
##TITLE=UV1290_M2_1207-1380_90_7534491_v0N7eArwV8
##JCAMPDX= 6.0         $$ Bruker NMR JCAMP-DX V2.0
##DATA TYPE= NMR SPECTRUM
##DATA CLASS= NTUPLES
##ORIGIN= BRUKER
##OWNER= Administrator
$$ 1.72 TOPSPIN		Version 2.1
$$ 2013-02-22 01:03:31.963 -0500  Administrator@X
$$ Compression mode = diff/dup
##.OBSERVE FREQUENCY= 400.02188249412
##.OBSERVE NUCLEUS= ^1H
##.ACQUISITION MODE= SIMULTANEOUS (DQD)
##.ACQUISITION SCHEME= undefined
##.AVERAGES= 64
##.DIGITISER RES= 22
##SPECTROMETER/DATA SYSTEM= spect
##.PULSE SEQUENCE= noesygpps1d.comp
##.SOLVENT NAME= COFFEE_meoh
##.SHIFT REFERENCE= INTERNAL, COFFEE_meoh, 1, 14.96138
##AUDIT TRAIL= $$ (NUMBER, WHEN, WHO, WHERE, PROCESS, VERSION, WHAT)
$$ ##TITLE= Audit trail, TOPSPIN		Version 2.1
$$ ##JCAMPDX= 5.01
$$ ##ORIGIN= Bruker BioSpin GmbH
$$ ##OWNER= Administrator
$$ $$ E:\/data/COFFEE/nmr/UV1290_M2_1207-1380_90_7534491_v0N7eArwV8/12/pdata/1/auditp.txt
$$ ##AUDIT TRAIL=  $$ (NUMBER, WHEN, WHO, WHERE, PROCESS, VERSION, WHAT)
(   1,<2013-02-22 01:03:25.209 -0500>,<Administrator>,<X>,<go>,<TOPSPIN 2.1>,
      <created by zg
	started at 2013-02-22 00:51:54.928 -0500,
	POWCHK enabled, PULCHK disabled,
       configuration hash MD5:
       86 BA 57 50 F2 9D 5C 9B 26 00 A9 28 5F 66 2E 89
       data hash MD5: 64K
       AA 75 5B 41 92 19 A2 EB 7C 8B 61 74 15 CB A0 CA>)
(   2,<2013-02-22 01:03:28.732 -0500>,<Administrator>,<X>,<proc1d>,<TOPSPIN 2.1>,
      <Start of raw data processing
       efp LB = 0.3 FT_mod = 6 PKNL = 1 PHC0 = 0 PHC1 = 0 SI = 128K 
       data hash MD5: 128K
       D7 4C 2E B0 C7 28 FB 61 B4 BE 98 AE 83 D2 EB 18>)
(   3,<2013-02-22 01:03:29.952 -0500>,<Administrator>,<X>,<proc1d>,<TOPSPIN 2.1>,
      <pk PHC0 = 246.286 PHC1 = 0 
       data hash MD5: 128K
       A3 71 72 0C D2 0F 4A 64 03 54 9C 07 54 1A 91 E0>)
(   4,<2013-02-22 01:03:30.760 -0500>,<Administrator>,<X>,<proc1d>,<TOPSPIN 2.1>,
      <abs ABSG = 1 
       data hash MD5: 128K
       9F 7E 03 F6 56 DC D6 9D 5A EE 0C 86 6D 83 9D C3>)
(   5,<2013-02-22 01:03:31.001 -0500>,<Administrator>,<X>,<proc1d>,<TOPSPIN 2.1>,
      <abs ABSG = 2 
       data hash MD5: 128K
       B0 07 9D 6E 62 06 B9 36 C6 1E F2 29 BD 53 2B 0E>)
(   6,<2013-02-22 01:03:31.207 -0500>,<Administrator>,<X>,<proc1d>,<TOPSPIN 2.1>,
      <abs ABSG = 3 
       data hash MD5: 128K
       6D D6 7F 6C 9B C3 F9 96 1F F7 37 30 99 3B 42 19>)
(   7,<2013-02-22 01:03:31.396 -0500>,<Administrator>,<X>,<proc1d>,<TOPSPIN 2.1>,
      <abs ABSG = 4 
       data hash MD5: 128K
       40 CE CB 02 13 54 A2 AC E4 F2 70 D1 F8 FB ED AF>)
(   8,<2013-02-22 01:03:31.602 -0500>,<Administrator>,<X>,<proc1d>,<TOPSPIN 2.1>,
      <abs ABSG = 5 
       data hash MD5: 128K
       74 60 1A D5 FB 8B 24 C0 ED A3 FB C7 AF 5B 42 2B>)
$$ ##END=
$$ 
$$ $$ hash MD5
$$ $$ F7 97 7B 1E 75 8F E1 5C C4 0C AD 8F 4E D2 4C B5
##$RELAX= 
##$RELAX= 
##$RELAX= 
##$RELAX= 
##$RELAX= 
##$RELAX= 
##$RELAX= 
##$RELAX= 
$$ Bruker specific parameters
$$ --------------------------
##$DU= <E:\>
##$EXPNO= 12
$$ [...]
150 150 150 150 150 150 150 150
##$TP07= 0
##$TPNAME0= <>
##$TPNAME1= <>
##$TPNAME2= <>
##$TPNAME3= <>
##$TPNAME4= <>
##$TPNAME5= <>
##$TPNAME6= <>
##$TPNAME7= <>
##$TPOAL= (0..7)
0.5 0.5 0.5 0.5 0.5 0.5 0.5 0.5
##$TPOFFS= (0..7)
0 0 0 0 0 0 0 0
##$TUNHIN= 0
##$TUNHOUT= 0
##$TUNXOUT= 0
##$USERA1= <user>
##$USERA2= <user>
##$USERA3= <user>
##$USERA4= <user>
##$USERA5= <user>
##$V9= 5
##$VALIST= <valist>
##$VCLIST= <CCCCCCCCCCCCCCC>
##$VD= 0
##$VDLIST= <DDDDDDDDDDDDDDD>
##$VPLIST= <PPPPPPPPPPPPPPP>
##$VTLIST= <TTTTTTTTTTTTTTT>
##$WBST= 1024
##$WBSW= 4
##$XGAIN= (0..3)
0 0 0 0
##$XL= 0
##$YL= 0
##$YMAX_a= 5833656
##$YMIN_a= -11457883
##$ZGOPTNS= <>
##$ZL1= 120
##$ZL2= 120
##$ZL3= 120
##$ZL4= 120
##$ABSF1= 14.96138
##$ABSF2= -5.596802
##$ABSG= 5
##$ABSL= 3
##$ALPHA= 0
##$AQORDER= 0
##$ASSFAC= 0
##$ASSFACI= 0
##$ASSFACX= 0
##$ASSWID= 0
##$AUNMP= <proc_prof1d_extract.lims>
##$AXLEFT= 0
##$AXNAME= <>
##$AXNUC= <1H>
##$AXRIGHT= 0
##$AXTYPE= 0
##$AXUNIT= <>
##$AZFE= 0.1
##$AZFW= 0.1
##$BCFW= 0
##$BC_mod= 0
##$BYTORDP= 0
##$COROFFS= 0
##$CY= 15
##$DATMOD= 1
##$DC= 0
##$DFILT= <>
##$DTYPP= 0
##$F1P= 0
##$F2P= 0
##$FCOR= 0.5
##$FTSIZE= 131072
##$FT_mod= 6
##$GAMMA= 0
##$GB= 0
##$INTBC= 1
##$INTSCL= 1
##$ISEN= 128
##$LB= 0.3
##$LEV0= 0
##$LPBIN= 0
##$MAXI= 10000
##$MC2= 0
##$MEAN= 0
##$ME_mod= 0
##$MI= 0
##$NCOEF= 0
##$NC_proc= -2
##$NLEV= 6
##$NOISF1= 0
##$NOISF2= 0
##$NSP= 0
##$NTH_PI= 0
##$NZP= 0
##$OFFSET= 14.96138
##$PC= 1
##$PHC0= 246.286
##$PHC1= 0
##$PH_mod= 1
##$PKNL= yes
##$PPARMOD= 0
##$PPDIAG= 0
##$PPIPTYP= 0
##$PPMPNUM= 2147483647
##$PPRESOL= 1
##$PSCAL= 4
##$PSIGN= 0
##$PYNMP= <proc.py>
##$REVERSE= no
##$SF= 400.020009486252
##$SI= 131072
##$SIGF1= 0
##$SIGF2= 0
##$SINO= 400
##$SIOLD= 131072
##$SPECTYP= <>
##$SREGLST= <1H.CDCl3>
##$SSB= 0
##$STSI= 131072
##$STSR= 0
##$SW_p= 8223.68421052631
##$SYMM= 0
##$S_DEV= 0
##$TDeff= 65536
##$TDoff= 0
##$TI= <>
##$TILT= no
##$TM1= 0
##$TM2= 0
##$TOPLEV= 0
##$USERP1= <user>
##$USERP2= <user>
##$USERP3= <user>
##$USERP4= <user>
##$USERP5= <user>
##$WDW= 1
##$XDIM= 131072
##$YMAX_p= 408814222
##$YMIN_p= -13099
##$CURPLOT= <Network HP LaserJet P1505>
##$CURPRIN= <$Network HP LaserJet P1505>
##$DFORMAT= <normdp>
##$LAYOUT= <+/1D_H.xwp>
##$LFORMAT= <normlp>
##$PFORMAT= <normpl>
##$SURQMSG= 1
$$ End of Bruker specific parameters
$$ ---------------------------------
##NTUPLES= NMR SPECTRUM
##VAR_NAME=  FREQUENCY,     SPECTRUM/REAL,   SPECTRUM/IMAG
##SYMBOL=    X,             R,               I
##VAR_TYPE=  INDEPENDENT,   DEPENDENT,       DEPENDENT
##VAR_FORM=  AFFN,          ASDF,            ASDF
##VAR_DIM=   131072,        131072,          131072
##UNITS=     HZ,            ARBITRARY UNITS, ARBITRARY UNITS
##FACTOR=    0.0627417313425164, 1,          1
##FIRST=     8223.62146879497, 21,           -63015
##LAST=      0,             2797,            -62948
##MIN=       0,             -13099,          0
##MAX=       8223.62146879497, 408814222,    0
$$ Real data points
##PAGE= N=1
##DATA TABLE= (X++(R..R)), XYDATA
$$ [...]
65181 147833 149267 150918 152567 154036 155002 155199 154785 154230 153752 153099 152006 150708 149747 149379 149435 149744 150351
65164 150351 151223 152019 152498 152964 154033 155965 158442 160916 162905 164043 164313 164284 164798 166210 168239 170638
65148 170638 173646 177576 182361 187834 194155 201593 210167 219869 231019 243876 258027 272565 286814
65135 286814 300469 313158 324427 334216 342864 350570 357265 363082 368456 373508 377686 380289 381105 380374
65121 380374 378448 375650 372189 367898 362292 355120 346705 337537 327694 316931 305270 293258 281593
65108 281593 270588 259976 249311 238593 228436 219455 211617 204502 198089 192778 188538 184521 179870
65095 179870 174709 170015 166658 164711 163493 162143 160330 158601 157824 158186 158982 159499 159813 160458 161608 162892
65079 162892 163823 164118 163787 163149 162597 162138 161410 160395 159794 160295 161660 163034 164028 165037 166464 168085 169304
65062 169304 169743 169488 168994 168809 169175 169841 170401 170740 170965 170981 170477 169394 168133 167227 166960 167250 167696 167734 167089
65043 167089 166109 165422 165144 164750 163788 162418 161027 159625 157966 156081 154262 152527 150514 148114 145905
65028 145905 144590 144119 143705 142823 141837 141425 141610 141791 141654 141652 142367 143686 144888 145486 145696 146082 146868 147744
65010 147744 148315 148672 149419 151181 154194 158339 163218 168044 171842 174231 175848 177592 179517 180970 181643
64995 181643 181848 181764 181213 180411 180174 180897 181979 182775 183581 185081 187284 189778 192639 196295 200571 204616
64979 204616 207744 209821 210884 211000 210511 209796 208751 206983 204536 201863 199036 195612 191415 186913 182623
64964 182623 178624 174877 171533 168701 166272 164213 162654 161496 160320 158965 157891 157635 158123 158704 158758
64949 158758 158151 157279 156710 156569 156305 155352 153977 153055 152989 153318 153460 153343 153163 153077 153378 154433 156065 157443
64931 157443 157930 157654 156973 155892 154482 153337 152935 152866 152358 151407 150747 150805 151345 152068 152930 153764 154282 154650
64913 154650 155561 157394 159728 161935 163861 165612 167080 168169 169256 170921 173305 176165 179515 183709
64899 183709 188804 194383 200227 206674 213898 221247 227956 234271 241102 248516 255446 261192 266489 272481
64885 272481 279176 285606 291077 295412 298174 298627 296638 292924 288196 282626 276325 269702 263068 256442
64871 256442 250094 244754 240877 238072 235665 233500 231799 230567 229516 228370 226876 224763 221944 218567
64857 218567 214672 210184 205470 201346 198003 194414 189500 183644 178349 174536 171835 169503 167314 165395
64843 165395 163841 162782 162447 162864 163756 164825 165909 166768 167102 166882 166364 165676 164732 163728 163313 163986 165536
64826 165536 167375 169203 171046 172783 174063 174783 175367 176402 178124 180420 183263 186885 191429 196610 202010
64811 202010 207679 214176 221911 230665 239830 248846 257198 264243 269479 272958 275102 276054 275428 272826 268409
64796 268409 262849 256738 250139 242810 234923 227479 221780 218390 216735 215774 214825 213697 212417 211193 210372
64781 210372 210000 209547 208473 207017 206026 206015 206774 207988 209799 212511 216064 220183 224929 230759 237932 245991
64765 245991 254024 261435 268354 275249 282296 289298 296052 302445 308228 313199 317725 322618 328132 333495
64751 333495 337882 341518 345335 349694 353966 357215 358731 357937 354419 348230 339829 329652 318157 306241
64737 306241 295018 284937 275605 266715 258770 252596 248514 246220 245121 244443 243417 241920 240763 240813
64723 240813 241827 242653 242719 242913 244619 248143 252554 257104 262278 268995 277002 284721 290787 295185 298538
64708 298538 300847 301552 300528 298192 294644 289442 282453 274346 265948 257541 249109 240876 233312 226828
64694 226828 221725 218129 215701 213705 211680 209859 208731 208386 208495 208686 208700 208423 208096 208373 209888 212798
64678 212798 216828 221604 226869 232616 239142 246699 254970 263194 270955 278436 285698 292181 297253 300754
64664 300754 302519 301895 298406 292664 285935 279024 272229 266101 261249 257335 253306 249016 245816 244950 245975
64649 245975 247404 248436 249401 250808 252740 255153 258064 261248 264269 267183 270943 276740 284925 294708
64635 294708 304896 314885 324943 335620 346925 358087 368023 375935 381518 384790 385922 385087 382333
64622 382333 377552 370720 362136 352284 341438 329571 316783 303723 291409 280566 271267 263291 256651
64609 256651 251563 247969 245425 243518 242115 241001 239668 237835 235972 234781 234201 233477 232395 231889 233087
64594 233087 236122 240221 244613 248892 252814 256404 260237 265027 270825 277044 283301 289697 296167 302216
64580 302216 307723 313456 320165 327465 334233 339954 344998 349531 352823 353957 352842 350205 346896 343380
64566 343380 339591 334927 328599 320371 310885 301008 290994 280595 269912 259732 250939 243860 238278
64553 238278 233869 230434 227856 226001 224659 223529 222366 221195 220273 219764 219559 219536 219912 221185 223684 227262
64537 227262 231426 235613 239310 242054 243492 243475 242016 239222 235368 231024 226887 223371 220472 218117 216519
64522 216519 215994 216498 217559 218623 219296 219359 218873 218321 218321 219020 219937 220603 221150 222073 223641 225797 228581 232286
64504 232286 237148 243062 249697 256731 263938 271219 278695 286678 295292 303994 311574 316835 319350 319479
64490 319479 317734 314461 310210 305935 302290 298927 295053 290656 286649 283809 282180 281574 281923 282822 283443
64475 283443 283402 283082 282557 280915 277476 273112 269301 266120 262391 257756 253466 250766 249583 249361 250240 252618
64459 252618 256103 259776 263226 266616 269798 271993 272507 271478 269822 268598 268276 268398 268028 266715 264939
64444 264939 263582 263129 263534 264631 266423 269070 272724 277308 282430 287769 293537 300275 308183 317176 327722
64429 327722 340986 357638 377012 398056 420841 446578 476429 511108 551692 600037 658022
64418 658022 726797 806921 898683 1001646 1113936 1232279 1352757 1471546 1585212 1690908
64408 1690908 1786576 1870954 1943187 2002188 2046136 2072639 2079647 2066655 2035256 1988428 1928949
64397 1928949 1858145 1775985 1682298 1577940 1465092 1347006 1227733 1111642 1002437 902342
64387 902342 812286 732656 663506 604226 553757 511375 476735 448893 425868 405691 387631
64376 387631 372047 359302 349233 341373 335158 330007 325612 322129 319704 317811 315327 311312 305591
64363 305591 298754 291740 285164 278786 271893 264480 257689 252599 248916 245531 242203 239953 239717 241329
64349 241329 244109 247848 252819 259050 265972 272611 277993 281550 283299 283556 282504 280211 276973 273205
64335 273205 269000 264225 259144 254465 250576 247190 244061 241677 240796 241511 243165 245076 247045 249186 251567
64320 251567 254040 256283 258121 259856 262092 264968 267794 269761 270922 272025 273391 274351 274011 272208 269369
64305 269369 265671 260821 254784 248267 242129 236570 231290 226393 222509 219825 217520 214667 211461 208970
64291 208970 207740 207217 206652 206054 205983 206816 208557 211073 214099 217161 219966 222839 226434 230914 235765 240551
64275 240551 245599 251667 259001 266971 274677 281722 288230 294246 299372 303055 305022 305285 303907 301093
64261 301093 297534 294328 292317 291540 291471 291738 292470 293903 295734 296971 296459 293544 288279 281189 273044 264784
64245 264784 257314 251079 245868 241201 236857 232944 229533 226489 223703 221320 219579 218450 217526 216350
64231 216350 214939 213915 213975 215198 216970 218611 219902 220965 221867 222548 223015 223411 223946 224773 225809 226583
64215 226583 226448 225104 222779 219844 216517 213052 209896 207380 205505 204312 204170 205301 207260 209284 210978
64200 210978 212249 212798 212280 210967 209764 209487 210488 212911 216807 221894 227725 234235 241880 251117 262051
64185 262051 274500 288021 301876 315400 328330 340272 349964 355847 357516 355918 351878 345204 335662
64172 335662 324103 311942 299961 288250 276964 266470 256950 248505 241551 236497 232987 229958 226576
64159 226576 222880 219525 217163 216043 215898 216160 216399 216548 216703 216940 217567 219183 222103 225878 229740 233364
64143 233364 236872 240252 243243 245731 247817 249418 250240 250199 249570 248590 247226 245437 243411 241397 239535
64128 239535 237956 236834 236171 235695 235204 234942 235481 237173 239838 243024 246527 250558 255430 261236 267912
64113 267912 275449 283765 292485 301133 309622 318285 327275 336108 343840 349542 352722 353745 353934 354797 356867
64098 356867 359608 362610 366399 371686 378247 385030 391093 395966 399390 401272 401815 401179 399098 395308 390240
64083 390240 384805 379491 374150 368624 363030 357403 351590 345658 339913 334388 328781 323101 317931 313765
64069 313765 310364 307044 303359 299360 295454 292249 290266 289533 289548 289743 289888 290038 290362 291082 292361 294142
64053 294142 296287 298865 301998 305477 308996 312814 317607 323449 329569 335554 342272 350987 361876 374056
64039 374056 386798 399994 413479 426707 439327 451391 462610 471887 478102 481113 481587 480007 476343
64026 476343 470717 463910 457001 450692 445099 440032 435321 431033 427538 425223 423848 422275 419135 413868
64012 413868 406926 398966 390206 380802 371438 363039 355888 349454 343186 337164 331853 327513 324065 321282
63998 321282 318899 316700 314776 313564 313355 313840 314464 315230 316784 319565 323217 327086 331031 335356 340050
63983 340050 344617 348822 353236 358759 365709 373575 381520 388961 395846 402682 410138 418337 426650 434551
63969 434551 442586 451989 463258 475626 488183 501077 515242 531270 548963 567845 587735 608904
63957 608904 631979 657661 686309 717891 752564 791253 835493 886910 947083 1017665 1100221
63946 1100221 1195999 1306148 1432046 1574991 1735585 1913670 2108740 2320036 2546182 2785023
63936 2785023 3033724 3288696 3545530 3799453 4045727 4279151 4493344 4681437 4837968
63927 4837968 4959848 5045439 5093397 5102821 5073976 5008084 4906543 4770910 4603737 4409170
63917 4409170 4192721 3960654 3719409 3475001 3232465 2995547 2766818 2548238 2341918
63908 2341918 2150338 1975547 1818038 1676767 1550403 1438294 1340047 1254663 1180587 1116401
63898 1116401 1060934 1012763 970172 931844 897345 866720 839718 815540 793227 772125 751963
63887 751963 732658 714200 696748 680643 666090 652904 640791 629906 620864 614184 609924 607959
63875 607959 608366 611421 617416 626586 638948 654079 671300 690312 711422 734994 760925 788821
63863 788821 818395 849356 881117 912971 944435 975138 1004526 1032051 1057513 1080834 1101526
63852 1101526 1118744 1131935 1141136 1146586 1148263 1145806 1138688 1126502 1109431 1088479 1064941 1039440
63840 1039440 1011603 980780 946929 910796 873509 836101 799251 763216 727966 693471 659872
63829 659872 627485 596738 568097 541880 518028 496096 475558 456218 438421 422780 409528
63818 409528 398047 387225 376418 365915 356323 347762 339904 332564 325808 319531 313408 307436 302118
63805 302118 297852 294348 290945 287442 284369 282322 281190 280168 278558 276372 274017 271518 268436 264644
63791 264644 260790 257692 255504 253767 252037 250018 247343 243841 240082 237074 235194 233851 232395 230934
63777 230934 229943 229442 229002 228331 227487 226639 225964 225727 226126 227027 227977 228464 228162 227170 226157 225965 226727 227603
63759 227603 227777 227528 227792 228747 229470 229231 228540 228499 229410 230532 231134 231311 231657 232448 233390 234067 234451 234915 235800
63740 235800 237032 238218 239122 239996 241387 243637 246558 249533 251936 253555 254720 255972 257573 259351 261030
63725 261030 262625 264437 266769 269783 273528 277966 282937 288221 293591 298730 303181 306631 309263 311556
63711 311556 313655 315085 315260 314094 312024 309568 307082 304788 302755 300866 299012 297332 296108 295455 295303
63696 295303 295690 296844 298875 301531 304324 306888 309245 311807 314976 318534 321566 323296 323962 324518 325440
63681 325440 326266 326426 326048 325593 325023 323882 322086 320198 318853 318197 317970 317949 318193 318944 320243 321663 322599
63664 322599 322968 323448 324753 326787 328754 329971 330248 329572 327908 325462 322792 320355 318052 315407 312155
63649 312155 308562 305192 302400 300005 297562 294997 292883 291882 292018 292747 293700 295053 297105 299803 302885
63634 302885 306244 309941 313941 318065 322267 326900 332599 339707 347748 355707 363077 370442 378718 388032
63620 388032 397785 407738 418393 430189 442951 456529 471453 488485 507784 529020 552083 577271
63608 577271 604920 635268 668502 704481 742387 781002 819246 856037 889750 918370 940351
63597 940351 955057 962429 962823 957418 948322 937741 927057 916749 906867 897290 887612 877080 864675
63584 864675 849327 830247 807320 781131 752612 722756 692629 663355 635895 610893 588742
63573 588742 569594 553261 539430 528074 519397 513284 509220 506957 506824 508924 512380 516003 519584
63560 519584 523942 529699 536586 544099 552204 561049 570513 580601 592148 606531 624620 646286 671057
63547 671057 698991 730698 766726 807114 851487 899107 948420 996491 1039245 1072722 1094433
63536 1094433 1103870 1102225 1091933 1076187 1058203 1040483 1024574 1011227 1000445 991393 982685 972937
63524 972937 960955 945499 925385 900048 869829 835618 798549 760089 721916 685216 650232
63513 650232 616818 585235 556137 529970 506754 486253 468034 451499 436311 422756 411329
63502 411329 401969 393995 386737 379896 373344 367063 361304 356397 352265 348464 344804 341624 339373 338235
63488 338235 338191 339011 340074 340674 340784 341125 342187 343586 344722 345698 347153 349463 352529 356129 359945 363427
63472 363427 366249 368820 371778 374834 376740 376674 375209 373531 372026 370098 367188 363449 359404 355426 351843
63457 351843 349154 347668 346930 345966 344283 342416 341322 341447 342604 344520 347120 350377 354282 358965 364500
63442 364500 370584 376873 383732 392233 403187 416576 432140 450070 470816 494641 521801 552716
63430 552716 587233 623740 659470 691755 718801 739650 754247 763713 770048 775302 781251 789720
63418 789720 802644 821421 846424 877250 913208 953471 997024 1042566 1088230 1131380 1169095
63407 1169095 1199126 1220349 1232447 1235631 1230863 1219998 1205391 1189334 1173705 1159551 1146709 1134011
63395 1134011 1120044 1103530 1083058 1057159 1025248 988292 948217 906739 864916 823489 783166
63384 783166 744652 708743 676311 647902 623403 602377 584619 570067 558296 548558 540524 534731
63372 534731 532096 532978 536738 542170 548466 555852 565235 577185 591408 607283 624658 643868 665223
63359 665223 688876 715130 744479 777230 813300 852338 893834 937001 980819 1024190 1065928
63348 1065928 1104551 1138293 1165345 1184141 1193742 1194409 1187853 1176570 1162773 1148028 1133625 1120518
63336 1120518 1108584 1096322 1081799 1063797 1041935 1015970 985514 950495 911650 870484 828836
63325 828836 788382 750386 715817 685619 660598 640869 625658 614002 605550 600217 596935 593155
63313 593155 585940 573584 556195 535119 512195 489322 468062 449179 432634 418160 405734 395414
63301 395414 386935 379818 373802 368823 364566 360416 356096 352067 348964 346751 344673 342034 338750 335213
63287 335213 331899 329164 327158 325759 324666 323617 322452 321027 319262 317278 315266 313234 311170 309493
63273 309493 308996 310111 312431 315121 317566 319457 320600 321059 321340 321966 322884 323662 324235 325054 326398 327960
63257 327960 329317 330514 331934 333841 336350 339672 344015 349195 354556 359361 363254 366438 369567 373363
63243 373363 378172 383795 389734 395624 401496 407832 415368 424622 435526 447643 460818 475339 491415
63230 491415 508851 527490 547531 568934 590813 612039 632420 652711 673401 694111 714371
63219 714371 734399 754742 775547 796573 817618 838538 859172 879630 900345 921311 941382
63208 941382 958829 972519 982158 987530 988117 983580 974099 960053 941771 919850 895317 869205 842283
63195 842283 815467 790110 767412 747650 730437 715703 704021 695899 691168 689341 690382 694794
63183 694794 702981 714736 729440 746582 765947 787449 810933 836121 862515 889365 916006 942351
63171 942351 968811 995498 1021749 1046723 1070335 1093152 1115404 1136458 1155306 1171141 1183221
63160 1183221 1190496 1191796 1186413 1174382 1156238 1132591 1103870 1070447 1033024 992779 950957 908420
63148 908420 865902 824563 785779 750247 717787 688216 661860 638837 618414 599732 582894
63137 582894 568578 556713 546291 536655 528281 521925 517456 513922 510533 507241 504514 502876 502582 503509
63123 503509 505308 507699 510579 513963 517998 523024 529197 535953 542160 547088 551035 554774 558613 562269
63109 562269 565457 568192 570605 572759 574697 576374 577551 577965 577662 576902 575770 574105 571869 569250 566313
63094 566313 562853 558819 554648 550922 547859 545391 543589 542625 542323 542149 541804 541556 541760 542329 543025 544087
63078 544087 546095 549066 552155 554618 556868 560142 565169 571457 577941 584002 589783 595877 602921 611197
63064 611197 620312 629510 638654 648741 661017 675684 691982 709498 728802 750587 774798 801072
63052 801072 829614 861028 895475 932611 972348 1015077 1060932 1109212 1158785 1208807 1258924
63041 1258924 1309086 1359457 1410275 1461452 1512335 1562147 1610711 1658587 1706443 1754331 1801612
63030 1801612 1847542 1891858 1934677 1975717 2013636 2046287 2071574 2087945 2094240 2089542 2073441 2046231
63018 2046231 2008661 1961694 1906770 1846121 1782470 1718268 1655246 1594495 1536737 1482666 1433318
63007 1433318 1390143 1354525 1327179 1308107 1297001 1293521 1297309 1308064 1325675 1350000 1380431 1415780
62995 1415780 1454713 1496275 1540148 1586472 1635251 1685697 1736337 1786084 1835074 1883971 1932604
62984 1932604 1979826 2024779 2067553 2108128 2145125 2176177 2199301 2213399 2217571 2210662 2191699 2160441
62972 2160441 2117351 2063375 2000033 1929502 1854209 1776234 1697144 1618313 1541136 1466853 1396271
62961 1396271 1329802 1267748 1210398 1157805 1109614 1065247 1024258 986409 951469 919105 888961
62950 888961 860661 833690 807469 781746 756877 733614 712579 693875 677031 661232 645766
62939 645766 630505 616002 603026 591901 582252 573376 564898 557095 550595 545711 542072 538959 535917
62926 535917 532931 530121 527507 525195 523452 522362 521448 519930 517476 514522 511736 509262 506673 503646
62912 503646 500426 497471 494796 491981 488775 485361 481952 478511 475072 472024 469705 467871 465977 463918
62898 463918 462158 461127 460827 461053 461709 462812 464336 466019 467197 467050 465422 463280 461890 461540 461535 461381
62882 461381 461348 461741 462294 462675 463032 463588 464127 464381 464593 465096 465583 465348 464191 462579 460912 459150 457270
62865 457270 455655 454754 454488 454162 452994 450775 448125 446046 445082 444999 445295 445770 446417 446983 447023 446380 445368
62848 445368 444443 443873 443732 444054 444928 446448 448485 450477 451629 451475 450233 448588 447227 446502 446236 445793
62832 445793 444593 442683 440586 438600 436638 434816 433687 433601 434251 435204 436487 438310 440566 443028 445694
62817 445694 448551 451275 453614 455806 458226 460926 463874 467248 470933 474175 476416 478174 480437 483422
62803 483422 486710 490351 494907 500486 506580 512962 519921 527444 535013 542435 550215 558872 568548 579445
62789 579445 591915 605810 620578 636460 654956 677579 704620 735597 770383 809286 852431
62778 852431 899724 951305 1007599 1068960 1135438 1206693 1281945 1360213 1440642 1522151 1602712
62767 1602712 1679633 1750857 1815385 1872041 1918533 1952369 1972303 1978310 1970662 1949735 1916345 1871488
62755 1871488 1815933 1750834 1678582 1602227 1523996 1444992 1366366 1289939 1217349 1149135 1085096
62744 1085096 1025210 969907 919601 874236 833254 795985 762141 731869 705191 681587 660384
62733 660384 641404 624833 610531 597936 586728 577096 569162 562543 556812 552156 549207 548271 548966
62720 548966 550597 552643 554846 557140 559792 563572 569379 577442 587070 597471 608770 621889 637486
62707 637486 655412 675319 697377 722175 750230 781908 817513 857187 900956 949222 1002957
62696 1002957 1062992 1129218 1200864 1277446 1359067 1445817 1537265 1632453 1729868 1827149 1921084
62685 1921084 2008211 2085508 2150572 2201402 2236184 2253384 2252128 2232580 2195887 2143745 2078133
62674 2078133 2001421 1916360 1825603 1731330 1635490 1540208 1447644 1359399 1276277 1198476 1125929
62663 1125929 1058613 996767 940731 890433 845208 804343 767639 735182 706725 681554 658889
62652 658889 638139 618911 601055 584655 569693 555812 542618 530109 518556 508101 498698 490296
62640 490296 482791 475953 469776 464728 461283 459295 458186 457622 457556 457706 457486 456554 455001 452925 450149 446525
62624 446525 442328 438275 435250 433755 433364 432933 431718 430147 429117 428806 428740 428756 429175 430133 431582 433971
62608 433971 437980 443283 448450 452597 456392 460922 466252 471879 478070 485863 495946 508294 522827
62595 522827 539723 559064 580781 605106 632601 663583 697861 735089 774905 816521 858486
62584 858486 899177 937365 972156 1002634 1027881 1047357 1060912 1068229 1068402 1060409 1044171 1020966
62572 1020966 992609 960388 925148 888167 851266 815686 781345 747662 714888 684149 656307
62561 656307 631301 608627 588001 569392 552787 538222 525790 515296 506015 497125 488427 480409
62549 480409 473567 467871 463006 458897 455691 453310 451388 449755 448736 448712 449566 450750 451827 452704 453475
62534 453475 454250 455134 456071 456745 456878 456712 456997 458503 461683 466760 473746 482309 491927 502354 513762
62519 513762 526391 540360 556005 574045 595146 619496 647105 678384 714118 754770 800005
62508 800005 848906 900629 954800 1011239 1069195 1126857 1181794 1231907 1275861 1312716 1341575
62497 1341575 1361751 1372975 1375202 1368528 1353654 1332314 1306957 1279984 1253316 1228359 1206012 1186782
62485 1186782 1171268 1160456 1155222 1155551 1160584 1169542 1182253 1198514 1217061 1235445 1250989 1261858
62473 1261858 1267282 1266980 1260617 1247844 1228628 1203233 1171820 1134295 1090774 1042206 990537 938280
62461 938280 887699 839977 794965 751926 710752 672346 637797 607476 581139 558580 539732
62450 539732 524273 511602 501276 493182 487204 483041 480434 479289 479351 480062 481029 482577 485509 490259
62436 490259 496398 503004 509419 515538 521501 527252 532391 536306 538375 538114 535253 529709 521619 511568
62422 511568 500798 490776 482233 474710 467337 459994 453312 447585 442208 436415 430232 424334 419183 414670
62408 414670 410487 406551 403002 400037 397760 396089 394850 394025 393767 394038 394402 394438 394264 394380 395090 396357
62392 396357 398212 400956 404670 408754 412227 414628 416468 418655 421436 424162 426335 428691 432811 439538
62378 439538 448141 457239 466111 474749 483016 490444 496926 503111 509942 518015 527434 537960 549254 561221
62364 561221 574282 589140 606358 626403 649964 677751 709835 745731 785392 829732 879863
62353 879863 936120 998086 1065021 1135576 1207323 1277265 1342935 1402557 1454288 1496178 1527222
62342 1527222 1547869 1559014 1560871 1553390 1537365 1514374 1485538 1450979 1410697 1365508 1316843 1265936
62330 1265936 1213593 1160658 1108438 1058678 1013076 972577 936928 905054 875984 849311 824736
62319 824736 801584 779103 757025 735454 714338 693403 672616 652379 633221 615513 599425
62308 599425 584904 571680 559572 548799 539749 532420 526353 521117 516589 512717 509316 506203 503292
62295 503292 500556 498202 496881 497261 499136 501297 502570 502853 502981 503848 505808 508609 511620 514280 516583
62280 516583 518947 521505 523818 525526 526971 528779 531070 533483 535845 538364 541249 544598 548750 554367
62266 554367 561989 571675 583182 596397 611631 629655 651427 677542 707940 742279 780624 823701
62254 823701 872589 928260 991110 1060470 1134507 1210834 1287247 1361731 1431923 1495013 1548370
62243 1548370 1590198 1619730 1637213 1643811 1641085 1630206 1611587 1585251 1551329 1510183 1462447 1409269
62231 1409269 1352442 1294065 1236059 1179982 1127112 1078478 1034738 996047 961947 931434 903382
62220 903382 877187 853005 831203 811592 793305 775379 757357 739348 721722 704837 688889
62209 688889 673815 659379 645479 632329 620207 609068 598682 589154 580956 574263 568603 563488
62197 563488 559189 556441 555535 556149 558011 561173 565509 570433 575407 580428 585852 592036 599330 608005 617870
62182 617870 628245 638574 648871 659324 669762 679729 688766 696447 702564 707714 713283 720357 728880
62169 728880 738379 749243 762804 780383 802841 830845 864801 904411 948821 997271 1049053 1102779
62157 1102779 1156241 1207173 1253816 1294718 1328495 1354028 1370635 1378070 1376777 1368125 1353749 1334363
62145 1334363 1309606 1279178 1243647 1204011 1161127 1116018 1070360 1026039 984352 945922 911197
62134 911197 880652 854523 832658 814617 799875 787985 778564 771024 764451 758164 752423 748092 745438
62121 745438 743684 742011 740591 740273 741681 745025 750462 758018 767245 777363 787715 797651 806147 812054
62107 812054 814883 814979 812856 808780 803227 797398 792769 790070 788841 788021 786844 785139 782955 780229 776954
62092 776954 773550 770835 769588 770209 772726 776931 782468 788914 795896 803174 810747 818980 828442 839370
62078 839370 851445 864350 878399 894247 912108 931689 952833 975601 999627 1024018 1048189
62067 1048189 1072256 1096302 1119860 1142686 1165632 1190127 1216953 1246037 1277152 1310051 1343862
62056 1343862 1376972 1407805 1435358 1458760 1476728 1487879 1491665 1488903 1481267 1470066 1455227 1435438
62044 1435438 1409346 1376638 1338033 1294539 1247006 1196243 1143212 1089032 1034927 982132 931624
62033 931624 883922 839275 797967 760342 726627 696867 670934 648405 628578 610900 595326
62022 595326 582002 570659 560623 551443 543178 535906 529176 522197 514540 506521 498841 491909 485664
62009 485664 480034 475369 472143 470342 469590 469938 472075 476455 482558 489444 496731 504589 512957 521292 529038
61994 529038 535902 541685 546360 550287 553835 556628 557685 556523 553697 549941 545218 539029 531361 522836
61980 522836 514068 505312 496654 488140 479685 471231 463050 455522 448588 441807 435211 429640 425855 423540
61966 423540 421646 419543 417333 415112 412607 409789 407249 405502 404322 403270 402515 402512 403146 403953 405117 407412
61950 407412 411055 415359 419855 424956 431084 437759 444246 450675 457875 466407 476369 487893 501166 516048
61936 516048 532187 549384 567326 585167 602035 617916 633449 648873 663761 677736 690655
61925 690655 701982 710790 716788 720733 723375 724493 723373 719776 713979 706337 697424 688362 680380 674077
61911 674077 669545 667083 667254 670221 675542 682758 691817 702772 715370 729135 743540 757780 770584
61898 770584 780659 787457 791277 792498 790896 785947 777667 766897 754705 741727 728190 714281 700304
61885 700304 686592 673519 661431 650350 639861 629593 619702 610573 602068 593451 584124 574195 564299
61872 564299 555169 547398 541258 536548 532821 529920 528103 527641 528510 530500 533393 537003 541423 547295 555468
61857 555468 566210 579006 593250 608725 625297 642649 660739 680140 701501 724890 750038
61846 750038 776907 805453 834992 864429 893130 920965 947293 970434 988594 1001109 1008425 1010963
61834 1010963 1008477 1000769 988742 974353 959390 944643 930543 918316 909904 906559 907921 912695
61822 912695 919953 929462 941006 953804 966553 977762 986008 990060 988909 981926 969240 951902 931222
61809 931222 907797 881608 853203 824137 795774 768207 741063 715006 691507 671176 653177
61798 653177 636513 621190 607802 596592 587291 579473 572648 566365 560600 555755 551981 548721 545277
61785 545277 541555 537938 534638 531584 528769 526218 523625 520496 516854 513500 511320 510401 509975 509246 508097
61770 508097 506967 506121 505277 504018 502351 500601 498893 497138 495587 494914 495478 496770 497967 498873 499982
61755 499982 501680 503748 505658 507127 508217 509061 509609 509647 509038 507865 506277 504233 501565 498343 494975
61740 494975 491838 488979 486297 483866 481901 480504 479568 478798 477760 476182 474456 473616 474458 476700 479209
61725 479209 481046 482151 483142 484681 486945 489577 492185 494969 498497 502691 506471 508911 510435 512227
61711 512227 514595 516622 517506 517474 517060 516102 513983 510556 506438 502512 499388 497103 495110 492696 489622
61696 489622 486244 482957 479766 476469 472917 468939 464458 459879 455984 453045 450407 447309 443789 440349
61682 440349 437053 433557 429895 426601 423953 421536 418723 415339 411797 408745 406596 405206 404082 403014
61668 403014 402347 402446 403108 403751 403926 403362 401848 399593 397432 396089 395339 394426 393198 392195 391745 391697 392119
61651 392119 393456 395686 398032 399874 401402 403011 404670 406340 408484 411498 414964 418059 420555 422883
61637 422883 425350 427755 429693 430801 430740 429325 426724 423280 419205 414733 410399 406764 403840 401144 398391
61622 398391 395830 393800 392193 390509 388384 385987 383940 382801 382564 382684 382591 382053 381093 379804 378375 377010
61606 377010 375571 373460 370126 365630 360521 355322 350331 345759 341711 338018 334316 330371 326280 322430
61592 322430 319297 317151 315800 314734 313571 312244 310710 308806 306579 304450 302798 301562 300483 299513
61578 299513 298679 297772 296461 294642 292461 290184 288251 287167 286981 287088 286890 286452 286200 286246 286414 286652 286940
61561 286940 287049 286989 287461 289156 291643 293686 294775 295669 297191 299175 300975 302502 304245 306485 308890
61546 308890 310850 312015 312592 313182 314199 315469 316599 317586 318692 319793 320412 320542 320881 322062 324005 326317
61530 326317 328870 331682 334498 336887 338563 339365 339174 338109 336612 335054 333390 331442 329307 327231 325279
61515 325279 323432 321917 321105 321034 321279 321333 321084 320880 321159 321995 323014 323758 324017 323706 322665 320887 318812
61498 318812 316987 315476 314002 312661 311943 311956 312182 312283 312621 313636 315094 316446 317597 318848 320222 321324
61482 321324 321852 321922 321869 321974 322352 322924 323564 324376 325681 327555 329519 330914 331524 331721 332074 332887 333953 334622
61464 334622 334311 333087 331619 330526 329954 329750 329621 329033 327504 325350 323788 323821 325285 327256 329136 330898
61448 330898 332571 334054 335349 336505 337365 337790 338169 339267 341477 344503 347901 351618 355817 360327 364543
61433 364543 367942 370628 373174 375819 378066 379399 380200 381414 383323 385246 386613 387678 388864 390113
61419 390113 391425 393345 396166 399124 401253 402766 404695 407303 409721 411198 411852 411968 411331 409646 407087
61404 407087 404043 400684 397058 393355 389863 386862 384653 383393 382855 382581 382269 381769 380835 379326 377556
61389 377556 375958 374483 372851 371324 370573 370720 371183 371572 372062 372712 373230 373696 374742 376527 378243 379194
61373 379194 379777 380732 382000 383097 384149 385680 387593 389184 390159 390933 391942 393272 394926 396795 398342
61358 398342 399033 399247 400148 402438 405794 409775 414653 420924 428498 436911 446007 455821 465910 475372 483574
61343 483574 490460 496124 500495 503676 506286 509170 512784 517005 521431 525716 529621 532908 535222 536074
61329 536074 535070 532313 528547 524704 521238 518045 515056 512587 510927 509766 508444 506739 505188 504581
61315 504581 505374 507563 510815 514594 518467 522544 527516 534035 542141 551360 561224 571519 582187 593246
61301 593246 604746 616584 628254 638890 647573 653616 656685 656795 654193 649235 642485 634879 627408
61288 627408 620313 612815 603998 593913 583490 573509 564123 555392 547701 541354 536207 532091 529254 527889
61274 527889 527514 527385 527522 528769 531721 536035 540925 545878 550694 555253 559651 564298 569513 575207 581289
61259 581289 588159 596408 606165 617102 628838 640823 651976 661107 667890 672973 677036 680139 682092
61246 682092 682839 682230 679921 675944 671031 665985 661004 655881 650526 644969 639270 633870 629617 626842 624664
61231 624664 621935 618700 616102 614900 614790 615307 616712 619664 624400 630476 636999 643062 648318 653230 658479
61216 658479 664127 669818 675706 682486 690274 698108 704976 710858 716236 721000 724425 726115 726505 726474 726787
61201 726787 727851 729721 732392 736236 742041 750469 761651 775463 791852 810578 830844 851587 872006
61188 872006 891524 909416 924919 937683 947778 955313 960436 963645 965613 966593 966333 964672 961823
61175 961823 957863 952382 945021 936117 926382 916026 904628 891922 878313 864433 850498 836321
61163 836321 821714 806503 790378 773200 755514 738265 721888 706129 690987 677369 666320
61152 666320 657971 651792 647608 645634 645557 646375 647348 648493 649795 650511 649707 647169 643305 638440 632661 626215
61136 626215 619670 613657 608672 605032 602809 601904 602366 604547 608782 615044 623048 632512 643244 655178
61122 655178 668496 683476 700146 718433 738790 762138 788774 817678 847428 877461 907978
61111 907978 938898 969644 999844 1029499 1058306 1085439 1110249 1132714 1152903 1170402 1184612
61100 1184612 1195380 1202875 1206860 1206385 1200374 1188579 1171925 1151855 1129273 1104246 1076672 1046986
61088 1046986 1016063 984764 953874 924135 895905 868881 842614 817159 792837 769555 746991
61077 746991 725473 706009 689247 674935 662591 652179 643765 636943 631078 625925 621685 618618 616860
61064 616860 616389 616903 617873 618959 620350 622495 625743 630312 636360 643734 651830 660046 668402 677533 688123
61049 688123 700498 714633 730326 747398 765874 785950 807678 830771 854831 879742 905688
61038 905688 932847 961151 990318 1020042 1050142 1080532 1111003 1141169 1170820 1200252 1230013
61027 1230013 1260378 1291372 1323261 1356496 1391082 1426472 1462319 1498823 1536061 1573537 1610992
61016 1610992 1649352 1690394 1735708 1786494 1844060 1909852 1985021 2070425 2166987 2275717 2398009
61005 2398009 2537050 2699208 2893568 3130401 3420987 3779042 4221949 4771897 5458172
60996 5458172 6317643 7387894 8694924 10246563 12036433 14044358 16216030 18431304
60988 18431304 20498645 22202653 23385118 24007117 24156105 24006129 23762084 23605523 23642081
60979 23642081 23857764 24109332 24168936 23810319 22894583 21415362 19490278 17312310 15086823
60970 15086823 12979476 11091454 9463366 8094804 6963690 6038380 5284786 4671446
60962 4671446 4172116 3765374 3433276 3160883 2936030 2748475 2589418 2452142 2332527
60953 2332527 2228167 2137100 2057682 1989036 1930673 1881683 1840829 1807257 1780378 1758946 1740864
60942 1740864 1724034 1707024 1688917 1669211 1648116 1626467 1604907 1583360 1561419 1538865 1515573
60931 1515573 1491296 1465859 1439336 1411738 1382799 1352427 1321138 1289686 1258327 1226772 1194777
60920 1194777 1162458 1130127 1098207 1067311 1038048 1010559 984479 959491 935788 913833 893846
60909 893846 875682 859137 844137 830595 818270 806924 796595 787566 779988 773576 767733 761895
60897 761895 755734 749210 742558 736117 729898 723317 715592 706505 696671 687093 678564 671391 665320 659627
60883 659627 653608 647199 640950 635279 630026 624893 619952 615352 610727 605385 599073 592193 585223 578235
60869 578235 571133 564058 557315 551008 544981 539144 533737 529157 525508 522422 519467 516675 514518 513281
60855 513281 512695 512329 512176 512507 513186 513413 512363 510014 507257 505161 504135 503769 503423 502842 502167 501516 500746
60838 500746 499553 497512 494094 488993 482601 475889 469682 464296 459924 456899 455241 454381 453803 453726 454634
60823 454634 456335 458056 459450 460891 462653 464381 465681 466798 468278 470123 471662 472206 471606 470180 468307
60808 468307 466160 463759 461216 458859 457067 455975 455372 454879 454173 453100 451673 449926 447721 444793 441091
60793 441091 436956 432849 429000 425416 422051 418772 415317 411592 407888 404588 401699 398927 396057 392994
60779 392994 389581 385782 381967 378627 375813 373238 370933 369287 368400 367889 367510 367530 368238 369503 371089 373067
60763 373067 375618 378726 382361 386705 391866 397535 403213 408648 413801 418578 422882 426774 430387 433728
60749 433728 436698 439169 440958 442010 442737 443827 445401 446572 446160 443685 439479 434137 428203 422097 415927
60734 415927 409430 402438 395224 388127 381105 374054 367358 361565 356657 352217 348279 345399 343758 342729
60720 342729 341565 340140 338792 337786 337176 336920 336900 336907 336738 336189 335059 333421 331861 331078 331174 331627 331963 332120
60702 332120 332184 332246 332590 333532 334895 336096 336915 337731 338816 339962 341141 342935 345835 349567 353596 357873
60686 357873 362533 367253 371563 375565 379681 383904 387923 391866 396201 401021 406093 411502 417475 423513
60672 423513 428557 432266 435438 438822 442090 444282 444748 443388 440548 437023 433607 430225 425951 420240
60658 420240 413643 407031 400796 395261 391069 388431 386570 384813 383751 384365 386283 387939 388401 388112 387816
60643 387816 387690 387644 387569 386964 385130 382099 378732 375625 372585 369449 366678 364642 362993 361274 359602 358224
60627 358224 356940 355623 354921 355690 357901 360623 362947 364468 365163 365353 365650 366371 367066 367079 366480 365929 365695
60610 365695 365365 364604 363692 363142 363121 363431 363832 364235 364695 365234 365639 365541 364868 364069 363674 363767 364108 364579 365273 366314
60590 366314 367839 369993 372652 375375 377917 380502 383200 385412 386507 386695 386610 386243 385136 383543 382487
60575 382487 382432 382754 382935 383527 385351 388319 391717 395334 399591 404723 410508 416847 424137 432840 442984
60560 442984 454231 466226 478651 490955 502229 511471 518069 521982 523415 522445 519090 513653 506773
60547 506773 499178 491584 484793 479565 476279 474838 474949 476371 478954 482649 487509 493544 500695 509141
60533 509141 519423 531962 546508 562378 579037 595990 612221 626353 637490 645451 650154 651392
60521 651392 649370 644934 639000 632152 624968 618082 611566 604837 597650 590842 585547 581977 579386 576997
60507 576997 574537 572139 570218 569267 569390 570177 571455 573976 578948 587012 598088 612098 629371 650364
60493 650364 675383 704652 738287 776101 817559 861835 907679 953331 996849 1036510 1070861
60482 1070861 1098626 1118888 1131225 1135430 1131237 1118597 1097961 1070057 1035670 996028 953019 908422
60470 908422 863115 817679 773600 733044 697264 665823 637576 611879 588675 568027 549981
60459 549981 534478 521068 509029 498021 488272 479864 472271 465003 458310 452713 448062 443611 438958
60446 438958 434431 430565 427624 425737 424998 425157 425479 425216 424178 422671 420952 419002 416842 414916 413877
60431 413877 413949 414638 415249 415604 416010 416494 416477 415474 413899 412743 412467 412595 412501 412186 412104 412488 413200 414050 414933
60412 414933 415724 416370 417098 418222 419762 421512 423494 425907 428553 430724 431931 432392 432553 432532 432432 432852
60396 432852 434443 436992 439500 441222 442283 443222 444401 445958 447946 450294 452871 455660 458682 461709
60382 461709 464413 466832 469404 472450 475887 479349 482253 483904 484173 484135 485275 487831 490511 492189 493206
60367 493206 494553 496430 498279 499763 500920 501659 501908 502155 503149 504986 507028 508771 510374 512358 515240
60352 515240 519377 524716 530653 536632 542879 550177 558967 569106 580351 592421 604441 614984 623032
60339 623032 628501 631567 631892 628926 622781 614459 605230 595891 586548 577017 567420 558328 550253 543165
60325 543165 536743 530919 525797 521192 516719 512333 508282 504504 500626 496770 493789 492348 492120 492299 492604
60310 492604 493436 495232 498107 502074 507323 514230 523248 534744 548842 565443 584453 605763 628803
60297 628803 652256 674419 693856 709595 720824 726654 726308 719491 706647 688986 668272 646433
60285 646433 625142 605525 588172 573384 561266 551466 543030 534959 527153 520440 515349 511140 506490
60272 506490 500965 495264 490121 485539 481285 477500 474480 472190 470368 468872 467591 466216 464495 462678
60258 462678 461407 461070 461403 461763 461723 461409 461288 461595 462032 462144 461928 461875 462398 463438 464647 465686 466265 466238
60240 466238 465864 465705 465964 466121 465523 464223 462941 462227 462002 462018 462419 463605 465634 468024 470238 472249 474575
60223 474575 477802 482059 486876 491444 495128 497909 500426 503479 507496 512512 518541 525659 533690 542089
60209 542089 550362 558427 566438 574434 582334 590084 597579 604577 610880 616492 621448 625658 629107 631963
60195 631963 634261 635730 636264 636294 636315 636221 635528 634085 632105 629633 626483 622715 618682 614571 610331 606044
60179 606044 601896 597787 593447 589037 585051 581464 577500 572621 567393 563050 560459 559687 560274 561575 563003
60164 563003 564169 564863 564975 564576 563995 563470 562776 561551 559942 558526 557592 557008 556790 557248 558405 559895 561628
60147 561628 563959 566846 569419 570931 571717 572729 574424 576555 578758 580883 582996 585512 589109 594000
60133 594000 599452 604480 608918 613364 618240 623404 628630 633857 638784 642689 645018 646007 646498 647241 648507
60118 648507 650246 652357 654694 656922 658676 659925 661018 662179 663145 663512 663222 662381 660809 658319 655333
60103 655333 652584 650065 646893 642476 637244 631925 626686 621397 616331 612061 608986 607368 607513 609420
60089 609420 612414 615568 618384 620828 623034 625308 628033 631086 633607 634865 635169 635476 636254 637156 637511
60074 637511 636610 633737 628586 621668 613869 605659 597199 588923 581331 574240 566975 559441 552365 546267
60060 546267 540791 535400 530218 525783 522251 519288 516611 514362 512927 512498 512789 513276 513804 514834 516840
60045 516840 519608 522560 525682 529623 534712 540397 545925 551194 556568 562060 567126 571214 574125 575771
60031 575771 575871 574143 570790 566547 562147 557760 553132 548111 542790 537158 531045 524550 518088 511688
60017 511688 504720 496871 489129 483102 479310 476683 473798 470072 465670 460890 456099 451908 448861 446967
60003 446967 445746 444722 443755 443015 442684 442574 442045 440582 438634 437611 438715 441775 445412 448325 450283
59988 450283 451994 454262 457433 461447 466066 470850 475063 477967 479391 479853 479964 479827 479157 477786 475816
59973 475816 473324 470235 466541 462449 458245 454142 450320 446960 444122 441620 439110 436424 433861 432091
59959 432091 431631 432431 434100 436415 439343 442597 445593 447921 449524 450381 450570 450814 452232 455008 457859
59944 457859 459510 460299 461529 463556 465447 466422 466632 466347 465392 463859 462612 462383 462820 463072 463029 463428 464858
59927 464858 467149 469717 472212 474807 478049 482359 487566 493034 498308 503409 508402 513084 517407 521843
59913 521843 526842 532061 536556 539722 541652 542622 542637 541642 539807 537405 534576 531404 528092 524903 521985
59898 521985 519360 517021 515004 513438 512527 512383 512870 513822 515516 518629 523445 529299 535199 540928 547103
59883 547103 554064 561207 567753 573765 579920 586491 593039 599077 604513 609394 613664 617321 620365 622421
59869 622421 622790 621161 617988 613920 609083 603214 596241 588459 580345 572480 565508 559803 555206 551251
59855 551251 547607 544224 541267 539128 538263 538788 540283 542240 544613 547784 552168 558026 565498 574584 585128
59840 585128 596872 609246 621054 630729 637321 641099 643048 644100 645012 646583 649375 653309 657799 662075
59826 662075 665093 665562 662668 656768 648895 639715 629378 618314 607611 598403 591148 585574 581091 577203
59812 577203 573688 570463 567290 563775 559722 555292 550759 546441 542874 540530 539116 537618 535401 532731
59798 532731 529919 526662 522790 518967 515877 513229 510486 508088 506870 506576 506086 505003 503902 502967 501601
59783 501601 499637 497915 497198 497337 497892 498820 500107 501371 502236 502593 502284 501185 499874 499506 500601 502512
59767 502512 504370 505974 507452 508752 509896 511146 512520 513694 514750 516419 519111 522306 525318 528045
59753 528045 530505 532340 533478 534753 537117 540581 544534 548661 552862 556705 559854 562834 566509 570744
59739 570744 574297 576209 576780 577064 577818 579049 580273 581056 581475 582071 583268 584926 586639 588239 589801 591345
59723 591345 592762 593946 594838 595544 596499 598156 600256 601824 602268 602176 602587 603719 604925 605651 605886 605711 605024
59706 605024 603941 603088 603154 604256 605867 607290 608114 608312 608063 607641 607471 608028 609490 611635 614308 617753
59690 617753 622077 626501 629730 631087 630842 629449 627079 624046 620992 618293 615737 613091 610493 607955
59676 607955 605003 601237 596842 592107 586854 580814 574246 567727 561625 556207 551882 548735 546048 542864
59662 542864 538989 535038 531588 528753 526569 525369 525541 527007 529027 530673 531720 533025 535693 539799
59648 539799 544317 548270 551425 553725 554747 554142 552186 549473 546390 543112 539729 536106 532106 528152
59634 528152 524985 522623 520278 517736 516012 515927 516725 516930 516065 514724 513353 511826 509918 507415 504065
59619 504065 500189 497038 495626 495441 495209 494714 494802 495587 495869 494749 492929 491856 492129 493258 494592 495989
59603 495989 497659 499698 501856 503794 505498 507191 508706 509345 508744 507538 506720 506561 506601 506436 506023 505464
59587 505464 505030 505212 506167 507283 507735 507278 506011 503824 500789 497782 495762 494504 492874 490376 487633
59572 487633 485306 483382 481719 480531 480017 480062 480498 481214 481924 482327 482565 482981 483428 483394 482816 482104 481327 480145
59554 480145 478709 477860 478138 479210 480588 482327 484659 487457 490378 493166 495614 497738 500188 503982 509569
59539 509569 516598 524771 534361 545723 558973 574512 593031 614186 635515 653311 664734 669115
59527 669115 667813 663267 657849 652988 649203 646912 646741 648805 652070 654917 656232 655721 653434 649396 643604
59512 643604 636022 626590 615470 603280 590894 578930 567516 556556 546176 536881 529232 523381
59500 523381 519019 515727 513138 510767 508159 505509 503736 503486 504334 505361 506228 507101 507910 508387 508697 509207
59484 509207 509671 509504 508945 509156 510874 513635 516671 519944 523964 529094 535360 542474 549821 556883 563827
59469 563827 571143 578508 584739 589221 592597 595503 597341 597165 595376 593640 593299 594634 597630 602561 609473
59454 609473 617745 626750 636667 648119 660984 674003 685776 695848 704492 711709 717055 720454 722444
59441 722444 723205 721856 717293 709409 699007 686931 673910 660948 649028 638513 629435 622180 617127
59428 617127 613805 611290 609492 609191 610775 613849 618276 624627 633213 643509 654963 667722 682120
59415 682120 698101 715487 734228 753997 774186 794653 815785 837258 857173 872769 881491 881342
59403 881342 871387 852961 829991 807305 788563 775709 769502 769735 775233 784084 793602 800031 799420
59390 799420 789838 772528 750477 726382 702417 680853 663414 650128 639856 631971 626775 624355
59378 624355 623956 624734 626494 629409 633414 638038 642535 646100 648288 649365 650116 651297 653240 655741 658164
59363 658164 659960 661271 662798 664919 667292 669597 672252 676069 681508 688544 696919 706199 716034 726725
59349 726725 739176 753940 770676 788820 808172 828340 848224 866822 884169 900758 916299
59338 916299 929693 940001 946775 949679 948574 943872 936151 925432 911439 894552 875929 856691
59326 856691 837511 818915 801394 785050 769615 755014 741658 730039 720180 711461 702960 694132
59314 694132 685243 676897 669190 661825 655071 649703 645634 641491 636270 630584 625450 620624 615382 610387
59300 610387 607326 606809 607988 610368 614729 621892 631659 643452 657031 671930 686781 699677 708750
59287 708750 712281 709135 699743 686206 670973 655768 641901 630714 622931 618050 615144 614123 615680
59274 615680 620208 627424 637019 649058 663486 679511 695750 710948 724572 736750 747673 757070
59262 757070 764303 768865 770578 769329 764910 757378 747445 736277 724805 713279 701569 689915 679235
59249 679235 670502 663870 658675 654365 651110 649380 649287 650690 653637 658298 664542 671930 680048 688602 697281
59234 697281 705794 713972 721644 728560 734629 739937 744300 747077 747793 746671 744137 740062 734042 726245
59220 726245 717471 708451 699560 691105 683323 676107 669196 662673 656859 651799 647188 642715 638036 632613
59206 632613 626223 619514 613368 607761 602000 596135 591241 587954 585550 583034 580522 578933 578676 579267 580038
59191 580038 580641 581012 581318 582007 583532 585957 589008 592446 596155 599974 603745 607544 611628 616063 620569
59176 620569 624825 628879 633215 638489 645136 653104 661852 670738 679543 688634 698461 708900 719254 728976
59162 728976 738117 746798 754452 760003 762821 763062 761016 756504 749171 739095 726921 713583 699980
59149 699980 686634 673507 660435 647756 636131 625655 615696 605903 596848 589196 582675 576423 570112
59136 570112 564113 558617 553117 546983 540314 534112 529517 526742 524870 523000 521422 521111 522124 523347
59122 523347 524084 525056 527408 531520 537367 545185 554920 565678 576648 588036 600158 612121 622624
59109 622624 631734 640695 650073 659223 667576 675261 682315 688415 693707 698786 703398 706185 706400 705064
59095 705064 703684 702440 700441 697367 693997 691191 689034 687139 685337 683801 682638 681575 680150 678073
59081 678073 675232 671375 666152 659671 652680 645873 639237 632465 625685 619352 613535 607841 601990 596155
59067 596155 590753 586174 582537 579472 576349 573000 569868 567179 564461 561347 558377 556321 555088 553884
59053 553884 552113 549515 545921 541698 538087 536147 535554 535213 534829 534914 535469 535758 535345 534409 533017 531065
59037 531065 529055 527927 527946 528537 529287 530269 531363 532217 533032 534483 536759 539674 543818 550437 559777 570561
59021 570561 581553 592692 604198 615543 626003 635494 644142 651547 657022 660197 661064 659922 657574
59008 657574 655055 652851 650835 649058 647981 647864 648672 650723 654591 660085 666256 672705 680045 688660 697853
58993 697853 706655 714685 721767 727567 732141 736041 739276 740890 740149 737494 733807 729463 724683 720130
58979 720130 716430 713649 711743 710987 711485 712964 715547 720046 726873 735342 744683 755054 766876 779827
58965 779827 793291 807233 821832 836642 850883 864214 876616 887756 896985 903642 907055 906765
58953 906765 903135 897037 888535 876614 860815 842343 822911 803253 783578 764657 747328 731480
58941 731480 716589 702953 691426 682162 674486 667857 662233 657706 654444 652672 652023 651297 649603 647449
58927 647449 645938 645196 644395 642958 640931 638410 635547 632916 631035 629595 627960 626338 625577 625815 626184
58912 626184 626004 625613 625819 627081 629362 632355 635777 639822 645286 652844 662266 672738 683939 696391
58898 696391 710832 727510 745941 764982 783390 800725 817694 835371 854251 874265 895374
58887 895374 917741 941520 966695 992802 1018575 1042339 1063100 1080867 1095594 1106412 1112372 1113382
58875 1113382 1109779 1101509 1088415 1071048 1050529 1027861 1003883 979559 955779 933120 912200 893825
58863 893825 878254 864726 852262 840582 829786 819606 809555 799411 788995 777965 766392
58852 766392 755039 744475 734415 724502 715143 706825 699227 691739 684340 677130 669586 661204 652472
58839 652472 644295 636884 629994 623700 618021 612283 605934 599643 594577 590907 587974 585517 583708 582385
58825 582385 581389 581293 582653 584860 586992 589438 593350 598659 604049 608890 613736 618804 623394 627206 630963
58810 630963 635229 639574 643270 645957 647373 647337 646293 644977 643331 640587 636581 632080 627631 622997 618001
58795 618001 612931 607820 602242 596196 590351 585105 580181 575454 571333 568013 565227 563100 562427 563623
58781 563623 566151 569380 573256 577660 581879 585292 588045 590573 592909 594845 596241 596838 596193 594146 590859
58766 590859 586197 579656 571301 562248 553812 546527 540276 535003 530988 528730 528667 530699 533896 537103 539914
58751 539914 542713 545778 548854 551605 553954 555986 558029 560800 564834 569750 574678 579465 584739 590739
58737 590739 596827 602397 607649 613205 619397 626086 632761 638876 644554 650809 658440 666813 674524 681139
58723 681139 687412 693780 699721 704857 709771 715206 721117 726993 732654 738439 744919 752546 761142 769722
58709 769722 777186 783056 787079 788502 786638 781942 775585 767938 758372 746448 732305 715850 696788
58696 696788 675704 654168 633470 614125 596678 581874 569673 559111 549535 541073 533690 526934
58684 526934 520997 516773 514199 511618 507594 502534 497777 493896 490679 488012 485882 484012 482369 481668
58670 481668 482743 485682 490043 495561 502220 509999 519001 529463 541280 553796 566215 577764 587344
58657 587344 593721 596419 595983 593121 588100 581205 573166 564866 557026 550242 544705 539803 534745 529660
58643 529660 525422 522349 519974 518155 517363 517650 518423 519586 521812 525163 528495 530929 532939 535238 537450
58628 537450 538712 538999 539053 539448 540362 541839 543776 545941 548339 551189 554456 558041 562488 568617 576314
58613 576314 584594 593059 602166 611659 619977 625878 629575 631539 631312 628533 624274 620226 617042 614298
58599 614298 611552 608600 605121 600875 596003 590707 585088 579689 575589 573417 572812 573259 574840 577794 582097
58584 582097 587931 595794 605660 616696 628268 640429 653051 665436 677170 688326 698346 706031
58572 706031 711409 716350 722382 729135 735976 743955 754690 768372 784423 803297 825886 851578 878539
58559 878539 905767 933346 960670 985812 1006956 1023393 1034883 1041016 1041634 1037343 1029356 1019206
58547 1019206 1008513 998527 989765 982281 975975 970292 963961 955549 944192 929654 912136 892330 871206
58534 871206 849413 827355 805977 786660 769963 755296 742338 731884 724633 719985 716891 715167
58522 715167 715056 716104 717439 718787 720341 721961 723265 724248 725102 725681 725656 724881 723158 720106 715723 710607
58506 710607 705204 699344 692993 686836 681634 677586 674713 673094 672181 670659 667765 664222 661331 659682
58492 659682 659135 659305 659560 659281 658719 658941 660601 663520 667738 673878 682013 691391 701938 714874 731048
58477 731048 749653 769234 788795 807174 822625 834040 841558 845144 843843 837375 827229 815113
58465 815113 801618 787430 774401 763978 755786 749221 745227 744905 747529 751697 757529 765991 776793
58452 776793 788677 801136 814070 826211 835560 841122 842925 840746 834228 823997 811588 798516
58440 798516 786193 775875 767730 760752 754574 750317 748619 748177 747701 747995 750448 754656 759473 765324
58426 765324 773442 783578 794542 806341 819752 834206 847960 859942 869713 876164 878156 876069
58414 876069 871073 863404 853055 841433 830355 819840 808781 797283 786395 776010 765166 754153
58402 754153 744342 736144 728996 723118 719360 717499 716515 716363 717725 720253 722859 725465 728766 732563 736031
58387 736031 739133 741964 743324 742011 739079 736790 735740 735094 735061 736824 740406 744969 750930 759318 769313
58372 769313 778942 788100 798259 809206 818850 826640 834538 843997 854362 864886 876089 888358 901201
58359 901201 914509 928700 943076 955856 966310 975173 982654 987852 990497 991504 991487 990365 988606
58346 988606 987181 986172 985101 984557 985765 988684 992422 997334 1004664 1014290 1024893 1036241 1049248 1063966
58332 1063966 1079717 1096898 1116243 1136395 1154616 1169859 1182865 1193555 1200949 1205482 1208672 1210460
58320 1210460 1209649 1206956 1204896 1204545 1205120 1206687 1210286 1215322 1219994 1224572 1231119 1239634 1247798 1255076 1263766
58305 1263766 1275131 1287617 1299840 1312406 1325813 1339387 1353206 1368407 1384721 1400282 1414553
58294 1414553 1428866 1443591 1457551 1470784 1485057 1501100 1518013 1535706 1554986 1575029 1593945
58283 1593945 1612159 1632026 1653805 1675434 1696553 1719118 1743638 1768464 1793401 1820340 1849768
58272 1849768 1880292 1912051 1946765 1984026 2021499 2059217 2099519 2142496 2185959 2230217 2278055
58261 2278055 2329465 2381489 2433907 2489656 2548610 2606533 2661618 2716500 2772322 2826510 2878307
58250 2878307 2930931 2986271 3042928 3101417 3165571 3236628 3311546 3389238 3472702 3563014 3657368
58239 3657368 3755323 3860719 3975064 4095474 4221511 4357259 4504042 4658133 4818492 4989597
58229 4989597 5173839 5368637 5573990 5794858 6032913 6284390 6549593 6835766 7146944
58220 7146944 7480394 7837135 8226040 8653067 9116896 9620098 10173523 10784374 11451898
58211 11451898 12181063 12988252 13887350 14884319 15993310 17243950 18664963 20277168 22113222
58202 22113222 24228890 26687240 29555010 32931953 36967396 41837662 47736339 54914527
58194 54914527 63722761 74616867 88166313 105055994 125964115 151302577 181044786
58187 181044786 214793527 251824890 290724518 328782072 361887457 385424595 395774131
58180 395774131 391523844 373810104 345833792 311890153 276255531 242263119 211846173
58173 211846173 185603050 163192061 143815735 126648399 111118185 96981650 84221871
58166 84221871 72896260 63035955 54603670 47484693 41510180 36502612 32304594 28775903
58158 28775903 25788827 23239825 21054753 19174175 17542482 16115572 14865511 13768179
58150 13768179 12794551 11919848 11131225 10419033 9768715 9167708 8612211 8100404 7626020
58141 7626020 7184507 6778399 6410156 6075418 5768613 5489191 5236964 5006955 4794079
58132 4794079 4597626 4416239 4243666 4074465 3909322 3750324 3595766 3444208 3299037
58123 3299037 3164193 3039048 2921480 2812058 2711226 2616147 2524323 2437027 2355788 2279088
58113 2279088 2205753 2137792 2076444 2019013 1963008 1909843 1861103 1814652 1767927 1721822 1677970
58102 1677970 1635357 1592872 1552044 1513956 1476443 1437578 1399136 1363543 1330237 1298039 1268213
58091 1268213 1241934 1217469 1192989 1169683 1149105 1129998 1110707 1092259 1075968 1060304 1043134
58080 1043134 1024875 1006632 987441 966202 944289 923479 903321 883076 864028 847190 830920
58069 830920 813641 796929 783058 771341 759664 747936 737353 727906 719185 712009 706753 701554
58057 701554 694585 686592 679069 671570 663025 653933 645006 635459 624928 615283 608138 602306 596040 590037
58043 590037 585769 582534 578691 574292 570083 565491 559981 554784 550869 546826 541242 535469 531373 527914
58029 527914 522794 516027 509096 501852 493206 483792 475028 466424 456619 446334 437605 430715 424425 418602
58015 418602 414112 410694 407335 404239 402195 400594 398318 395900 394582 393919 392618 391028 390423 390429 389669 388439
57999 388439 388206 388763 388389 386783 385504 385454 386076 387158 389383 392908 397128 401861 407117 411785 414303 414642
57983 414642 414040 412927 410692 407346 403788 400377 396646 392387 387797 382838 377687 373406 370843 369274
57969 369274 367428 365317 363722 362522 361075 359701 359165 359222 359165 359267 360155 361294 361703 361581 361586 361100 358994
57952 358994 355663 352593 350229 347874 345233 342518 339583 336607 335025 335997 338490 340677 342615 345666
57938 345666 349989 354796 360567 368608 378589 388777 398668 409200 420324 430567 439242 447017 454000
57925 454000 459182 462095 463224 462555 459525 454636 449272 443706 437088 429574 422561 416563 410854 405554
57911 405554 402012 400477 399351 397510 395641 394526 393704 392666 391738 390840 388796 384856 379793 374700 369777
57896 369777 364937 360438 356240 351803 347111 342934 339616 336732 334329 333309 334047 335752 337675 339862
57882 339862 342241 344166 345393 346416 347397 347927 348176 348993 350315 350746 349409 347095 344971 343365 342419 342685
57866 342685 344179 345855 346948 347963 349656 351925 354363 356945 359486 361374 362608 364135 366345 368223
57852 368223 368942 369345 370710 372723 373912 373733 373055 372704 372421 371390 369120 365675 361430 356755 351868 347017
57836 347017 342618 338770 334770 329782 324096 319061 315546 313167 311252 309842 309266 309336 309593 310043 311155
57821 311155 313179 315735 318048 319590 320582 321686 323030 323842 323397 321989 320505 319424 318809 318785 319207 319155
57805 319155 317610 314462 310181 304936 298936 293185 288712 285271 281873 278417 275708 274133 273514 274006 275751
57790 275751 277872 279374 280967 284363 289614 294874 299118 303298 308249 313215 317348 321174 325488 330081
57776 330081 334571 339391 344798 349849 353447 355710 357352 358369 358222 356752 354074 350055 344650 338344
57762 338344 331696 324814 317696 310609 303780 297239 291227 286094 281599 277090 272658 269298 267697 267703 269152
57747 269152 272161 276295 280551 284600 288990 293781 298243 302328 306964 312169 316327 318330 319098 319801 319886
57732 319886 318254 315399 312884 311436 310857 311128 312120 312708 311637 309046 306003 302806 298921 294321 289708
57717 289708 285461 281419 277636 274358 271287 267836 264127 260913 258423 256046 253248 250153 247074 243995
57703 243995 240640 236753 232376 228078 224663 222384 220678 218968 217292 215900 214759 213935 213885 214762 215878
57688 215878 216437 216413 216157 215610 214606 213566 213217 213759 214889 216469 218738 222073 226894 233481 241655 251040
57672 251040 261975 275720 293611 316650 346066 383254 428479 480363 537030 596509 654995
57661 654995 705648 740678 754840 746837 718584 674451 620621 563475 507946 457362 413945 378375
57649 378375 349482 325540 305818 290203 277917 267761 259321 252832 247985 243903 240174 236998 234382
57636 234382 231997 229748 227705 225686 223685 222441 222701 224114 225645 226789 227576 227828 227486 227278 227800 228153
57620 228153 226837 223926 221009 218853 216572 213469 210353 208315 207248 206354 205363 204487 203667 202584 201197
57605 201197 199919 199324 199740 200821 201666 201743 201590 202050 203049 203846 204298 204906 205599 205498 204154 202170 200196
57588 200196 198096 195518 192641 189903 187492 185499 184094 183151 182102 180483 178392 176262 174486 173300
57574 173300 172610 171893 170655 169046 167539 166100 164282 162098 160045 158169 155965 153465 151584 150867 150584
57559 150584 149701 148264 147184 146947 147161 147292 147383 147944 149326 151269 153072 154302 155304 156818 159178 162089
57543 162089 165011 167422 168889 169431 169777 170760 172417 174155 175793 177826 180501 183205 185074 185797 185559
57528 185559 184578 182999 181030 178943 177003 175471 174546 174320 174877 176244 178083 179742 180938 182087 183602
57513 183602 185177 186311 187109 187887 188364 188125 187664 187928 188820 189191 188491 187450 186824 186391 185682 184923 184695 185128
57495 185128 185850 186269 185680 183717 181001 178761 177470 176405 174820 172837 170855 168794 166539 164478 162992
57480 162992 161866 160763 159848 159381 159170 158996 159100 159582 159738 158798 157089 155709 155096 154591 153369 151184 148195
57463 148195 144743 141469 139083 137656 136528 135222 134169 134208 135478 137195 138553 139510 140486 141540 142337
57448 142337 142879 143749 145268 146816 147472 147122 146441 145933 145553 145209 145109 145439 146150 147128 148241 149191 149734 150054
57430 150054 150553 151363 152459 154057 156176 157972 158370 157517 156756 156851 157109 156635 155709 155298 155793 156806 157789
57413 157789 158295 158004 157076 156215 156037 156575 157602 158958 160286 161018 161062 160959 160955 160486 159173 157737 157198 157544
57395 157544 157956 158063 158237 158769 159466 160061 160502 160861 161380 162497 164371 166545 168491 170307 172429 174880
57379 174880 177292 179495 181548 183305 184532 185372 186160 186833 187043 186816 186572 186441 186092 185324 184383 183606 183100
57362 183100 182793 182479 181846 180833 179931 179742 180223 180762 180991 181153 181664 182668 184033 185361 186075 185937 185524
57345 185524 185727 186703 187802 188588 189339 190332 191256 191781 192229 193118 194245 194775 194253 193073 191888 190938 190155
57328 190155 189600 189416 189384 188908 187679 186197 185319 185343 185801 186173 186421 186656 186705 186377 185973 186078 186843 187782 188328
57309 188328 188348 188097 187864 187729 187509 186893 185748 184243 182665 181221 180097 179497 179446 179677 179939 180216 180513 180622
57291 180622 180426 180190 180165 180033 179219 177751 176385 175734 175632 175446 174741 173472 171844 170221 169078 168838 169677
57274 169677 171450 173756 176229 178973 182661 187932 194688 202169 209728 217313 225156 233270 241368 249141
57260 249141 256451 263260 269402 274470 278053 280237 281680 283082 284658 286274 287855 289410 290850 292141
57246 292141 293500 295038 296345 296870 296745 296722 297277 298245 299421 300979 303040 305338 307680 310288 313258 316070
57230 316070 318230 320164 322900 326875 331587 336416 341267 346208 350986 355242 358930 362195 365027 367375
57216 367375 369523 372053 375344 379319 383695 388287 392961 397468 401500 404999 408327 412155 417097 423326
57202 423326 430477 437918 445178 452095 458629 464740 470613 476811 483884 491814 500064 508271 516671 525750
57188 525750 535656 546109 556723 567211 577402 587319 597163 606957 616237 624359 631195 637288 643292
57175 643292 649553 656333 664127 673453 684449 696923 710684 725598 741435 757960 775129 792888
57163 792888 810778 828125 844716 861025 877621 894612 911790 929057 946510 964340 982853
57152 982853 1002400 1023048 1044507 1066598 1089606 1113903 1139457 1165954 1193167 1220903 1248863
57141 1248863 1276999 1305880 1336182 1367928 1400688 1434437 1469683 1506787 1545745 1586696 1630008
57130 1630008 1675653 1723035 1771750 1822113 1874745 1930013 1988105 2049211 2113334 2180294 2250225
57119 2250225 2323901 2402384 2486573 2577158 2674905 2781080 2897940 3028590 3175906 3341736
57109 3341736 3527556 3735524 3968168 4227586 4516302 4839203 5204113 5621136 6103150
57100 6103150 6667296 7335261 8133148 9093837 10260485 11686198 13429655 15551711 18114258
57091 18114258 21176558 24787237 28975782 33744366 39057223 44832770 50951105 57276963
57083 57276963 63679514 70035501 76222940 82112712 87548246 92313425 96126370 98697530
57075 98697530 99827286 99465215 97687599 94632689 90460262 85351729 79518551 73194883
57067 73194883 66620543 60024853 53610397 47537397 41917179 36816892 32266721 28264274
57059 28264274 24780878 21772460 19189167 16979321 15091296 13476902 12093806 10904919
57051 10904919 9877584 8984597 8204483 7519582 6914834 6378721 5903407 5482418 5108956
57042 5108956 4776935 4482141 4221147 3989895 3784018 3599629 3433058 3280747 3140216
57033 3140216 3010445 2890785 2780272 2678411 2585752 2503084 2430870 2370007 2322437 2290428
57023 2290428 2275693 2279426 2302422 2344591 2404187 2476420 2551113 2611807 2639628 2620693 2551320
57012 2551320 2437916 2293709 2135050 1977279 1830778 1699920 1585473 1487059 1403324 1331664
57002 1331664 1269357 1214669 1166354 1122985 1083515 1047751 1015533 986073 958763 933849 911635
56991 911635 891681 873548 857697 844900 835304 828803 825783 826761 831559 839276 848589 857531 863442
56978 863442 863673 856227 839896 814828 783439 749796 717279 687172 659692 635352 614611 597187
56966 597187 582677 571331 563542 559261 558675 562768 572284 586625 604556 625436 648828 673247 696068
56953 696068 714292 724804 724691 712648 690181 660718 627581 593197 559635 528830 502156 480291
56941 480291 463427 451234 443016 438441 437911 441924 450538 463935 482838 507677 537766 571789 608295
56928 608295 644683 676215 697245 703704 694267 670023 634221 591879 548097 506072 467020 431641
56916 431641 400776 374720 352838 334272 318530 305359 294482 285571 278211 271964 266759 262943
56904 262943 260679 259576 259232 259664 260803 262124 263378 265192 268184 271912 275523 279164 284041 291299 301517
56889 301517 314887 331064 348989 367647 386795 406244 424621 439552 448851 450914 444514 429498
56877 429498 407806 382898 357918 334815 314842 298806 286719 278088 272872 271677 275062 283316
56865 283316 297033 317258 344897 380285 423240 473065 528560 588108 649090 706540 753200
56854 753200 782214 790151 777313 746349 701901 650754 599955 553856 513756 480255 454576 437510
56842 437510 428833 428614 437982 457839 487944 528149 579671 644113 721625 810499 907473 1007067
56830 1007067 1100660 1177440 1227160 1242892 1222644 1169827 1092406 1000714 904889 813071 730618
56819 730618 660112 602127 556375 522401 499577 487127 484489 491585 508724 536400 575005 624276
56807 624276 682819 748097 816379 882099 937649 974899 987733 973740 934541 875517 804675
56796 804675 730079 657409 589927 530141 480194 440562 409815 386526 370715 362891 362523 368255
56784 368255 379182 395168 416247 442304 472986 507064 541649 572363 594439 603958 598696 578604
56772 578604 545819 504228 458681 413820 372700 336169 303773 275196 250671 230327 213804
56761 213804 200485 189586 180114 171381 163603 157396 152687 148774 145422 143087 141883 141052 139770 137867
56747 137867 135595 133302 131543 130807 130801 130549 129503 128082 126967 126458 126644 127516 128613 129216 129198 129120 129304 129462
56729 129462 129432 129525 129847 130085 130321 131201 132780 134036 134255 134281 135597 138559 142171 145236 147166 148003 148325
56712 148325 148976 150386 152170 153631 154464 154807 154976 155368 156297 157620 158819 159575 159998 160248 160379 160519 160634
56695 160634 160087 158194 155331 152709 150860 149194 147295 145676 144801 144286 143741 143520 143915 144342 144182 143839
56679 143839 144163 145217 146373 147256 147944 148603 149542 151268 153893 156799 159363 161584 163548 164919 165627 166516
56663 166516 168510 171478 174660 177863 181434 185263 188592 190795 191822 192016 191970 192398 193675 195609 197931
56648 197931 200607 203351 205315 205901 205626 205672 206731 208605 210560 211712 211457 210004 208231 206696 205153
56633 205153 203174 200716 197811 194359 190601 187059 183603 179418 174434 169929 167012 165266 163669 162010
56619 162010 160566 159202 157785 156770 156309 155537 153909 152591 153116 155136 156925 157837 158775 160343 161996
56604 161996 163191 164081 164786 165090 165188 165739 166797 167514 167240 166245 165167 164405 164132 164244 164208 163633 163001 163149
56586 163149 164053 164908 165414 166132 167475 169262 171451 174404 178015 181292 183296 184026 184119 184113 184291 184833 185860
56569 185860 187490 189846 192706 195347 197264 199012 201800 206274 212189 219184 227296 236686 247411 259559
56555 259559 273082 287342 301073 312808 321274 325875 327320 327441 327720 328178 328128 327518 326784 325807 324024
56540 324024 321442 318640 315840 312785 309465 306098 302430 297904 292636 287419 282668 278070 273319 268463
56526 268463 263467 258164 252823 248124 244446 241629 239409 237577 235860 234225 233099 232643 232125 230810 229172
56511 229172 228267 228095 227558 226022 223899 221684 219366 216865 214166 210983 207154 203325 200309 197846 194985
56496 194985 191669 188839 186941 185513 184334 183772 183693 183235 182128 181185 181084 181596 182427 183841 185968 188330
56480 188330 190533 192611 194426 195546 196038 196516 197098 197259 197042 197375 198763 200551 202005 203193 204365 205408
56464 205408 206422 207933 209953 211676 212636 213350 214226 214709 214148 212787 211301 210078 209447 209748 210561 210601 209198
56447 209198 207249 206141 206299 207339 208928 210787 212437 213623 214637 215753 216786 217544 218151 218605 218660 218513
56431 218513 218868 219925 221043 221779 222454 223211 223406 222572 221227 220140 219472 219151 219258 219447 218854 217325 216006
56414 216006 215917 216691 217463 218271 219616 221219 222243 222422 222192 221958 221849 221952 222208 222396 222608 223267 224274 224732
56396 224732 224007 222590 221449 221047 221386 222344 223437 223900 223581 223261 223736 225169 227623 231281 235662 239590
56380 239590 242578 245346 248314 250627 251574 251947 252901 254300 255363 256280 257816 259769 261095 261415 261371 261612
56364 261612 262378 263911 266320 268989 270922 271801 272209 272817 273721 274462 274404 273284 271631 270299 269506 268838 268283
56347 268283 268425 269311 270082 270256 270556 271813 273855 276056 278185 280062 281216 281683 282406 284088 286382 288893
56331 288893 292086 296320 300816 304579 307671 310633 313356 315538 317613 320161 322916 325337 327646 330348
56317 330348 333192 335521 337172 338220 338345 337358 335844 334502 333430 332759 333154 334741 336360 337029 337488 339158
56301 339158 342183 345701 349434 353768 358630 363510 368353 373441 378639 383641 388577 393576 398213 402160
56287 402160 405833 409595 413099 416281 420121 425385 431469 437658 444586 453056 462252 470716 478521 486961
56273 486961 496481 506400 516315 526367 536446 546523 557569 570846 586451 603547 621707 641105
56261 641105 662039 685312 712290 743319 776964 812299 851084 896011 947617 1004824 1067888
56250 1067888 1138773 1218904 1308575 1408282 1518575 1638560 1766442 1901537 2043871 2191684
56240 2191684 2341221 2489228 2633834 2772641 2901687 3016775 3114437 3191349 3244429 3272111
56230 3272111 3274409 3251625 3204361 3134939 3047287 2945017 2830743 2707345 2578429 2447167
56220 2447167 2315803 2186439 2061041 1940524 1824986 1715001 1611680 1515538 1426527 1344969
56210 1344969 1271115 1203911 1141645 1083799 1030928 982925 938861 898436 862076 829657 800541
56199 800541 774664 752028 731439 711503 692718 676752 663767 652293 641654 632460 624646 617159
56187 617159 609917 604128 600219 597213 594442 592095 589834 586834 583526 581350 580378 579109 577024 575300
56173 575300 574449 573406 571783 571057 572521 575670 579460 583567 587678 591202 594512 598951 604810 610714 615732
56158 615732 620606 626199 632225 638309 644992 652878 661894 671959 683289 695790 709333 724781 743427
56145 743427 765439 790335 818933 853104 893743 940920 996052 1061636 1138506 1225383 1321238
56134 1321238 1425553 1535626 1645955 1751214 1848036 1933664 2005654 2064209 2112822 2155417
56124 2155417 2194154 2230074 2263273 2291412 2310293 2317338 2313293 2300259 2280020 2254513 2225292 2191420
56112 2191420 2149799 2098165 2035827 1961542 1873902 1775035 1671315 1569194 1472403 1383635 1305686
56101 1305686 1239370 1182934 1135116 1096572 1067151 1044386 1026100 1012088 1001917 993662 986330 981106
56089 981106 978716 977986 978352 981123 986641 992768 997903 1003073 1009406 1016037 1022222 1029051 1037247 1045602 1053262
56074 1053262 1061213 1070020 1078567 1086576 1095744 1106855 1118470 1129970 1142971 1158070 1173262 1187462
56062 1187462 1202453 1219372 1236413 1252197 1268216 1285543 1302281 1316774 1330347 1344367 1357677
56051 1357677 1369531 1382001 1396700 1412024 1426385 1441172 1457806 1474855 1490934 1507487 1525874
56040 1525874 1544734 1563073 1582841 1605554 1629636 1654006 1680853 1711617 1743755 1774939 1807012
56029 1807012 1842147 1878590 1914143 1950545 1990358 2032585 2075364 2119922 2167813 2217188 2265803
56018 2265803 2314871 2366205 2418679 2471196 2525829 2584236 2644465 2705054 2768452 2836463 2906554
56007 2906554 2976933 3050870 3131366 3216057 3302327 3392816 3490599 3593570 3699191 3810205 3929889
55996 3929889 4056359 4187497 4326610 4476992 4635925 4800572 4974609 5162257 5361282
55987 5361282 5569194 5790706 6031333 6289324 6561989 6853985 7170958 7511455 7874356
55978 7874356 8267716 8700478 9172272 9681712 10237497 10850258 11521418 12252587 13058184
55969 13058184 13955836 14953198 16059184 17299882 18708190 20307998 22127030 24216835
55961 24216835 26643630 29474575 32800034 36762826 41545682 47348243 54413950 63082232
55953 63082232 73804975 87145238 103783813 124439242 149626308 179422880 213477779
55946 213477779 251119508 291128718 331122136 367197906 394532274 408814222 407679425
55939 407679425 391399460 362671142 325748179 285261125 245137348 208013992 175246433
55932 175246433 147249644 123850293 104546883 88716722 75761275 65154539 56436413
55925 56436413 49220321 43208545 38174267 33928205 30313487 27216220 24553449 22249973
55917 22249973 20238830 18474645 16927008 15563076 14349647 13266392 12301867 11439507
55909 11439507 10659892 9952698 9313769 8733469 8199378 7707280 7258264 6847548 6466454
55900 6466454 6112685 5788421 5490512 5212189 4952427 4714278 4495635 4290346 4096871
55891 4096871 3917573 3751023 3593018 3443719 3305957 3177823 3054396 2935655 2825500
55882 2825500 2724181 2628714 2539608 2460084 2389411 2323678 2262413 2207852 2158175 2107820 2054309
55871 2054309 1999025 1941713 1880128 1815010 1749971 1686491 1623879 1563610 1508547 1458266 1410127
55860 1410127 1364572 1324370 1289040 1255035 1221310 1189963 1161431 1133770 1106760 1082177 1059742
55849 1059742 1036929 1012953 989116 965297 940035 913985 889465 866586 843470 820060 798104
55838 798104 777731 757757 738988 723336 709891 695721 680543 666873 655674 645520 636022 628274
55826 628274 621765 614456 606226 598856 592418 584992 576155 567441 559157 549982 539951 530684 522410 513838
55812 513838 505150 498091 492907 488212 484019 481804 481474 481462 482090 485637 492556 500643 508487 516848 526034
55797 526034 534753 542258 548927 554002 555250 551637 544201 533904 520818 505790 490642 476284 462589
55784 462589 450178 440219 432515 426042 421147 418669 417017 412896 405236 395930 386611 377390 368988 363348
55770 363348 361498 363110 368428 378155 390942 403312 412517 417440 416876 409649 396822 381264 364602
55757 364602 346886 329317 314420 303036 293792 286186 281559 280346 280914 281935 283406 284652 283844 280465
55743 280465 275979 271253 265627 259335 254282 251371 249354 247389 246439 246953 247380 246399 244728 243477 242409
55728 242409 240960 239286 237278 234225 230393 227221 225030 222283 218024 213239 208892 204500 199785 195980
55714 195980 194216 194100 194907 196647 199009 200931 202365 204962 209828 215904 221558 226326 230061 231853 231100
55699 231100 228503 224912 220261 214532 208657 203505 198988 194887 191513 188887 186470 184345 183524 184425 186179
55684 186179 187969 189850 191852 193717 196044 200134 206033 212169 217586 222926 228488 232958 235110 235311
55670 235311 234360 232209 228844 225180 222031 219223 216547 214453 213079 211777 210351 209627 210123 211403 213297
55655 213297 216429 220816 225337 229271 232995 236562 239038 240041 240381 240379 239021 235637 230856 225061 217540
55640 217540 208259 198872 190827 183873 177518 172359 168700 165344 161223 157002 153708 151025 148236 145683
55626 145683 143875 142209 139981 137674 135947 134320 132074 129490 127064 124514 121741 119645 118730 118005 116632
55611 116632 115528 115834 116819 116962 116283 115935 116112 115991 115381 114928 114863 114768 114458 114119 113772 113336 112846 112092 110635
55592 110635 108728 107331 106622 105538 103565 101816 101336 101527 101392 101190 101551 101970 101603 100765 100238 99873 99201
55575 99201 98697 99025 99713 99940 100079 101115 103066 105253 107567 110168 112494 113934 115036 116708 118614 119653
55559 119653 119668 119434 119263 118810 118053 117374 116865 116443 116316 116522 116492 115907 115380 115456 115741 115963 116929 119158 121425
55540 121425 122123 121488 121096 121780 123425 126143 129992 133885 136338 137134 136986 136033 134118 132043 130836 129983
55524 129983 128011 124689 121115 117725 113945 109842 106413 103946 101575 98837 96327 94422 92653 90787
55510 90787 89359 88669 88278 87893 87808 88109 88344 88351 88614 89478 90716 92064 93493 94749 95364 95277 94807 93958 92454
55491 92454 90470 88615 87142 85868 84854 84422 84484 84607 84721 85144 85940 86899 87960 88985 89374 88773 87960
55474 87960 88094 89202 90324 90972 91435 91744 91500 90851 90585 90965 91339 91140 90530 89861 89216 88640 88205 87753
55456 87753 87130 86589 86377 86111 85302 84326 83991 84310 84580 84547 84568 84759 84984 85570 86868 88109 87890 86036 83918
55437 83918 82650 82049 81653 81617 82065 82498 82496 82354 82468 82729 82945 83285 83810 84101 83820 83283 83098 83471 84084 84438
55417 84438 84272 83961 84462 86449 89534 92737 95532 97918 99700 100460 100208 99373 98143 96452 94623 93307
55401 93307 92760 92728 93031 93602 94017 93675 92512 90975 89412 88136 87802 88775 90182 90532 89429 87894 86953
55384 86953 86708 86860 87165 87183 86440 85149 84082 83538 83142 82728 82577 82640 82421 81949 82063 83323 85259 87031
55366 87031 88231 88793 88774 88556 88690 89278 89892 90216 90233 89788 88688 87334 86502 86323 86189 85847 85819 86474 87408
55347 87408 88083 88450 88656 88687 88630 88780 89232 89772 90209 90383 89926 88676 87262 86540 86449 86268 85947 86172 87001
55328 87001 87557 87437 87371 87924 88418 87837 86198 84412 83224 82733 82536 82093 81359 81153 82302 84332 85782
55311 85782 86014 85911 86515 87828 89270 90468 91080 90710 89553 88452 87853 87345 86676 86411 86971 87779 88056
55294 88056 87927 88073 88809 90067 91771 93574 94733 94867 94466 94102 93605 92611 91464 90839 90822 91002 91249 91751
55276 91751 92414 92789 92616 92098 91734 92061 93272 94833 95798 95736 95054 94246 93356 92489 92240 92939 93874 93952 93064
55257 93064 92283 92718 94452 96581 98029 98394 98138 97920 97818 97458 96846 96498 96653 96859 96636 96124 95792 95786 95845
55238 95845 95596 94803 93595 92479 91805 91275 90458 89671 89711 90676 91756 92321 92478 92435 92129 91774 91908 92495 92745
55219 92745 92268 91666 91483 91404 91109 91111 91867 92688 92498 91290 90009 89238 88822 88600 88730 89274 90093 91194 92652
55200 92652 94201 95316 95785 95896 96022 96235 96350 96207 95920 95854 96176 96542 96513 96227 96185 96387 96269 95609 94912
55181 94912 94689 94908 95385 96076 96710 96769 96240 95828 96029 96507 96771 96839 96785 96250 95036 93726 93087 93203 93687
55162 93687 94357 95155 95742 95794 95540 95532 96013 96794 97558 98057 98276 98536 99067 99416 98905 97796 97240 97708 98321 98249
55142 98249 97926 98114 98499 98191 97167 96267 95982 96043 96065 95965 95917 96420 98067 100620 102678 102996 101979 101127
55124 101127 101207 101666 101735 101339 100781 100229 99792 99728 100315 101541 102904 103555 103011 101875 101465 102453 104295 106118
55106 106118 107589 108512 108430 107334 106242 106221 107166 108222 109054 109854 110449 110327 109551 108791 108421 108251 108167 108393
55088 108393 108999 109763 110670 112038 113937 115852 117112 117455 117156 116786 116819 117335 118106 118965 119776 120069 119308 117794
55070 117794 116707 116710 116994 116332 114702 113182 112519 112519 112734 113034 113450 113956 114533 115099 115390 115151 114397 113297 111997
55051 111997 110730 109793 109207 108745 108509 108970 110124 111148 111328 110837 110141 109165 107639 105815 104263 103319 103151
55034 103151 103836 104870 105252 104770 104498 105288 106436 106816 106694 107223 108569 109782 110332 110520 110443 109702 108292
55017 108292 106803 105622 104798 104695 105740 107470 108829 109602 110592 112121 113401 113735 113447 113089 112551 111583
55001 111583 110608 110294 110688 111280 111751 112273 113131 114260 115173 115375 114969 114650 114892 115394 115744 116210 117274 118644
54983 118644 119475 119507 119294 119323 119621 120183 121064 121920 122152 121683 121038 120607 120389 120446 120896 121356 121146 120249 119474 119404
54963 119404 119727 119840 119622 119410 119629 120590 122216 123919 125134 125966 126802 127435 127259 126335 125463 125094 124898 124570
54945 124570 124349 124498 124920 125547 126430 127190 127060 125844 124267 123069 122281 121693 121406 121564 122087 123048 124764
54928 124764 127137 129428 131159 132743 134822 137435 140403 144105 149191 155687 162864 169895 176248 181553
54914 181553 185570 188261 189649 189575 187811 184362 179506 173603 167070 160485 154471 149323 144811 140498 136387
54899 136387 133128 131337 130733 130303 129433 128447 127837 127450 126842 126034 125397 125144 125401 126489 128557 131206 133988
54882 133988 136950 140086 142762 144561 146400 149793 155037 161121 167392 174229 181709 188583 193157 194712
54868 194712 193706 191105 187765 184037 179712 174593 169087 163827 158885 154039 149643 146378 144036 141445
54854 141445 137941 134209 131333 129621 128638 127876 127107 126504 126531 127276 127902 127343 125516 123235 120987 118608
54838 118608 116167 114255 113219 112926 113409 114819 116566 117511 117358 116964 116933 116895 116534 116254 116241 115904 114999 114420
54820 114420 114995 116169 116741 116318 115299 114024 112796 112277 112991 114580 116215 117459 118268 118555 118375 118199
54804 118199 118402 118764 118985 119385 120535 122414 124447 126127 127194 127508 127222 126860 126836 127074 127331 127532 127603 127431
54786 127431 127294 127810 129064 130278 130771 130795 131004 131581 132383 133446 134856 136444 138092 139989 142220 144539
54770 144539 146881 149619 152919 156477 160329 165301 171982 179722 187227 193728 198988 202690 204614 205123
54756 205123 204760 203561 201250 197848 193608 188616 182958 177037 171299 165891 160851 156284 152093 148040
54742 148040 144369 141764 140365 139507 138820 138756 139496 140249 140426 140670 141776 143301 144249 144591 145023 145716 146424
54725 146424 147523 149778 153251 157383 162013 167397 173352 179238 184646 189293 192488 193634 193085 191582
54711 191582 189040 184846 179223 173265 167619 162207 157272 153582 151261 149357 146969 144214 141746 139921
54697 139921 138682 137772 136893 135993 135350 135019 134437 133209 131932 131450 131481 130959 129716 128774 128807 129269 129369 129071
54679 129071 128659 128062 127171 126370 126199 126678 127202 127048 126001 124673 124065 124507 125302 125798 126380 127722 129434
54662 129434 130412 130381 130115 130109 130022 129606 129214 129010 128520 127442 126327 125983 126555 127453 127869 127289 125993 125082 125530
54643 125530 127144 128903 130220 131246 132077 132530 132744 133153 133680 133719 133105 132377 131923 131605 131401 131520 131695 131254
54625 131254 130283 129805 130352 131176 131335 130776 129888 128823 127849 127582 128107 128599 128510 128498 129372 130760 131711 132161 132823
54606 132823 133915 134889 135321 135262 134801 133982 133128 132629 132417 132172 131961 132114 132589 133026 133428 134126 134984 135248 134452
54587 134452 133055 131970 131739 132304 133291 134267 134856 134834 134174 133078 131959 131226 130909 130637 130230 130119 130858 132216
54569 132216 133165 132955 131985 131349 131596 132201 132364 132079 132093 132849 133874 134417 134360 134132 133964 133744 133533 133629 133960
54550 133960 133876 132894 131400 130387 130621 132141 134343 136401 137839 138830 139831 140930 141775 142139 142246 142471
54534 142471 143067 144209 145920 147782 149165 149960 150730 151844 152711 152300 150269 147363 144766 143231 142703 142575
54518 142575 142321 141892 141466 140980 140201 139221 138491 138306 138551 139037 139588 139696 138644 136364 133838 132226 131823
54501 131823 132104 132497 132735 132750 132708 133055 134093 135547 136874 137959 139119 140413 141379 141608 141297 140963 140800
54484 140800 140581 140168 139820 139906 140448 141144 141773 142370 143041 143822 144719 145653 146295 146329 146035 146235 147338 148762 149679
54465 149679 150010 150220 150372 150086 149425 149154 149852 151175 152229 152421 151824 150986 150493 150499 150641 150534 150265 150110 149969
54446 149969 149491 148706 148035 147674 147465 147401 147752 148524 149236 149406 148922 147877 146458 145116 144434 144582 145164 145648
54428 145648 145752 145449 145044 145127 146020 147254 148121 148641 149381 150395 151183 151797 153025 155084 157009 157886 157989
54411 157989 158079 158188 157814 156898 155846 154860 153894 153131 152929 153367 154261 155491 156910 158075 158522 158302 157989 158180
54393 158180 159111 160542 161823 162362 162227 162086 162385 162907 163316 163672 164080 164295 164081 163633 163175 162554 161737 161369
54375 161369 162151 163778 165106 165461 165301 165493 166353 167535 168572 169321 169990 170849 171949 173121 174202 175101
54359 175101 175740 176176 176767 177873 179377 180875 182401 184546 187699 191573 195588 199305 202326 204336 205529
54344 205529 206473 207209 206984 205231 202291 198744 194619 189890 185224 181464 178596 175916 173085 170366 167947
54329 167947 165697 163665 162252 161734 161904 162220 162108 161246 159906 158898 158814 159365 159772 159712 159593 159958 160869 161822
54311 161822 162076 161279 159944 159123 159363 160185 160827 161156 161568 162223 162765 162623 161391 159230 157140 156390 157269
54294 157269 158693 159463 159558 159762 160377 160896 160769 159975 158997 158540 159030 160023 160493 160098 159704 160153 161002 161219 160679
54275 160679 160134 159982 159994 160102 160519 161027 161049 160562 160190 160248 160418 160597 161340 163090 165490 167764 169433 170491
54257 170491 171290 172384 174013 175666 176564 176680 176764 177224 177554 177116 175988 174748 173814 173283 173069 172880 172358
54240 172358 171533 170854 170569 170295 169533 168410 167579 167460 167795 168053 168056 168047 168206 168308 168088 167715 167561 167568 167395 167154
54220 167154 167313 167701 167481 166618 166465 168052 170456 171925 172169 172360 173144 173942 174239 174307 174323 173906 173002 172291
54202 172291 172158 172032 171300 170194 169231 168401 167496 166750 166559 166928 167623 168463 169047 168665 167090 165153 163986
54185 163986 163872 164226 164464 164433 164231 164083 164338 165185 166355 167284 167517 166915 165699 164448 163745 163602 163537 163403
54167 163403 163792 165257 167372 168961 169161 168075 166505 165242 164498 163824 162711 161316 160397 160454 161212 162046
54151 162046 162613 162908 163107 163516 164319 165117 165088 163903 162235 161116 161066 162027 163760 165865 167748 168985 169658
54134 169658 170085 170438 170770 171102 171201 170660 169590 168867 169209 170247 170975 170953 170550 170167 169793 169380 169094 169062 169188
54115 169188 169339 169504 169773 170376 171671 173720 175898 177320 177781 177982 178712 180088 181722 183303 184733 185799
54099 185799 186110 185424 183950 182193 180529 179013 177589 176378 175606 175325 175403 175825 176794 178412 180369 182084
54083 182084 183154 183672 184187 185331 187360 190039 193101 196745 201412 207093 213248 219550 226324 233873 241637
54068 241637 248364 253017 255226 254984 252340 247507 241027 233635 226072 219018 213018 208301 204706 201900
54054 201900 199736 198356 197890 198088 198379 198381 198227 198286 198687 199300 200048 200964 202018 203250 205023 207737 211192
54037 211192 214645 217636 220444 223561 227125 231139 235826 241357 247392 253337 258923 264205 269130 273507
54023 273507 277333 280833 284165 287384 290623 293969 297199 300022 302560 305198 307840 309819 310800 311414 312571
54008 312571 314326 315871 316509 316174 314954 312607 308882 303998 298450 292474 286058 279367 272727 266171 259481
53993 259481 252836 247010 242547 239058 235717 232284 229187 226716 224663 222808 221233 219937 218523 216662
53979 216662 214672 213285 212832 212865 212629 211725 210281 208674 207226 206127 205428 204952 204374 203600 202996 203018 203543
53962 203543 203934 203841 203596 203597 203694 203588 203560 204275 205917 207919 209643 210996 212377 214278 216901 219926 222695
53945 222695 224840 226696 228879 231684 235195 239673 245203 251075 256213 260429 264725 270181 276972 284600
53931 284600 292615 300825 309272 318346 328644 340408 353321 367109 382097 398825 417072 435241
53919 435241 450558 460050 462031 457100 447640 436163 424207 412675 402551 394818 389856 387263 386283
53906 386283 386270 386795 387487 387923 387806 387265 386632 385766 383981 381077 378015 375901 374518 372674 369877 366722
53890 366722 363496 359520 354401 349055 344668 341121 337141 331787 325222 318273 311673 305626 299727 293460
53876 293460 286882 280582 274889 269675 265073 261716 259802 258551 257116 255496 253953 252122 249454 246221
53862 246221 243217 240679 238232 235795 233809 232562 231891 231566 231465 231355 230968 230292 229442 228306 226785 225211
53846 225211 224071 223399 222878 222419 222140 221890 221333 220479 219674 219149 219033 219608 220885 222064 222104 220964 219571
53829 219571 218535 217648 216809 216589 217321 218253 218233 216922 214842 212564 210443 208981 208774 209901 211756 213685
53813 213685 215534 217387 218956 219678 219533 219462 220533 222758 225151 227110 229261 232614 237263 242402 247382
53798 247382 252192 256964 261617 266047 270183 273706 276215 277933 279872 282943 287074 291421 295196 298043
53784 298043 299853 300641 300681 300472 300392 300437 300337 299867 298930 297359 294837 291168 286539 281322 275653 269522 263268
53767 263268 257613 253014 249284 246101 243569 241966 241151 240584 239801 238535 236559 233839 230825 228155 226061
53752 226061 224359 223020 222336 222381 222639 222426 221563 220511 219904 220041 220700 221387 221697 221501 220911 220207 219756 219711
53734 219711 219791 219588 219157 219009 219475 220482 221973 224024 226262 227788 228161 228088 228592 229846 231307 232648 233928
53717 233928 235082 235972 236812 237927 239183 240247 241324 242950 245175 247651 250489 254184 258523 262401 265013
53702 265013 266642 267974 269301 270737 272596 275103 278212 282060 286968 292555 297537 301165 304372 308641
53688 308641 313938 318670 321622 323065 323769 323776 322713 320756 318623 316812 315345 314153 313192 312180 310717
53673 310717 308898 307385 306581 306016 304953 303446 302309 302061 302288 302139 301134 299415 297591 296448 296395 296987
53657 296987 297297 296966 296525 296477 296546 296183 295414 294679 294176 293901 294076 294889 295942 296518 296405 295949 295350 294477 293468
53638 293468 292980 293588 295244 297445 299704 301800 303839 306092 308594 310947 312793 314330 316008 317869 319634
53623 319634 321344 323423 326054 328941 331736 334311 336642 338854 341393 344686 348589 352627 356795 361619
53609 361619 367309 373413 379484 385552 391702 397694 403416 409289 415808 422881 429961 436690 443147 449525
53595 449525 455703 461093 464839 466385 465901 464001 461134 457530 453636 450132 447337 444951 442564 440104
53581 440104 437618 434915 431751 428212 424699 421626 419173 417224 415502 413833 412256 410795 409293 407700
53567 407700 406299 405314 404443 403244 401905 401169 401400 402167 402800 403037 403044 403173 403733 404705 405646 406148 406328 406543
53549 406543 406839 407094 407544 408593 410207 412039 414039 416250 418130 418961 419104 419948 422278 425424 428430 431356
53533 431356 434894 439308 444409 450164 456766 464284 472684 481977 492051 502576 513379 524678 536684
53520 536684 549233 562044 575107 588614 602719 617526 633038 649085 665600 682979 701752
53509 701752 721957 743398 766485 792029 819973 849111 878408 907831 937370 966070 992880
53498 992880 1018037 1042801 1067930 1093005 1117119 1139790 1161202 1181925 1202418 1222691 1242616
53487 1242616 1262423 1282476 1302596 1322254 1341597 1361540 1382584 1404210 1425725 1446908 1467411
53476 1467411 1486493 1504046 1521080 1538308 1554878 1569372 1581464 1591594 1599556 1604559 1606474 1605872
53464 1605872 1602866 1596847 1587469 1575117 1560399 1543933 1526576 1509032 1491145 1472319 1452720 1433240
53452 1433240 1414183 1394760 1374204 1352664 1330681 1308400 1285740 1262877 1240114 1217509 1194981
53441 1194981 1172629 1150769 1129782 1110057 1091944 1075746 1061848 1050680 1042298 1036103 1031348 1027793
53429 1027793 1025528 1024347 1023802 1023884 1025106 1027817 1031844 1036910 1042982 1050120 1058415 1068256 1080317 1095005
53415 1095005 1112102 1131086 1151578 1173369 1196317 1220418 1245902 1273045 1301946 1332516 1364662
53404 1364662 1398430 1433935 1471099 1509567 1549117 1590182 1633652 1679995 1728883 1779829 1832842
53393 1832842 1888092 1945262 2003731 2063277 2124136 2186351 2249387 2312457 2375025 2436970 2498418
53382 2498418 2559367 2619408 2677789 2733733 2786536 2835517 2880298 2921224 2958995 2993685 3024521
53371 3024521 3050731 3072081 3088337 3098923 3103600 3102943 3097466 3086591 3068995 3043729 3010613 2969922
53359 2969922 2922295 2868766 2810449 2748398 2683952 2618730 2553905 2489918 2427189 2366440 2307872
53348 2307872 2250896 2195383 2142372 2092602 2045049 1998054 1951291 1905422 1860262 1814720 1768493
53337 1768493 1722558 1677993 1635427 1595579 1559134 1525867 1494925 1466086 1439819 1416105 1394295
53326 1394295 1374229 1356347 1340517 1325809 1311630 1298003 1284527 1270331 1255464 1241240 1228680
53315 1228680 1217535 1207178 1197389 1187907 1178475 1169878 1163771 1160731 1159509 1158881 1159146 1161048 1164466 1169277
53301 1169277 1176420 1186706 1199247 1212421 1225938 1240809 1257675 1276422 1297127 1320133 1345181
53290 1345181 1371555 1399135 1428419 1459436 1491491 1524045 1557009 1590013 1622096 1652371 1680430
53279 1680430 1705959 1728512 1747888 1764311 1777990 1788818 1796608 1801372 1803204 1801987 1797314 1788712
53267 1788712 1776201 1760624 1743052 1723741 1702097 1677854 1651672 1624235 1595400 1564854 1533112
53256 1533112 1501165 1469457 1437829 1406124 1374187 1341619 1308330 1275011 1242283 1209664 1176430
53245 1176430 1143361 1112408 1084384 1057959 1031369 1004195 976951 949848 922896 896741 872367
53234 872367 849901 828395 806999 785950 766202 748331 732082 716903 702641 689596 678038
53223 678038 667908 658949 650840 643084 635003 626071 616089 604944 592469 578773 564456 550184 536208
53210 536208 522545 509386 496952 485132 473683 462722 452672 443793 436048 429264 423108 417028
53198 417028 410630 404012 397386 390583 383411 376364 370281 365272 360549 355497 350330 345492 340965 336531
53184 336531 332337 328763 325889 323376 320731 317523 313592 309277 305287 302142 299917 298558 298116 298378 298658
53169 298658 298411 297904 297768 297855 297067 294534 290607 286503 283250 281240 280426 280378 280215 279111 277166 275388 274494
53152 274494 274047 273144 271622 270040 268674 267247 265749 264794 264816 265402 265844 265957 265904 265650 265171 264964 265630 266980
53134 266980 268110 268480 268406 268349 268244 267891 267614 268091 269643 271987 274562 276842 278409 279122 279309 279557 280142
53117 280142 280817 281247 281480 281732 281877 281545 280794 280353 280901 282295 283746 284591 284653 284036 282955 281713 280433
53100 280433 278804 276421 273438 270540 268221 266448 265117 264384 264304 264486 264405 263886 263111 262397 262092 262339 262754
53083 262754 262610 261590 260087 258602 257247 256135 255770 256467 257602 258068 257489 256554 256135 256451 257158 257853 258298
53066 258298 258352 257960 257214 256403 255902 255872 256022 255798 254921 253618 252278 251058 249885 248673 247470 246591 246585 247745
53048 247745 249585 251139 251898 252136 252252 252292 252310 252590 253116 253330 252875 252189 251857 251819 251733 251719 252036 252372 252238 251874
53028 251874 251942 252346 252206 251130 249818 249150 249211 249521 249762 250009 250548 251672 253402 255316 256916 258171 259350
53011 259350 260366 260826 260794 260994 261968 263451 264870 266098 267361 268646 269566 269773 269257 268268 267089 265950
52995 265950 265093 264788 265085 265555 265568 265025 264508 264456 264543 264279 263830 263666 263726 263723 264082 265575 267887 269605 270091 270502
52975 270502 272266 275242 278210 280669 283170 286008 288530 289983 290357 290145 289757 289505 289775 290779 292235
52960 292235 293597 294551 295093 295183 294636 293483 292207 291353 290893 290185 288693 286625 284711 283399 282383 280993
52944 280993 278947 276690 274955 274016 273484 272866 272130 271475 270751 269610 268265 267520 267771 268448 268849 269077 269591
52927 269591 270133 269864 268503 266682 265133 264089 263621 263924 264923 266036 266719 266978 267085 267042 266684 266170 266058
52910 266058 266779 268153 269408 269739 268936 267466 265876 264287 262608 261003 259766 258846 257931 257019 256526 256700
52894 256700 257320 258035 258709 259317 259833 260379 261236 262534 264124 265737 267044 267611 267223 266371 265956 266288 266649
52877 266649 266052 264208 261664 259314 257933 257792 258442 259093 259422 259818 260716 262060 263625 265553 268242 271850
52861 271850 276083 280238 283399 284998 285432 285780 286540 286990 286093 283715 280525 277057 273465 270010 267103
52846 267103 264738 262366 259541 256381 253276 250401 247640 244827 242005 239639 238498 238982 240443 241514
52832 241514 241307 240153 239012 238448 238429 238867 239892 241506 243285 244639 245229 245033 244203 243080 242197 241914 242029
52815 242029 242050 241878 241942 242515 243322 244068 245077 246948 249736 252876 255847 258476 260569 261700 261554 260201
52799 260201 257966 255317 252900 251300 250463 249612 247987 245628 243302 241801 241402 241792 242364 242617 242413 241867
52783 241867 241171 240654 240834 242000 243775 245438 246688 247748 248760 249607 250427 251689 253416 254877 255523 255827
52767 255827 256584 257663 258113 257475 256323 255381 254637 253642 252311 251035 250140 249572 249077 248474 247673 246626 245434
52750 245434 244450 244146 244730 245920 247185 248264 249423 251121 253437 255914 258033 259779 261547 263507 265340
52735 265340 266744 267868 268876 269361 268846 267846 267693 269012 271020 272705 274015 275274 276147 276145 275842 276447
52719 276447 278077 279394 279198 277619 275454 273086 270532 268018 265970 264604 263813 263263 262542 261566 260806 260707
52703 260707 260864 260391 259195 258185 258034 258481 259224 260653 263039 265617 267317 268067 268651 269522 270471 271320 272198
52686 272198 273053 273468 273238 272749 272610 273044 273747 274221 274199 273788 273211 272486 271568 270640 269941 269326 268454 267432 266772
52667 266772 266539 266154 265299 264471 264237 264449 264589 264450 264026 263225 262201 261618 261991 263083 264382 265798 267437
52650 267437 269138 270828 272918 275600 278111 279497 279869 280090 280390 280175 279216 278141 277574 277488 277633 277901 277992
52633 277992 277306 275618 273556 272147 272066 273343 275473 277676 279367 280552 281594 282594 283230 283071 281804
52618 281804 279355 276241 273663 272690 273243 274285 274947 275040 274596 273581 272200 270933 270106 269836 270429 272235
52602 272235 274873 277177 278246 278226 277820 277438 277162 277098 277344 277743 278027 278198 278550 279299 280267 280971 281109 281056 281659
52583 281659 283314 285412 286960 287575 287601 287510 287679 288467 289868 291191 291717 291651 291734 291965 291559 290297 289022 288445
52565 288445 288210 287623 286614 285412 283914 282120 280690 280290 280565 280519 279794 278956 278531 278335 277862 276921 275778
52548 275778 274942 274873 275636 276829 278005 279093 280218 281271 281962 282237 282245 281862 280626 278374 275794 274053 273852
52531 273852 274860 276109 276865 277051 276928 276633 276215 275867 275800 275973 276291 276999 278491 280639 282678 283950 284478
52514 284478 284737 285206 286331 288510 291789 295710 299723 303665 307656 311682 315371 318130 319425 319170 317821
52499 317821 315918 313528 310417 306690 302831 299164 295825 293358 292524 293131 293645 292603 290085 287317 285217
52484 285217 283879 283132 282879 282914 283022 283310 284079 285388 287023 288747 290259 291113 291163 290878 290767 290713 290450 290496
52466 290496 291810 294512 297688 300622 303490 306592 309616 312164 314430 316831 319242 321035 321584 320423
52452 320423 317338 312860 308299 304662 301647 298321 294623 291492 289405 287584 285123 282400 280725 280751 281731
52437 281731 282384 282059 280946 279491 277916 276201 274266 272179 270296 269200 269310 270457 271928 273074 273796
52422 273796 274411 275118 275813 276407 277123 278312 280071 282168 284301 286299 288121 289802 291435 293133 295035
52407 295035 297393 300611 305039 310770 317806 326380 336810 348871 361526 373373 383138 389697 392108
52394 392108 390183 384906 377795 369832 361334 352706 344687 337712 331587 326073 321380 317762 315037 312925
52380 312925 311588 311428 312516 314506 316927 319294 321269 323088 325570 329282 333862 338585 343308 348355
52366 348355 353667 358682 362940 366198 368084 368339 367469 366460 365679 364649 363036 361200 359558 358089 356831
52351 356831 356239 356587 357551 358819 360590 362955 365252 366727 367587 368779 370846 373480 376109 378468 380628
52336 380628 382835 385315 388051 390907 394159 398533 404392 411234 418412 426033 434681 444614 455778 468234
52322 468234 481778 495439 508278 520654 533758 547723 561194 573136 584234 595931 608776
52311 608776 622425 636728 651998 668365 685586 703431 721809 740545 759476 778664 798131
52300 798131 817495 836349 854882 873574 892269 910088 926380 941196 954551 965779 974098 979524
52288 979524 982693 983964 983249 980716 977157 973377 969532 965303 960581 955684 950964 946411 941751 936871
52274 936871 932086 928005 925167 923771 923709 924731 926562 929049 932366 937019 943393 951225 959746 968377 977117
52259 977117 986202 995707 1005747 1016864 1029769 1044663 1061025 1078131 1095541 1113006 1130124 1146296
52247 1146296 1161030 1174169 1185790 1195892 1204213 1210454 1214707 1217517 1219447 1220691 1221186 1220885 1219705
52234 1219705 1217436 1214006 1209794 1205347 1200798 1195859 1190369 1184467 1178171 1171233 1163669 1156146 1149494 1143980
52220 1143980 1139246 1134878 1130802 1127222 1124359 1122215 1120573 1119343 1118886 1119719 1121784 1124330 1126796 1129524
52206 1129524 1133231 1138010 1143291 1148678 1154236 1159883 1165062 1169437 1173618 1178719 1185251 1192779 1200642 1208720
52192 1208720 1217391 1227007 1237521 1248425 1258803 1267599 1274131 1278460 1281156 1282646 1282830 1281280 1277728
52179 1277728 1272425 1266103 1259466 1252517 1244494 1234791 1223915 1213258 1203862 1195713 1188235 1181023 1173980
52166 1173980 1167257 1161359 1156970 1154265 1152659 1151548 1151000 1151408 1152826 1155076 1158041 1161252 1163590 1164216 1163685
52151 1163685 1163300 1163401 1163088 1161670 1159534 1157384 1155561 1154463 1154787 1156646 1159037 1160882 1162203 1163611 1164970
52136 1164970 1165250 1163722 1160699 1157139 1153889 1151407 1149856 1149313 1149959 1152096 1155983 1161811 1169893 1180610
52122 1180610 1194029 1209731 1227128 1245794 1265469 1286050 1307603 1330032 1352657 1374481 1395003
52111 1395003 1414374 1432700 1449782 1465831 1481813 1498585 1516041 1533506 1550665 1567675 1584732
52100 1584732 1601978 1619574 1637409 1654880 1671291 1686231 1699329 1709990 1717676 1722041 1722440 1717881
52088 1717881 1708128 1694489 1678851 1662245 1644992 1627903 1612333 1598958 1587226 1576205 1565445
52077 1565445 1554973 1544996 1535830 1527706 1520555 1514235 1508995 1505407 1503913 1504672 1507657 1512534 1518720 1526030
52063 1526030 1535011 1546035 1558283 1570336 1581716 1593151 1605293 1617984 1630897 1644175 1658043
52052 1658043 1672231 1686088 1698910 1710003 1718790 1724999 1728455 1728715 1725427 1719058 1710746 1701263 1690605
52039 1690605 1678698 1665978 1653079 1640371 1627946 1615602 1602766 1588979 1574634 1560735 1547692
52028 1547692 1534906 1521716 1508129 1494300 1479989 1465030 1449859 1435027 1420532 1406099 1391783
52017 1391783 1377835 1364327 1351356 1339387 1328891 1319813 1311804 1304737 1298520 1292577 1286049 1278473 1269849
52004 1269849 1260047 1248545 1234743 1218232 1198805 1176689 1152956 1129341 1107256 1086914 1067581
51993 1067581 1048687 1030564 1013932 998783 984118 968939 953140 937028 920308 902221 882710
51982 882710 862771 843341 824358 805275 786085 767386 749621 732707 716312 700258 684740
51971 684740 670373 657947 647996 640719 636293 634897 636224 639364 643505 648599 654962 662336 669611 675499
51957 675499 679355 681407 682230 681864 679465 674109 665927 656160 646149 636743 628733 623083 620264 619868 621382
51942 621382 624949 630913 639029 648801 660295 673871 689180 705051 720363 734482 746869 756964
51930 756964 764642 770220 773695 774330 771250 764236 753720 740334 724684 707506 689765 672549 656740
51917 656740 642681 630252 619516 611198 606294 605283 608048 614542 625034 639500 657014 675955
51905 675955 694549 711082 723937 731849 734273 731453 724273 714112 702470 690247 677227 662497
51893 662497 645474 626468 606289 585632 565049 545259 527101 511127 497465 486155 477378 471246
51881 471246 467637 466436 467739 471600 477770 485963 496175 508363 521909 535831 549441 562368 573924
51868 573924 583030 588904 591361 590282 585436 577266 567336 557430 548402 540304 533267 527606 523242 519733
51854 519733 517045 515781 516392 518450 520852 522532 522879 521753 519359 516013 511897 507010 501334 495004 488338
51839 488338 481809 475940 471049 467090 463808 461025 458696 456806 455380 454607 454797 456116 458447 461482 464874
51824 464874 468206 470851 471993 471060 468264 464642 461345 458924 457368 456621 456718 457519 458729 460259 462225
51809 462225 464492 466578 468044 468607 467900 465661 462349 458924 455720 452144 447950 444187 442184 442012 442666
51794 442666 443436 444278 444984 444986 444201 443369 443173 443464 443573 443076 442059 440948 440202 439882 439379 437844 435050 431647
51776 431647 428602 426629 426046 426794 428552 431180 435133 441048 448925 458099 468021 478572 489490 500008
51762 500008 509345 517170 523324 527467 529312 528885 526281 521473 514704 506860 499047 491905 485503 479639
51748 479639 473953 467974 461528 455113 449576 445360 442229 439692 437575 436235 436345 438383 442206 447187
51734 447187 452803 458938 465524 472141 478185 483281 487366 490462 492489 493178 492140 489404 486052 483890
51720 483890 484006 485865 488098 489819 490707 490274 488089 484743 481696 479771 478397 476655 474463 472330 470545
51705 470545 469171 468386 468185 468170 468272 469321 471993 475360 477436 477324 476024 474959 474593 474835 475882 477939
51689 477939 480654 483490 486249 488568 489424 487926 484348 479627 474149 467874 461438 456050 452145 449055
51675 449055 446279 444185 443042 442187 440792 438932 437342 436565 436812 438230 440789 444253 448731 454815 462605
51660 462605 471033 478782 485505 491345 495612 496973 495139 491566 488251 486456 486726 489380 494458 501600
51646 501600 510416 520649 531536 541321 547872 549745 546471 538142 525324 509431 492628 476865 462929
51633 462929 450501 439142 429072 421016 415464 412259 410873 410855 411881 413537 415301 416783 417902 418812
51619 418812 419682 420503 421072 421181 420830 420195 419413 418527 417653 417033 416876 417167 417555 417317 415719 412813 409820 408181
51601 408181 408170 408896 409782 411354 414262 418188 422368 426761 432059 438800 447070 456792 467576 478287 487377
51586 487377 493715 496750 496095 491667 484327 475792 467729 461261 457200 456124 458058 462665 469931 480174
51572 480174 493253 508328 524649 542083 560618 579934 599825 620547 642243 664408 686522
51561 686522 709072 733453 760959 792271 827806 867998 912875 961540 1012134 1062167 1108767
51550 1108767 1148809 1179174 1197352 1202159 1194035 1174552 1145522 1108468 1064765 1016041 964294 911636
51538 911636 859897 810452 764309 722214 684539 651219 622165 597661 577934 562232 548937
51527 548937 536952 526457 517854 510581 503742 497429 492397 488515 484659 480407 476909 475546 476355 478239
51513 478239 480227 482028 483725 485473 487366 489282 490898 491884 491802 489828 485181 478153 470277 463155 457405
51498 457405 452909 449480 446869 444588 442336 440355 438906 437641 435969 433821 431579 429452 427430 425683
51484 425683 424456 423534 422344 420661 418745 416666 413962 410266 406005 402155 399386 397669 396633 396037 395737
51469 395737 395406 394593 393124 391209 389035 386525 383748 381315 379913 379499 379392 379133 378826 378594 378274 377896
51453 377896 377976 378943 380590 382429 384372 386750 389844 393759 398601 404521 411613 419916 429478 440274 452134
51438 452134 464744 477491 489305 498951 505744 509796 511577 511519 510110 507948 505346 501952 496955 489600
51424 489600 479697 467972 455920 444914 435396 427212 420593 416157 413918 413004 412641 412814 413680 414988
51410 414988 416510 418493 421223 424563 428250 432124 435725 438369 440100 441907 444451 447258 449826 452706
51396 452706 456541 460679 463928 466295 468810 471883 475079 478538 483370 490376 499375 510157 523261 539436
51382 539436 559173 583156 612534 648198 690236 738368 792401 851949 916140 983902 1054023
51371 1054023 1124544 1192386 1253846 1305259 1343258 1365167 1369808 1357828 1331108 1291977 1242877
51360 1242877 1186106 1123615 1057362 989930 924192 862028 803854 749695 700281 656767 619768
51349 619768 589079 563961 543354 526106 511440 499047 488540 479148 470220 461719 453877 446687
51337 446687 440093 434267 429197 424224 418662 412862 408143 405409 404109 402758 400368 397257 394463 392508
51323 392508 390918 389010 386811 384781 382839 380367 377330 374783 373828 374499 376073 378102 380633 383704 387238
51308 387238 391360 396331 402111 408261 414244 419548 423677 426345 427664 427836 426810 424577 421525 418001
51294 418001 413643 407855 401038 394616 389496 385066 380317 375534 372148 370980 371297 371795 372016 372463 373732
51279 373732 376021 379369 383836 389284 395207 400941 405906 409627 411819 412663 412771 412591 412044 410981 409841
51264 409841 409515 410617 413184 416937 421370 425601 428688 430390 431225 431549 430981 429060 426124 423070 420437
51249 420437 418166 416107 414175 412041 409273 406073 403446 402215 402071 401916 401059 399755 398648 398026 397658
51234 397658 397080 395867 393875 391452 389213 387405 385684 383816 382362 382108 382809 383102 382021 380159 378903
51219 378903 378836 379427 380058 380731 381715 383055 384638 386394 388283 390381 393104 396966 401930 407246 412131 416399
51203 416399 420307 424060 427703 431258 434647 437563 439642 440720 440873 440348 439496 438583 437497 435869 433575
51188 433575 430906 428095 425003 421577 418428 416487 416062 416504 416847 416648 416207 416177 416955 418319 419541 419921
51172 419921 419268 417984 416785 416318 416790 417806 418676 418971 418736 418145 417191 415862 414449 413496 413494 414678 416949
51155 416949 419843 422709 425056 426707 427617 427843 427794 428110 428987 429877 430195 430085 429994 429695 428372 425728 422434
51138 422434 419269 416279 413190 410214 407877 406170 404468 402477 400815 400258 400608 400823 400361 399983 400896 403338
51122 403338 406427 409326 412046 415017 418324 421671 424768 427379 429293 430713 432500 435528 439756 444262
51108 444262 448182 451260 453597 455467 457475 460285 463800 467030 469118 470231 471047 471720 471891 471548 471285
51093 471285 471560 472139 472323 471479 469293 466002 462502 459837 458309 457303 456172 454992 454179 453728 453270 452700
51077 452700 452261 452015 451658 450961 450078 449342 449073 449667 451477 454393 457811 461235 464661 468200 471702 475261
51061 475261 479843 486797 496556 508190 520472 533138 546918 562455 579370 596239 611381 623878
51049 623878 634228 644145 655559 669547 685991 704011 722444 739916 754820 765698 771830 773353
51037 773353 770743 764384 754702 742482 728726 714325 700027 686520 674096 662237 649962 636695
51025 636695 622599 608138 593802 580372 568936 560258 554408 551193 550623 552659 556859 562627 569560
51012 569560 577299 585418 593838 602943 612750 622320 630625 637838 645134 653328 662362 672058 682610 694147
50998 694147 706434 719203 732279 745210 757256 767969 777357 785350 791650 796305 799876 802671 804312
50985 804312 804418 803292 801521 799333 796866 794739 793812 794522 797045 801955 810125 821776 835979 851240
50971 851240 866434 881286 896330 912671 931618 954319 981530 1013517 1050046 1090593 1134826
50960 1134826 1182945 1235391 1292086 1351983 1413554 1475844 1538875 1602707 1666112 1726651 1782306
50949 1782306 1832635 1878025 1918398 1953409 1983591 2010264 2034207 2055333 2074047 2092124 2111589
50938 2111589 2133123 2155886 2178319 2198643 2215128 2226766 2233702 2236598 2235704 2230771 2221498 2207617
50926 2207617 2188793 2164901 2136165 2102571 2063389 2017780 1965698 1907797 1844859 1778004 1709228
50915 1709228 1640816 1574025 1508983 1445995 1386311 1331287 1281328 1236076 1195234 1158695 1126033
50904 1126033 1096360 1068859 1043254 1019641 997962 977810 958802 941043 924942 910552 897332
50893 897332 884748 872928 862543 854151 847850 843385 840324 838184 836628 835577 835063 835067 835589 836669 838275
50878 838275 840357 843142 847097 852425 858844 865975 873629 881575 889576 898005 907908 919942 933643 948282
50864 948282 963976 981201 999628 1018475 1038058 1060030 1085764 1115178 1147461 1182359 1220442
50853 1220442 1262640 1309976 1363389 1423445 1490383 1564562 1646536 1736574 1834438 1939870 2052907
50842 2052907 2173520 2301257 2435434 2575216 2719063 2864304 3007643 3146043 3276993
50833 3276993 3398195 3507305 3602045 3680541 3741870 3786557 3816418 3833781 3840930 3840367 3835304 3829563
50821 3829563 3826937 3830529 3842273 3862704 3891141 3926167 3965775 4006901 4045091 4074986 4091387 4090044
50809 4090044 4067931 4023363 3956154 3867538 3759616 3634575 3494349 3341127 3178138 3009707
50799 3009707 2840395 2674208 2514577 2364492 2226077 2100243 1987277 1887645 1801693 1728720
50789 1728720 1667087 1615412 1573068 1539356 1512918 1492387 1477092 1466620 1460041 1456009 1453286 1450726
50777 1450726 1447149 1441873 1435260 1428109 1420492 1411633 1400912 1388501 1374897 1360277 1344555 1327774
50765 1327774 1310125 1291628 1271987 1250880 1228476 1205682 1183681 1163011 1143211 1123657 1104689
50754 1104689 1087585 1073386 1062086 1053110 1046200 1041462 1038779 1037704 1038067 1040319 1045041 1052374 1062196
50741 1062196 1074711 1090472 1109879 1133060 1160372 1192630 1230510 1273952 1322425 1375591 1433365
50730 1433365 1495378 1560789 1628659 1698280 1769136 1840815 1913021 1985394 2057236 2127623 2195856
50719 2195856 2261576 2324298 2382958 2435906 2481153 2516658 2540765 2552755 2552995 2542647 2523489 2498066
50707 2498066 2469704 2441987 2418090 2400443 2390672 2389534 2396893 2411873 2433071 2458654 2486308 2513130
50695 2513130 2535651 2550315 2554298 2545895 2523988 2487403 2435269 2368125 2288363 2199515 2105388 2009787
50683 2009787 1916301 1827726 1745616 1670655 1603432 1544807 1495656 1456331 1426311 1404436 1389727
50672 1389727 1382086 1381996 1389562 1404080 1424539 1450086 1479766 1512120 1545364 1577955 1608922 1637796
50660 1637796 1664285 1687903 1708014 1724536 1738494 1751445 1764237 1776778 1788978 1801299 1814180
50649 1814180 1827647 1841908 1857714 1875525 1894899 1915541 1938637 1966254 1999551 2038394 2082670
50638 2082670 2132905 2189150 2250118 2314105 2380241 2448029 2515902 2581211 2641995 2698302 2751483
50627 2751483 2802527 2851473 2898167 2942846 2985594 3025264 3058861 3081655 3087903 3072479 3033201
50616 3033201 2972438 2896564 2813617 2730991 2654369 2587604 2532982 2491613 2463674 2448193 2442943
50605 2442943 2445152 2452504 2463116 2474541 2483437 2486554 2481555 2466709 2440387 2401546 2350436 2288406
50593 2288406 2217338 2139748 2059012 1978515 1900288 1824843 1752393 1683829 1620405 1562826 1510859
50582 1510859 1463598 1420056 1379687 1342470 1308448 1277253 1248229 1220985 1195715 1173070 1153873
50571 1153873 1138768 1127884 1120789 1116870 1115710 1117098 1120988 1127572 1137047 1148968 1162166 1175794 1190342
50558 1190342 1207190 1227291 1250689 1277155 1306597 1338692 1372644 1407666 1443500 1480232 1517720
50547 1517720 1555281 1591843 1626385 1658385 1687883 1715103 1740269 1764023 1787791 1813299 1841807
50536 1841807 1874173 1911449 1954801 2004738 2061076 2123991 2194637 2274331 2363427 2461377 2567802
50525 2567802 2683192 2808611 2944801 3091364 3246576 3408010 3573384 3740558 3906709
50516 3906709 4068001 4220439 4360811 4486428 4594275 4681103 4744389 4782702 4795017 4780293
50506 4780293 4738239 4670210 4578922 4467389 4338712 4196966 4047762 3897447 3751785 3615476
50496 3615476 3492630 3387166 3302539 3241159 3204073 3191038 3200848 3231653 3280881 3344714 3417692
50485 3417692 3493037 3563415 3621379 3659566 3671394 3652369 3601041 3518949 3409871 3278966 3131993
50474 3131993 2974744 2812839 2651551 2495223 2346634 2207246 2078108 1960172 1853729
50465 1853729 1758213 1672970 1597758 1532125 1474756 1424071 1379356 1340858 1308902 1283328 1263654
50454 1263654 1249316 1239658 1233877 1230932 1229446 1228144 1226740 1226017 1226580 1227859 1228995 1230410 1233707 1239990
50440 1239990 1249009 1259981 1272502 1286334 1300879 1315282 1328765 1340686 1350672 1358985 1366455 1373779
50428 1373779 1381063 1388191 1395392 1403282 1412442 1423051 1434706 1446710 1458846 1471832 1486596 1503166
50416 1503166 1520914 1540066 1562322 1589583 1622533 1660936 1704858 1755010 1812033 1876000 1946540
50405 1946540 2022907 2103839 2187780 2273393 2359604 2445023 2527567 2604854 2674887 2736268 2787842
50394 2787842 2828347 2856345 2870318 2868758 2850390 2814701 2762440 2695530 2616473 2528030 2433451
50383 2433451 2336612 2241450 2151244 2068513 1995331 1933397 1883887 1847576 1824971 1815986 1819585 1834149
50371 1834149 1858091 1889565 1925588 1962049 1994827 2020530 2036113 2038562 2025708 1997266 1954791
50360 1954791 1900689 1837503 1767878 1694668 1620704 1548337 1479074 1413621 1352262 1295164 1242307
50349 1242307 1193364 1148010 1106267 1068306 1034092 1003647 977565 956667 941035 929925 922801
50338 922801 919932 921618 927306 935894 946648 959372 973770 988809 1002549 1012529 1016742 1014682 1007363
50325 1007363 996274 982628 967727 953375 941285 932231 926242 923386 923854 927294 932611 938604 944645
50312 944645 950696 956907 963221 969262 974607 979192 983308 987172 990756 994122 997565 1001258 1005075 1009024
50298 1009024 1013417 1018255 1022872 1026805 1030781 1036179 1043572 1052354 1061825 1071983 1083125 1095238 1108173
50285 1108173 1122011 1136672 1151074 1162810 1168813 1166717 1156159 1139151 1119133 1099445 1082402 1069288
50273 1069288 1060627 1056303 1055828 1058764 1064821 1073413 1083331 1093123 1101834 1109322 1115871 1121640 1126474 1130170
50259 1130170 1132730 1134281 1134835 1134411 1133392 1132468 1132022 1131827 1131588 1131647 1132845 1135770 1140456 1146807 1155007 1165503
50243 1165503 1178827 1195529 1215944 1239829 1266328 1294468 1323650 1353577 1383840 1413728 1442541
50232 1442541 1470113 1496953 1523651 1549950 1574462 1595365 1611218 1620958 1623442 1617632 1603371 1581589
50220 1581589 1553577 1520461 1483670 1445501 1408578 1374639 1344158 1317067 1293370 1272818 1254306
50209 1254306 1235929 1215604 1191647 1163146 1130374 1094929 1059115 1024855 993141 964385 938901
50198 938901 916812 897693 880696 865171 851107 838885 828631 819829 811630 803639 796319 790400
50186 790400 785841 781609 776619 770732 764716 759482 755504 752717 750572 748332 745603 742546 739446 736312
50172 736312 733196 730555 728813 727677 726436 724958 723876 723698 724245 725081 726038 727061 727924 728515 729213 730720
50156 730720 733499 737433 741974 746682 751698 757548 764319 771382 778242 785309 793147 801143 807655 811541
50142 811541 812896 812386 810696 808873 808186 809182 811497 815045 820730 829556 841771 857518 877654 903190
50128 903190 934345 970802 1012421 1058967 1109471 1162597 1217366 1272972 1328276 1382300 1435047
50117 1435047 1487167 1539050 1590902 1643237 1696299 1748933 1798740 1843236 1880155 1906936 1921155
50106 1921155 1921838 1909606 1885340 1849481 1802907 1747719 1686649 1622117 1556211 1491046 1428600 1370290
50094 1370290 1316814 1268189 1223918 1183571 1147301 1115475 1087801 1063259 1041009 1020906 1003082
50083 1003082 987553 974399 963782 955547 949165 944327 941207 940011 940642 942988 947084 952757 959490
50070 959490 966860 974774 983093 991375 999210 1006477 1013061 1018649 1022992 1026047 1027694 1027651 1025877 1022751 1018710
50055 1018710 1014012 1008891 1003508 997630 990880 983541 976653 970940 966006 960900 955189 949216 943776 939882
50041 939882 938490 939909 943608 948898 955658 964128 974194 985291 996995 1009542 1023662 1039848 1057597
50028 1057597 1075482 1092264 1107903 1123134 1138136 1152177 1164500 1174882 1183140 1188865 1192079 1193575
50016 1193575 1194148 1193957 1193015 1191711 1190292 1188394 1185861 1183690 1183566 1186662 1193456 1204353 1219722 1239336
50002 1239336 1262366 1287866 1314916 1342598 1370486 1398991 1428587 1458864 1489009 1519002 1549295
49991 1549295 1579028 1605374 1625075 1636086 1637364 1627753 1605977 1571740 1526360 1472246 1412008 1348134
49979 1348134 1283209 1220048 1161229 1108310 1061484 1020165 983909 952686 926401 904432 885818
49968 885818 869766 855848 843682 832623 822009 811793 802712 795532 790225 786227 783383 782125 782661
49955 782661 784618 787778 792625 799738 809009 819914 832186 845611 859409 872323 883283 891649 897123
49942 897123 899982 901198 901656 901219 899018 894562 888019 879522 868852 855922 840992 824253 805759
49929 805759 785998 766039 746797 728486 711078 695003 681071 669819 661105 654272 648682 644246
49917 644246 641406 640490 641170 642806 645179 648490 652666 657112 661252 665079 669174 674421 681600 690854 701615
49902 701615 713382 726445 741314 757585 773987 789576 804222 817874 830106 840617 849427 856166
49890 856166 859845 859844 856575 850664 842018 830354 816163 800423 783609 765784 747513 729947 713897
49877 713897 699312 685767 673029 661077 649972 639894 631063 623568 617430 612797 609849 608591 608882
49864 608882 610535 613178 616254 619589 623792 629659 637254 646031 655831 667173 680468 695432 711470
49851 711470 728161 745009 761058 775206 786821 795867 802553 807103 809695 810351 808855 804906 798369
49838 798369 789310 777930 764634 750097 735108 720318 706206 693229 681923 672818 666259 662230
49826 662230 660296 659803 660270 661651 664200 668114 673321 679578 686767 695151 705344 717846 732408 747861
49812 747861 762743 776204 788284 799282 809017 816903 822698 826907 830214 832660 833571 832268 828570
49799 828570 822633 814673 805039 794337 783133 771692 760274 749502 739939 731234 722168 711923 701059
49786 701059 690955 682503 675720 670452 666893 665205 665017 665622 666483 667288 667781 667983 668498 670182 673355 677695
49770 677695 682997 689623 697937 707593 717775 727897 737640 746463 753643 758852 762292 764237 764890 764759
49756 764759 764495 763927 761729 756533 748188 737514 725123 711176 696167 681238 667435 655138 644473
49743 644473 635763 629184 624234 620038 616187 612921 610485 608633 606900 605176 603798 603112 603160 603883 605502
49728 605502 608443 612830 618223 624015 629977 636304 643296 651258 660591 671622 684274 698102 712685
49715 712685 727707 742628 756598 768842 778869 786204 790242 790621 787486 781205 772117 760835 748461
49702 748461 736019 723848 711920 700699 691182 684054 679119 675571 672476 669054 665002 660799 657373
49689 657373 655347 654725 655342 657229 660453 664930 670532 677097 684238 691547 699187 707948 718531 731060
49675 731060 745438 761666 779562 798625 818463 838740 858129 874043 884332 889033 889680 887272
49663 887272 882104 875483 870054 867655 867734 868608 869455 870124 869649 866214 858631 846985 831797 813490 792938
49648 792938 771820 751877 734149 719117 707076 697908 690875 685146 680517 677308 675723 675626 676796
49635 676796 678965 681590 683929 685469 686039 685491 683531 679982 675000 668939 662206 655304 648695 642424 636230
49620 636230 630325 625738 623353 622758 622574 621872 620765 619640 618531 617560 617232 617741 618458 618722 618895 619946
49604 619946 622141 624708 626752 627949 628426 628545 628844 629657 630664 631303 631615 632194 633254 634382 635317 636304
49588 636304 637484 638635 639769 641292 643163 644612 645234 645665 646591 647728 648606 649756 652137 655672 659338
49573 659338 662602 665859 669488 673393 677596 682470 688244 694946 702935 712716 724021 735864 747748
49560 747748 760015 772626 784381 793896 800663 804597 805221 802235 796543 789841 783174 776512 769699 763193
49546 763193 757772 753875 751432 750063 749395 749309 749845 750808 751649 751952 751837 751687 751684 751911 752629 754129 756467 759774
49528 759774 764663 771877 781558 793259 806678 822061 839847 860250 883114 907783 932946 956925
49516 956925 978146 995197 1006748 1012144 1012316 1009617 1006446 1004269 1003918 1006056 1010663 1016403 1021247 1023736
49502 1023736 1023224 1018975 1009896 995646 977569 957933 938235 918661 899173 880564 864114 850475
49490 850475 839369 830298 823127 817794 813825 810482 807293 804234 801497 799351 798177 798296 799553 801253
49476 801253 802669 803611 804462 805776 807836 810419 812877 814629 815814 817388 820291 824506 829173 833688 838357
49461 838357 843709 849438 854449 857905 859810 860482 859968 858326 856074 853800 851367 847994 843143 836992 830031
49446 830031 822639 815164 808002 801312 794961 788987 783882 780146 777788 776489 776018 776251 777075 778693 781786
49431 781786 786910 793836 801951 811248 822431 835984 851620 868790 887274 907003 927668 948893
49419 948893 970571 992579 1013970 1032518 1045239 1049774 1045885 1035915 1023552 1011841 1002268 995440
49407 995440 991978 992297 995945 1001799 1008948 1016992 1025565 1034135 1042545 1051426 1061692 1073658 1086727 1099805
49393 1099805 1111955 1122881 1132970 1142760 1152225 1160694 1167558 1172754 1176225 1177188 1174518 1167948 1158387
49380 1158387 1146846 1133585 1118716 1103175 1088364 1074901 1062384 1050527 1040050 1032180 1027700 1026687
49368 1026687 1028759 1033216 1039214 1046241 1054194 1062715 1070767 1077280 1081941 1084819 1085527 1083465 1078854 1072697
49354 1072697 1065586 1057333 1048079 1038991 1031237 1024821 1019087 1013965 1009966 1007182 1005130 1003606 1002969 1003351
49340 1003351 1004146 1004565 1004263 1003139 1000877 997064 991696 985308 978696 972543 967193 962680 959069 956694 955860
49325 955860 956369 957658 959429 961833 964992 968737 972901 977501 982482 987687 993291 999817 1007432 1015606
49311 1015606 1023811 1032201 1041267 1051233 1062254 1074860 1089575 1106355 1124889 1145134 1166837 1188739
49299 1188739 1209077 1226773 1241357 1251737 1256204 1254038 1246319 1234722 1220276 1203764 1186406 1169258
49287 1169258 1152421 1135726 1119885 1106113 1094735 1084956 1075972 1067617 1059919 1052828 1046634 1042090 1039754
49274 1039754 1039466 1040540 1042244 1044085 1045999 1048316 1051226 1054291 1056827 1058647 1059973 1060716 1060559 1059822 1059513
49259 1059513 1060237 1061648 1063388 1066023 1070611 1077892 1088454 1103145 1122434 1145355 1169718 1193348 1214552
49246 1214552 1231459 1241762 1243699 1237028 1222709 1201939 1175889 1146279 1115639 1086613 1060955 1039215
49234 1039215 1021250 1006821 995749 987852 983002 981217 982477 986456 992594 1000369 1009328 1018941 1028767
49221 1028767 1038838 1049621 1061457 1074269 1087739 1101423 1114573 1126318 1136399 1145377 1153747 1161077
49209 1161077 1166531 1170090 1172787 1175747 1179480 1184214 1190489 1199069 1210346 1224020 1239353 1255671 1272678
49196 1272678 1290334 1308470 1326575 1344023 1360386 1375469 1389164 1401424 1412272 1421652 1429384 1435475
49184 1435475 1440388 1444797 1449107 1453454 1458094 1463573 1470553 1479773 1492261 1509272 1531856 1560563 1595653
49171 1595653 1637407 1686034 1741301 1802194 1866707 1931634 1992555 2044331 2082261 2103603 2108636
49160 2108636 2100590 2084395 2065077 2046588 2031277 2019806 2011429 2004692 1998201 1991175 1983622 1976181 1969633
49147 1969633 1964373 1960435 1958026 1957742 1960040 1964738 1971359 1979817 1990348 2002824 2016511 2030603 2044749
49134 2044749 2059067 2073911 2089693 2106601 2124347 2142344 2160167 2177737 2195153 2212644 2230613
49123 2230613 2249289 2268256 2286752 2304597 2322505 2341292 2361164 2382010 2403969 2427300 2452094
49112 2452094 2478794 2508996 2545288 2590140 2645104 2710963 2788219 2877450 2979249 3093272 3216313
49101 3216313 3341327 3459938 3567495 3665647 3758617 3845956 3918912 3964199 3971820 3940516 3877640
49090 3877640 3794763 3702264 3605694 3505624 3400778 3291854 3182843 3079300 2985861 2905160
49080 2905160 2838024 2783765 2740500 2706035 2678818 2657945 2642316 2630180 2619727 2609954 2600760 2592227
49068 2592227 2583930 2575067 2565269 2555116 2545611 2537136 2529158 2521006 2512562 2503991 2495204 2486052 2476840 2468184
49054 2468184 2460397 2453434 2447365 2442355 2438139 2434048 2429879 2426268 2423868 2422501 2421603 2421356 2422820 2426895
49040 2426895 2433573 2442476 2453707 2467618 2483642 2499806 2513808 2524527 2532315 2538064 2542451 2546082
49028 2546082 2549672 2553635 2557856 2562196 2566853 2571709 2575689 2577497 2577004 2575279 2573266 2571077 2568727 2566778
49014 2566778 2565811 2565718 2566013 2566564 2567637 2569461 2572160 2575968 2581144 2587678 2595313 2603762 2612731 2621944 2631376
48999 2631376 2641288 2651732 2662140 2671652 2679780 2686544 2692145 2696891 2701252 2705523 2709285 2711542 2711614 2709764
48985 2709764 2706866 2703664 2700486 2697502 2694842 2692426 2689875 2686904 2683754 2680982 2678653 2675940 2671727 2665517
48971 2665517 2657562 2648350 2638303 2627871 2617389 2606761 2595754 2584809 2575157 2567879 2563158 2560658
48959 2560658 2560243 2561981 2565753 2571293 2578443 2587085 2596996 2608142 2620890 2635459 2651338 2667629 2684013
48946 2684013 2700998 2719276 2739104 2760193 2781745 2802630 2822038 2840196 2858279 2877641 2899331
48935 2899331 2924164 2952675 2984832 3020204 3058550 3099935 3144175 3190603 3238620 3288190 3339523
48924 3339523 3392578 3447180 3503372 3561384 3621442 3683942 3749533 3818529 3890184 3962948 4035575
48913 4035575 4107681 4179098 4248999 4316077 4379613 4440172 4499134 4557592 4615671 4672647 4727500
48902 4727500 4779420 4828167 4874111 4917785 4959230 4997955 5033755 5067317 5099555 5130400 5158690
48891 5158690 5183441 5204788 5223352 5239004 5250776 5257939 5260751 5260049 5256424 5249968 5240529 5227947 5212125
48878 5212125 5193129 5171315 5147214 5121156 5092955 5061916 5027131 4987856 4943778 4895086 4842340
48867 4842340 4786233 4727366 4666183 4603139 4538948 4474605 4411062 4348893 4288367 4229749 4173300
48856 4173300 4118892 4065980 4014217 3963967 3915877 3870143 3826584 3785419 3747341 3712635 3680778
48845 3680778 3651290 3624522 3601091 3580954 3563735 3549676 3539440 3532922 3529113 3527344 3527954 3531405
48833 3531405 3537455 3545738 3556586 3570525 3587313 3606129 3626555 3648698 3672428 3697164 3722542 3748768
48821 3748768 3776142 3804594 3833788 3863310 3892596 3921034 3948383 3974890 4000911 4026618 4052141
48810 4052141 4077682 4103293 4128760 4153884 4178706 4203317 4227678 4251872 4276350 4301668 4328029
48799 4328029 4355338 4383646 4413203 4443898 4474874 4504927 4533250 4559626 4583976 4606148 4626368
48788 4626368 4645546 4664603 4683460 4701057 4716434 4729383 4739861 4747227 4750414 4748657 4741789 4730074
48776 4730074 4714050 4694307 4671100 4644373 4614440 4582275 4548647 4513203 4474944 4433442 4388944
48765 4388944 4341540 4291135 4238382 4184791 4131423 4078093 4024298 3970450 3917683 3866806 3817942
48754 3817942 3770899 3725379 3681047 3637958 3596869 3558609 3523060 3489133 3455827 3423006 3391147
48743 3391147 3360723 3332171 3306158 3283555 3264967 3250446 3239715 3232555 3228755 3227659 3227984 3228310 3227643
48730 3227643 3225449 3221428 3215792 3209712 3204902 3202484 3202408 3204039 3206891 3210694 3215309 3220930 3227938 3236098
48716 3236098 3244203 3250976 3256077 3259724 3261695 3261493 3259476 3257057 3255483 3254888 3254752 3254831 3255302 3256450 3258597
48701 3258597 3262056 3266713 3271850 3276778 3281539 3286645 3292259 3298089 3304058 3310568 3317912 3325746 3333346 3340089
48687 3340089 3345461 3348973 3350520 3350758 3350742 3351195 3352386 3354479 3357482 3360843 3363661 3365545 3366752 3367184 3365812
48672 3365812 3361621 3354757 3346082 3335866 3323751 3309976 3295724 3281868 3267917 3252625 3235256 3215917
48660 3215917 3195013 3172825 3149413 3124477 3097438 3067892 3035884 3001545 2964728 2925401 2884280
48649 2884280 2842793 2802489 2764676 2730329 2699836 2672779 2648246 2625392 2603540 2581940 2559853
48638 2559853 2536968 2513505 2489962 2466922 2444918 2424054 2403764 2383279 2362341 2341128 2319561
48627 2319561 2297114 2273452 2248819 2223675 2198354 2173318 2149332 2127033 2106545 2087870 2071411
48616 2071411 2057690 2046704 2038033 2031673 2028262 2028168 2030625 2034111 2037534 2040658 2043324 2044719 2043883 2040832
48602 2040832 2036660 2032382 2028147 2023978 2020804 2020025 2021941 2025198 2027971 2029254 2028768 2026201 2021172 2013777
48588 2013777 2004604 1994137 1982458 1969591 1955812 1941501 1926968 1912566 1898754 1885895 1874101
48577 1874101 1863408 1854008 1846162 1839947 1835138 1831316 1828158 1825824 1825144 1827175 1832388 1840338 1850163 1861203
48563 1861203 1873000 1884966 1896299 1906041 1912909 1915292 1912007 1903171 1890083 1874238 1856833 1839144
48551 1839144 1822650 1808315 1796002 1784907 1774260 1763348 1751260 1737185 1720929 1702816 1683299
48540 1683299 1663046 1643141 1624601 1607624 1591748 1576719 1562802 1550299 1539275 1529797 1521931 1515437
48528 1515437 1509998 1505891 1503981 1504867 1508552 1515087 1524980 1538623 1555802 1576045 1598738 1622200 1642963
48515 1642963 1656756 1660400 1652855 1635181 1610256 1582160 1554825 1530875 1511770 1498608 1491992 1491260
48503 1491260 1494751 1501215 1510491 1522629 1536986 1552595 1569083 1586803 1606225 1627335 1649126 1669079
48491 1669079 1683334 1688107 1681556 1664405 1638920 1607533 1572413 1535823 1500181 1467404 1438296 1412717
48479 1412717 1390296 1370854 1354321 1340547 1329288 1320236 1313014 1307299 1302905 1299607 1296947 1294484 1292219
48466 1292219 1290561 1289920 1290598 1292928 1297016 1302345 1308185 1314536 1322124 1331271 1341245 1350886 1359241 1365380
48452 1365380 1368407 1368250 1365863 1362064 1356756 1349888 1342461 1335639 1329297 1322407 1314557 1306102 1297012 1286641
48438 1286641 1274676 1261352 1246748 1230814 1214319 1198865 1185646 1174789 1165992 1158977 1153132 1147622
48426 1147622 1142337 1138087 1135504 1134276 1133692 1133235 1132409 1130732 1128336 1125932 1123745 1121039 1117044 1111743 1105388
48411 1105388 1097965 1089672 1081313 1073608 1066570 1059988 1053958 1048394 1042612 1036114 1029376 1023229 1017848 1012970
48397 1012970 1008686 1005227 1002164 998595 994115 989105 984093 979306 974755 970258 965359 959608 952998 945961
48383 945961 939057 932772 927420 922993 919289 916286 914117 912603 911287 910093 909502 909753 910260 910088 908629
48368 908629 905712 901614 897241 893664 891120 889041 887310 886665 887397 888520 888974 888971 889359 890260 891217 892148 893316
48351 893316 894697 896148 897843 899860 901788 903504 905868 909862 915461 922201 930337 940541 952821 966735
48337 966735 982394 1000176 1019420 1038176 1054194 1065793 1072242 1074162 1073373 1071821 1070903 1071979 1076549
48324 1076549 1085173 1097132 1111932 1130164 1151964 1175891 1200642 1226705 1254930 1284670 1315122
48313 1315122 1347470 1383744 1424523 1469727 1520729 1579593 1647205 1724453 1814353 1920773 2046499
48302 2046499 2195531 2376142 2598687 2872189 3207448 3623000 4145432 4807805 5653950
48293 5653950 6738799 8109723 9782724 11744701 13975182 16436094 19008017 21433479
48285 21433479 23349003 24408371 24414825 23383479 21519683 19142539 16587669 14123119
48277 14123119 11910070 10014378 8441308 7163278 6136074 5312444 4652311 4123614
48269 4123614 3698219 3352034 3068008 2834794 2642172 2480209 2342058 2224371 2124575 2039668
48259 2039668 1967352 1906003 1853378 1806952 1765423 1728407 1694950 1663775 1634629 1607919 1583357
48248 1583357 1560404 1539504 1521302 1505019 1489322 1474599 1462689 1454351 1448522 1444137 1441219 1440050
48236 1440050 1440736 1443893 1450497 1460511 1472494 1484650 1495285 1502257 1503237 1497195 1485019 1468536 1449576
48223 1449576 1429811 1410340 1391042 1371104 1350447 1329950 1310199 1290850 1271436 1251998 1232549
48212 1232549 1212650 1191924 1170513 1148706 1126542 1104020 1081310 1058567 1035809 1013143 990835
48201 990835 969188 948577 929487 912142 896256 881427 867487 854104 840563 826713 813719
48190 813719 803024 794693 787566 780875 774760 769275 763931 758460 753132 748107 743229 738657 734897 731873
48176 731873 728740 725000 721185 718065 715766 714053 712887 712226 711681 710818 709568 708110 706580 705084 703741
48161 703741 702576 701599 700908 700422 699696 698511 697465 697301 697714 697597 696570 695438 695034 695398 696314 697769 699442
48144 699442 700606 701090 701728 703265 705417 707529 709586 711853 713967 715175 715314 714978 714851 715317 716525 718375
48128 718375 720515 722689 724980 727432 729701 731455 732949 734832 737488 740752 744171 747346 750162 752889
48114 752889 755876 759080 762131 764987 768162 772092 776542 780878 784732 788359 792537 798163 805562 814174
48100 814174 823270 832886 843497 854837 865877 876188 886506 897553 909077 920534 931974 943579
48088 943579 955005 965985 977143 989393 1002772 1016478 1029750 1042144 1053333 1063404 1073151 1083417
48076 1083417 1094287 1105340 1116303 1126826 1136122 1143741 1150408 1157236 1164261 1170694 1176487 1182638 1189895
48063 1189895 1198086 1206870 1216234 1225908 1235107 1243231 1250202 1255822 1259560 1261392 1262115 1262240 1261048 1257392
48049 1257392 1251104 1243048 1234018 1224160 1213412 1202080 1190823 1180261 1170564 1161249 1151412 1140259 1127498
48036 1127498 1113364 1098440 1083398 1068570 1053708 1038357 1022455 1006374 990462 974784 959235
48025 959235 943559 927369 910615 893975 878269 863446 848701 833719 819191 805834 793543
48014 793543 781916 771104 761578 753373 746079 739359 733068 726988 720999 715409 710746 707134 704146 701274
48000 701274 698366 695656 693520 692131 691256 690522 690009 690262 691488 693013 693984 694391 694910 695753 696249 695759 694628
47983 694628 693824 693769 693872 693307 692059 690925 690459 690151 688946 686485 683432 680536 677790 674825 671694 668748
47967 668748 665906 662691 659076 655808 653642 652515 651701 650517 648678 646232 643546 641241 639851 639430 639643
47952 639643 640196 641006 642001 642998 643926 645019 646703 649309 652924 657368 662308 667530 673184 679595 686748
47937 686748 694176 701496 708911 716965 725898 735442 745048 754057 761858 768399 774515 781243 788623 795586
47923 795586 801149 805313 808533 810827 811816 811377 809736 807125 803776 800071 796281 792189 787354 781607 774989
47908 774989 767378 758736 749647 741068 733455 726523 719925 713732 708206 703517 699824 697150 695078 693014
47894 693014 690993 689868 690457 692806 696433 700860 705643 710246 714278 717746 720963 724377 728576 734005
47880 734005 740446 747145 753682 760350 767477 774829 782072 789340 796822 804123 810571 815880 820002 822606
47866 822606 823414 822860 821691 819920 816860 812273 806781 800922 794435 786819 778113 768752 759078 749350 739899
47851 739899 730821 721734 712259 702638 693552 685412 678141 671546 665617 660453 656136 652666 649892 647592
47837 647592 645775 644811 645028 646265 648060 650279 653287 657485 662857 668955 675111 680714 685560 690041 694781
47822 694781 699986 705424 711083 717518 725246 734061 743344 752991 763633 775926 790014 805817 823514
47809 823514 843440 865645 889820 915620 942840 971241 1000363 1029487 1057701 1084028 1107684
47798 1107684 1128223 1145282 1158175 1165999 1168306 1165532 1158606 1148186 1134486 1117791 1098897 1079036
47786 1079036 1059491 1041359 1025369 1011608 999484 988276 977914 969100 962523 958001 954511 951011
47774 951011 947158 943217 939398 935378 930532 924658 918369 912538 907364 902234 896664 891023 885946 881197
47760 881197 875702 868827 861181 853901 847367 840862 833382 824653 815473 807128 800291 794429 788551 782559
47746 782559 777452 774078 772100 770547 768999 767837 767665 768944 771931 776360 781340 786124 791054 797214
47732 797214 805193 814680 825295 837153 850356 864493 879032 893825 908831 923596 937434 950046
47720 950046 961629 972387 982165 990574 997322 1002320 1005475 1006487 1005003 1001060 995199 987978 979562 970003
47706 970003 959696 949041 937827 925450 911793 897421 882919 868611 855087 843371 834102 826918
47694 826918 821000 815911 811602 807935 804728 802208 801064 802001 805227 810208 815907 821640 827781 835302
47680 835302 844477 854580 865043 876225 888562 901567 914425 927180 940476 954267 967574 979592
47668 979592 990354 1000176 1009079 1016972 1023831 1029374 1032981 1034312 1033702 1031598 1027846 1021867 1013473 1003254
47654 1003254 992166 980865 969481 957958 946562 935918 926507 918174 910343 902665 895329 888808
47642 888808 883528 879782 877731 877395 878755 881886 886896 893806 902561 913153 925532 939396 954254
47629 954254 969880 986769 1006074 1028871 1055294 1084457 1115443 1148268 1183470 1220814 1258906
47618 1258906 1296192 1331784 1364992 1394697 1419731 1439387 1452902 1458918 1456304 1445384 1427495 1403442
47606 1403442 1373198 1337121 1296512 1252702 1206450 1158651 1110884 1064664 1020639 978984 940092
47595 940092 904309 871483 841433 814576 791443 771787 754860 740436 728801 719627 711549 703244
47583 703244 694532 686188 678972 673117 668422 664414 660520 656483 652657 649657 647617 645980 644128 642108
47569 642108 640604 640252 641134 642773 644363 645010 644120 641799 638683 635185 631101 626225 621081 616598 613048
47554 613048 609765 605981 601560 596778 591838 586935 582509 578960 576128 573401 570398 567390 564949 563328
47540 563328 562276 561376 560434 559479 558496 557329 555963 554700 553845 553285 552634 551815 551279 551588 552929 555072 557571
47523 557571 559925 561728 562820 563276 563210 562712 561930 561068 560314 559894 560042 560642 561059 560777 560207 560325 561302 562088
47505 562088 561747 560740 560324 560973 562041 562895 563637 564532 565334 565597 565350 565002 564700 564203 563416 562691 562385 562295
47487 562295 561803 560580 558955 557528 556596 556156 556312 557352 559392 562122 565111 568221 571614 575453 579698
47472 579698 584175 588725 593284 597848 602365 606721 610862 614902 618955 622908 626541 629883 633194 636500
47458 636500 639342 641250 642372 643370 644648 645847 646246 645645 644770 644729 646158 649005 653103 658691 666194 675683
47442 675683 686818 699298 713107 728357 745148 763581 783642 805088 827737 851828 877668
47431 877668 904754 931687 957206 980995 1003204 1023471 1040853 1054539 1064270 1070193 1072769 1072765 1070885
47418 1070885 1067241 1061504 1053647 1044234 1033832 1022473 1010008 996738 983326 970100 956878 943548
47406 943548 930497 918111 906035 893254 878990 863362 847217 831599 817422 805228 794895
47395 794895 785697 776884 768182 759667 751512 744151 738398 734867 733300 732877 733191 734523 737193 741175 746409
47380 746409 752937 760501 768531 776838 785911 796175 807277 818529 829737 841102 852498 863289
47368 863289 872821 880711 886697 890576 892382 892379 890812 887730 882954 876091 866802 855261 842191 828208
47354 828208 813294 797216 780285 763369 747236 732187 718275 705450 693443 681847 670480
47343 670480 659514 649272 640079 632236 625811 620397 615386 610572 606229 602503 599032 595417 591881 589156
47329 589156 587748 587529 588081 589192 590855 592986 595417 598202 601551 605315 608876 611914 615001 618865 623140
47314 623140 626518 628303 629182 630194 631512 632682 633506 633950 633594 631974 629397 626682 624051 620929 616983
47299 616983 612770 609118 606267 603902 601669 599480 597590 596555 596860 598385 600500 602740 605123 607725
47285 607725 610397 613176 616677 621657 628305 636208 644826 653772 662741 671572 680445 689774 699763 710085
47271 710085 720086 729326 737911 746251 754561 762697 770526 778224 786047 793986 801907 809915 818267 827076
47257 827076 836409 846560 857661 868967 879005 886606 891289 892461 888846 879411 864671 846630 827535
47244 827535 809053 792376 778354 767152 758129 750397 743460 737279 731993 727856 725312 724794 726280
47231 726280 729179 732752 736691 741175 746333 751848 757320 762997 769812 778435 788483 799003 809673
47218 809673 821174 834182 848340 862547 876087 889047 901595 913325 923552 932002 938815 944010
47206 944010 947307 948409 947150 943450 937509 930027 921683 912271 900897 887449 873404 860658 849774
47193 849774 839903 830224 820906 812690 806125 801406 798539 797407 797866 799837 803123 807209 811630 816598
47179 816598 822849 830766 840074 850535 862514 876516 892513 910099 929090 949515 971142 993431
47167 993431 1015969 1038605 1061002 1082349 1101757 1118858 1133856 1146982 1158006 1166379 1171765 1174305
47155 1174305 1174346 1172069 1167432 1160363 1150954 1139605 1127055 1113997 1100486 1085993 1070401 1054697 1040224
47142 1040224 1027386 1015550 1004154 993322 983335 974192 966033 959422 954753 951702 949751 948982 949897
47129 949897 952535 956291 960634 965638 971615 978485 985706 992821 999893 1007245 1014669 1021093 1025309 1026953
47115 1026953 1026456 1024138 1019817 1013415 1005374 996241 986264 975686 964966 954261 943137 931350 919537
47102 919537 908495 898053 887423 876532 866163 856710 847614 838354 829207 820511 811799 802251 791761
47089 791761 780951 770387 760405 751599 744782 740237 737407 735587 734626 734725 735858 737698 740008 742776
47075 742776 745975 749461 753200 757343 761913 766515 770607 774072 777380 781093 785242 789218 792212 793753
47061 793753 793947 793343 792520 791674 790551 788865 786773 784938 784068 784416 785672 787225 788543 789493 790521 792485
47045 792485 796061 801183 807121 813182 819260 825614 832312 839084 845678 852087 858390 864622 870872 877297
47031 877297 883928 890620 897330 904219 911339 918383 924989 931216 937545 944496 952294 960697 968971 976320
47017 976320 982614 988538 994669 1000575 1005229 1008152 1009725 1010413 1010213 1008965 1006787 1003955 1000561 996419 991146
47002 991146 984463 976758 969254 963131 958412 954219 950162 946823 944682 943310 942171 941601 942250 943824 945183
46987 945183 945763 946337 948205 951941 957042 962516 967745 972929 978782 985726 993509 1001711 1010372 1019798 1029944
46972 1029944 1040372 1050829 1061516 1072695 1084297 1095997 1107520 1118740 1129575 1139829 1149171
46961 1149171 1157386 1164682 1171566 1178270 1184444 1189622 1193731 1196941 1199208 1200391 1200767 1201004 1201500 1202002 1202005 1201333
46945 1201333 1200291 1199419 1199221 1199962 1201654 1204304 1208094 1213099 1218848 1224479 1229566 1234645 1240730 1248283 1256813
46930 1256813 1265458 1273788 1281940 1290140 1298385 1306632 1315071 1323949 1333195 1342400 1351150 1359228 1366559 1373115
46916 1373115 1378752 1382902 1384563 1382957 1378237 1371252 1362634 1352431 1340606 1327424 1313312 1298802 1284733
46903 1284733 1271919 1260363 1249293 1238394 1228577 1221210 1216901 1215380 1216129 1218741 1223079 1229505 1238689
46890 1238689 1250725 1264802 1280185 1297046 1315800 1336068 1357008 1378353 1400304 1422623 1444602
46879 1444602 1465749 1485672 1503420 1517983 1529607 1539695 1549080 1557190 1563287 1567706 1571293 1574239
46867 1574239 1576203 1577306 1578368 1580251 1583377 1587882 1593899 1601600 1611059 1622119 1634401 1647547 1661354
46854 1661354 1675598 1689920 1704149 1718533 1733254 1747901 1761807 1774710 1786566 1796942 1805249
46843 1805249 1811532 1816277 1819468 1820656 1820017 1818401 1816026 1812046 1805961 1798698 1791683 1785436 1779675 1774224
46829 1774224 1769094 1764121 1759308 1755357 1753236 1753363 1755642 1760051 1766673 1775366 1785943 1798504 1813094
46816 1813094 1829186 1845971 1863064 1880558 1898527 1916824 1935057 1952359 1967452 1979464 1988557
46805 1988557 1995395 2000300 2003367 2004884 2004906 2002734 1997745 1990642 1983010 1975581 1967745 1958906 1949491 1940307
46791 1940307 1931671 1923618 1916322 1909847 1903900 1898292 1893291 1889125 1885555 1882417 1880244 1879794 1881072 1883277
46777 1883277 1885694 1888261 1891281 1894907 1898993 1903180 1907062 1910418 1913340 1916095 1918940 1922174 1926202 1931270
46763 1931270 1937127 1943300 1949810 1957376 1966668 1977472 1988945 2000715 2013387 2027772 2043921 2061263
46751 2061263 2079508 2098845 2119184 2139772 2159913 2179738 2199816 2220137 2239866 2258038 2274245
46740 2274245 2288657 2301611 2313177 2323003 2330612 2335945 2339467 2341664 2342691 2342714 2342193 2341508 2340618 2339577
46726 2339577 2339094 2340005 2342299 2345318 2348885 2353643 2360145 2368165 2377111 2386546 2396144 2405548 2414562 2423062
46712 2423062 2430565 2436356 2440254 2442746 2444013 2443281 2439536 2432454 2422236 2408986 2392811 2374181 2353508
46699 2353508 2330568 2304946 2276991 2247702 2217690 2186879 2155304 2123562 2092198 2061153 2030196
46688 2030196 1999578 1969865 1941330 1913889 1887532 1862521 1839092 1817164 1796428 1776649 1757926
46677 1757926 1740580 1724682 1709647 1694553 1679023 1663659 1649416 1636626 1624896 1613856 1603700
46666 1603700 1594855 1587443 1581328 1576575 1573531 1572414 1573024 1574981 1578101 1582384 1587838 1594448 1602291 1611365
46652 1611365 1621292 1631328 1640785 1649283 1656600 1662504 1666891 1669881 1671531 1671554 1669611 1665872 1661050 1655876
46638 1655876 1650779 1646145 1642522 1640261 1639178 1638968 1640025 1643515 1650482 1661068 1674745 1691024 1709681
46625 1709681 1730403 1752637 1775896 1800032 1825005 1850447 1875459 1898720 1918880 1935101 1947384
46614 1947384 1956189 1961632 1963180 1960265 1952982 1942003 1928021 1911604 1893431 1874212 1854210 1833141
46602 1833141 1810750 1787420 1764164 1742188 1722448 1705327 1690422 1676823 1663834 1651482 1640132
46591 1640132 1629738 1619749 1609867 1600544 1592401 1585279 1578240 1570604 1562611 1554857 1547432 1540049 1532812 1526197
46577 1526197 1520205 1514148 1507589 1500966 1494887 1489232 1483538 1477987 1473286 1469661 1466634 1463915 1461874 1460893
46563 1460893 1460751 1460985 1461474 1462375 1463760 1465607 1467888 1470445 1473027 1475663 1478750 1482542 1486806 1491196 1495654
46548 1495654 1500269 1505134 1510676 1517696 1526506 1536322 1546082 1555691 1565897 1577077 1588880 1601107 1614201
46535 1614201 1628524 1643738 1659275 1675068 1691490 1708920 1727779 1748687 1772088 1797754 1825039
46524 1825039 1853558 1883352 1914472 1946770 1980119 2014511 2049821 2085720 2121893 2158068 2193655
46513 2193655 2227604 2258938 2287402 2313343 2337008 2358232 2376772 2392586 2405563 2415283 2421441 2424430
46501 2424430 2425141 2424251 2422078 2419147 2416316 2414024 2411699 2408343 2403601 2397982 2392262 2386934 2382016 2376951
46487 2376951 2370798 2362957 2353627 2343192 2331264 2316915 2299846 2280632 2259627 2236257 2209777 2180177
46475 2180177 2147928 2113323 2076737 2039197 2001864 1964938 1927664 1889625 1851572 1814827 1780229
46464 1780229 1747886 1717680 1689741 1664517 1642543 1624132 1609298 1597982 1590305 1586450 1586398 1589939
46452 1589939 1596852 1606843 1619408 1633990 1650286 1668217 1687686 1708568 1730728 1753581 1775721 1795516
$$ [...]
##END NTUPLES=NMR SPECTRUM
##END=
