
##TITLE=UV1291_M3_1216-1376_5_7535606_kqToaAJUhd
##JCAMPDX= 6.0         $$ Bruker NMR JCAMP-DX V2.0
##DATA TYPE= NMR SPECTRUM
##DATA CLASS= NTUPLES
##ORIGIN= BRUKER
##OWNER= Administrator
$$ 1.72 TOPSPIN		Version 2.1
$$ 2013-02-21 19:24:11.536 -0500  Administrator@X
$$ Compression mode = diff/dup
##.OBSERVE FREQUENCY= 400.02188249412
##.OBSERVE NUCLEUS= ^1H
##.ACQUISITION MODE= SIMULTANEOUS (DQD)
##.ACQUISITION SCHEME= undefined
##.AVERAGES= 8
##.DIGITISER RES= 22
##SPECTROMETER/DATA SYSTEM= spect
##.PULSE SEQUENCE= zg30
##.SOLVENT NAME= COFFEE_meoh
##.SHIFT REFERENCE= INTERNAL, COFFEE_meoh, 1, 14.98509
##AUDIT TRAIL= $$ (NUMBER, WHEN, WHO, WHERE, PROCESS, VERSION, WHAT)
$$ ##TITLE= Audit trail, TOPSPIN		Version 2.1
$$ ##JCAMPDX= 5.01
$$ ##ORIGIN= Bruker BioSpin GmbH
$$ ##OWNER= Administrator
$$ $$ E:\/data/COFFEE/nmr/UV1291_M3_1216-1376_5_7535606_kqToaAJUhd/10/pdata/1/auditp.txt
$$ ##AUDIT TRAIL=  $$ (NUMBER, WHEN, WHO, WHERE, PROCESS, VERSION, WHAT)
(   1,<2013-02-21 19:24:02.452 -0500>,<Administrator>,<X>,<go>,<TOPSPIN 2.1>,
      <created by zg
	started at 2013-02-21 19:22:57.690 -0500,
	POWCHK enabled, PULCHK disabled,
       configuration hash MD5:
       86 BA 57 50 F2 9D 5C 9B 26 00 A9 28 5F 66 2E 89
       data hash MD5: 64K
       14 52 07 0A EB A7 D7 34 17 93 6F 75 08 49 77 FA>)
(   2,<2013-02-21 19:24:05.779 -0500>,<Administrator>,<X>,<proc1d>,<TOPSPIN 2.1>,
      <Start of raw data processing
       efp LB = 0 FT_mod = 6 PKNL = 1 PHC0 = 0 PHC1 = 0 SI = 32K 
       data hash MD5: 32K
       1B 42 4E 9E 4D 77 24 5D 4E 0E BE FD 73 8C FF 9D>)
(   3,<2013-02-21 19:24:06.318 -0500>,<Administrator>,<X>,<proc1d>,<TOPSPIN 2.1>,
      <pk PHC0 = 70.03235 PHC1 = 0 
       data hash MD5: 32K
       A7 4C 7D 25 1A B0 F8 1E 40 65 79 BB 41 6F CC EA>)
(   4,<2013-02-21 19:24:06.553 -0500>,<Administrator>,<X>,<proc1d>,<TOPSPIN 2.1>,
      <abs ABSG = 1 
       data hash MD5: 32K
       AD B5 7B EE 4E 60 6B D7 9E 02 3E E0 2A 36 CF 2B>)
(   5,<2013-02-21 19:24:06.722 -0500>,<Administrator>,<X>,<proc1d>,<TOPSPIN 2.1>,
      <abs ABSG = 2 
       data hash MD5: 32K
       3E 7C 2B 52 83 24 C9 BC FF 45 8B 9C 64 21 00 2C>)
(   6,<2013-02-21 19:24:06.873 -0500>,<Administrator>,<X>,<proc1d>,<TOPSPIN 2.1>,
      <abs ABSG = 3 
       data hash MD5: 32K
       35 FB A5 25 D8 5C C0 8C E0 4C 58 92 D5 64 0B 85>)
(   7,<2013-02-21 19:24:07.075 -0500>,<Administrator>,<X>,<proc1d>,<TOPSPIN 2.1>,
      <abs ABSG = 4 
       data hash MD5: 32K
       E3 66 0B DA 05 CC 93 23 76 F5 51 A7 7D 01 2D 5F>)
(   8,<2013-02-21 19:24:07.260 -0500>,<Administrator>,<X>,<proc1d>,<TOPSPIN 2.1>,
      <abs ABSG = 5 
       data hash MD5: 32K
       1C F7 63 7A 5F 41 36 6B A2 89 41 0F 39 EB 9B 6C>)
$$ ##END=
$$ 
$$ $$ hash MD5
$$ $$ 2B 0F 72 02 F1 70 CA CB E9 97 55 EC C8 3D 3E 8F
##$RELAX= 
##$RELAX= 
##$RELAX= 
##$RELAX= 
##$RELAX= 
##$RELAX= 
##$RELAX= 
$$ Bruker specific parameters
$$ --------------------------
##$DU= <E:\>
##$EXPNO= 10
$$ [...]
150 150 150 150 150 150 150 150
##$TP07= 0
##$TPNAME0= <>
##$TPNAME1= <>
##$TPNAME2= <>
##$TPNAME3= <>
##$TPNAME4= <>
##$TPNAME5= <>
##$TPNAME6= <>
##$TPNAME7= <>
##$TPOAL= (0..7)
0.5 0.5 0.5 0.5 0.5 0.5 0.5 0.5
##$TPOFFS= (0..7)
0 0 0 0 0 0 0 0
##$TUNHIN= 0
##$TUNHOUT= 0
##$TUNXOUT= 0
##$USERA1= <user>
##$USERA2= <user>
##$USERA3= <user>
##$USERA4= <user>
##$USERA5= <user>
##$V9= 5
##$VALIST= <valist>
##$VCLIST= <CCCCCCCCCCCCCCC>
##$VD= 0
##$VDLIST= <DDDDDDDDDDDDDDD>
##$VPLIST= <PPPPPPPPPPPPPPP>
##$VTLIST= <TTTTTTTTTTTTTTT>
##$WBST= 1024
##$WBSW= 4
##$XGAIN= (0..3)
0 0 0 0
##$XL= 0
##$YL= 0
##$YMAX_a= 568220
##$YMIN_a= -566073
##$ZGOPTNS= <>
##$ZL1= 120
##$ZL2= 120
##$ZL3= 120
##$ZL4= 120
##$ABSF1= 14.98509
##$ABSF2= -5.573092
##$ABSG= 5
##$ABSL= 3
##$ALPHA= 0
##$AQORDER= 0
##$ASSFAC= 0
##$ASSFACI= 0
##$ASSFACX= 0
##$ASSWID= 0
##$AUNMP= <proc_prof1d_extract_pilot.lims>
##$AXLEFT= 0
##$AXNAME= <>
##$AXNUC= <1H>
##$AXRIGHT= 0
##$AXTYPE= 0
##$AXUNIT= <>
##$AZFE= 0.1
##$AZFW= 0.1
##$BCFW= 0
##$BC_mod= 0
##$BYTORDP= 0
##$COROFFS= 0
##$CY= 15
##$DATMOD= 1
##$DC= 0
##$DFILT= <>
##$DTYPP= 0
##$F1P= 0
##$F2P= 0
##$FCOR= 0.5
##$FTSIZE= 32768
##$FT_mod= 6
##$GAMMA= 0
##$GB= 0
##$INTBC= 1
##$INTSCL= 1
##$ISEN= 128
##$LB= 0
##$LEV0= 0
##$LPBIN= 0
##$MAXI= 10000
##$MC2= 0
##$MEAN= 0
##$ME_mod= 0
##$MI= 0
##$NCOEF= 0
##$NC_proc= -8
##$NLEV= 6
##$NOISF1= 0
##$NOISF2= 0
##$NSP= 0
##$NTH_PI= 0
##$NZP= 0
##$OFFSET= 14.98509
##$PC= 1
##$PHC0= 70.03235
##$PHC1= 0
##$PH_mod= 1
##$PKNL= yes
##$PPARMOD= 0
##$PPDIAG= 0
##$PPIPTYP= 0
##$PPMPNUM= 2147483647
##$PPRESOL= 1
##$PSCAL= 4
##$PSIGN= 0
##$PYNMP= <proc.py>
##$REVERSE= no
##$SF= 400.02
##$SI= 32768
##$SIGF1= 0
##$SIGF2= 0
##$SINO= 400
##$SIOLD= 32768
##$SPECTYP= <>
##$SREGLST= <1H.CDCl3>
##$SSB= 0
##$STSI= 32768
##$STSR= 0
##$SW_p= 8223.68421052631
##$SYMM= 0
##$S_DEV= 0
##$TDeff= 65536
##$TDoff= 0
##$TI= <>
##$TILT= no
##$TM1= 0
##$TM2= 0
##$TOPLEV= 0
##$USERP1= <user>
##$USERP2= <user>
##$USERP3= <user>
##$USERP4= <user>
##$USERP5= <user>
##$WDW= 1
##$XDIM= 32768
##$YMAX_p= 469114345
##$YMIN_p= -688378
##$CURPLOT= <Network HP LaserJet P1505>
##$CURPRIN= <$Network HP LaserJet P1505>
##$DFORMAT= <normdp>
##$LAYOUT= <+/1D_H.xwp>
##$LFORMAT= <normlp>
##$PFORMAT= <normpl>
##$SURQMSG= 1
$$ End of Bruker specific parameters
$$ ---------------------------------
##NTUPLES= NMR SPECTRUM
##VAR_NAME=  FREQUENCY,     SPECTRUM/REAL,   SPECTRUM/IMAG
##SYMBOL=    X,             R,               I
##VAR_TYPE=  INDEPENDENT,   DEPENDENT,       DEPENDENT
##VAR_FORM=  AFFN,          ASDF,            ASDF
##VAR_DIM=   32768,         32768,           32768
##UNITS=     HZ,            ARBITRARY UNITS, ARBITRARY UNITS
##FACTOR=    0.250966925370066, 1,           1
##FIRST=     8223.43324360094, -118948,      -163745
##LAST=      0,             81620,           -86128
##MIN=       0,             -688378,         0
##MAX=       8223.43324360094, 469114345,    0
$$ Real data points
##PAGE= N=1
##DATA TABLE= (X++(R..R)), XYDATA
$$ [...]
19544a90410N5192n613j2852b1301r9824j46679a30362e7139j37233A0547b36836
19532a34155b6954l20786a5060B5053J25520a64731A29911l9894a839C33562b75192
19520b44424L4049d8075J9967F2935J6366a22933A4586e4353j86722e5351A4364
19508B22742b9378A33676c61612A43346a33138B05823b91982j81648a20442e2127
19497a08663j11019j11575A36310c0108k41638H6116L9920m4393a62549M702k9441
19486a87288E969i9517c03l03509A54920c9184m67650J32734A75480B8256a44048
19474B39720o4690a56658c2491P402l3186j39291I2686c88741F9532a45393B1142
19462a00855B9656f83m90983E32h6141j34929f5967j16597b0967B865R6636d5084
$$ plain form
19544 -190410 -135218 -140831 -153683 -21301 -121125 -267804 -130362 -57139 -194372 10547 -236836
19532 -134155 -26954 -347740 -15060 25053 150573 -164731 129911 90017 -1839 333562 -275192
19520 -244424 -210375 -48075 -28108 62935 79301 -122933 14586 -54353 -241075 -55351 14364
19508 222742 -29378 133676 -361612 143346 -133138 205823 -291982 -473630 -120442 -52127
19497 -108663 -219682 -331257 136310 -30108 -271746 86116 126036 81643 -162549 -157847 -187288
19486 -187288 5969 -99517 -303 -303812 154920 -39184 -506834 -374100 175480 28256 -144048
19474 239720 175030 -156658 -32491 -25089 -58275 -197566 92686 -388741 69532 -145393 21142
19462 -100855 29656 -683 -491666 532 -86141 -221070 -65967 -182564 -20967 2865 99501 -45084
19449b14580A90408Q7572g2778A76820B8319c14100A91241p2328a05263k61831
19439c67094c3325j01238A84286q7598j7127b80482N6432L3300I4594Q4613J7092
19428A96299h4731B1960a94621c0549l9026k28106N6917c0179P464m23444A24373
19416d42744C2768e26464b45p7015K7287j8372j92708L1488j8163g6327B19901
19404d42282d9933k92088J21210g0145G2244n888A5248a41788j8455c2403n4166
19393h6569b2261j07777A43804K1650c25692e9996A16213a5970k33728D4861a18318
19381A26992f0878B80398h7815k54774J62832A25652L680a95763H5018R2066o5611
19370A11473F51J02029a70964D4269d6921p4804K3677j29499h2250D2363N9572
$$ plain form
19449 -214580 190408 277980 -72778 176820 28319 -314100 191241 118913 -105263 -367094
19439 -367094 -33325 -134563 184286 96688 79561 -280482 -224050 -190750 94594 179207 196299
19428 196299 -84731 21960 -194621 -30549 -69575 -297681 -240764 -30179 -22715 -446159 124373
19416 -442744 32768 -526464 -245 -77260 -49973 -68345 -261053 -229565 -247728 -76327 219901
19404 -442282 -49933 -342021 -220811 -70145 72244 66356 15248 -141788 -160243 -32403 -86569
19393 -86569 -22261 -130038 143804 165454 -325692 -59996 116213 -15970 -249698 44861 -118318
19381 126992 -60878 280398 -87815 -342589 -179757 125652 129332 -195763 85018 177084 111473
19370 111473 651 102680 -170964 44269 -46921 -121725 -98048 -227547 -82250 42363 101935
19359A01935B5685c9099A59562a06187c8221j77330N3370j06577a17058M7179
19349f9879j17669q9590e3668K3441m05976f3051l64453B59943J37a37722j27715
19338b65437B42230a45882B10405o4345b16912J04515k16187A85246p2028l0279
19328H2939N9171d30336c8451j22452d1623A05341b63076A71080a91253G4713
19317A9200K17497a05881k60864L5428R9085A4130k603h758p5400p7197B00753
19305C5864J42908C5320h6718p1993C9770L25688A73634b51392f7696A02469K5826
19294A28295d9626B38139n3872k9193b34529B77370a64230k7032b5547G5530N1624
19283A27154B0133a01859o650k50724a7512F2480A723J02738h0124I5660F052
$$ plain form
19359 101935 25685 -39099 159562 -106187 -38221 -215551 -162181 -268758 -117058 -69879
19349 -69879 -187548 -277138 -53668 -30227 -436203 -63051 -427504 259943 260080 -137722 -265437
19338 -265437 242230 -145882 210405 146060 -216912 -112397 -328584 185246 113218 82939
19328 82939 142110 -430336 -38451 -160903 -41623 105341 -263076 171080 -191253 74713
19317 19200 236697 -105881 -366745 -331317 -232232 14130 11527 -8758 -84158 -161355 200753
19305 35864 178772 35320 -86718 -158711 39770 365458 173634 -251392 -67696 102469 128295
19294 128295 -49626 238139 184267 155074 -234529 277370 -164230 -191262 -25547 75530 127154
19283 127154 20133 -101859 -108509 -359233 -17512 62480 1723 104461 -80124 95660 6052
19271d33342A05084d01583E5538L25827f3374k3542d3365B607b55421K6039C254
19259a55303p3020A54663g562k23783A86921n1895f298q6664L4708l33169B45562
19247C0040a81013F2343M3615l8337K11948j07134j627G4107a16110B76948b42681
19235b01280F0841a94109i6017j67056d2408p4667d3427L962k51343a25482m89083
19224f14565K89186a17283n4845k9998g931k21512A22010d06470R2436I3502k0266
19213G3236a5706A18124p849g8654o2737b0702j72995Q476A24784C9471b68412
19201b6691A8978b1326q7439j58011f7514K5654r8673J9151B7535e4558k20621
19190b75179h2851E495Q0285B075a10057l08534g4119j36189C74b89153k3731
$$ plain form
19271 -433342 105084 -401583 55538 381365 -63374 -86916 -43365 2607 -255421 -229382 3254
19259 -155303 -228323 154663 -7562 -231345 186921 135026 -6298 -92962 -58254 -391423 245562
19247 30040 -181013 62343 105958 67621 279569 172435 170808 74107 -116110 276948 -242681
19235 -201280 60841 -194109 -96017 -263073 -42408 -117075 -43427 -39465 -290808 -125482 -614565
19224 -614565 -325379 -117283 -172128 -202126 -7931 -229443 122010 -406470 -314034 93502 73236
19213 73236 -15706 118124 110275 -78654 -141391 -20702 -193697 -185221 124784 39471 -268412
19201 -26691 18978 -21326 -108765 -266776 -67514 -41860 -140533 -121382 27535 -54558 -275179
19190 -275179 -82851 5495 85780 2075 -110057 -418591 -74119 -210308 374 -289153 -312884
19179c12884h9673G8768a83313C14400a53400k82061G6715h4432n6214A51195
19168b41356P6989A32086m878j9747a09537B41007a55384C1110g3547b4115j42987
19157a67102k5508k01424H5897c1200A26289a02030D7840a15521D5465q992O5572
19146A02045g1888C0887K7042b89093A28186c02636a21880D2567b65543b8577
19135a28891A14460n2261b3365A06924m6558K7070g7087K5670r4995j32455A45021
19123b28371l6422B12762F1809a78228j66005G4581A4387c3182j09704l5180o5765
19112b43831g9716G1752M0643c65310f6108j97657o4765B2723L76114a73753j44736
19101c18489G2612f1203j5901r8470K3483N990m8299A25785f2403k60248F9380
$$ plain form
19179 -312884 -89673 78768 -183313 314400 -153400 -435461 76715 -84432 -140646 151195
19168 -241356 -164367 132086 127208 107461 -109537 241007 -155384 31110 -73547 -24115 -167102
19157 -167102 -192610 -394034 85897 -31200 126289 -102030 47840 -115521 45465 36473 102045
19146 102045 -71888 30887 57929 -289093 128186 -302636 -121880 42567 -265543 -28577
19135 -128891 114460 62199 -23365 106924 60366 87436 -77087 -51417 -146412 -278867 145021
19123 -228371 -264793 212762 61809 -178228 -344233 74581 14387 -33182 -142886 -178066 -243831
19112 -243831 -79716 71752 112395 -365310 -66108 -263765 -328530 22723 398837 -173753 -318489
19101 -318489 72612 -61203 -77104 -175574 -152091 -146101 -194400 125785 -62403 -322651 69380
19089H3320l8556b99713b7507C2757e0252a092j32794e079A44882F6471j2113
19078E4358a50218g4357l37837b3598j20001B18005P4655i6546N051E1023d05365
19066f9501d724j39556B8195b9622m2914B94007a38225A08632Q2292L304a9069
19054F711a11376k21742C7402a09952C13364E2215P7397a44018C9650a44508G9038
19042A55429b11476g1172A04782J66053F3503i5151j55556k4496A92206a27438
19031B53347b64134I4509R9033a98241B56638E6267J74344l0779E7206P9639g4225
19019a17970B23513M7577b47159e8504A22333m9825l5757a8252l96787H0191a42888
19007d65639A7506c60257i792G0487C399P1443c3493n0840j51060f6759L477C401
$$ plain form
19089 83320 44764 -299713 -27507 32757 -50252 -1092 -133886 -5079 144882 66471 54358
19078 54358 -150218 -74357 -412194 -23598 -143599 218005 292660 -96546 -91495 51023 -405365
19066 -69501 -4724 -144280 28195 -29622 -72536 294007 -138225 108632 190924 194228 -19069
19054 6711 -111376 -333118 37402 -109952 313364 52215 129612 -144018 39650 -144508 79038
19042 155429 -211476 -71172 104782 270835 63503 -95151 -250707 -275203 192206 -127438
19031 253347 -264134 94509 193542 -198241 256638 56267 230611 199832 57206 136845 -74225
19019 -117970 223513 271090 -247159 -58504 122333 72508 36751 -18252 -415039 80191 -142888
19007 -465639 17506 -360257 -9792 70487 3399 74842 -33493 -84333 -235393 -66759 -63282 3401
18994c29100o8000B84231I8125b94664a13973k08961M5517C55857a31347C8843
18983H5747K6804b23214M2903O3020j5942A53310a38019n5501j26440a8128o1184
18972g9312L5371P116D4598a70576A08065J80757c920j37880r6945B4532a05791
18960b08604K5624O5989A29582d3775B05208m5405K86072A14020b99659E9705
18949G0704P487f4253j75779C0598a46341B50408a06724G7671d6660A21121b15743
18937i331k95088A57209i2856c9231A54293n9099d09100h8090j7035k86685g2533
18925I8423k4922j6516O8060b2977j23111M7836p1917H223M4190f092B8491d41374
18912c50451J60533R0240J0854C7065J24051a79581A65090q1134e63890a73931
$$ plain form
18994 -329100 -397100 284231 98125 -294664 -113973 -322934 -277417 355857 -131347 38843
18983 85747 112551 -223214 -180311 -117291 -133233 153310 -138019 -193520 -319960 -18128 -79312
18972 -79312 -43941 -36825 44598 -170576 108065 288822 -3920 -141800 -238745 24532 -105791
18960 -208604 -182980 -116991 129582 -43775 205208 159803 445875 114020 -299659 59705
18949 70704 78191 -64253 -240032 30598 -146341 250408 -106724 77671 -46660 121121 -215743
18937 -9331 -304419 157209 -92856 -39231 154293 95194 -409100 -88090 -105125 -391810 -72533
18925 98423 73501 56985 125045 -22977 -146088 -98252 -170169 8223 52413 -6092 28491 -441374
18912 -350451 -189918 -99678 -88824 37065 161116 -179581 165090 83956 -563890 -173931
18901C0334a62303j18289A50553c04530R8019j4232K6784I9601d4334A83535a14341
18889f6307c0922G2317J18391k3584J38960a04965l170C94908c2849E8431b36790
18877A32767a74189j8752l8112a11253N0536k19242g4255j3162A31020b64503
18866g3414k58900B1154e3810j67251f8103I9687M3823f582l3272n4477C74667
18854i0485A9794O0679N5067D1063f4313j92722L6937A73062n234L7396b46363
18842a70210L8115k2267j88285I411J26515e2481B73884a11671d7663m8329a6588
18830A20928k4251a70060B39771i1602G2533b90747A076i2088E6497L06741r2576
18819B70662p1193I4413m2751e8343m512a8491j83711D29b39113E186L9309d2253
$$ plain form
18901 30334 -162303 -280592 150553 -304530 -206511 -220743 -193959 99601 -44334 183535 -114341
18889 -66307 -30922 72317 190708 167124 306084 -104965 -108135 394908 -32849 58431 -236790
18877 132767 -174189 -192941 -231053 -111253 -60717 -279959 -74255 -87417 131020 -264503
18866 -73414 -332314 21154 -53810 -221061 -68103 99687 143510 -6582 -39854 -94331 374667
18854 -90485 19794 80473 135540 41063 -64313 -257035 -220098 173062 167828 205224 -246363
18842 -170210 -132095 -154362 -342647 9411 135926 -52481 273884 -111671 -47663 -95992 -16588
18830 120928 96677 -170060 239771 -91602 72533 -290747 1076 -92088 56497 363238 270662
18819 270662 199469 94413 51662 -58343 -62855 -18491 -202202 429 -239113 5186 44495 -42253
18806B46385g957p6094k76085N5690L0841A41685E7966d12065I0500J90142d17919
18794B22982b78678k38A50876a6115q2203c2701o3769o151l3630B81673b84464
18782c10261D3949i9979E1193j384a71299j47095a46784j17998a9292j52857j01902
18771b74051D9832i5045o734j76649A68526c22670D5658P8168a64777e3895j51458
18760b05353P2266k71159J21448F9391h7622A19892b25645A7071K05536F5350
18749e7183k657r9400e6962a3906l3671n9769k14793D2874R3876b98685e3427
18737b39247H8392a49486i945o4600a4120l8433A70499B3568i0674D54971f6268
18725a05307H2545a64361A71137a1757b635k91385B98343A30670M4747E9758J62377
$$ plain form
18806 246385 -7957 -84051 -360136 -304446 -273605 141685 57966 -412065 90500 280642 -417919
18794 222982 -278678 -278916 150876 -16115 -98318 -32701 -96470 -102621 -136251 281673 -284464
18782 -310261 43949 -99979 51193 49809 -171299 -318394 -146784 -264782 -19292 -172149 -274051
18771 -274051 49832 -95045 -101779 -278428 168526 -322670 45658 123826 -164777 -53895 -205353
18760 -205353 -133087 -404246 -282798 69391 -87622 119892 -225645 17071 222607 65350
18749 -57183 -59840 -159240 -56962 -13906 -47577 -107346 -322139 42874 136750 -298685 -53427
18737 -239247 88392 -149486 -9945 -74545 -14120 -52553 170499 23568 -90674 454971 -66268
18725 -105307 82545 -164361 171137 -11757 -2635 -294020 298343 130670 175417 59758 222135
18714B22135b26925P9003c6600j48820A11203g6156D8391a40149M5142K1797k19377
18703b92587a09371l9270A37803b63697f0266o4241j45000k9290C6052L7386e4997
18691C2644h7023M2231j03640b7503g23j99258A46472e6661A3969b46755I4488
18679a79768F2066a8181j51472b5173B4948d70703B06657A7533b7671k50050E7666
18667B88590A15245c23049a43115B5467L22412A36030b23934J631h3719r0421
18657a74140A63966d19446J5516D7503d33171B0577h2513K1300A59240a40587
18646e086C6237b59562J00378A4144b18994i5402L2350B70379j22980a52317f4932
18634a93456A07680j0270R9336J89234f1521k42368d6492C4101J39788d1296k1308
$$ plain form
18714 222135 -226925 -147922 -36600 -185420 111203 -76156 48391 -140149 -95007 -73210 -292587
18703 -292587 -109371 -148641 137803 -263697 -60266 -124507 -269507 -298797 36052 73438 -54997
18691 32644 -87023 -44792 -148432 -27503 -723 -199981 146472 -56661 13969 -246755 94488
18679 -179768 62066 -18181 -169653 -25173 24948 -470703 206657 17533 -27671 -277721 57666
18667 288590 115245 -323049 -143115 25467 347879 136030 -223934 -222303 -83719 -174140
18657 -174140 163966 -419446 -403930 47503 -433171 20577 -82513 -61213 159240 -140587
18646 -5086 36237 -259562 -159184 14144 -218994 -95402 -63052 270379 147399 -152317 -64932
18634 -193456 107680 97410 196746 385980 -61521 -303889 -46492 34101 173889 -41296 -62604
18623f2604p2854P663I688a35230A64395O8750a82361P8954M4423j66082A5035
18611d34097B83050f0169B26391c31257i4590k48637a58982I573L21314h4925
18600b04637f4524G9898a6303j86949C9884J51579C185K25790c36824f6698G785
18588a38496c6282k07747C0092c7905A19707l2768b13008d538k6406G3800a94553
18576G3777a35593O1430k72780e6612m1025A94505b08746I7977b57208C3301L77169
18565D10470B03646a4216A85829b4743A20347J27272c0046k6534j96053B394g082
18553A41075o5059b76148I3304m4696K77638F5163k4236b23641J05392e7852G3523
18541a20923F9793b8867B7961d44329K15103R7113k28113A6790O8197b4670F2300
$$ plain form
18623 -62604 -135458 -127795 9688 -135230 164395 233145 -182361 -103407 -58984 -225066 15035
18611 -434097 283050 -60169 226391 -331257 -94590 -343227 -158982 9573 330887 -84925
18600 -204637 -64524 79898 -16303 -203252 39884 191463 3185 228975 -336824 -66698 7785
18588 -138496 -36282 -244029 30092 -37905 119707 86939 -213008 -4538 -30944 73800 -194553
18576 73777 -135593 -74163 -346943 -56612 -97637 194505 -208746 97977 -257208 33301 410470
18565 410470 203646 -14216 185829 -24743 120347 247619 -30046 -56580 -252633 2394 -7082
18553 141075 76016 -276148 93304 48608 326246 65163 40927 -223641 -118249 -57852 73523
18541 -120923 69793 -28867 27961 -444329 -229226 -132113 -360226 16790 84987 -24670 62300
18529C08020b188j83789B3883J67135O5533H5728J27371a78074j6330a8678r1278
18518a09956B3914b08602e1056B16650a59809j9851q236p8030L1303E2545g386
18506C38392A29754b18386A23912c37681J21821A84747a71075B3430b94509B51436
18495b8097j80692B3612b00203B30725b258E7854g2700j0288k75907G2897B7253
18483e9901C1025b268j83539j96846a15111A6901K16213d6144C4563a59893A1815
18471a00157k5387H1973a57355j5691N4579N5174k6860K6025B19238H0016K6746
18460A06762b38591a12629d379j3427l5048o1449F6534f0034j1564B77229e2322
18448c03562a00986G9603i2874B60893a73001a0478B1126c05920r7192A14028
$$ plain form
18529 308020 -2188 -185977 23883 191018 256551 85728 213099 -178074 -194404 -18678 -109956
18518 -109956 23914 -208602 -51056 216650 -159809 -179660 -187896 -265926 -234623 52545 -7386
18506 338392 129754 -218386 123912 -337681 -215860 184747 -171075 23430 -294509 251436
18495 -28097 -208789 23612 -200203 230725 -2258 57854 -72700 -82988 -358895 72897 27253
18483 -59901 31025 -2268 -185807 -382653 -115111 16901 233114 -46144 34563 -159893 11815
18471 -100157 -125544 81973 -157355 -173046 -118467 -63293 -90153 -64128 219238 80016 106762
18460 106762 -238591 -112629 -4379 -17806 -52854 -114303 66534 -60034 -71598 277229 -52322
18448 -303562 -100986 79603 -92874 260893 -173001 -10478 21126 -305920 -403112 114028
18437b18112J05895j9746A45396f2579j10957N0014A11983a81872n0422k07384
18427d39678b6197m4846a1684k24473K6747c2j52322k20730A19443a5406m522
18416a9928j79804H238K72603b1938n3356A99141G1020a77447e2124j06502o0849
18405b19475e8640n6873a522G5758C1538a31620j90465d4664j87505a05499B15266
18393d3689F0233J91558B7661a75142P9581k76968N9198B10762m7161a04245B0092
18381G5727K8221L7374c0473j77677N567G6599a61178b9654k71859B75797A01589
18369b80337j05928o6886A10333A0981g4700D7003d2661B6359g6108F4805J58801
18358B23606e44062a68606j432E3274b1175j10440C1308c6239n3713K0783j38413
$$ plain form
18437 -218112 -112217 -131963 145396 -62579 -173536 -123522 111983 -181872 -232294 -439678
18427 -439678 -26197 -71043 -11684 -236157 -209410 -32 -152354 -373084 119443 -15406 -19928
18416 -19928 -199732 8238 280841 -21938 -75294 199141 71020 -177447 -52124 -158626 -219475
18405 -219475 -58640 -115513 -1522 75758 31538 -131620 -322085 -44664 -232169 -105499 215266
18393 -43689 60233 251791 27661 -175142 -95561 -372529 -313331 210762 163601 -104245 20092
18381 75727 103948 141322 -30473 -208150 -202583 76599 -161178 -29654 -301513 275797 101589
18369 -280337 -386265 -453151 110333 10981 -74700 47003 -42661 26359 -76108 64805 223606
18358 223606 -544062 -168606 -170038 53274 -21175 -131615 31308 -36239 -89952 -69169 -207582
18347b07582i3230G736a6442H4387a4163E7887i1825q7843C04608b2224o5296
18336h7520j60743a6796m87873F0092L7739N1591m8344c7598A68252E7033b22765
18324b99029b068A42817N006D4366a42379f0928A44614E7914k7170b4420A19734
18312C5873c5449q7463k35095a8335A8344b33663D3124M7328h0221B01010J56315
18301C57325a71606M6732A40449K80895a91619P5756N239D2355M22676c90146
18290D79a28541O0861d04I6595L2241b26051h2793B27153E1057a637j74002D9402
18277A68256L0062a07421M4134K5588j8438F7655f7502E9552i0255A13000l5201
18266G7799B7476G140N5760i6060F4792b04142C9641a66201j86610B06725a32964
$$ plain form
18347 -207582 -93230 7736 -16442 84387 -14163 57887 -91825 -179668 304608 -22224 -87520
18336 -87520 -248263 -16796 -504669 60092 97831 149422 101078 -37598 168252 57033 -222765
18324 -299029 -2068 142817 147823 44366 -142379 -60928 144614 57914 30744 -24420 119734
18312 35873 -35449 -122912 -358007 -18335 18344 -233663 43124 90452 -80221 201010 357325
18301 357325 -171606 -124874 140449 421344 -191619 -115863 -110624 42355 465031 -390146
18290 479 -128541 -67680 -404 96595 128836 -226051 -82793 227153 51057 -1637 -175639 49402
18277 168256 198318 -107421 -63287 -37699 -56137 67655 -67502 59552 -90255 113000 77799
18266 77799 27476 7140 62900 -96060 64792 -204142 39641 -166201 -352811 206725 -132964
18254H351c4248j10631k7065A02728e5450k63080a45656j01250C27047k3190a79068
18242a77914o2258l3564a00065A10704a5359l62162A26452J3677n4711b157n2680
18231e4837o1978a8478F1596c7264G7919k7019J4750b92098i7068H3499e4276
18219a31532N8733A52501i2405j9024m5026A86349N4054e3748A82548c67638f5804
18207a42935b6089r4931A38257b14653A51815c38310A83747b41903f5251a4034
18196G5656a34191k9358C12729c6267F5687O3417a91603e2666H2062J19579G5799
18184a85909e6813k12293J4811J13742K1922c1099k49099B04141c13374P5382
18174b37992N4084D0588b31378b4550j62932b4768k41757i3007n7131C5541K98811
$$ plain form
18254 8351 -34248 -144879 -171944 102728 -55450 -318530 -145656 -246906 327047 303857 -179068
18242 -177914 -240172 -273736 -100065 110704 -15359 -377521 126452 140129 85418 -2157 -54837
18231 -54837 -116815 -18478 61596 -37264 77919 50900 65650 -292098 -97068 83499 -54276
18219 -131532 -72799 152501 -92405 -111429 -156455 186349 240403 -53748 182548 -367638 -65804
18207 -142935 -26089 -121020 138257 -214653 151815 -338310 183747 -241903 -65251 -14034
18196 75656 -134191 -163549 312729 -36267 65687 129104 -191603 -52666 82062 201641 75799
18184 -185909 -56813 -269106 -254295 -140553 -118631 -31099 -280198 204141 -313374 -237992
18174 -237992 -183908 40588 -231378 -24550 -187482 -24768 -266525 -93007 -150138 35541 334352
18163C34352b52497j11853J25262A27515K5701a1107B15127a16006K8581B19478
18152a16988j09584P2432j21874A75758G7142b15617e6120G3881J6018h6094A1057
18140b21451A2972P8527N3987i9418j8894p6242D5121L51688a71691C15065I6052
18128H9544b84798b9770A15255Q5915b29898N8080j02951e9825J4076I7958C1847
18116b31068j85503C54588A47666i2534B15873n7877Q3242c5635B01133F8952
18105A91955h9178A42147c7136H8328b8456k09991L9243H7326a98873N2523C14996
18093A41705o8791b7398A10330a93238G0962c404G4156g0971p2525l9652j30570
18082c13718C1955a87852Q6644k46636E4831J7718a6451C17148g0276E7804J58060
$$ plain form
18163 334352 -252497 -364350 -239088 127515 153216 -11107 215127 -116006 -87425 219478
18152 -116988 -226572 -154140 -276014 175758 77142 -215617 -56120 73881 89899 -86094 11057
18140 -221451 12972 91499 145486 -99418 -118312 -194554 45121 396809 -171691 315065 96052
18128 89544 -284798 -29770 115255 201170 -229898 -171818 -274769 -59825 -45749 97958 31847
18116 -231068 -416571 354588 147666 -92534 215873 157996 241238 -35635 201133 68952
18105 191955 -89178 142147 -37136 88328 -28456 -238447 -199204 87326 -198873 -146350 314996
18093 141705 72914 -27398 110330 -193238 70962 -3404 74156 -70971 -143496 -183148 -313718
18082 -313718 31955 -187852 -101208 -347844 54831 72549 -16451 317148 -70276 57804 215864
18071B15864j03899M2492o9589a06158A78161f1694C57150a24233B45753O6328
18061C12081b77739G5778d7460k81036C6887a89814A03068c2076B6936J16712
18051A43648c4210A65150g1115M490r367A24770g9716L7088o7947C34866A7838
18039b22815g9492H6123J74454A1062a33009B37724K66645D7795a83161N2992
18029a30169E1530j7811a69688J296A77543c3927q0240j40362F1438a60674B50967
18017d9113B4237N906h901B74878a17769c5339j16191e2863j46750m0090B90027
18005A60395F2130a55851l74448C82335j22436i4890j19415d5457j09319k37686
17995c92462H8707J67414l7942q2556a06525A72385J03710p6871P1720b32568
$$ plain form
18071 215864 111965 154457 84868 -106158 178161 -61694 357150 -124233 245753 312081
18061 312081 -277739 75778 -47460 -328496 36887 -189814 103068 -32076 26936 143648
18051 143648 -34210 165150 -71115 -66625 -75992 124770 -79716 -42628 -110575 334866 17838
18039 -222815 -79492 86123 260577 11062 -133009 237724 504369 47795 -183161 -130169
18029 -130169 51530 33719 -169688 -168392 177543 -33927 -114167 -254529 61438 -160674 250967
18017 -49113 24237 30143 -8901 274878 -117769 -35339 -151530 -52863 -199613 -239703 290027
18005 160395 62130 -155851 -530299 382335 259899 -94890 -214305 -45457 -154776 -392462
17995 -392462 88707 256121 218179 135623 -106525 172385 276095 199224 270944 -232568
17984a96882B20602A01690a44143G7556I215g1172B50376A01747a11223a1630
17973a69897F3063h9754G3048M1022a04651c3813r200g354j43714g1221j95392
17962b66613i8468A39760d3296j30113e6497A17055a54304j173L5029j66440C75579
17950B09988A373J46823g9228D2905R609d59895g6158j14514A93975q4748i5220
17938A46089R8627r0598b48032H4537M6514j3442a98164e834j32024A65822C0423
17926A17185h535A47595i8084b1770A24775b7031A07740c521n0467j58286i1763
17914d1834p7590A63433k6992d63174i6422I85b36233N0399G2405a71327g5831
17902B29989l2538B7315P3001c32215A5766g0286A88410a01218m1662h9j07052
$$ plain form
17984 -196882 220602 101690 -144143 77556 9215 -71172 250376 101747 -111223 -11630
17973 -169897 63063 -89754 73048 114070 -104651 -33813 -43013 -7354 -151068 -71221 -266613
17962 -266613 -98468 139760 -43296 -173409 -56497 117055 -154304 -155477 -120448 -286888 375579
17950 209988 1373 148196 -79228 42905 52514 -459895 -76158 -190672 193975 109227 -95220
17938 146089 244716 154118 -248032 84537 131051 117609 -198164 -5834 -137858 165822 30423
17926 117185 -8535 147595 -98084 -21770 124775 -27031 107740 -3521 -53988 -212274 -91763
17914 -41834 -119424 163433 136441 -463174 -96422 985 -236233 -185834 72405 -171327 -75831
17902 229989 197451 27315 100316 -332215 15766 -70286 188410 -101218 -142880 -89 -107141
17891a07141B23973F1644k458M84779b72382i3417A6755c36587i2485G0755O0651
17880A31406J56780j25567i5821k8802B6395J92849e9945K8261B9873L57594f6544
17868a57529G8021M60950e0838a9243r9770j50892A38169j625J18410l10q5342
17857A69302g1521a1414p2976J514I1584Q1842L614a90653k18777h2366K1384
17846f0982H0032a4656k8333p4348A71506J8926e4591E9548a15921e3538A68837
17834c6399C2788J06719c9535j80877a9271G393N4983a09274E3312j1894R0058
17823A31476R590B8561a07760o3816D13897A84524J45073h202p612B37765c41859
17811C92362c9348j14770c7859k9377C0792M4364P9990a5290k5031j94457i9072
$$ plain form
17891 -107141 223973 61644 59186 543965 -272382 -93417 16755 -336587 -92485 70755 131406
17880 131406 288186 162619 -95821 -124623 26395 219244 -59945 -31684 29873 387467 -66544
17868 -157529 78021 538971 -50838 -19243 -119013 -269905 138169 136544 254954 254644 169302
17857 169302 -71521 -11414 -84390 -82876 91584 173426 177040 -190653 -409430 -82366 -60982
17846 -60982 80032 -14656 -42989 -117337 171506 190432 -54591 59548 -115921 -53538 168837
17834 -36399 32788 139507 -39535 -220412 -19271 7393 62376 -109274 53312 41418 131476
17823 131476 141066 28561 -107760 -171576 413897 184524 329597 -8202 -15814 237765 -341859
17811 392362 -39348 -154118 -37859 -67236 30792 75156 155146 -15290 -40321 -234778 -99072
17799d8211j1648j96389g7667j42181A53531g0688b4136j29B7869J33214a70733
17787I3666h1902k15859D61195E3438g5639q6478c5020A47142e1990r4812B09297
17775d0816j8842j46560A71247e1350m32990C6812L72446b33266A42253J0083
17765A52336e7742h39C11941m3664G8357M2868B5584J01671j7600d4195B40610
17753C86088j55135h6283B34804g1158o6913C5234b22122J03573F542J7200K9957
17742E3699O6857A5638a18397K0236B40487J3032E0751a24042J6046M8380l06734
17731c66350J82301B684J83703L14432h0952j41848B07826b3955A6145J7355c7347
17719E4814a53264j6320B02466a26836D00900A00975K0206b77025A83737J44560
$$ plain form
17799 -48211 -59859 -256248 -77667 -219848 153531 -70688 -24136 -24265 27869 161083 -170733
17787 93666 -81902 -297761 461195 53438 -75639 -162117 -35020 147142 -51990 -146802 209297
17775 -40816 -59658 -206218 171247 -51350 -484340 36812 409258 -233266 142253 152336
17765 152336 -57742 -839 311941 268277 78357 121225 25584 127255 109655 -44195 240610
17753 386088 230953 -86283 234804 -71158 -138071 35234 -222122 -118549 6542 23742 53699
17742 53699 120556 15638 -118397 -98161 240487 253519 50751 -124042 -107996 -59616 -366350
17731 -366350 -184049 2684 186387 500819 -80952 -222800 207826 -23955 16145 33500 -37347
17719 54814 -153264 -169584 202466 -126836 400900 100975 121181 -277025 183737 328297
17709C28297I9443b63769C8299J03779K25368A46192m8906K0012l9776J98816
17699B76338G8565a75572A14793a35301A67436O5243d8395j08044H9560b66807
17688A93643p6763d5338H5030a97662A71513o0154B4245a89756B38386E1870L09040
17677C60910j31023O7212b24453A12581j6515b40110A4459J06940b93073m4115
17667c37188D0574f3998a0415o823B23573B1837J256e0074A92851b1463I941a05808
17654a14092l15856a52273j1186K7430d105j41107j20862j07472H2521a30417
17643a30967A40948n8115i9358j33486H7700N3607K4273D0538a0534n037A83274
17631h0746c5728J775A05075a20327d6438E8317d8345H9943a37238L0168j78148
$$ plain form
17709 328297 99443 -263769 38299 142078 367446 146192 97286 117298 77522 276338
17699 276338 78565 -175572 114793 -135301 167436 232679 -48395 -156439 89560 -266807
17688 193643 116880 -45338 85030 -197662 171513 111359 24245 -189756 238386 51870 360910
17677 360910 229887 297099 -224453 112581 96066 -240110 14459 121399 -293073 -337188
17667 -337188 40574 -63998 -10415 -17238 223573 21837 23093 -50074 192851 -21463 9941 -105808
17654 -114092 -429948 -152273 -163459 -136029 -4105 -145212 -266074 -373546 82521 -130417
17643 -130967 140948 82833 -99358 -232844 87700 141307 165580 40538 -10534 -15571 183274
17631 -80746 -35728 -33953 105075 -120327 -46438 58317 -48345 89943 -137238 -107070 -285218
17620b85218F5473b06377B29694a23798M1021A52826P9185b87993B77305f6984
17609D46871k22835c71823A29310c99447g6435j80918a03694G6107G988a55246
17598A09456m3325L72330k123k12228a01160A0677L64398r0258d5897D41278E201
17586b1878g884G4271k487J27998a58764A43586a98887O7806I7888J39942G5030
17574B77160j20068m549J74575a47730f0703B81758a10409k56949C34565a05450
17563e3929B60899l8055q8525a74176A74374l9453G611i2727C3703J97903D4525
17551a02815Q329P970A10596a26739F3614j4190R8338f6003K1089A14357g1340
17539a00417B05632e7940k1510m6879A48640E2508N9384d098j67447A70548a62567
$$ plain form
17620 -285218 65473 -206377 229694 -123798 -82777 152826 232011 -287993 277305 -66984
17609 446871 224036 -371823 129310 -399447 -76435 -257353 -103694 76107 7988 -155246
17598 109456 66131 438461 436338 224110 -101160 10677 375075 284817 -45897 441278 5201
17586 -21878 -7884 74271 71784 199782 -158764 143586 -198887 -131081 97888 237830 75030
17574 277160 157092 152543 327118 -147730 -60703 281758 -110409 -367358 334565 -105450
17563 -53929 260899 222844 134319 -174176 174374 134921 7611 -92727 33703 231606 44525
17551 -102815 -94486 -86516 110596 -126739 63614 49424 147762 -66003 -44914 114357 -71340
17539 -100417 205632 -57940 -79450 -126329 148640 52508 111892 -4098 -171545 170548 -162567
17527D6168A3942c458l50834A08459Q2752L1769F7928c3356C08599A3507K0654
17516C4161J39215Q331F7681M0330A9076b25678B97655A07596O9488b50359a04120
17504A31839n2952J43924J97222b13295A36283o6780b9267D0227E421i0798C19807
17492C7859a63313j5230j37379b5142B58204H1296K95400a99229A37660c5600
17481A82231p9929a05195E8952L06321f3154C30142P0570I7977K15794c3609Q217
17470b5392A42134N3361k4750R985D6612P9021m8660a93239C3738p01a47969E8630
17457c5B51656H7252K02953r8180f2317A35078E1858Q4096K09230j37906J16003
17446C23281J83573k15720K08517E7788K33677o6582J79893j3014A07496k2195
$$ plain form
17527 46168 13942 -3458 -354292 108459 191211 222980 67928 -33356 308599 13507 34161
17516 34161 173376 181707 67681 108011 19076 -225678 297655 107596 177084 -250359 -104120
17504 131839 78887 222811 420033 -213295 136283 69503 -29267 40227 5421 -90798 319807
17492 37859 -163313 -178543 -315922 -25142 258204 81296 376696 -199229 137660 -35600
17481 182231 102302 -105195 58952 365273 -63154 330142 400712 97977 313771 -33609 -25392
17470 -25392 142134 195495 170745 180730 46612 125633 76973 -193239 33738 33037 -147969 58630
17457 -35 251656 87252 290205 192025 -62317 135078 51858 135954 345184 207278 323281
17446 323281 506854 291134 499651 57788 291465 224883 404776 391762 107496 85301
17436H5301M8497L8293k1547J38002J68307A28478a66681D00668p8696c663m9769
17425e3432H102M13346B03901N9772P4000b7574A40749K11171A00007J96338L9286
17414C35631O2227K20448a58978M7274B34197A12805C1735K49562J15174a19815
17403C86034E1218p71a0651B88845a21336A07512J24435F1653K06369G7002j2527
17392F4475Q287K02447n5889I0520M10060b3464A1836J13887L9804C1680L64194
17381C95874H2498O0602K99203a0983A23983E6095M84414j12404b79811a05259
17370A48477B7314L39052I9225P8604l5851B1934N18518G6804R2655Q8906J51368
17359D09733A63677p8257K52303A51226N1626J44288A03614r345D6084J19051
$$ plain form
17436 85301 133798 172091 150544 288546 456853 128478 -166681 400668 321972 -3663 -53432
17425 -53432 8102 421448 203901 263673 337673 -27574 140749 351920 100007 296345 335631
17414 335631 397858 618306 -158978 -111704 234197 112805 31735 281297 396471 -119815
17403 386034 51218 50447 -10651 288845 -121336 107512 231947 61653 268022 77002 64475
17392 64475 72762 275209 219320 90520 500580 -23464 11836 125723 165527 31680 395874
17381 395874 82498 143100 442303 -10983 123983 56095 540509 428105 -279811 -105259
17370 148477 27314 366366 99225 177829 141978 21934 540452 76804 169459 258365 409733
17359 409733 163677 85420 337723 151226 202852 347140 103614 94269 46084 165135
17349A65135r407h881r4907k0141B3890J5121K85046n1789K7295J46734A22341
17337I6395A9780f958E59950j28293b5897A33862B7746b4725C43039c06984A78749
17325b6520A3545K3981O3842A7859L63282j01856r9675N6513K13342b2249A03606
17313C05901E8056J03838b9727B35987F3231L64936A08723b4324I5860J28789
17303B24649J983D5422a03836k3963B75470o5691l5944c0155A41570L7157b1238
17291B74115j06476J10576a22732D5262J00598m306k2784K4881o8919o848J63492
17280B31376P4428A6852c4655A34407E2032K27495P1923j70699c1323C41672I9829
17268a08700B54795G8945R4164j3032j0226l7685d6317B46298g392A07089K70464
$$ plain form
17349 165135 155728 -8881 -103788 -123929 23890 39011 324057 272268 299563 446297 122341
17337 96395 19780 -6958 559950 431657 -25897 133862 27746 -24725 343039 -306984 178749
17325 -26520 13545 37526 101368 17859 381141 279285 179610 236123 449465 -22249 103606
17313 305901 58056 161894 -29727 235987 63231 428167 108723 -24324 95860 224649
17303 224649 226632 45422 -103836 -127799 275470 209779 173835 -30155 141570 178727 -21238
17291 274115 167639 278215 -122732 45262 145860 141554 118770 143651 74732 67884 231376
17280 231376 305804 16852 -34655 134407 52032 279527 351450 180751 -31323 341672 99829
17268 -108700 254795 78945 173109 160077 149851 112166 -46317 246298 -7392 107089 377553
17257C77553K47510A1035P0229j7299N8650J14205L2971I2912N76455j26347H5821
17245B65314C9990L90962I2651Q3624q7754l6180L65913A88090E7349J39692L429
17234B00470N4916o7439K11008m9350R2765p311j64004A28900J21020B3149M33596
17223D56745A17311b1848G4119N0280K55715K41860B08869H0039L89875e8343
17212B72101G8662J69987F9380J74236E2082N30456F6870L03804j48323L9308
17202B61659K2106L6162i98C17976A19342J84285j06026J866K26207j42562J52996
17191D36108j31078O39798c128A85570R8351j04078O451A7008L01722f3035A65411
17179C55741A62112K48608n0351n9091m5815n8347M88847A46325K79379A41793
$$ plain form
17257 377553 625063 11035 81264 63965 122615 236820 269791 92912 669367 543020 85821
17245 265314 39990 430952 92651 176275 88521 52341 418254 188090 57349 197041 200470
17234 200470 255386 187947 398955 349605 442370 435059 271055 128900 249920 23149 456745
17223 456745 117311 -21848 74119 124399 380114 621974 208869 80039 469914 -58343
17212 272101 78662 248649 69380 243616 52082 582538 66870 370674 222351 261659
17202 261659 283765 319927 -998 317976 119342 303627 197601 199467 425674 283112 436108
17191 436108 305030 944828 -3128 185570 283921 179843 186294 17008 318730 -63035 165411
17179 355741 162112 410720 360369 301278 255463 197116 685963 146325 425704 141793
17168C51940A00379L40249k06926J26967O5752j9472K74213l14358j32118J58993
17158C93679A57530J89297K2857I1868c706A82163h7B65112J56222p7784J40458
17147D84008j25598J41286E433M70311j02192J0285N1981f2046A45693L38095
17137D83788j27296J15146k19537J70086A85064L00312A52577L52314J32738B9057
17126A40680L36771j6626j94819K0596b6383C29384M5716K0200j88620J77873
17116C84553M0137k8755p6484L15760j42763P2822r1349j53017K14739j36874
17106C98769A98294r709o1681J71753I0833M28683A87220M90032A96109L72820
17096E68929j16041J12983k28723Q4260M6775A86042L18044N7177J30057j83448
$$ plain form
17168 351940 100379 440628 233702 360669 426421 406949 681162 366804 234686 393679
17158 393679 157530 346827 369684 91868 -3706 182163 -87 265112 421334 343550 484008
17147 484008 358410 499696 5433 475744 373552 383837 435818 -62046 145693 483788
17137 483788 356492 471638 252101 422187 185064 485376 152577 504891 637629 29057
17126 140680 477451 460825 266006 286602 -26383 329384 375100 395300 206680 384553
17116 384553 424690 395935 319451 635211 492448 565270 473921 320904 535643 398769
17106 398769 198294 188585 126904 298657 90833 519516 187220 677252 196109 568929
17096 568929 452888 565871 337148 421408 468183 186042 504086 561263 691320 507872
17086E07872m6358j19299j5450K31768K16658j75252q2381j54829K17667l4948
17076E45448J01776k58464L92674j99223j79795A35153L72077l567B38033o2751
17066A75282J24240r2326L15913A64190L72271R8236A34216L77554R2418r9436
17056E04752J26558l1755j36621J59741k9097J2393P9598L57352m66676l6761
17046E39484l6447K86143C88159L62753j37538L59970k45512k25187j4253l6794
17036D51598J58401m7823J00141P8305k15309r578K14946j38045q3590J67446
17026F76492l0126L9993k06952K08914j9885M79388E58166M5355K08642j53237
17016F58926K63345D61023J88188M1172k07649N34258k18672q4217j70862Q6075
$$ plain form
17086 507872 461514 342215 326765 558533 775191 599939 517558 362729 580396 545448
17076 545448 647224 388760 781434 582211 402416 135153 507230 503663 238033 175282
17066 175282 299522 207196 523109 164190 536461 634697 134216 511770 604188 504752
17056 504752 631310 599555 462934 622675 593578 605971 685569 1042921 576245 539484
17046 539484 503037 789180 388159 750912 613374 973344 727832 502645 488392 451598
17036 451598 609999 562176 662317 740622 525313 515735 730681 592636 509046 676492
17026 676492 646366 686359 479407 688321 668436 1147824 558166 603521 812163 658926
17016 658926 922271 461023 649211 690383 482734 1016992 798320 714103 543241 629316
17006F29316K69625k65136J29220K91235k13422N8751r6917j62795K3086J48790
16996H11753Q415j80245K88275q0555k462J18483n7215k87766K34019P2739P0021
16985I95462q6379o0905j71440K0780J74763K99627n11271K13412M4656k45774
16975F72931K30668L8680K187l38511J88058J14456j11862L84112K8928k35351
16965I74296n1265r0785K50596O3675k52507k2593K26399m424j66558O3550K7809
16954A018193l1520J94284n0406k29814K78162m019j98289L11626L0027l99405
16944I18839m6060L46983j05996Q5877L9221k54591L63986k64263K09613K84358
16934A577967l89411J08120o2224K39649j0178K265J70337k07412n8315J14300
$$ plain form
17006 629316 898941 633805 763025 1054260 840838 899589 802672 639877 662963 811753
16996 811753 820168 639923 928198 847643 845181 963664 906449 618683 852702 925441 995462
16985 995462 909083 848178 676738 697518 872281 1171908 660637 874049 918705 672931
16975 672931 903599 942279 944466 605955 794013 908469 796607 1180719 1209647 974296
16965 974296 923031 832246 1082842 1146517 894010 871417 1097816 1093392 926834 990384 1018193
16954 1018193 986673 1180957 1130551 900737 1178899 1174880 976591 1288217 1318244 918839
16944 918839 872779 1219762 1113766 1199643 1238864 984273 1348259 1083996 1293609 1577967
16934 1577967 1188556 1296676 1234452 1474101 1463923 1466188 1636525 1429113 1370798 1485098
16924A485098L2091Q0295n9195N2267j46336J28481j33137N14122n55033J34600
16914A533253l28924K29015K20252K03333o2670Q9400k39215L21551M3983k32368
16904A777610j2918O9893k45431K36106j69120K46621K8219O763J3064m0600j44560
16893A765647M4712K29050n7516N4443j07776J46575M31955n46323J13091l31930
16883A741928M62996j75204j61904K66606J98078N2089K7877j02900J01695J81007
16873B592268l61617L25131J70315k380l98759L13678J72143l3967j97936M605
16863B583481Q7374K46770m5001K20095j3716K73618k03122r1848N04397l70178
16853C191870K08424K9108o3211J36999J5228j08039K41799j6335J56768j31891
$$ plain form
16924 1485098 1517189 1597484 1538289 1590556 1444220 1572701 1439564 1953686 1398653 1533253
16914 1533253 1204329 1433344 1653596 1856929 1794259 1883659 1644444 1965995 2009978 1777610
16904 1777610 1764692 1834585 1589154 1825260 1656140 1902761 1930980 1937743 1950807 1910207 1765647
16893 1765647 1810359 2039409 1981893 2036336 1928560 2075135 2507090 1960767 2073858 1741928
16883 1741928 2204924 2029720 1867816 2134422 2332500 2384589 2412466 2309566 2411261 2592268
16873 2592268 2230651 2555782 2726097 2723717 2324958 2638636 2810779 2776812 2578876 2583481
16863 2583481 2670855 2917625 2872624 3092719 3079003 3352621 3149499 3057651 3562048 3191870
16853 3191870 3400294 3429402 3366191 3503190 3518418 3410379 3652178 3635843 3792611 3660720
16843C660720j78441N97941P499k81845M31547n1558j9087k92944N80935n1806
16833D402961O3244J21059k93316K25000L9078J20685O05444n58889M13267p0782
16823E067751M3007J34427K06854j00141M32217q0188K49132J76614J28128k21322
16813F036479L01038r1703M39137l55946K66125L75782K17633k2414J72621L98161
16803G736913L3673J66631k1734K12235L01841M51558j60089M09879L4557J26396
16793I291860L82754J42538N20217J21384Q8961K15749O40835J42636J80724P87383
16783A2515041J4044M73983J71743N41476L41891L34132L52203M13009L58050
16774A5515572N15683N50080Q94909M85393N04779O94840L98527R44469J156989
$$ plain form
16843 3660720 3482279 4080220 4087719 3805874 4237421 4185863 4166776 3873832 4454767 4402961
16833 4402961 4466205 4587264 4293948 4518948 4558026 4678711 5284155 4725266 5138533 5067751
16823 5067751 5110758 5245185 5452039 5351898 5784115 5703927 5953059 6129673 6257801 6036479
16813 6036479 6337517 6245814 6684951 6329005 6595130 6970912 7188545 7166131 7338752 7736913
16803 7736913 7770586 7937217 7915483 8127718 8429559 8881117 8721028 9130907 9165464 9291860
16793 9291860 9674614 9817152 10337369 10458753 10547714 10763463 11404298 11546934 11727658 12515041
16783 12515041 12529085 13003068 13174811 13716287 14058178 14392310 14744513 15157522 15515572
16774 15515572 16031255 16581335 17476244 17961637 18466416 19161256 19559783 20504252 21661241
16765B1661241L71755Q27200P33269Q28482J059821R60701J187772J390263P84121
16756B9804625J429192J439984J274163J838929J402219J491145J994057K067376
16748D2741690K289680K026308K533181K480599K549883K580874L686013L240546
16740F4128774L838524L641604M068316M148288N094985M765060N213838N769919
16732A00669308N904702O503766O673611O939138P439353P160845P731107P649761
16724A56671591P329687P652741O594869O054867N860737M652546L165305K375016
16716B00357359J180080k47894j609700k737185m181751n263678o047063o463495
16708A74986673p231539p483963q145989p568371p698772p740398p083898o985651
$$ plain form
16765 21661241 22032996 22860196 23593465 24421947 25481768 26442469 27630241 29020504 29804625
16756 29804625 31233817 32673801 33947964 35786893 37189112 38680257 40674314 42741690
16748 42741690 45031370 47057678 49590859 52071458 54621341 57202215 60888228 64128774
16740 64128774 67967298 71608902 75677218 79825506 84920491 89685551 94899389 100669308
16732 100669308 106574010 113077776 119751387 126690525 134129878 141290723 149021830 156671591
16724 156671591 164001278 171654019 178248888 184303755 190164492 194817038 197982343 200357359
16716 200357359 201537439 201289545 199679845 196942660 192760909 187497231 181450168 174986673
16708 174986673 167755134 160271171 152125182 144556811 136858039 129117641 122033743 115048092
16700A15048092o887347o385525n988263n473218m914366n183747m720217m242066
16692G1253343m011707l725252l525873l008653l253642k888583k705650j965060
16684D6168923k433482k298855k480578j047125k061796j644313j306535j712683
16676C1183556j190547j425517j329838q63644j033985j276070k04341j516648
16668B2342966o05672r04959o57485q57884p04196p33965p97901l67532m40022
16659A6273350p44482n67666m54136k77113p63754k95199J51576r50027k17819
16650A2154730k07070m78661k52735m37986k73653k65122p16546J87399k54091
16641I456265m27040r4153j91642l22774k01257j71549j87251l21438j06250k31719
$$ plain form
16700 115048092 108160745 101775220 95786957 90313739 85399373 80215626 75495409 71253343
16692 71253343 67241636 63516384 59990511 56981858 53728216 50839633 48133983 46168923
16684 46168923 43735441 41436586 38956008 37908883 35847087 34202774 32896239 31183556
16676 31183556 29993009 28567492 27237654 26374010 25340025 24063955 23859614 22342966
16668 22342966 21737294 20832335 20174850 19316966 18612770 17878805 17080904 16713372 16273350
16659 16273350 15528868 14961202 14507066 14229953 13466199 13171000 13322576 12372549 12154730
16650 12154730 11947660 11468999 11216264 10778278 10504625 10239503 9522957 9710356 9456265
16641 9456265 9029225 8935072 8743430 8420656 8219399 8047850 7860599 7539161 7432911 7201192
16631G201192n537j38735m38046j8185k12245j26040j36532k62727k72851l1538
16621E558756r5545J09294k12209j9212l57340J38954R349l70620K9450j48637
16611D642240M3384l16970O4458j43434o870m5227k00782K15514l38589j89930
16601C723794R9984j52544P128j08534j09443J65183n03090J62177l13687q0366
16591B890602M15084n2904m55713N2074J700M21504n18909K3091l0784l0192m1962
16580B673591j01376m49792O64228m68254j73737N06222l83402L28868l90070
16571B206278K29801m69434K90223n7375k48821j27521J40014J96621p9316n32857
16561A547613L03857K98101l56601O8447J19947j27296N6139l35790K84600j21373
$$ plain form
16631 7201192 7195655 7056920 6618874 6600689 6388444 6262404 6125872 5863145 5590294 5558756
16621 5558756 5463211 5572505 5360296 5341084 4983744 5122698 5132047 4761427 4790877 4642240
16611 4642240 4685624 4368654 4433112 4289678 4282808 4237581 4036799 4252313 3913724 3723794
16601 3723794 3823778 3671234 3678362 3569828 3460385 3625568 3122478 3284655 2970968 2890602
16591 2890602 3305686 3252782 2797069 2849143 2850843 3272347 2753438 2776529 2745745 2715553 2673591
16580 2673591 2572215 2122423 2786651 2318397 2144660 2650882 2267480 2596348 2206278
16571 2206278 2436079 1966645 2256868 2199493 1950672 1823151 1963165 2159786 2080470 1547613
16561 1547613 1851470 2149571 1792970 1861417 1981364 1854068 1910207 1574417 1859017 1737644
16551A737644l35616K98966J25738n76015K13154j05912J32653j7829o0519j6546
16541A395718N7374j81710L49248k22115J8941L1863J04495o6367L8391j15760
16531A410078q4278j13904p3739K12623j42536Q0471O2771o0995j64621J0979
16521A136849j16036J97782k62193R7348J60296m95962O19495j47492k19521K78531
16511A249097l85713J85860p9366p995k2510M4447J44438k62708J10796o8933
16501I07413k04032J24165r043J6605R3705M05127m51022j64482J66321k0746
16491H64011r8763M26078l42213l91384O13131j8270m10958j6344M6160J04303
16481G75751l85974K16544J96871j53479k45025N11602k51552J29597j3941N2514
$$ plain form
16551 1737644 1402028 1700994 1826732 1250717 1463871 1357959 1490612 1472783 1412264 1395718
16541 1395718 1453092 1271382 1620630 1398515 1417456 1449319 1553814 1487447 1525838 1410078
16531 1410078 1325800 1211896 1138157 1350780 1208244 1288715 1351486 1290491 1125870 1136849
16521 1136849 1020813 1218595 956402 1053750 1214046 718084 1337579 1190087 970566 1249097
16511 1249097 863384 1049244 969878 961883 939373 983820 1128258 865550 976346 907413
16501 907413 703381 827546 818503 835108 928813 1333940 882918 718436 884757 864011
16491 864011 765248 1191326 849113 457729 1070860 1052590 641632 625288 671448 775751
16481 775751 389777 606321 803192 649713 404688 916290 664738 794335 780394 832908
16471H32908J31002k19579k42693M54203l46850N6378K71744r9397D13165k4720
16461C88445q2934L64402L6471j68223p6908l8514L04052C57621K74905k22071
16451D10455J35039k33800O9136J82855K58759C43445J48216J07204k21649R4251
16441D71467M2716j55059L07931J17314j85419j44153J50559r5911J30046j62357
16431D77134J7161k4144M10744D17018j25433K50008p5833j77261I5663J85852
16421B81515K27470K15676k47066j98104k365K05727j70170Q2039L29002B45957
16410B74596j1945J0122J64926J11703k6248k28j00413A33331K41800N9044J4332
16399D48507q6805j23495K62823j75239m0391M66049j06003j57735j96276L04505
$$ plain form
16471 832908 963910 744331 501638 955841 608991 665369 937113 837716 413165 388445
16461 388445 305511 669913 706384 538161 461253 422739 726791 357621 632526 410455
16451 410455 545494 311694 380830 563685 822444 343445 491661 598865 377216 471467
16441 471467 514183 359124 667055 784369 598950 454797 605356 509445 639491 477134
16431 477134 494295 470151 880895 417018 291585 541593 465760 288499 95663 281515
16421 281515 508985 724661 477595 279491 277126 482853 312683 394722 723724 245957
16410 274596 262651 272773 437699 549402 523154 522926 422513 133331 375131 434175 448507
16399 448507 361702 238207 501030 325791 285400 751449 645446 487711 291435 595940
16389E95940k90049j4346J51309A34661J24816K23505e2469B99555Q5044K31975
16379F16574A46194J74634A40856C468L91527r7650q5550J33036k2505j50234
16369A72092C6950K26173O4245K2588I7917P6949K54212A54806p6965J0561J39107
16358B27509M8332l9711o7212L4635d1977C96724r4129m6538b0073i720C83098
16346B44445A10665d8605h60j38662D10983k00367K06662B05738p5806q054L74611
16335D96489C7574J24834J72428g6609B07519P6258j24311J16465a4099A48221
16324f7639E4797M2165J75095R7819M1169A6147M60027A07220M9727a51783F1664
16312a90780D00484c8914a6667E4840a68248a4611C15465a80972C06263K94173
$$ plain form
16389 595940 305891 291545 442854 134661 259477 482982 -52469 299555 384599 616574
16379 616574 146194 320828 140856 3468 394995 297345 211795 344831 322326 172092
16369 172092 36950 263123 327368 349956 97917 174866 429078 154806 77841 88402 227509
16358 227509 275841 236130 168918 203553 -41977 396724 302595 256057 -20073 -9720 383098
16346 244445 110665 -48605 -860 -139522 410983 210616 417278 205738 129932 121878 496489
16335 496489 37574 162408 334836 -76609 207519 283777 159466 275931 -14099 148221
16324 -67639 54797 96962 272057 369876 411045 16147 476174 107220 156947 -151783 61664
16312 -190780 400484 -38914 -16667 54840 -168248 -14611 315465 -180972 306263 600436
16302F00436B24410d9289A09081O8057E3628m41M52794A28963b3900B71276K0446
16291B91722j31181A7400b1140C28164H9332f8848A30153J85566j06435D6509
16280D403J27164i2670j38214A60588K03623q3205d7633k3737A35757n0930O1958
16269A46785N3041k5505j6498a5598A06112K49439K6046n1622A24796c9642B09817
16257C7094J67102c1695B17853r597J28412m3626f181n0251A39573N8736g1450
16245E04567j85827H0241b9471j23108B52414C3214K53096j12085E4368J1185
16235F5553d0768C14788g9455J8674j03201N362B2376K10472A513Q6024h7951
16223A31119a15756B45892o6824P4677d5096j98521B5578J96228P4318c5315D7501
$$ plain form
16302 600436 224410 -49289 109081 177138 53628 53187 505981 128963 -23900 271276 291722
16291 291722 160541 17400 -21140 328164 89332 -68848 130153 315719 209284 46509
16280 4403 131567 -92670 -230884 160588 364211 281006 -47633 -71370 135757 84827 146785
16269 146785 199826 174321 157823 -15598 106112 355551 381597 329975 124796 -39642 209817
16257 37094 204196 -31695 217853 208256 336668 293042 -6181 -56432 139573 198309 -71450
16245 504567 318740 80241 -29471 -152579 252414 33214 286310 174225 54368 65553
16235 65553 -40768 314788 -79455 -60781 -163982 -158620 22376 232848 1513 87537 -87951
16223 131119 -115756 245892 179068 253745 -45096 -243617 25578 221806 296124 -35315 47501
16211A14345L1376b6735H0876a21279H0432L233J48762g5735D2707a36207C65421
16199a6738B55894N8313A31384a05054j8070a6985l3210j07943H2338l4163a7439
16187E36297A3537a88430B8473A0182K69764i9589R357A31890D2627K8906l4326
16176C7207a00771j91488a39006B4953P4445g3977l77792D5017a30671B29655
16165C7097M5998b0845B05091j8266a7020B01861F4176b17592D83721a77289g8286
16153h1386o7962B08543i5530j13593E3415a20423B23323i9435C57789g9571J5761
16142f3810n6782K813H0344J76782n9122M1818B4135a35027O1526B25233n6550
16131A68683f962A35873B7910K05750a66714M9229a0423A225f5476b7634B919
$$ plain form
16211 114345 145721 -26735 80876 -121279 80432 83665 232427 -75735 42707 -136207 365421
16199 -16738 255894 314207 131384 -105054 -123124 -16985 -50195 -158138 82338 48175 -17439
16187 536297 13537 -188430 28473 10182 279946 -99589 -90232 131890 42627 71533 37207
16176 37207 -100771 -292259 -139006 24953 99398 -73977 -451769 45017 -130671 229655
16165 37097 83095 -20845 205091 186825 -17020 201861 64176 -217592 483721 -177289 -78286
16153 -81386 -149348 208543 -95530 -209123 53415 -120423 223323 -99435 357789 -79571 -63810
16142 -63810 -120592 -117779 80344 257126 198004 239822 24135 -135027 -73501 225233 168683
16131 168683 -6962 135873 27910 233660 -166714 -117485 -10423 1225 -65476 -27634 2919
16119b71201C5103K09205A17537J2122C8287I540L13443b36739k0275k1740J00932
16108a77822L531F9385a47194k98427c2952F619L62891A38270b03782B37403a52781
16096a48435b6170B25658i6625m9170e608j64345B48696a75480A34633D1254c42776
16084a55750C9073A693a37005J0119B5967f4696n933a4692B64136l2794a47761
16072a42521j68172J28828k5455J4488k82659a41624k0604j00697J01583c6851
16061C13433b02974A3119J27354M3520K3831J76539b97644B70672a96048h5390
16050h6756o3622j06346d9820m5691B20198p2051b07549a9635A68013b06103e452
16038B3331d3944C19629a00122d9851o5846D9891b66691I4656c54954B7032J20968
$$ plain form
16119 -271201 35103 244308 117537 129659 38287 9540 322983 -236739 -257014 -278754 -177822
16108 -177822 -174291 69385 -147194 -445621 -32952 6619 369510 138270 -203782 237403 -152781
16096 -148435 -26170 225658 -96625 -145795 -5608 -169953 248696 -175480 134633 41254 -342776
16084 -155750 39073 1693 -137005 -126886 25967 -64696 -70629 -14692 264136 231342 -147761
16072 -142521 -310693 -181865 -207320 -192832 -475491 -141624 -162228 -262925 -161342 -36851
16061 313433 -202974 13119 140473 183993 207824 384363 -297644 270672 -196048 -85390
16050 -86756 -150378 -256724 -49820 -95511 220198 148147 -207549 -19635 168013 -206103 -5452
16038 23331 -43944 319629 -100122 -49851 -115697 49891 -266691 94656 -354954 27032 148000
16027A48000R7215c0635j44261C3159J26250b20317f3397C05505G4436L0284i0490
16015b96013E0250i7243G8098c66875l5635a98539d2841J1878j56745I4461l3494
16004F0967h3185C1062Q2119i6013C98250e9220p531a1062k44093B1862J4855
15993C6717N7549a8840k43902f0414B9185N02133a3326B35578A04464c3183D4217
15981C08927j04162L08474j75524A61666D2644c16220g2783l23206J73075F9386
15970H8086a1287B67633a04401F8479N2580c68466a7918k39671O9929j17893P0105
15959b35448g3002k89486a63852I8630a15731A74843a66354c1567A83987f9166
15948F10P0054a06334j07682e1171j0832I3157a48201A81131b42683N9405L8399
$$ plain form
16027 148000 245215 -30635 -174896 33159 159409 -220317 -63397 305505 74436 104720 -90490
16015 -296013 50250 -97243 78098 -366875 -402510 -198539 -42841 -30963 -187708 94461 60967
16004 60967 -83185 31062 113181 -96013 398250 -59220 -66751 -11062 -255155 21862 36717
15993 36717 94266 -18840 -262742 -60414 29185 531318 -13326 235578 104464 -33183 44217
15981 308927 204765 513239 337715 161666 42644 -316220 -72783 -395989 -222914 69386
15970 88086 -11287 267633 -104401 68479 121059 -368466 -17918 -257589 -187660 -305553 -235448
15959 -235448 -73002 -362488 -163852 98630 -115731 174843 -166354 -31567 183987 -69166
15948 610 70664 -106334 -214016 -51171 -62003 93157 -148201 181131 -242683 -183278 -144879
15937a44879M2103k68587A92196g662k97987B38767a44972B31544I9143c9823
15926c3599A00035k1489a87972A08197L1125K26658b07021A43634K02D3381b91013
15914A4752d7601r1740G8091b92492A3006a35359F5356A1108J39399m4538n0361
15903E5608P2176k5214K6258c0368n7114A92090f3689n1631B5293J28396g4242
15891a29019q5672H8068a19822F8546k928a24889A41786m2375b82390B1143P7769
15880I8912j7610K7096f033A1392d627k3935l40918f8970K4708B86020i8142c7003
15867b9686A21933b54240c1014E8048J9410j0962a09552B0326d6372j99245B56289
15855a07589I5731a94428n6478Q5550A41303a72707P6258E7362J42575a10781
$$ plain form
15937 -144879 -102776 -371363 192196 -7662 -305649 238767 -144972 231544 99143 -39823
15926 -33599 100035 78546 -187972 108197 139322 365980 -207021 143634 143836 43381 -291013
15914 14752 -47601 -139341 78091 -292492 13006 -135359 65356 11108 150507 105969 55608
15903 55608 127784 102570 128828 -30368 -87482 192090 -63689 -115320 25293 153689 -74242
15891 -129019 -214691 88068 -119822 68546 65618 -124889 141786 99411 -282390 21143 98912
15880 98912 81302 108398 -6033 11392 -4627 -28562 -369480 -68970 -44262 286020 -98142 -37003
15867 -29686 121933 -254240 -31014 58048 77458 66496 -109552 20326 -46372 -245617 256289
15855 -107589 95731 -194428 -250906 -165356 141303 -172707 -96449 57362 199937 -110781
15844e9899r256D1154O6907a57884A82603h0202B23015L2058E100a66093C5360
15832c7933j04514N3323E8295b1976o4374H0969a18415j94893P1762P632j20698
15821c54612O4496A05145e5418E0323A734i5907L2257j36721j06011e3162B54540
15809f94F9631a95236A06093c0773d719A28857a2995j12876C14137D0565K03a71859
15796c89954h4381q0958P1370c6499h415j84724B61479g0093B53036o1613m4335
15785A47088a63329d560l11369F3118b09282j4678B2451e9374D5517a2308k68368
15774b80676B32582A3896b78336R5004m755O1071H7294J47924e9611n7375j33372
15763b50358A0937d0188O909I0482C0367J82667p3064o7743J33396k3315n2117
$$ plain form
15844 -59899 -69155 41154 108061 -157884 182603 -80202 223015 255073 5100 -166093 35360
15832 -37933 -142447 -89124 58295 -21976 -86350 80969 -118415 -313308 -241546 -233914 -354612
15821 -354612 -290116 105145 -55418 50323 1734 -95907 -63650 -200371 -306382 -53162 254540
15809 -694 69631 -195236 106093 -30773 -4719 128857 -12995 -125871 314137 40565 40768 -171859
15796 -389954 -84381 -165339 -93969 -36499 -8415 -193139 261479 -70093 253036 191423 147088
15785 147088 -163329 -4560 -315929 63118 -209282 -223960 22451 -59374 45517 -12308 -280676
15774 -280676 232582 13896 -278336 -183332 -188087 -127016 87294 235218 -59611 -116986 -250358
15763 -250358 10937 -40188 -33279 90482 30367 213034 139970 72227 205623 182308 130191
15752A30191a95851l4400B12644a93540I3966a54581M7218A47390J91739h3740
15741a72889o6689I3961n072c03166a227k13151J0325e1474l11763H1210c3101
15729h7706b4131A67864o6556D0940A7728b18944r5834A41339a97370r423J4724
15718a92069A01942e6276f95q2058l22016O3493A36926D331f3566B91546c5965
15706b81974H5306B1679a57794B28440F3601J69761c40753d384k78266g6946b8255
15694i3424m0833A3340J81663p7867j5845m533l8305B8906J12402a01295B514
15682E4746b2001j41619f1156A65593j7683G3345J04617J5549J2382l1859p487
15671A66547J22124F6402K9081a25850D5044a04755A66748j0281h8097k44582
$$ plain form
15752 130191 -195851 -230251 212644 -193540 93966 -154581 -107363 147390 339129 -83740
15741 -172889 -239578 93961 88889 -303166 -1227 -214378 -204053 -51474 -363237 81210 -33101
15729 -87706 -24131 167864 101308 40940 17728 -218944 -314778 141339 -197370 -206793 -192069
15718 -192069 101942 -56276 -695 -82753 -404769 -341276 136926 4331 -63566 291546 -35965
15706 -281974 85306 21679 -157794 228440 63601 233362 -340753 -4384 -282650 -76946 -28255
15694 -93424 -134257 13340 195003 117136 101291 96758 58453 28906 141308 -101295 2514
15682 54746 -22001 -163620 -61156 165593 147910 73345 177962 193511 205893 174034 166547
15671 166547 288671 66402 95483 -125850 45044 -104755 166748 156467 -88097 -332679
15661c32679J15018a01065c4143l22694e3337i573A08445E1176J11856c0207A90753
15649a60697E4031b36609h5972c2659r6889j21621A58141c98356a14333p2610
15639a86943K1914F8262J30887h7738B85927j33569c8720j58204O6272e0029A46088
15627a984j19822j06626k0279A54738L3428c4375A24527a26270N3211f007k25588
15616b31595a0920j29967H3567c7846a5315A88257a8017A13938e9342k39670a32825
15604E38c74856J86087F7619I179K21501D7016K83111d3977l2226H9956J35255
15593B25211A02704a61963M4494K8619K8143k100m25092C36292m8228j11792J09578
15582B85850a11636e790B88607b19637f0976b4016F7042C1276a61151e5201H1199
$$ plain form
15661 -332679 -217661 -101065 -34143 -356837 -53337 -9573 108445 51176 163032 -30207 190753
15649 -160697 54031 -236609 -85972 -32659 -129548 -251169 158141 -398356 -114333 -186943
15639 -186943 -165029 68262 199149 -87738 285927 152358 -38720 -196924 -130652 -50029 146088
15627 -1984 -121806 -228432 -248711 154738 188166 -34375 124527 -126270 -73059 -6007 -231595
15616 -231595 -10920 -140887 83567 -37846 -15315 188257 -18017 113938 -59342 -299012 -132825
15604 538 -374856 -188769 67619 9179 230680 47016 330127 -43977 -76203 89956 225211
15593 225211 102704 -161963 -117469 -88850 -60707 -62807 -487899 336292 288064 176272 285850
15582 285850 -111636 -5790 288607 -219637 -60976 -24016 67042 31276 -161151 -55201 81199
15570A36807n3100O0066a34898h157D4506e0791j14875B67688c2842a3793n4685
15559f8478A0522K20003I024a00587F2931a28707G8310a38618N9285k4441H5199
15547d05097b3653j28417M85N1939A04315e5220o570G4914b1749A94975i2957
15535F4123a05881A73781a90922D31909b09195q4968A81696l0994b059j01237
15525a03296A366J40505B5453a45302c7356D4150O509j3826J59076b67717K7994
15514b39723B4656N9218A3624R8746a30993B92563a77684A26721a29355J4063
15504a15292c7075q3477r0673O5071A2588g1158C50492c5476A27917g4865g097
15492c72105B97688a82428a3144B3337b89927A81288q8218J0501K28413N7804
$$ plain form
15570 136807 83707 143773 -134898 -8157 44506 -50791 -165666 267688 -32842 -13793 -68478
15559 -68478 10522 230525 9024 -100587 62931 -128707 78310 -138618 -79333 -103774 85199
15547 -405097 -23653 -152070 -151585 -99646 104315 -55220 -61790 74914 -21749 194975 -92957
15535 64123 -105881 173781 -190922 431909 -209195 -294163 181696 150702 -2059 -103296
15525 -103296 1366 141871 25453 -145302 -37356 44150 50659 36833 195909 -267717 -239723
15514 -239723 24656 83874 13624 112370 -130993 292563 -177684 126721 -129355 -115292
15504 -115292 -37075 -120552 -211225 -146154 12588 -71158 350492 -35476 127917 -74865 -7097
15492 -372105 297688 -182428 -13144 23337 -289927 181288 93070 103571 331984 389788
15482C89788b115C22659j40945a45773K8598m2675n8325i1756A99414I2581b4065
15470a53032P2543H8640c0214j39189r4725C6015b46432A56083f5504B04950g7671
15458E1531A2157b0233A31845B3057p567R517L19576b4030j2100k5815m1062k4224
15446a27231B50384d1714A67198Q7995b40161i9908l92511A11564c8168A26111
15435A93677F3131g3970A47349I831g6861k23m7314M641F9434n835J79893p1185
15423A72307c9698q844j63057H5944p980b5270j836D7673g102n3700C51575A38761
15410G0752b19278B7159L246a07442C35324G8533R9992b45110A86095D0237J34358
15399A74595e65849b51099A61831b3j50678H148a77567j2131m1272J02891A81272
$$ plain form
15482 389788 -2115 322659 181714 -145773 -117175 -159850 -218175 -91756 199414 92581 -24065
15470 -153032 -80489 88640 -30214 -169403 -264128 36015 -246432 156083 -65504 204950 -77671
15458 51531 12157 -20233 131845 23057 15490 25007 344583 -24030 -36130 -61945 -103007 -127231
15446 -127231 250384 -41714 167198 255193 -240161 -99908 -492419 111564 -38168 126111
15435 193677 63131 -73970 147349 9831 -76861 -77084 -124398 -119757 69434 63599 243492 172307
15423 172307 -39698 -48542 -211599 85944 77964 -25270 -27106 47673 -7102 -60802 351575 138761
15410 70752 -219278 27159 30405 -107442 335324 78533 178525 -245110 186095 40237 174595
15399 174595 -565849 -251099 161831 -23 -150701 8148 -177567 -189698 -230970 -128079 181272
15387B00464D040J86656B77J31868E0068O4644B0404M8964b25085J09884A03959
15375d2148l8138m6805o4831F9403c5906j13741b9024p4216M4779j89769J7950
15364b30280e0135j28469d853B44628h5205p7821a6164F9746Q8847b10847K5142
15353a85705E7060J40313n5834b4988Q72B17933b21886C16962g0513j2684C6295
15341A1434R6828G347J60922m5633e9449j9130G0592J50865C579R8644m426i1895
15328G0049b19816g7204A93544K06481A35235D1161b19023B81445E861a17514
15317h0966B38367A03876D9806O4517E6326K25097J32465j43576f3563C55666
15306D9219k2843K86962A01054L45639g5746C25800H3007n286J31372e1815l7188
$$ plain form
15387 200464 4040 190696 277 132145 50068 114712 20404 69368 -225085 -115201 103959
15375 -42148 -80286 -127091 -191922 69403 -35906 -149647 -29024 -103240 -58461 -248230 -230280
15364 -230280 -50135 -178604 -4853 244628 -85205 -163026 -16164 69746 158593 -210847 -185705
15353 -185705 57060 197373 141539 -24988 -24116 217933 -221886 316962 -70513 -83197 36295
15341 11434 108262 7347 168269 122636 -59449 -78579 70592 221457 3579 102223 97797 -91895
15328 70049 -219816 -77204 193544 400025 135235 41161 -219023 281445 5861 -117514
15317 -80966 238367 103876 49806 114323 56326 281423 413888 270312 -63563 355666
15306 49219 26376 313338 101054 446693 -75746 325800 83007 77721 209093 -51815 -89003
15295h9003L7303j26285A67843L9633a49136B64988H6488c53367J24546E2123
15284B05159L5185a32047l8216J991Q0267p1400P7057A26N01121i3201A78951
15272A94389k4758C6237d9944G9304Q4602D3035e4978B5055o394L08252q6953
15261B39960J00292A45726a25527j27505A0135h1103C10111E0141K79824k5695
15251C04270l4344n4178L43149K01199N87946J90445l77584O75962H80634C6013
15240f6012I8227A0097K18099r6192d8196H248a18879H2531k7657J65577F0314
15228C10905i5508A07682m3685f1508A46936A8688K3599K42717a77869r3421o079
15217b77369B20333J19212j53228K575a08161M7734F9411i201I7408e675A79427
$$ plain form
15295 -89003 -51700 -177985 167843 207476 -149136 264988 86488 -353367 -228821 52123
15284 205159 240344 -132047 -170263 -168272 -88005 -159405 -82348 126 501247 -93201 178951
15272 194389 169631 36237 -49944 79304 163906 43035 -54978 25055 18661 326913 239960
15261 239960 340252 145726 -125527 -253032 10135 -81103 310111 50141 329965 304270
15251 304270 269926 215748 558897 760096 1348042 1538487 1160903 1836865 880634 36013
15240 -66012 98227 10097 228196 132004 -48196 8248 -118879 82531 54874 220451 60314
15228 310905 -95508 107682 63997 -61508 146936 18688 42287 285004 -177869 -271290 -277369
15217 -277369 220333 339545 186317 188892 -108161 -60427 69411 -9201 97408 -5675 179427
15205B27497b20992B75816n9529c10904c4247l3029N043A02508a05752C2279b15300
15193C46562o0540a60675d8859B92647c7709o5857j44903H7885p69K14911k1286
15182B80741J69844A98397A3989h640F4840M0636m8006K69570j10184J08216j306
15171C23766a92088N2803B34442K4625m2740H2672g6680K9610C62082A65517b39247
15159a15459l13564B33362E2124O1475J16994F2371J57088C6502L9027f5656b8419
15147A23947D6249h4866C63585j61067M39349a5974A75230A1004J80842l6439
15137A55407C338Q4206c91426A89454N8642b3531G4258K95604i584k90363A45471
15125g753C14901G9155j1403R8162J7590j6047A2156c8206p1068B3337L46252
$$ plain form
15205 227497 -220992 275816 216287 -310904 -34247 -67276 -62233 102508 -105752 32279 -215300
15193 346562 286022 -160675 -48859 292647 -37709 -103566 -248469 87885 87116 302027 280741
15182 280741 450585 198397 13989 -8640 64840 105476 57470 327040 216856 325072 323766
15171 323766 -192088 -139285 234442 259067 216327 82672 -76680 -47070 362082 165517 -239247
15159 -115459 -429023 233362 52124 113599 230593 62371 219459 36502 75529 -65656 -28419
15147 123947 46249 -84866 363585 202518 641867 -15974 175230 11004 191846 155407
15137 155407 3338 87544 -391426 189454 248096 -23531 74258 369862 -9584 -299947 145471
15125 -7753 314901 79155 67752 165914 183504 167457 12156 -38206 -109274 23337 369589
15114C69589j31639n5236L12816j59571E5002J42345g277B81349I4625J97703
15104B92328d3129A10493l0600J83K06263A04318Q5076L17504I8149J96184A08838
15092D31224E8465J41913K14051H8776K37205A29566f0879E59507j2684a1525
15081A70753O8234p2157M4200l3498k8304E5452b96906E09276A76890k6062n9870
15070I0958J85676G4161Q4184F8083J0007D619K65557J27554E6257b0991A1722
15058a50192C24674A06465J30386j16356b9162C81958j06752J54141o3158J67543
15048E33732A12234J62630g4117B31556K25583j32717p4372q5624P6066G7796
15037C3815a8014r1305A92933R3516A32493c34701D26110a40042B86407M8132
$$ plain form
15114 369589 237950 182714 495530 335959 55002 197347 -7277 281349 94625 292328
15104 292328 -43129 110493 79893 80076 286339 104318 189394 506898 98149 294333 108838
15092 431224 58465 200378 414429 88776 325981 129566 -60879 559507 546823 -11525
15081 170753 238987 166830 211030 177532 149228 55452 -296906 509276 176890 150828 90958
15070 90958 276634 74161 158345 68083 78090 4619 270176 397730 56257 -20991 11722
15058 -150192 324674 106465 236851 120495 -29162 381958 275206 429347 366189 533732
15048 533732 112234 274864 -74117 231556 457139 324422 250050 164426 240492 77796
15037 33815 -18014 -109319 192933 286449 132493 -334701 426110 -140042 286407 334539
15027C34539H095a07117I7621a96930D77704j86192l2609J4618j25337J87428
15017C35612m3746A18331K51489j2665j33117g1620C38819a0039B52087Q6079
15007C38166I1541B306J71632J50143J19516k00965p9238K5068M3109K6809E2404
14995A86962p0966M0387j8771a632E08227A35773a3432j76198B65338K53856m9303
14984D69891A73878J42116j28873r2238O7298K14448A31425d6618B67484J68218
14974D35702K8707J08278k19227M7112a80913C46769C0308M86373A05466P9974
14964A85440j0740J19283M0734J07426j69945o5588r1579J15957r2210b66887
14953A40117M7217J4667J36137P4413A20169c00047F6727N7833J93320F2039j6943
$$ plain form
15027 334539 8095 -107117 97621 -196930 477704 291512 258903 273521 148184 335612
15017 335612 291866 118331 369820 357155 224038 -71620 338819 -10039 252087 338166
15007 338166 91541 2306 173938 324081 443597 242632 163394 188462 231571 258380 52404
14995 186962 115996 156383 137612 -1632 508227 135773 -13432 -189630 265338 519194 469891
14984 469891 173878 315994 187121 94883 162181 376629 131425 -46618 267484 435702
14974 435702 464409 572687 353460 400572 -180913 346769 30308 516681 105466 185440
14964 185440 174700 293983 334717 442143 272198 206610 115031 230988 138778 -266887
14953 140117 187334 202001 338138 412551 120169 -300047 66727 124560 317880 62039 45096
14942D5096K28741m9857o1603K27342j76212P3938b31750B65280N4676K156L33686
14931F55798j38029r8351R8325j90226J55706j59262J28425q5226p8j42683K07798
14920D32197j55201p6258K62882M2374N8997j78528Q4156J04532j00294j80737
14910B94120j34251L11608N548B22831K07746A3865N13908B27820R1664P3419
14900C92903j10902M0889J23854G2279K68176j60325L23946A07125K92200O0958
14890D60283F6394K98459j52572J75335L06490C39364J63203A92427K79218j08640
14880C63005n4986K17657n8068J24968q9367J15982j00077L064J26674m0135A37251
14868B43220L43436L3882A87292K35705N4549j73091J1248L53930k93521J09861
$$ plain form
14942 45096 273837 223980 162377 389719 213507 287445 -231750 265280 319956 322112 655798
14931 655798 517769 419418 517743 327517 483223 323961 452386 367160 367082 224399 432197
14920 432197 276996 200738 463620 505994 564991 386463 470619 575151 474857 294120
14910 294120 159869 471477 477025 222831 430577 13865 527773 227820 319484 392903
14900 392903 282001 322890 446744 72279 340455 180130 504076 107125 399325 460283
14890 460283 66394 364853 212281 387616 694106 339364 502567 192427 471645 363005
14880 363005 308019 525676 467608 592576 503209 619191 519114 522178 648852 608717 137251
14868 243220 586656 620538 187292 422997 477546 304455 315703 669633 376112 485973
14858D85973k32208M64168n8514j33494j34255K54155r7107j08230j02226I6864
14847B86091J54695J10324k0843j06926j68481J44910p4700K81316p8735j19735
14837D07916l8862r57A82670L4437M22626j5369A62006K83926L2565o2293K24235
14826F40439N1664J67331K6798l36946J96432B74406J39860J41222K79676k75403
14816E59761j16151j77544M86985j95814k0986j68918J47738j0274P2292B46942
14805D18515O3158J43940j02233R4010L2587J63323j34512k77924J60853j03946
14795D57771k1844M58154C29646K20624J62481k5678j14155j33193J83315J63533
14785G86573l02376K43385k42297R4639J31572k54891M04109l5315N2722J33792
$$ plain form
14858 485973 253765 717933 659419 525925 391670 645825 548718 440488 338262 96864
14847 286091 440786 551110 530267 423341 254860 399770 325070 606386 527651 407916
14837 407916 369054 368097 182670 217107 639733 624364 162006 445932 478497 416204 640439
14826 640439 692103 859434 886232 549286 745718 274406 414266 555488 835164 559761
14816 559761 443610 266066 753051 557237 536251 367333 515071 504797 577089 246942
14805 418515 481673 625613 523380 617390 649977 813300 678788 400864 561717 457771
14795 457771 435927 894081 329646 550270 712751 687073 572918 439725 623040 786573
14785 786573 484197 727582 485285 579924 711496 456605 860714 825399 878121 1011913
14775A011913k30562k87897K07472N0485j68083L8953J99664R112p557k18128
14765F05372k07042M74903k81944k2561M7404J56386J26605n4360J00001l38068
14755F06696Q7998K86468k14053k087K4704k2960j37294J70374K74201m66340
14745F07707K23322k23500M69103l07543k91930J79331l9469J33568k82649K35110
14735G03050o708J25355k47977M12852k15235L07281Q0856k30316l29807j72380
14725D26971L76568j1082J18724K59359l25317k0396J1815P3756l05010K65393
14715H70781k29959J91800k07094L79047j82253K86617r1810j89598J9091J27564
14705I74186m15882L38452P4662r7012k11425K45618J72280J26668m90085M654
$$ plain form
14775 1011913 781351 493454 700926 751411 583328 622281 821945 831057 823500 605372
14765 605372 398330 873233 591289 568728 616132 772518 899123 844763 944764 606696
14755 606696 694694 981162 767109 765022 789726 766766 629472 799846 1074047 607707
14745 607707 831029 607529 1076632 769089 477159 656490 617021 750589 467940 703050
14735 703050 696342 821697 573720 986572 771337 1078618 1159474 929158 599351 426971
14725 426971 803539 792457 911181 1170540 845223 824827 836642 910398 605388 870781
14715 870781 640822 832622 625528 1004575 822322 1108939 1017129 827531 846622 974186
14705 974186 558304 896756 971418 874406 662981 908599 1080879 1207547 717462 722116
14695G22116K95723o4144K5730K92904l29408J13177r5333L19137l22706K3148
14685I80344k70926K98056j78785L01227o1855j13662J83629j29505m3905L45814
14675A310432k15747R1250K78402o72526M54648r2554o0604J42612n9276K48314
14665A424951k3169j45855n6996j86221P5073J48373J66012P5030k58295P093
14655A225996m7913j05978L82879n37630K74587K63714m41218m9611L08210K85340
14645A558376k82285P1056j22094J02580l5751J51635N2851N2789N1950l44413
14635A256694L67384k58304O0779j8983m9857N507J99079j59378K3176p0543M61873
14624A817427L7556j49784m08029M7184L28928n00420M32934m43573K11969N21210
$$ plain form
14695 722116 1017839 953695 979425 1272329 942921 1056098 960765 1279902 957196 980344
14685 980344 709418 1007474 828689 1129916 1068061 954399 1138028 1008523 964618 1310432
14675 1310432 1094685 1185935 1464337 791811 1246459 1153905 1093301 1235913 1176637 1424951
14665 1424951 1401782 1255927 1198931 1012710 1087783 1236156 1402168 1477198 1218903 1225996
14655 1225996 1178083 1072105 1454984 917354 1191941 1455655 1014437 964826 1273036 1558376
14645 1558376 1276091 1347147 1225053 1327633 1291882 1443517 1496368 1549157 1601107 1256694
14635 1256694 1624078 1365774 1426553 1407570 1357713 1363220 1562299 1402921 1426097 1355554 1817427
14624 1817427 1854983 1705199 1297170 1344354 1673282 1172862 1605796 1162223 1374192 1895402
14614A895402k56442p5739J5491K43121m2607j18873k50097K87601k3745M6066
14604A720178m1053Q6931o430k14852K86622j53392j54795K89807Q6901j65632
14594A734285O8881K11162n25960J09998J81549J71815k07111P972J09796j36528
14584A725859L10081l13844K96075L96741k49537k4347M47774m98257L39856r6113
14574B334288j46029o1707J95276j51660K81913j86790J96881K99565k38550j91585
14564B331602K24988p8672J17199J42694M13090k83652Q1826L65637p5500L1782
14554C270994M60608K63678P23183n558R60557J637521L280368Q363700K1892372
14545D0847423Q932295k4261080A2586650o005647l216245p93996q69322M67444
$$ plain form
14614 1895402 1638960 1563221 1578712 1821833 1779226 1660353 1410256 1697857 1674112 1720178
14604 1720178 1679125 1766056 1759626 1544774 1831396 1678004 1523209 1813016 1899917 1734285
14594 1734285 1803166 2014328 1488368 1598366 1779915 1951730 1744619 1752591 1862387 1725859
14584 1725859 2035940 1722096 2018171 2414912 2165375 2141028 2588802 2090545 2430401 2334288
14574 2334288 2188259 2126552 2321828 2170168 2452081 2265291 2462172 2761737 2523187 2331602
14564 2331602 2556590 2477918 2595117 2737811 3150901 2867249 2949075 3314712 3239212 3270994
14554 3270994 3731602 3995280 4718463 4712905 5673462 7310983 10591351 18955051 40847423
14545 40847423 49779718 25518638 12586650 6581003 3364758 2570762 1701440 2168884
14537B168884P8401k05283J68137n7067q8199N25463m62542J61661J76642J82716
14527B648813m72361L13275k57363L29281J69971P7049j19311k01560K37583n02789
14517B222588L80604J63012K59520k05454P5836n7612n4399J10379K01933l47334
14507B749073N87191j86812k23898L93066k1977j08153k8868M10066k62943J47864
14497C454609q7277q4184L75475l35078k781N30139n14768O2197N79533k39805
14487C738060K49798l93286L43796J05016k48266J23589J00280j37643L68756
14478D250100J0009k11032K26896Q5031K54352j04422n4151K03339k92847K11505
14468D578780K28506l39347O36531m88961K35991K03643j64154L01364r0857N99064
$$ plain form
14537 2168884 2247285 2042002 2210139 2153072 2064873 2590336 2127794 2289455 2466097 2648813
14527 2648813 2176452 2489727 2232364 2561645 2731616 2808665 2689354 2487794 2725377 2222588
14517 2222588 2603192 2766204 3025724 2820270 2896106 2838494 2784095 2894474 3096407 2749073
14507 2749073 3336264 3149452 2925554 3318620 3296643 3188490 3159622 3569688 3306745 3454609
14497 3454609 3367332 3283148 3658623 3323545 3320764 3850903 3336135 3398332 3977865 3738060
14487 3738060 3987858 3594572 3938368 4043384 3795118 3918707 4018987 3881344 4250100
14478 4250100 4260109 4049077 4275973 4361004 4615356 4510934 4456783 4660122 4367275 4578780
14468 4578780 4807286 4467939 5104470 4615509 4851500 5055143 4890989 5192353 5101496 5700560
14458E700560k64545P509j75066K99663p0700L40528M3538j63935q8647K09629
14448E838534K89276j17109K69241j99757p5880O51477m73675M69961k54969J8153
14438F415252L39915j30009L20129J45428j07331J78975j36831L77695M2647K83772
14428G729642R2929o6438J36248k7440J19034N34802l68016K46882R9344J77766
14418H674753j51601O30142m1957Q8356p6478K69231K93852K6836L72424m40265
14408I645293Q50710L6082j85864L29967N2043K15849L6191L90494J89332L6461
14398A1596558J21769k06738M25321K59821J83708K20447L45400J69808K13203
14389A3329297J19213N1676M58300O1264L97231J54485L66234P1274M03598P47457
$$ plain form
14458 5700560 5436015 5443524 5268458 5568121 5497421 5837949 5881487 5717552 5628905 5838534
14448 5838534 6127810 6010701 6279942 6080185 6004305 6655782 6182107 6652068 6397099 6415252
14438 6415252 6755167 6625158 6945287 7090715 6983384 7162359 7025528 7403223 7445870 7729642
14428 7729642 7822571 7756133 7892381 7864941 7983975 8518777 8150761 8397643 8496987 8674753
14418 8674753 8523152 9153294 9111337 9199693 9123215 9392446 9686298 9713134 10085558 9645293
14408 9645293 10496003 10532085 10346221 10676188 10728231 10944080 10980271 11370765 11560097 11596558
14398 11596558 11718327 11511589 11936910 12196731 12380439 12600886 12946286 13116094 13329297
14389 13329297 13448510 13500186 13958486 14019750 14416981 14571466 14937700 15008974 15412572 16160029
14379A6160029p7053M06049p1311L50038M19007M00974J30607M34551N02150p1815
14369A8583226P07594M38979M16502L41750L68015M46693N03686O44343K59227
14360B2710015O42014M99128L62124P43421L88234N38668J005854K43384R64258
14351B8097100J67015J054498M66053O38400P47261Q17237J181190N15363R20122
14342C4604239J034551P85253J170708Q75526J206043J123857J047922J150223
14334D2998322J238717J532529J164990J482635J595793J391831J507193J721965
14326E4633975K142195J267927J993125K382194K241347K105506K314806K555444
14318G1636519K618134K710718K818122L018076K998712L694298L283445L766952
$$ plain form
14379 16160029 16082976 16489025 16417714 16767752 17186759 17587733 17718340 18152891 18655041 18583226
14369 18583226 19290820 19729799 20146301 20488051 20856066 21302759 21806445 22450788 22710015
14360 22710015 23352029 23851157 24213281 24956702 25344936 25883604 26889458 27132842 28097100
14351 28097100 28264115 29318613 29784666 30423066 31170327 31987564 33168754 33684117 34604239
14342 34604239 35638790 36424043 37594751 38470277 39676320 40800177 41848099 42998322
14334 42998322 44237039 45769568 46934558 48417193 50012986 51404817 52912010 54633975
14326 54633975 56776170 58044097 60037222 62419416 64660763 66766269 69081075 71636519
14318 71636519 74254653 76965371 79783493 82801569 85800281 89494579 92778024 96544976
14310I6544976M023931M179083M170923N179886M904060N033135N511188N945631
14302A35492813N997495O712844O709258P224470Q046731Q101828Q437587R101364
14294A95824390R592451J0411101J0249060J1411057J1781442J2175107J3138657
14287B74583265J3331791J3439061J4561304J4210319J5003112J4927006J4472712
14280C74528570J4726370J4021301J3431592J1957112J1440704R576803Q345487
14273D58027939O588991L775511P21904k017740k679113k656551k972495m592010
14265D54196436q013661j0023776j1811414j3388246j4286265j4649074j4962023
14258C67061977j4907908j5386823j5149334j4841753j3915316j3012700j3108971
$$ plain form
14310 96544976 100568907 104747990 108918913 114098799 119002859 124035994 129547182 135492813
14302 135492813 141490308 148203152 154912410 162136880 170183611 178285439 186723026 195824390
14294 195824390 205416841 215827942 226077002 237488059 249269501 261444608 274583265
14287 274583265 287915056 301354117 315915421 330125740 345128852 360055858 374528570
14280 374528570 389254940 403276241 416707833 428664945 440105649 449682452 458027939
14273 458027939 464616930 468392441 469114345 467096605 464417492 461760941 458788446 454196436
14265 454196436 446182775 436158999 424347585 410959339 396673074 382024000 367061977
14258 367061977 352154069 336767246 321617912 306776159 292860843 279848143 266739172
14251B66739172j2819920j2149110j1743589j1123101j0468734r707669r365531
14244A89361518q485798q463666p936759p632082p061071o704929n663244n663912
14236A31750057n792295n594228n037875m529740m638009l696312l638687m062397
14228I4760514l702976l220455l801757k953375l062833k666920k397046k549376
14220G0405776k120299k491450k287280j757886k400275j620201j563842j743326
14212E4421217j578239j607483j681891j887776p17130r34786r73666k157596
14204D2882650j109885q96011j420912n28440r87019j101617j224998q12105j035382
14195C3766281j007451k87076p12205q92555n83040q86138q35451n42799o94694
$$ plain form
14251 266739172 253919252 241770142 230026553 218903452 208434718 198727049 189361518
14244 189361518 180875720 172412054 164475295 156843213 149782142 143077213 137413969 131750057
14236 131750057 125957762 120363534 115325659 110795919 106157910 102461598 98822911 94760514
14228 94760514 91057538 87837083 84035326 81081951 78019118 75352198 72955152 70405776
14220 70405776 68285477 65794027 63506747 61748861 59348586 57728385 56164543 54421217
14212 54421217 52842978 51235495 49553604 47665828 46948698 46013912 45040246 42882650
14204 42882650 41772765 40876754 39455842 38927402 37940383 36838766 35613768 34801663 33766281
14195 33766281 32758830 32471754 31759549 30866994 30283954 29397816 28562365 28019566 27324872
14186B7324872q73632n99863k92148q55998m14366n29714o76578l38424n01551
14177B2242598o58786j69247l88086j51547o27486k65875o74546l97228O2278
14168A8972075o68818m31041L5910m55178l54074l82193o17147r7640j32800l79595
14158A5489499n5494l28689m54253j48575l09978j3160l83398k28736n44350J99063
14148A3221929j58872l09636n45392O1082k97001k49648l58336L77911m61060
14139A1280977l08178K37799n98393n9529j9289n9831l33036j39372j38520m6509
14129I816119j69335l46604K0530l59023l3275J89554K34240n57658m08225J97562
14119H583885j51502m45929L70341l03030k99597r7892L37993l39555l45813q3622
$$ plain form
14186 27324872 26451240 25851377 25559229 24703231 24288865 23759151 23082573 22744149 22242598
14177 22242598 21583812 21414565 21026479 20874932 20247446 19981571 19307025 18909797 18972075
14168 18972075 18303257 17872216 17908126 17452948 17098874 16716681 16099534 16001894 15869094 15489499
14158 15489499 15434005 15105316 14651063 14502488 14192510 14179350 13795952 13567216 13022866 13221929
14148 13221929 13063057 12753421 12208029 12269111 11972110 11722462 11364126 11742037 11280977
14139 11280977 10972799 11210598 10612205 10552676 10533387 10473556 10140520 10001148 9862628 9816119
14129 9816119 9646784 9300180 9320710 8961687 8928412 9117966 9352206 8794548 8386323 8583885
14119 8583885 8432383 7986454 8356795 8053765 7754168 7656276 7994269 7654714 7308901 7225279
14109G225279J38640r1717L1132K42414l76518k79103K2944j53635O6387k37701
14099F588122J72187k64245J63536k46916j29936j64429j05454K3471n7408k43732
14089E735196O5505L35626o83116J49790O3217o9484l233j14549J0399j89582
14079E299769l74784J76835L15975o12585L41271n19926M37295m7576j36433J26580
14069E006421p1453j90073j11121k05076k3613o85p9293J9858k4966J64769L40458
14058D825226l24868k20365o806k80907J97057j28847J11648p3930j95663j92843
14048C709702K48421j07833k66375R9064J37569p7026k43953j06771M86707l40585
14038C538920O8522N347J51715l84619j43908p7028M88620j74795j30906j21965
$$ plain form
14109 7225279 7363919 7272202 7303334 7545748 7169230 6890127 6913071 6759436 6825823 6588122
14099 6588122 6760309 6496064 6659600 6412684 6282748 6118319 6012865 6036336 5978928 5735196
14089 5735196 5800701 6136327 5453211 5603001 5666218 5596734 5593501 5478952 5489351 5299769
14079 5299769 4924985 5101820 5417795 4805210 5146481 4626555 5063850 5016274 4879841 5006421
14069 5006421 4934968 4744895 4633774 4428698 4405085 4404400 4325107 4344965 4319999 4484768 4825226
14058 4825226 4500358 4279993 4273187 3992280 4189337 4060490 4172138 4098208 3902545 3709702
14048 3709702 3958123 3850290 3583915 3682979 3820548 3743522 3499569 3392798 3879505 3538920
14038 3538920 3607442 3612789 3764504 3379885 3235977 3158949 3647569 3472774 3341868 3219903
14028C219903j27831L76456p4260m27829l4882J88676k35435M3247N16513j76823
14018C267735m84833L773q0732J09719J81414l12824n4756m8031j48269N07072
14008B940268k36755k40504j43683k11972N05389l8270k69629R5889k13437K3
13998B187319J20483k38310R4086M42597n71352N35749o8237j28442K91662P18342
13988C383897J596827N948739K1162987J8344494j8136060A6095820p033337k709356
13980F353127j123387o24260p18185n75379L01031n49816O0653J02775J18069
13971C344628m48183p7404r4270k24621J48934n8327l8791j29878j94483k55434
13961A972171K41214K80671n23029L89889k44619J88568K08585j33909J84649
$$ plain form
14028 3219903 3092072 3468528 3394268 2966439 2931557 3120233 2884798 2928045 3444558 3267735
14018 3267735 2782902 2786675 2705943 2815662 2997076 2684252 2629496 2581465 2433196 2940268
14008 2940268 2703513 2463009 2319326 2107354 2612743 2574473 2304844 2400733 2187296 2187319
13998 2187319 2307802 2069492 2163578 2606175 2034823 2570572 2502335 2373893 2665555 3383897
13988 3383897 4980724 10929463 32092450 50436944 32300884 16095820 9062483 6353127
13980 6353127 5229740 4605480 3887295 3311916 3612947 3063131 3123784 3226559 3344628
13971 3344628 2896445 2819041 2724771 2500150 2649084 2590757 2551966 2422088 2227605 1972171
13961 1972171 2213385 2494056 1971027 2360916 2116297 2304865 2513450 2379541 2564190
13952B564190l23334k8418j55405K53335Q5170k07226j33628J76268k22572j30083
13942A878297k79315K05786r767K98840j77014K0466M7443N1003l5836k18227
13932A781676M88080k48683j10746j63284j32980K70469J49769M8471k31005o6642
13922A785125J47409j71551k83777K59677J91277k44427k14666K85544l59445
13913A395166r162J75991o5027J27658k24870L45156j15038k18679q5386L17478
13903A643287j82723l1889J55609m14966K19582M912j89949R4641K00411k50733
13893A248182K35669J03514j62854J46843k25499q4126M09667l54638k16404P7630
13883A177984r5632P8837J30922L10678k78206j53065K17339J27694m45714J81641
$$ plain form
13952 2564190 2240856 2212438 2057033 2310368 2395538 2188312 2054684 2230952 2008380 1878297
13942 1878297 1598982 1804768 1795001 2093841 1916827 1937293 1984736 2035739 1999903 1781676
13932 1781676 2269756 2021073 1910327 1747043 1614063 1884532 2034301 2082772 1851767 1785125
13922 1785125 1932534 1760983 1477206 1736883 1928160 1683733 1469067 1754611 1395166
13913 1395166 1386004 1561995 1496968 1624626 1399756 1744912 1629874 1411195 1325809 1643287
13903 1643287 1460564 1428675 1584284 1169318 1388900 1393812 1203863 1298504 1498915 1248182
13893 1248182 1483851 1587365 1424511 1571354 1345855 1261729 1671396 1316758 1100354 1177984
13883 1177984 1082352 1161189 1292111 1602789 1324583 1171518 1388857 1516551 1070837 1252478
13873A252478J5533j58862J57920j57275Q9279j18737L94542j01839m1616j81041
13863A150382M31910k30628l06156J81677j73001J61011J98808j56923l36838
13854I20242M51701l25742n7878J45206j70193j17391K97329j7950j31235L85709
13844A379798p9640j93451k86360K15549j95350K99920M1464k21107J56811j08462
13834A009172k53462L69113k50424K92777n8244k71240J99549j00774o4006K27745
13824A100206l89794O44959E70206L78419J62870J62492k32077l60238J95424
13815H77096N5980K20952j63577O880r9793k7351L708j35174L62160l78389Q5707
13804H08199P8233K46562J5095k35575J26313l87693L13156k5953O6622k3870
$$ plain form
13873 1252478 1268011 1109149 1267069 1109794 1199073 1080336 1474878 1373039 1331423 1150382
13863 1150382 1582292 1351664 1045508 1227185 1054184 1215195 1414003 1257080 920242
13854 920242 1371943 1046201 988323 1133529 963336 845945 1143274 1125324 994089 1379798
13844 1379798 1300158 1106707 820347 1035896 840546 1140466 1181930 960823 1117634 1009172
13834 1009172 755710 1124823 874399 1167176 1108932 837692 1037241 936467 872461 1100206
13824 1100206 710412 1355371 570206 948625 1111495 1273987 1041910 681672 877096
13815 877096 933076 1154028 990451 997331 897538 870187 873895 738721 1100881 722492 808199
13804 808199 886432 1132994 1148089 912514 1038827 651134 964290 938337 1004959 981089
13794I81089k57324L02424k05417J91854r9130j85904o6705N759L45491J8554
13784A030691k032E03884K25472j04189M01948k74433M34400l43096J95777E05911
13773G32202J33221q2345J18915M3626k32613K05436J4961k49120M8912L73335
13763A106530l18092k54903N31804k38289B93187J11873K7811L24739l17081K22621
13753F63150N7868l0826o3723L78419l03084K93716m59410L32510l34776L68105
13743I01949j40706j31766j57248N16959m37050J17430J20938k43191j28276M73222
13733H92261J5061k06330K55295m75007K37763m3021r3468o8142j38240L81567
13723G57739L8433k37902J54999j04750j43545J86203K6329k18575q4609L21568
$$ plain form
13794 981089 723765 1026189 820772 1012626 913496 727592 660887 666646 1012137 1030691
13784 1030691 1028659 503884 729356 625167 1027115 752682 1187082 843986 1039763 505911
13773 732202 865423 783078 901993 945619 713006 918442 933403 684283 733195 1106530
13763 1106530 788438 533535 1065339 827050 293187 405060 432871 757610 440529 663150
13753 663150 721018 690192 626469 1004888 701804 995520 536110 868620 533844 901949
13743 901949 761243 629477 472229 989188 552138 669568 790506 547315 419039 892261
13733 892261 907322 700992 956287 481280 719043 676022 582554 514412 376172 757739
13723 757739 796172 558270 713269 608519 464974 651177 677506 458931 374322 695890
13713F95890j82739L47711l23213o0233k0663L49528M7058j24173P8533l61430
13703D46269M51417D11437L23344o2445l01116K45684B43675K92406q7328o9455
13693C79298j6724P6466p8558j8497l3163L5742J28243N45005D95307J46370j32246
13682E09431j25009k5861L08058n6850B52734M04427j56905J0967K48004k48110
13672E11117J70064k77354M35936m03421K48347p7100Q6947K5458j35192j94283
13662C90519R2585N5652k1939k38456L02795J73853C27064N4170L53693l51072
13652C83855m9205n9009J56522k5793L0083M1536K38515k28364J30594j19106
13642D99628J0253j9834P3959B00985Q1843A23034J03451L87144A29878J11476
$$ plain form
13713 695890 513151 860862 537649 477416 456753 806281 853339 729166 807699 446269
13703 446269 897686 411437 734781 672336 371220 616904 243675 536081 448753 379298
13693 379298 362574 439040 360482 341985 308822 344564 472807 1017812 495307 641677 509431
13682 509431 384422 358561 666619 609769 252734 657161 500256 511223 759227 511117
13672 511117 681181 403827 839763 436342 684689 607589 694536 719994 584802 390519
13662 390519 483104 538756 516817 278361 581156 755009 327064 381234 734927 383855
13652 383855 334650 275641 432163 406370 436453 477989 716504 488140 618734 499628
13642 499628 509881 490047 564006 200985 282828 123034 226485 613629 129878 241354
13632B41354J77808j23637L58645L6237B97659N1376j07907j11361L14000K7553
13622D71320j31980m839J45483q8753K80235j67409B14194R5095N3733K65109
13612F28131j49404k23911J44430k7991K27167m1541j37694m769R848A95245Q8387
13601B83632L85226k53785K4914A47700M61038k23365Q7542j9142l8766J99586
13591F14593j41866n7412l6096j24534M5286J11909j62544K48132j94661k8678
13581B74129Q921K7773J83820N1770k2638m1352Q8696A56923J60493c2762C42560
13569D76256j74430L52906k58836n55K6355O4555A88927m2060j2939L08660J60486
13558F03074q4501k926J8953q8928m1486A03633a87530B72107r0153p9963L69178
$$ plain form
13632 241354 419162 295525 654170 690407 297659 349035 241128 129767 443767 471320
13622 471320 339340 334501 479984 391231 671466 504057 214194 309289 363022 628131
13612 628131 478727 254816 399246 371255 598422 556881 419187 414418 424266 195245 283632
13601 283632 668858 415073 439987 147700 608738 385373 472915 453773 415007 614593
13591 614593 472727 415315 379219 254685 299971 411880 249336 497468 302807 274129
13581 274129 283050 310823 494643 546413 523775 482423 571119 156923 317416 -32762 342560
13569 476256 301826 654732 395896 395341 421696 486251 188927 146867 133928 442588 603074
13558 603074 518573 515647 534600 445672 404186 103633 -187530 272107 181954 101991 471169
13547D71169j84976O4799j11895j08202M59795j50222j18434P3760P6855c362
13536C37892D7287L58369A60247K30858j36527p9415J15990a01313C23832J58445
13526D82277k19780L21227k0772k32786L54198k96439b32515B20873N26821C12527
13515D68701p0813A90518K20793N2029A23980K00588A22301k0415J09578Q4112
13505B95576L2395L06939A54147c9523A65520J14024m3213K85617j18628A01096
13494A81756R7790H9352D3254M28373A0076L10962J81503A36043N4188K38474
13484D28705k8594A82972M0827p1092k1447K10373p9392q2507J94094K3255A05651
13472B12346L8697R487J46191A47866L92206I8550J11444J38600j733A13547J76156
$$ plain form
13547 471169 286193 350992 239097 130895 590690 440468 322034 395794 472649 -3362
13536 337892 47287 405656 160247 391105 254578 175163 291153 -101313 323832 482277
13526 482277 262497 583724 562952 330166 684364 387925 -232515 220873 747694 312527
13515 468701 397888 190518 411311 463340 123980 324568 122301 101886 211464 295576
13505 295576 327971 634910 154147 -39523 165520 279544 236331 521948 403320 101096
13494 181756 279546 89352 43254 471627 10076 321038 502541 136043 190231 428705
13484 428705 400111 182972 223799 152707 131260 341633 262241 179734 373828 397083 105651
13472 212346 251043 260530 406721 147866 540072 98550 209994 348594 346861 113547 289703
13461B89703A30049K68211G5796M01312l776A02693L24196A66759n936B8920n132
13450B3788K42403C448J22430O32349k13635j15875a14030A50019Q7338J92614
13440D29971p1829A04009L8167L81341A18319J43905a54710C79387N4693j44806
13430B89274m3269G5820a22709B54654K55371A96080n3877k9164J47231j24785
13420A35485n2318j2976J81065K36831B42626K61094A12783J77812L26487B97013
13409B24096F7446K82946P5482J47471B59443A15804K43697j03794a83527A69652
13398D63988B0067K26300J53649j00666K207j26214f1100B77743p0958b8443D40630
13386E8523K10950O9336f126C72759N5047a34657B4769a3790j6904B6569K25972
$$ plain form
13461 289703 130049 398260 75796 477108 473332 102693 426889 166759 160823 28920 23788
13450 23788 266191 3448 125878 758227 544592 428717 -114030 150019 237357 429971
13440 429971 358142 104009 142176 523517 118319 262224 -154710 379387 434080 289274
13430 289274 246005 75820 -122709 254654 510025 196080 142203 113039 260270 135485
13420 135485 83167 70191 251256 488087 242626 503720 112783 290595 617082 297013
13409 224096 67446 350392 425874 573345 259443 115804 359501 255707 -183527 169652
13398 463988 20067 246367 400016 299350 301557 175343 -61100 277743 206785 -28443 440630
13386 58523 269473 338809 -6126 372759 427806 -134657 24769 -13790 -30694 26569 252541
13375B52541A2109R6480J87071A42918K92495j81848J39010j35976P0718J18455
13365D45772M3486C9804g3484B24984F5249J44672K36329j63588A33792K27962
13355C61754d2019C89273A78674J52078n8231J3357I3239L18691b8251D0926j6074
13344B4852M74251A98903J20780k2008k9811J80559j80074A14729Q9192b10285
13333b7742A32146K70659j58572P2941F6676J89513D0809Q8673L1470G7970K10718
13322B88688M8063J57477n0869B12976K67083G5121R7262L44850B14258O5854
13312B80112M7717o1784j27682K74298B809N14953k52029P8469n8868j17972E9225
13300G9410M5389D7989k870b66070A93813H5577J42378a99378B64032A30366M3011
$$ plain form
13375 252541 12109 108589 295660 142918 435413 253565 392575 256599 327317 445772
13365 445772 489258 39804 -73484 224984 65249 209921 446250 282662 133792 361754
13355 361754 -42019 389273 178674 330752 272521 285878 93239 411930 -28251 40926 24852
13344 24852 499103 198903 319683 297675 267864 448423 268349 114729 203921 -210285
13333 -27742 132146 402805 244233 317174 66676 256189 40809 129482 160952 77970 288688
13322 288688 336751 494228 443359 212976 480059 75121 172383 517233 214258 280112
13312 280112 327829 266045 138363 412661 2809 517762 265733 344202 285334 167362 59225
13300 79410 124799 47989 45119 -266070 193813 85577 227955 -199378 264032 130366 173377
13289A73377o3679K2935n8256K37866j03016K76503A58049M601b6120A64752J11324
13278B76076K23097b96673B66953G8842J73598G1407n867d6477A39037a996k023
13267d019k23217C37860j37369E1573M40110A73413l796K2306J39134H4576r724
13256G4852J94007i8640B48827L47608I8224O2847O8163m2478N8525A22192k4868
13245I7324e1627B28659J12661p6292b39284B70505J68666E837L37577g584A91239
13233A82249J58701O7474C7824a25600C81162b07766b4392F2435c19031B64950
13222E6060h096D00145A13117j0942j8911K59896j37642f855j71538A73507e1017
13210A04470M3017N0190E5642P611L45145j66936q9698J08665q9678b10961C1621
$$ plain form
13289 173377 109698 132633 74377 312243 209227 485730 158049 162650 -26120 164752 276076
13278 276076 499173 -296673 266953 78842 252440 71407 65540 -46477 139037 -1996 -4019
13267 -4019 -227236 337860 200491 51573 491683 173413 169617 191923 331057 84576 74852
13256 74852 268859 -98640 248827 596435 98224 161071 229234 186756 245281 122192 97324
13245 97324 -51627 228659 341320 265028 -239284 270505 439171 5837 343414 -7584 191239
13233 182249 340950 408424 37824 -125600 381162 -207766 -24392 62435 -319031 264950
13222 56060 -8096 400145 113117 102175 83264 343160 205518 -6855 -178393 173507 -51017
13210 104470 147487 197677 55642 63253 408398 241462 151764 260429 170751 -210961 31621
13198B42366C6799a00294F2813K869J15842b16372B27736d979A79396J54715C9898
13186G626K30561N7681A28319J29617p5717A5829d2565B82950K10291A30824P683
13175A38507c1786A24068J06694d6145B83383D2281c3124A81101O2883c7947k14535
13164b52482B50153N2134A27911b48953A22440K51229A42126F9560c6997l2921
13154f9918B74048q2255n1885c3421j1598G9271b80052a9939F5532b92956E3288
13142E7993O2062K69821a51528c2322D69325b4405n6916C10094C0466K4842K42361
13131B97669G7435L41823k01933N8513j29555l8389J9805a47044b7651B05191
13120B88569m9610D4458J58102a1892A80141c3630I6069c1806D0954G138P212
$$ plain form
13198 242366 36799 -100294 62813 65682 181524 -216372 227736 -4979 179396 334111 39898
13186 7626 238187 295868 128319 257936 182219 15829 -42565 282950 493241 130824 138507
13175 138507 -31786 124068 230762 -46145 283383 42281 -33124 181101 243984 -37947 -252482
13164 -252482 250153 302287 127911 -248953 122440 373669 142126 69560 -36997 -69918
13154 -69918 274048 191793 139908 -33421 -45019 79271 -280052 -19939 65532 -292956 53288
13142 57993 120055 389876 -151528 -32322 469325 -24405 -81321 310094 30466 55308 297669
13131 297669 77435 419258 217325 275838 146283 107894 127699 -147044 -27651 205191
13120 288569 238959 44458 202560 -11892 180141 -33630 96069 -31806 40954 7138 14350
13109A4350R1826d1808B62730b8516B31253J8898k4620l0871m5529K51473G6849
13097h9091C56493j70160b5944F9440B001a91860o9645n8610a09365A82556F0193
13085A77132J6012F7039B682b41624A73559g9151L1217A98418b2121N868C51081
13073A22605J33054j09314J72348A08541a3964A34635c24527J42966A33982a41562
13062c1214E3234K83043l3259a31841A2539O2219a19582A04467K39482D455Q2751
13051H7206Q4472J6500b83075C24387K03831B3069J25964K4895C3882K04019a13241
13039B00530c0153j47025n02N8173D6196K46408g3352O278i561A79463a60596
13027B37037J28832a4330A19729K1366C5005j0421K61314H3025J2290g3782o8326
$$ plain form
13109 14350 106176 -41808 262730 -28516 231253 250151 225531 194660 149131 400604 76849
13097 -89091 356493 186333 -25944 69440 2001 -191860 -261505 -320115 -109365 182556 60193
13085 177132 193144 67039 2682 -241624 173559 -79151 -47934 198418 -22121 -16253 351081
13073 122605 255659 146345 318693 108541 -13964 134635 -324527 -181561 133982 -141562
13062 -31214 53234 336277 303018 -131841 12539 74758 -119582 104467 343949 4455 87206
13051 87206 171678 188178 -283075 324387 528218 23069 149033 173928 33882 237901 -113241
13039 200530 -30153 -177178 -177680 -119507 46196 292604 -73352 -67074 -9561 179463 -160596
13027 237037 365869 -14330 119729 141095 35005 24584 285898 83025 95315 -73782 -142108
13016a42108G5825a31328B17070I8667l5159e0134A59606B7681J51328L1984G315
13004B04177Q9077B9611J7789e3801j17364B12689r4533b97679A59495F7875d3216
12992A19914b56587B95758k8274K1580p4179f0629k07469A01751P2262e9736A00362
12980a19019A29038J88620R3044e0778C60206H7966O3263J43256c3540l036a4797
12968G0462a73042a2195B88375L4152J01888d33770E8068f4945b2366A8692R5058
12957A13750d6349g407A10473l934C6214a23623B94258F4956g2600n6317B03923
12945b4374C5504K17812j16791b10433D53144j80491a75535I7922m2702B4945
12934A58993C9405K1698E311b36917C50556A17309Q4342n286p8892K25024F1470
$$ plain form
13016 -142108 75825 -131328 217070 98667 63508 -50134 159606 27681 179009 210993 7315
13004 204177 293254 29611 47400 -53801 -171165 212689 118156 -297679 159495 67875 -43216
12992 119914 -256587 295758 267484 289064 214885 -60629 -268098 101751 174013 -59736 100362
12980 -119019 129038 317658 410702 -50778 360206 87966 151229 294485 -33540 -36576 -14797
12968 70462 -173042 -12195 288375 322527 424415 -433770 58068 -64945 -22366 18692 113750
12957 113750 -46349 -7407 110473 106539 36214 -123623 294258 64956 -72600 -128917 203923
12945 -24374 35504 253316 136525 -210433 453144 272653 -175535 97922 55220 24945
12934 158993 39405 61103 5311 -236917 350556 117309 201651 196365 117473 342497 61470
12922I8236j8653b1396l23513B19426a07675I2990c6705k34410C83789A27829
12911H1878c313A4291j362K06669c8589C17672i5942D5661O9827R3015n0036J64321
12899C22788j46802J5711J19432i0127C38559r9273b324A13893M4943j1568F9820
12887i0293A76551p1211n1600a07368C01637A07770c0214I462a07898A4854f7788
12875B24700b6323P157k01231C71055Q5150a92431P4260J3327A58874O8967m4684
12864A83157m3029n060b15804A2801J40570L8904F6324L57598G7063l936K53896
12853C27023d3660m0213B59208c69604B43835b29007P602O6825A72223P6559l8252
12842B10530n9167J62208M4880c17377J45612a0745A09241j3213b86294f3774
$$ plain form
12922 98236 79583 -21396 -344909 219426 -107675 92990 -36705 -271115 383789 127829
12911 81878 -3313 14291 12929 219598 -38589 317672 -95942 45661 115488 208503 158467 322788
12899 322788 175986 191697 311129 -90127 338559 239286 -2324 113893 158836 147268 69820
12887 -90293 176551 105340 53740 -107368 301637 107770 -30214 9462 -107898 14854 -67788
12875 224700 -26323 -19166 -220397 371055 456205 -192431 -118171 -104844 158874 227841 183157
12864 183157 140128 135068 -215804 12801 153371 192275 66324 423922 77063 73127 327023
12853 327023 -43660 -83873 259208 -369604 243835 -229007 -221405 -154580 172223 248782 210530
12842 210530 151363 313571 358451 -317377 -171765 -10745 109241 96028 -286294 -63774
12831B5343Q4984Q4854q1833a23780G0893P5631J3911a87836A19068a08771l4141
12820a42912B14948k725h8361p0803J1462d9267B40168E7349a35260A23609a08173
12808g9274E2551N0650a06941I1107c3023B72428A15810a72851D8389O1788J7150
12797A27327a93436c1479k29826d5672j26997C1420q647N2767b401A10789A2705
12785c14247e6855A14213O6566O9737B6054N5093c22473C97395c3929B25190a58595
12773A5974f8803D0775L45835A71462b78850L2166A52678J67181b234H7296c13825
12761c22911G8953c8973B22219g8992j16547P9700E4873a04371j64405d5187k06393
12750b51580A06320B8222f2286I6870J29696a09669m4039j00436A95099Q2890
$$ plain form
12831 25343 110327 195181 113348 -123780 70893 146524 160435 -187836 119068 -108771 -142912
12820 -142912 214948 212223 -88361 -159164 -147702 -49267 240168 57349 -135260 123609 -108173
12808 -79274 52551 103201 -106941 91107 -33023 272428 115810 -172851 48389 110177 127327
12797 127327 -193436 -31479 -261305 -45672 -172669 31420 22773 75540 -2401 110789 12705
12785 -314247 -56855 114213 180779 250516 26054 81147 -322473 397395 -33929 225190 -158595
12773 15974 -68803 40775 386610 171462 -278850 -246684 152678 319859 -2234 87296 -313825
12761 -322911 78953 -38973 222219 -78992 -195539 -115839 54873 -104371 -268776 -45187 -251580
12750 -251580 106320 28222 -62286 96870 226566 -109669 -153708 -254144 195099 277989
12740B77989E0651i0419j49745a05760j0072e3057B69202b7306B66615F7685c1954
12728F4786f2652B05132a50679A04717a48968A27982a26344F0350h9788q7105
12718a76893B79915j04944c20137c4637j91062D8320d3843k09498B21165I1646
12707D15146k02769a68845B82005h5724A96819N4036C2266J88306j668F0750a79322
12695a43541B68328n2240a08716I4102D4190L4847a59653E2456M2639e4485K5688
12684b8797A49850A8078e742B23163c1207A03930R9510M5225j10823J25974I2057
12672c8694j32106D32615A92956K0177a91119n7009a00572l9523d2121B31573
12661i6705A25751L21585k16411f4780j03362B95770F4005a33057E91597A75749
$$ plain form
12740 277989 50651 -90419 -240164 -105760 -115832 -53057 269202 -27306 266615 67685 -31954
12728 64786 -62652 205132 -150679 104717 -148968 127982 -126344 60350 -89788 -176893
12718 -176893 279915 174971 -320137 -34637 -225699 48320 -43843 -253341 221165 91646
12707 415146 212377 -168845 282005 -85724 196819 250855 32266 220572 218904 60750 -179322
12695 -143541 268328 216088 -108716 94102 44190 79037 -159653 52456 95095 -54485 -28797
12684 -28797 149850 18078 -5742 223163 -31207 103930 203440 248665 137842 263816 92057
12672 -38694 -170800 432615 192956 213133 -191119 -248128 -100572 -140095 -42121 231573
12661 -96705 125751 447336 230925 -64780 -168142 295770 64005 -133057 591597 175749
12650D3135L56135h7653q4221j23152A27432J13263F0166J75672g4749b3512j08015
12639a31527C2675a5182a488G6273a10240G2671J65915A1964c38572B500b6414
12627B75487A31537D8351J44735B2538h4222L9088B08730N5975J0665M2376B4670
12615i9299A27373R7082M3831B0817K6675e1621B02230j4916h7907A30357D1948
12603A25041J63581a36629B78637j18961P9343J36078J9064j27794b4988B32930
12592D8250K44156d4791A40888c13287G8130a36989F2837M2886a24044K588I3123
12580b0161j14710A01780l6273b77579A59607K5662L09709B5984J73400a06115
12569B29469E1775J64136N9952Q7663e2593a5063A70095m0811D3534C850J47783
$$ plain form
12650 43135 399270 -87653 -171874 -295026 127432 240695 60166 235838 -74749 -23512 -131527
12639 -131527 32675 -15182 -1488 76273 -110240 72671 238586 11964 -338572 2500 -26414
12627 275487 131537 48351 193086 22538 -84222 -45134 208730 264705 275370 317746 24670
12615 -99299 127373 224455 268286 20817 47492 -51621 202230 187314 -87907 130357 41948
12603 125041 288622 -136629 278637 159676 239019 375097 394161 266367 -24988 232930
12592 48250 292406 -44791 140888 -313287 78130 -136989 62837 105723 -124044 -121456 93123
12580 -20161 -134871 101780 65507 -277579 159607 185269 494978 25984 199384 -106115
12569 229469 51775 215911 275863 363526 -52593 -15063 170095 129284 43534 3850 151633
12558A51633f1016D66032k22293c28010A64821o8680B6626K6228O7686a9032A94248
12546f3081C1308c65964N4798B6157b98597g7619L887A46464h6423D21234e8108
12534a26852C5065l337B177L2455K88080a08934B76810j28654b7412l8423D060
12522A20886b25702F8358m876a8501A14285a20478G2677a99208A59133L812F8779
12510c987B23971c5902k35190C8228J88906a29207D2532K13769A07989B631N5890
12499E8521J46827H9511A5717L5701g2865r1045J352O6618B09372c2515J2064
12488b0451C0212E231c39165A15177f4993m31262D8645b4007q5611d2047D5124
12476a39299c1987j7256A70899b3198B53164A04300A9250J58999o0763j2486D7927
$$ plain form
12558 151633 -61016 466032 243739 -328010 164821 96141 26626 52854 120540 -19032 194248
12546 -63081 31308 -365964 -311166 26157 -298597 -77619 -73732 146464 -86423 421234 -58108
12534 -126852 35065 31728 2177 34632 322712 -108934 276810 148156 -27412 -65835 4060
12522 120886 -225702 68358 63482 -18501 114285 -120478 72677 -199208 159133 162945 68779
12510 -3987 223971 -35902 -271092 38228 227134 -129207 42532 256301 107989 2631 58521
12499 58521 205348 89511 15717 51418 -72865 -163910 -162558 -95940 209372 -32515 -20451
12488 -20451 30212 5231 -339165 115177 -64993 -496255 48645 -24007 -109618 -42047 45124
12476 -139299 -31987 -49243 170899 -23198 253164 104300 19250 178249 117486 105000 47927
12464c54415O2901F6352a46475C93254G1357A229d8787D7604b30558f4337c1739
12452B78882E0917K99582c7913A50455j3090a78894B45253j13492J39111a55500
12441A87508G4397c33899C8953R2198b70144A88698a9705B95491H0095e9749k72310
12430c32059m2353l2406C971J82326a26114r4507M4192H1271g2556A00045B0700
12418C4688J02090E4966c85140d4036C31206i7865F6318J79692a00721j2629J3754
12407i9596E2782K02252a00105D03727E034J0969M26370a51917M5666I8570d93316
12395c14614a43523C1126a20635N1973j97k6168o5894B44967a8163j74880G337
12383A15295a15711G2475o604J42770m620B8496a08909n5814A92827c9483A31653
$$ plain form
12464 -354415 -291514 66352 -146475 393254 71357 1229 -48787 47604 -230558 -64337 -31739
12452 278882 50917 350499 -37913 150455 137365 -178894 245253 131761 270872 -155500
12441 187508 74397 -333899 38953 131151 -270144 188698 -19705 295491 80095 -59749 -332059
12430 -332059 -374412 -406818 3971 186297 -126114 -220621 -176429 81271 -72556 100045 20700
12418 34688 136778 54966 -385140 -44036 331206 -97865 66318 246010 -100721 -113350 -99596
12407 -99596 52782 255034 -100105 403727 5034 16003 442373 -151917 -106251 98570 -493316
12395 -314614 -143523 31126 -120635 -68662 -68859 -95027 -160921 244967 -18163 -193043 7337
12383 115295 -115711 72475 65871 208641 204021 28496 -108909 -164723 192827 -39483 131653
12371B09386q2169J4840a10406F7256a58694m2002L4646I0837j3400e995j16078
12360a22073L7136B0661b54959C9305b21246E3731b4427C08009c4895j74584K3022
12349a86457A27784P5450G4732A3506K05570L024j00649d0657c417m12117e2449
12337A97537a09102m07284B58516j24026n9062K3577K02211d0459A02919a76629
12326C3447P6677a80051H2931f50m0480C0719L58073d023k73579L3527D4934i7241
12313A41500b91573A66440B6858B732b14611c5549G3725b1482C15962F6159L0291
12302I6450K6553a90930f5630j24581A90277L2124H3744a3057D6527J88456a51418
12290A8614K35098B8751b57305A91777G3103J21956E7269R6559b53732A43119
$$ plain form
12371 209386 127217 142057 -110406 67256 -158694 -200696 -166050 90837 77437 -5995 -122073
12360 -122073 -84937 20661 -254959 39305 -221246 53731 -24427 308009 -34895 -209479 -186457
12349 -186457 127784 203234 74732 13506 219076 222100 121451 -40657 -3417 -415534 -52449
12337 197537 -109102 -516386 258516 134490 75428 99005 301216 -40459 102919 -176629
12326 33447 110124 -180051 82931 -650 -41130 30719 388792 -4023 -277602 -244075 44934 -97241
12313 141500 -291573 166440 26858 2732 -214611 -35549 73725 -21482 315962 66159 96450
12302 96450 123003 -190930 -65630 -190211 190277 222401 83744 -13057 46527 234983 -151418
12290 18614 253712 28751 -257305 191777 73103 195059 57269 153828 -253732 143119
12279C81917h1043m3735B63449j23573n1650L86538k6262j49307j6718f0180A53102
12267B04060a92517g7433K4770C08177F3005J20387F37N14389D8787J59827I1522
12255A69178N9033D6004O0015C491J85312J52983a54035C9875K72561b52233H8537
12243a35841C18881j5364j32413J99014i2396D8003K33548A14060a24738e6479
12232H419L87015j87295b32872A45676K46252A07424a31043B4632K38977a17179
12221F19554B77662e6612D90944h6780A33835N2973b53780B17599M8732c2497
12210B85801A01157M2338J60921B4253L37080D8098K48006C7742J22774a44956
12199I1073a40484C28933j09681J64066l4562g84A44135d1491A99156K59404j01000
$$ plain form
12279 381917 -81043 -124778 263449 139876 88226 474764 448502 299195 282477 -60180 153102
12267 204060 -192517 -77433 -52663 308177 63005 183392 637 515026 48787 208614 91522
12255 169178 228211 46004 106019 3491 188803 341786 -154035 39875 312436 -252233 88537
12243 -135841 318881 303517 171104 370118 -92396 48003 281551 114060 -124738 -56479
12232 8419 395434 208139 -232872 145676 391928 107424 -131043 24632 263609 -117179
12221 619554 277662 -56612 490944 -86780 133835 186808 -253780 217599 266331 -32497
12210 285801 101157 143495 304416 24253 361333 48098 296104 37742 160516 -144956
12199 91073 -140484 328933 219252 383318 348756 -784 144135 -41491 199156 458560 357560
12188C57560E9469k765h7760A41192O1328L27896A2013a00645o027C5701J69281
12177B04982R5829e2269C5360Q2961J66502J1359r6035P1073j10609K6581p4720
12166A12472d2882A53590b26631A64633m4684i67j49634C40731A3164g3955B69650
12154A17299a06620A85241F1991K75858D2763A5231J75950A9461b60083I4451
12143b10340A43110a8006f425A86635J512E6231J28709a55008B59J35054a66673
12131g0297A03634g33A29045e5388G625J24422O5546a34843g818B26560a89806
12119A32272i6818B21609k1260m1936J32803E3407P6176C089c46260h1986l1732
12108a13718C50271D2437N7033f397l2812A66848C6261A5914d3689R78i348j14011
$$ plain form
12188 357560 59469 56704 -87760 141192 202520 530416 12013 -100645 -106672 35701 204982
12177 204982 300811 -52269 35360 118321 284823 296182 200147 271220 160611 187192 112472
12166 112472 -42882 153590 -226631 164633 119949 -967 -150601 340731 13164 -73955 269650
12154 117299 -106620 185241 61991 337849 42763 15231 191181 19461 -260083 94451
12143 -210340 143110 -18006 -6425 186635 188147 56231 184940 -155008 259 135313 -166673
12131 -70297 103634 -733 129045 -55388 7625 132047 197593 -134843 -7818 226560 -189806
12119 132272 -96818 221609 200349 158413 291216 53407 129583 3089 -346260 -81986 -113718
12108 -113718 350271 42437 99470 -6397 -39209 166848 36261 15914 -43689 -42711 -9348 -123359
12096a23359K9969b2893j34270a9585j52878A59316J64126B5618K3414J96489
12086B45521B0167J21221c2595d884m47419A73456a88953A94328H8803N08604
12076E97407K1995J571173p52753o94448G0794g7220B0622J16730J62079D6130
12065d0387B10728b05091G8960L15058A77865a60697B4435A0096b33684l232d7632
12053E6994a07576A89235c6593b939l49594A95637f4747F6608B5491Q725d3673
12041B19733o0745J14262h9665A41198h2570A08092a24410q963A22609L3241n920
12030A49930a41096o5539N259f5558A94542a33707d1685n4226p7718p7047h9626
12018a24708A12268C664a90190G2266B9992f9315G5258J73837p8567a09116p7874
$$ plain form
12096 -123359 -93390 -22893 -157163 -19585 -172463 159316 323442 25618 49032 245521
12086 245521 20167 141388 -32595 -4884 -452303 173456 -188953 194328 88803 597407
12076 597407 619402 2190575 1437822 743374 70794 -77220 20622 137352 299431 46130
12065 -40387 210728 -205091 78960 394018 177865 -160697 24435 10096 -233684 -236916 -47632
12053 56994 -107576 189235 -36593 -2939 -352533 195637 -64747 66608 25491 34216 -43673
12041 219733 158988 273250 -89665 141198 -82570 108092 -124410 -133373 122609 155850 149930
12030 149930 -141096 -206635 -201376 -65558 194542 -133707 -41685 -95911 -173629 -250676 -89626
12018 -124708 112268 3664 -190190 72266 29992 -69315 75258 249095 170528 -109116 -186990
12007a86990C4061a78414L9203r010j37606E717M067P0665a41348A0498h1464
11995H6199J76202b59386Q1268C1115a07255E2756a71090C0230a65292p9057D5540
11983c73483J67699L320j09929A88962J99929b7396E9986M8809j4571a54911A17523
11971h7624k3516A8229J13004a48242o9184F7248a05021I2970a94396Q238A88253
11959B12640g8483j51706g4496L1121K613A13605J46551d01A88127E1710J47468
11948A99178o4982C2455h1864B28690d7086j93494H7288a74961A21748O5709J35856
11937C23313E3483R8190a748H9260a52843j916D2509f4004l1853q141M8250q8771
11925a44519A8096b93342B26151J71555A748K33745M9896I3971b28387k0816B24060
$$ plain form
12007 -186990 34061 -178414 -139211 -148221 -285827 5717 9784 80449 -141348 10498 -81464
11995 86199 262401 -259386 -178118 31115 -107255 52756 -171090 30230 -165292 -244349 45540
11983 -373483 -205784 -202464 -312393 188962 388891 -27396 59986 108795 94224 -154911 117523
11971 -87624 -111140 18229 131233 -148242 -217426 67248 -105021 92970 -194396 -186158 188253
11959 212640 -78483 -230189 -74496 -43375 -40762 113605 260156 -401 188127 51710 199178
11948 199178 134196 32455 -81864 228690 -47086 -240580 87288 -174961 121748 187457 323313
11937 323313 53483 151673 -1748 89260 -152843 -154759 42509 -64004 -95857 -103998 -55748 -144519
11925 -144519 18096 -293342 226151 397706 1748 235493 285389 93971 -228387 -249203 224060
11913A33755J78604a79329L0049A81269K52963A12678l7270a15290N7299E385
11902c39289K7337a46586F8031L3550b53509a1408k4080k25887G0974J01535a95338
11890b0098C0965J12792J70969j02232J00387a98206B1692a31330A69867d6886
11879A8901f2234G7008K09313a13359F6674N9472d81081E4506a08917p2078j39837
11868c20832h6351B61327b73007B03956b3737B26737b83857b3438A87810p7278
11858A10532a99724h159p9582j33494G8536g606p7073A03554a90174B03200G8170
11846h6243k831L6925e820j90778b7301B76020i635r8841e3916j84265A99322
11834e5143o7408j81758E5872a14917j63462F3405f0365j61479J8531A63687f0148
$$ plain form
11913 133755 312359 -179329 -149280 181269 434232 112678 75408 -115290 -57991 5385
11902 -339289 -311952 -146586 68031 101581 -253509 -11408 -35488 -261375 70974 172509 -195338
11890 -20098 30965 143757 314726 212494 312881 -198206 21692 -131330 169867 -46886
11879 18901 -62234 77008 286321 -113359 66674 126146 -481081 54506 -108917 -180995 -320832
11868 -320832 -86351 261327 -273007 203956 -23737 226737 -283857 -23438 187810 110532
11858 110532 -199724 -8159 -87741 -221235 78536 -7606 -84679 103554 -190174 203200 78170
11846 -86243 -89074 -52149 -5820 -196598 -27301 276020 -9635 -108476 -53916 -238181 199322
11834 -55143 -122551 -304309 55872 -114917 -278379 63405 -60365 -221844 -203313 163687 -60148
11822b7288p218B54085r399b8463A08144a44414D110K03389l1746D9271f3036
11810b41304A01234b14091e815I1722J74416a16990B09513b5599I417a2569B36999
11798a0048j46346d9864A56737P2064l4851D939e6367m5437A15977E94c41463
11786A71405d0888n2985M3336q3498c2162D1164b80179C19028A20230l4196c5464
11774A07431a74336K1022f0722k4812B1113L11909q6134A17525n4951b321B22031
11762c8620j37631n6978A54711k1971a84118A22548B3502a30247j88176a53324
11751e0998C15464b75821A59903J81784b04923C31664a02557A76858c069G6579
11740A09132E0830K5713b68281d207k7441B43737b48750C7138L07807D7224N1310
$$ plain form
11822 -27288 -34506 254085 244686 -28463 108144 -144414 4110 207499 175753 49271 -63036
11810 -241304 101234 -214091 -5815 91722 266138 -116990 209513 -25599 9417 -12569 236999
11798 -10048 -156394 -49864 156737 228801 193950 4939 -56367 -101804 115977 594 -341463
11786 171405 -40888 -93873 -50537 -134035 -32162 41164 -280179 319028 120230 86034 -35464
11774 107431 -174336 -153314 -60722 -85534 21113 333022 246888 117525 62574 -2321 222031
11762 -38620 -176251 -233229 154711 132740 -184118 122548 23502 -130247 -318423 -153324
11751 -50998 315464 -275821 159903 341687 -204923 331664 -102557 176858 -3069 76579
11740 109132 50830 76543 -268281 -4207 -31648 243737 -248750 37138 344945 47224 98534
11729I8534c64053J42149B31056b59205Q2815g3588j31752l3178C6220a02146
11718a20612j9598l6947A51K0959K0815e8809A44396m2035D967a04615B76989
11706D7929J4154a94402M5326A64619C0402e2878k24327d243A1731e1060g537
11694A85857f5341D54867a36113A1934i2950K6542G4367h5591D291e3749l03189
11683c56938J05108B35464a81115A24389J70888g418m0492F580J21210K00005
11673C27795j48570a31700e4870B19130C8644O725f6801j306k24336K8876n5376
11662c18943B56056A4409b07863i9315B72026a38457B97400j16212j7562a1394
11651A83870m6859e3044H2776a64320j14318A37164a5104A28251b00105a3511
$$ plain form
11729 98534 -364053 -221904 231056 -259205 -176390 -73588 -205340 -238518 36220 -102146
11718 -120612 -140210 -177157 151 21110 41925 -58809 144396 102361 4967 -104615 276989
11706 47929 62083 -194402 -149076 164619 30402 -52878 -277205 -4243 11731 -51060 -7537
11694 185857 -65341 454867 -136113 11934 -92950 -66408 74367 -85591 4291 -53749 -356938
11683 -356938 -251830 235464 -181115 124389 295277 -7418 -47910 6580 127790 327795
11673 327795 179225 -131700 -54870 219130 38644 45369 -66801 -68107 -292443 -263567 -318943
11662 -318943 256056 14409 -207863 -99315 272026 -138457 297400 181188 163626 -11394
11651 183870 137011 -53044 82776 -164320 -278638 137164 -15104 128251 -200105 -13511
11640D5722g8272k10524b0160k47503A90130f5351k34564A1254L7012b37536A6107
11628A39641R897J57385B5566a97637H6709k4204J51081l2613b0326c516j23583
11617a27099I9759N2200k6494A2273J11955d037l62189A57313p2577J20132c7172
11605i7820l2959a0478B12082P5270A33845P6330a07564C6621e3619B57048B0981
11593B8261K40448a07046P926A91020K40128q6712I3297J7870J8730h7168b6106
11581B29471l9176P4784G725h3895c3713l19045A77562H3063J16258a39802j96906
11570c36708A82936h9868E0310J22891L5340b0493B4046m552a97358Q3713B4445
11558B89042K72729b583D17416G7181D099b44392B2082L02200j13404c22804C68455
$$ plain form
11640 45722 -78272 -288796 -20160 -267663 190130 -65351 -299915 11254 48266 -237536 16107
11628 139641 149538 306923 25566 -197637 86709 62505 213586 180973 -20326 -3516 -127099
11617 -127099 99759 151959 125465 12273 124228 -4037 -366226 157313 84736 204868 -37172
11605 -97820 -130779 -10478 212082 287352 133845 210175 -107564 36621 -53619 257048 20981
11593 28261 268709 -107046 -99120 191020 431148 344436 93297 111167 129897 -87168 -26106
11581 229471 190295 265079 7725 -83895 -33713 -352758 177562 83063 199321 -139802 -336708
11570 -336708 182936 -89868 50310 173201 208541 -20493 24046 19494 -197358 -113645 24445
11558 289042 561771 -2583 417416 77181 4099 -244392 22082 324282 210878 -322804 368455
11546A12790l9022c882G0378K61743a54957M4466A17873J84167f4522A3488K4424
11535C7912J03939D3293K9272b09201e032B7296O0844J55265G7543g5118C58664
11523A20291n003a0498p6504D3907J1444J46613H5307B5663c1739J4090f475B9803
11510C63349C9158N3443A1860O08120e0946E4602J48632c8505k4370o6775C10714
11498C14893j13210H584M45562p5436j16481n2053E6684i1319C07545o6709Q4636
11487C25472a29048A00409K2165c06223J35151B75055b19272F36035g8367A4040
11476C43636a0082A38872a2789D6754O5534R8481e3967A62063p0975b9482o7337
11465i6819C00261I0204e2557A34634D9935J82131b28927f5699B00550F5906j4962
$$ plain form
11546 112790 73768 -3882 70378 332121 -154957 -110491 117873 302040 -64522 13488 37912
11535 37912 141851 43293 72565 -209201 -5032 27296 88140 243405 77543 -75118 358664
11523 120291 115288 -10498 -87002 43907 55351 201964 85307 25663 -31739 -17649 -6475 29803
11510 363349 39158 92601 11860 619980 -50946 54602 203234 -38505 -62875 -129650 310714
11498 314893 201683 8584 454146 378710 262229 210176 56684 -91319 307545 240836 325472
11487 325472 -129048 100409 122574 -306223 -171072 275055 -219272 636035 -78367 14040
11476 343636 -10082 138872 -12789 46754 112288 210769 -53967 162063 91088 -29482 -96819
11465 -96819 300261 90204 -52557 134634 49935 232066 -228927 -65699 200550 65906 50944
11454E0944P7936l2275J56509c6204j7165I6360K9664g424D8018K5384L4695K49710
11442C57807j5442i5244A01832N0382o8096j5676k103R1591F9638K7744a90015
11430A66462J45127N8516b03191R9633c2861a2611C85184A62327D0039e86190
11419I3385b25238b7184H0770a00375l7457f2131B23138a52018C9747J50873D7321
11407A3559f17754C3308f8580B24105a18498j62924C78986g023A31264h1890n5998
11396a37888A48719b59124b1997p1938B15481e0146m1092A20725J25876o1555
11386A85046i2186j3596d6123A54065M790j0355D3504a34260D09129b46520B63880
11374A10175N1914k1393K39011E4549Q8645i1474n39897A05227b82934H309J1202
$$ plain form
11454 50944 128880 96605 253114 -36204 -53369 96360 126024 -7424 48018 73402 108097 357807
11442 357807 342365 -95244 101832 152214 84118 68442 66339 157930 69638 97382 -190015
11430 166462 311589 370105 -203191 -103558 -32861 -12611 385184 162327 40039 -586190
11419 93385 -225238 -27184 80770 -100375 -137832 -62131 223138 -152018 39747 190620 47321
11407 13559 -617754 33308 -68580 224105 -118498 -281422 378986 -7023 131264 -81890 -137888
11396 -137888 148719 -259124 -21997 -93935 215481 -50146 -91238 120725 246601 185046
11386 185046 -92186 -105782 -46123 154065 158855 148500 43504 -134260 409129 -246520 263880
11374 110175 162089 140696 379707 54549 143194 -91474 -631371 105227 -282934 8309 19511
11363A9511R332f1141a2548k81408J18850g6831j10199B47472q557B6228c80560
11351g8354j41502b1204l37811a00340L2450G9560b56576H2269a34362C59599
11340A31924a8649k16389C28512a39720A21769G042b30245c6406j99701a8133
11329A69072a54676m6630l4036k086R2237r1470B23096o5620K1440Q1016b71711
11317A22496b1995l35378h7911B19290a93638j14295C4005L38865c5614A10467
11306b73575b5983j48332J6863m7163B966a54042J8531k37964A10273K7978c36666
11294D91714k35110b46587i0561c2588p4111o3183Q3678A43786B2543c3609A34584
11282f2147l78233c4948a7249B53500C2750i8465A3839c73085h7506a7512j79000
$$ plain form
11363 19511 28843 -61141 -12548 -293956 -175106 -76831 -187030 247472 238915 26228 -380560
11351 -78354 -219856 -21204 -359015 -100340 -67890 79560 -256576 82269 -134362 359599
11340 131924 -18649 -235038 328512 -139720 121769 7042 -230245 -36406 -236107 -18133
11329 169072 -154676 -201306 -235342 -237428 -145191 -236661 223096 157476 178916 259932 -271711
11317 122496 -21995 -357373 -87911 219290 -193638 -307933 34005 372870 -35614 110467
11306 -273575 -25983 -174315 -157452 -204615 2966 -154042 -135511 -373475 110273 138251 -336666
11294 491714 256604 -246587 -90561 -32588 -106699 -169882 -86204 143786 22543 -33609 134584
11282 -62147 -440380 -34948 -17249 253500 32750 -98465 13839 -373085 -87506 -17512 -196512
11271a96512f5461K911H4542a33676k83976e1856b803A11131c6007A09206E3752
11259a21439A47267a7486l39122f7936K4431C0372c00232J07958J4676H9764a3967
11247A53857O370b23347h6533A37406K23570B6756L4613a8774j03617f139D9956
11235d9944A94334I4116b36293A56683O0609a71259D4559N0908a06469B12272
11224a12493A95289g2169L1916A04621b33650D4006c7067C22233G9405b34998
11213B7447c8995j06052j45526A80134d2497q3889O1947G4479M911b42986h7606
11201I3402K52803A24541J79699G1433a18421A2850a70858g985j54335D3712i9479
11189A0967a35032H3701K6397N1208d8339M702K0351A17984C2801a00749A86356
$$ plain form
11271 -196512 -65461 -62550 84542 -133676 -417652 -51856 -2803 111131 -36007 109206 53752
11259 -121439 147267 -17486 -356608 -67936 -43505 30372 -300232 -192274 -177598 89764 -13967
11247 153857 160227 -223347 -86533 137406 360976 26756 61369 -18774 -122391 -6139 49956
11235 -49944 194334 94116 -236293 156683 217292 -171259 44559 95467 -106469 212272
11224 -112493 195289 -72169 -40253 104621 -233650 44006 -37067 322233 79405 -234998
11213 27447 -38995 -145047 -290573 180134 -42497 -126386 -64439 74479 79390 -242986 -87606
11201 93402 346205 124541 304240 71433 -118421 12850 -170858 -7985 -162320 43712 -99479
11189 10967 -135032 83701 110098 161306 -48339 -43637 -23286 117984 32801 -100749 186356
11177b78225h0391o9512N2847D3207Q6445J96781a08180k19707J23450c0412j00955
11166a31367e7731B96748A39801o8456J39491j5271m6596f4048F6841a98231P1937
11155a26294F6606b52287e1278j9039o5013p8756n8597j46508A15052b4399k50572
11144b74971J14019B79823F748d4325R65o8332k3482r651N9281E7273c21957C3985
11131c3586j777A74688a64436e7553D36660N5241A55352J2502m8955K3421c3152
11119a41965A70859g1951L3096B18626a87060O8434A68371a35798m3292J027E43723
11107B2434a01121j35739B65083G9369J2467L531L3955J27503A21190K47427A48581
11095D8039J20354l781f6674E0687K46914J44584j84510j13587E2024K08267A6007
$$ plain form
11177 -278225 -80391 -149903 -97056 43207 129652 326433 -108180 -327887 -204437 -30412 -131367
11166 -131367 -57731 296748 139801 71345 210836 195565 148969 -64048 66841 -198231 -126294
11155 -126294 66606 -252287 -51278 -70317 -135330 -214086 -272683 -419191 115052 -24399 -274971
11144 -274971 -160952 279823 6748 -44325 -43360 -111692 -135174 -144825 -85544 57273 -321957 33985
11131 -33586 -35363 174688 -164436 -57553 436660 491901 155352 167854 118899 142320 -33152
11119 -141965 170859 -71951 -38855 218626 -187060 -118626 168371 -135798 -179090 -178063 543723
11107 22434 -101121 -236860 265083 79369 91836 95367 129322 256825 121190 368617 148581
11095 48039 168393 164612 -66674 50687 297601 442185 257675 144088 52024 260291 16007
11083C09438e2142H4659L74613j94896C450P226K08787k8246J60433B5097K13827
11072B38924A00775J22294M53031D8330d9922E41190j46306r77N9227l1150J40397
11061E62381J06822F8726N59452k81935L03163J07044m5808k2010M9134J75861
11051I13627j79693B65623M89382L2751Q4648N1201k21472j59189K36410k95733
11041D83621K2711L02747k11886L35430j59186j44629J22280J24213j47216l4398
11031F93687K71440k80401k405q6286L11206R4561p2790m48987L86635j48150
11021G18510k62562J50744j75759L01892J86266k51316m4233J90034K1525r9947
11011G35154j85739k24922K67080j88057N36053D62593L19046A96103L82022k41089
$$ plain form
11083 309438 -52142 84659 459272 264376 3450 10676 219463 191217 351650 25097 238924
11072 238924 100775 223069 676100 48330 -49922 541190 394884 393907 453134 421984 562381
11061 562381 669203 68726 628178 346243 649406 756450 710642 688632 737766 913627
11051 913627 733934 265623 755005 787756 872404 923605 702133 542944 779354 483621
11041 483621 506332 809079 597193 932623 773437 628808 751088 875301 728085 693687
11031 693687 965127 684726 682321 596035 907241 1001802 929012 480025 866660 718510
11021 718510 455948 606692 430933 732825 919091 667775 623542 813576 835101 735154
11011 735154 549415 324493 591573 403516 939569 462593 781639 196103 578125 337036
11001C37036K67864q496Q8494O4286k03840R7474j34356K40955R1755j44846K6825
10990G23151k4847r3199j50287J31268J48577J50424m9407J48060k30405m318
10980G49017J33459L81291p9023K50945k2846K75153M05266J69553O52558N7026
10970B972399j96187J9606n3189k45128k92012k48173j17489l79825J95788r5669
10960A560121N1519P1625k52348L1221M20466n26192K21502j60381J27574m12246
10950A132861k67725P654C61165J31955J48118k11582H3504J50646R5815E4338
10939B21480a2535A4930K42292r4805K900k2624K2791n0899A3345h6914B57918
10927H9347P6766o3581b92851a14161A11833J01812O020G9026K57223j03508C5234
$$ plain form
11001 337036 604900 596404 684898 749184 545344 642818 508462 749417 841172 696326 723151
10990 723151 698304 605105 454818 586086 734663 885087 835680 983740 753335 749017
10980 749017 882476 1263767 1184744 1435689 1412843 1687996 2093262 2262815 2915373 2972399
10970 2972399 2776212 2795818 2742629 2497501 2205489 1957316 1839827 1460002 1655790 1560121
10960 1560121 1611640 1683265 1430917 1462138 1882604 1356412 1577914 1417533 1545107 1132861
10950 1132861 865136 872790 361165 493120 641238 429656 83504 234150 329965 54338
10939 221480 -12535 14930 257222 162417 165317 142693 165484 114585 13345 -86914 257918
10927 89347 166113 102532 -292851 -114161 111833 213645 219665 79026 336249 232741 35234
10915a51556a1012B0456K74673E6504j4974b1993E00604a41349D7648f7201A28512
10903b03716A39517b10889j69281A5902a46913D6041a41386A50314a18225m5947
10893a64172J6118h320j85252B38223a78034K4005j3546A84091b47722c2525l1634
10882f4159f774A44837c12759c5258B07938e6737J7648I3207b10239E2296J18443
10871A70739H4200e5982o4819F5597d73921A86826b75900B96020G6292f0690C1372
10859A8180h0244j16486D057J18601J5821a40536B4788c37389g5874m6689A53412
10847A9044M2017Q0851d47071F1881a51203F5500M8824A8530J46754b81505M619
10836b76886h4943K0735A18160m1374J57227E1431L4071a99545g1820C00210a66647
$$ plain form
10915 -151556 -11012 20456 295129 56504 41530 -21993 500604 -141349 47648 -67201 128512
10903 -203716 139517 -210889 -380170 15902 -146913 46041 -141386 150314 -118225 -164172
10893 -164172 -148054 -8320 -193572 238223 -178034 -154029 -167575 184091 -247722 -32525 -64159
10882 -64159 -6774 144837 -312759 -35258 207938 -56737 -39089 93207 -210239 52296 170739
10871 170739 84200 -55982 -120801 65597 -473921 186826 -275900 296020 76292 -60690 31372
10859 18180 -80244 -196730 4057 122658 138479 -140536 24788 -337389 -75874 -122563 153412
10847 19044 61061 141912 -447071 61881 -151203 65500 114324 18530 165284 -281505 -276886
10836 -276886 -84943 -64208 118160 76786 234013 51431 85502 -199545 -71820 300210 -166647
10824c33674N6207Q4311C34409a01692k79234B44663A02472c58913b6905F3113
10813c6543j75005A21257a35765j41225R1719B692J23464k3222a15163o383I5501
10801C2460J32272c2462B62002G8657k3752a22475A21780c6422H3045b67195D2284
10789I3274B2771c70607E0339e948D7364c59817a55623N2545r0290E4492b13748
10777a6942p1279I3296C1314K3257L2379J12139C5803J27861b05251F0173b66855
10765H5116J0388C2549a45785A13587c3440l92018E4974b23595H3097a01753j6530
10754a18283I4910b0037j13019A32167F393c06451f7734B7563g252k08575B9993
10742b5414j92964B178J35914M6749a00114j79412R3910P4692c3814C1073L28821
$$ plain form
10824 -333674 -277467 -193156 334409 -101692 -380926 244663 102472 -358913 -26905 63113
10813 -36543 -211548 121257 -135765 -276990 -185271 2692 126156 102934 -115163 -121546 95501
10801 32460 164732 -32462 262002 78657 54905 -122475 121780 -36422 83045 -267195 42284
10789 93274 22771 -370607 50339 -5948 47364 -359817 -155623 -103078 -193368 54492 -213748
10777 -16942 -88221 93296 31314 54571 86950 199089 35803 163664 -205251 60173 -266855
10765 85116 95504 32549 -145785 113587 -33440 -425458 54974 -223595 83097 -101753 -118283
10754 -118283 94910 -20037 -133056 132167 6393 -306451 -67734 27563 -7252 -215827 29993
10742 -25414 -218378 2178 138092 184841 -100114 -279526 -185616 -110924 -33814 31073 359894
10731C59894b44436h5958c735B06261b73204A3222a09793e0330n7300j10342i2238
10719c9971j5679B41271E2555a46140F6655a6582o227r7738F9484p966O6980K0663
10707A49161c74991g6131a0061r7868B69641b02436e0758F870a25867k12866J61007
10696a77726d8659A64193g5479G5349J6598a06863c9399C69211d09296a92997
10685f5564L929p2714K8086D8080p265M69143A05049a03338A64567a67198j60152
10674c27350A6718e9578A55347b09088P558m5336I7835d4109J3065j2455o2111
10663a05610r727r790p722r313A8242f7335a6366B02632a77127q9476a07023B33365
10650a39065k31797A60356D6825h691B3602b01529H3258j961R0241J52405a18989
$$ plain form
10731 359894 -244436 -85958 -3735 206261 -273204 13222 -109793 -50330 -107630 -217972 -92238
10719 -39971 -55650 241271 52555 -146140 66655 -16582 -22809 -120547 69484 61518 128498 149161
10707 149161 -374991 -76131 -10061 -107929 269641 -202436 -50758 6870 -125867 -338733 -177726
10696 -177726 -48659 164193 -75479 75349 91947 -106863 -39399 369211 -409296 -192997
10685 -65564 -61635 -134349 -106263 48080 40815 509958 105049 -103338 164567 -167198 -327350
10674 -327350 16718 -59578 155347 -209088 -201530 -246866 97835 -44109 -31044 -43499 -105610
10663 -105610 -115337 -125127 -132849 -142162 18242 -67335 -16366 202632 -177127 -266603 -107023 233365
10650 -139065 -370862 160356 46825 -8691 23602 -201529 83258 81297 171538 323943 -118989
10638A14077b84508f4249A05927a19434e0107j4575R488j38013M9102j90358G2481
10626G458F42d4810j5706j920j04448q2037M9891A83413a49882A93539a62392
10614A55226a09958G3533e19081a18227b2612j72048B19687a69340e6339l20876
10604c77215a01852B8660A0984Q5926i9364I8487R9062a44582A63281l4075C862
10592B06924j1488I5763K4252g8919o0606A75195A8538K14740a26093N8861m9746
10581a16978N7552J6542j48194A91557D3368a56018A4720J37328a19362A89922
10570b55635R1815A29466C1494N6928L64538F4512a27659f2856j17978b7623k10590
10559b38213C07021B4631e4721H5992a76804e5233k29239c9385A26724b1304A88503
$$ plain form
10638 114077 -284508 -64249 105927 -119434 -50107 -64682 -55194 -193207 -144105 -334463 72481
10626 7458 642 -44810 -60516 -62436 -166884 -248921 -199030 183413 -149882 193539 -162392
10614 155226 -109958 73533 -519081 -118227 -22612 -194660 219687 -169340 -56339 -377215
10604 -377215 -101852 28660 10984 96910 -99364 98487 197549 -144582 163281 129206 3862
10592 206924 195436 95763 120015 -78919 -139525 175195 18538 233278 -126093 -67232 -116978
10581 -116978 -59426 -42884 -191078 191557 43368 -156018 14720 152048 -119362 189922
10570 -255635 -163820 129466 31494 88422 452960 64512 -127659 -62856 -180834 -27623 -238213
10559 -238213 307021 24631 -54721 85992 -176804 -55233 -284472 -39385 126724 -21304 188503
10547A5990J44142G5663b5723F3458b06401O0796O9551p1995A66873E6089a1550
10535b5145j8639j41336h882D9599d0442j01970A15038c29728O0439i9914C33037
10523g8386F7677J00500a41333a0829k40716G8327M3968a1312j17372P777B2302
10511f4088k11909p375K7996N9600n0621L3058D4706a55798A2942L9597K0838
10500G3377M8646b3557j87761A37928f142A45858a07310A97050E1380a3278E7923
10488c4316n6437m001k6513A42702d945B10208k2771K4938K07694B05619n7683
10477A47936e9117C6506J44775k3326N7016B9276Q9106C9209L5468J53255E6200
10465E7484a87142k15804f0798m1157j39471a11183N3114r2321M3402H38g998
$$ plain form
10547 15990 160132 75663 -25723 63458 -206401 -145605 -76054 -148049 166873 56089 -11550
10535 -25145 -43784 -185120 -8882 49599 -40442 -142412 115038 -329728 -269289 -99914 333037
10523 -78386 67677 168177 -141333 -10829 -251545 78327 122295 -11312 -128684 -120907 22302
10511 -64088 -275997 -283372 -255376 -195776 -246397 -213339 44706 -155798 12942 52539 73377
10500 73377 122023 -23557 -211318 137928 -6142 145858 -107310 197050 51380 -13278 57923
10488 -34316 -90753 -94754 -121267 142702 -4945 210208 187437 212375 420069 205619 147936
10477 147936 -59117 36506 181281 157955 214971 29276 118382 39209 74677 227932 56200
10465 57484 -187142 -402946 -60798 -101955 -241426 -111183 -58069 -150390 -106988 838 -7998
10453H1275g464r1769j51065f5921A52939O4892c08561J05023M5345I9664i0401
10441b35234d9825n3279r4956O1234A87042j5124p0019D9504e9385B65252A5229
10429A45504A4725a90153A09773e6609i554A42164a23438K2485G8858b35790I354
10417a62399d4940n0124j87236B6223M5748K23450A5982d6755k2873D5038K65854
10406C10892G1432f5761M544B61088a46329p6982B15739f7758l0681M3428k9850
10395h4861I2606O8986N3081M7287A29457a19526B42117c9391m8197B05969C3060
10383G5423a26316B15775b5419B18566O8997a26472m4859D7004h25B38520n3622
10372A84898j7206Q9495I4967K6631p19K47676q6425J76113j63259A36629K68372
$$ plain form
10453 81275 -7464 -99233 -250298 -65921 152939 217831 -308561 -203538 -158193 99664 -90401
10441 -235234 -49825 -103104 -198060 -136826 187042 171918 101899 49504 -59385 265252 15229
10429 145504 14725 -190153 109773 -56609 -9554 142164 -123438 -100953 78858 -235790 9354
10417 -162399 -44940 -95064 -282300 26223 71971 295421 15982 -46755 -69628 45038 310892
10406 310892 71432 -65761 -61217 261088 -146329 -223311 215739 -67758 -98439 -55011 -84861
10395 -84861 92606 161592 214673 261960 129457 -119526 242117 -39391 -87588 205969 33060
10383 75423 -126316 215775 -25419 218566 287563 -126472 -171331 47004 -825 238520 184898
10372 184898 167692 257187 94967 121598 120879 368555 282130 458243 294984 136629 405001
10361D05001j8500j12445O9623l0716A52114C7768K37967H7518J57896E8626J41292
10350A99918J98256q3549O9170O0883m526G9470K17533K30680A94413K58444A97688
10338A58682E9916K30612J3475O06d4259j21420A73365a1792C54107I7721M0751
10327A38472L0571d4557d3A73536A3191J78842n7848A8131O3286K01328j28959
10316A53786J87790j51972o1162J94586o7317C0328J35589c759o4092j46505A17468
10304A13295l3681R9560N8399F9915C2111P725K74955a5524F6774k3443J82491
10293B25822h4730C98433e3141a770B0763J32644d1558l52293J77889J07800A66092
10281c20386J20565d494E5171a2511r4112k8070E5997b88099A5397d18604A86858
$$ plain form
10361 405001 386501 274056 343679 312963 152114 37768 275735 87518 245414 58626 199918
10350 199918 398174 314625 383795 444678 440152 79470 297003 527683 194413 452857 197688
10338 158682 59916 290528 304003 304609 -44259 -165679 173365 -11792 354107 97721 138472
10327 138472 169043 -44557 -43 173536 13191 192033 134185 18131 81417 282745 153786
10316 153786 341576 189604 128442 323028 255711 30328 165917 -3759 -67851 -214356 117468
10304 113295 79614 179174 237573 69915 32111 39836 314791 -15524 66774 43331 225822
10293 225822 -84730 398433 -53141 -1770 20763 153407 -41558 -393851 -215962 -108162 166092
10281 -320386 -199821 -4494 55171 -12511 -106623 -134693 55997 -288099 15397 -418604 186858
10269f7898o5709A40014O717K26201e9339I2977Q74m1107a3732A28133K68776
10258C96909j80605K56103G7613b15910A46854O1585J23797a95912M7065L2612
10248a16235N0008r2609a2438A60095A7640J81862D16b12667E7152A3768P7326
10237I1094b18161A61326b6089j75165M7473J9564j24898h1659j67955a7500j63712
10226a81212A04966M3556Q4202A01413d1527j14667r8196G5945a39572b2011A18324
10214A33879C3631q937b41307j455k63555e5103G1485g7596p6906G4724b54261
10202a1821A27199b18712A57115h2484C3934a02110I8059K16600b04956F5785
10191A89956d58488B0684P1288L167a75529M6287B09539Q3763j37584h779j28915
$$ plain form
10269 -67898 -133607 140014 146731 372932 -59339 92977 93851 52744 -13732 128133 396909
10258 396909 216304 472407 77613 -215910 146854 208439 332236 -195912 -148847 -116235
10248 -116235 -66227 -158836 -12438 160095 17640 199502 416 -212667 57152 13768 91094
10237 91094 -218161 161326 -26089 -201254 -153781 -134217 -259115 -81659 -249614 -17500 -181212
10226 -181212 104966 148522 232724 101413 -41527 -156194 -254390 75945 -139572 -22011 118324
10214 133879 33631 24694 -241307 -242762 -506317 -55103 71485 -77596 -154502 74724 -254261
10202 -11821 127199 -218712 157115 -82484 33934 -102110 98059 314659 -204956 65785
10191 189956 -458488 20684 91972 95139 -175529 -129242 209539 293302 155718 -8779 -137694
10180a37694o9618g9144C2206Q540d3258j85954J5871E813c01156o1275i6411
10168D7648a98341B1325f8418B0331a14368D9422h3508a1455A60477d5364B60650
10156a02854o3737a9640n0841j59247O0178D1192J88572j0308b45239n2834C7098
10144D3286A1205h2304J1522j22546f7467a9241k15667j20662e2373A17350a66770
10132d66080c0165k9110k6140L8104E7402L01676a17348j2757B8614b90180D4921
10120G4707a81959e4301A9266h2056k53027J52846B29345d4215c597g07j82837
10109a83544P2974j0609B49939G7690a41558j6800A31339d04432g9210J3446C12231
10097h8105G6415g9918A62918h4250A51069q679D5549c1542B56015b03250L6521
$$ plain form
10180 -137694 -207312 -79144 32206 40746 -43258 -229212 -213341 5813 -301156 -362431 -96411
10168 47648 -198341 21325 -68418 20331 -114368 49422 -83508 -11455 160477 -45364 260650
10156 -102854 -166591 -19640 -70481 -229728 -169550 41192 229764 219456 -245239 -298073 37098
10144 43286 11205 -82304 -70782 -193328 -67467 -19241 -234908 -355570 -52373 117350 -166770
10132 -466080 -30165 -59275 -85415 -47311 57402 359078 -117348 -130105 28614 -290180 44921
10120 74707 -181959 -54301 19266 -82056 -335083 -182237 229345 -44215 -3597 -707 -183544
10109 -183544 -110570 -121179 249939 77690 -141558 -158358 131339 -404432 -79210 -65764 312231
10097 -88105 76415 -79918 162918 -84250 151069 142390 45549 -31542 256015 -203250 -166729
10086a66729B00308a06550F1329K9535d0176k27373m8692F3918c3811j47519G8369
10074A3741c57291A41669f5688a0039H6842J10967b60722K437h7233C42406c76674
10062D4364b84941Q4068A17332a94024R2111M6270j09295n2362A08957b48816
10051e891k5467n5571q7416B69648E0312K7034a28262A44J29654c71604B20667
10039d30827a33667j89133A95317b22384a02665G3651d7306k74493A46654R8393
10029B45047a06480B90990F4269Q906a55707A37660a22333q1502i8706A49293
10018c90620P3700a02339j6743h777o8175A52484o6607a83976Q0320B84220c13295
10006i6428l04k1935k68925g8330E1314a74758n984C4905c9049J4951A59699a08774
$$ plain form
10086 -166729 200308 -106550 61329 90864 -40176 -267549 -316241 63918 -33811 -181330 78369
10074 13741 -357291 141669 -65688 -10039 86842 197809 -260722 -258285 -87233 342406 -376674
10062 44364 -284941 -200873 117332 -194024 -101913 -55643 -164938 -217300 108957 -248816
10051 -5891 -31358 -86929 -174345 269648 50312 77346 -128262 144 129798 -371604 220667
10039 -430827 -133667 -322800 195317 -222384 -102665 73651 -47306 -321799 146654 245047
10029 245047 -106480 290990 64269 73175 -155707 137660 -122333 -203835 -98706 149293
10018 -390620 -316920 -102339 -119082 -8777 -76952 152484 85877 -183976 -103656 284220 -313295
10006 -96428 -96732 -118667 -387592 -78330 51314 -174758 -180742 34905 -39049 -24098 159699 -108774
9993b5296A35929b69396a32936H9135A7478g062B0470a24754j62759E6360b50317
9981B34132I0923m1759f9871j12866B46057a82904A72037a10964o8611N5910N4717
9970f8948B41780D8987L0159L18358C7807i1843C4872j4182a76611B86702a12820
9958a5814q5682j94049a07568n3493p9390A29669j0336b29249A34860i7040a8734
9946f2310D3631a13729j1877o9847d2340A42853O6787a66748P9088n3332j33969
9935b74961Q9882f8271o5804j89601A81641a45087A44648M68b24539j22342E4360
9923F002c50679f2625j05423K0946B11127b21893P3110j28450C04325b39215A55378
9911a79630c5762k19525A01243D5440J27579g9152n7748m08094a05912N2256K4816
$$ plain form
9993 -25296 135929 -269396 -132936 89135 17478 -7062 20470 -124754 -287513 56360 -250317
9981 234132 90923 49164 -69871 -182737 246057 -182904 172037 -110964 -179575 -123665 -68948
9970 -68948 241780 48987 79146 397504 37807 -91843 34872 20690 -176611 286702 -112820
9958 -15814 -101496 -295545 -107568 -161061 -240451 129669 119333 -229249 134860 -97040 -18734
9946 -62310 43631 -113729 -125606 -195453 -42340 142853 209640 -166748 -87660 -140992 -274961
9935 -274961 -185079 -68271 -134075 -323676 181641 -145087 144648 145116 -224539 -346881 54360
9923 6002 -350679 -62625 -168048 -147102 211127 -221893 -148783 -277233 304325 -239215 155378
9911 -179630 -35762 -255287 101243 45440 173019 -79152 -136900 -544994 -105912 -53656 -28840
9900b8840k09407E0729J4139c75907b8077C26064C2544d28564A32503c25899B10238
9888D6530O9625b57956F9174J35936b40248A45710E0981Q4241a54242F9202b11565
9876G6895a01690j48147f7475j00898j74788J53533H1408h4917A719c03696B19818
9864b09143B44353b3313j24343B79908b17086d1958j3950J5858B71988a29053
9853c35261B02910F0250c1317j97572I5256a05864M0081B58242b05082O1894B099
9841B96319E5279i1652j00728L7157d6413b280k2265j82024g133B30430F7366
9829D1966d01069a57225K8030Q791B12221E0402b8375A82566a51122F4676J53448
9818B18124c50870F118R3446i8517k22253J04696i1392k08622J8322Q4948m4354
$$ plain form
9900 -28840 -238247 50729 64868 -375907 -28077 326064 32544 -428564 132503 -325899 210238
9888 46530 116155 -257956 69174 205110 -240248 145710 50981 135222 -154242 69202 -211565
9876 76895 -101690 -249837 -67475 -168373 -343161 -189628 81408 -84917 1719 -303696 219818
9864 -209143 244353 -23313 -147656 279908 -217086 -41958 -55908 -40050 271988 -129053
9853 -335261 202910 60250 -31317 -228889 95256 -105864 -65783 258242 -205082 -143188 2099
9841 296319 55279 -91652 -192380 -155223 -46413 -2280 -24545 -206569 -7133 230430 67366
9829 41966 -401069 -157225 -129195 -120404 212221 50402 -28375 182566 -151122 64676 218124
9818 218124 -350870 6118 99564 -98517 -320770 -216074 -91392 -300014 -281692 -196744 -241098
9807b41098A05018a87421r8270A34772a98075i2401j48762A16813b1555A7176
9796H0336b77826k11047e0037O137m5599L9482a0987A94867i1308A29235c9128
9784G2140k7998b02362h775B4424a79168B27510e1575j59251C10516c35013A48912
9772c02754B91102b30865p647j45836i3442J5730C09679j49906h4859m2682l25854
9761d53395H3674b38181N7197b6286k09116G1932a00611D123P7704J21590c00058
9749c95482a44409e9803K312j53266f5498B73148a15019m698k92385a14497C14395
9737b62074B8048b59262a16847F0090a464n8371G6906j3310P1629d4674m1504
9726h6178E145b26211g4790a675n5572B80817g2489J9480B780K61604P5874j01293
$$ plain form
9807 -241098 105018 -187421 -285691 134772 -198075 -92401 -241163 116813 -21555 17176
9796 80336 -277826 -488873 -50037 -43900 -89499 -50017 -10987 194867 -91308 129235 -39128
9784 72140 44142 -202362 -8775 24424 -179168 227510 -51575 -210826 310516 -335013 148912
9772 -302754 291102 -230865 -238512 -384348 -93442 -77712 309679 159773 -84859 -127541 -453395
9761 -453395 83674 -238181 -180984 -26286 -235402 71932 -100611 4123 81827 203417 -300058
9749 -395482 -144409 -59803 -57491 -210757 -65498 273148 -115019 -119717 -412102 -114497 314395
9737 -262074 28048 -259262 -116847 60090 -1464 -59835 76906 63596 135225 -44674 -86178
9726 -86178 5145 -226211 -74790 -1675 -57247 280817 -72489 -53009 2780 264384 340258 238965
9714B38965A08901l9735b03924B31855e8667B3280H336J41667f6769B00920a67491
9702f1993l1790I808b21542L5504f6703c1353G7038a35609A24039h1986A0685
9690i8920l06026a75024Q1465B8922Q3773k2452a96172C2657a05516n632B6490
9678a09875j17137A84285K9016a56875A29431c14695G9589J20886g8855j23923
9668b02778B91526c95219C538b45011i2835k88371a30194B98895a38244A83858
9657b96098C4973e8868o377A237J610a05098a9388k59980A64064a17407A02466
9645A00336B5686i3382E2291J24297a29290q3895O526K5294H7180a12711r0311
9634b03022L0611A08583a3507l28621Q3642Q6286b7395j21227A02027c22359A7492
$$ plain form
9714 238965 108901 69166 -203924 231855 -58667 23280 8336 150003 -66769 200920 -167491
9702 -61993 -93783 9808 -221542 -186038 -66703 -31353 77038 -135609 124039 -81986 10685
9690 -98920 -404946 -175024 -93559 28922 112695 90243 -196172 32657 -105516 -111148 26490
9678 -109875 -227012 184285 213301 -156875 129431 -314695 79589 200475 -78855 -202778
9668 -202778 291526 -395219 3538 -245011 -92835 -381206 -130194 298895 -138244 183858
9657 -296098 34973 -58868 -65245 1237 2847 -105098 -19388 -279368 164064 -117407 102466
9645 100336 25686 -93382 52291 176588 -129290 -213185 -206659 -181365 87180 -112711 -203022
9634 -203022 -172411 108583 -13507 -342128 -258486 -172200 -27395 -148622 102027 -322359 17492
9622h223B56912A674a0203j03171h759q1559b4029m505B18673b12225A12182a94411
9609a24025E8674a47950d0637q5137K021b8522A76432e198k07692A6933a77291
9597a95977p0183b0l27852J963J04064i3004k25575j5955O3657J8275A19836e5428
9584A85427b53596B1256L37353j48785f340m5923a0725a896k32045C8013i0562
9572e10427B78211c16763a38865A19129m0619C8309g0084A78141C4680b9803A6063
9560c8123A97924a18007o3869h5008j77196g8358j07019c9584o117G2279J2683
9549H4962c8056l46447d9993j36013Q0466A95974b14303J05008L9745L4525k73420
9538c08445R8613H8602L9736k793a96716j05103a29541j01034K1163N700j6506
$$ plain form
9622 -8223 256912 1674 -10203 -113374 -8759 -90318 -24029 -28534 218673 -212225 112182 -194411
9609 -124025 58674 -147950 -40637 -125774 -123753 -28522 176432 -5198 -212890 16933 -177291
9597 -195977 -266160 -20 -327872 -325909 -221845 -93004 -318579 -334534 -270877 -252602 119836 -55428
9584 185427 -253596 21256 358609 209824 -6340 -52263 -10725 -1896 -233941 38013 -90562
9572 -510427 278211 -316763 -138865 119129 78510 38309 -70084 178141 34680 -29803 16063
9560 -38123 197924 -118007 -181876 -85008 -262204 -78358 -185377 -39584 -45701 72279 84962
9549 84962 -38056 -384503 -49993 -186006 -105540 195974 -214303 -109295 -69550 -35025 -308445
9538 -308445 -209832 88602 128338 125545 -196716 -301819 -129541 -230575 -209412 -203712 -220218
9527b20218I0112a21059a2513B35469E4737L8116d26271a79666B14250B9229P9255
9516A08484b282j8463m67885a49495A74301b329r8094C14392D803L1074L3248
9505F9125j3084Q1803b52027m5819a37710n3446f6278k36331k2381L6083R455
9494b79452L3718J0100h8569I1236D3242b06237a5899j18330N1041A21530c2665
9482a07886J0523A57730O7688b2251A19811c62506J42863J02289d4659q2263H0992
9470a95715P9162M0472j4965A93126a21726k8467P2874j8108E0337K95328b43301
9458H651J22063a3143l22053J60808R634A2757J75712H7635c15568G2239f9019
9446h0349I2827b54320J23783k82223J88142F7156i6577H3086e4136k79682A09077
$$ plain form
9527 -220218 90112 -121059 -12513 235469 54737 92853 -426271 -179666 214250 29229 108484
9516 108484 -2282 -20745 -488630 -149495 174301 -2329 -100423 314392 4803 35877 69125
9505 69125 56041 137844 -252027 -297846 -137710 -191156 -66278 -302609 -324990 -288907 -279452
9494 -279452 -245734 -235634 -88569 91236 43242 -206237 -15899 -134229 -83188 121530 -32665
9482 -107886 -97363 157730 225418 -22251 119811 -362506 -219643 -117354 -44659 -126922 80992
9470 -195715 -116553 -76081 -91046 193126 -121726 -150193 -77319 -95427 50337 345665 -243301
9458 8651 130714 -13143 -335196 -174388 -164754 12757 188469 87635 -315568 72239 -69019
9446 -80349 92827 -254320 -130537 -412760 -224618 67156 -96577 83086 -54136 -333818 109077
9434a93330k2656a01185L8185D1961b0542A86843e3821C21827d8041F482J64832
9423A71314d60233D4489a3945q3023j86410A74142C2843J00200p990J1638g6069
9411G960L65293b04338e5147F2317b7358D9647A3294J84980d5696G7528L827L6603
9399A17958a46464A77260o7953d8751A49473h4609E1775b9121l65996C4569d1875
9387b64346j07740m0533a69000d3559n0378b7686l58356e8668m0215C0928a24618
9375g940A3420b54149C57375A36831J36459a25774C4582a56954L8779B61151c72705
9363A85050b8339r4381I8018d63473C17489H801K7486a47631A0240N2035h3019
9351c40506o409Q9985I9603a08915b3032k75289F6524a75586m20911b70030a13669
$$ plain form
9434 -193330 -215986 -101185 -63000 41961 -20542 186843 -53821 321827 -48041 6482 171314
9423 171314 -460233 44489 -13945 -96968 -283378 174142 32843 133043 125053 136691 -76069
9411 7960 373253 -204338 -55147 62317 -27358 49647 13294 198274 -45696 77528 81355 117958
9399 117958 -146464 177260 109307 -48751 149473 -84609 51775 -29121 -395117 34569 -41875
9387 -264346 -372086 -412619 -169000 -43559 -93937 -27686 -386042 -58668 -98883 30928 -124618
9375 -7940 13420 -254149 357375 136831 273290 -125774 34582 -156954 -118175 261151 -372705
9363 185050 -28339 -122720 98018 -463473 317489 8801 36287 -147631 10240 62275 -83019
9351 -340506 -346915 -256930 99603 -108915 -23032 -298321 66524 -175586 -596497 -270030 -113669
9339g8736G867a58086j70928f1544j59765l0756A52579E3758a01397B62643B3601
9327B8612b46142R1167E8738J52168F1668c7791o6489l26409D277a29219l34436
9316d63655A53907A1536g4925J6887b6646q4450A068a46780A09635b2550C6717
9304e7782K4225k28400C7087b26805N1845B02472l5689A6322L28077f9237j14201
9293a83438A06154a15867q6874N9097N2375q6398A2600M8218c18762a7772q1258
9282i9030k07132N4004M3218Q6794A2906b08656d1887E7026c5134J2947l5066
9271e7253B4767a11066M0311C82799b64060K8864G1490b34414h056j9397l3835
9260f1288D0702e400F4734a76345J181A75608P4392a25901A66522b50967A74783
$$ plain form
9339 -78736 7867 -158086 -329014 -61544 -221309 -252065 152579 53758 -101397 262643 23601
9327 28612 -246142 -154975 58738 210906 61668 -37791 -104280 -430689 4277 -129219 -463655
9316 -463655 153907 11536 -74925 -58038 -26646 -111096 1068 -146780 109635 -22550 36717
9304 -57782 -33557 -261957 37087 -226805 -174960 202472 166783 16322 344399 -69237 -183438
9293 -183438 106154 -115867 -202741 -143644 -91269 -177667 12600 60818 -318762 -17772 -99030
9282 -99030 -306162 -252158 -208940 -122146 12906 -208656 -41887 57026 -35134 -22187 -57253
9271 -57253 24767 -111066 -70755 382799 -264060 -235196 71490 -234414 -8056 -27453 -61288
9260 -61288 40702 -5400 64734 -176345 -175164 175608 250000 -125901 166522 -250967 174783
9248A21553J07020E1266J18090l3417K1754b52892J10786p0929C73491h7722o7869
9237a55591A1639a31603b7398k36728R1613O4048j38510b112r2300j82690P2614
9226b04488A51197D274J43202c06458a35294q6417k22503A70790a15953b4884
9215a10882A07066Q9267c76621f8908E3741a25953A83585a85598K4394j01464
9205b62668A38839b38995D2545a56989C02112r6879b78227j30544J12708e8840
9194b03202K9544j44657C4430K29256a95959p7842B16666b1652r4059d7058A13250
9182F0042N0316a49771E5367J83521g4834B29671e3203H425c94183A48600C625
9170F9626d2558B1240a40168k8889P3614d353k29535B72603c433A54910e0173
$$ plain form
9248 121553 228573 51266 169356 135939 157693 -252892 -142106 -213035 373491 -87722 -155591
9237 -155591 11639 -131603 -27398 -264126 -172513 -108465 -246975 -2112 -94412 -277102 -204488
9226 -204488 151197 4274 147476 -306458 -135294 -221711 -444214 170790 -115953 -24884
9215 -110882 107066 196333 -376621 -68908 53741 -125953 183585 -185598 -161204 -262668
9205 -262668 138839 -238995 42545 -156989 302112 205233 -278227 -408771 -296063 -58840
9194 -203202 -173658 -318315 34430 263686 -195959 -273801 216666 -21652 -115711 -47058 113250
9182 60042 110358 -149771 55367 238888 -74834 229671 -53203 8425 -394183 148600 3625
9170 69626 -42558 21240 -140168 -169057 -95443 -4353 -233888 272603 -3433 154910 -50173
9158b69478M5226R8448I6053a07722A51873b58907H8520a12410o7372B2418c71946
9146c63651J50578D9567b35270a00083F787i9B89066a14060j19103j87019e1030
9134i1344k47708J08547A7745e7081I7800b60722N1025A69178a2757C50608C5795
9122b68455f5940a7603I5167c4423A25861a39525n3002B03149p7937j6710b13434
9110I4636b4953H7458g2390A12952Q4551a40656b2837I3437a8276l36981B02688
9098e2213l01447j91522a01639p0674N5358k9268r8346C2063j5173c6459A2729
9086A39999f0594o2585B95191a67051b5122A02039d8514l5352A88201b36877f131
9074A72223b21837A16724h2814I6470a48764H2970K4006b03958j37885f1035B0246
$$ plain form
9158 -269478 -224252 -125804 96053 -107722 151873 -258907 88520 -112410 -179782 22418 -371946
9146 -363651 -213073 49567 -235270 -100083 6787 -99 289066 -114060 -233163 -420182 -51030
9134 -91344 -339052 -230505 17745 -57081 97800 -260722 -209697 169178 -12757 350608 35795
9122 -268455 -65940 -17603 95167 -34423 125861 -139525 -192527 203149 125212 108502 -213434
9110 94636 -24953 87458 -72390 112952 197503 -140656 -22837 93437 -18276 -355257 202688
9098 -52213 -353660 -545182 -101639 -172313 -116955 -146223 -244569 32063 16890 -36459 12729
9086 139999 -60594 -123179 295191 -167051 -25122 102039 -48514 -83866 188201 -236877 -6131
9074 172223 -221837 116724 -82814 96470 -148764 82970 106976 -203958 -341843 -61035 20246
9062a98697n7059r6708B6549M19b6225n2348C02905A19544a87825h5675A04929
9050g3201m0993K755A3662J25403a78631O4463j83894A25446a49249C2348h8191
9038C20754p0075d54282a07657O574l8015L6434a5613j95661A25101c13853l1337
9027c45190J8848D38737e44997e0597A40901b44987H066i2543K0080D2112a09946
9015C67239a20803R300j66332J37104F3928i4953B1610a85341A28051J7610K134
9004A47795e8053j82916B9824J62128g5410b7115j84465k0686a6763C36311a56387
8992C1766f1323k64196C7976a89706B7762J41867a38090I8019j8865J93072b5375
8980d2428j30930B8823b54863B13836B5607c82583f9754n5548C33424b99398Q6713
$$ plain form
9062 -198697 -255756 -352464 26549 26968 -26225 -78573 302905 119544 -187825 -85675 104929
9050 -73201 -114194 -111439 13662 139065 -178631 -114168 -298062 125446 -149249 32348 -88191
9038 320754 250679 -454282 -107657 -101083 -139098 -102664 -15613 -211274 125101 -313853 -345190
9027 -345190 -326342 438737 -544997 -50597 140901 -244987 8066 -92543 -72463 42112 -109946
9015 367239 -120803 -111503 -277835 -140731 63928 -94953 21610 -185341 128051 145661 147795
9004 147795 -58053 -240969 29824 191952 -75410 -27115 -211580 -232266 -16763 336311 -156387
8992 31766 -61323 -325519 37976 -189706 27762 169629 -138090 98019 79154 272226 -25375
8980 -42428 -173358 28823 -254863 213836 25607 -382583 -69754 -125302 333424 -299398 -212685
8969b12685B39341d43946b18563N5683L5652a7603m0799j31421Q8737j85667e6147
8957a2779m8419B47615h9967A85197a51355J8311j51116j09054J74948G2410b7042
8945b13400G1753a15712a4769j20835o5931B52461H04b16679q4124A92495j2969
8934A79526Q5041r4620a62764D6303b6564B0085a19810G3269L39956K8911j5007
8923D27129M97808M067565Q002131F293127A639665F76941l25648M0074f0280
8913c21045e6431b5438A21073a97082e6123C10465l9439b90101a06504k263Q033
8902a00734C7599K85k097i8638E98398G0690c3727F3591c9049N910j44741B5794
8889i337j83372D9718j5914g3191A06760J26693q8940d19378a75440A14542A2078
$$ plain form
8969 -212685 239341 -443946 -218563 -162880 -127228 -17603 -58402 -189823 -101086 -286753 -56147
8957 -12779 -61198 247615 -89967 185197 -151355 -133044 -284160 -393214 -218266 72410 -27042
8945 -213400 71753 -115712 -14769 -135604 -201535 252461 804 -216679 -300803 192495 179526
8934 179526 264567 169947 -162764 46303 -26564 20085 -119810 73269 413225 442136 427129
8923 427129 924937 4992502 12994633 6293127 1639665 676941 351293 391367 -60280
8913 -321045 -56431 -25438 121073 -197082 -56123 310465 271026 -290101 -106504 -108767 -100734
8902 -100734 37599 37884 35787 -98638 598398 70690 -33727 63591 -39049 -33139 -177880 25794
8889 -9337 -192709 49718 33804 -73191 106760 233453 144513 -419378 -175440 114542 12078
8877a00609H3871J77328b88737A82926P8923a3490j10584a1469e130A15573c00241
8865a26535D7275O3333a65569m3912B85267a4994n2907j2328L0504j54347a01419
8853H9843B5393H799a75280D9966b47714a10263j47054A87480a76632Q2301E3094
8841b60054Q7669O5081c6058j95608G5371J28914c1946q8065a6723k93338f6730
$$ plain form
8877 -100609 83871 261199 -288737 182926 261849 -13490 -124074 -11469 -5130 115573 -300241
8865 -126535 47275 110608 -165569 -209481 285267 -14994 -67901 -80229 -49725 -204072 -101419
8853 89843 25393 8799 -175280 49966 -247714 -110263 -257317 187480 -176632 -94331 53094
8841 -260054 -172385 -107304 -36058 -231666 75371 204285 -31946 -120011 -16723 -310061 -66730
$$ [...]
##END NTUPLES=NMR SPECTRUM
##END=
