
##TITLE=UV1291_M3_1216-1376_5_7535606_kqToaAJUhd
##JCAMPDX= 6.0         $$ Bruker NMR JCAMP-DX V2.0
##DATA TYPE= NMR SPECTRUM
##DATA CLASS= NTUPLES
##ORIGIN= BRUKER
##OWNER= Administrator
$$ 1.72 TOPSPIN		Version 2.1
$$ 2013-02-21 19:37:25.610 -0500  Administrator@X
$$ Compression mode = diff/dup
##.OBSERVE FREQUENCY= 400.02188249412
##.OBSERVE NUCLEUS= ^1H
##.ACQUISITION MODE= SIMULTANEOUS (DQD)
##.ACQUISITION SCHEME= undefined
##.AVERAGES= 64
##.DIGITISER RES= 22
##SPECTROMETER/DATA SYSTEM= spect
##.PULSE SEQUENCE= noesygpps1d.comp
##.SOLVENT NAME= COFFEE_meoh
##.SHIFT REFERENCE= INTERNAL, COFFEE_meoh, 1, 14.9612
##AUDIT TRAIL= $$ (NUMBER, WHEN, WHO, WHERE, PROCESS, VERSION, WHAT)
$$ ##TITLE= Audit trail, TOPSPIN		Version 2.1
$$ ##JCAMPDX= 5.01
$$ ##ORIGIN= Bruker BioSpin GmbH
$$ ##OWNER= Administrator
$$ $$ E:\/data/COFFEE/nmr/UV1291_M3_1216-1376_5_7535606_kqToaAJUhd/12/pdata/1/auditp.txt
$$ ##AUDIT TRAIL=  $$ (NUMBER, WHEN, WHO, WHERE, PROCESS, VERSION, WHAT)
(   1,<2013-02-21 19:37:19.051 -0500>,<Administrator>,<X>,<go>,<TOPSPIN 2.1>,
      <created by zg
	started at 2013-02-21 19:25:40.999 -0500,
	POWCHK enabled, PULCHK disabled,
       configuration hash MD5:
       86 BA 57 50 F2 9D 5C 9B 26 00 A9 28 5F 66 2E 89
       data hash MD5: 64K
       7A 51 2A 89 B6 84 06 86 93 3F EB 4F 89 A6 CD 38>)
(   2,<2013-02-21 19:37:22.568 -0500>,<Administrator>,<X>,<proc1d>,<TOPSPIN 2.1>,
      <Start of raw data processing
       efp LB = 0.3 FT_mod = 6 PKNL = 1 PHC0 = 0 PHC1 = 0 SI = 128K 
       data hash MD5: 128K
       2D 6A 66 23 64 E8 25 72 F2 13 0B 4B FC 1D 2B 47>)
(   3,<2013-02-21 19:37:23.758 -0500>,<Administrator>,<X>,<proc1d>,<TOPSPIN 2.1>,
      <pk PHC0 = 251.7078 PHC1 = 0 
       data hash MD5: 128K
       58 D2 5C EF 08 36 B9 E0 FD 19 5A 69 CA 5B BD 11>)
(   4,<2013-02-21 19:37:24.489 -0500>,<Administrator>,<X>,<proc1d>,<TOPSPIN 2.1>,
      <abs ABSG = 1 
       data hash MD5: 128K
       9B EB F6 A4 8F FB 81 73 1D BA AF 9A 44 0A 80 DA>)
(   5,<2013-02-21 19:37:24.710 -0500>,<Administrator>,<X>,<proc1d>,<TOPSPIN 2.1>,
      <abs ABSG = 2 
       data hash MD5: 128K
       F3 87 27 3B 54 E2 7D F4 86 C8 D3 FD F3 42 22 65>)
(   6,<2013-02-21 19:37:24.879 -0500>,<Administrator>,<X>,<proc1d>,<TOPSPIN 2.1>,
      <abs ABSG = 3 
       data hash MD5: 128K
       B1 8F 9F 63 43 5B E8 70 47 D2 84 72 F2 B3 80 F0>)
(   7,<2013-02-21 19:37:25.032 -0500>,<Administrator>,<X>,<proc1d>,<TOPSPIN 2.1>,
      <abs ABSG = 4 
       data hash MD5: 128K
       E4 4E E4 4D BF DF 0D 6C 13 C6 62 45 D6 E5 9A FF>)
(   8,<2013-02-21 19:37:25.236 -0500>,<Administrator>,<X>,<proc1d>,<TOPSPIN 2.1>,
      <abs ABSG = 5 
       data hash MD5: 128K
       08 79 1B 74 7B 72 43 AB E9 B9 BD F7 F9 50 AC FD>)
$$ ##END=
$$ 
$$ $$ hash MD5
$$ $$ DE 7C 6B 42 DF 77 0D 13 48 55 84 CC 59 98 81 B9
##$RELAX= 
##$RELAX= 
##$RELAX= 
##$RELAX= 
##$RELAX= 
##$RELAX= 
##$RELAX= 
##$RELAX= 
$$ Bruker specific parameters
$$ --------------------------
##$DU= <E:\>
##$EXPNO= 12
$$ [...]
150 150 150 150 150 150 150 150
##$TP07= 0
##$TPNAME0= <>
##$TPNAME1= <>
##$TPNAME2= <>
##$TPNAME3= <>
##$TPNAME4= <>
##$TPNAME5= <>
##$TPNAME6= <>
##$TPNAME7= <>
##$TPOAL= (0..7)
0.5 0.5 0.5 0.5 0.5 0.5 0.5 0.5
##$TPOFFS= (0..7)
0 0 0 0 0 0 0 0
##$TUNHIN= 0
##$TUNHOUT= 0
##$TUNXOUT= 0
##$USERA1= <user>
##$USERA2= <user>
##$USERA3= <user>
##$USERA4= <user>
##$USERA5= <user>
##$V9= 5
##$VALIST= <valist>
##$VCLIST= <CCCCCCCCCCCCCCC>
##$VD= 0
##$VDLIST= <DDDDDDDDDDDDDDD>
##$VPLIST= <PPPPPPPPPPPPPPP>
##$VTLIST= <TTTTTTTTTTTTTTT>
##$WBST= 1024
##$WBSW= 4
##$XGAIN= (0..3)
0 0 0 0
##$XL= 0
##$YL= 0
##$YMAX_a= 6070984
##$YMIN_a= -10628033
##$ZGOPTNS= <>
##$ZL1= 120
##$ZL2= 120
##$ZL3= 120
##$ZL4= 120
##$ABSF1= 14.9612
##$ABSF2= -5.596982
##$ABSG= 5
##$ABSL= 3
##$ALPHA= 0
##$AQORDER= 0
##$ASSFAC= 0
##$ASSFACI= 0
##$ASSFACX= 0
##$ASSWID= 0
##$AUNMP= <proc_prof1d_extract.lims>
##$AXLEFT= 0
##$AXNAME= <>
##$AXNUC= <1H>
##$AXRIGHT= 0
##$AXTYPE= 0
##$AXUNIT= <>
##$AZFE= 0.1
##$AZFW= 0.1
##$BCFW= 0
##$BC_mod= 0
##$BYTORDP= 0
##$COROFFS= 0
##$CY= 15
##$DATMOD= 1
##$DC= 0
##$DFILT= <>
##$DTYPP= 0
##$F1P= 0
##$F2P= 0
##$FCOR= 0.5
##$FTSIZE= 131072
##$FT_mod= 6
##$GAMMA= 0
##$GB= 0
##$INTBC= 1
##$INTSCL= 1
##$ISEN= 128
##$LB= 0.3
##$LEV0= 0
##$LPBIN= 0
##$MAXI= 10000
##$MC2= 0
##$MEAN= 0
##$ME_mod= 0
##$MI= 0
##$NCOEF= 0
##$NC_proc= -2
##$NLEV= 6
##$NOISF1= 0
##$NOISF2= 0
##$NSP= 0
##$NTH_PI= 0
##$NZP= 0
##$OFFSET= 14.9612
##$PC= 1
##$PHC0= 251.7078
##$PHC1= 0
##$PH_mod= 1
##$PKNL= yes
##$PPARMOD= 0
##$PPDIAG= 0
##$PPIPTYP= 0
##$PPMPNUM= 2147483647
##$PPRESOL= 1
##$PSCAL= 4
##$PSIGN= 0
##$PYNMP= <proc.py>
##$REVERSE= no
##$SF= 400.020009556346
##$SI= 131072
##$SIGF1= 0
##$SIGF2= 0
##$SINO= 400
##$SIOLD= 131072
##$SPECTYP= <>
##$SREGLST= <1H.CDCl3>
##$SSB= 0
##$STSI= 131072
##$STSR= 0
##$SW_p= 8223.68421052631
##$SYMM= 0
##$S_DEV= 0
##$TDeff= 65536
##$TDoff= 0
##$TI= <>
##$TILT= no
##$TM1= 0
##$TM2= 0
##$TOPLEV= 0
##$USERP1= <user>
##$USERP2= <user>
##$USERP3= <user>
##$USERP4= <user>
##$USERP5= <user>
##$WDW= 1
##$XDIM= 131072
##$YMAX_p= 478448533
##$YMIN_p= -11671
##$CURPLOT= <Network HP LaserJet P1505>
##$CURPRIN= <$Network HP LaserJet P1505>
##$DFORMAT= <normdp>
##$LAYOUT= <+/1D_H.xwp>
##$LFORMAT= <normlp>
##$PFORMAT= <normpl>
##$SURQMSG= 1
$$ End of Bruker specific parameters
$$ ---------------------------------
##NTUPLES= NMR SPECTRUM
##VAR_NAME=  FREQUENCY,     SPECTRUM/REAL,   SPECTRUM/IMAG
##SYMBOL=    X,             R,               I
##VAR_TYPE=  INDEPENDENT,   DEPENDENT,       DEPENDENT
##VAR_FORM=  AFFN,          ASDF,            ASDF
##VAR_DIM=   131072,        131072,          131072
##UNITS=     HZ,            ARBITRARY UNITS, ARBITRARY UNITS
##FACTOR=    0.0627417313425164, 1,          1
##FIRST=     8223.62146879497, -2106,        -59147
##LAST=      0,             -18,             -59374
##MIN=       0,             -11671,          0
##MAX=       8223.62146879497, 478448533,    0
$$ Real data points
##PAGE= N=1
##DATA TABLE= (X++(R..R)), XYDATA
$$ [...]
67854 89666 87654 85592 84112 83343 82929 82441 81674 80675 79709 79169 79237 79593 79670 79223 78519 77964 77710 77540 76973
67835 76973 75551 73340 71147 69994 70298 71666 73398 74967 76155 77126 78378 80331 82915 85792 88880
67820 88880 92280 95711 98524 100336 101295 101640 101495 101170 101081 101094 100410 98543 96040 93855 92287 90906 89298
67803 89298 87436 85447 83365 81137 78729 76363 74663 74218 74790 75287 74856 73731 72726 72262 72251 72558
67787 72558 72982 73023 72294 71140 70389 70484 71252 72421 73841 75248 76311 77004 77492 77626 77095 76187 75846 76652
67769 76652 78125 79342 79897 79980 79843 79605 79425 79461 79674 79896 80108 80441 80934 81491 82130 83113 84655 86539
67751 86539 88156 89077 89494 89936 90565 90981 90797 90114 89261 88362 87453 86802 86689 86967 87168 86968 86243 84861
67733 84861 82907 80984 79650 78514 76536 73490 70533 68980 68969 69717 70648 71667 72618 73096 72838 71957
67717 71957 70747 69517 68539 67905 67503 67309 67560 68341 69208 69590 69482 69369 69499 69640 69582 69413 69219 68898 68494
67698 68494 68377 68828 69599 70122 70039 69478 68983 69245 70577 72392 73423 72779 70734 68354 66580 65880 66443
67681 66443 68095 70061 71400 71902 72215 72901 73705 74016 73705 73161 72735 72509 72506 72748 73107 73419 73756 74346 75236
67662 75236 76254 77277 78272 79094 79549 79705 79873 80232 80685 81097 81384 81388 81050 80759 81093 82025 82819 82952 82689
67643 82689 82419 81923 80869 79624 78879 78612 78124 77206 76555 76774 77481 77797 77440 76954 77046 78010 79665 81615
67625 81615 83516 85280 87033 88894 90850 92848 94812 96461 97324 97119 96125 94974 94084 93366 92547 91654
67609 91654 91019 90779 90588 90038 89331 89190 90036 91471 92704 93228 92929 91889 90433 89180 88537 88226 87670
67592 87670 86828 86233 86200 86368 86114 85122 83501 81673 80204 79389 78908 78197 77253 76640 76587 76542 75897 74757 73667
67573 73667 72864 72217 71686 71399 71343 71324 71225 71085 70992 71126 71759 72868 73822 73846 72906 71835 71417 71540 71415 70550
67553 70550 69350 68771 69469 71249 73217 74481 74724 74265 73663 73300 73197 73096 72704 71930 70963 70122 69595 69301
67535 69301 69059 68893 69079 69759 70620 71195 71483 71914 72591 72991 72702 72148 72056 72451 72678 72306 71502 70492 69320
67516 69320 68227 67668 67665 67675 67386 67192 67457 67759 67393 66347 65257 64579 64237 63979 63615 63031 62390 62268 63107
67497 63107 64502 65457 65445 64845 64273 63863 63388 62710 61865 60950 60265 60403 61810 64167 66460 67844 68368 68695
67479 68695 69144 69279 68545 67099 65697 64830 64330 63866 63460 63300 63292 63118 62661 62174 62047 62510 63444 64332 64564
67460 64564 63981 63085 62564 62680 63145 63466 63332 62837 62428 62489 62894 63216 63441 64127 65641 67554 69125 70051
67442 70051 70421 70232 69542 68888 68941 69655 70274 70322 70224 70766 72221 74153 75792 76519 76200 75249 74230 73350 72414
67423 72414 71235 69845 68395 67079 66144 65676 65400 64979 64513 64388 64586 64594 64131 63567 63303 63060 62156 60393
67405 60393 58313 56627 55655 55300 55306 55480 55812 56450 57495 58766 59878 60582 61010 61473 62070 62574 62778 62783 62756
67386 62756 62539 61831 60800 60152 60354 61110 61888 62682 63805 65130 66089 66432 66500 66625 66694 66570 66520 66870 67416
67367 67416 67569 67091 66457 66376 67023 67808 67948 67296 66465 66119 66272 66459 66454 66512 66925 67616 68248 68528 68363 67883
67347 67883 67336 66892 66565 66431 66723 67494 68342 68839 69105 69557 70171 70447 70123 69534 69190 69459 70613 72597
67329 72597 74577 75398 74874 74180 74541 75942 77487 78593 79305 79754 79923 79834 79471 78597 77093 75391 74099
67312 74099 73245 72371 71312 70396 69812 69293 68644 68153 68196 68765 69643 70854 72536 74502 76213 77251 77671
67295 77671 77866 78181 78676 79124 79277 79139 78986 79045 79196 79148 78908 78884 79360 79974 79949 78902 77282 75946 75434
67276 75434 75715 76392 76959 77050 76689 76213 75791 75200 74320 73632 73806 74911 76515 78442 80815 83256 84764
67259 84764 84805 84016 83390 83142 82850 82355 81899 81556 81127 80654 80532 81003 81844 82631 83053 82978 82571 82344 82743 83526
67239 83526 83858 83166 81711 80201 79127 78649 78884 79896 81398 82750 83424 83390 82955 82323 81533 80784 80495
67222 80495 80819 81307 81366 80955 80504 80220 79911 79515 79325 79519 79890 80248 80689 81207 81464 81273 80983 81031 81460 82212
67202 82212 83427 84916 85795 85348 84074 83163 83079 83381 83890 85140 87409 90009 91896 92516 91812 89969 87594
67185 87594 85719 85109 85608 86412 86844 86727 86246 85710 85362 85298 85587 86394 87671 88890 89487 89567 89700 90017 90115
67166 90115 89955 90054 90459 90296 89048 87729 87882 89660 91694 92831 93198 93438 93657 93616 93535 94098 95657 97715
67148 97715 99359 100157 100519 101122 102102 103016 103611 104215 105214 106518 107921 109621 111797 113812 114504 113487 111730
67131 111730 110546 110331 110570 110795 111087 111646 112242 112399 112075 111932 112708 114374 116116 117197 117662 118058 118682
67114 118682 119328 119643 119452 118877 118393 118718 120233 122428 124206 124901 124834 124796 125215 125982 126859 127746 128612 129360
67096 129360 129890 130176 130303 130428 130694 131063 131199 130690 129558 128582 128867 130886 134006 137156 139885 142527 145378
67079 145378 148131 150315 151912 153226 154348 155140 155656 156216 157037 158089 159315 160719 162141 163190 163557
67064 163557 163327 162917 162764 163086 163870 165079 166799 169012 171275 172965 174019 175035 176336 177345 177409 176943
67048 176943 177053 178160 179725 181373 183448 186153 188930 191215 193234 195416 197445 198628 199039 199650 201317
67033 201317 204051 207189 209852 211353 211736 211983 213244 215749 218816 221833 224731 227462 229710 231487 233478
67018 233478 236297 239732 243219 246810 251034 255862 260416 263945 266658 269285 272109 274798 277090 279266
67004 279266 281844 285035 288629 292336 296104 300096 304427 308925 313208 317009 320452 323985 328050 332848
66990 332848 338307 344144 349918 355224 359987 364534 369282 374358 379570 384672 389590 394465 399581 405187
66976 405187 411268 417548 423800 430042 436362 442693 448983 455453 462364 469597 476754 483718 490759 498051
66962 498051 505411 512668 519976 527616 535710 544273 553266 562505 571827 581515 592202 604027 616275
66949 616275 628192 639893 651999 664675 677529 690274 702914 715357 727512 739893 753466
66938 753466 768593 784563 800510 816461 833092 850751 869148 887940 907184 927123 947750
66927 947750 968803 990064 1011544 1033324 1055378 1077700 1100544 1124245 1148749 1173691 1199132
66916 1199132 1225777 1254022 1283142 1312051 1340718 1370137 1400899 1432594 1464827 1498012 1532668
66905 1532668 1568499 1604753 1641083 1677562 1714159 1750798 1787690 1825102 1862960 1901151 1939963
66894 1939963 1979629 2019622 2059095 2098022 2137215 2177025 2216646 2255080 2292357 2329357 2366581
66883 2366581 2403443 2438708 2471488 2501780 2530122 2556810 2581687 2604717 2626341 2646774 2665213
66872 2665213 2680339 2691658 2699799 2705494 2708922 2710234 2709905 2707909 2703059 2693942 2680479 2664056 2646141
66859 2646141 2627155 2606640 2583972 2558792 2531143 2501460 2470310 2438030 2404686 2370262 2334683
66848 2334683 2297778 2259578 2220688 2181978 2143697 2105183 2065730 2025526 1985456 1946120 1907401
66837 1907401 1868959 1830744 1792846 1755157 1717578 1680432 1644251 1609038 1574124 1539037 1504270
66826 1504270 1470763 1438677 1407101 1375125 1342815 1310905 1279861 1249632 1220205 1191912 1165023
66815 1165023 1139326 1114320 1089735 1065717 1042564 1020369 998938 977992 957395 937139 917141
66804 917141 897251 877570 858616 840932 824472 808553 792439 775892 759167 742692 726762
66793 726762 711367 696237 681237 666786 653675 642293 632179 622488 612692 602630 592143 581084
66781 581084 569682 558478 547803 537589 527703 518147 508788 499277 489442 479589 470164 461337 453122
66768 453122 445566 438506 431362 423655 415662 408164 401589 395779 390496 385625 380859 375789 370536 365809
66754 365809 362015 358742 355425 352085 348965 345827 342185 338042 333795 329510 324882 319925 315169 310981
66740 310981 307155 303317 299383 295443 291528 287718 284123 280548 276483 271751 266936 262896 259944 257755
66726 257755 255867 253953 251732 249031 245971 242828 239649 236251 232666 229323 226601 224369 222193 219907
66712 219907 217709 215715 213726 211554 209364 207467 205928 204661 203765 203326 202900 201687 199469 196962 194920
66697 194920 193230 191303 189035 186783 184579 182088 179378 177114 175687 174694 173567 172332 171373 170776 170306
66682 170306 169837 169398 168869 167932 166374 164315 162207 160651 159982 159837 159344 157934 155916 154063 152822 152054
66666 152054 151354 150368 149008 147594 146616 146118 145474 144088 142202 140684 140090 140202 140417 140266 139625 138768 138228
66649 138228 138260 138384 137812 136401 134886 133995 133618 133052 131790 129814 127302 124516 122011 120563 120500 121157 121308
66632 121308 120265 118436 116736 115679 115252 115408 116161 117166 117691 117314 116343 115374 114675 114259 114207 114493 114676
66615 114676 114266 113416 112818 112847 113083 112860 112032 111060 110438 110144 109695 108714 107472 106710 106845 107519 108084 108365 108685
66596 108685 109201 109565 109291 108311 107042 105943 105012 103778 101916 99773 98031 96866 95844 94781 94130 94179
66580 94179 94351 93895 92907 92060 91551 91087 90785 91256 92600 94036 94778 94764 94255 93267 91800 90206 88928 88123
66562 88123 87806 88036 88711 89414 89751 89660 89244 88693 88513 89398 91383 93369 93953 92725 90542 88658 87765 87684
66544 87684 87685 87196 86347 85676 85330 84845 83911 82879 82199 81738 81103 80346 79815 79478 78980 78301 77849 77872 78276 79074
66524 79074 80481 82336 83851 84292 83682 82610 81528 80449 79199 77683 75935 74139 72612 71657 71396
66509 71396 71778 72715 74081 75579 76781 77446 77717 77850 77794 77302 76530 76203 76832 77971 78616 78305 77447 76603
66491 76603 75888 75181 74465 73698 72738 71706 71130 71388 72198 72923 73230 73191 73021 72984 73339 74026 74618 74903 75251
66472 75251 75955 76526 76242 75301 74750 75159 75973 76352 76178 75924 75970 76357 76992 77761 78578 79488 80555 81566 82085
66453 82085 81932 81371 80655 79773 78881 78624 79585 81504 83432 84595 84796 84131 82798 81281 80173 79511 78572
66436 78572 76741 74455 72867 72545 72836 72680 71791 70785 70322 70457 70838 71237 71693 72261 72829 73211 73383 73591
66418 73591 74191 75282 76534 77450 77798 77730 77535 77375 77187 76691 75574 73880 72154 70937 70141 69270 68210
66401 68210 67380 67072 67084 67175 67342 67402 66892 65851 65210 65777 67233 68712 69994 71288 72144 71664 69928 68281
66383 68281 67805 68242 68794 69250 69758 70099 69909 69320 68802 68541 68490 68798 69618 70571 71020 70932 71038 72016 73787
66364 73787 75699 77067 77435 76698 75211 73681 72702 72336 72113 71371 69726 67391 65112 63650 63270 63713
66348 63713 64555 65558 66697 67987 69251 70095 70229 69875 69627 69785 70034 69967 69648 69327 68902 68157 67489 67687
66330 67687 68793 69675 69190 67536 66039 65761 66674 68074 69316 70023 70009 69394 68640 68184 68009 67780 67410 67290
66312 67290 67822 68934 70249 71634 73263 75063 76424 76691 75844 74416 72827 71104 69308 67917 67505
66297 67505 68189 69613 71359 73154 74713 75721 76124 76286 76674 77452 78432 79308 79799 79692 79003 78075 77308
66280 77308 76729 75966 74734 73206 71827 70875 70346 70194 70537 71578 73328 75376 77001 77685 77586 77401 77672
66263 77672 78322 78941 79334 79573 79635 79286 78406 77221 76146 75459 75159 75091 75189 75617 76539 77667 78221 77657 76385
66244 76385 75463 75519 76232 76929 77321 77464 77344 76892 76268 75758 75412 75075 74826 74992 75628 76230 76249 75765 75406 75594
66224 75594 76089 76351 76234 76135 76500 77287 78032 78390 78514 78808 79317 79521 78841 77338 75756 74818 74607 74733 74958
66205 74958 75387 76117 76995 77827 78584 79216 79511 79364 79077 79147 79823 81007 82418 83599 83965 83309 82250 81758
66187 81758 82095 82565 82466 81900 81422 81245 81199 81238 81538 82111 82692 83084 83275 83210 82777 82144 81806 82051 82581 82909
66167 82909 82958 83011 83122 82975 82461 82046 82286 83063 83591 83248 82235 81361 81280 81926 82521 82085 80212 77581 75573
66148 75573 75141 76034 77259 78183 78928 79763 80488 80652 80121 79196 78239 77447 76964 76975 77523 78357 79158 79933 81042
66129 81042 82702 84534 85815 86222 86150 86208 86535 86832 86854 86597 86086 85361 84770 84892 85920 87348 88488 89151
66111 89151 89523 89618 89299 88828 88913 89905 91238 92025 92084 92035 92479 93448 94659 95887 96886 97329 97226 97162 97700 98672
66091 98672 99446 99798 100078 100511 100836 100736 100134 98957 97148 95214 94164 94480 95566 96643 97719 99092
66075 99092 100341 100615 99755 98381 96997 95742 94966 95152 96125 97131 97962 99264 101342 103437 104688 105238
66059 105238 105758 106327 106427 105794 104678 103437 102308 101448 100824 100237 99773 99951 101009 102329 103102 103370 103861
66042 103861 104877 105909 106359 106160 105622 105131 105048 105548 106441 107400 108348 109283 109829 109500 108484 107686 107780 108629
66024 108629 109813 111254 112960 114499 115247 115111 114642 114461 114824 115749 117243 119203 121279 123027 124256 125107
66008 125107 125767 126259 126614 127140 128276 130156 132511 135059 137837 141058 144846 149202 153990 158859 163373
65993 163373 167457 171487 175749 180031 183965 187434 190255 191787 191496 189901 188376 187778 187632 186839 184885
65978 184885 182149 179283 176519 173490 169621 164846 159933 155878 152953 150562 148088 145548 143273 141280
65964 141280 139260 137010 134622 132277 130084 128097 126404 125205 124826 125516 127099 128935 130383 131282 131947
65949 131947 132726 133736 134969 136470 138307 140443 142742 145128 147627 150237 152873 155486 158121 160693
65935 160693 162843 164290 165248 166180 167166 167896 168379 169123 170364 171590 172246 172566 173220 174471 176235 178750
65919 178750 182438 187129 192119 197125 202553 208610 214732 220307 225472 230712 235948 240543 244132 246960
65905 246960 249287 250800 250906 249610 247865 246824 246777 247019 246831 246264 245740 245234 244312 242824 240992 238792
65889 238792 235745 231487 226234 220560 214952 209621 204449 199108 193475 187901 182721 177644 172125 166366
65875 166366 161343 157692 155111 153060 151512 150655 150308 150017 149495 148725 147886 147325 147237 147230 146618 145332 144056
65858 144056 143249 142550 141488 140289 139580 139716 140714 142349 143936 144528 143883 142768 141851 140887 139608 138755 139268
65841 139268 140833 142236 142948 143443 144100 144855 145937 147844 150299 152220 153155 153993 155743 158296 160937 163497
65825 163497 166398 169921 174096 179036 184810 191063 197223 203115 209061 215339 221746 227618 232166 234846
65811 234846 235620 234813 232717 229454 225237 220540 215823 211195 206459 201379 195878 190170 184751 180109 176321
65796 176321 173118 170378 168347 167285 167088 167381 167776 167958 167722 167117 166486 166292 166960 168829 172004 176231
65780 176231 181079 186327 192043 198364 205469 213635 222917 232699 241936 249955 256713 262233 266231 268425
65766 268425 268753 266981 262567 255343 246030 235768 225373 215395 206511 199281 193688 189365 186241 184552
65752 184552 184276 185073 186827 189874 194524 200727 208355 217514 228316 240435 253134 265720 277911
65739 277911 289686 300812 310616 318334 323621 326494 326796 324099 318349 310305 300967 290765 279677
65726 279677 267954 256233 244875 233613 222102 210574 199781 190386 182495 175611 169019 162402
65714 162402 156208 151303 148146 146353 145026 143406 141257 138854 136729 135284 134522 134147 133939 133908 134097 134361
65698 134361 134434 134154 133623 133217 133377 134233 135416 136359 136778 136735 136356 135787 135465 136009 137607 139734 141777 143773
65680 143773 146198 149113 151937 154218 156351 159270 163561 169041 175211 181931 189610 198809 209663 221674
65666 221674 234119 246765 260153 274946 290971 307068 322036 335524 347764 358631 367396 373469
65654 373469 377071 378937 379637 379395 378368 376801 375000 373503 373244 375161 379333 384641 389500 392944 394951
65639 394951 395742 394993 391835 385572 376220 364287 350234 334380 317257 299721 282553 266102 250409
65626 250409 235499 221461 208486 197024 187624 180257 174005 167833 161690 156401 152442 149229 145872
65613 145872 142287 139137 136889 135296 133914 132797 132431 132998 133951 134426 134060 133274 132765 132868 133457 134256 135036
65596 135036 135654 136091 136407 136473 135903 134539 132915 131894 131844 132476 133460 134756 136216 137363 137948 138441 139607
65579 139607 141779 144863 148946 154513 162047 171592 182683 194561 206572 218618 231144 244555 258760
65566 258760 273453 288519 303678 317821 329268 336937 341007 342292 341234 337692 331472 322792 312260
65553 312260 300551 288071 274895 261144 247367 234388 222695 212231 202936 195137 189090 184297
65541 184297 179748 174966 170478 167072 164808 163046 161329 159953 159559 160455 162426 165026 167801 170330 172360
65526 172360 173944 175193 175847 175339 173390 170275 166343 161677 156520 151745 148327 146343 144949 143375 141563
65511 141563 139829 138411 137534 137456 138077 138792 139057 138911 138668 138360 137864 137395 137407 138010 138769 139151 138999 138650 138819
65492 138819 140154 142575 145143 147037 148592 150986 154857 159725 164841 170033 175343 180331 184391 187568
65478 187568 190491 193408 195721 196681 196212 194851 193102 191131 188964 186635 184037 180853 176848 172228 167617
65463 167617 163617 160454 157950 155718 153361 150648 147646 144653 141977 139857 138547 138169 138340 138219 137278
65448 137278 135895 134862 134395 134031 133513 133280 133898 135357 137193 139032 140760 142415 144180 146289 148704
65433 148704 151089 153420 156354 160515 165535 170263 173983 176935 179532 181484 181997 180594 177510 173474
65419 173474 169329 165679 162562 159482 156001 152408 149680 148679 149362 150755 151742 151915 151727 151811 152250 152588
65403 152588 152489 152183 152259 153180 155066 157733 160812 163962 167124 170573 174640 179389 184512 189421 193454 196243
65387 196243 197936 198871 198997 197890 195425 192076 188356 184402 180479 177444 176009 175668 175122 173919 172977
65372 172977 173249 174501 175858 177035 178367 179934 181388 182632 184105 186246 189099 192534 196469 200788
65358 200788 205404 210558 216741 224176 232709 242347 253474 266201 279791 293078 305261 315884 324222
65345 324222 329259 330450 328215 323533 317276 310038 302392 294947 288067 281575 274929 267851 260747 254306
65331 254306 248607 242919 236559 229640 222698 215911 209224 203097 198399 195352 193092 190589 187652 184729
65317 184729 182121 179827 177900 176419 175174 173790 172221 170767 169541 168254 166662 164956 163462 162120
65303 162120 160595 158882 157528 157051 157317 157761 158245 159311 161412 164255 167344 170902 175541 180966 185785
65288 185785 188986 191013 192833 194438 195023 194330 192912 191105 188641 185587 182872 181298 180481 179346 177459
65273 177459 175420 174017 173442 173313 173173 172854 172437 171870 170722 168605 165934 163871 163184 163407 163491 163113 162846
65256 162846 163169 163892 164755 166070 168294 171125 173391 173901 172297 169178 165621 162666 160954 160456 160436 159926
65240 159926 158587 157120 156537 156976 157502 157241 156418 156013 156664 158308 160652 163326 165549 166328 165481 164093
65224 164093 163498 163933 164528 164450 163603 162276 160616 158745 157081 156139 155988 156113 155934 155367 154825 154679 154907 155368
65206 155368 156248 157903 160196 162311 163478 163683 163403 162848 161899 160680 159704 159240 158935 158316 157405 156549 155900
65189 155900 155450 155431 156235 157818 159497 160570 161062 161716 163204 165415 167615 169333 170940 173122 175807 178039
65173 178039 179044 179082 178924 178823 178516 178046 177949 178556 179645 180905 182284 183650 184700 185579 187181 190289 194610
65156 194610 199104 203118 206749 210228 213544 216810 220601 225688 232642 241726 252893 265810 280169
65143 280169 296215 314785 336725 362327 391265 422618 454742 485524 513377 538168 561005
65132 561005 583089 604800 625700 644996 661880 675633 685637 691321 692117 687712 678600 666328
65120 666328 652836 639229 625084 608908 589258 565523 538121 508319 477817 448059 419736
65109 419736 393022 368234 345997 326666 309944 295241 282144 270296 259213 248691 239241 231600
65097 231600 225701 220497 214865 208460 201711 195398 190316 186977 185352 185044 185741 187205 188798 189542 189022
65082 189022 187900 187149 186972 186852 186479 186150 186276 186930 187947 189111 190113 190623 190634 190576 190853 191341 191491 190907
65064 190907 189764 188665 188095 187971 187722 186892 185667 184669 184254 184232 184320 184599 185296 186275 187089 187544 187923 188525
65046 188525 189224 189663 189730 189592 189331 188800 187918 186891 185995 185184 184093 182436 180337 178206 176312 174515 172473
65029 172473 170012 167219 164219 161116 158246 156195 155256 155028 154889 154794 155183 156106 156946 157213 157125 157069 156866 156091
65011 156091 154905 154062 154125 155099 156821 159280 162447 166079 169830 173374 176486 179206 181912 184883 187829
64996 187829 190169 191741 192857 193676 194023 193977 194131 194983 196421 198144 200149 202463 204695 206482 208283 211122
64980 211122 215356 220065 223910 226348 227779 228645 228778 227749 225616 223019 220552 218236 215664 212448 208458
64965 208458 203932 199525 195951 193259 190680 187543 184114 181111 178666 176399 174342 173002 172411 171889 171010
64950 171010 170108 169476 168805 167905 167283 167300 167332 166632 165694 165760 167003 168108 167949 166981 166570 167322 168543 169188 168984
64931 168984 168604 168871 169930 171270 172450 173477 174421 175024 175019 174541 173879 173039 171932 170804 170058 169801 169912
64914 169912 170443 171466 172664 173547 174032 174390 174706 174900 175314 176655 179212 182547 186117 189794 193663 197797
64898 197797 202471 208178 215101 222817 230789 238874 247052 254907 261798 267514 272495 277272 281809 285535
64884 285535 288031 289560 290710 291530 291361 289663 286598 282479 277109 270268 262660 255614 249792 244803 240176
64869 240176 236127 233160 231458 230936 231377 232272 232955 233239 233519 233999 234204 233573 232055 229773 226512 222082
64853 222082 216911 211771 207027 202537 198174 194098 190608 188055 186677 186240 185937 185041 183640 182477 182180
64838 182180 182858 184253 185907 187270 188011 188277 188484 188855 189303 189629 189598 189036 188115 187460 187637 188566 189678 190581
64820 190581 191333 192218 193654 196230 200362 205739 211457 216929 222537 229161 237200 246226 255650 265579 276806
64805 276806 289792 303731 316789 327329 334672 338778 339644 337348 332303 325042 315904 305293 294082
64792 294082 283293 273433 264538 256796 250587 245783 241530 237076 232557 228674 225841 223960 222863 222485
64778 222485 222572 222633 222460 222520 223559 225850 229005 232519 236247 240376 245278 251543 259812 270182 281866
64763 281866 293753 305169 315803 325161 332779 338987 344815 350789 356283 360370 362896 364378 365286 365860
64749 365860 366363 366947 367321 366884 365182 362024 357315 351058 343375 334341 324037 312924 301862 291440
64735 291440 281668 272610 264815 258626 253506 248784 244727 242100 240827 240019 239322 239318 240295 241453 241754 241065
64719 241065 240026 239299 239289 240260 242310 245425 249700 255166 261283 267028 271733 275429 278155 279473 279031
64704 279031 277150 274330 270488 265236 258778 252088 246255 241827 238598 235731 232362 228468 224959 222570
64690 222570 220911 219063 216889 215187 214619 215071 216141 217695 219744 222236 225284 229235 234179 239609 244972
64675 244972 250517 257238 265877 276178 287247 298539 310232 322561 334961 346065 354507 359589
64663 359589 361167 359279 354140 346329 336663 325822 314288 302657 291809 282628 275572 270495 266836
64650 266836 264005 261703 259965 258872 258315 258116 258375 259577 262230 266399 271615 277332 283571 291141 301122
64635 301122 314028 329420 346256 363512 380472 396637 411535 424644 435371 443112 447415 448160
64623 448160 445675 440677 433991 426111 416960 406194 393843 380608 367494 355273 344377 335205 328239
64610 328239 323756 321486 320696 320644 320901 321319 321834 322458 323312 324380 325218 325194 324088 322177 319655 316359 312327
64593 312327 308187 304469 300768 296188 290528 284512 278888 273931 269916 267350 266385 266505 267190 268533 270863
64578 270863 274127 278010 282386 287228 292259 296989 300953 303725 305028 305079 304447 303282 301080 297582 293406
64563 293406 289181 284481 278397 270961 263190 255825 248838 242230 236457 231831 228225 225653 224418 224237
64549 224237 223960 222769 221180 220243 220084 219974 219600 219545 220432 222201 224344 226410 228081 229145 229622 229692 229360
64532 229360 228474 227245 226355 226180 226073 224935 222580 220090 218598 218062 217652 217133 217238 218567 220682 222700
64516 222700 224410 226277 228457 230408 231603 232277 233242 235192 238314 242349 246908 251848 257464 264144 271829
64501 271829 280006 288276 296680 305490 315031 325778 338014 350908 362283 369922 373190 373047 370549
64488 370549 365793 358443 348830 338148 327664 317930 308853 300390 293047 287524 283885 281323 278971 276778
64474 276778 275230 274241 272798 269957 265991 262192 259567 257927 256302 254027 251277 248725 246958 246323 247070
64459 247070 249324 252908 257344 262080 266553 270077 272054 272523 272296 272253 272544 272744 272694 272856 273775 275476 277507
64442 277507 279399 280962 282345 284091 287003 291591 297540 303914 310121 316634 324581 334554 346007 358015
64428 358015 370496 384438 400898 420155 442082 467065 496161 530471 570848 618395 674907
64417 674907 742450 822400 914764 1018010 1129133 1243977 1358023 1467532 1570324 1665626
64407 1665626 1752938 1830701 1895801 1944404 1973491 1982012 1971108 1943650 1903323 1853244 1794533
64396 1794533 1725948 1645308 1551870 1447821 1337741 1226665 1118435 1015435 919370 831758
64386 831758 753597 684915 625124 573789 530723 495296 466115 441624 420835 403336 388850
64375 388850 377027 367412 359298 351770 344221 336767 329919 323890 318430 313152 307736 301962 295854 289743
64361 289743 283920 278327 272935 268194 264563 261724 258906 256091 254243 254103 255397 257625 261033 266223
64347 266223 273181 281309 290163 299537 308929 317562 324990 331142 335689 337827 336965 333386 328153 322613
64333 322613 317925 314623 312353 310260 307845 305452 303911 303892 305565 308618 312438 316355 319790 322264 323513
64318 323513 323778 323700 323532 322627 320184 316424 312496 309168 306159 302898 299317 295615 291800 287914 284291
64303 284291 281030 277515 272961 267321 261212 255176 249462 244368 240222 237000 234411 232421 231282 230976
64289 230976 231106 231477 232440 234429 237404 241018 245101 249779 255197 261319 267923 274697 281421 288188 295377
64274 295377 303307 311874 320613 329130 337473 346050 355068 363967 371473 376319 378042 377110 374460 370948
64260 370948 367116 363289 359898 357640 357170 358493 360826 363164 364822 365353 364304 361347 356457 349656 340843
64245 340843 330304 319194 308939 300106 292248 284902 278229 272602 268029 264242 261048 258382 256307
64232 256307 255058 254809 255268 255863 256439 257404 258956 260577 261579 261850 261782 261769 262103 263076 264771 266861 268860
64215 268860 270314 270594 268973 265421 261063 257237 254216 251360 248417 245979 244640 244243 244254 244459 245055 246344
64199 246344 248506 251378 254259 256303 257390 258387 260295 263301 266973 271219 276603 283701 292522 302838
64185 302838 314853 329137 345840 364249 383228 401744 418626 432137 440524 443134 440540 433473
64173 433473 422277 407719 391622 375964 361610 348441 336354 325429 315449 306174 297982 291396
64161 291396 285938 280416 274529 269247 265263 262057 259076 256916 256410 257102 257692 257748 258098 259624 262453 266352
64145 266352 271132 276433 281657 286406 290627 294226 296887 298412 298932 298704 297928 296799 295441 293805 291865
64130 291865 289851 287976 286068 283885 281794 280608 280654 281434 282347 283366 284846 287077 290237 294475 299783
64115 299783 305946 312761 320141 328022 336511 346142 357536 370642 384601 398423 411308 422252 430086
64102 430086 434398 436017 436132 435299 433750 432279 432136 434199 438674 445370 453689 462449 470268 476214 479722
64087 479722 480151 477103 471211 463959 456490 448967 441147 433037 424779 416378 407887 399534 391430 383449
64073 383449 375629 368399 362166 356932 352494 348746 345526 342528 339688 337384 335929 335079 334392 333865 333819
64058 333819 334296 334948 335469 335751 335735 335552 335807 337202 339681 342318 344287 345744 347606 350790 355811 362793
64042 362793 371445 381133 391331 402124 414076 427542 442219 457366 472361 486991 501204 514586
64030 514586 526064 534253 538295 538427 535697 531127 525303 518711 512278 507238 504367 503439 503541 503913 504316
64015 504316 504543 503724 500461 493803 484062 472616 460968 450048 440171 431334 423430 416382 410175 404694
64001 404694 399519 394184 388864 384552 382154 381450 381378 381359 381884 383550 386053 388660 391362 394814 399151 403587
63985 403587 407493 411322 415918 421312 426834 432277 438266 445322 453126 461107 469404 478778 489609 501380
63971 501380 513255 524967 537023 550192 564944 581390 599591 619656 641487 664604 688558
63960 688558 713539 740332 769560 801329 835908 874496 918847 970151 1028774 1095248 1171137
63949 1171137 1258652 1359765 1476013 1608925 1760187 1931346 2123632 2337903 2574264 2831548
63939 2831548 3107462 3399389 3704903 4021262 4344403 4668296 4985008 5285441 5560603
63930 5560603 5802894 6006668 6167981 6284150 6353521 6375023 6347512 6269821 6142017 5966788
63920 5966788 5749487 5497023 5216967 4917415 4606729 4292557 3980815 3675643 3380347
63911 3380347 3098309 2833119 2587887 2364503 2163468 1984291 1825848 1686421 1563807
63902 1563807 1455791 1360626 1277071 1204180 1141188 1087310 1041282 1001228 965363 932829 903536
63891 903536 877206 852946 829767 807126 784845 762912 741584 721367 702571 685055 668617
63880 668617 653471 640111 628922 620126 613947 610521 609747 611429 615486 621797 629938 639392 650042
63867 650042 662237 676265 691868 708316 724893 741361 757971 774975 792055 808330 822986
63856 822986 835738 846605 855429 861892 865795 867062 865520 860993 853633 843894 832141 818519 803282
63843 803282 786926 769770 751542 731727 710357 688276 666473 645185 623822 601806 579363
63832 579363 557394 536621 517063 498338 480261 462994 446793 431775 417859 404787 392235
63821 392235 380119 368809 358921 350778 344088 338151 332395 326771 321647 317334 313771 310749 308284 306558
63807 306558 305466 304537 303425 302269 301399 300862 300399 299735 298727 297351 295737 294111 292588 291107 289645
63792 289645 288261 286746 284480 280951 276351 271467 267127 263874 261837 260577 259295 257703 256507 256559 257576
63777 257576 258263 257745 256363 254987 254098 253796 254140 254992 255769 255757 254645 252590 250008 247553 246016 245799 246488
63760 246488 247252 247684 248080 248873 250003 250876 250848 249729 247929 246161 244965 244498 244671 245347 246358 247461 248395
63743 248395 249022 249459 250181 251844 254773 258578 262502 266129 269537 272808 275781 278420 280991 283582 285776
63728 285776 287198 288242 289857 292646 296442 300672 304851 308801 312760 317343 323071 329830 336924 343647
63714 343647 349547 354178 357028 357933 357343 355947 354160 352096 349812 347290 344371 341103 338142 336388 335989
63699 335989 336026 335475 334340 333566 333946 335493 337863 340928 344641 348659 352502 356008 359308 362423 365197
63684 365197 367615 369816 371722 372960 373295 372892 372032 370833 369449 368257 367581 367358 367357 367580 368205 369184 370166
63667 370166 370788 370933 370797 370858 371577 372859 373985 374392 374352 374453 374501 373507 370890 367141 363051 358765 354049
63650 354049 349074 344383 340239 336544 333363 330996 329387 327938 326087 323805 321441 319406 318177 318203 319495
63635 319495 321555 323993 326981 330791 335153 339556 344081 349396 355817 362741 369249 375021 380553 386702
63621 386702 394105 402804 412228 421710 431170 441211 452523 465359 479644 495367 512664 531745
63609 531745 552886 576410 602509 631226 662647 696906 733840 772680 811979 849521 882426
63598 882426 908040 925317 935103 938840 937428 931743 923667 915578 908740 902805 896935 890700 883579 874266
63584 874266 861125 843210 820664 794353 765502 735583 706127 678408 653182 630666 610780
63573 610780 593491 578889 566868 556925 548573 541837 537093 534507 534030 535849 540236 546742 554021 560838
63559 560838 566999 573101 579645 586728 594308 602365 610883 620079 630675 643703 659982 679902 703681
63546 703681 731638 764121 801316 843149 889206 938264 987531 1032433 1067929 1090839 1101173
63535 1101173 1101271 1093977 1081893 1067750 1054340 1043589 1036014 1031170 1028136 1025426 1021023 1012977 999844
63522 999844 980568 954629 922708 886735 848725 809753 770339 731376 694075 659220 627022
63511 627022 597625 571311 548253 528420 511631 497390 484842 473310 462890 454101 447004 441049
63499 441049 435754 431137 427367 424305 421528 418683 415795 413312 411773 411233 411071 410474 409006 406584 403272
63484 403272 399488 396245 394652 395069 396971 399604 402502 405463 408452 411625 415182 419077 423051 426897
63470 426897 430498 433582 435756 436800 436747 435659 433506 430307 426187 421320 416042 410981 406814 403734 401304
63455 401304 398936 396456 394206 392651 391942 391837 392052 392641 393914 396094 399315 403844 409869 416960 424229
63440 424229 431324 438896 447763 458050 469539 482513 497771 516066 538050 564421 595327 629389
63428 629389 663713 695010 720680 739376 751303 758130 762117 765159 768747 774493 784101 798792 819158
63415 819158 845459 877651 915197 957202 1002482 1049015 1093627 1132942 1164670 1187615 1201003
63404 1201003 1204854 1200998 1192607 1182448 1172139 1162816 1155185 1148542 1140796 1130044 1115332 1095635 1069459
63391 1069459 1036494 998766 959067 918742 877947 837440 798776 762822 729249 697739 668917
63380 668917 643817 623001 606362 593274 582776 574062 567072 562420 560677 561895 565709 571587 578983
63367 578983 587592 597478 608798 621477 635366 650543 667164 685164 704450 725296 748256 773800
63355 773800 802367 834564 870798 910657 952936 996219 1039035 1079537 1115473 1144640 1165295
63344 1165295 1176470 1178561 1173672 1164782 1154199 1142941 1131527 1120698 1110947 1101651 1091116 1077462
63332 1077462 1059279 1035683 1006322 971682 933325 893566 854625 817846 783589 751744 722373
63321 722373 696037 673730 656510 644907 638440 635568 634012 631082 624156 611715 594349 574401
63309 574401 554166 534483 515194 496520 479456 464957 453296 444264 437521 432565 428677 425156
63297 425156 421614 418035 414675 411882 409805 408189 406526 404393 401662 398483 395146 391798 388211 383988
63283 383988 379101 374066 369438 365365 361723 358400 355255 352207 349602 348084 347677 347410 346401 344990 344161
63268 344161 344139 344366 344734 345880 348061 350568 352638 354368 356321 358741 361536 364605 367761 370690 373346
63253 373346 376069 378990 381701 383917 386121 389076 392905 397113 401309 405496 409829 414571 420202 427099
63239 427099 435123 443947 453732 465031 478020 492272 507412 523538 540840 559207 578502 598904
63227 598904 620595 643246 666127 688689 710821 732564 753812 774313 793871 812493 830466
63216 830466 848270 866354 884982 904305 924460 945428 966689 987085 1005155 1019693 1030081
63205 1030081 1036085 1037329 1033103 1022869 1007015 986935 964162 939485 913075 885387 857678 831551
63193 831551 808166 787978 771006 757076 745875 737031 730303 725682 723314 723377 726004 731217 738928
63180 738928 749034 761468 776082 792488 810145 828566 847391 866306 885039 903449 921513
63169 921513 939218 956572 973616 990232 1005919 1019977 1031962 1041721 1048859 1052438 1051467 1045584 1035065
63156 1035065 1020265 1001273 978140 951248 921433 889900 858011 826906 797180 768948 742268
63145 742268 717392 694567 673784 654930 638115 623541 610975 599650 588984 579293 571501 566081
63133 566081 562526 559878 557528 555348 553386 551744 550646 550379 551163 553237 556896 562204 568725 575797 583025
63118 583025 590327 597564 604393 610479 615656 619935 623510 626639 629310 631191 632212 632974 634133 635532
63104 635532 636460 636705 636778 636983 636916 636149 634874 633526 632183 630709 629170 627690 626068 623905 621021 617634
63088 617634 614332 611960 611165 611741 612658 613032 612921 613007 613725 614937 616243 617375 618452 620010 622617 626308
63072 626308 630578 634972 639455 644167 649192 654640 660664 667334 674899 684122 695705 709294 723723
63059 723723 738526 754493 772513 792691 815063 840266 868748 900002 933490 969678 1009288
63048 1009288 1052016 1097020 1144241 1194113 1246130 1298854 1351409 1404035 1457001 1509805 1561591
63037 1561591 1611647 1659450 1704982 1749207 1793567 1838754 1884343 1929483 1973315 2014785 2052817
63026 2052817 2086664 2115407 2137141 2149465 2150834 2140748 2118822 2084847 2039957 1986639 1927115
63015 1927115 1862643 1794701 1725827 1658607 1594595 1534811 1480472 1432483 1390790 1355042 1325537
63004 1325537 1302942 1287500 1279060 1277462 1282296 1292595 1307276 1325665 1347329 1371827 1399004 1428976
62992 1428976 1461331 1494811 1528286 1561578 1594879 1627858 1660012 1691406 1722318 1752389 1780691
62981 1780691 1806332 1828435 1845836 1857419 1862427 1859925 1848438 1826959 1796128 1757645 1712707 1661843
62969 1661843 1606091 1547351 1487395 1427236 1367649 1309618 1254020 1201368 1152076 1106529 1064730
62958 1064730 1026275 990839 958340 928578 901103 875508 851506 828632 806275 784149 762402
62947 762402 741239 720786 701342 683299 666661 650953 635782 621244 607705 595450 584573
62936 584573 574902 565972 557449 549617 543064 537787 533039 528246 523715 520127 517662 515955 514698 513859
62922 513859 513374 512964 512405 511750 511092 510148 508261 505005 500795 496733 493757 491937 490528 488508 485123 480405
62906 480405 475387 471518 469457 468546 467662 466277 464454 462273 459860 457749 456389 455294 453386 450387 447301
62891 447301 445216 444164 443546 443159 443205 443527 443445 442484 440942 439633 439182 439624 440519 441414 442192 442953 443661 444145
62873 444145 444511 445238 446581 448060 448871 448777 448300 447968 447721 447212 446364 445310 443974 442219 440448 439501 439652
62856 439652 440047 439598 438239 436891 436316 436490 437102 438043 439238 440471 441623 442745 443616 443691 442872 441933 441772
62839 441772 442399 443091 443304 442935 441844 439804 437073 434525 432877 431968 430985 429359 427363 425864 425532 426314
62823 426314 427686 429269 430962 432567 433755 434611 435825 437999 440999 444243 447378 450446 453675 457429
62809 457429 462005 467092 471849 476003 480478 486272 493080 499848 506454 513848 522435 531350 539737 547871
62795 547871 556432 565321 573931 582216 590768 600072 610332 621996 635865 652507 671965 694190 719484
62782 719484 748353 781131 818024 859450 906106 958602 1017036 1081029 1150092 1223838 1301793
62771 1301793 1383111 1466516 1550423 1633134 1713066 1788755 1858367 1919159 1967914 2002331 2021842
62760 2021842 2026881 2017686 1994255 1957178 1907912 1848270 1780169 1705911 1628068 1548740 1469208 1390441
62748 1390441 1313661 1240147 1170707 1105533 1044464 987296 933997 884757 839857 799511 763820
62737 763820 732651 705379 681006 658844 638873 621150 605175 590391 577048 565876 556913 549368
62725 549368 542713 537192 533001 529757 527178 525707 525860 527351 529377 531514 533881 536731 540383 545361
62711 545361 552049 560311 569889 581054 594389 609990 627490 646947 669120 694609 723256 754828
62699 754828 789889 829313 872990 919709 968653 1020613 1077302 1139670 1207236 1278795 1353128
62688 1353128 1428899 1504385 1577599 1646374 1708230 1760686 1802060 1831599 1848534 1851548 1839686
62677 1839686 1813417 1774222 1723647 1663461 1596376 1525380 1452215 1377347 1301644 1227255 1156471
62666 1156471 1090381 1028989 972053 919370 870820 826596 787007 751726 719629 689795 662285
62655 662285 637586 615729 596366 579339 564645 552032 540986 530872 520865 510191 498912
62644 498912 488110 478831 471114 464492 458979 454922 452128 449947 448176 447183 447045 447234 447371 447689 448410
62629 448410 449042 448752 447297 445234 443191 441199 438833 435931 432923 430386 428407 426703 425296 424724 425451
62614 425451 427375 430100 433388 437078 440900 444724 448805 453440 458520 463726 468965 474321 479751 485314
62600 485314 491580 499388 509183 521022 535202 552353 572724 595814 621056 648626 679296 713585
62588 713585 751262 791540 833412 875788 917541 957575 994756 1027759 1055089 1075493 1088339
62577 1088339 1093502 1091010 1081090 1064543 1042605 1016125 985293 950591 913657 876582 840435 805113
62565 805113 770593 737551 706553 677440 649997 624686 602186 582579 565491 550700 538061
62554 538061 527084 517151 508079 500091 493314 487668 483050 479289 476042 473115 470705 468964 467567 466135
62540 466135 464909 464476 464937 465836 466867 468132 469678 471267 472698 473929 474778 474970 474697 474789 476073 478734
62524 478734 482443 486969 492583 499936 509550 521310 534596 549070 565213 583846 605312 629494
62512 629494 656456 686536 719772 755726 794033 834734 877908 923170 969684 1016342 1061844
62501 1061844 1104871 1144407 1179735 1210054 1234324 1251648 1261765 1265212 1263237 1257515 1249721 1241345
62489 1241345 1234087 1230206 1231886 1240094 1254421 1274282 1299949 1332223 1371476 1417369 1469295 1526592
62477 1526592 1588039 1651035 1711207 1763167 1802553 1828134 1841885 1846487 1842391 1827159 1797467 1751655
62465 1751655 1690831 1618340 1538436 1454929 1370294 1285792 1202464 1121915 1045978 975777 911584
62454 911584 853725 803123 760475 725108 695203 669255 646915 628369 613425 601515 592169 585067
62442 585067 579817 576085 573815 572955 573113 573865 575338 578048 582047 586633 590994 594796 597930 600033 600620
62427 600620 599601 597338 594133 589869 584286 577483 569976 562270 554536 546735 538862 530933 522921 514962
62413 514962 507500 500886 494832 488634 482048 475691 470371 466259 462825 459444 455956 452794 450628 449725
62399 449725 449687 450004 450697 452028 453724 455189 456522 458596 461807 465460 468796 471978 475481 479090 482218
62384 482218 484857 487572 490861 495097 500680 507538 514797 521700 528626 536480 545374 554737 564535 575273
62370 575273 586828 598287 609172 619987 631234 642720 654246 666383 680187 696646 716594
62359 716594 740580 768535 800165 835972 877308 925039 978655 1036933 1098928 1163880 1230651
62348 1230651 1297637 1362763 1423230 1475879 1518524 1550780 1573303 1586641 1591227 1587940 1577855 1561408
62336 1561408 1538288 1508128 1471082 1428034 1380719 1331493 1282494 1234863 1188961 1145180 1104250
62325 1104250 1066793 1032875 1002025 973574 947004 922023 898253 874948 851311 827168 802923
62314 802923 778772 754356 729453 704686 681185 659835 641071 625123 611976 601229 592239 584414
62302 584414 577266 570465 564093 558656 554646 552184 551147 551298 552156 553171 554319 556188 559235 563387 568670
62287 568670 575654 584664 594972 605453 615813 626469 637366 647795 657481 667033 676932 686705 695623
62274 695623 703835 712235 721266 730321 738360 744857 750040 754507 758854 763586 769087 775512 782884 791508
62260 791508 802228 816079 833731 855472 881658 912884 949703 992509 1041688 1097448 1159228
62249 1159228 1225460 1294038 1362603 1428195 1487186 1536357 1574224 1601132 1618093 1625783 1624512 1614662
62237 1614662 1596709 1570841 1536786 1494266 1443723 1386496 1324345 1259121 1193028 1128665 1068082
62226 1068082 1011931 960106 913055 871685 835956 804604 776628 752249 731821 714641 699598
62215 699598 686445 675491 666424 658356 650919 644427 638895 633704 628435 623447 619358 616346 614231 612960
62201 612960 612857 614434 617874 622580 627488 632115 637051 643037 649838 656548 662791 668976 675471 682258
62187 682258 689463 697530 706597 716250 726247 737047 749232 762635 776379 789634 802072 813643
62175 813643 824066 832708 839064 843438 846932 850681 855348 861600 870638 883704 901224 923047 949448
62162 949448 981293 1019114 1062539 1110654 1162245 1215395 1267434 1315751 1358509 1394482 1422745
62151 1422745 1442908 1455354 1460818 1459821 1452607 1439297 1419843 1394049 1362068 1324768 1283542 1239967
62139 1239967 1195788 1152824 1112363 1074781 1040076 1008746 981719 959325 940672 924244 909118
62128 909118 895476 884013 874957 867726 861394 855264 849006 842676 836902 832759 830890 830787 831370 832398
62114 832398 834885 840003 847923 857754 868014 876818 882199 883006 879582 873335 865850 858632 853214 850536
62100 850536 849913 849155 846175 840466 832951 824685 816005 806839 797436 788606 781305 776130 773194 772314 773171
62085 773171 775312 778199 781431 785004 789312 794902 802183 811323 822356 835322 850197 866778 884810
62072 884810 904355 925826 949414 974489 999854 1024623 1048706 1072436 1096095 1119995 1144733
62061 1144733 1171005 1199222 1229530 1262010 1296325 1330990 1363380 1390938 1412386 1427693 1437124
62050 1437124 1440796 1439025 1432472 1421523 1405802 1384577 1357432 1324272 1285077 1240325 1191601 1141141
62038 1141141 1090533 1040243 990565 942499 897369 855925 818177 783876 752814 724825 699806
62027 699806 677653 658063 640628 625301 612485 602381 594494 588026 582455 577441 572573 567639 562846
62014 562846 558290 553495 548024 542310 537243 533058 529287 525800 523104 521504 520624 520070 520047 520997 523109
61999 523109 526473 531311 537549 544361 550560 555434 559062 561915 564302 566132 567093 567044 566158 564574 562039
61984 562039 558142 552765 546032 537948 528538 518325 508207 498723 489805 481331 473526 466633 460539 454959
61970 454959 449771 445070 441076 437990 435657 433432 430820 428232 426633 426377 426869 427461 427993 428344 428148 427425
61954 427425 426868 426954 427230 427073 426760 427154 428586 430701 433284 436659 441250 447195 454429 462794 472066 482178
61938 482178 493452 506393 521286 538087 556473 575761 595094 614043 632808 651441 669246
61927 669246 685499 700508 715194 729518 742012 751153 756741 759658 760635 759625 756200 750218 742142
61914 742142 732911 723528 714753 707141 701268 697752 697050 699342 704594 712607 723067 735629 749802 764616
61900 764616 778648 790748 800655 808592 814342 817175 816699 813320 807686 800064 790526 779543 767973
61887 767973 756534 745485 734829 724706 715470 707351 700020 692645 684510 675488 665687 654780 642138
61874 642138 627759 612676 598174 584806 572452 561117 551243 543210 536919 532035 528457 526329 525718
61861 525718 526484 528492 531781 536439 542386 549448 557642 567232 578461 591355 605958 622687 642183
61848 642183 664714 689835 716750 744909 774054 803773 833259 861648 888359 912875 934267
61837 934267 951257 962849 968770 969276 964815 956091 944229 930554 916225 902288 889978 880624 875188
61824 875188 874095 877450 885080 896223 909565 923871 938425 952618 965268 974663 979337 978656 972634
61811 972634 961417 945136 924330 900417 875457 851145 828009 805726 784129 763580 744318
61800 744318 725920 707733 689660 672180 655752 640508 626510 613976 603117 593881 585926 578803
61788 578803 572150 565752 559467 553212 547202 542088 538505 536378 534989 533844 533091 532793 532257 530713 528528
61773 528528 527019 526967 527797 528485 528766 529095 529742 530480 531160 532183 534237 537672 542202 547177 552169 557352
61757 557352 563209 569831 576708 583417 590354 598312 607206 615595 621722 624825 625096 622740 617709 610409
61743 610409 601986 593448 584844 575782 566501 558004 551182 546188 542552 539462 536005 531755 527307 523849
61729 523849 521947 521040 520272 519441 518912 518992 519738 521107 522951 525056 527479 530622 534585 538631 541752 543752
61713 543752 545363 547267 549399 551322 552901 554340 555696 556613 556481 554797 551411 546585 540883 534981 529474
61698 529474 524678 520478 516473 512407 508447 504955 501960 498957 495299 490797 485961 481582 478011 474855
61684 474855 471433 467421 462918 458083 453095 448526 445258 443674 443102 442342 440663 438200 435570 433385 431983
61669 431983 431305 430986 430680 430317 430009 429872 430059 430765 431964 433228 434020 434180 434056 434254 435352 437637 440863
61652 440863 444367 447578 450327 452634 454459 455940 457587 459860 462619 465351 467851 470336 472933 475437
61638 475437 477634 479523 481102 482204 482767 483044 483380 483868 484393 484941 485694 486721 487590 487459 485756 482720
61622 482720 479118 475384 471337 466804 462121 457720 453557 449395 445508 442574 440843 439822 438853 437669
61608 437669 436211 434262 431500 427783 423164 417718 411532 404898 398362 392462 387346 382724 378288 374128
61594 374128 370533 367448 364416 361163 357931 355068 352628 350573 348989 347728 346204 344090 341988 340819
61580 340819 340567 340213 339027 337432 336422 336443 337015 337173 336211 334337 332645 332109 332555 332972 332852 332674 332967
61563 332967 333477 333720 333837 334307 335053 335512 335627 336228 338169 341373 344949 348089 350639 352817 354608 355635
61547 355635 355671 355136 354826 355106 355591 355785 355857 356490 358049 360178 362340 364439 366630 368741 370287 371223 372293
61530 372293 374297 377130 379870 381750 382707 382954 382534 381567 380540 379812 378937 377010 373844 370461 368112 367013
61514 367013 366294 365182 363887 363171 363262 363566 363489 363124 362879 362773 362525 362174 362123 362575 363380 364460 365822 367137
61496 367137 367931 368424 369520 371631 374070 376053 377717 379621 381786 383958 386285 388833 390737 390903 389605
61481 389605 388447 388582 389725 391208 393107 395823 399136 402361 405191 407796 410216 412058 412910 412838 412413
61466 412413 412214 412314 412307 411904 411293 410712 409855 408159 405631 403054 401306 400707 400998 401585 401836 401543 401183 401474
61448 401474 402583 404059 405482 406874 408367 409832 410940 411413 411276 411044 411516 413004 414881 416249 416989
61433 416989 417802 419422 422218 426287 431184 435550 437831 437612 435806 433466 431015 428779 427435 427429 428436
61418 428436 429827 431427 433491 436219 439475 442709 445088 446058 445887 445278 444452 443115 441306 439540 437940
61403 437940 435948 433270 430495 428376 427075 426447 426459 426874 427084 426801 426487 426670 427259 427923 428615 429291 429700
61386 429700 429925 430522 431585 432302 432153 431949 432827 434749 436899 439129 441910 445132 448132 450931 454338 458578
61370 458578 462766 466125 468954 471995 475447 479038 482575 485986 489134 491948 494517 496884 498996 501013
61356 501013 503344 506184 509312 512536 516113 520520 526030 532639 540211 548454 556857 564775 571534 576534
61342 576534 579478 580668 580939 581204 581975 583275 584869 586555 588220 589588 590070 589163 587021 584246 580998
61327 580998 576730 571110 564727 558453 552463 546532 541078 537116 535105 534440 534320 534630 535701 537613 540077
61312 540077 542825 545909 549761 555031 562190 571122 581266 592336 604792 619423 636392 654624 672123
61299 672123 686983 698273 706039 710585 711975 710275 705967 699885 692845 685482 678184 670924 663356 655388
61285 655388 647493 640172 633265 626230 619059 612508 607377 603896 601926 601403 602378 604704 607890 611342 614787
61270 614787 618475 622795 627685 632599 637087 641091 644592 647391 649685 652541 657272 664315 673017 682464
61256 682464 692164 701889 711184 719209 725043 728204 728973 728152 726471 724325 721980 719616 717086 714033 710525
61241 710525 707152 704258 701456 698223 694559 690718 686723 682603 678677 675012 670990 666072 660815 656554
61227 656554 654208 653891 655402 658423 662324 666417 670354 673888 676552 678210 679705 682204 685991 690591
61213 690591 695877 702156 709135 715673 720786 724276 726301 727052 727061 727116 727597 728407 729661 731840 735203 739740
61197 739740 745849 754350 765616 779384 795582 814536 835990 858614 880855 901551 919431 932922
61185 932922 941266 945335 946720 946435 944961 942894 940711 938194 934787 930394 925274 919340 912137 903478
61171 903478 893680 883222 872529 861933 851500 840933 829904 818388 806493 794204 781547 768781
61159 768781 756140 743554 730926 718556 707030 696836 688226 681354 676391 673687 673799 677028 682723
61146 682723 689370 695527 700369 703237 703149 699247 691467 680563 667773 654654 642752 632912 625055 618863
61132 618863 614363 611599 610181 609696 610351 612677 616769 622278 629067 637386 647384 658828 671461 685380
61118 685380 700893 718058 736530 755929 776349 798260 821796 846384 871433 897103 923835
61107 923835 951259 978239 1004002 1028535 1051831 1073524 1093452 1111620 1127172 1138223 1143384 1142932
61095 1142932 1137932 1128944 1116276 1100798 1083482 1064498 1043699 1021835 1000367 980094 960657 941382
61083 941382 921986 902550 883482 865658 850005 836822 825789 816537 808708 801676 794884 788564
61071 788564 783623 780713 779761 780413 782420 785557 789645 794828 801477 809701 819250 829938 841876 855196
61057 855196 869826 885594 902287 919529 936868 954190 972058 991552 1013640 1038508 1065555
61046 1065555 1094221 1124670 1157283 1191667 1226873 1262639 1299638 1338262 1378018 1418498 1460025
61035 1460025 1502672 1545536 1587859 1630233 1673680 1718087 1762530 1806723 1851088 1895787 1940832
61024 1940832 1986954 2035097 2084883 2134426 2181716 2225624 2266101 2304624 2344360 2388681 2439375
61013 2439375 2497179 2563715 2641414 2731316 2832251 2942655 3062640 3194847 3345130 3522829
61003 3522829 3739202 4005485 4333895 4740514 5246103 5875677 6661536 7648180 8891764
60994 8891764 10453499 12391492 14741378 17465295 20381273 23142279 25333253 26658665
60986 26658665 27091613 26871921 26371073 25942351 25839189 26178727 26897357 27720276 28224987
60977 28224987 28016646 26913233 25008741 22584273 19956920 17374128 14986908 12868136
60969 12868136 11037654 9482783 8175493 7084066 6177659 5427542 4808415 4298696 3878984
60960 3878984 3531112 3239199 2990677 2775856 2587391 2420427 2271985 2139410 2019993
60951 2019993 1912272 1816505 1733068 1661112 1599167 1545960 1499688 1457309 1415670 1373148 1329585
60940 1329585 1285195 1240426 1196488 1154855 1115975 1079080 1043316 1008599 975358 944017 914889
60929 914889 888217 864022 842028 821828 803092 785785 770248 756871 745511 735457 726148 717664
60917 717664 710226 703533 697013 690557 684576 679420 675188 672053 670270 669706 669737 669814 669943 670432 671344 672348
60901 672348 673034 673234 673023 672487 671586 670293 668729 666914 664367 660331 654586 647770 640625 633194 625133
60886 625133 616611 608373 600944 594156 587511 580598 573139 565117 557004 549486 542685 536015 529059 522267
60872 522267 516413 511582 507171 502804 498848 495883 493997 492836 492185 492237 493226 494973 497031 499260 502066
60857 502066 506005 511349 518159 526394 535490 544051 550612 554874 557735 560068 562090 564148 567294 572330
60843 572330 578624 584537 588797 590888 590433 587079 581086 573337 564610 555373 546275 538050 530725 523650
60829 523650 516701 510742 506446 503245 500091 496721 493460 490162 486272 481896 477969 475115 472899 470446
60815 470446 467339 463692 459682 455378 450887 446388 442000 437642 433031 427942 422597 417652 413622 410399
60801 410399 407513 404715 402060 399577 397249 395244 393783 392745 391767 390767 390000 389586 389336 389137 389155 389534
60785 389534 390228 391275 392937 395407 398553 401985 405051 406830 406756 405501 404759 405739 408093 410611 412578
60770 412578 414010 415012 415585 416026 416882 418329 419995 421525 423001 424676 426563 428460 430195 431655 432714
60755 432714 433299 433523 433621 433724 433684 433141 431835 429891 427785 426010 424835 424373 424722 425861 427449 428754 428854
60738 428854 427030 423261 418350 413319 408555 403786 398882 394267 390267 386560 382776 379328 377010 375860
60724 375860 375053 374034 373148 372947 373427 374287 375475 377002 378478 379380 379734 380141 381071 382373 383533 384157 384214
60707 384214 384008 383968 384336 385043 386001 387454 389810 393087 396734 400055 402672 404498 405548 405971 406164 406562
60691 406562 407287 408087 408601 408609 408125 407445 407068 407305 407880 408141 407816 407399 407585 408445 409446 410171 410731 411418 412291
60672 412291 413284 414509 416218 418517 421214 423849 425752 426247 425038 422416 418997 415304 411651 408209 404982
60657 404982 401804 398693 396181 395026 395488 397093 399103 401043 402754 404247 405705 407444 409706 412492
60643 412492 415610 418720 421265 422604 422341 420435 416991 412246 406880 401941 398131 395281 392808 390519
60629 390519 388678 387528 387220 388076 390316 393341 395805 396750 396487 396120 396401 397234 398156 398990 399969 401287 402590
60612 402590 403049 402137 400268 398442 397307 396926 397321 398670 400695 402455 403224 403271 403290 403372 403079 402341 401670 401512
60594 401512 401888 402727 404057 405733 407453 409151 410987 412850 414338 415413 416612 418304 420137 421601 422736
60579 422736 423852 424860 425436 425736 426362 427587 429125 430802 433049 436418 440920 446156 451963 458606 466335
60564 466335 475028 484404 494431 505368 517387 530120 542492 553011 560535 564950 567023 567366 565716
60551 565716 561585 555475 548868 542893 537588 532800 529197 527687 528199 529810 531960 534856 538683 543237
60537 543237 548657 555897 566040 579451 595811 614638 635471 657852 681254 704694 726364 744127
60525 744127 756565 763268 764148 759262 749602 737284 724244 711176 698137 685623 674344 664382 655399
60512 655399 647468 640960 635747 631225 627114 623634 620957 619060 618197 618930 621622 626325 633246 642931 655963
60497 655963 672814 693938 719646 749960 784897 824620 868823 916127 964700 1013403 1061797
60486 1061797 1109132 1154013 1195093 1231414 1261969 1285523 1301034 1307738 1304804 1291558 1268196 1235661
60474 1235661 1194737 1146067 1091353 1033745 976453 921321 869088 820482 776432 737526 703767
60463 703767 674786 650053 628993 611020 595262 580409 565452 550777 537931 527970 520416 514052
60451 514052 508143 502444 496609 490284 483652 477417 472304 468708 466544 465186 463846 462242 460617 459044
60437 459044 457300 455568 454536 454312 453916 452505 450557 449144 448500 448105 447806 447917 448330 448419 447890 447069 446261
60420 446261 445434 444614 444064 443942 444270 445222 446976 449218 451289 452946 454500 456144 457634 458775 459782 460916
60404 460916 462125 463257 464368 465662 467364 469714 472791 476218 479319 481711 483587 485383 487418 489881
60390 489881 492856 496227 499777 503471 507493 511913 516517 520954 524917 528253 531156 534187 537763 541609
60376 541609 545028 547727 550104 552678 555623 558943 562637 566469 569870 572423 574288 575957 577723 579540
60362 579540 581225 582584 583467 583961 584517 585703 587835 590941 594993 600027 606028 612920 620765 629896 640722
60347 640722 653380 667618 682892 698328 712512 723708 730698 733436 732602 728558 721098 710289 697176
60334 697176 683396 670360 658880 649192 640974 633557 626477 619782 613679 608104 602812 597595 592207
60321 592207 586443 580626 575720 572437 570402 568641 566804 565525 565684 567681 571343 576185 581838 588576
60307 588576 597357 609006 623437 639943 657930 676884 695854 713664 729641 743576 754934 762759
60295 762759 766517 766468 762976 755944 745209 731141 714615 696758 678878 662251 647563 634764 623649
60282 623649 614348 607009 601257 596272 591435 586755 582661 579341 576257 572516 567851 562993 558707 554696
60268 554696 549973 544232 538249 532920 528458 524676 521457 518685 516171 514003 512570 511999 511857 511625 511140
60253 511140 510443 509605 508930 508912 509667 510730 511644 512449 513364 514394 515506 516801 518212 519376 520104 520618 520994
60236 520994 520862 520050 519128 518778 518977 519305 519758 520598 521648 522486 523382 525305 528783 533216 537601 541582 545555
60219 545555 550028 555149 560764 566707 572998 579788 587160 595098 603664 613020 623160 633758 644472
60206 644472 655256 666234 677402 688600 699574 709929 719250 727520 735211 742673 749660 755742 760923
60193 760923 765405 768995 771293 772426 773006 773242 772565 770335 766577 761832 756599 751103 745311 738991 731941
60178 731941 724318 716585 709055 701719 694616 688071 682394 677549 673356 669840 667165 665357 664222 663428
60164 663428 662487 660882 658467 655613 652737 649817 646672 643602 641333 640224 639884 639689 639432 639234 639137 639107
60148 639107 639328 640083 641338 642697 643822 644662 645265 645692 646295 647774 650672 654984 660456 667082 674998 684014
60132 684014 693627 703446 713262 722737 731437 739275 746525 753203 758755 762590 764707 765653 766178 767113 769165
60117 769165 772348 775862 779028 782236 786408 791557 796482 800146 802848 805605 808686 811242 812295 811621
60103 811621 809558 806315 801812 796115 789773 783536 777714 771939 765737 759326 753645 749455 746605 744419
60089 744419 742558 741134 740060 738875 737436 736315 736064 736358 736342 735671 734711 733782 732717 731283 729553 727613
60073 727613 725258 722180 718194 713070 706497 698529 689824 681150 672823 664872 657516 651081 645497 640198
60059 640198 634581 628486 622299 616652 611870 607695 603776 600418 598352 597618 597315 596837 596813 598257 601255
60044 601255 605177 609774 615215 621302 627587 634251 641982 650783 659670 667703 674629 680275 684156 686093
60030 686093 686621 686316 685123 682710 679036 674306 668798 663019 657487 651963 645414 637165 627701 617944 608217
60015 608217 598377 588506 578830 569307 559925 551230 543989 538448 534387 531694 530307 529648 528775 527197 525228
60000 525228 523478 522292 521661 521352 521111 520971 521324 522438 523968 525235 526012 526816 528459 531478 535886 541242
59984 541242 547004 552937 559084 565242 570737 574931 577727 579337 579804 579083 577351 574922 571974 568717 565568
59969 565568 562751 559905 556527 552762 549398 547123 546156 546483 547994 550376 553213 556261 559347 562170 564583
59954 564583 567026 570125 573711 576639 577817 577235 575844 574648 574036 573788 573559 573309 573257 573436 573472 572929 571644
59937 571644 569555 566494 562520 558286 554631 551949 550297 549901 550946 552940 555002 556967 559701 564039
59923 564039 569888 576633 583867 591274 598148 603676 607646 610402 612155 612826 612703 612830 614367 617675 622232
59908 622232 627285 632307 636937 640926 644362 647605 650726 653180 654383 654411 653706 652266 649739 646451 643663
59893 643663 642447 642692 643615 644886 646873 650067 654719 660762 667660 674547 680979 687413 694563 702497 710815
59878 710815 719487 728809 738597 748098 756779 764649 771602 777084 780735 782913 784151 784385 783105 780116
59864 780116 775854 771013 766076 761072 755601 749208 741957 734597 727979 722307 717135 712060 707212 702988
59850 702988 699550 696894 695334 695483 697538 700942 705187 710754 718737 729367 741264 752166 760086 763941
59836 763941 763927 761718 759812 760031 762683 767183 772898 779032 784227 786983 786451 782680 776464 769189 762154
59821 762154 755485 748234 740069 732186 725705 719848 712899 704641 696585 689790 683782 677891 672420 667860
59807 667860 663896 659892 655765 651770 647925 644254 641193 639196 638157 637566 636965 635933 634024 631109 627580
59792 627580 623921 620294 616824 613977 612280 611773 611938 612078 611677 610648 609357 608220 607267 606317 605489 605141
59776 605141 605330 605835 606735 608383 610678 612987 615029 617262 620111 623437 627099 631438 636668 642211 647166
59761 647166 651180 654489 657540 660990 665650 671809 678883 686162 693671 701826 710644 719891 729733 740476
59747 740476 751737 762499 772105 780706 788720 796323 803533 810295 816313 821151 824656 827016 828321 828311
59733 828311 826742 823806 820126 816492 813600 811784 810821 810044 808799 806897 804718 802870 801635 800694 799533
59718 799533 797993 796171 793772 790094 784965 779375 774712 771508 769248 767259 765377 763819 762849 762679 763401
59703 763401 764847 766736 769042 772030 775807 780043 784247 788240 792175 796146 800030 803844 808063 813161
59689 813161 818737 823447 826159 827083 827428 828070 828918 829498 829660 829486 828850 827335 824462 819933 813873 806869
59673 806869 799543 792026 784095 775747 767273 758782 750215 741959 734891 729485 725355 722001 719578 718544
59659 718544 718920 720319 722427 725076 728173 732019 737374 744682 753370 762371 771190 779986 788754 796949
59645 796949 803914 809166 812207 812405 809257 802621 792807 780692 767595 754582 741846 729090 716561
59632 716561 705344 696434 689749 684258 679021 673947 669561 666104 662981 659153 653920 647215 639303 630618
59618 630618 621890 613914 606958 600707 594940 589829 585397 581220 577168 574004 572599 572744 573322 573618 573987
59603 573987 575171 577387 580118 582503 583917 584433 584700 585181 585674 585783 585623 585686 586213 587145 588489 590186 591721
59586 591721 592458 592443 592366 592571 592564 591672 589824 587497 585209 583253 581600 579820 577353 574100 570593 567453 564881
59569 564881 562766 561030 559593 558197 556601 554917 553537 552623 551878 550925 549830 549083 549040 549503 549935 549984 549675
59552 549675 549249 549049 549457 550593 552036 553200 554145 555726 558690 562848 567298 571326 575013 579296 585588
59537 585588 595019 607852 623950 643868 668597 697325 725711 747425 758001 757297 748639 736292
59525 736292 723686 712968 705176 700548 698882 699733 702330 705552 708279 709937 710646 710642 709486 706125 699997
59510 699997 691908 683295 674646 665171 654241 642564 631565 622025 613788 606429 599654 593216 586937
59497 586937 580882 575245 570245 566298 563956 563298 563672 564431 565698 567931 570956 573951 576290 578017 579618
59482 579618 581727 584883 589124 593830 598304 602362 606135 609663 613096 616889 621196 625331 628498 630832
59468 630832 633070 635366 637172 638226 638859 639300 639439 639402 639659 640345 641108 641880 643241 645811 649762 655108
59452 655108 661940 670133 679187 688540 697620 705622 711833 716400 720262 724031 727304 729109 728587 725148
59438 725148 718665 709842 699986 690159 680863 672536 665663 660192 655452 651051 647392 645053 644092 644277 645494
59423 645494 647644 650673 654987 661378 670169 680967 693506 708131 725019 743552 763076 783794
59411 783794 806460 831746 860358 892717 927028 957826 977954 982957 973676 954962 932649 911545
59399 911545 894905 884598 881697 887022 900580 919881 939141 951224 951314 939230 918558 893933
59387 893933 869061 846410 827429 812402 800502 790781 783205 778380 776315 775951 776060 776267 777063 779074
59373 779074 782373 786264 789694 792131 793977 795802 797326 797706 796734 795071 793280 791410 789813 789465 790897
59358 790897 793422 796072 798814 802270 806689 811982 818430 826574 836505 847891 860629 874877 890493
59345 890493 907014 924127 941719 959535 977366 995474 1014164 1032887 1050271 1065155 1077125
59334 1077125 1086032 1091641 1093952 1093270 1089724 1083177 1073879 1062654 1050076 1035883 1019698 1001990 983837
59321 983837 965982 948631 932040 916672 902697 889791 877626 866190 855415 844846 834002
59310 834002 822853 811625 800279 788657 777172 766832 758286 751147 744621 738611 733841 731014 730399
59297 730399 732251 737111 745367 756941 771689 789661 810127 830253 845428 851589 847504 834965
59285 834965 817128 796858 776316 757269 741144 728670 719719 713748 710355 709416 710836 714391 719925
59272 719925 727606 737874 751042 766879 784605 803318 822360 841224 859248 875685 890073 902247
59260 902247 911908 918500 921648 921404 917910 911229 901868 891133 880376 870043 859877 849973 841021
59247 841021 833484 827080 821318 816144 811828 808494 806088 804683 804679 806673 810998 817247 824361 831533 838927
59232 838927 847163 856091 864465 870894 874752 876106 875182 872122 866970 859684 850367 839630 828458 817521
59218 817521 806757 795751 784416 773252 763051 754312 746834 739962 733361 727293 721889 716599 710909
59205 710909 705379 701166 698515 696462 694240 692264 691372 691655 692460 693213 693878 694864 696687 699497 702810 706047
59189 706047 709390 713704 719515 726581 734552 743386 752849 762245 771112 779715 788352 796606 803762 809643
59175 809643 814567 818744 822148 824743 826423 826947 826330 825166 824213 823783 823743 823936 824340 824969 825773 826481 826508
59158 826508 825354 823124 820242 816583 811437 804461 796013 786359 775304 763127 751157 740695 731736
59145 731736 723335 714829 706111 697149 687950 678791 669930 661309 653010 645603 639476 634206 629267 625033
59131 625033 622270 620921 620220 619922 620560 622410 625011 627910 631230 635236 639875 645049 651011 658244 667112
59116 667112 677711 689854 703166 717385 732499 748430 764756 780968 796720 811479 824330
59105 824330 834755 843432 851627 859721 866856 872012 874862 875527 874113 870797 866032 860320 853960 847117
59091 847117 839996 832941 826520 821472 818301 816896 816705 817152 817683 817537 815888 812306 806921 800112 792171
59076 792171 783204 773293 762841 752724 743788 736098 729037 722280 716190 711035 706400 701837 697556 693797
59062 693797 689985 685308 679946 674916 670719 666824 662561 657936 653407 649337 645802 642589 639360 636140
59048 636140 633556 632190 631797 631647 631552 632004 633242 634721 635712 636029 635988 635897 635770 635438 634908 634657 635339 637051
59030 637051 639181 641245 643589 646925 651604 657792 666003 676686 689511 703759 719376 736955 756561
59017 756561 777160 797206 815240 829913 840195 845980 848058 847177 843396 836589 827377 817324 808223
59004 808223 801124 795917 791891 788718 786755 786452 787922 791277 796698 803681 810611 815754 818469 819131 818320
58989 818320 816642 814768 812871 810308 806592 802276 798120 793838 788763 783432 779288 776836 775359 774598
58975 774598 775459 778588 783344 788858 795303 803495 813788 825910 839346 853384 867239 880633 893956
58962 893956 907559 921163 934220 946433 957629 967441 975385 981014 983841 983387 979364 971534 959535
58949 959535 943451 924602 905104 886377 868510 851173 834554 819166 805296 793010 782299
58938 782299 772984 764842 758020 752971 749778 747925 746887 746585 747073 748143 749423 750583 751330 751456 750909
58923 750909 749613 747360 744220 740847 737824 734892 731417 727453 723664 720280 716984 713872 711685 710865
58909 710865 711054 711727 712748 714239 716544 720392 726358 734110 742948 753116 765704 781040 798088 815634
58895 815634 833119 850012 865466 879280 892422 906032 920533 936159 953507 972855 993583
58884 993583 1014910 1036629 1058539 1079696 1098931 1115646 1129568 1140201 1147152 1150666 1151232 1148950
58872 1148950 1143742 1135835 1125651 1113498 1099852 1085641 1071897 1059322 1048316 1038969 1030770 1022856
58860 1022856 1014791 1006670 998327 989082 978573 967165 955213 942624 929538 916712 904751 893533
58848 893533 882906 873231 864725 856875 849106 841400 833695 825295 815540 804499 792407 779130 764928
58835 764928 751116 738977 728425 718561 709206 700954 694033 688112 683179 679710 677806 676883 676375 676305
58821 676305 676908 678057 679197 679824 680095 680977 683444 687405 691821 695971 700032 704165 707787 710344 712260
58806 712260 714366 716705 718532 719382 719557 719574 719523 718990 717485 715054 712417 710120 707609 703704 698071 691484
58790 691484 684561 677190 669644 663345 659748 659015 660360 663133 666994 671594 676809 682934 690172 698376
58776 698376 707618 718244 729743 740255 747957 752441 754140 753052 748888 742012 733389 723854 714000
58763 714000 704351 695054 685783 676508 667954 660863 655388 651699 650372 651457 653853 656387 658881 661435
58749 661435 663473 664451 664791 665071 664977 664205 663812 665384 669171 674238 680160 687372 695978 705354 714906 724293
58733 724293 733051 740975 748718 757041 765627 773483 780299 786433 791803 795947 799118 802194 805360 807846
58719 807846 809153 809754 810508 812128 815238 820183 826662 834174 842752 852617 863140 872833 880319 884847
58705 884847 886130 884366 880201 873983 865244 853402 838547 821000 800788 778453 755682 734014
58693 734014 713417 693287 674352 658179 645136 634179 624493 616016 608471 601330 594777 589363 584610
58680 584610 579299 573279 567677 563111 558989 554900 551420 549145 548024 548036 549459 552057 555048 558266 562419
58665 562419 567919 574494 582232 591882 603558 616077 628001 638390 646209 650148 649863 646623 642106
58652 642106 637079 631602 625731 619476 612685 605403 597933 590325 582452 574670 567605 561135 554497 547735
58638 547735 542078 538404 536142 534249 532565 531573 531439 531829 532332 532624 532531 532197 531954 531959 532290 533212 534787 536425
58620 536425 537589 538727 540658 543180 545344 547105 549548 553304 557879 562770 568100 573706 578688 582418
58606 582418 585166 587262 588485 588710 588388 587900 587175 586322 585937 586545 588555 592938 600833 611994 624455
58591 624455 636184 646337 654809 661773 668217 675703 684747 694314 703589 713315 724581 737193 750219
58578 750219 763377 776781 789782 801151 810336 817804 824234 829972 835159 840055 845307 852142 861971
58565 861971 875583 892911 913668 937774 965160 995704 1029474 1066430 1105607 1145007 1182304
58554 1182304 1215237 1241498 1259275 1268253 1269584 1264844 1255600 1243806 1231493 1219736 1208638 1198422
58542 1198422 1189598 1181836 1173539 1162879 1148592 1129743 1105748 1077033 1044991 1011177 977185 945061
58530 945061 916540 891625 869030 848254 830192 815560 803940 794691 787552 781954 776912 772109
58518 772109 768039 764690 761258 757518 754274 751913 749738 747236 744802 742659 740231 737256 734393 732109
58504 732109 730061 728125 726867 726408 726015 725379 725064 725137 724765 723865 723685 724873 726359 727142 727874 729654 732481
58487 732481 736030 740732 746907 753952 761610 771042 783456 798549 815414 834083 855083 878319 903401
58474 903401 930113 957424 982870 1003958 1019486 1028728 1030552 1024522 1012025 995214 975711 955191
58462 955191 936008 919960 907257 897793 892344 891385 893858 898594 906025 917112 931441 947747 965444
58449 965444 984133 1002262 1017678 1029022 1035430 1035696 1029150 1016847 1000655 981762 961187 940865
58437 940865 922748 907337 894310 883983 876898 872587 870044 868899 869069 869936 871193 873902 879510 888331
58423 888331 900023 914649 931887 949844 966068 979308 989180 994898 995680 991941 984810 975018 963322
58410 963322 951250 940088 929648 919145 908599 898308 887897 877297 867853 861043 856724 853903
58398 853903 852437 852563 853601 854704 856305 859332 863553 868013 872500 877251 881807 885435 888021 889443
58384 889443 889025 886907 884890 884364 884381 883315 881455 880297 880306 881245 883886 889379 897395 906564 916212 926237
58368 926237 936161 945933 956775 969521 983074 996225 1009922 1025759 1043302 1061067 1079159 1098528
58356 1098528 1118274 1136121 1151108 1163655 1173502 1179870 1183276 1185003 1185159 1183349 1180782 1179465 1179654
58343 1179654 1180200 1181014 1183099 1186561 1190839 1196557 1204980 1215875 1228012 1241386 1256862 1274063 1291810
58330 1291810 1310249 1330300 1351370 1371738 1390827 1408878 1424862 1437024 1445234 1450653 1453556 1453698
58318 1453698 1452290 1451185 1450554 1449668 1449426 1451659 1456404 1462310 1469223 1477952 1488131 1498948 1511348 1526747
58304 1526747 1544103 1561025 1577273 1594398 1612563 1630654 1648944 1668592 1688884 1708042 1726260
58293 1726260 1744961 1763634 1780647 1796639 1813745 1831995 1849972 1868616 1890588 1916060 1942768
58282 1942768 1970131 1999618 2031095 2062574 2093728 2126124 2159866 2193439 2226863 2261508 2297032
58271 2297032 2332029 2367352 2405074 2444723 2484572 2526062 2572542 2624066 2678048 2734677 2796743
58260 2796743 2864184 2933846 3004871 3079321 3157238 3236094 3315377 3396567 3478333 3557136 3633115
58249 3633115 3710156 3789788 3870419 3952883 4040878 4135279 4233895 4337414 4449585 4570863 4698057
58238 4698057 4830971 4973106 5125169 5284554 5451941 5631418 5823240 6023844 6234094
58229 6234094 6459977 6703853 6962762 7236681 7530619 7847182 8185186 8546940 8938485
58220 8938485 9361510 9814048 10300232 10829907 11407764 12033347 12712684 13458495 14277815
58211 14277815 15172164 16151878 17237476 18445438 19787347 21285492 22974445 24885778
58203 24885778 27049071 29511660 32340800 35606891 39389153 43805247 49019291 55229629
58195 55229629 62690347 71762911 82932408 96792672 114075432 135704475 162757090
58188 162757090 196306404 237167681 285341718 338906496 392848321 439219001 469546741
58181 469546741 478448533 465928877 436772502 397866537 355594558 314569829 277447032
58174 277447032 245117365 217108304 192280090 169605158 148606806 129309837 111936883
58167 111936883 96647552 83437844 72164851 62617910 54572236 47806802 42111402
58160 42111402 37301594 33226996 29761900 26796616 24242878 22036947 20127998 18467741
58152 18467741 17014099 15735335 14603592 13590538 12673858 11840939 11081272 10381567 9732392
58143 9732392 9132595 8582164 8076448 7611158 7186636 6802549 6453754 6135371 5846709
58134 5846709 5586362 5348285 5125971 4915788 4713691 4514313 4316673 4125725 3945166
58125 3945166 3773517 3609815 3457293 3317778 3187593 3062834 2944314 2833952 2730750
58116 2730750 2633838 2545174 2465651 2392400 2323190 2259601 2202614 2148952 2095221 2042173 1991683
58105 1991683 1942988 1895107 1849546 1807243 1765766 1722621 1678513 1634677 1590136 1544457 1500096
58094 1500096 1458952 1419501 1380264 1343183 1310428 1280602 1251433 1223874 1200316 1180697 1163296
58083 1163296 1147490 1133019 1118315 1102114 1085105 1067843 1048941 1027413 1004783 982693 960511
58072 960511 937410 914653 893549 873271 853026 834276 818433 804367 790646 778263 768609 760640
58060 760640 752677 745342 740061 736041 731277 725279 718450 710044 699233 687160 675727 665189 654913
58047 654913 645457 637852 631719 625956 620505 615823 611548 607159 602958 599055 594555 589050 583510 578328
58033 578328 572031 563561 554342 546327 539301 531750 523073 513330 502218 490028 478357 468235 458839
58020 458839 449502 441460 435920 431948 428115 424720 422419 420161 416613 412384 408774 405551 402075 399381
58006 399381 398813 399515 399544 398741 398423 398965 399803 401209 403955 407656 411300 414934 419122 423291 426359 428396
57990 428396 429939 430294 428393 424897 421599 419020 416274 412908 409273 405306 400554 395266 390167 385332
57976 385332 380436 375692 371475 367599 364024 361586 360841 360948 360845 360669 360859 360923 360556 360832 362598 364642
57960 364642 365251 364764 364716 365198 365013 363864 362426 360674 358033 354908 352273 350022 347457 345100 344247 344908
57944 344908 345917 346945 348736 351503 354751 358625 363839 370313 377381 385309 395043 406526 418723 431278
57930 431278 444595 458207 470530 480387 487508 491483 491667 488314 482564 475070 465666 454466 442259
57917 442259 429769 417368 405432 394154 383273 372865 363978 357472 352805 349052 346506 345911 346724
57904 346724 347626 348273 348976 349126 347723 345179 342846 340860 338258 335266 333572 334002 335539 337148 339148
57889 339148 342372 347160 353545 361293 369438 376795 383109 388825 393798 397331 399381 400546 400905 400065 398189
57874 398189 395721 392231 386964 380465 374237 368848 363835 359371 356310 354475 352712 351015 350872 352904
57860 352904 355720 357801 359194 360723 362799 365659 369626 374458 379453 384695 391098 398759 406396 412914
57846 412914 418348 422726 425289 425661 424754 423549 421781 418671 414370 409946 406299 403580 401365 399086 396644
57831 396644 394610 393446 392726 391821 391015 390972 391364 391226 390579 390364 390733 390799 390248 389775 389529 388526 386184 383209
57813 383209 380386 377630 374864 372723 371702 371366 370816 368998 364389 355710 343569 330306 317653 305616
57799 305616 294022 283668 275128 267707 260682 254566 250117 247006 244491 242639 241912 242219 243273 245264
57785 245264 248249 251489 254260 256801 259707 262907 266153 270040 275714 283916 295063 309835 328693
57772 328693 350772 373779 395031 412430 424855 432142 434726 433237 428659 422545 416264 409845 402341
57759 402341 393535 384568 376629 369861 363848 358398 353448 348987 345442 343413 342688 342375 342349 343609 346748
57744 346748 351051 355609 360343 365279 369818 373553 376950 380323 382838 383418 382014 379259 375532 371202
57730 371202 367110 363859 361051 358038 355064 352919 351890 351740 352261 353204 354077 354698 355519 356825 358088 358682
57714 358682 358676 358347 357475 355953 354504 353977 354250 354477 354069 352828 350632 347727 344966 343030 341660 340165
57698 340165 338264 335966 333152 329925 326851 324228 321633 318754 316013 313660 310980 307329 303394 300415
57684 300415 298581 297151 295803 294908 294822 295863 298724 303936 311097 319528 329516 342146 358238 378454
57670 378454 404243 437620 480133 533127 598999 680689 778700 888148 998031 1092831 1156211
57659 1156211 1176551 1151798 1089879 1004168 907875 811120 720732 640671 572249 514786 466924
57648 466924 427666 396344 371843 352447 336788 324637 316154 310506 306091 302227 299678 299050 299482
57635 299482 299582 299008 298387 298153 298210 298352 298330 297797 296758 295758 295123 294466 293515 292765 292566 292143 290424 287467
57617 287467 284145 280784 277132 273399 270296 268073 266402 265161 264418 263729 262375 260416 258683 257636 256935
57602 256935 256229 255587 255033 254385 253684 253121 252414 250979 248891 247013 245873 244964 243459 241160 238436 235652
57586 235652 232973 230512 228425 226860 225843 225122 224351 223588 223340 223827 224493 224555 223795 222436 220620 218471
57570 218471 216282 214116 211543 208344 205127 202620 200681 198743 196914 195742 195106 194267 193103 192456 193056
57555 193056 194728 196772 198581 199829 200616 201513 203045 205186 207815 211359 216246 221794 226451 229227 230344
57540 230344 230464 230029 229436 229162 229391 229864 230152 229769 228201 225360 221890 218437 214758 210147 204627 198981
57524 198981 193685 188594 183694 179424 176067 173457 171400 169874 168796 168170 168382 169729 171669 173223 174081
57509 174081 174640 175016 174830 174063 173286 172854 172486 171793 170629 168915 166824 165083 164291 163895 162679 160314 157611
57492 157611 155268 153430 152567 153559 156390 159813 162841 165631 168395 170487 171425 171973 173248 175295 177388
57477 177388 179286 181329 183550 185534 187015 187981 188237 187397 185332 182304 178747 175143 171917 169144 166567
57462 166567 164122 162239 161385 161531 162304 163451 164913 166605 168335 169835 170859 171458 172086 173069 173947 173793
57446 173793 172299 170165 168324 167172 166622 166445 166368 166302 166570 167511 168784 169604 169801 170124 171269 173103 175080
57429 175080 176961 178839 180791 182804 184815 186761 188784 191230 194004 196098 196441 195192 193527 192173
57415 192173 190934 189672 188783 188445 188304 188281 188856 190146 191548 192779 194387 196625 198600 199293 198789 197725
57399 197725 196054 193236 189361 185350 182182 180395 180063 180722 181584 182212 182766 183342 183594 183443 183563 184560 186175
57382 186175 187949 190231 193738 198322 202939 206716 209493 211455 212816 213820 214537 214655 213882 212472 210972
57367 210972 209592 208213 206853 205766 205102 204802 204755 204808 204801 204791 204981 205253 205080 204269 203452 203443 204339 205587 206730
57348 206730 207703 208620 209632 210850 212120 213092 213734 214447 215410 216172 216359 216423 217118 218365 219179 218738 217199
57331 217199 215435 214231 213728 213444 212787 211632 210328 209234 208415 207764 207055 205948 204330 202641 201386 200299
57315 200299 198623 196312 194311 193422 193514 194107 195047 196235 197322 198124 198807 199375 199614 199869 201054 203310 205418
57298 205418 206241 206145 206286 207072 208135 209302 210676 212096 213407 215050 217594 220851 224134 227207 230331
57283 230331 233608 236981 240719 245156 250000 254617 258956 263545 268565 273542 278094 282439 286986 291764
57269 291764 296360 300208 302924 304516 305220 305172 304516 303835 303886 304644 305214 305046 304687 304893 305561 306126 306515 307075
57251 307075 307896 308832 309831 310745 311226 311386 312118 314123 317025 320014 322898 325872 328752 331240 333546 335964
57235 335964 338188 339869 341515 343981 347354 351171 355504 360945 367664 375183 382978 390699 398134 405660
57221 405660 414279 424378 434815 444117 452181 459851 467316 474191 480913 488601 497438 506399 514905 523661
57207 523661 533566 544690 556596 568857 581018 592820 604707 617456 631192 645402 659923 675069
57195 675069 690716 706111 720775 734833 748317 760956 772877 784814 797315 810364 823911
57184 823911 838152 853153 868812 885256 902689 920810 939009 957078 975118 992787 1009512
57173 1009512 1025402 1041195 1057238 1073262 1089127 1105014 1120878 1136503 1152052 1167788 1183400
57162 1183400 1198522 1213760 1230137 1247621 1265313 1283043 1301515 1320828 1340243 1359708 1380261
57151 1380261 1402429 1425463 1448809 1473261 1499986 1529280 1560767 1593923 1627912 1661858 1695860
57140 1695860 1730973 1767771 1805838 1845059 1886278 1930060 1975843 2023074 2072232 2123879 2177499
57129 2177499 2232274 2288591 2347925 2411560 2480052 2553742 2633331 2720306 2817518 2929619 3062238
57118 3062238 3218651 3394368 3574243 3738453 3876276 3995414 4116024 4254823 4415531
57109 4415531 4592539 4779096 4970752 5165678 5366444 5581385 5822160 6100142 6425577
57100 6425577 6808269 7257404 7782581 8397754 9124143 9988470 11019881 12249901 13712916
57091 13712916 15442697 17467048 19805376 22468279 25455462 28752917 32332242 36150505
57083 36150505 40148923 44253767 48379805 52425579 56253743 59673420 62454142 64377361
57075 64377361 65295932 65165651 64038727 62033735 59300885 55995202 52264141 48248070
57067 48248070 44083396 39899162 35808538 31902841 28250622 24898371 21870915 19173436
57059 19173436 16796063 14718929 12916074 11358588 10017355 8864670 7874676 7023646
57051 7023646 6290543 5657442 5109424 4634096 4220866 3860342 3544364 3266406 3021396
57042 3021396 2804860 2612495 2440642 2286638 2148337 2023576 1910316 1807016 1712656 1626734
57032 1626734 1549354 1480880 1421198 1369563 1325312 1288437 1259463 1239207 1228783 1229480 1242911 1271832
57020 1271832 1319924 1387900 1467671 1541032 1586618 1590268 1550350 1475293 1377718 1270009 1162100
57009 1162100 1060386 967722 884720 811248 746922 690909 642117 599754 563397 532499 506163
56998 506163 483546 464203 447772 433495 420403 408004 396568 386746 379066 373728 370552 369113
56986 369113 369318 372044 378896 390990 407894 427497 446355 460321 465880 461855 449757 432180 411167
56973 411167 388283 365367 344111 325092 308138 293619 282598 275582 271945 270849 272198 276452
56961 276452 284070 295484 311277 332047 358182 389491 424296 458568 486571 503158 505957 495879
56949 495879 476201 451148 424464 398454 374148 352257 333656 318898 307789 299810 294734 292632
56937 292632 293600 297844 305919 318601 336574 360399 390609 427337 469303 512664 550788 575909
56925 575909 582342 569179 540301 501841 459467 417258 377889 342914 312863 287520 266374 248898
56913 248898 234530 222596 212336 203130 194800 187633 181974 177716 174284 171118 168092 165406 163148
56900 163148 161042 158763 156581 155607 157116 161490 167962 175453 183558 192775 204074 218326 235883 256642
56886 256642 280622 308273 339433 371725 400554 421258 431188 429938 418641 399820 377222 354507
56874 354507 333756 315561 300289 288633 281095 277697 278374 283225 292351 305901 324424 348963 380895
56861 380895 421895 473702 537033 609993 687010 758882 814346 843634 842809 815599 770751 717353
56849 717353 662190 609938 563777 525256 494508 471304 455693 447692 447142 454325 470363 496739
56837 496739 534740 585559 650724 732148 831323 947171 1072959 1194596 1293009 1350471 1357441
56826 1357441 1315985 1238054 1139802 1035383 933917 840420 757893 687900 630291 584028 548588
56815 548588 524016 509924 505439 510288 525270 551632 590642 643714 711881 794136 885666 976857
56803 976857 1053851 1101946 1111470 1082244 1022647 944448 858337 772481 692357 620636 558042 505064
56791 505064 462429 429876 405607 387568 374802 367376 365886 371452 385415 408507 440676 481458
56779 481458 529140 578753 621851 649559 656394 641824 609523 565669 516753 467477 420229 376304
56767 376304 336907 302765 273692 249185 228977 212651 199355 188337 179247 171605 164723 158560
56755 158560 153832 150678 147985 144736 141368 138931 137429 135886 133726 131328 129342 128082 127475 127135 126643
56740 126643 126075 125966 126379 126440 125238 122906 120399 118567 117782 118041 118898 119606 119808 119919 120476 121427 122367 123123
56722 123123 123778 124457 125394 126813 128437 129534 129799 129804 130286 131411 132917 134433 135357 135158 134222 133775 134398
56705 134398 135272 135460 135367 136153 138113 140322 141626 141441 139887 137678 135697 134236 132862 131245 129646 128347
56689 128347 127233 126288 125863 125976 126050 125888 126162 127294 128597 129390 130217 132010 134606 137199 139803 143092
56673 143092 146978 150522 153289 155753 158228 160186 160923 160286 158610 156398 154128 151958 149621 146979 144520
56658 144520 142934 142391 142527 142791 142439 140787 138115 135863 135118 135274 134986 134037 133186 132460 130894 128215 125667
56641 125667 124615 125045 125926 126496 126707 126837 127221 128227 130086 132678 135677 138867 142213 145590 148512 150389
56625 150389 151224 151801 152816 153953 154329 153765 152964 152400 151835 151159 150844 151092 151310 150973 150383 150054 149990 150129
56607 150129 150758 151790 152305 151651 150446 149670 149299 148715 147879 147113 146165 144611 142952 142262 142823 143962 145152
56590 145152 146439 147866 149337 150992 152984 154895 156090 156605 157034 157629 158133 158382 158479 158479 158486 158815 159515 160049
56572 160049 160132 160489 161981 164315 166490 168258 170227 172694 175386 178345 182176 187369 194105 202738 213716
56557 213716 226979 241947 257857 273446 286606 295365 299219 298898 295135 288549 280463 272621 265926
56544 265926 260208 255167 250739 246621 242432 238420 235170 232593 229995 227131 224346 221772 219246 217017
56530 217017 215567 214717 213790 212634 211571 210411 208584 206295 204422 203117 201638 199789 198350 197694 197098
56515 197098 195966 194801 194296 194146 193418 191624 189024 186288 184145 182878 181965 180608 178747 177109 176325
56500 176325 176464 177306 178387 178932 178569 178055 178465 179695 180592 180524 179918 179370 179212 179909 181707 183739 184665 184469
56482 184469 184534 185646 187047 187871 188370 189123 190001 190588 190892 191068 191051 190903 190914 191049 190955 190714 190873 191492 191982
56463 191982 192113 192327 192774 192969 192713 192400 192066 191120 189464 187971 187302 187165 187228 187856 189267 190778 191642 192021
56445 192021 192577 193628 195231 197389 199705 201416 202217 202510 202533 202023 201094 200603 201036 201756 201884 201371 200738
56428 200738 200376 200514 201151 201594 200835 198895 197139 196731 197450 198500 199729 201408 203444 205451 207184 208522
56412 208522 209516 210694 212634 214887 216079 215500 213849 212043 210142 207904 205527 203155 200383 196920 193184
56397 193184 189726 186701 184279 182828 182139 181266 179731 178260 177825 178683 180784 184214 188591 192861 196484
56382 196484 200110 204447 209112 213295 216841 219892 222185 223500 224255 224842 224850 223676 221514 219103 216884
56367 216884 214954 213385 212041 210499 208644 206939 205698 204572 203137 201564 200546 201209 205190 213792
56353 213792 226572 241483 256602 270897 283241 292211 297575 300733 302877 303788 303184 301959 300998 299874
56339 299874 297945 295894 294957 295306 296335 297861 299950 302174 304140 306264 308992 311760 313747 315143 316688
56324 316688 318502 320359 322693 326190 330616 334906 338180 340017 340206 339030 337444 336224 335265 334219 333294
56309 333294 332815 332660 332740 333316 334200 334471 333815 333316 334056 335738 337674 340283 344410 349798 355401 360684 365585
56292 365585 369804 373290 376905 381476 386585 391391 396161 401812 408273 414528 420105 425509 431352 437961
56278 437961 445682 454681 464490 474345 483789 492529 500275 507420 515258 524778 535652 547026 558771
56265 558771 571335 585009 600016 616655 634792 653989 674723 698470 725918 756310 789464
56254 789464 827146 871218 921653 977774 1040268 1110386 1188119 1273002 1365979 1468656 1581086
56243 1581086 1701855 1829757 1963608 2100705 2237282 2370474 2498357 2618125 2725788
56234 2725788 2817813 2891883 2946116 2978856 2989403 2978010 2945253 2892375 2822137 2738328 2644402
56223 2644402 2543140 2437118 2328571 2219113 2110336 2004094 1901417 1801943 1705453 1613218
56213 1613218 1526717 1445878 1369830 1298601 1232623 1171271 1113432 1059055 1008718 962163 918693
56202 918693 878538 842406 810041 780571 753872 730273 709408 690644 674135 660108 647655
56191 647655 635673 624439 614809 606412 598140 589999 583008 577677 573856 571521 570360 569245 567542 566228
56177 566228 566295 566948 566994 567068 568576 571263 573835 576255 579311 582564 584971 587124 590602 595366 599941 604055
56161 604055 609016 615638 623756 633631 645699 658987 671837 684255 697705 712690 728480 745254
56149 745254 764498 787186 813303 843244 878043 918343 964864 1019835 1086410 1166805 1262345
56138 1262345 1374491 1503720 1647559 1801236 1959489 2115952 2262093 2389952 2496415
56129 2496415 2583403 2654931 2716074 2773077 2830125 2885086 2930771 2960892 2973316 2968851 2950407
56118 2950407 2923425 2893664 2862982 2828416 2784862 2726598 2647444 2543396 2416264 2272832 2120626
56107 2120626 1966557 1818321 1683006 1563521 1459004 1368801 1293200 1230607 1177679 1132836
56097 1132836 1096538 1067758 1043534 1022610 1006246 994686 985925 978692 973546 970250 967171 964256
56085 964256 963558 965766 968918 971480 974106 977600 981829 987236 994728 1003473 1011501 1018852 1027422 1037525
56071 1037525 1047664 1057816 1069595 1082993 1096449 1110420 1127169 1146610 1166202 1185396 1206164
56060 1206164 1228492 1249618 1268658 1287749 1307561 1325868 1341833 1357487 1373554 1387947 1399845
56049 1399845 1411170 1422707 1433073 1442956 1455871 1472882 1490987 1508613 1528306 1551929 1577564
56038 1577564 1603469 1630841 1660345 1689879 1718086 1746269 1774887 1802241 1828559 1857182 1889663
56027 1889663 1923892 1958909 1996999 2039018 2082297 2125383 2170213 2217490 2264807 2311607 2361105
56016 2361105 2415052 2471686 2531029 2596595 2669164 2744438 2819751 2897627 2979898 3064093 3148793
56005 3148793 3236775 3329594 3424758 3521486 3623459 3732681 3846641 3964674 4090787 4227003
55995 4227003 4370515 4520678 4681762 4855364 5037560 5227226 5429472 5647140 5877186
55986 5877186 6119570 6380978 6665237 6969007 7291589 7639571 8016982 8421084 8853207
55977 8853207 9323048 9836637 10391544 10990194 11645727 12368077 13157587 14020124 14974898
55968 14974898 16039461 17222229 18539273 20023238 21706587 23613863 25782052 28271491
55960 28271491 31147905 34478131 38360981 42945833 48416971 54999132 63007922 72879018
55952 72879018 85149979 100472866 119679059 143779889 173837745 210754732 254850289
55945 254850289 304915251 356960902 403879670 437226716 450634651 442588915 416583502
55938 416583502 378877797 335794476 292159829 251026909 213999562 181661025 153976509
55931 153976509 130605826 111069480 94823835 81334070 70134474 60830632 53076074
55924 53076074 46577393 41107916 36489486 32565642 29204620 26311411 23814374 21645732
55916 21645732 19746979 18080588 16619074 15329332 14179616 13152370 12236588 11414646
55908 11414646 10668325 9990227 9377334 8819373 8304046 7827681 7390555 6987175 6610494
55899 6610494 6260381 5938784 5641255 5361562 5099980 4859084 4635856 4425496 4228554
55890 4228554 4046922 3877045 3714317 3560248 3418345 3286682 3161219 3042887 2934911
55881 2934911 2836433 2744960 2661988 2590256 2528228 2472584 2422962 2378862 2335094 2285928 2231239
55870 2231239 2173719 2113036 2047740 1980069 1913729 1849235 1785935 1725947 1671545 1621202 1572585
55859 1572585 1526802 1485413 1446114 1405917 1365984 1328887 1293759 1258711 1225447 1196641 1170804
55848 1170804 1144337 1116857 1090199 1064125 1037375 1011304 988180 967298 946577 926400 908111
55837 908111 890468 871464 852079 834433 817781 800208 782763 767978 755469 742852 730053
55826 730053 719090 710411 702773 695891 690102 684193 676483 667242 657582 647155 635484 624077 614470
55813 614470 605681 596335 587659 581477 576814 571596 566295 562794 561049 560037 560676 564590 571041 578177
55799 578177 586320 596934 609312 621172 631579 640391 645870 645984 641434 634616 626268 615722 603515
55786 603515 591051 578510 565722 554267 546048 540555 535835 531008 525345 516433 502483 485645 470014
55773 470014 457041 445613 435593 428075 422809 418601 416013 416769 420655 425564 430188 434159 436121 434537
55759 434537 430183 425285 420463 414909 408950 403684 398390 391138 381898 372491 363616 354374 344661 335577
55745 335577 327435 319592 312119 305543 299201 292065 284912 279403 275343 271166 266846 263918 262738 262038
55731 262038 261167 260570 260147 259238 258102 257361 256222 253360 249195 245195 241347 236615 231465 227431 224472
55716 224472 221250 217901 216012 215908 216437 217396 219682 223013 226018 228796 232871 238352 243514 247466 250908
55701 250908 253888 255190 254393 252389 249474 245027 239405 234012 229147 223884 218362 213983 211068 208575
55687 208575 206474 205986 206942 207462 207096 207936 211515 216647 221520 226114 231352 237341 243458 248982 252916
55672 252916 254440 254053 253075 251788 249479 246424 244055 242850 241824 240471 239400 238658 237331 235468 234528
55657 234528 235191 236418 237428 238947 241724 245326 249152 253196 257132 260032 261590 262299 261974 259603 255153
55642 255153 249929 244587 238393 231027 223523 216723 210342 204204 198881 194442 190045 185493 181662 178803
55628 178803 175981 172922 170764 170077 169731 168707 167570 167114 166869 166041 164732 163247 161238 158519 155776
55613 155776 153650 151914 150184 148452 146470 143694 140356 137484 135406 133422 131312 129800 129064 128259 127160
55598 127160 126760 127541 128536 128866 128816 128645 127784 126096 124532 123577 122386 120388 118449 117432 116851 115948 114892
55581 114892 113949 112642 110772 109174 108450 108013 107265 106579 106239 105679 104790 104745 106333 108663 110706 112953 116216
55564 116216 119830 122510 124217 125799 127378 128358 128527 128061 126887 125005 122931 121067 119213 117370 116180
55549 116180 115823 115402 114292 113121 112452 111515 109392 106572 104123 102121 100204 98995 99670 102624 107793
55534 107793 115761 127187 141352 156370 170636 183180 193044 199432 202377 202417 199898 195345 190062
55521 190062 185266 180836 175762 169719 163412 157579 152442 148036 144337 141094 138046 135266 132996 131334
55507 131334 130387 130391 131380 133121 135603 139058 143273 147459 151042 153906 155692 155766 154193 151795 148865 144904
55491 144904 140150 136069 133457 131122 127514 122773 118180 114429 111533 109652 108815 108345 107682 107347 108080
55476 108080 109509 110639 111249 111822 112504 113099 113729 114517 114893 114123 112360 110404 108683 107186 106040 105399
55460 105399 104986 104466 104014 103908 103903 103549 102811 101895 100938 100354 100827 102305 103636 103941 103791 104268 105450 106637
55442 106637 107506 108170 108563 108602 108586 108706 108592 108052 107695 108035 108496 108164 107116 106194 105841 105867 105940 105663 104642
55423 104642 103164 102240 102315 102629 102572 102780 103904 105094 105001 103822 103118 103844 105524 107118 107777 107101 105554
55406 105554 104337 104056 103908 102959 101636 101064 101539 102600 104019 105572 106394 105775 104276 102962 101999 101057
55390 101057 100547 101094 102143 102542 102319 102555 103588 104601 105000 105004 104848 104505 104255 104563 105367 106291 107291 108195
55372 108195 108094 106439 104407 103794 104627 105260 104747 103719 102794 101595 99792 97926 96685 96206 96336 96818
55356 96818 97128 97001 97097 98207 99856 100764 100644 100421 100661 101008 101319 102077 103374 104592 105379 105855 105644 103931
55338 103931 100893 97949 96090 94962 94022 93510 93688 94106 94328 94640 95396 96280 96728 96559 95847 94737 93705
55321 93705 93419 94037 95164 96549 98145 99460 99786 99279 98946 99283 99749 99862 99895 100153 100437 100604 100919 101430
55303 101430 101715 101532 101056 100320 99203 98151 97970 98709 99703 100857 102717 104937 106036 105308 103873 103060
55287 103060 102871 102757 102806 103189 103398 103087 102890 103349 103788 103334 102382 101866 101642 100829 99455 98504 98466 98929 99545
55268 99545 100311 100823 100334 98824 97224 96256 95738 95308 95200 95835 97121 98549 99797 100867 101753 102226 102002
55251 102002 101077 99832 98760 98130 97949 98203 98942 100142 101668 103426 105327 107100 108433 109286 109841 110118
55235 110118 109995 109569 109063 108363 107136 105595 104652 104969 106182 107313 107699 107388 106873 106602 106492 105958 104670
55218 104670 103196 102365 102058 101333 99916 98776 98898 100096 101543 102853 104086 105161 105943 106608 107280 107466
55202 107466 106484 104466 102460 101417 101386 101747 101925 101832 101792 102175 103058 104204 105302 106168 106775 107208 107538 107627
55184 107627 107206 106308 105453 105140 105349 105830 106618 107819 109071 109782 109836 109554 109067 108324 107643 107575 108121 108710 109051
55165 109051 109434 110117 111020 112111 113472 114820 115628 115865 116007 116234 116278 116213 116538 117192 117336 116574 115591 115089
55147 115089 114817 114265 113637 113376 113206 112438 110993 109487 108432 107887 107712 107719 107685 107583 107731 108441 109622 110817
55129 110817 111513 111393 110644 109952 109784 109741 109182 108436 108504 109432 109974 109289 108062 107342 107098 106718 106241 106146 106316
55110 106316 106113 105400 104786 104916 105914 107403 108756 109518 109903 110572 111728 112877 113646 114264 114885 115197 115141 115280
55092 115280 115876 116326 116205 116120 116746 117683 118198 118432 118869 119170 118714 117844 117361 117059 116070 114513 113486 113387 113502
55073 113502 113448 113719 114481 115086 115372 116313 118562 121147 122438 121867 120061 117807 115654 114180 113815 114419 115485
55056 115485 116649 117689 118199 117753 116398 114682 113164 112017 111023 109874 108599 107754 107973 109176 110528
55041 110528 111379 112008 113132 114867 116564 117635 118188 118712 119394 119993 120262 120247 120053 119572 118659 117528 116693
55024 116693 116487 116847 117560 118432 119124 119196 118655 118160 118355 119103 119731 119906 119910 120064 120312 120494 120683 120970 121091 120529
55004 120529 119106 117372 116264 116337 117371 118761 120165 121628 123208 124754 126032 126824 126961 126552 126108 126058
54988 126058 126146 125739 124792 123957 123678 123725 123885 124434 125545 126782 127706 128468 129256 129621 129095 128127 127620 127692 127701 127406
54968 127406 127322 127835 128667 129494 130482 131882 133485 134788 135461 135457 134911 134132 133489 133127 132909 132642 132263 131778 131263
54949 131263 130924 130959 131309 131662 131754 131573 131336 131344 131710 132085 131805 130577 128938 127838 127833 128814 130273 131610 132359
54930 132359 132425 132064 131543 131106 131378 133304 137183 142166 147240 152454 158544 165641 173220 181216 190238 200404
54914 200404 210713 219960 227602 233265 236067 235215 231085 225037 218118 210405 201682 192339 183361 175553
54900 175553 169009 163355 158339 153989 150306 147120 144459 142747 142230 142324 142053 141221 140706 141418 143324 145789
54884 145789 148522 151650 155028 157947 159817 160901 162242 164905 169341 175388 182694 191042 200229 209674
54870 209674 218303 225010 229322 231441 231517 229078 223531 215277 205914 197087 189307 182107 175072 168294 162024
54855 162024 156408 151654 148002 145385 143415 141791 140402 139004 137190 134881 132424 130075 127803 125771
54841 125771 124540 124419 124928 125303 125298 125203 125304 125647 126096 126281 125711 124273 122477 120977 119977 119364 119100 119184
54823 119184 119476 119892 120565 121439 121976 121709 120917 120295 120074 119949 119842 120165 121165 122381 123053 122972 122776 123352
54805 123352 124973 127007 128546 129222 129285 129125 129118 129840 131715 134200 135882 135789 134309 132551 131274 130697 130754
54788 130754 131031 130900 130294 129998 130658 131869 132840 133557 134540 135768 136713 137356 138351 140020 141892 143443 144791
54771 144791 146421 148609 151302 154325 157574 161249 165876 171929 179402 187873 196805 205633 213838 221158
54757 221158 227395 231769 232988 230487 225252 218856 212015 204637 196882 189343 182319 175721 169641 164389
54743 164389 160018 156476 154113 153312 153583 153802 153473 153034 152807 152333 151091 149327 147792 147036 147171 148094 149695
54726 149695 152005 155189 159260 163995 169343 175658 183170 191552 200441 209959 220007 229315 236015 239145
54712 239145 238992 236140 231006 224224 216597 208494 199935 191326 183435 176609 170667 165525 161196 157269
54698 157269 153236 149397 146575 144882 143667 142722 142505 142945 143112 142496 141630 141004 140305 139274 138418 138201 138271
54681 138271 138145 137949 137839 137352 136096 134553 133503 132986 132492 131803 131137 130701 130548 130596 130511 129961 129178 128753
54663 128753 128682 128327 127594 127303 127874 128520 128425 127985 128053 128600 128982 129052 129113 129169 129014 128748 128488 127965 127094 126554 126960
54642 126960 127928 128799 129832 131664 133854 135115 134940 133981 132836 131528 130292 129779 130070 130315 129852 129044
54626 129044 128609 128651 128746 128548 127984 127242 126820 127223 128366 129615 130580 131473 132505 133389 133763 133738 133713 133871 134151
54607 134151 134488 134800 134941 134888 134834 134852 134681 134129 133571 133684 134654 135874 136537 136401 135905 135641 135808 136163 136387
54588 136387 136420 136416 136445 136324 135827 135028 134318 133987 133949 134104 134774 136350 138358 139443 138715 136821 135217 134549 134272
54569 134272 133739 133013 132510 132347 132305 132136 131823 131745 132503 134184 135984 137053 137613 138497 139666 140094 139387 138612
54551 138612 139013 140517 142115 143164 143763 144239 144792 145401 145746 145538 145158 145475 146775 148430 149950 151579
54535 151579 153385 154561 154462 153695 153331 153481 153537 153325 153006 152201 150371 147987 146227 145405 144701 143630 142777
54518 142777 142723 143131 143385 143455 143569 143515 142853 141573 140153 139163 139011 139807 141162 142328 142823 142844 142895 143149 143337
54499 143337 143167 142681 142244 142205 142598 143121 143463 143583 143637 143735 143846 143892 143914 144186 145084 146533 147672 147532 146189
54480 146189 144799 144277 144422 144677 145121 146112 147414 148501 149579 151476 154456 157708 160217 161691 162486 162995
54464 162995 163389 163772 164404 165645 167535 169467 170624 170892 171051 171825 173126 174435 175445 175924 175491 174152
54448 174152 172691 171858 171375 170416 168835 167290 166292 165859 165964 166524 166954 166465 165028 163482 162584 162398 162620
54431 162620 162907 162829 162102 161048 160383 160396 160745 161067 161352 161690 162179 163080 164532 166087 167115 167735 168650 169877
54413 169877 170298 168930 166161 163366 161583 160879 160768 160871 161213 161962 162956 163734 164244 165140 166854 168618 169163
54396 169163 168378 167554 167797 168883 169927 170566 171102 171900 173018 174195 174964 175044 174743 174745 175392 176438 177440 178012
54378 178012 177825 176877 175819 175479 175922 176456 176603 176531 176491 176458 176517 176998 178001 179307 180915 183097 185712 188139
54360 188139 190115 192021 194057 195838 197197 198713 200806 202801 203547 202648 200652 198289 195964 193746 191457
54345 191457 188918 186320 184041 181998 179691 177105 174936 173554 172352 170679 168854 167632 167111 166800 166380
54330 166380 165744 164689 163358 162699 163584 165573 167313 168208 168882 169895 170766 170671 169582 168238 167295 166889 166856
54313 166856 167044 167377 167831 168454 169372 170607 171810 172240 171330 169332 167192 165697 164959 164759 164978 165458 165807
54296 165807 165708 165297 164976 165022 165508 166288 166846 166568 165536 164744 165047 166153 167088 167436 167582 167871 168146 168234 168323
54277 168323 168692 169298 169810 169906 169512 168920 168575 168544 168349 167661 167036 167510 169379 171747 173407 173901 173569 172888
54259 172888 172022 170929 169697 168722 168525 169288 170606 171854 172898 174265 176444 179056 180907 181037 179733
54244 179733 178415 178418 179859 181668 182601 182129 180578 178729 177323 176614 176242 175576 174247 172331 170145 168123
54228 168123 166762 166321 166480 166624 166588 166898 168169 170433 173055 175098 175857 175393 174536 174018 173630 172692 171246
54211 171246 170161 169921 170030 169927 169804 170098 170740 171463 172340 173446 174348 174619 174600 175068 176312 177990 179707
54194 179707 181159 181985 182061 181826 181743 181538 180604 179043 177660 176860 176218 175339 174593 174749 176222 178816 181803
54177 181803 184176 185289 185532 186049 187517 189421 190647 190551 189345 187791 186707 186444 186486 185757 183647 180746
54161 180746 178393 177468 177671 177923 177388 176126 174796 173828 173060 172256 171666 171751 172419 172937 172677 171726 170649 169923
54143 169923 169751 170167 171065 172138 173004 173424 173371 172957 172319 171554 170698 169838 169261 169359 170240 171490 172505 173112
54125 173112 173683 174534 175388 175755 175760 176205 177669 179836 181870 183129 183316 182425 181064 180481 181607 184086 186754
54108 186754 188965 190815 192236 192793 192635 192776 193963 195873 197924 200300 203578 207801 212545 217560 222672
54093 222672 227213 230159 230838 229200 225627 220882 215981 211592 207589 203560 199612 196335 194178 193206 193241
54078 193241 193879 194617 195406 196809 199212 202202 205262 208647 212819 217263 220782 222947 224418 225683 226260
54063 226260 225484 223421 220640 217528 214239 210979 208004 205532 203833 203136 203293 203814 204423 205351 206909 208963
54047 208963 211065 212961 214821 216980 219595 222568 225818 229505 233769 238278 242404 245984 249492 253297
54033 253297 257303 261681 267294 274603 282590 289662 295548 301418 308073 314875 320691 325160 328676 331661
54019 331661 334256 336366 337768 338415 338670 338886 338793 337795 335897 333739 331633 329142 325803 321607 316553 310370
54003 310370 303113 295577 288667 282680 277472 272982 269213 265982 262982 259912 256526 252939 249933 248366
53989 248366 248020 247552 245946 243525 241284 239764 238985 238861 239044 238759 237501 235724 234287 233393 232550 231429
53973 231429 230186 229025 227932 226955 226353 226374 227093 228458 230282 232195 233838 235215 236782 239184 242825
53958 242825 247615 253191 259565 267388 277133 287966 297844 304832 308032 307429 303634 297957 291958 286407
53944 286407 281163 276373 273053 271952 272589 274115 276577 280428 285297 290263 295150 300549 306539 312299
53930 312299 316994 320252 321765 321389 319943 319026 319589 321274 323487 326434 330613 335895 341730 347907 354482
53915 354482 361231 367774 374224 381269 389542 399127 409617 420350 430592 439746 447504 453845 458955
53902 458955 463152 466656 469299 470646 470500 469110 466793 463626 459784 455877 452539 449683 446511 442306
53888 442306 436922 430371 422312 412333 400771 388937 378307 369498 362076 355218 348376 341371 334259
53875 334259 327371 321308 316502 312724 309219 305367 301104 296740 292606 288861 285416 281949 278166 274113
53861 274113 270154 266631 263714 261530 260053 258806 257064 254625 252106 250146 248540 246589 244190 242076
53847 242076 240829 240054 238826 236752 234305 232225 230862 230119 229775 229675 229693 229714 229736 229915 230344 230792 230794 230129
53829 230129 229138 228417 228255 228523 229101 230105 231576 233130 234232 234771 235161 235887 237104 238733 240651 242696
53813 242696 244614 246197 247446 248470 249346 250157 251161 252693 254872 257512 260419 263675 267573 272322 277892
53798 277892 284114 290796 297668 304375 310599 316200 321185 325608 329653 333699 338053 342576 346820 350623
53784 350623 354278 357937 361135 363265 364249 364318 363310 360783 356814 352085 346973 341137 334378 327356 320966
53769 320966 315327 309884 304317 298811 293571 288600 284004 280005 276550 273199 269610 265901 262489 259746
53755 259746 257830 256593 255612 254456 252995 251297 249336 247011 244469 242148 240470 239643 239691 240421 241357 241968
53739 241968 242034 241613 240755 239505 238231 237544 237700 238239 238431 238069 237683 237978 239039 240213 240905 241399 242527
53722 242527 244476 246420 247615 248389 249555 251155 252427 252866 252709 252439 252373 252821 254063 256055 258579 261653
53706 261653 265304 268958 271725 273427 274782 276399 278252 280315 282968 286332 289797 292777 295492 298545
53692 298545 302133 306184 310796 315913 320774 324397 326558 327779 328403 328222 327064 325329 323732 322740 322360
53677 322360 322243 321887 320849 318971 316567 314403 313310 313524 314459 315319 315853 316194 316147 315216 313387 311303 309528
53660 309528 308171 307337 307259 307644 307666 307135 307050 308288 310230 311419 311272 310400 309484 308652 307914 307475 307470 307924 309050
53641 309050 311067 313660 316096 317983 319581 321286 323142 324961 326627 328190 329818 331616 333356 334587
53627 334587 335308 336313 338490 341893 345877 350038 354563 359717 365408 371260 376770 381442 385077 387929
53613 387929 390352 392472 394483 396964 400407 404592 408932 413241 417641 421893 425510 428513 431385 434267
53599 434267 436812 438908 440846 442610 443669 443768 443295 442611 441586 440144 438745 437872 437418 436948 436249 435258
53583 435258 433786 431718 429340 427135 425348 423909 422573 421040 419204 417329 415698 414015 411657 408630
53569 408630 405745 403578 401776 399780 397644 395698 393955 392525 392148 393408 395523 396805 396523 395672 395726
53554 395726 397150 399325 401370 402660 402970 402650 402526 403259 404750 406371 407736 409017 410537 412278 413960
53539 413960 415504 417235 419591 422683 426215 429852 433594 437811 442994 449517 457526 466890 477179 487785
53525 487785 498234 508547 519249 530853 543282 555937 568431 581068 594436 608703 623631
53514 623631 639164 655628 673329 692335 712815 735211 759733 785863 812697 839789 867441
53503 867441 896162 925940 955979 985021 1012009 1036766 1060116 1083237 1106705 1130099 1152511
53492 1152511 1173390 1192969 1212002 1231164 1250637 1270162 1289410 1308327 1327225 1346528 1366393
53481 1366393 1386550 1406553 1426203 1445613 1464893 1483906 1502355 1519949 1536345 1551082 1563737
53470 1563737 1574126 1582218 1587927 1591022 1591149 1587843 1580763 1570122 1556835 1542018 1526355 1510014 1492992
53457 1492992 1475289 1456954 1438236 1419598 1401216 1382481 1362337 1340273 1316743 1292557 1268074
53446 1268074 1243191 1217969 1193100 1169577 1147846 1127368 1107253 1087484 1069264 1053980 1042111
53435 1042111 1033349 1027342 1023695 1021454 1019373 1016989 1014964 1014160 1014740 1016423 1019178 1023306 1028964 1035983
53421 1035983 1044145 1053524 1064572 1077936 1094009 1112562 1132812 1153956 1175699 1198400 1222779 1249349
53409 1249349 1277907 1307751 1338500 1370551 1404422 1439930 1476425 1513741 1552411 1592992 1635658
53398 1635658 1680531 1727904 1777927 1830427 1885215 1942207 2001088 2061187 2121885 2182916 2244154
53387 2244154 2305407 2366527 2427446 2487979 2547820 2606707 2664236 2719548 2771760 2820835 2867478
53376 2867478 2911887 2953035 2989490 3020513 3046094 3066414 3081760 3092619 3099315 3101539 3098410 3088759
53364 3088759 3071198 3044429 3008041 2962972 2911017 2854095 2794120 2732888 2671390 2609361 2546101
53353 2546101 2481813 2417792 2355356 2294987 2236547 2180035 2125955 2074907 2026711 1980011 1933143
53342 1933143 1885558 1838069 1791581 1746117 1701457 1658197 1617499 1579995 1545474 1513481 1483695
53331 1483695 1455864 1429973 1406542 1386291 1369372 1355211 1342969 1331780 1320600 1308386 1294646
53320 1294646 1279663 1264182 1249078 1235165 1222918 1212258 1202802 1194227 1186321 1179024 1172758 1168411
53308 1168411 1166451 1166242 1166806 1168125 1171043 1175915 1182098 1188970 1196826 1206439 1218183 1231912 1247348 1264356
53294 1264356 1283089 1304041 1327636 1353625 1381218 1409960 1440056 1471681 1504371 1537325 1569820
53283 1569820 1600962 1629558 1654869 1677341 1698066 1717494 1735077 1750069 1762188 1771349 1777151 1778962
53271 1778962 1776439 1769833 1759763 1746812 1731356 1713679 1694050 1672487 1648589 1621983 1593061 1562976
53259 1562976 1532665 1502114 1470790 1438579 1405946 1373298 1340550 1307356 1273515 1239184 1205026
53248 1205026 1172174 1141629 1113377 1086220 1058738 1030383 1001597 973082 945223 918128 891886
53237 891886 866616 842395 819265 797290 776537 757026 738707 721478 705269 690214 676674
53226 676674 664958 655009 646489 639059 632323 625554 617929 609308 600411 591860 583234 573447 561893 548816
53212 548816 534741 520132 505645 492143 480178 469724 460527 452345 444786 437402 430194 423540 417425
53199 417425 411194 404480 397802 391713 385765 379051 371578 364324 357923 352014 346134 340580 335904 331941
53185 331941 327893 323282 318442 313973 310078 306564 303318 300450 297974 295613 293158 290846 289101 287953
53171 287953 287009 286009 285034 284107 283018 281697 280402 279301 278257 277248 276551 276086 275003 272533 269067
53156 269067 265830 263628 262434 262077 262602 263871 265398 266785 267933 268633 268420 267111 265206 263487 262443
53141 262443 262183 262572 263227 263611 263470 263078 262876 262990 263263 263633 264247 265137 265994 266390 266297 266263 266963 268558 270611
53122 270611 272583 274178 275226 275644 275698 275911 276456 276991 277435 278456 280640 283491 285896 287398 288304 288675
53106 288675 288084 286540 284875 283776 282963 281680 279631 277104 274613 272757 272006 272177 272366 271843 270869 270240
53090 270240 270178 270077 269342 268061 266752 265675 264670 263587 262650 262200 262163 262026 261469 260764 260388 260508 261094 262204
53072 262204 263685 264816 264881 264095 263411 263361 263509 263121 261830 259668 257059 254931 254111 254258 253978 252449 250475
53055 250475 249467 249789 250602 251011 250861 250598 250841 252059 254285 257041 259667 261623 262595 262685 262570 262984 263854
53038 263854 264422 264428 264530 265134 265502 264712 262997 261363 260179 259013 257726 256827 256637 256772 256722 256398 255946 255416
53020 255416 254863 254453 254282 254268 254298 254302 254310 254602 255640 257457 259262 260090 259788 258974 258209 257710 257692 258238 258751 258340
53000 258340 257029 255999 256232 257436 258651 259376 259598 259177 257969 256438 255518 255728 256752 257981 259158 260422
52984 260422 261987 263961 266372 269242 272602 276348 280096 283312 285713 287429 288701 289547 289892 289866 289748
52969 289748 289680 289622 289603 289756 290081 290346 290397 290437 290871 291897 293331 294812 296017 296645 296396 295117 293006 290538
52951 290538 288196 286299 285009 284283 283811 283216 282426 281658 280978 280098 278762 277094 275320 273407 271333 269551
52935 269551 268667 268652 268824 268742 268674 268991 269482 269658 269469 269339 269527 269834 269921 269697 269350 269177 269325 269521 269128 267731
52915 267731 265711 264017 263273 263289 263492 263619 263867 264502 265487 266422 266791 266450 265946 266194 267569 269409 270625
52898 270625 270696 269927 268884 267940 267358 267309 267590 267613 266997 266049 265453 265547 266107 266755 267387 268212 269417 270790 271735
52879 271735 271905 271806 272365 273707 274869 275044 274675 274734 275369 276095 277173 279744 284271 289637 294243 297447 299510
52862 299510 300710 301195 301382 301823 302715 303902 305139 305941 305407 302863 298662 293918 289432 285256 281235 277446
52846 277446 273929 270449 266765 262920 259179 255946 253705 252587 251821 250076 246796 243035 240589 240296 241415
52831 241415 242633 243347 243880 244753 246076 247662 249406 251335 253344 255112 256312 256779 256419 255124 252937
52816 252937 250262 247832 246347 246040 246507 247089 247549 248291 249735 251716 253853 256289 259408 262731 264792
52801 264792 264549 262494 259970 257767 255835 253986 252249 250686 249345 248384 247794 247169 246075 244529 242753
52786 242753 240766 238732 237425 237643 239214 241192 242995 244694 246247 247287 247843 248517 249642 250888 251930
52771 251930 252829 253416 253045 251533 249731 248514 247676 246499 245020 243932 243433 242978 242250 241716 241998 243102
52755 243102 244471 245578 246349 247182 248536 250333 251904 252730 253078 253610 254519 255484 256405 257709 259789 262495
52739 262495 265296 267698 269475 270721 271806 273031 274252 275052 275340 275533 276029 276740 277285 277501 277613 277984
52723 277984 278753 279591 279840 279069 277530 275876 274423 272955 271275 269597 268172 266849 265342 263766 262601
52708 262601 262154 262316 262779 263208 263191 262364 260788 259051 257867 257594 258149 259230 260578 262162 264184 266709
52692 266709 269177 270543 270215 268777 267444 266853 266688 266505 266460 266958 267922 268813 269246 269218 268778 267845 266440 264790
52674 264790 263108 261449 259883 258611 257773 257362 257404 258003 259016 259892 260103 259720 259362 259544 260221 261008 261735
52657 261735 262709 264345 266605 268944 270983 273120 276185 280518 285628 290782 295487 299263 301433 301662 300444
52642 300444 298584 296272 293208 289556 286173 283657 281680 279615 277399 275369 273588 271854 270286 269322
52628 269322 269080 269271 269910 271592 274609 278097 280598 281416 281007 280044 278630 276634 274352 272417 271240 270868
52612 270868 271238 272127 272921 272907 271959 270664 269622 268906 268423 268401 269081 270029 270271 269326 267842 266991 267318 268356
52594 268356 269289 269791 270191 271019 272450 274083 275134 274964 273624 271914 270713 270238 270076 269918 269970 270559 271672
52577 271672 273116 274819 276594 277873 278185 277876 277802 278296 278928 279364 279856 280615 281279 281451 281357 281426 281521 281114 280068
52558 280068 278676 277056 275087 272952 271210 270191 269713 269517 269539 269622 269426 268933 268740 269472 270994 272410 272856
52541 272856 272270 271533 271784 273379 275493 277014 277733 278256 278810 278840 278027 277007 276569 276620 276594 276493 276761 277378
52523 277378 277928 278593 280203 282984 285924 287822 288514 288653 288748 288991 289697 291241 293499 295889 298087 300433
52507 300433 303483 307439 312104 317089 321793 325353 327006 326604 324653 321744 318096 313802 309355 305568
52493 305568 302807 300535 297896 294638 291231 288197 285690 283701 282239 281174 280240 279384 278818 278560 278316
52478 278316 278072 278379 279635 281365 282726 283583 284538 285973 287649 289309 291136 293352 295779 298068 300143
52463 300143 302208 304563 307540 311373 315913 320610 324873 328307 330626 331635 331420 330200 327896 324228
52449 324228 319381 314147 309191 304546 300128 296285 293416 291419 289990 289144 288889 288654 287764 286355 285163
52434 285163 284378 283435 282117 281162 281331 282328 283054 282711 281377 279797 278918 279292 280536 281509 281459 280922 281187 282871
52416 282871 285335 287484 288807 289549 290191 291032 292171 293634 295499 297985 301432 306120 312095 319292 327816
52401 327816 337883 349300 361044 371548 379424 383846 384453 381354 375363 367861 360120 352828 346321
52388 346321 340889 336574 333008 329906 327513 326112 325269 324166 322639 321356 320840 320908 321302 322301 324256 326880
52372 326880 329533 332106 335201 339411 344711 350591 356591 362529 368265 373351 377102 379097 379529 378889 377406
52357 377406 375048 372018 368941 366502 365093 364703 364854 364689 363619 361982 360701 360239 360389 361157 363109 366415
52341 366415 370117 372936 374498 375265 375690 376090 377115 379522 383383 388124 393420 399512 406550 414186 422078
52326 422078 430374 439419 449296 459999 471807 485100 499777 515078 530058 544243 557816 571135
52314 571135 584118 596349 607871 619574 632386 646283 660542 674914 689964 706117 722985
52303 722985 739991 757250 775304 794193 813278 831964 850126 867761 884578 900205 914552
52292 914552 927623 938974 947656 952889 954718 953906 951261 947240 942078 935987 929117 921610 913926 906867
52278 906867 900944 895803 890637 885259 880519 877539 876651 877164 878098 879085 880676 883825 889050 896065 904083
52263 904083 912308 920135 927282 934051 941260 949596 959089 969471 980851 993673 1008113 1023917 1040777
52250 1040777 1058383 1076111 1093183 1109272 1124468 1138427 1150006 1158046 1162198 1162821 1160536 1156240
52238 1156240 1151029 1145542 1139542 1132574 1124800 1116735 1108391 1099320 1089447 1079237 1068986 1058484 1047612
52225 1047612 1036812 1026670 1017360 1008750 1000777 993476 986819 980805 975574 971213 967559 964374 961619
52212 961619 959420 957863 956996 956979 958035 960275 963576 967569 971710 975530 978971 982318 985694 988816 991510
52197 991510 994238 997736 1002214 1007334 1012976 1019508 1027085 1035143 1042969 1050522 1058245 1066226 1073967 1080868
52183 1080868 1086489 1090310 1091788 1090873 1088076 1083721 1077434 1068731 1057899 1045986 1034081 1022926 1013002
52170 1013002 1004463 996980 990115 983966 979080 975693 973497 972293 972374 973951 976661 980037 984114 989019
52156 989019 994219 998760 1002166 1004565 1005979 1006106 1004919 1002899 1000440 997560 994528 992280 991678 992616 994282
52141 994282 996134 998160 1000396 1002654 1004723 1006379 1007226 1006929 1005701 1004233 1003101 1002566 1002916 1004562 1007681
52126 1007681 1012195 1018296 1026608 1037646 1051477 1068113 1087733 1110088 1134061 1158398 1182730 1207416
52114 1207416 1232504 1257415 1281716 1305576 1329132 1351781 1372440 1390438 1405878 1419238 1430922
52103 1430922 1441324 1451143 1461281 1472211 1483571 1494624 1505090 1515172 1524647 1532426 1537429 1539676
52091 1539676 1539954 1538453 1534119 1525489 1512024 1494671 1475401 1456081 1437439 1419044 1400476 1382326
52079 1382326 1365679 1350873 1337408 1325091 1314494 1305969 1298859 1292245 1286163 1281601 1279500 1280126 1283187
52066 1283187 1288128 1294360 1301608 1310087 1320074 1331319 1343023 1354402 1365208 1375828 1387008 1399351
52054 1399351 1412948 1427498 1442690 1458155 1473079 1486316 1497108 1505354 1511023 1513802 1513609 1510918
52042 1510918 1506051 1498572 1488011 1474927 1460603 1445813 1430551 1414853 1399138 1383639 1368189 1352837
52030 1352837 1338148 1324615 1312265 1301057 1291128 1282184 1273110 1262830 1251469 1240182 1229767 1219815
52018 1219815 1209389 1198293 1187399 1177730 1169441 1161880 1154570 1147789 1142010 1137000 1131819 1125643 1118294
52005 1118294 1109910 1100394 1089302 1076131 1060683 1043218 1024248 1004113 982926 961148 940022 921042
51993 921042 904907 891279 879493 869105 859619 850086 839438 827274 814180 801126 788475 775596
51981 775596 761626 746587 731361 716400 700941 684005 665867 647868 630949 615075 600148
51970 600148 586709 575448 566583 560117 556266 555235 556834 560593 566131 573291 582068 592360 603377
51957 603377 613374 620574 624529 626031 625569 622643 616984 609667 602277 595466 588995 582803 577312 572962
51943 572962 570261 570160 573592 580537 590130 601793 615703 632144 651007 672133 695553 720995 747484
51930 747484 773831 799278 823413 845508 864132 877390 883504 881259 870180 850578 823718 791861
51918 791861 757657 723147 689488 657689 629013 604195 582639 563197 545718 531209 520401
51907 520401 512780 507208 503051 500444 499887 501824 506293 512649 519808 526935 533723 539986 545254 548867
51893 548867 550131 548270 542622 533255 521245 508144 495257 483405 473046 464376 457510 452682 450080
51880 450080 449411 450022 451647 454760 459955 467289 476440 487130 498979 511174 522690 532763 540892
51867 540892 546612 549681 550405 549417 547106 543524 538731 532979 526677 520533 515552 512526 511463 511836 513260
51852 513260 515649 518786 522204 525463 528183 529830 529874 528119 524437 518347 509545 498983 488639 479841
51838 479841 472370 465492 459146 453547 448290 442774 437351 433244 431340 431585 433450 436302 439360 441965
51824 441965 444073 445916 447141 446942 445240 443022 441133 439329 436996 434316 432117 430874 430463 430771 431947
51809 431947 434042 436782 439740 442470 444499 445580 446013 446453 447279 448228 448605 447806 445834 443544 442205 442472
51793 442472 443801 445068 445631 445572 445111 444242 442956 441382 439611 437659 435669 433952 432760 432223 432421 433165
51777 433165 433740 433362 432099 431082 431556 433869 437493 441803 446629 452189 458771 466576 475798 486571 498599
51762 498599 510792 521667 530340 536859 541374 543383 542284 538257 531938 523514 512935 500941 488923
51749 488923 477623 466790 456311 446750 438450 431105 424790 420435 418420 417491 416174 414819 415167 418205
51735 418205 423483 430388 438927 449074 460293 471932 483256 492890 499212 501829 502120 501962 502556 504778
51721 504778 509658 517417 526303 533266 535973 533904 527840 519115 509499 501064 495423 492812 491946 490805
51707 490805 487808 482562 475716 468282 461256 455688 452580 452269 454052 456706 459306 461325 462170 461195 458420
51692 458420 454965 452444 451852 453016 454971 456716 457691 457711 456676 454455 451082 446943 442666 438758 435396
51677 435396 432573 430376 429036 428735 429491 431284 434182 438137 442702 447241 451663 456887 464377 475197
51663 475197 489500 506683 525634 544752 562010 575290 582761 583140 576105 562836 545979 528615
51651 528615 512974 500109 490563 484917 483481 485733 490386 495791 500093 501365 498429 491843 483587 475316
51637 475316 467179 458626 449979 442537 437293 434224 432936 433277 434970 437150 438782 439336 438845 437639 436333
51622 436333 435647 435647 435311 433408 429786 425424 421245 417353 413493 409754 406529 403994 401882 399664 396909
51607 396909 393603 390161 387032 384346 382080 380510 380196 381428 383831 386590 389062 391302 394204 399010
51593 399010 406405 416011 426957 438754 451222 463532 473780 479909 481001 477688 471520 464084 456473
51580 456473 449291 443044 438448 436188 436394 438618 442506 448395 457027 468649 482488 497185 511817
51567 511817 526507 541933 558229 574492 589456 602532 614173 625579 638329 654067 673981
51556 673981 698447 727306 760312 796865 835247 872525 905438 931339 948541 956379 955270 946362
51544 946362 930836 909583 883597 854263 822985 790715 758088 725862 694986 666340 640710
51533 640710 618927 601770 589520 581618 576752 573329 569991 565881 560626 554266 547228 540088 533066
51520 533066 525796 517795 509091 500223 491712 483808 476567 469819 463156 456410 450140 445161 441507 438295
51506 438295 434759 430960 427306 423949 421006 418875 417796 417346 416861 416229 415886 416159 416940 417858 418408 418110
51490 418110 417017 416036 416269 417954 420329 422531 424235 425425 426036 426082 425789 425280 424312 422667 420727 419300
51474 419300 418734 418411 417303 415020 412156 409636 407838 406431 404907 403016 400660 397627 393695 389027 384287
51459 384287 380232 377098 374420 371544 368327 365327 363278 362483 362691 363380 364087 364708 365679 367670 370870 374757
51443 374757 378908 383880 390934 400909 413671 428471 444240 459477 472504 482348 489286 494337 498421
51430 498421 502020 505286 508082 509925 510036 507524 501800 493215 483247 473664 465373 458338 452435 447767
51416 447767 444028 440319 436033 431486 427340 423825 420927 418819 417527 416497 415131 413593 412579 412363
51402 412363 412532 412625 412608 412768 413510 415210 417919 421210 424579 427932 431479 435266 439151 443155 447534 452614
51386 452614 458783 466477 475899 486938 499717 515072 534122 557454 585079 616978 653235 693752
51374 693752 738367 787242 840491 897056 954003 1007014 1051661 1084731 1105042 1113168 1110204 1096824
51362 1096824 1073658 1042115 1004132 961200 914283 864734 814613 765808 719287 675508 635122
51351 635122 598907 567261 540098 517180 498330 483276 471338 461362 452203 443442 435475 428720
51339 428720 422997 417957 413700 410402 407614 404643 401630 399582 399212 400308 402251 404538 406702 408377
51325 408377 409604 410505 410572 409042 406176 403308 401210 399247 396688 393963 391814 389944 387608 385134 383701
51310 383701 383698 384300 384793 385389 386505 387961 389262 390167 390607 390498 389900 389112 388374 387758 387375 387305 387183 386289 384287
51291 384287 381576 378733 376047 373782 372394 372078 372478 373349 375195 378692 383605 388886 393839 398635 403626
51276 403626 408740 413806 418897 423834 427760 429813 430203 430144 430634 431663 432696 433530 434453 435832 437797 440227
51260 440227 442783 444932 446077 445805 444051 441104 437400 433216 428615 423792 419261 415390 411836 407848
51246 407848 403225 398572 394501 391079 388267 386328 385254 384251 382523 380359 378776 378056 377390 376066 374405
51231 374405 373205 372824 373184 374334 376491 379641 383360 387016 390038 392137 393380 393932 393761 392843 391648
51216 391648 391010 391328 392211 393090 393828 394535 395165 395654 396174 396866 397588 398336 399684 402243 405810 409548 413038
51199 413038 416614 420551 424397 427372 429118 429786 429701 429232 428768 428447 427943 426852 425326 424087 423730 424176
51183 424176 424833 425123 424789 423864 422533 420991 419320 417534 415800 414514 414018 414323 415232 416583 418121 419295
51167 419295 419632 419351 419171 419306 419134 418181 417085 417090 418708 421323 423989 426174 427746 428696 429040 428791 427973
51150 427973 426762 425546 424540 423473 421915 419819 417451 415019 412756 411071 409982 408604 406071 402997
51136 402997 401152 401431 403008 404842 407056 410078 413246 415361 416275 416921 417824 418562 418810 419092 420079 421732
51120 421732 423545 425293 427131 429054 430592 431141 430589 429626 429348 430421 432626 435233 437670 439716 441368
51105 441368 442795 444276 445920 447549 449070 450809 453125 455875 458573 460981 463175 465094 466447 467023
51091 467023 466827 465960 464681 463534 462912 462576 461975 461066 460312 459841 459244 458373 457817 458191 459350 460676 461852
51074 461852 462968 464109 465253 466516 468130 470195 472618 475228 477818 480246 482721 485882 490339 496253
51060 496253 503641 513042 525650 542699 564691 590900 619222 646577 670014 687931 700545 709480
51048 709480 717089 725831 737368 751512 765989 777737 784864 787587 787313 784861 779654 770581 757590
51035 757590 742410 727877 716581 709811 707064 706117 703795 697352 685694 669550 650714 631203 612814
51022 612814 596793 583529 572736 564166 558044 554628 553589 554227 556286 560178 566273 574316 583704 594076
51008 594076 605387 617571 630384 643448 656227 668095 678664 687964 696115 702967 708315 712224
50996 712224 714741 715440 713842 710347 706145 701985 697541 692338 686896 682430 679668 678380 678017 678400 679897
50981 679897 683282 689502 699313 712993 730301 750424 771824 792475 810751 826157 839194 850945
50969 850945 863067 877652 896287 919198 945850 976331 1011542 1052030 1097325 1146646 1199622
50958 1199622 1255932 1314780 1375234 1436676 1498432 1559223 1617510 1672281 1723087 1769374 1810216
50947 1810216 1844686 1872284 1893128 1908081 1918533 1925733 1930382 1933268 1936060 1940768 1948035 1956240 1962517
50934 1962517 1964599 1961859 1955133 1945871 1935133 1922985 1908722 1891630 1871365 1847688 1820284 1788979
50922 1788979 1753760 1714359 1670288 1621700 1569928 1516696 1462983 1409068 1355525 1303580 1254479
50911 1254479 1209030 1167750 1130870 1097997 1068219 1040853 1015770 992836 971506 951253 932005
50900 932005 913830 896577 880201 865089 851579 839443 828343 818574 810763 804909 800325 796507
50888 796507 793550 791606 790487 789974 790081 790751 791637 792475 793441 795021 797632 801379 805961 810839 815813 821406
50872 821406 828347 836731 846142 856517 868226 881187 894665 908309 922788 938938 956861 976429
50860 976429 998120 1022611 1049811 1079071 1110233 1143854 1180466 1220339 1264100 1313016 1368430
50849 1368430 1431238 1501976 1581006 1668389 1763871 1867125 1977870 2095765 2220422 2351459
50839 2351459 2488192 2629114 2771800 2913146 3049409 3176218 3289301 3385665 3464024 3524107
50829 3524107 3565927 3589844 3596970 3589245 3569326 3540542 3506671 3471288 3437288 3407092 3383190 3368044
50817 3368044 3363153 3367985 3379751 3394257 3407135 3414514 3412970 3399399 3371336 3327346 3266989 3190545
50805 3190545 3098951 2993831 2877334 2751964 2620632 2486641 2353325 2223689 2100328 1985307
50795 1985307 1879819 1784302 1699222 1625399 1563093 1511149 1467737 1431797 1403076 1380929 1364017
50784 1364017 1351416 1343151 1339144 1338201 1338601 1339216 1339585 1339244 1337636 1334557 1330165 1324451 1317112 1308039 1297754
50769 1297754 1287202 1277070 1267210 1256620 1244068 1228858 1211112 1191512 1170941 1150222 1129804
50758 1129804 1109640 1089607 1070081 1051849 1035444 1020881 1008117 997467 989420 984294 982136 982716
50746 982716 985661 990900 999023 1010841 1026541 1045657 1067875 1093458 1122742 1155690 1192060 1231579
50734 1231579 1273893 1318913 1367377 1420434 1478299 1539790 1603478 1668744 1735422 1803185 1871838
50723 1871838 1941449 2011393 2079780 2144767 2206068 2264250 2318696 2367057 2406566 2435026 2450668
50712 2450668 2452238 2439791 2414992 2380563 2339914 2297060 2255824 2218568 2186264 2159906 2141055
50701 2141055 2130607 2127842 2131240 2139610 2151718 2165295 2177252 2184707 2185224 2176391 2156120 2123638 2079660
50688 2079660 2025426 1962115 1891487 1816637 1741506 1669426 1602158 1540217 1483915 1434009 1391456
50677 1391456 1356754 1329703 1309834 1296996 1291479 1293638 1303417 1320115 1342616 1369922 1401464 1436689
50665 1436689 1474281 1511961 1547290 1578743 1606111 1630045 1651335 1670495 1687847 1703851 1719189
50654 1719189 1734382 1749460 1764277 1779095 1794495 1810666 1827272 1844274 1862537 1883256 1907017
50643 1907017 1933785 1963573 1996656 2033181 2073064 2116312 2163000 2212775 2264678 2317621 2370766
50632 2370766 2423302 2474098 2521792 2565203 2603709 2637596 2668180 2697313 2726485 2756163 2785278
50621 2785278 2810344 2824979 2821842 2796875 2752318 2695427 2634373 2575497 2523263 2480741 2449160
50610 2449160 2427849 2415539 2411455 2414801 2423827 2436275 2450342 2464274 2475136 2478947 2472417 2454101
50598 2454101 2423772 2381496 2327866 2264712 2194814 2120829 2044694 1967946 1892156 1818779 1748640
50587 1748640 1681745 1617715 1556470 1498429 1444107 1393727 1347301 1304891 1266584 1232442 1202672
50576 1202672 1177570 1156924 1139698 1124882 1112548 1103549 1098162 1095706 1095594 1098093 1103652 1112041 1122556
50563 1122556 1134646 1147939 1162156 1177581 1195324 1216410 1240732 1267318 1295496 1325211 1356331
50552 1356331 1388332 1420819 1453877 1487662 1522028 1556710 1591543 1626333 1660796 1694778 1728319
50541 1728319 1761399 1794046 1826998 1861979 1900839 1944402 1992495 2045175 2103585 2169300 2242907
50530 2242907 2323499 2409683 2500867 2597469 2700147 2809246 2925006 3047749 3177412 3312928
50520 3312928 3452282 3593156 3733358 3870721 4002764 4126495 4238499 4335319 4413955 4472095
50510 4472095 4508043 4520677 4509587 4475115 4418141 4340091 4243253 4130874 4006780 3875097 3740495
50499 3740495 3608283 3483740 3371322 3274563 3196376 3138952 3103476 3090330 3099425 3129789 3178755
50488 3178755 3241894 3313660 3387594 3455890 3509719 3540947 3543993 3516375 3458198 3371697 3261055
50477 3261055 3131856 2990057 2841130 2689876 2540639 2397284 2262800 2138955 2026432
50468 2026432 1925201 1834636 1753425 1679838 1612367 1550065 1492306 1438707 1389532 1345701 1307809
50457 1307809 1275350 1247338 1223516 1204428 1190412 1181122 1175987 1174409 1175440 1178089 1182356 1189356 1199888
50444 1199888 1213358 1228685 1246002 1266794 1292430 1322916 1356839 1391826 1424888 1452954 1473749
50433 1473749 1486534 1492183 1492653 1490200 1486682 1483324 1480943 1480188 1481403 1484429 1488780 1494066 1500233 1507639
50419 1507639 1517128 1529833 1546509 1567048 1591012 1618651 1651080 1689337 1733664 1783889 1840066
50408 1840066 1902263 1969899 2041801 2116886 2194250 2272447 2349214 2422369 2490796 2554187 2611962
50397 2611962 2662886 2705632 2739243 2762800 2774921 2773855 2758067 2726725 2679965 2618971 2545875
50386 2545875 2463576 2375598 2285854 2198024 2114952 2038661 1970864 1913150 1866636 1831837 1808985
50375 1808985 1798108 1798633 1809224 1828206 1853720 1883242 1913351 1940364 1960905 1971772 1970010 1953954
50363 1953954 1924039 1882115 1830223 1770569 1706105 1640065 1574766 1511541 1451820 1397332 1349003
50352 1349003 1306390 1268700 1235891 1208378 1186095 1168182 1153186 1139120 1123629 1104678 1081391
50341 1081391 1054406 1025601 997355 971576 949136 930262 915206 904078 896214 890421 885979 882895
50329 882895 881108 880192 880053 881183 883822 887471 891702 896745 902685 908679 913811 918358 923437 929545 936171
50314 936171 942723 949099 955295 961120 966520 971786 977266 983159 989666 997033 1005341 1014461 1024300 1034947
50300 1034947 1046585 1059385 1073423 1088598 1104801 1122370 1142282 1165868 1194526 1229747 1273026
50289 1273026 1325577 1388387 1462019 1544446 1627558 1696727 1736471 1738585 1705710 1648035 1577496
50278 1577496 1504167 1435113 1374089 1321999 1278515 1243436 1216401 1196013 1180270 1167934 1158949
50267 1158949 1153493 1151150 1151134 1152783 1155649 1159498 1164532 1171403 1180715 1192601 1207000 1224251 1245119
50254 1245119 1270064 1298486 1328602 1358007 1384577 1407266 1426370 1443050 1458505 1473467 1488263
50243 1488263 1502944 1517175 1530130 1540726 1547802 1550017 1545929 1534754 1517072 1494445 1468413 1440227
50231 1440227 1411478 1384241 1360240 1340261 1324568 1313134 1304749 1296234 1283497 1263824 1237104 1205158
50219 1205158 1170352 1134762 1099922 1066816 1036032 1007919 982560 959718 939034 920250 903125
50208 903125 887314 872611 859249 847653 837878 829432 821581 813744 805804 798287 792025 787323 783609
50195 783609 780183 777066 774697 772994 771277 769049 766352 763307 759877 756192 752646 749475 746595 743977
50181 743977 741754 739852 737888 735654 733323 731029 728640 726183 724131 722944 722581 722692 723089 723780 724760
50166 724760 726023 727648 729718 732323 735752 740349 745949 751721 756851 761278 765584 770330 775775 782092
50152 782092 789653 799104 811193 826317 844115 863690 884395 906245 929613 954938 982942 1014751
50140 1014751 1051322 1092889 1139201 1190004 1244805 1302247 1360210 1416705 1470596 1521646 1570275
50129 1570275 1617360 1663850 1710163 1755775 1799211 1838290 1870454 1893159 1904222 1902064 1885965
50118 1885965 1856357 1814803 1763572 1705152 1642085 1576897 1511880 1448902 1389487 1334878 1285862
50107 1285862 1242707 1205365 1173544 1146336 1122095 1099169 1076825 1055191 1034468 1014622 995790
50096 995790 978360 962322 946891 931162 915015 899131 884267 870833 859129 849556 842392 837494
50084 837494 834421 832815 832538 833462 835267 837484 839696 841793 844118 847326 851794 857108 862384 867286 872450
50069 872450 878619 885516 891996 897236 901414 905169 908829 912271 915108 916826 917067 916085 914621 913105 911249
50054 911249 908684 905576 902232 898447 893927 889190 885408 883204 882127 881478 881216 881798 883512 886365 890362
50039 890362 895530 901783 909094 917818 928531 941412 955967 971543 988035 1005886 1025399 1046237
50027 1046237 1067795 1089911 1112868 1136652 1160622 1184285 1208207 1233757 1261901 1292502 1324767
50016 1324767 1358007 1391749 1425301 1457370 1486083 1509448 1526281 1537090 1544050 1549781 1555842 1562077
50004 1562077 1566977 1568348 1563821 1551359 1529870 1499617 1462080 1419393 1373778 1327238 1281423 1237551
49992 1237551 1196373 1158245 1123234 1091201 1061989 1035678 1012621 992900 975645 959109 941629
49981 941629 922584 902404 881901 861797 842729 825242 809567 795482 782590 770697 759950
49970 759950 750607 742699 735914 729910 724677 720367 716661 712653 707720 702337 697523 693505 689514 685113
49956 685113 681155 678957 678882 680330 682932 687062 693082 700748 709717 720044 731565 743001 752386 758654
49942 758654 762478 765409 768459 771670 774691 777257 779122 779927 779362 777310 773638 767895 759440 748024
49928 748024 734312 719737 705687 692707 680547 668973 658395 649580 642874 637981 634433 632056
49916 632056 630916 631078 632538 635219 638819 642752 646380 649324 651608 653647 656114 659582 664165 669658
49902 669658 676083 683799 692894 702846 713159 724112 736347 749692 762855 774411 783732 790859 795914
49889 795914 798947 799998 798875 795039 788161 778803 768218 757288 745933 733708 720747 707870 695868
49876 695868 684950 674892 665485 656687 648558 641344 635591 631813 629841 628734 627625 626641 626630 627999
49862 627999 630124 632146 634096 636934 641515 647876 655554 664338 674417 685960 698831 712735 727362
49849 727362 742208 756398 768913 779047 786609 791864 795405 797956 799870 800650 799146 794446 786504
49836 786504 775955 763603 750310 737098 724877 714049 704607 696557 689930 684432 679575 675336 672281
49823 672281 670754 670249 670035 670255 671924 675782 681518 688264 695518 703382 712124 721816 732285 743069
49809 743069 753418 762595 770356 776990 782769 787485 790699 792304 792572 791636 789232 785197 780056 774821
49795 774821 770160 765932 761473 756056 748992 739690 728035 714738 701043 688047 676380 666402 658351
49782 658351 652173 647530 644197 642255 641680 641939 642356 642802 643665 645120 646835 648556 650659 653852 658500
49767 658500 664493 671620 679759 688723 698145 707530 716290 723791 729666 734128 737814 741181 744152 746297
49753 746297 747181 746473 743830 738853 731234 721134 709535 698101 688329 680727 674844 670038 666051 662954
49739 662954 660878 659848 659641 659685 659345 658432 657292 656431 656344 657748 661533 668038 676382 684727 691296 695377
49723 695377 697678 699781 702979 707582 713540 721542 732779 747425 764117 781358 798782 816260 832290
49710 832290 844297 850515 850882 846215 837440 825845 813164 800777 789188 778669 770102 764789 763649
49697 763649 766715 772995 780465 786530 789083 787367 781880 773791 764540 755632 748341 743520 741611 742547
49683 742547 745563 749539 753895 759007 765637 774287 785255 798869 815272 834466 857070 884492 917167
49670 917167 952209 983464 1004703 1013197 1010571 1000810 987646 973459 959874 948725 942078 941440 947300
49657 947300 959338 976306 995032 1010033 1015398 1008014 989120 962768 933037 902601 873202 846498
49645 846498 823994 806230 792416 781219 772099 765661 762497 761939 762398 762906 763811 765799 768683 771482
49631 771482 773295 773621 772056 768258 762361 755036 746944 738416 729774 721626 714481 708194 702161 696176
49617 696176 690831 686902 684527 683157 682164 681282 680576 680305 680842 682403 684696 687090 689304 691755 694972
49602 694972 698851 702687 705851 708188 709855 711052 711913 712431 712457 711958 711241 710767 710745 711109 711810 712917 714397
49585 714397 716008 717408 718270 718348 717680 716723 716064 715993 716498 717449 718452 718736 717816 716408 716128 718004 721627
49568 721627 726002 730857 736766 744365 753865 765183 778114 792306 807198 821911 835180 845701
49556 845701 852851 856889 858314 857251 853649 847789 840294 831894 823440 815837 809551 804434 800340 797600
49542 797600 796429 796273 796404 796916 798329 800242 801252 800519 798815 797646 797821 799204 801496 804831 809769
49527 809769 816969 826801 839162 853791 870745 890341 912727 937761 965055 993469 1020523 1043068
49515 1043068 1059011 1068211 1071832 1071528 1069382 1067618 1067699 1070126 1075493 1084830 1098066 1112744 1125175 1132625
49501 1132625 1133717 1127375 1112926 1091451 1065921 1039405 1013678 989610 967948 949127 932907 918811
49489 918811 906630 896189 887056 878911 871984 866723 863258 861476 861345 862768 865242 867955 870266 871961
49475 871961 873187 874210 875095 875597 875598 875660 876746 879234 882602 886169 889739 893265 896484 899351 902393 906021
49459 906021 909808 913107 916204 920124 925198 930370 934103 935548 934745 932221 928664 924617 920130 914869
49445 914869 908790 902521 896967 892701 889879 888475 888304 888995 890302 892402 895637 900016 905265 911396 918791
49430 918791 927427 936384 944700 952761 962346 975012 990865 1009249 1030199 1054540 1082780 1114759
49418 1114759 1150248 1188405 1225624 1254809 1268556 1263985 1244398 1216494 1186561 1158908 1136251
49407 1136251 1120160 1111052 1108364 1111017 1117831 1127948 1141159 1157616 1176861 1197325 1217189 1235634
49395 1235634 1252966 1269629 1285561 1300467 1314261 1327025 1338777 1349409 1358600 1365633 1369571 1369880
49383 1369880 1366722 1360500 1351326 1339218 1324695 1308800 1292501 1276337 1260676 1246029 1232957 1221849
49371 1221849 1212918 1206244 1201686 1198928 1197815 1198540 1201315 1205898 1211588 1217520 1222813 1226621 1228424 1228299
49357 1228299 1226605 1223366 1218268 1211303 1203064 1194222 1185000 1175423 1165911 1157322 1150448 1145603 1142644 1141166
49343 1141166 1140691 1140828 1141334 1142061 1142896 1143717 1144237 1143871 1141954 1138173 1132622 1125446 1116735 1106952 1097138 1088368
49327 1088368 1081193 1075851 1072810 1072661 1075544 1081145 1089381 1100832 1116354 1136374 1160462 1187191 1214098
49314 1214098 1237912 1255272 1263823 1263118 1254660 1240903 1224006 1205352 1185849 1166128 1146419 1126867
49302 1126867 1108312 1092267 1079642 1069884 1061910 1055579 1051579 1050141 1050639 1052507 1055742 1060293 1065525
49289 1065525 1070525 1074561 1077171 1078309 1078507 1078302 1077332 1074597 1069795 1063738 1057188 1050082 1042404 1035083 1029217
49274 1029217 1024938 1021831 1020122 1020554 1023243 1027485 1032655 1038490 1044388 1049258 1052402 1053984 1054367 1053484 1051201
49259 1051201 1047848 1044019 1040135 1036594 1034247 1034453 1038710 1048212 1063417 1083733 1107743 1133854 1160538
49246 1160538 1185837 1207011 1221124 1226234 1222117 1210140 1192488 1171294 1148211 1124771 1102870 1084303
49234 1084303 1069567 1057581 1047084 1038101 1031720 1028696 1028827 1031520 1036243 1042304 1048849 1055432 1062215
49221 1062215 1069290 1076220 1082651 1089021 1096057 1103711 1111158 1117895 1124312 1130932 1137575 1143607 1148757 1153268
49207 1153268 1157393 1161183 1164950 1169633 1176452 1186104 1198380 1212567 1228160 1245065 1263115 1281608
49195 1281608 1299581 1316444 1332132 1346620 1359663 1371112 1381206 1390276 1398399 1405606 1412223 1418613
49183 1418613 1424640 1429757 1433728 1437074 1440755 1445693 1452590 1461956 1474129 1489370 1508061 1530771 1558197
49170 1558197 1591272 1631397 1680047 1737369 1800529 1863291 1917691 1957025 1978300 1982720 1974372 1958486
49158 1958486 1940215 1923746 1911518 1903947 1900016 1898135 1896605 1893919 1889346 1883374 1877277 1872163 1868527
49145 1868527 1866486 1866014 1866983 1869328 1873230 1878825 1885858 1893963 1903281 1914346 1927298 1941580 1956502
49132 1956502 1971783 1987456 2003616 2020368 2037687 2055239 2072635 2089902 2107318 2124814 2142049
49121 2142049 2159216 2177243 2196939 2218365 2241242 2265551 2291558 2319747 2351027 2386556 2427172
49110 2427172 2473607 2527684 2592836 2673256 2773338 2898181 3052749 3237493 3443423 3652851
49100 3652851 3848360 4024564 4192551 4370216 4562755 4748711 4886539 4940168 4903345 4801873
49090 4801873 4672883 4540256 4405442 4256473 4083576 3888708 3684527 3486776 3307131
49081 3307131 3150924 3018915 2909570 2820066 2746883 2686769 2637377 2596978 2563809 2535870 2511203
49070 2511203 2488428 2467223 2448084 2431279 2416194 2402064 2388994 2377611 2367905 2359163 2351020 2343767
49058 2343767 2337559 2332083 2327196 2323183 2320096 2317568 2315536 2314544 2315007 2316882 2320288 2325740 2333286 2342122
49044 2342122 2351619 2362117 2374100 2387045 2399628 2410533 2418550 2422522 2422150 2418705 2414305 2410632 2408675
49031 2408675 2409136 2412182 2417054 2422791 2429388 2437531 2447132 2456746 2464591 2469734 2472337 2473244 2473409 2473336 2472998
49016 2472998 2472498 2472637 2474424 2478183 2483636 2490656 2499341 2509382 2520065 2531014 2542396 2554235 2566055
49003 2566055 2577438 2588535 2599791 2611418 2623238 2634721 2645114 2653919 2661401 2668318 2675033 2681113
48991 2681113 2685850 2688823 2689922 2689252 2687156 2684035 2680032 2675190 2669924 2664833 2659972 2654767 2648871 2642622
48977 2642622 2636483 2630556 2624951 2620044 2615823 2611396 2605783 2599006 2591804 2584395 2576170 2566662 2556272 2545840
48963 2545840 2535905 2526697 2518591 2512252 2508314 2507025 2508182 2511347 2516184 2522601 2530603 2540132 2551188 2564015
48949 2564015 2578919 2595878 2614523 2634662 2656697 2681239 2708209 2736386 2764060 2790231 2815215
48938 2815215 2840100 2865814 2892864 2921754 2953094 2987144 3023584 3062082 3102898 3146606 3193288
48927 3193288 3242383 3293284 3345769 3399770 3455203 3512260 3571551 3633503 3697712 3763285 3829826
48916 3829826 3897682 3967038 4037092 4106445 4174153 4240122 4304568 4367484 4428697 4488083 4545505
48905 4545505 4600720 4653516 4703825 4751548 4796456 4838511 4878184 4916098 4952319 4986283 5017489
48894 5017489 5045973 5071908 5094918 5114137 5128968 5139570 5146570 5150481 5151526 5149834 5145556 5138735
48882 5138735 5129251 5116966 5101806 5083636 5062183 5037323 5009389 4979061 4946861 4912748 4876096
48871 4876096 4835939 4791424 4742353 4689351 4633330 4574778 4513866 4451181 4387882 4324918 4262497
48860 4262497 4200704 4140291 4082357 4027336 3974817 3924398 3876327 3831206 3789386 3750768 3714934
48849 3714934 3681329 3649590 3619895 3592866 3568953 3548050 3529804 3514171 3501489 3492074 3485893 3482685
48837 3482685 3482317 3484970 3490896 3499944 3511451 3524688 3539443 3556028 3574761 3595515 3617755 3640817
48825 3640817 3664159 3687480 3710732 3734064 3757698 3781779 3806213 3830689 3855075 3879795 3905495
48814 3905495 3932129 3958674 3984084 4008294 4031972 4055512 4078802 4101853 4125084 4148849 4173158
48803 4173158 4197996 4223511 4249733 4276530 4304043 4332742 4362797 4393762 4425093 4456623 4488158
$$ [...]
##END NTUPLES=NMR SPECTRUM
##END=
