
##TITLE=UV1292_M3_1216-1376_10_7535562_trwCHx6B9J
##JCAMPDX= 6.0         $$ Bruker NMR JCAMP-DX V2.0
##DATA TYPE= NMR SPECTRUM
##DATA CLASS= NTUPLES
##ORIGIN= BRUKER
##OWNER= Administrator
$$ 1.72 TOPSPIN		Version 2.1
$$ 2013-02-21 20:00:08.362 -0500  Administrator@X
$$ Compression mode = diff/dup
##.OBSERVE FREQUENCY= 400.02188249412
##.OBSERVE NUCLEUS= ^1H
##.ACQUISITION MODE= SIMULTANEOUS (DQD)
##.ACQUISITION SCHEME= undefined
##.AVERAGES= 8
##.DIGITISER RES= 22
##SPECTROMETER/DATA SYSTEM= spect
##.PULSE SEQUENCE= zg30
##.SOLVENT NAME= COFFEE_meoh
##.SHIFT REFERENCE= INTERNAL, COFFEE_meoh, 1, 14.98509
##AUDIT TRAIL= $$ (NUMBER, WHEN, WHO, WHERE, PROCESS, VERSION, WHAT)
$$ ##TITLE= Audit trail, TOPSPIN		Version 2.1
$$ ##JCAMPDX= 5.01
$$ ##ORIGIN= Bruker BioSpin GmbH
$$ ##OWNER= Administrator
$$ $$ E:\/data/COFFEE/nmr/UV1292_M3_1216-1376_10_7535562_trwCHx6B9J/10/pdata/1/auditp.txt
$$ ##AUDIT TRAIL=  $$ (NUMBER, WHEN, WHO, WHERE, PROCESS, VERSION, WHAT)
(   1,<2013-02-21 19:59:59.784 -0500>,<Administrator>,<X>,<go>,<TOPSPIN 2.1>,
      <created by zg
	started at 2013-02-21 19:58:53.237 -0500,
	POWCHK enabled, PULCHK disabled,
       configuration hash MD5:
       86 BA 57 50 F2 9D 5C 9B 26 00 A9 28 5F 66 2E 89
       data hash MD5: 64K
       A0 FE C3 87 61 8A 6E DA D4 E2 EE C0 FE 95 84 A2>)
(   2,<2013-02-21 20:00:02.878 -0500>,<Administrator>,<X>,<proc1d>,<TOPSPIN 2.1>,
      <Start of raw data processing
       efp LB = 0 FT_mod = 6 PKNL = 1 PHC0 = 0 PHC1 = 0 SI = 32K 
       data hash MD5: 32K
       54 0A C1 39 A6 18 E0 A1 0E 3C 4E 3B 9D 95 5E 1D>)
(   3,<2013-02-21 20:00:03.378 -0500>,<Administrator>,<X>,<proc1d>,<TOPSPIN 2.1>,
      <pk PHC0 = 67.41211 PHC1 = 0 
       data hash MD5: 32K
       14 24 4B C4 B0 68 03 75 7C F7 32 08 68 BF CD 27>)
(   4,<2013-02-21 20:00:03.612 -0500>,<Administrator>,<X>,<proc1d>,<TOPSPIN 2.1>,
      <abs ABSG = 1 
       data hash MD5: 32K
       C6 CF 61 B9 1E 73 C2 A4 84 A7 8A 3A 22 00 94 0A>)
(   5,<2013-02-21 20:00:03.768 -0500>,<Administrator>,<X>,<proc1d>,<TOPSPIN 2.1>,
      <abs ABSG = 2 
       data hash MD5: 32K
       2B CC 14 71 1F E5 E0 CA 94 77 12 43 4E 5D D5 BD>)
(   6,<2013-02-21 20:00:03.909 -0500>,<Administrator>,<X>,<proc1d>,<TOPSPIN 2.1>,
      <abs ABSG = 3 
       data hash MD5: 32K
       81 8F A0 56 97 42 52 BB C2 49 04 7B 6C 1A 88 2E>)
(   7,<2013-02-21 20:00:04.049 -0500>,<Administrator>,<X>,<proc1d>,<TOPSPIN 2.1>,
      <abs ABSG = 4 
       data hash MD5: 32K
       29 AD F8 DC D9 27 85 92 97 A2 20 00 4D D3 CB C8>)
(   8,<2013-02-21 20:00:04.253 -0500>,<Administrator>,<X>,<proc1d>,<TOPSPIN 2.1>,
      <abs ABSG = 5 
       data hash MD5: 32K
       20 D1 BC 32 C0 98 E9 AA 06 16 A5 07 EE 91 A7 D7>)
$$ ##END=
$$ 
$$ $$ hash MD5
$$ $$ D6 41 22 19 A7 EE 6F 9E BE FE E2 DC 24 D9 7A 9D
##$RELAX= 
##$RELAX= 
##$RELAX= 
##$RELAX= 
##$RELAX= 
##$RELAX= 
##$RELAX= 
$$ Bruker specific parameters
$$ --------------------------
##$DU= <E:\>
##$EXPNO= 10
$$ [...]
150 150 150 150 150 150 150 150
##$TP07= 0
##$TPNAME0= <>
##$TPNAME1= <>
##$TPNAME2= <>
##$TPNAME3= <>
##$TPNAME4= <>
##$TPNAME5= <>
##$TPNAME6= <>
##$TPNAME7= <>
##$TPOAL= (0..7)
0.5 0.5 0.5 0.5 0.5 0.5 0.5 0.5
##$TPOFFS= (0..7)
0 0 0 0 0 0 0 0
##$TUNHIN= 0
##$TUNHOUT= 0
##$TUNXOUT= 0
##$USERA1= <user>
##$USERA2= <user>
##$USERA3= <user>
##$USERA4= <user>
##$USERA5= <user>
##$V9= 5
##$VALIST= <valist>
##$VCLIST= <CCCCCCCCCCCCCCC>
##$VD= 0
##$VDLIST= <DDDDDDDDDDDDDDD>
##$VPLIST= <PPPPPPPPPPPPPPP>
##$VTLIST= <TTTTTTTTTTTTTTT>
##$WBST= 1024
##$WBSW= 4
##$XGAIN= (0..3)
0 0 0 0
##$XL= 0
##$YL= 0
##$YMAX_a= 548946
##$YMIN_a= -546771
##$ZGOPTNS= <>
##$ZL1= 120
##$ZL2= 120
##$ZL3= 120
##$ZL4= 120
##$ABSF1= 14.98509
##$ABSF2= -5.573092
##$ABSG= 5
##$ABSL= 3
##$ALPHA= 0
##$AQORDER= 0
##$ASSFAC= 0
##$ASSFACI= 0
##$ASSFACX= 0
##$ASSWID= 0
##$AUNMP= <proc_prof1d_extract_pilot.lims>
##$AXLEFT= 0
##$AXNAME= <>
##$AXNUC= <1H>
##$AXRIGHT= 0
##$AXTYPE= 0
##$AXUNIT= <>
##$AZFE= 0.1
##$AZFW= 0.1
##$BCFW= 0
##$BC_mod= 0
##$BYTORDP= 0
##$COROFFS= 0
##$CY= 15
##$DATMOD= 1
##$DC= 0
##$DFILT= <>
##$DTYPP= 0
##$F1P= 0
##$F2P= 0
##$FCOR= 0.5
##$FTSIZE= 32768
##$FT_mod= 6
##$GAMMA= 0
##$GB= 0
##$INTBC= 1
##$INTSCL= 1
##$ISEN= 128
##$LB= 0
##$LEV0= 0
##$LPBIN= 0
##$MAXI= 10000
##$MC2= 0
##$MEAN= 0
##$ME_mod= 0
##$MI= 0
##$NCOEF= 0
##$NC_proc= -8
##$NLEV= 6
##$NOISF1= 0
##$NOISF2= 0
##$NSP= 0
##$NTH_PI= 0
##$NZP= 0
##$OFFSET= 14.98509
##$PC= 1
##$PHC0= 67.41211
##$PHC1= 0
##$PH_mod= 1
##$PKNL= yes
##$PPARMOD= 0
##$PPDIAG= 0
##$PPIPTYP= 0
##$PPMPNUM= 2147483647
##$PPRESOL= 1
##$PSCAL= 4
##$PSIGN= 0
##$PYNMP= <proc.py>
##$REVERSE= no
##$SF= 400.02
##$SI= 32768
##$SIGF1= 0
##$SIGF2= 0
##$SINO= 400
##$SIOLD= 32768
##$SPECTYP= <>
##$SREGLST= <1H.CDCl3>
##$SSB= 0
##$STSI= 32768
##$STSR= 0
##$SW_p= 8223.68421052631
##$SYMM= 0
##$S_DEV= 0
##$TDeff= 65536
##$TDoff= 0
##$TI= <>
##$TILT= no
##$TM1= 0
##$TM2= 0
##$TOPLEV= 0
##$USERP1= <user>
##$USERP2= <user>
##$USERP3= <user>
##$USERP4= <user>
##$USERP5= <user>
##$WDW= 1
##$XDIM= 32768
##$YMAX_p= 452699009
##$YMIN_p= -766517
##$CURPLOT= <Network HP LaserJet P1505>
##$CURPRIN= <$Network HP LaserJet P1505>
##$DFORMAT= <normdp>
##$LAYOUT= <+/1D_H.xwp>
##$LFORMAT= <normlp>
##$PFORMAT= <normpl>
##$SURQMSG= 1
$$ End of Bruker specific parameters
$$ ---------------------------------
##NTUPLES= NMR SPECTRUM
##VAR_NAME=  FREQUENCY,     SPECTRUM/REAL,   SPECTRUM/IMAG
##SYMBOL=    X,             R,               I
##VAR_TYPE=  INDEPENDENT,   DEPENDENT,       DEPENDENT
##VAR_FORM=  AFFN,          ASDF,            ASDF
##VAR_DIM=   32768,         32768,           32768
##UNITS=     HZ,            ARBITRARY UNITS, ARBITRARY UNITS
##FACTOR=    0.250966925370066, 1,           1
##FIRST=     8223.43324360094, 57664,        -352175
##LAST=      0,             -153691,         -97793
##MIN=       0,             -766517,         0
##MAX=       8223.43324360094, 452699009,    0
$$ Real data points
##PAGE= N=1
##DATA TABLE= (X++(R..R)), XYDATA
$$ [...]
19543g448o2890j36980I2698a60801B2004a38753f7891A34751a62757k93264B43842
$$ -7448 -70338 -207318 92698 -160801 22004 -138753 -67891 134751 -162757 -456021 243842
19531F5888J00555e2614J0287k31469R2075A16023a99589A83374J92892I3490
$$ 65888 166443 -52614 -42327 -273796 -181721 116023 -199589 183374 376266 93490
19520c23901A88575D2672j3263e903j20924f1787n0133A2221M9977b1502k6487
$$ -323901 188575 42672 29409 -5903 -126827 -61787 -111920 12221 62198 -21502 -47989
19509d7989j45220J3152A10036a14180A22872o391a91306q6528j54986K15867
$$ -47989 -193209 -180057 110036 -114180 122872 116481 -191306 -277834 -432820 -216953
19499b16953J07690K5075P26o411a6064l39704a17807M2196o4346b6734C7821
$$ -216953 -109263 -84188 -83462 -89873 -16064 -355768 -117807 -75611 -139957 -26734 37821
19487A48546J68385C8302L47859I2921a34882k39703E4030b70624A00942j5238
$$ 148546 316931 38302 386161 92921 -134882 -374585 54030 -270624 100942 85704
19477H5704i3087G1285e5816j30749B89751a34062G276g5758A49151f0096r8949
$$ 85704 -93087 71285 -55816 -186565 289751 -134062 7276 -75758 149151 -60096 -159045
19466a59045Q423j57710i1929j21241I2964a36396K6136r4691A11153c48814a20186
$$ -159045 -150622 -308332 -91929 -213170 92964 -136396 -110260 -204951 111153 -348814 -120186
19454a32980q4728J01899b425A34975N3241d8898j44676G5603K28236a23492c014
$$ -132980 -217708 -115809 -2425 134975 188216 -48898 -193574 75603 303839 -123492 -3014
19442A03670a42559A86173C0087e5429l63946J80488g2887j39454N0722B86916
$$ 103670 -142559 186173 30087 -55429 -419375 -238887 -72887 -212341 -161619 286916
19431b5865B19619i6321H0194O1311a16230d3575A39970a39225A71297E1475a1743
$$ -25865 219619 -96321 80194 141505 -116230 -43575 139970 -139225 171297 51475 -11743
19419B258b06347C9939a98975m7268J4898f1589b336p1508A55656b84918D6935
$$ 2258 -206347 39939 -198975 -246243 -231345 -61589 -2336 -73844 155656 -284918 46935
19407b92467A67627c37235J53531h7122A17925g74l447j56896A36694a35166m6695
$$ -292467 167627 -337235 -183704 -87122 117925 -774 -4221 -161117 136694 -135166 -181861
19396a81861j19863o2801A98394b68478a04437k26792a08508A50659l3049a45763
$$ -181861 -301724 -364525 198394 -268478 -104437 -331229 -108508 150659 117610 -145763
19385e7660M425h570C2500a23886j00173C01518h7822C25654j32844L7208b45287
$$ -57660 -53235 -8570 32500 -123886 -224059 301518 -87822 325654 192810 230018 -245287
19373h7264d976I4458b0782q515j16692a33j26020C01793a60127d0983j33251
$$ -87264 -4976 94458 -20782 -29297 -145989 -133 -126153 301793 -160127 -40983 -174234
19362a74234P7781j20347Q4363A01497m2669a37486b8204k58201E194b30633g7907
$$ -174234 -96453 -216800 -132437 101497 58828 -137486 -28204 -286405 5194 -230633 -77907
19350a17039M9718r0132B50523a87479k17384J28671A50445c99593j280J90212
$$ -117039 -67321 -157453 250523 -187479 -404863 -276192 150445 -399593 -400873 -210661
19340b10661A6523Q7623N2639n3947b68918J07224D705b51542f4011A91774k4481
$$ -210661 16523 104146 156785 102838 -268918 -161694 4705 -251542 -64011 191774 167293
19329A67293a60407L5624l9795L5312N0567A10061J4804b22410F5692K14373A13600
$$ 167293 -160407 -124783 -164578 -129266 -78699 110061 124865 -222410 65692 280065 113600
19317a16369B57833c06354j14046J06744K9684e0048k97229a40317I393g4195
$$ -116369 257833 -306354 -420400 -313656 -283972 -50048 -347277 -140317 9393 -74195
19306A8335a9273k13321n5428B21674c6827B87290a20235A28736n5684b56876
$$ 18335 -19273 -232594 -288022 221674 -36827 287290 -120235 128736 73052 -256876
19295f4238n6388A80149a01127j55884P6401A33119a86026A2987P5904d8124B1850
$$ -64238 -120626 180149 -101127 -257011 -180610 133119 -186026 12987 88891 -48124 21850
19283c38282J31710P2387A15358K20850A49172c4377A00139b70370b4667j75651
$$ -338282 -206572 -134185 115358 336208 149172 -34377 100139 -270370 -24667 -200318
19273b00318m9314D27203e7669o3439B40592A18020a18217K6397A66699D7811
$$ -200318 -249632 427203 -57669 -121108 240592 118020 -118217 -91820 166699 47811
19262A29386h0840p7558j3700h4143j14593d8978A17462b62047b1036F6817k0418
$$ 129386 -80840 -158398 -172098 -84143 -198736 -48978 117462 -262047 -21036 66817 46399
19251D6399K23879j05308L7597h3544C59238b12268J2950m5469f2256m1581q847
$$ 46399 270278 164970 202567 -83544 359238 -212268 -199318 -244787 -62256 -103837 -112684
19240a12684e2556q940j32976m5417n6502f8359A74315o3810c86706a54107A37252
$$ -112684 -52556 -61496 -194472 -239889 -296391 -68359 174315 110505 -386706 -154107 137252
19228f9046F5081b37059A98484D0511i8279A2855g140A56673d57683B0067b80609
$$ -69046 65081 -237059 198484 40511 -98279 12855 -7140 156673 -457683 20067 -280609
19216F357J48305a14491A38101L23159b84672D8248K5811a85152F0986h9883j62272
$$ 6357 154662 -114491 138101 461260 -284672 48248 74059 -185152 60986 -89883 -252155
19205b52155e5367A88361q4495b53649F9361a84765A01505c4269r2115A11032
$$ -252155 -55367 188361 103866 -253649 69361 -184765 101505 -34269 -126384 111032
19194i8217l77336C2580l870j2898K8005d214m54220G4566i0425A1249a56792
$$ -98217 -475553 32580 28710 15812 43817 -4214 -458434 74566 -90425 11249 -156792
19182b20213d4160B56123g7393j89468h6282j27337C3979A3491h609m9908j49343
$$ -220213 -44160 256123 -77393 -266861 -86282 -213619 33979 13491 -8609 -58517 -207860
19171b07860B68759e1865B8041K54904d03976f2687L355A86306a34778C6473K9040
$$ -207860 268759 -51865 28041 282945 -403976 -62687 -59332 186306 -134778 36473 65513
19160F5513a6046J65j23582d7550M717A63081b73048A93786a94383m7744k73185
$$ 65513 -16046 -15881 -139463 -47550 -42833 163081 -273048 193786 -194383 -242127 -515312
19149e15312a29044A0451i8744q124a3669j57601c1730E3516K8003a65895m317
$$ -515312 -129044 10451 -98744 -106868 -13669 -171270 -31730 53516 81519 -165895 -170212
19138a70212K5740a4990q4398p9618D0256a19655j43178M4994c3178F8217A833
$$ -170212 -144472 -14990 -99388 -179006 40256 -119655 -262833 -217839 -33178 68217 1833
19126i6788c7864j61576D25360b75653B1747J918b12826f0644D996e7857j51912
$$ -96788 -37864 -199440 425360 -275653 21747 23665 -212826 -60644 4996 -57857 -209769
19115b09769i1293j3448A50631b50019b0097j17649l4314p2494C0739a30500j40368
$$ -209769 -91293 -104741 150631 -250019 -20097 -137746 -172060 -244554 30739 -130500 -270868
19104b70868i531j19195j81248d393B06052b3350D169a24998A09705K8061a47846
$$ -270868 -9531 -128726 -309974 -4393 206052 -23350 4169 -124998 109705 137766 -147846
19092C9357b37550K2655G7866L4995A1974d4513J9149A8459a50888k65145h8705
$$ 39357 -237550 -214895 77866 112861 11974 -44513 -25364 18459 -150888 -416033 -88705
19080A13233B1880J54217c14452n129a51904q66o5068M9709B4611i3513K1070
$$ 113233 21880 176097 -314452 -319581 -151904 -152770 -217838 -168129 24611 -93513 -72443
19069g2443e168k61489A45263e5965d555E77J2101i1323b9839o1430k75803a39561
$$ -72443 -5168 -266657 145263 -55965 -4555 577 12678 -91323 -29839 -91269 -367072 -139561
19056d70105b1444l92652a53158f2974I9000C027b94458R5627F8075a51738M1457
$$ -470105 -21444 -414096 -153158 -62974 99000 3027 -294458 -198831 68075 -151738 -110281
19045a10281J4405A36004c43151A92909r27a23039D1327K51454j12381B1321J90778
$$ -110281 -95876 136004 -343151 192909 191982 -123039 41327 292781 180400 21321 212099
19034B12099e9991K9872j36789l3431c7987B70655a54805D0612M3006c90030a02336
$$ 212099 -59991 -30119 -166908 -200339 -37987 270655 -154805 40612 83618 -390030 -102336
19022b73994A07332K52956G2364c23053C2759i6963J5935B99791d12795D2009
$$ -273994 107332 360288 72364 -323053 32759 -96963 -81028 299791 -412795 42009
19011a73680H3956m0752J81169j07181b53071a18845A84278b11426f5562n8558
$$ -173680 83956 43204 224373 117192 -253071 -118845 184278 -211426 -65562 -124120
19001a24120C7223c10554A11140h2846p8758d4298k02957a16885b3736I9337i3724
$$ -124120 37223 -310554 111140 -82846 -161604 -44298 -247255 -116885 -23736 99337 -93724
18989a61928c8411A44601h4626A9242e2084k12436B89476a44199f2513R770E8537
$$ -161928 -38411 144601 -84626 19242 -52084 -264520 289476 -144199 -62513 -52743 58537
18977b38189B14835a22834E1592a36641j08682k5927M3060R7841A26380L2558
$$ -238189 214835 -122834 51592 -136641 -245323 -271250 -228190 -130349 126380 158938
18967A58938a22178n999j57131H6279l6536K01138H055P5423J35806d0207o4083
$$ 158938 -122178 -128177 -285308 86279 49743 250881 8055 83478 219284 -40207 -104290
18956a04290H0994c00793O0956p1942a138k09858J7033B68662i6373B11112d39014
$$ -104290 80994 -300793 -239837 -311779 -1138 -210996 -193963 268662 -96373 211112 -439014
18944e4072H1410a62482B83244d4450j04391R805G4812a18662A48304b7521A84822
$$ -54072 81410 -162482 283244 -44450 -148841 -139036 74812 -118662 148304 -27521 184822
18932b38492B50494j23132a84754n1137E4441b79753F5565i289B8520G777K13149
$$ -238492 250494 127362 -184754 -235891 54441 -279753 65565 -9289 28520 7777 220926
18921B20926a03415E3718A7321K8021e6829k79548H1623a54925L1903F7473f8665
$$ 220926 -103415 53718 17321 45342 -56829 -336377 81623 -154925 -123022 67473 -68665
18909F9073o713J39237f8569p4415r9895C820c6259l4799A32437c9016D4014a36358
$$ 69073 62360 201597 -68569 -142984 -242879 3820 -36259 -71058 132437 -39016 44014 -136358
18896a40146H2350O9046m0144i0574L7078k64749B21322F8726R2719K1437G6500
$$ -140146 82350 151396 111252 -90574 -53496 -318245 221322 68726 161445 182882 76500
18884a32984C2846j81J44162b1290M673n5844p9068H397b61072h3201l2768M1416
$$ -132984 32846 32665 176827 -21290 -16617 -72461 -151529 8397 -261072 -83201 -115969 -74553
18872g4553r3984B9064c94387A74878a17701B05875f9595H3442a68999n8183K8668
$$ -74553 -168537 29064 -394387 174878 -117701 205875 -69595 83442 -168999 -227182 -198514
18861a98514B45671A9374K28470b58515b6834j98947o7228d6257l25275c1884
$$ -198514 245671 19374 247844 -258515 -26834 -225781 -293009 -46257 -371532 -31884
18850a46804A79454b40878G6700g5389D9526J14244n1718b00524B05776d9235
$$ -146804 179454 -240878 76700 -75389 49526 163770 112052 -200524 205776 -49235
18839c53530g3859k17648i720A00378b94874A47434M17A1003a99246P5899b8235
$$ -353530 -73859 -291507 -9720 100378 -294874 147434 147851 11003 -199246 -123347 -28235
18827b43310g2022A72728a36828G0102m87g9477K8427o8736r6173m6932f9130
$$ -243310 -72022 172728 -136828 70102 69615 -79477 -51050 -119786 -215959 -262891 -69130
18815C89403b39416A43717i3496a9865A39147P494m2637M35461e1031q893j40852
$$ 389403 -239416 143717 -93496 -19865 139147 146641 104004 539465 -51031 -59924 -200776
18804b00776J3914B02741J12997E9877f6684E2325b7629m220A58767M9980D3791
$$ -200776 -186862 202741 315738 59877 -66684 52325 -27629 -31849 158767 208747 43791
18792i0016d3855l20131a34373D56479a03502j96654C09781f8276j7440a3704
$$ -90016 -43855 -363986 -134373 456479 -103502 -300156 309781 -68276 -85716 -13704
18781f0707n8358F4687d7656l9611j53467M1317a9301A29022c4117j80610r8577
$$ -60707 -119065 64687 -47656 -87267 -240734 -199417 -19301 129022 -34117 -214727 -313304
18770c13304A86735a58386H5872b2169A51029R1943a61348l7996g977j97707r0371
$$ -313304 186735 -158386 85872 -22169 151029 242972 -161348 -199344 -7977 -205684 -296055
18759b96055B17876b17144A05233a50502L8936C1268N1524c12017n9756F5078
$$ -296055 217876 -217144 105233 -150502 -111566 31268 82792 -312017 -371773 65078
18748A40802b34486R3857L5664j68512f4009A5238a43361F7747c15650J9550a36061
$$ 140802 -234486 -140629 -104965 -273477 -64009 15238 -143361 67747 -315650 -296100 -136061
18736D6483a88862i0837A9523k344a04379F700h8099n9978d7922A11954B600L4846
$$ 46483 -188862 -90837 19523 17179 -104379 6700 -88099 -148077 -47922 111954 2600 37446
18724C7446c00572A475c3719A5995a15589C6317J66142c8436k12619A63956g4053
$$ 37446 -300572 1475 -33719 15995 -115589 36317 202459 -38436 -251055 163956 -74053
18712c26039e9871p2725q3407D5088a32051b0722G6580J6147j8932Q7587b65925
$$ -326039 -59871 -132596 -216003 45088 -132051 -20722 76580 92727 73795 161382 -265925
18700f0147A89161B3500K9253c28813a07911A84512a50736b9476k71011c9223
$$ -60147 189161 23500 52753 -328813 -107911 184512 -150736 -29476 -300487 -39223
18689F8353J05478a96782k8819H8807a46073B3678M4441a55306d4788k1736A5117
$$ 68353 173831 -196782 -225601 88807 -146073 23678 68119 -155306 -44788 -66524 15117
18677a49528D5590J98081i9526L952A31711b35593g9344A88167d29773J75335
$$ -149528 45590 243671 -99526 -95574 131711 -235593 -79344 188167 -429773 -254438
18667b54438J14114C22599b51306i4449A5158a68451e2868j86689A89945i8953
$$ -254438 -140324 322599 -251306 -94449 15158 -168451 -52868 -239557 189945 -98953
18656b93842A04636c3564j44476q9824d9156E5916i8320D3232Q0381a20424G7505
$$ -293842 104636 -33564 -178040 -267864 -49156 55916 -98320 43232 123613 -120424 77505
18644c12050K5399P7469Q4702E6475f0222i772j94450D8889a16245i75A15570
$$ -312050 -286651 -209182 -124480 56475 -60222 -9772 -204222 48889 -116245 -975 115570
18632a78193J5697d5384r9349B69491a93051A49758b63611m8077l6655A061f5260
$$ -178193 -162496 -45384 -144733 269491 -193051 149758 -263611 -311688 -348343 1061 -65260
18620A9816c00172J00514O8662A59288a96377I9933a33076k88152b03790F5728
$$ 19816 -300172 -199658 -130996 159288 -196377 99933 -133076 -421228 -203790 65728
18609c88120J61557H7942a39064B30963B4817d22212k1389e3433r4667A50131
$$ -388120 -226563 87942 -139064 230963 24817 -422212 -443601 -53433 -148100 150131
18598C9543b9078C79255a59809H5904h9479b9420j21789E9717a42461C8637N6017
$$ 39543 -29078 379255 -159809 85904 -89479 -29420 -151209 59717 -142461 38637 94654
18587I4654j162K7043d43382D0073J3112R4502d78546a4450j58801j893e076l2560
$$ 94654 93492 120535 -443382 40073 53185 147687 -478546 -14450 -173251 -175144 -5076 -37636
18575c7636B22203B2427L1003c5456H0431A2236i9488C1272f8848A28851a81176
$$ -37636 222203 22427 53430 -35456 80431 12236 -99488 31272 -68848 128851 -181176
18563b06138J7146j91877A85152e4760k4935B7592d60929C4853q46c81415M1161
$$ -206138 -188992 -380869 185152 -54760 -79695 27592 -460929 34853 34007 -381415 -340254
18552c40254A41638a23755M3163B70629g8210r3886A02480A7736K7801d66933
$$ -340254 141638 -123755 -80592 270629 -78210 -172096 102480 17736 45537 -466933
18541d4999B3378K8584c20888J48353b3691r2880E5276J74640m2480j1083H2703
$$ -44999 23378 51962 -320888 -172535 -23691 -116571 55276 229916 187436 176353 82703
18529c4866A7562k837a32240k17486d717A61735e5049A20789j8684m7299a73024
$$ -34866 17562 14725 -132240 -349726 -4717 161735 -55049 120789 102105 54806 -173024
18517d03724B13698M0005a50872A46804c71616Q6022e1481j11986O9511A25796
$$ -403724 213698 253703 -150872 146804 -371616 -285594 -51481 -163467 -93956 125796
18506a04656B8865b30635K3198j03347c7763l9462j26218k14272C1631a35837
$$ -104656 28865 -230635 -207437 -310784 -37763 -77225 -203443 -417715 31631 -135837
18495a76337q6298A32630a05154k47450h419I5487b15793A41391b9250j5376B08790
$$ -176337 -262635 132630 -105154 -352604 -8419 95487 -215793 141391 -29250 -44626 208790
18483h824k6794q3907C96178j51265h7571n6751I8134m0134a06964j24287C4314
$$ -8824 -35618 -119525 396178 244913 -87571 -144322 98134 58000 -106964 -231251 34314
18471c30079A66655F6656g7813A1506m369h2152B38863N9342N0256a64061g3687
$$ -330079 166655 66656 -77813 11506 7137 -82152 238863 298205 348461 -164061 -73687
18459a51430j5851A52995a89285j7510g1727K3525C44282b15118N8710f174k65757
$$ -151430 -167281 152995 -189285 -206795 -71727 -48202 344282 -215118 -156408 -6174 -271931
18448b71931A0382K7002J75093a75107L2695l5681e3239I7866c54102e2654j14513
$$ -271931 10382 37384 212477 -175107 -142412 -178093 -53239 97866 -354102 -52654 -167167
18437a67167K8780k1196B01795b52126A5858j961J97460b39610F7391J61586a39688
$$ -167167 -138387 -159583 201795 -252126 15858 13897 211357 -239610 67391 228977 -139688
18425a33746m5017q0144B15838d96676i4888B66185P2014a34440A12319K9695
$$ -133746 -178763 -258907 215838 -496676 -94888 266185 338199 -134440 112319 142014
18415A42014b25934J11058j88468n2246B01383a08265A82695H032O5616e5752
$$ 142014 -225934 -114876 -303344 -355590 201383 -108265 182695 8032 73648 -55752
18404C8295L2332e6137C22622a83601j35354i2122C39514a5390j399C5629a91297
$$ 38295 70627 -56137 322622 -183601 -318955 -92122 339514 -15390 -16789 35629 -191297
18392e2553A9702N4829a87703C28365C0664I02c3842J1747r2691j67556F9653
$$ -52553 19702 74531 -187703 328365 30664 902 -33842 -22095 -114786 -282342 69653
18380c45210b0641I643a23806G9651a60152h549B43271b36330J07947j68528I1116
$$ -345210 -20641 9643 -123806 79651 -160152 -8549 243271 -236330 -128383 -296911 91116
18368B57572B8039K0298a33761B14449a7984j7434E863b3933o8428l3964l2877
$$ 257572 28039 48337 -133761 214449 -17984 -35418 5863 -23933 -92361 -126325 -159202
18357a59202N3425H0481b54370J03047K7203p160o2017j8638E6384L8870k3901
$$ -159202 -105777 80481 -254370 -151323 -124120 -131280 -193297 -211935 56384 95254 71353
18346G1353d41437B19855c17985A64823E8582a5556p5467k2603q7726j39818A12122
$$ 71353 -441437 219855 -317985 164823 58582 -15556 -91023 -113626 -201352 -341170 112122
18334b0539C9163b33433c5862E2064k4304i5432b6596j01324j04590A54224a26464
$$ -20539 39163 -233433 -35862 52064 27760 -95432 -26596 -127920 -232510 154224 -126464
18322c16022H5497f3078B0355b08124j30775A3977O822P5086J98218j12513F2382
$$ -316022 85497 -63078 20355 -208124 -338899 13977 20799 95885 294103 181590 62382
18310c41624O297g9834j86486a00238d348I3209c9605n1736l98661G3520i5109
$$ -341624 -335327 -79834 -266320 -100238 -4348 93209 -39605 -91341 -490002 73520 -95109
18298B38968c2103G2869l5900a41005K915E4276g9289B52677c61687B619P4452
$$ 238968 -32103 72869 36969 -141005 -138090 54276 -79289 252677 -361687 2619 77071
18287G7071e2712k8452B52210G4269a83530G7712d92899h9159A27697d598j26038
$$ 77071 -52712 -81164 252210 74269 -183530 77712 -492899 -89159 127697 -4598 -130636
18276a30636E2740e1346A7737J4203J81387a46841c8206B36591b55202P2269o1885
$$ -130636 52740 -51346 17737 31940 213327 -146841 -38206 236591 -255202 -182933 -244818
18265b44818J13166n3155A68159b51133A33613F456c2680F2235c401l9143F1289
$$ -244818 -131652 -184807 168159 -251133 133613 6456 -32680 62235 -3401 -42544 61289
18253e21643G7480B8939a36207o7411j64864B05343h395l93203a06766B40477
$$ -521643 77480 28939 -136207 -203618 -368482 205343 -8395 -401598 -106766 240477
18242f6739C0800J74444D7777R4119a79337C8625P7696a71508n6904O8850D8063
$$ -66739 30800 205244 47777 141896 -179337 38625 116321 -171508 -228412 -159562 48063
18230c58422A28244k944e3683C7121d084j48872G0739h8856A04457n61a86956
$$ -358422 128244 125300 -53683 37121 -4084 -152956 70739 -88856 104457 103896 -186956
18218d061k8041j75803c5655k8865A28460c0959j66703B2798a70010A1613b69541
$$ -4061 -32102 -207905 -35655 -64520 128460 -30959 -197662 22798 -170010 11613 -269541
18206d0712j58787E7676b59520I7258h3226C5300a21642l0222A05480a24616A6008
$$ -40712 -199499 57676 -259520 97258 -83226 35300 -121642 -151864 105480 -124616 16008
18194A69138a72044j28908a08608B21048G0726f9710A2808a57524e8117J6025
$$ 169138 -172044 -300952 -108608 221048 70726 -69710 12808 -157524 -58117 -42092
18184d2092A37585f7250o7623f6336C3491J58929b50121A9723b8572A05774b51073
$$ -42092 137585 -67250 -134873 -66336 33491 192420 -250121 19723 -28572 105774 -251073
18172B33034a5364A80377e329l31170g5740o7765N2124L9879F931P0387R3062
$$ 233034 -15364 180377 -5329 -336499 -75740 -143505 -91381 -51502 6931 77318 170380
18161A70380i8433B01976d0360j77469M807D2744j1705f3438A8671J31071C4773
$$ 170380 -98433 201976 -40360 -217829 -213022 42744 31039 -63438 18671 149742 34773
18149d8955l5316r0118l7298A50485h7286l25118F6433a9428j52228N9944A08199
$$ -48955 -84271 -174389 -211687 150485 -87286 -412404 66433 -19428 -171656 -111712 108199
18137h5825k28068a03891e042j36260d9355A6119b61091k7400D17382j42193p158
$$ -85825 -313893 -103891 -5042 -141302 -49355 16119 -261091 -288491 417382 275189 268031
18126B68031c9999j00016a5783A24132A9188L37948E2305a68895A87293A038L2503
$$ 268031 -39999 -140015 -15783 124132 19188 357136 52305 -168895 187293 1038 33541
18115C3541a68774b1474o7241j1214B85805i4735k78525n0870A07910E1054j0998
$$ 33541 -168774 -21474 -88715 -99929 285805 -94735 -373260 -424130 107910 51054 40056
18104D0056d9450j03240c4891q8900H2316a03721A57255a56966K7738j3518B64158
$$ 40056 -49450 -152690 -34891 -123791 82316 -103721 157255 -156966 -129228 -142746 264158
18092b87909I6271b67162J32394A44574B7552J03118Q1755b34991d9317j46705
$$ -287909 96271 -267162 -134768 144574 27552 130670 212425 -234991 -49317 -196022
18082a96022d5489A214K5810P267d3950j11783l6929j15901q1048a85079j83646
$$ -196022 -45489 1214 27024 34291 -43950 -155733 -192662 -308563 -389611 -185079 -368725
18071c68725f1751l3331B74609A37196a88347A09948L5366n0287L2121d47l99299
$$ -368725 -61751 -95082 274609 137196 -188347 109948 145314 95027 127148 -447 -399746
18060c99746a28034j25024D63J5955a6989r4758j26956n9694J31525h190k26820
$$ -399746 -128034 -253058 463 16418 -16989 -111747 -238703 -298397 -166872 -8190 -235010
18049b35010H752b76516e0746C71268j84797j5673n7365a26552d0225H6419a64736
$$ -235010 8752 -276516 -50746 371268 186471 170798 113433 -126552 -40225 86419 -164736
18037C0712J24548a62179E1776I456J39581a10615b5q2299A48848R416a40411
$$ 30712 155260 -162179 51776 9456 149037 -110615 -25 -82324 148848 158264 -140411
18025b76293P9259j03574B8511K0388O5872b75007B13733B8929b19802g5703C43825
$$ -276293 -197034 -300608 28511 48899 114771 -275007 213733 28929 -219802 -75703 343825
18013b70088E10369c33849a01979A20503l1793M180J15823a9775k35951B48003
$$ -270088 510369 -333849 -101979 120503 88710 92890 208713 -19775 -255726 248003
18002d5002A55314m3569a0619A88880c8442n0941e659p7522A0855c66291D2067
$$ -45002 155314 111745 -10619 188880 -38442 -89383 -5659 -83181 10855 -366291 42067
17990B548a12878n125A00334a17447A6209e50m701A03107d2571k8440m7171N4426
$$ 2548 -112878 -118003 100334 -117447 16209 -550 -5251 103107 -42571 -71011 -118182 -63756
17978f3756G6573L0815P8610a6525k37866J3617a7454B3450h1824A06159R3135
$$ -63756 76573 107388 185998 -16525 -254391 -240774 -17454 23450 -81824 106159 199294
17967A99294L1852j5961n0314a15126A73395J0480q0807B1073D871J73738E1733
$$ 199294 231146 215185 164871 -115126 173395 183875 103068 21073 4871 178609 51733
17955b08466e0210p8664B09336I63d5414n014j811j63820I2409e1748B22026b18276
$$ -208466 -50210 -128874 209336 963 -45414 -50428 -52239 -216059 92409 -51748 222026 -218276
17942B46686c44182f7541K1104H9430a48329D007a40903j18706A53763F8489c23668
$$ 246686 -344182 -67541 -46437 89430 -148329 4007 -140903 -259609 153763 68489 -323668
17930a37467r6904a6597Q081o2037A29410m9335b180k7282J3073n1098A15277
$$ -137467 -234371 -16597 -8516 -70553 129410 80075 -2180 -29462 -16389 -67487 115277
17918C6008b51553A99366f3011k9787E5423a02159E1135b7565k29835B77148a03995
$$ 36008 -251553 199366 -63011 -92798 55423 -102159 51135 -27565 -257400 277148 -103995
17906a89831B00278m8816a76197f9243B3873P42d13702d5274H4336J18597C696
$$ -189831 200278 151462 -176197 -69243 23873 24615 -413702 -45274 84336 202933 3696
17894C32251j38932d9895j59709D7888L0512J4926b35397d8737D758a72697F3999
$$ 332251 193319 -49895 -209604 47888 78400 93326 -235397 -48737 4758 -172697 63999
17882c84978A44439a2394j48297C9904J38502c60753c6820A7165d07145e3671
$$ -384978 144439 -12394 -160691 39904 178406 -360753 -36820 17165 -407145 -53671
17871a78715k25318k8171H8809a47288p7890C1018a27485a5495C83653e9361j5946
$$ -178715 -404033 -432204 88809 -147288 -225178 31018 -127485 -15495 383653 -59361 -75307
17860g5307A0401P8351a85435A9867J26117d24178B34651a30243l1978A31K22887
$$ -75307 10401 88752 -185435 19867 145984 -424178 234651 -130243 -162221 131 223018
17849B23018b9033j36294a3247p5885J4834A40576i693k6031E0267b38628C3258
$$ 223018 -29033 -165327 -13247 -89132 -74298 140576 -9693 -35724 50267 -238628 33258
17837e026j40712A33318a75690B65725c5960j14237A50871i878A74801e5679n4782
$$ -5026 -145738 133318 -175690 265725 -35960 -150197 150871 -9878 174801 -55679 -110461
17826a10461B778b63660A5416a57187G7646J9453f4263I4822a4323q5911k5460
$$ -110461 2778 -263660 15416 -157187 77646 97099 -64263 94822 -14323 -100234 -125694
17815a25694B1462e0666A99288E2134f9113j65852i2295j05708A15635f08596
$$ -125694 21462 -50666 199288 52134 -69113 -234965 -92295 -198003 115635 -608596
17804A65794P5996A15147h0493A22642i447F2572O12B0720L5600J00558N5087
$$ 165794 241790 115147 -80493 122642 -9447 62572 63184 20720 56320 156878 211965
17793B11965a29193j9119A71078h7728j24785M5770B66847E0286b22843m6789
$$ 211965 -129193 -148312 171078 -87728 -212513 -166743 266847 50286 -222843 -269632
17783b69632A47316a94458F4843h0586j7287l7163A82230o4102i4518A32086e5265
$$ -269632 147316 -194458 64843 -80586 -97873 -135036 182230 118128 -94518 132086 -55265
17771a063j09378B49481A1358L33253A49833E7578J11118n8285R4475G6092f2853
$$ -1063 -110441 249481 11358 344611 149833 57578 168696 110411 204886 76092 -62853
17759F7849k8149b38667A07418k5738d4981j31888A24348a41537N569A77042c8687
$$ 67849 39700 -238667 107418 81680 -44981 -176869 124348 -141537 -135968 177042 -38687
17747h6920A69906L02183f8151g858G3158i9539B9168a3558G5799a5084F6163
$$ -86920 169906 472089 -68151 -7858 73158 -99539 29168 -13558 75799 -15084 66163
17735A67647c10972A04186J93367b49955B12559a1941j71751n1842F1544J50963
$$ 167647 -310972 104186 297553 -249955 212559 -11941 -183692 -235534 61544 212507
17725B12507b83471F475h0653o5342C06143l222a19544B1264J82082c5987E586
$$ 212507 -283471 6475 -80653 -145995 306143 302921 -119544 21264 203346 -35987 5586
17713b2079l4118n0730A36538a76421A75711p6355l6915c12495J05968b9558l40129
$$ -22079 -56197 -106927 136538 -176421 175711 99356 62441 -312495 -206527 -29558 -369687
17702c69687B0027K1594K75058A5064h9431o1185m3016R449j13427B71685a45388
$$ -369687 20027 41621 316679 15064 -89431 -150616 -193632 -184183 -297610 271685 -145388
17690A88317c5283j95056B87007C9576J35820i6643q4079A96056c56504B71941
$$ 188317 -35283 -230339 287007 39576 175396 -96643 -180722 196056 -356504 271941
17679b2726j63574N6781N5231A13974m4799R6984b31603D3450c22992A45925i6617
$$ -22726 -186300 -129519 -74288 113974 69175 166159 -231603 43450 -322992 145925 -96617
17667A2914c51469B887K31430j780A14760a20763J6737r739F0286b61284B22847
$$ 12914 -351469 2887 234317 232537 114760 -120763 -104026 -113765 60286 -261284 222847
17655a53417A57781O4453j1970A03460Q3424j929b52911G8764l297c6788A50108
$$ -153417 157781 222234 210264 103460 186884 184955 -252911 78764 75467 -36788 150108
17643G3785o787J1473b05335a3271j96490H8142k0789B5509e5589E1587K0332
$$ 73785 66998 78471 -205335 -13271 -209761 88142 67353 25509 -55589 51587 71919
17632G1919A694J17347E7084B3601a03391H7053R7910l9149M9522o2470a18447
$$ 71919 1694 119041 57084 23601 -103391 87053 184963 145814 195336 132866 -118447
17620G2636M20018c8780B14583a45314M0886A70494c38836G7701R8605C3899b34461
$$ 72636 492654 -38780 214583 -145314 -104428 170494 -338836 77701 176306 33899 -234461
17608A43298b16785A03104J73788A4041a96003B54891f4798k81852F1360h1769
$$ 143298 -216785 103104 276892 14041 -196003 254891 -64798 -346650 61360 -81769
17597b11943B29044c7182D1936j3953a15023M1020B17745g5570j83063a3085n1055
$$ -211943 229044 -37182 41936 27983 -115023 -74003 217745 -75570 -258633 -13085 -64140
17586f4140A61243b8181C08413M2633H0057a9495C2136J6521K2712a1935A24495
$$ -64140 161243 -28181 308413 351046 80057 -19495 32136 48657 71369 -11935 124495
17574A38379a52338H5375j5176M0521L0910B9305a58656J6476f6580m9605C98876
$$ 138379 -152338 85375 70199 110720 141630 29305 -158656 -142180 -66580 -116185 398876
17562A22790P3328m9414c16671a01872A79236J39156b36491A63162J32630A06842
$$ 122790 196118 146704 -316671 -101872 179236 318392 -236491 163162 295792 106842
17551h9662A14373K40738j10842r2007a88913A50890a72111D5807a84988E1074
$$ -89662 114373 355111 244269 152262 -188913 150890 -172111 45807 -184988 51074
17540a1743o5183L3051H0718e3242a1688B65024d3354r298A94759J46823G5208
$$ -11743 -76926 -43875 80718 -53242 -11688 265024 -43354 -52652 194759 341582 75208
17528c9499A39876l7543A097a0154C1812m562J46649L4119a22521B58403j8908
$$ -39499 139876 102333 1097 -10154 31812 27250 173899 208018 -122521 258403 239495
17517B39495m3486L9681Q130a53782L5868A3789Q131L48613r6594C8701R1154
$$ 239495 196009 235690 243820 -153782 -117914 13789 21920 370533 273939 38701 129855
17506A29855L928n3943R88a530A85998o2058A7512J47424K02768j16004E1103
$$ 129855 133783 79840 80828 -1530 185998 123940 17512 164936 367704 251700 51103
17494B97978j41730J29933b62218C51587b21301b3203C89497I817M7856J14698
$$ 297978 156248 286181 -262218 351587 -221301 -23203 389497 9817 57673 172371
17484A72371l2247Q04J1231J35258F7420J10263K8841a06476A59445J06791b29355
$$ 172371 140124 140928 152159 287417 67420 177683 206524 -106476 159445 266236 -229355
17472A65707D148j35K01904J18462a41153J3858m3727B86142C6999M50801B13765
$$ 165707 4148 4013 205917 324379 -141153 -127295 -171022 286142 36999 487800 213765
17460A50544L9456R7103a76521g9513D4022L33725A22338O0356E3459D035N70824
$$ 150544 190000 287103 -176521 -79513 44022 377747 122338 182694 53459 4035 574859
17449E74859A00816l4526J65175A01434P9737d5742B53473r1656J71445N4258
$$ 574859 100816 66290 231465 101434 181171 -45742 253473 161817 333262 387520
17439C87520A55158M01660E3038K81549h2289A73087A329a92767I9800d9587k80164
$$ 387520 155158 556818 53038 334587 -82289 173087 1329 -192767 99800 -49587 -329751
17428c29751B37993J4305p7841N9364M11503B77779J56361j34548f6319B71572
$$ -329751 237993 252298 174457 233821 645324 277779 434140 299592 -66319 271572
17417B74855r4043J11298A01648L15912o8283g4338B35263j2895n3398k2889Q030
$$ 274855 180812 292110 101648 417560 349277 -74338 235263 222368 168970 146081 154111
17406A54111J11363F233K19768f5593C30415r9027J44779a9514B39474l3757r2558
$$ 154111 265474 6233 226001 -65593 330415 231388 376167 -19514 239474 205717 113159
17395A13159P0161A1625K92963k9103K21256A66416J45553j55945F2283I667J77563
$$ 113159 183320 11625 304588 275485 496741 166416 311969 156024 62283 9667 187230
17384A87230B667J35199J80416M7340E1668J3457J95785J97391E0158L1287J53763
$$ 187230 2667 137866 318282 365622 51668 65125 260910 458301 50158 81445 235208
17373B35208j11163K11024l519G7857h7425B08580n9944K44409d66423A5565J48770
$$ 235208 124045 335069 331550 77857 -87425 208580 148636 393045 -466423 15565 164335
17362A64335J05072q0358H5997B512P9688K23430d093A5182a0703m1878E8188
$$ 164335 269407 189049 85997 2512 82200 305630 -4093 15182 -10703 -52581 58188
17350A96685O6739A285M2567J01395J8703p342j7276J362b0211B19270K11359
$$ 196685 263424 1285 43852 145247 163950 156608 139332 140694 -20211 219270 430629
17339D30629n0529r1232b05943M9810E5396J96334C3788J96235Q800J858O5527
$$ 430629 380100 288868 -205943 -156133 55396 251730 33788 230023 238823 240681 306208
17328C06208a48939A89123M25614G0825J78295Q162d1471B92514j14706N1792
$$ 306208 -148939 189123 614737 70825 249120 257282 -41471 292514 177808 229600
17318B29600I5743b65274C52145I923J9690J62653p7960K28222A1705J98110b30988
$$ 229600 95743 -265274 352145 9923 29613 192266 114306 342528 11705 209815 -230988
17306A56561h5992D4209P588N20660k18306E1640Q5294n2319N8827j2046J02485
$$ 156561 -85992 44209 51797 572457 354151 51640 136934 84615 143442 131396 233881
17295B33881a03587C30888n9009e9974A40610N2336m234J1743k5842N2176N2403
$$ 233881 -103587 330888 271879 -59974 140610 192946 188712 200455 174613 226789 279192
17284B79192q5303J05087J1424j05716E7761A3418a72418C58626E1586N753A7509
$$ 279192 193889 298976 310400 204684 57761 13418 -172418 358626 51586 57339 17509
17272C52143j50152J17772D9046K72806E5401K66292E1959n323J08090K00968
$$ 352143 201991 319763 49046 321852 55401 321693 51959 46636 154726 355694
17262C55694A4280J36843J11142o9755R6359P5377G9707A1442L25353P7539j52766
$$ 355694 14280 151123 262265 192510 288869 364246 79707 11442 336795 414334 261568
17251B61568l3632o7511O9784K12872A5622M5880a30329D61200g5500A89299O5789
$$ 261568 227936 160425 230209 443081 15622 61502 -130329 461200 -75500 189299 255088
17240B55088H0251J32853K95665A46649L56792a26337C09143p1785B801J80351
$$ 255088 80251 213104 508769 146649 503441 -126337 309143 237358 2801 183152
17230A83152i4347A35578p451a34709B03129L9360N3155k8411m7649j02189J86360
$$ 183152 -94347 135578 128127 -134709 203129 242489 295644 267233 219584 117395 303755
17219C03755L310A33285M6550A5480J73552A7185K82232O072I7823j1333K34222
$$ 303755 307065 133285 179835 15480 189032 17185 299417 305489 97823 86490 320712
17208C20712Q139D0318K6032j7039J16241O2067F334L11132F2091J27640l4518
$$ 320712 328851 40318 66350 49311 165552 227619 6334 317466 62091 189731 155213
17197A55213N27552B70676F8715a59136A55388K09940J3207k1674m9766K0201
$$ 155213 682765 270676 68715 -159136 155388 365328 378535 356861 307095 327296
17187C27296E9020L35123j33072r2929j3744O7287g853C51797j54713Q9458A8776
$$ 327296 59020 394143 261071 168142 154398 221685 -7853 351797 197084 286542 18776
17175C14807L23608k46490A02676K15613j24896J19026j05819K94055B38300n5395
$$ 314807 638415 391925 102676 318289 193393 312419 206600 500655 238300 182905
17165A82905J7663K65849j5856j81443J96688l5315A25851K39208q4774K29790
$$ 182905 200568 466417 450561 269118 465806 430491 125851 365059 280285 510075
17155E10075B19488h5142G5852L64983k5805m9061J25495o9592D9182M20474o6541
$$ 510075 219488 -85142 75852 440835 415030 365969 491464 421872 49182 469656 403115
17144D03115j16457j39350M02968R1851k67566j277A4441K78396M0716j61299
$$ 403115 286658 147308 550276 642127 374561 373284 14441 292837 333553 172254
17134A72254n8687K05723A49374L75198K2339N3432B21974O4763N5283K41306
$$ 172254 113567 319290 149374 524572 546911 600343 221974 286737 342020 583326
17124E83326B53346J76800R9303j39264D6829L32831J26559A95173M06802k62123
$$ 583326 253346 430146 529449 390185 46829 379660 506219 195173 601975 339852
17114C39852j44839J21216J8594E5558M87638B57629R0650q5934J66103L3505
$$ 339852 195013 316229 334823 55558 543196 257629 348279 262345 428448 461953
17104D61953j72127K06889j48701K0015N2102M05054k43346r4708A58116N6751
$$ 461953 289826 496715 348014 368029 420131 825185 581839 487131 158116 214867
17094B14867L57073r3297j67759A39463M25182A92807N02064C19969n3741J86814
$$ 214867 571940 478643 310884 139463 564645 192807 694871 319969 266228 453042
17084D53042M4093k44846R1926N09845m08665m6864J3872K69132j45177l7967
$$ 453042 497135 252289 344215 854060 445395 398531 412403 681535 536358 498391
17074D98391j19250J11762J9399j58770K3916K83965e9449B28066K20328K73534
$$ 498391 379141 490903 510302 351532 375448 659413 -59449 228066 448394 721928
17064G21928j47762j65415k8183J61537j3365n7813N4571k30679L6792M3407K82082
$$ 721928 574166 408751 380568 542105 528740 470927 525498 294819 331611 375018 657100
17053F57100J66856k97223m132j24155J24815k26308M5809J07257j95316O1400
$$ 657100 823956 526733 522601 398446 523261 296953 342762 450019 254703 316103
17043C16103L55793k61221K70483j07700J27543C22040L94308l03867L14506o2239
$$ 316103 671896 410675 681158 573458 701001 322040 716348 412481 726987 664748
17033F64748k25197J51845q7155N52426B25908Q11898k79229A63718O90141j94624
$$ 664748 439551 591396 504241 1056667 225908 1037806 758577 163718 853859 659235
17023F59235j51272J55062K13531J1544j11656j99122k2952n003K3842K99394
$$ 659235 507963 663025 876556 888100 776444 577322 554370 549367 573209 872603
17013H72603k31934L90861m13941K87676j48048m6300m9648K41712j32188K46229
$$ 872603 640669 1031530 617589 905265 757217 710917 661269 902981 770793 1017022
17003A017022l30833O8044K99542k30312K58197j96052m2209j20305L23762m77954
$$ 1017022 686189 754233 1053775 823463 1081660 885608 843399 723094 1046856 568902
16993E68902K69083j82628K70202o7752k79418K69351J82402j22843j78012R2622
$$ 568902 837985 655357 925559 857807 578389 847740 1030142 907299 729287 821909
16983H21909M8705K232J80812k81575r9362L42070Q0352m2085j32294l3547j5698
$$ 821909 870614 872846 1053658 772083 672721 1014791 1095143 1053058 920764 887217 871519
16972H71519J03062j39500J41817m43522N13754J63524l01570J63642j39439J24441
$$ 871519 974581 835081 976898 533376 1047130 1210654 909084 1072726 933287 1057728
16962A057728K70723k56892r9134N1978K0184Q8235M3937k03987j1734M9213M64344
$$ 1057728 1328451 1071559 972425 1024403 1044587 1132822 1176759 972772 961038 1010251 1474595
16951A474595k41162m9041P0812p4341p1331K1197K161J00971K61514m86025K58753
$$ 1474595 1233433 1184392 1255204 1180863 1109532 1130729 1132890 1233861 1495375 1009350 1268103
16940A268103J55339k37298K6557R0611j38833J51227J5681K4021j0791K03041
$$ 1268103 1423442 1186144 1212701 1303312 1164479 1315706 1331387 1355408 1344617 1547658
16930A547658k55860P9854r6726J99504j40956j85118L13402l3434J02360K98851
$$ 1547658 1291798 1371652 1274926 1474430 1333474 1148356 1461758 1428324 1530684 1829535
16920A829535k69758l74139L28016j69347K17851l47522M10757J20452j47220
$$ 1829535 1559777 1185638 1513654 1344307 1562158 1214636 1625393 1745845 1598625
16911A598625J39675l03320J03668K13712j08084J8156p4702L07442l37163K06926
$$ 1598625 1738300 1434980 1538648 1752360 1644276 1662432 1587730 1895172 1558009 1764935
16901A764935J14246l49885M29186N1353K2449p3032j01744m3045K11322m63745
$$ 1764935 1879181 1529296 1958482 2009835 2032284 1959252 1857508 1814463 2025785 1562040
16891A562040L74123K02745j05753j11164K40383K53683k83059L6448Q7175k05459
$$ 1562040 1936163 2138908 2033155 1921991 2162374 2416057 2132998 2169446 2256621 2051162
16881B051162J05388j01147N09671p7802k691j3037J12814j20975M7278j47734
$$ 2051162 2156550 2055403 2565074 2487272 2484581 2471544 2584358 2463383 2510661 2362927
16871B362927K45184n3408o9553O8610J48077k03433m0630K43232o1630J40441
$$ 2362927 2608111 2554703 2485150 2553760 2701837 2498404 2457774 2701006 2639376 2779817
16861B779817o5385K32505j51702J64847k1761K82256l0399k9187L22606k26668
$$ 2779817 2714432 2946937 2795235 2960082 2938321 3220577 3190178 3160991 3483597 3256929
16851C256929K60219p278j23657L40102j75873J75401k41751K66097j36974L66939
$$ 3256929 3517148 3509870 3386213 3726315 3550442 3725843 3484092 3750189 3613215 3980154
16841C980154l36087L63571m0624M48354k50813K31715j07768r4549K24558L25040
$$ 3980154 3644067 4007638 3967014 4415368 4164555 4396270 4288502 4193953 4418511 4743551
16831D743551m37774M96103n2391J31040J14765k30778J29444J66873L39548N65773
$$ 4743551 4305777 4801880 4749489 4880529 4995294 4764516 4893960 5060833 5400381 5966154
16821E966154m62339K72447j70018K31653l67596P19755J12496q8145N1623L58192
$$ 5966154 5503815 5776262 5606244 5837897 5470301 6190056 6302552 6214407 6266030 6624222
16811F624222K50996r1294N40289j19321J61174J57900J36769M11337j29357J77984
$$ 6624222 6875218 6783924 7324213 7204892 7366066 7523966 7660735 8072072 7942715 8120699
16801H120699K45217j11338M87288R4732J30103N04714P7237K28274J53398L76351
$$ 8120699 8365916 8254578 8741866 8836598 8966701 9471415 9548652 9776926 9930324 10306675
16791A0306675L17924q6225M00660M29487J03088M46607O55904M3417N03702J73979
$$ 10306675 10624599 10538374 10939034 11368521 11471609 11918216 12574120 12617537 13121239 13295218
16781A3295218O32960L94022L47585M55160N00962K24432L63289R08658L01755
$$ 13295218 13928178 14322200 14669785 15124945 15625907 15850339 16213628 17122286 17424041
16772A7424041O73029M83673J181715M13605O05998Q13578Q49707O91663P95061
$$ 17424041 18097070 18580743 19762458 20176063 20782061 21595639 22445346 23137009 23932070
16763B3932070J141433Q52779J280861P94910J421257N67013J781233J197471
$$ 23932070 25073503 25926282 27207143 28002053 29423310 29990323 31771556 32969027
16755C2969027J641487J625545J533127K028907J820021K072391J821446K472362
$$ 32969027 34610514 36236059 37769186 39798093 41618114 43690505 45511951 47984313
16747D7984313K421044K340149K929120K959040L470413L165264M344388L744020
$$ 47984313 50405357 52745506 55674626 58633666 62104079 65269343 69613731 73357751
16739G3357751M157265M132074N138181N024253N446195N923763O167424O241678
$$ 73357751 77515016 81647090 86785271 91809524 97255719 103179482 109346906 115588584
16731A15588584O793909O776678O991807P302672P649510O852406O755585O785632
$$ 115588584 122382493 129159171 136150978 143453650 151103160 157955566 164711151 171496783
16723A71496783N766423N421365M200904L306644K055237J226432n01461j972875
$$ 171496783 177263206 182684571 186885475 190192119 192247356 193473788 192972327 190999452
16715A90999452k458159l916522n122065n475112o026680o987463p223978p638738
$$ 190999452 188541293 184624771 179502706 174027594 168000914 161013451 153789473 146150735
16707A46150735p375772p245622o942593p103459o692361o438367o083027n059739
$$ 146150735 138774963 131529341 124586748 117483289 110790928 104352561 98269534 93209795
16699I3209795n693380n254561m259569m658233m457709l477155l695245l254830
$$ 93209795 87516415 82261854 78002285 73344052 68886343 65409188 61713943 58459113
16691E8459113k907355l121947k781862k648646j978293k411403k295391j676402
$$ 58459113 55551758 52429811 49647949 46999303 45021010 42609607 40314216 38637814
16683C8637814j924545j888502j527957j382407j549798j322383j543567p29409
$$ 38637814 36713269 34824767 33296810 31914403 30364605 29042222 27498655 26769246
16675B6769246r19758j111363j286282n82078j240055q67574n54031q89353p59773
$$ 26769246 25849488 24738125 23451843 22869765 21629710 20762136 20208105 19318752 18558979
16666A8558979m47215n26219p13268q66719m78885l79131n76341n95906m35618
$$ 18558979 18111764 17585545 16872277 16005558 15526673 15147542 14571201 13975295 13539677
16657A3539677k70263k63771l55943p01942j11293n95023r2746l78402j40781
$$ 13539677 13269414 13005643 12649700 11947758 11836465 11241442 11148696 10770294 10629513
16648A0629513l66332l06246k45500n73491n1827l63408m3421l66053o46079M4309
$$ 10629513 10263181 9956935 9711435 9137944 9086117 8722709 8679288 8313235 7667156 7711465
16638G711465J22631k14394l14799k75521p4417j32619j22540n0143k13966l72956
$$ 7711465 7834096 7619702 7304903 7029382 6954965 6822346 6699806 6649663 6435697 6062741
16628F062741p8767K73103n93972K8498j2963m42286J91282k13743k66276m4577
$$ 6062741 5983974 6257077 5663105 5691603 5678640 5236354 5427636 5213893 4947617 4903040
16618D903040O2061j54203j32416J14110j07521l48945l0113k42034P2999R0991
$$ 4903040 4965101 4810898 4678482 4792592 4685071 4336126 4306013 4063979 4136978 4227969
16608D227969P1543n04829N0404j30387m42426K81192N4484k35955l21848M00908
$$ 4227969 4299512 3794683 3845087 3714700 3272274 3553466 3607950 3371995 3050147 3451055
16598C451055r0847L7916k55634J07547j07854r9700J36295k02397j93194L00781
$$ 3451055 3360208 3398124 3142490 3250037 3142183 3042483 3178778 2976381 2783187 3083968
16588C083968m42837K05032j39751p2915L14304l6511k42754J03488k38476l18572
$$ 3083968 2641131 2846163 2706412 2633497 2947801 2911290 2668536 2772024 2533548 2214976
16578B214976J86421o8020J0054j8789l52355j33675O07007m20586P504k34563
$$ 2214976 2401397 2333377 2343431 2324642 1972287 1838612 2445619 2025033 2032537 1797974
16568A797974O6440J15876P7632L80836m32086o2454M3587L919j49364k25416
$$ 1797974 1864414 1980290 2057922 2438758 2006672 1944218 1987805 1991724 1842360 1616944
16558A616944L89629k18948L94514m83510k57939L83373k14644J96452n37970
$$ 1616944 2006573 1787625 2182139 1698629 1440690 1824063 1609419 1805871 1267901
16549A267901K36694k68999M44507k66228k383k99945L59789l85964R1869R7171
$$ 1267901 1504595 1235596 1680103 1413875 1411492 1111547 1471336 1085372 1177241 1274412
16539A274412R0862k36396J18431J8355L9563Q2425J03549m07069L82434o20442
$$ 1274412 1365274 1128878 1247309 1265664 1305227 1387652 1491201 1084132 1466566 846124
16529H46124N15567k65417L45640r5772l17386L19699q6428N3928k82027J06399
$$ 846124 1361691 1096274 1441914 1346142 1028756 1348455 1262027 1315955 1033928 1140327
16519A140327o6259J7845K69153j726k04770o5160K00887k11262k0542K6234q9481
$$ 1140327 1074068 1091913 1361066 1359340 1154570 1089410 1290297 1079035 1058493 1084727 995246
16508I95246K06364j90371O9411k95882K29276p6995l29662M34316m30570P8525
$$ 995246 1201610 1011239 1080650 784768 1014044 937049 607387 1041703 611133 689658
16498F89658J63100j9024k56893K38655L34284m43711P2460m8318J33749j72639
$$ 689658 852758 833734 576841 815496 1149780 706069 778529 730211 863960 691321
16488F91321q7084K43073m3144j12129K6194J49715k28363j39836K23243K82573
$$ 691321 604237 847310 804166 692037 718231 867946 639583 499747 722990 1005563
16478A005563m34677N4690K64157l04141j63761L44348k34217L2865K51751k45133
$$ 1005563 570886 625576 889733 585592 421831 766179 531962 564827 816578 571445
16468E71445B23422J98065M01422C72402K32765j13528o8251L2077J85986j28999
$$ 571445 223422 421487 822909 372402 605167 491639 423388 455465 641451 512452
16458E12452J62715n0893j05348j04353L10505r5014j85106K53171J85835B55470
$$ 512452 675167 624274 518926 414573 725078 630064 444958 698129 883964 255470
16447E75236L0518j70900J92513R5181l42383M06828C93308Q2965k16572K95039
$$ 575236 605754 434854 627367 722548 380165 786993 393308 476273 259701 554740
16437E54740o7800j09966O856P5596B15162L04500m134j69459J59724r5602J91951
$$ 554740 486940 376974 383830 459426 215162 519662 515528 346069 505793 410191 602142
16426F02142j83806j61158K47813q1636N8983O9905J20069j9447j94880k28224
$$ 602142 418336 257178 504991 423355 482338 552243 672312 652865 457985 229761
16416B29761M41564B11629N7715L30241k65733A10458L97195j87449O0315M5462
$$ 229761 671325 211629 269344 599585 333852 110458 507653 320204 380519 425981
16406D25981Q7598k52752A15660M93157k31595L19665l32903A47823J70153J45498
$$ 425981 513579 260827 115660 608817 377222 696887 363984 147823 317976 463474
16396D63474A87197H773J43987J62336N6941p84j68480M38810B44264j3159K3747
$$ 463474 187197 8773 152760 315096 372037 371253 202773 641583 244264 231105 254852
16385B54852I2446a76378A71222L11776G5717K58851j64230K12753k7519j50581
$$ 254852 92446 -176378 171222 482998 75717 334568 170338 383091 355572 204991
16375B04991L43233A45195l0304J19044n5752H0755M045L25158j29966r7917d3102
$$ 204991 548224 145195 114891 233935 178183 80755 84800 409958 279992 182075 -43102
16363B06267Q26J17771j42671J08382K00245j27359D5771R774M34562A65652m4432
$$ 206267 207093 324864 182193 290575 490820 363461 45771 55545 490107 165652 121220
16352A21220K73636k7395A43057J58060N3727j12792q8305c4298F6179a03850
$$ 121220 394856 367461 143057 301117 354844 242052 153747 -34298 66179 -103850
16341A13204K47840j18789q7197J72048D7499f5840C28551j23142J3524j05218
$$ 113204 361044 242255 155058 327106 47499 -65840 328551 205409 218933 113715
16331A13715J59601J75982A13061e9659q7879D1464A500J72618M4457h3934B17603
$$ 113715 273316 449298 113061 -59659 -147538 41464 1500 174118 218575 -83934 217603
16319B17513P9784e0102j9644a2174k40029A98025J47241a04173o3133P7186D20728
$$ 217513 297297 -50102 -69746 -12174 -252203 198025 345266 -104173 -167306 -90120 420728
16307B31666j454g5126A81026a52987G7204K0383O1090d880A83849A2611J02005
$$ 231666 230212 -75126 181026 -152987 77204 97587 158677 -4880 183849 12611 114616
16296A14616D5948K00524G7248J18696e9639q2772c4456B68087a45570B72459
$$ 114616 45948 246472 77248 195944 -59639 -142411 -34456 268087 -145570 272459
16285B2130a07492A44105j0203O2037M080q6762l1754A4803L0290J86243A9761
$$ 22130 -107492 144105 133902 195939 200019 113257 81503 14803 45093 231336 19761
16273B50644F4026a15197A92864a0025A14846k4033e3742A54637i6348m9254A73423
$$ 250644 64026 -115197 192864 -10025 114846 90813 -53742 154637 -96348 -145602 173423
16261A62708a35965M8395B22987b8527B48714a4586C00621C8118g4974A34663
$$ 162708 -135965 -87570 222987 -28527 248714 -14586 300621 38118 -74974 134663
16250h3195C3230Q5034l3532e0496b3853C77163b15567B69537b2105b128r610
$$ -83195 33230 118264 84732 -50496 -23853 377163 -215567 269537 -22105 -2128 -11738
16239a1738E0779c3954A23676O2032f9609A3956D058J25170D8413P505J57876
$$ -11738 50779 -33954 123676 185708 -69609 13956 4058 129228 48413 55918 213794
16228B13794L11777A18809J1457l5183a40331B18311b49522A30784r217K6027
$$ 213794 525571 118809 130266 95083 -140331 218311 -249522 130784 121567 147594
16218A47594K36670b05772I4038J32999e4951A23677P9155H9536Q7096f0947A44073
$$ 147594 384264 -205772 94038 227037 -54951 123677 202832 89536 176632 -60947 144073
16206b00977B29378j03050n8795J85226b6452G4390i0439a9676B13668b1377o9794
$$ -200977 229378 126328 67533 252759 -26452 74390 -90439 -19676 213668 -21377 -91171
16195i1171O490C4743g7000I3094K5570F367Q9124O3210E5033b33416L7657D7194
$$ -91171 -84681 34743 -77000 93094 118664 6367 95491 158701 55033 -233416 -195759 47194
16182F8883J17875b32261B54164m8013H92a14673j1842F2333i9768C1939a81164
$$ 68883 186758 -232261 254164 206151 892 -114673 -126515 62333 -99768 31939 -181164
16170A90868a99756Q2878B05487i315A09740i4794A47069k4106J04569A07159
$$ 190868 -199756 -116878 205487 -9315 109740 -94794 147069 122963 227532 107159
16159B92804i2077L5890A98430l6248i057B19127b5903j218j64428A14627A1842
$$ 292804 -92077 -56187 198430 162182 -9057 219127 -25903 -27121 -191549 114627 11842
16147A35139c42198a10852b7798A08088d62242B0130J34462J22915a9904C67891
$$ 135139 -342198 -110852 -27798 108088 -462242 20130 154592 277507 -19904 367891
16136d0508B13346E3496b6920C63610K7335e9765b4366p0288L7789j90304D1656
$$ -40508 213346 53496 -26920 363610 390945 -59765 -24366 -94654 -56865 -247169 41656
16124c63865I2187h829j35498A36738b5889H6546e3333G2129J57497d11248a85007
$$ -363865 92187 -8829 -144327 136738 -25889 86546 -53333 72129 229626 -411248 -185007
16112G1886N7222b6053H3599A8966J20379h7494j18217D6189c9239B21146D2821
$$ 71886 129108 -26053 83599 18966 139345 -87494 -205711 46189 -39239 221146 42821
16100A2949a06289C87185d4301A15878l7676f0589j87181D3003K42771j00564
$$ 12949 -106289 387185 -44301 115878 78202 -60589 -247770 43003 285774 185210
16090A85210a9184C5320F936a6460o8944D833a16366F6043a73335A71304k5880
$$ 185210 -19184 35320 6936 -16460 -85404 4833 -116366 66043 -173335 171304 145424
16079A45424k6077a15535B44376K1818A2151a4988j28118L8734G5528c5831A19352
$$ 145424 119347 -115535 244376 266194 12151 -14988 -143106 -104372 75528 -35831 119352
16067b0302j27855A9529K39895g062k40301C1680c73456D5353d29484g562H9152
$$ -20302 -148157 19529 259424 -7062 -247363 31680 -373456 45353 -429484 -7562 89152
16055G8011J42149r5691c15207P8540C8907a06726J7610a8259h654E8693N4997
$$ 78011 220160 124469 -315207 -236667 38907 -106726 -89116 -18259 -8654 58693 113690
16044A13690a05500B18288a91383A18079a50919n537A63949f4887j09854d0335
$$ 113690 -105500 218288 -191383 118079 -150919 -156456 163949 -64887 -174741 -40335
16033b24612l972B62595C5506a31280j2152g0854I4470b5626k21545O9622b2669
$$ -224612 -228584 262595 35506 -131280 -143432 -70854 94470 -25626 -247171 -177549 -22669
16021a18355C28361h3279r7022Q7778d2061A90422a27530P06A69024b00736C4380
$$ -118355 328361 -83279 -180301 -92523 -42061 190422 -127530 -126824 169024 -200736 34380
16009a73356A22349J8070d4597A81474a65488k13615c9033A14562a80925E1300
$$ -173356 122349 140419 -44597 181474 -165488 -379103 -39033 114562 -180925 51300
15998F0278i198C14746a64345j25746f7830r9772O4328j56830C4221f7895G6385
$$ 60278 -9198 314746 -164345 -290091 -67830 -167602 -103274 -260104 34221 -67895 76385
15986A00840J1849A2759J15730B0132J93773n2853C1165J92372d0903G8062J23294
$$ 100840 112689 12759 128489 20132 213905 161052 31165 223537 -40903 78062 201356
15975B01356K5893e0617j40386F2345K5583L048n562a38600b1952j9813l3327
$$ 201356 227249 -50617 -191003 62345 87928 90976 85414 -138600 -21952 -41765 -75092
15964g5092l14847N9369b0491E754J30847c06344D8626a58553A53333a06759A5322
$$ -75092 -389939 -330570 -20491 5754 136601 -306344 48626 -158553 153333 -106759 15322
15952b57092A57845f4833K1395r4842j8296C01435c6345A32964j1355J0706e5177
$$ -257092 157845 -64833 -43438 -138280 -156576 301435 -36345 132964 121609 132315 -55177
15940b05465g3108l31078a86849m9004e0588j20268C3228J54874f2810j14080
$$ -205465 -73108 -404186 -186849 -235853 -50588 -170856 33228 188102 -62810 -176890
15930a76890j10529I5436g7868F3585f8730k7451j98430H2719C3862b61302B03952
$$ -176890 -287419 95436 -77868 63585 -68730 -96181 -294611 82719 33862 -261302 203952
15918b25637R8485O3123B89164a0196E3763B2917i073B1313a73468A28951J45453
$$ -225637 -127152 -64029 289164 -10196 53763 22917 -9073 21313 -173468 128951 274404
15907B74404d63264f9247j36949m6885F6994b84806D3504c5644r9627f7529B73084
$$ 274404 -463264 -69247 -206196 -253081 66994 -284806 43504 -35644 -135271 -67529 273084
15895h3753j32969K1649r7881k66d3316j26974B99229b15611f7368H4258l6034
$$ -83753 -216722 -195073 -292954 -293220 -43316 -170290 299229 -215611 -67368 84258 48224
15884D8224A2477P021h8332C11700b39270f9113k9035j84665G315a69890g2902
$$ 48224 12477 19498 -88332 311700 -239270 -69113 -98148 -282813 7315 -169890 -72902
15872e214A02711e585l4389a6536l9682H6086K0235a63372f7072A26637K0332
$$ -5214 102711 -5585 -39974 -16536 -56218 86086 106321 -163372 -67072 126637 146969
15861A46969a33677j98292F6582a50253a8162k03754f7139k912B8750i2329J2291
$$ 146969 -133677 -331969 66582 -150253 -18162 -221916 -67139 -70051 28750 -92329 -80038
15850h0038A75569D4107d17453G2879d6338q3500D7663d4603j20300A59782h9772
$$ -80038 175569 44107 -417453 72879 -46338 -129838 47663 -44603 -164903 159782 -89772
15838A88360b80144A16633A610K0468b76121A95425E0043c88290B2734a88171
$$ 188360 -280144 116633 1610 22078 -276121 195425 50043 -388290 22734 -188171
15827c56464R7943N8377L2258j56421D995L27392J34F6297i6672o576k36317A26933
$$ -356464 -258521 -200144 -167886 -324307 4995 332387 332521 66297 -96672 -103248 -339565 126933
15814F8720J4090B523a25587d3971k24757H3315b24838k05283B24940k5342c17154
$$ 68720 82810 2523 -125587 -43971 -268728 83315 -224838 -430121 224940 199598 -317154
15802A42723b44665E0518c4828B23173J02081A52417a47263j1673G4322A8548
$$ 142723 -244665 50518 -34828 223173 325254 152417 -147263 -158936 74322 18548
15791A54507a20413N2223j8660L299G632f5980A41138h062A09824a60585H8976
$$ 154507 -120413 -68190 -86850 -83551 7632 -65980 141138 -8062 109824 -160585 88976
15779A51639d77429c0969q9568j33670a01209E4002c5685a7659A24694C8497a03573
$$ 151639 -477429 -30969 -120537 -254207 -101209 54002 -35685 -17659 124694 38497 -103573
15767i0536n7118N9597r7005B88163C5227J65379O5246r9930J84763L0059c29818
$$ -90536 -147654 -88057 -185062 288163 35227 200606 265852 165922 350685 380744 -329818
15755a11244j53039A55517E5002a10479d3378C24503A12846a17765j70271A17849
$$ -111244 -264283 155517 55002 -110479 -43378 324503 112846 -117765 -288036 117849
15744a51596O4653O956j53813g648n9730i262A7870R1090a75847A38464Q44a98798
$$ -151596 -86943 -79987 -233800 -7648 -67378 -9262 17870 108960 -175847 138464 139308 -198798
15731a05890D05189d41040a00468c4655a1844A79066C6333b52149G6337J59853
$$ -105890 405189 -441040 -100468 -34655 -11844 179066 36333 -252149 76337 236190
15721B36190o6482L8217d1284l32583h5049C52743G1928b20105f871m7417o9015
$$ 236190 169708 207925 -41284 -373867 -85049 352743 71928 -220105 -6871 -54288 -123303
15710a23303A19783c12744R1098E4050J03272a15515b1576H7098c2837m9524A52922
$$ -123303 119783 -312744 -221646 54050 157322 -115515 -21576 87098 -32837 -82361 152922
15698h0310q1723N206j1251d6814k13731A12166a40685C10127E5450j8985d1481
$$ -80310 -162033 -156827 -168078 -46814 -260545 112166 -140685 310127 55450 36465 -41481
15686C09537a46555B3201h3183D1215i692F0683g1335A41607b4862A30J24124
$$ 309537 -146555 23201 -83183 41215 -9692 60683 -71335 141607 -24862 130 124254
15675A24254a45472M1557k71109A78237b75183A37452k4494Q7029J2427a92957
$$ 124254 -145472 -103915 -375024 178237 -275183 137452 112958 199987 212414 -192957
15664a62899B08371a26211A58838h3433D9308a70285L742b8054A9968e5299k4149
$$ -162899 208371 -126211 158838 -83433 49308 -170285 -166543 -28054 19968 -55299 -79448
15653g9448B94805D3917Q4753c6292E0353a41307j14429C1020J4684d93218i5922
$$ -79448 294805 43917 128670 -36292 50353 -141307 -255736 31020 45704 -493218 -95922
15641a51010B14404H2802J8090R5525f0448b8081k8767j69570B01769c01547F2704
$$ -151010 214404 82802 100892 196417 -60448 -28081 -56848 -226418 201769 -301547 62704
15629B3165N1200g9420j9914A13596o113a56609l439B37274I2552O7718i4046
$$ 23165 74365 -79420 -99334 113596 107483 -156609 -160048 237274 92552 160270 -94046
15617D275R6184a0832C9961f3278q2095c9493C6400g1254A29647b9061F4677a95338
$$ 4275 100459 -10832 39961 -63278 -145373 -39493 36400 -71254 129647 -29061 64677 -195338
15604b25867F7918B7355J04375b43425J10238k6421R190R117L666j11831b1705
$$ -225867 67918 27355 131730 -243425 -133187 -159608 -150418 -141301 -137635 -249466 -21705
15592B12404A1703J03974c85743q5629J75245f6538B37107G8917l3863J13556
$$ 212404 11703 115677 -385743 -471372 -296127 -66538 237107 78917 45054 158610
15582A58610l7007b24418A3696b7996C5989b61017A32054e1532m22353B8327a17787
$$ 158610 121603 -224418 13696 -27996 35989 -261017 132054 -51532 -473885 28327 -117787
15570a02349F3567h7495b1174k21417O5875b6361A8448b03886A96775H2262b38668
$$ -102349 63567 -87495 -21174 -242591 -176716 -26361 18448 -203886 196775 82262 -238668
15558a4479k97318d2929J9656j16238C1942a29710b0833B08079n9718k4404a62429
$$ -14479 -311797 -42929 -23273 -139511 31942 -129710 -20833 208079 148361 123957 -162429
15546a20390J0750D544i66k21039A77970A7325d9340j7720A53331o7341j4449
$$ -120390 -109640 4544 -966 -222005 177970 17325 -49340 -67060 153331 85990 71541
15535G1541f2784B58172J25324r0242e7155A50586a59240n727F5924d6019E7056
$$ 71541 -62784 258172 383496 293254 -57155 150586 -159240 -164967 65924 -46019 57056
15523A13590a19967A45870o4118a46618K8577j69798A46352b63911p6912B28152
$$ 113590 -119967 145870 81752 -146618 -118041 -287839 146352 -263911 -340823 228152
15512i9622A53900e6070D5638Q3762P0280d14697A92327f9443B3379a7868B13109
$$ -99622 153900 -56070 45638 129400 199680 -414697 192327 -69443 23379 -17868 213109
15500i9934c312k36542A36772m3214J17997b29969A50884a33434e5724l4679C8213
$$ -99934 -3312 -239854 136772 93558 211555 -229969 150884 -133434 -55724 -90403 38213
15488I8377b32097F727M8049j274b7947B2N4263K61021B5715h8020j87182E5963
$$ 98377 -232097 6727 54776 53502 -27947 22 54285 315306 25715 -88020 -275202 55963
15475e6032B09964F080h7349c3630B30451c7046j707j64601b5588l4268n5546
$$ -56032 209964 6080 -87349 -33630 230451 -37046 -38753 -203354 -25588 -59856 -115402
15464a15402A57658p8422A1272L8005a51981k9513H3762l0805J30851e37512A16222
$$ -115402 157658 79236 11272 49277 -151981 -181494 83762 52957 183808 -537512 116222
15452C222P5817J5151b633A8872d2769n5310A2825a58110P5380J6133H0323a1329
$$ 3222 79039 94190 -2633 18872 -42769 -98079 12825 -158110 -82730 -66597 80323 -11329
15439A14230c00719O6798a08048G1888E205a16828C7080d2515H6890a2766j85996
$$ 114230 -300719 -233921 -108048 71888 5205 -116828 37080 -42515 86890 -12766 -198762
15428a98762g6319k3565o2687A01442K48106A0715b59341C7381a5358G9580k3363
$$ -198762 -76319 -99884 -162571 101442 349548 10715 -259341 37381 -15358 79580 56217
15417E6217c66576C44947A00385Q5780B872O8110b32272a11087C9824a4350A05650
$$ 56217 -366576 344947 100385 186165 2872 70982 -232272 -111087 39824 -14350 105650
15405i1937K0474A83141i1604C51293F8189K07956E5983O1715b8259j54626D2604
$$ -91937 -71463 183141 -91604 351293 68189 276145 55983 117698 -28259 -182885 42604
15393b71529f7155K0971o3233A40798L00318b7363A16301h3382B9762e9100G3964
$$ -271529 -67155 -46184 -109417 140798 441116 -27363 116301 -83382 29762 -59100 73964
15381I8836c8171D7445e8335A45760d19006B30260a39545A6173K8728j6838K53753
$$ 98836 -38171 47445 -58335 145760 -419006 230260 -139545 16173 44901 28063 281816
15370B81816B309b10772A61240K48021C6312a95981k3011I0680a23412j40012
$$ 281816 2309 -210772 161240 409261 36312 -195981 -218992 90680 -123412 -263424
15360b63424B08990D7046g0221B040P9017c3898l81614d788j54292A32126b42173
$$ -263424 208990 47046 -70221 2040 81057 -33898 -415512 -4788 -159080 132126 -242173
15348A2065J15231J30104j25999b06887A24467M3985c29721d5360A41812p785
$$ 12065 127296 257400 131401 -206887 124467 168452 -329721 -45360 141812 134027
15338A34027a6753A82123q0873J22388H4297L47634A15574N7094d2912K1059C31793
$$ 134027 -16753 182123 101250 223638 84297 431931 115574 172668 -42912 -21853 331793
15326h2497G2910b8363q5564G2145a90364p5603A61585a02610A02963K7799J45834
$$ -82497 72910 -28363 -113927 72145 -190364 -265967 161585 -102610 102963 130762 276596
15315B76596A06864o51K67172j63073I4870i5666k9652N8248C2468d22205a86967
$$ 276596 106864 106213 373385 210312 94870 -95666 -125318 -67070 32468 -422205 -186967
15303F6826Q0396N0757p9051i4769J8638C4890N8691R2956a10953D2612a14140
$$ 66826 147222 197979 118928 -94769 -76131 34890 93581 186537 -110953 42612 -114140
15291H488O0161a78029g7434p0379B99720a11546A35590b4642A35832g4627L0119
$$ 8488 68649 -178029 -77434 -147813 299720 -111546 135590 -24642 135832 -74627 -44508
15280d4508q3913F3558J6945k7262J50031D0342J39113b12689C5555e6295j85256
$$ -44508 -128421 63558 80503 53241 203272 40342 179455 -212689 35555 -56295 -241551
15269b41551d752A53275J29094F8728c9690D1540I936L7944b19083A17909k6188
$$ -241551 -4752 153275 282369 68728 -39690 41540 9936 47880 -219083 117909 91721
15258I1721a39049D66896F7394J83966c04563A45139J80234k4870b5201B78145
$$ 91721 -139049 466896 67394 251360 -304563 145139 325373 300503 -25201 278145
15247E14066J069570P5823p09226J138699j010965A83911R6185J3225H2776d7099
$$ 514066 1583636 1659459 950233 2088932 1077967 183911 280096 293321 82776 -47099
15236A18392h5147G4642a22920i413A94125g0269C02544a06892A67298b22601
$$ 118392 -85147 74642 -122920 -9413 194125 -70269 302544 -106892 167298 -222601
15225a73924M1033A18754K32160R5560j52760H8521K44983F4635J02795D833i8571
$$ -173924 -132891 118754 350914 446474 293714 88521 333504 64635 167430 4833 -98571
15213B5607c30851B4214N5423J20580F0732A7005h6574j36468D19030j35750a57698
$$ 25607 -330851 24214 79637 200217 60732 17005 -86574 -223042 419030 283280 -157698
15201C78508c22941a6910B19356B941b50754a5977E3359j7407a6836D28565A54337
$$ 378508 -322941 -16910 219356 2941 -250754 -15977 53359 35952 -16836 428565 154337
15189C93467g7204l0136C19407a23779j76573B22570a49653b0951F6041G889M80039
$$ 393467 -77204 -107340 319407 -123779 -300352 222570 -149653 -20951 66041 7889 487928
15178D87928H150a98135E1227k3239j242L88849a05299A81678j3071R3147j13482
$$ 487928 8150 -198135 51227 27988 26746 415595 -105299 181678 168607 261754 148272
15167A48272M1585N9104L51409A2130c0025j92218C45930A31052a40566d1387
$$ 148272 189857 248961 600370 12130 -30025 -222243 345930 131052 -140566 -41387
15156a78201j69045d3012j2039A62637g1147k32726A63114F8303K3012D1498J34014
$$ -178201 -347246 -43012 -55051 162637 -71147 -303873 163114 68303 91315 41498 175512
15145A75512c40337B84924d34123e7146b5935A32685a72069A80626c55705a3173
$$ 175512 -340337 284924 -434123 -57146 -25935 132685 -172069 180626 -355705 -13173
15134B794Q0233R7637i0737F22096D1232K72573N8346A25870b31334i796A14616
$$ 2794 83027 180664 -90737 622096 41232 313805 372151 125870 -231334 -9796 114616
15122B3044J48576d3760k2057B35278F567a9869A85414J54752I0603P8948o3129
$$ 23044 171620 -43760 -65817 235278 6567 -19869 185414 340166 90603 169551 106422
15111A06422k4358e1588D4950J28141b2329B63162a15671I0148e8008d292A8493
$$ 106422 82064 -51588 44950 173091 -22329 263162 -115671 90148 -58008 -4292 18493
15099G2914J44077o1859K31315j48476R1995j28070M7155J44539D4027A6761a55630
$$ 72914 216991 155132 386447 237971 329966 201896 249051 393590 44027 16761 -155630
15087C25184I114J25640L35234A77556d4233A41276L46610A86344k8467O8104
$$ 325184 9114 134754 469988 177556 -44233 141276 487886 186344 157877 225981
15077B25981q1869J76603A25074K89726A93081J31976j15371R3708D4731a26332
$$ 225981 144112 320715 125074 414800 193081 325057 209686 303394 44731 -126332
15066A50754D1673K1709N17984B21425j7463C2058L5211P3455C104O0152d1614
$$ 150754 41673 63382 581366 221425 203962 32058 67269 140724 3104 63256 -41614
15054A3413J309J12146h3019o596G5199I459J5732c6205B67006a54779A57422
$$ 13413 14722 126868 -83019 -89615 75199 9459 25191 -36205 267006 -154779 157422
15042C18355G0246b0371D59018m1775A78930a3745B83375H9874J50363J76671
$$ 318355 70246 -20371 459018 417243 178930 -13745 283375 89874 240237 416908
15032D16908o9033n9615B8656J68499c0236C11793J8719j45728P8483o0689L5711
$$ 416908 347875 288260 28656 197155 -30236 311793 330512 184784 263267 202578 238289
15021B38289J83483j99633K22253k03561J53838j00033G9345n013f0614n3018
$$ 238289 421772 222139 444392 240831 394669 294636 79345 74332 -60614 -113632
15011a13632D26536j32150d4526B26440o3407o9287a99582C15687j19976a3488
$$ -113632 426536 294386 -44526 226440 163033 93746 -199582 315687 195711 -13488
15000B15416q6906K50510J43873j36898A20698f5438C77583r5320A6494L18397
$$ 215416 128510 379020 522893 385995 120698 -65438 377583 282263 16494 334891
14990C34891C2937K06551b4833C386L85113J3913j29796k7696r5867l1156g1944
$$ 334891 32937 239488 -24833 3386 388499 402412 272616 244920 149053 117897 -71944
14978B8769M4257K18058k3231m3648L04778j89789E4006J55157b23673D54035
$$ 28769 73026 291084 267853 224205 528983 339194 54006 209163 -223673 454035
14967C07500A51827J06093b23158C59766r8337K6753K07832B03066J2905Q8452
$$ 307500 151827 257920 -223158 359766 261429 288182 496014 203066 215971 304423
14957C04423C1622J99474C6803L36177H7867K14001A41356A4940L05862j3208
$$ 304423 31622 231096 36803 372980 87867 301868 141356 14940 320802 307594
14947C07594q610K26345A14549K84609j72371j08518K15459k7497j05963M0664
$$ 307594 298984 525329 114549 399158 226787 118269 333728 306231 200268 240932
14937B40932J84868j36347K23071p567N0272B51820j06210N57292B68445k5401
$$ 240932 425800 289453 512524 504957 555229 251820 145610 702902 268445 243044
14927B43044b4925A66471K69954J67627A46190N3574M9286J19347R4091g5891
$$ 243044 -24925 166471 436425 604052 146190 199764 249050 368397 462488 -75891
14916C21332o2330j11202L90471J49323k42369m5273J77837A68744L06919O7585
$$ 321332 259002 147800 538271 687594 445225 399952 577789 168744 475663 543248
14906E43248j75893J33801B9197K05491J31025p6286I6015J75894K10841k27439
$$ 543248 367355 501156 29197 234688 365713 289427 96015 271909 482750 255311
14896B55311K10330m4122K76538j07874B57675K50653d9259D77383B04783J77867
$$ 255311 465641 421519 698057 590183 257675 508328 -49259 477383 204783 382650
14886C82650j89762L34505K8376B73645E6329J13850K60938O62A52408J86859
$$ 382650 192888 527393 555769 273645 56329 170179 431117 431779 152408 339267
14876C39267K02104j82639K72396j73157m3295j18003J06316J7818j52237L82208
$$ 339267 541371 358732 631128 457971 414676 296673 402989 420807 268570 650778
14866F50778A56366l5169J36429K59010L6108k67528J91476n3717J57674P0908
$$ 650778 156366 121197 257626 516636 552744 285216 476692 422975 580649 651557
14856F51557j61644q1994B01447l5956K87040K00348k12524j5807K3199j21145
$$ 651557 489913 407919 201447 165491 452531 652879 440355 424548 447747 326602
14846C26602J57862n2349l9405j10642n9640L62975k08986l8519N3794K48412
$$ 326602 484464 432115 392710 282068 222428 585403 376417 337898 391692 640104
14836F40104C00954L63520o0732B50311M01753l12552K67583k35911L80335k45455
$$ 640104 300954 664474 603742 250311 652064 339512 607095 371184 751519 506064
14826E06064L5810Q5247B87710L31350j67870J37858P7277k71195K7445M17802
$$ 506064 541874 627121 287710 619060 451190 589048 666325 395130 422575 840377
14816H40377k58061J73060l8416k30470n2464J82255j56072A92195L42862j07987
$$ 840377 582316 755376 716960 486490 434026 616281 460209 192195 535057 427070
14806D27070N2766K57134k80209M46065j86950j97054A66874L92518l8048J81930
$$ 427070 479836 736970 456761 902826 715876 518822 166874 559392 521344 703274
14796G03274J70807A82585M22076k51866J54549n5224O3909j4250P5280k6114
$$ 703274 874081 182585 604661 352795 507344 452120 516029 501779 577059 550945
14786E50945o6776j41685L13659k23151m4710K25247B54483N43047j46455Q1827
$$ 550945 484169 342484 656143 432992 388282 613529 254483 797530 651075 732902
14776G32902Q5847j82958l8030N0391k01421r5773J93193L63137l65379K50605
$$ 732902 818749 635791 597761 648152 446731 350958 544151 907288 541909 792514
14766G92514k60342K26612r2738k561L260j15152K5263K39694N743j05505L09695
$$ 792514 532172 758784 666046 663485 666745 551593 576856 816550 822293 716788 1026483
14755A026483m39777R7105N8269n7103J32271r9716O1018J44275l21201M41247
$$ 1026483 586706 683811 742080 684977 817248 717532 778550 922825 601624 1042871
14745A042871m17369Q9318j09700j9627q011R9346j44046R5752k22407J11229
$$ 1042871 625502 714820 605120 585493 577482 676828 532782 628534 406127 517356
14735E17356N3328B13995N33826k04963p1368M02185l80532K36873j65290j73940
$$ 517356 570684 213995 747821 542858 471490 873675 493143 730016 564726 390786
14725C90786O25664m86716K40392N2486J87983k08461J6692N2911j99773j64408
$$ 390786 1016450 529734 770126 822612 1010595 802134 818826 871737 671964 507556
14715E07556K33377J12112j11607n027J98152J2274j28015J1418N5641m1781J73219
$$ 507556 740933 853045 741438 736411 934563 946837 818822 830240 885881 844100 1017319
14704A017319K8655l4797j57377N4620M69746o29189r2071L20847l36684J21738
$$ 1017319 1045974 1011177 853800 908420 1378166 748977 656906 977753 641069 762807
14694G62807j18595K93756l22810J13127L56838K10667m92906K3092l29052P88147
$$ 762807 644212 937968 615158 728285 1085123 1295790 802884 825976 496924 1285071
14684A285071l14446R0499m44166N80607k63347K6402j1562J56727Q5595j77271
$$ 1285071 970625 1061124 616958 1197565 934218 960620 949058 1105785 1191380 1014109
14674A014109j11703L09850m48415K95518O6558J2161L900J13059J2981j00422
$$ 1014109 902406 1212256 763841 1059359 1125917 1138078 1141978 1255037 1268018 1167596
14664A167596k06303J74817j42680K17650l40478L45530m9543k04087R9907K09384
$$ 1167596 961293 1136110 993430 1211080 870602 1216132 1166589 962502 1062409 1271793
14654A271793k35856J79064o5767k0057K03823l1695k79646J88625K03090p8776
$$ 1271793 1035937 1215001 1149234 1129177 1333000 1301305 1021659 1210284 1413374 1334598
14644A334598N9085j72644M532K78839l19632k6493J46168L05998l91013M39271
$$ 1334598 1393683 1221039 1225571 1504410 1184778 1158285 1304453 1610451 1219438 1658709
14634A658709k63397j66512J39610r1203l0874O2560K27501N4250k99773P9040
$$ 1658709 1395312 1228800 1368410 1277207 1246333 1308893 1536394 1590644 1290871 1369911
14624A369911j85797J18755K53397j50871r1240K75001n4829j82528J97585k75605
$$ 1369911 1184114 1302869 1556266 1405395 1314155 1589156 1534327 1351799 1549384 1273779
14614A273779M6563M30826j12916R1948j53669j65921M9552P230M40520k88184
$$ 1273779 1320342 1751168 1638252 1730200 1576531 1410610 1460162 1467392 1907912 1619728
14604A619728k51925P01075k98165k02116Q221J96194p5455J46251J12612n29444
$$ 1619728 1367803 2068878 1770713 1568597 1576818 1773012 1697557 1843808 1956420 1426976
14594A426976M35095M2457J12743R1496m23509r9883N12764k62256k47581L88634
$$ 1426976 1862071 1904528 2017271 2108767 1685258 1585375 2098139 1835883 1588302 1976936
14584A976936l37470K06437J58273J51871K9436l52056L99648j42590o1557J64950
$$ 1976936 1639466 1845903 2004176 2156047 2185483 1833427 2233075 2090485 2028928 2193878
14574B193878M1407k96960O7995M80300j49915l57869K14708J26606Q1155k00494
$$ 2193878 2235285 1938325 2006320 2486620 2336705 1978836 2193544 2320150 2401305 2200811
14564B200811K39199j01053R2541J46267K27455J84894r6462j28609N03715l18790
$$ 2200811 2440010 2338957 2431498 2577765 2805220 2990114 2893652 2765043 3268758 2949968
14554B949968Q67703l28766N71868N08285O02647J879668K767508O602047J8275140
$$ 2949968 3817671 3488905 4060773 4569058 5171705 7051373 9818881 16420928 34696068
14545C4696068K1350724B4895386A1606410m048603l710867j054154n87938K04868
$$ 34696068 56046792 24895386 11606410 7557807 3846940 2792786 2204848 2409716
14537B409716l59287J6683k37163J45711N87618k16721k07545n5090N71612m49973
$$ 2409716 2050429 2067112 1829949 1975660 2563278 2346557 2139012 2083922 2655534 2205561
14527B205561L2877L50846o2151r9268j1783J76814L8973K85075j19122j25084
$$ 2205561 2238438 2589284 2527133 2427865 2416082 2592896 2631869 2916944 2797822 2672738
14517B672738L0216k5104Q4263l8333O8416M30557m04106J62903O7191k98962
$$ 2672738 2702954 2677850 2762113 2723780 2792196 3222753 2818647 2981550 3048741 2749779
14507B749779N2980K95259J73425j8852j41159l4391J51762k19050K7900J71807
$$ 2749779 2802759 3098018 3271443 3252591 3111432 3077041 3228803 3009753 3037653 3209460
14497C209460N3768J48941J4968J49507n2188r0443j65968O51618j75309Q5786
$$ 3209460 3263228 3412169 3427137 3576644 3524456 3434013 3268045 3919663 3744354 3830140
14487C830140r2477K4865o050j99722M58514k15156n6414M69335j32262k925j83985
$$ 3830140 3737663 3762528 3756478 3556756 4015270 3800114 3743700 4213035 4080773 4077848 3893863
14476C893863L81566O0172l04097N29846p55397L52597J3902K67480m3141J17968
$$ 3893863 4275429 4335601 4031504 4561350 3805953 4158550 4172452 4439932 4396791 4514759
14466D514759L79100j61687k32275M73537m30140L64573J83678l12504M80551
$$ 4514759 4893859 4732172 4499897 4973434 4543294 4907867 5091545 4779041 5259592
14457E259592j81126j72603L66342O3918j21084Q8632P4739j4877L44586n9617
$$ 5259592 5078466 4905863 5272205 5336123 5215039 5303671 5378410 5363533 5708119 5648502
14447E648502R6028P6027L03809k45551J52529n5603R6793K37053J33901k2978
$$ 5648502 5744530 5820557 6124366 5878815 6031344 5975741 6072534 6309587 6443488 6420510
14437F420510J27336K07961m7326R4024O9438N720r2651L58628K6402J17918J06274
$$ 6420510 6547846 6755807 6708481 6802505 6871943 6877663 6785012 7143640 7170042 7287960 7394234
14426G394234K92051K19940m77926O33876k32092j4841L73950q8243l0516P21986
$$ 7394234 7686285 7906225 7428299 8062175 7830083 7815242 8189192 8100949 8070433 8792419
14416H792419J58074J49096R1636l41633K03302K81768K25250K09030j92905O78828
$$ 8792419 8950493 9099589 9191225 8849592 9052894 9334662 9559912 9768942 9576037 10254865
14406A0254865r9523P6616J24421P6876J89519L23930K91511K8709k51241K75637
$$ 10254865 10155342 10231958 10356379 10433255 10622774 10946704 11238215 11266924 11015683 11291320
14396A1291320l9646Q25756n6249K2979K57555K75632L13349M284N73966O050
$$ 11291320 11251674 12077430 12021181 12044160 12301715 12577347 12890696 12894980 13468946 13474996
14386A3474996K71072K82200L16328l8311M87146L92648K04474k4509P55912K03524
$$ 13474996 13746068 14028268 14344596 14306285 14793431 15186079 15390553 15366044 16121956 16325480
14376A6325480K84401J5985N22079N66707J60763O26155J55848L10982K97280
$$ 16325480 16609881 16625866 17147945 17714652 17875415 18501570 18657418 18968400 19265680
14367A9265680L73541N29486P49831j64130Q61335K75719N47018L04426N79711
$$ 19265680 19639221 20168707 20918538 20754408 21615743 21891462 22438480 22742906 23322617
14358B3322617O90754L52447O93218O89766L77793P59244Q23354Q9435O22119
$$ 23322617 24013371 24365818 25059036 25748802 26126595 26885839 27709193 27798628 28420747
14349B8420747J272259N22623L62047J147620M26689J445336P36090R57418J141072
$$ 28420747 29693006 30215629 30577676 31725296 32151985 33597321 34333411 35290829 36431901
14340C6431901P39931Q90704R48474J216040J289614R42562J222250J117112J458974
$$ 36431901 37171832 38062536 39011010 40227050 41516664 42459226 43681476 44798588 46257562
14331D6257562J710751J177029J561456J847306J584492J118455K465721J857011
$$ 46257562 47968313 49145342 50706798 52554104 54138596 55257051 57722772 59579783
14323E9579783J920299J896250K514693K053988K937353K312685K574382K718314
$$ 59579783 61500082 63396332 65911025 67965013 70902366 73215051 75789433 78507747
14315G8507747L173066L002035L398454L643629L556702M005864M078720L708859
$$ 78507747 81680813 84682848 88081302 91724931 95281633 99287497 103366217 107075076
14307A07075076N226555M802030M935171N512858N387740O408946O733017O565864
$$ 107075076 112301631 117103661 122038832 127551690 132939430 139348376 146081393 152647257
14299A52647257P127959P923123Q000871Q653226R599593R059961J0321065J0784647
$$ 152647257 159775216 167698339 175699210 184352436 193952029 203011990 213333055 224117702
14291B24117702J1164838J1566013J2342817J2818956J2991043J3966995J3875733
$$ 224117702 235282540 246848553 259191370 272010326 285001369 298968364 312844097
14284C12844097J4032947J4520154J4362060J3962263J3818057J3352094J2257718
$$ 312844097 326877044 341397198 355759258 369721521 383539578 396891672 409149390
14277D09149390J1324553R978015Q913663O993479M681068J505415J53426p56496
$$ 409149390 420473943 430451958 439365621 446359100 451040168 452545583 452699009 451942513
14269D51942513k716820m930845m287932p208686q840247j0666003j1538159j2803714
$$ 451942513 449225693 444294848 440006916 432798230 423957983 413291980 401753821 388950107
14261C88950107j3494407j3579150j4607993j4735149j4453111j4438745j3852720
$$ 388950107 375455700 361876550 347268557 332533408 318080297 303641552 289788832
14254B89788832j4000596j1688509j2515714j1811879j1775581j1132713r892572
$$ 289788832 275788236 264099727 251584013 239772134 227996553 216863840 206971268
14247B06971268j0305597r115181q848687p660232q166022p085452p380355o624623
$$ 206971268 196665671 187550490 178701803 171041571 162875549 155790097 148409742 141785119
14239A41785119o465280n916326m684388n732863n010466m575984m440155m383855
$$ 141785119 135319839 129403513 124719125 118986262 113975796 109399812 104959657 100575802
14231A00575802l377067l561180m041556l377592l293302l284602k712081l134849
$$ 100575802 97198735 93637555 89595999 86218407 82925105 79640503 76928422 73793573
14223G3793573k081762k553962k410155k293435j860830k442615k131764j794120
$$ 73793573 71711811 69157849 66747694 64454259 62593429 60150814 58019050 56224930
14215E6224930j809723j471389r56739j638885k241786j380501j285254j575444
$$ 56224930 54415207 52943818 51987079 50348194 48106408 46725907 45440653 43865209
14207D3865209k68111j368562j036076j796889j061785j097786o37373n00872
$$ 43865209 43597098 42228536 41192460 39395571 38333786 37236000 36598627 36097755
14199C6097755j119452j189676q45797r34631o63052o33884j066403m21788p77147
$$ 36097755 34978303 33788627 32942830 32008199 31345147 30711263 29644860 29223072 28445925
14190B8445925r65300m07469r06758M6282r22305p88770k00748o07913m60255
$$ 28445925 27480625 27073156 26166398 26212680 25290375 24501605 24300857 23692944 23232689
14181B3232689q11078n05963k42163m55250n14510m20826m24636k55555m40689
$$ 23232689 22421611 21915648 21673485 21218235 20703725 20282899 19858263 19602708 19162019
14172A9162019j88434o18211n07835J75609k40508n07887k35255l58674n23292
$$ 19162019 18973585 18355374 17847539 18023148 17782640 17274753 17039498 16680824 16157532
14163A6157532o6418n82632j89023m02395j87064k89592j31284k09015l97475
$$ 16157532 16091114 15508482 15319459 14917064 14730000 14440408 14309124 14100109 13702634
14154A3702634J03747m21553l36435L2777l67099k97356l15519l640J886m37101
$$ 13702634 13806381 13384828 13048393 13081170 12714071 12416715 12101196 12097556 12099442 11662341
14144A1662341K9243o20603P8480k50609P0594l03421r3720n3362O0092l62447
$$ 11662341 11691584 11070981 11149461 10898852 10969446 10666025 10572305 10518943 10579035 10216588
14134A0216588j20588l17578j60440k35596p1838j35057K5174J28886l65659L600
$$ 10216588 10096000 9778422 9617982 9382386 9310548 9175491 9200665 9329551 8963892 8967492
14124H967492O9920l96655p4231q9531l54626l1882j60425q6478M5162j18623
$$ 8967492 9037412 8640757 8566526 8476995 8122369 8090487 7930062 7843584 7888746 7770123
14114G770123l74182L68481m44694M97679q46100J84711o7713k4639l39828L8498
$$ 7770123 7395941 7764422 7319728 7817407 6971307 7156018 7088305 7063666 6723838 6762336
14104F762336J18165r4114k82557J35553o5519m55178M39247m05504M0152l84367
$$ 6762336 6880501 6786387 6503830 6639383 6573864 6118686 6557933 6152429 6192581 5808214
14094E808214J72991J81420k32855k36688m4256L07221m64712M2322M8019k13847
$$ 5808214 5981205 6162625 5929770 5693082 5648826 5956047 5491335 5533657 5581676 5367829
14084E367829j58211Q7645o2432o1185o5450k6599J48423k4982n24721K45561
$$ 5367829 5209618 5297263 5234831 5173646 5108196 5081597 5230020 5205038 4680317 4925878
14074D925878k47803L73751j88248m25420K60814K2004k41825Q2981l56714K39231
$$ 4925878 4678075 5051826 4863578 4438158 4698972 4720976 4479151 4562132 4205418 4444649
14064D444649K3942J33863k98430j26768J72453r3103M7558M533k37408Q6465
$$ 4444649 4468591 4602454 4304024 4177256 4349709 4256606 4304164 4308697 4071289 4157754
14054D157754j57125J81671n65512Q5903J17480j32041L68457k98000l1679J08194
$$ 4157754 4000629 4182300 3616788 3702691 3820171 3688130 4056587 3758587 3726908 3835102
14044C835102J8994l82063k04665j37796K81150k51021Q3335M2996q4742q785
$$ 3835102 3854096 3472033 3267368 3129572 3410722 3159701 3243036 3286032 3201290 3192505
14034C192505J3386j71605M03261l09760K06420J11773r4155n73038J80696l54531
$$ 3192505 3205891 3034286 3437547 3127787 3334207 3445980 3351825 2778787 2959483 2604952
14024B604952J56153J9512M71750j95055k04301J65478l36629J83850j54417j47164
$$ 2604952 2761105 2780617 3252367 3057312 2853011 3018489 2681860 2865710 2711293 2564129
14014B564129K11634K9960j03094O4767m77929P39607n61268j26481n4495K52976
$$ 2564129 2775763 2805723 2702629 2767396 2289467 3029074 2467806 2341325 2286830 2539806
14004B539806n8380o0703J55688k88102k23182O0743l9916N2928K73739m52827
$$ 2539806 2481426 2420723 2576411 2288309 2065127 2125870 2085954 2138882 2412621 1959794
13994A959794K26012r9779K26327l06891P58182K21576J596832M841699J5170865
$$ 1959794 2185806 2086027 2312354 2005463 2763645 2985221 4582053 9423752 24594617
13985B4594617L0662321k3470232A5364114o382164k748095j235165o06273l20841
$$ 24594617 55256938 31786706 15364114 8981950 6233855 4998690 4392417 4071576
13977D071576m82976k18052k906m11378l28207J91000J75827l03168k37676j57324
$$ 4071576 3588600 3370548 3367642 2956264 2628057 2819057 2994884 2691716 2454040 2296716
13967B296716L56201J20968q4670l65635O6952K58429m58280K48343m35939K5818
$$ 2296716 2652917 2773885 2689215 2323580 2390532 2648961 2190681 2439024 2003085 2028903
13957B028903J25310K8082J47720j39903R8149j69128k90567Q1793L4466J57132
$$ 2028903 2154213 2182295 2330015 2190112 2288261 2119133 1828566 1910359 1944825 2101957
13947B101957O0567l63342K50687j0826l43202Q7929J0630J31882k19194J31403
$$ 2101957 2162524 1799182 2049869 2039043 1695841 1783770 1794400 1926282 1707088 1838491
13937A838491J55687j95351k2588K10319p8459j51933J29237l00061L28010m69576
$$ 1838491 1994178 1798827 1776239 1986558 1908099 1756166 1885403 1585342 1913352 1443776
13927A443776J92945J26049j22817k713o4412K74197l90754p2576O45817k21338
$$ 1443776 1636721 1762770 1639953 1637240 1572828 1847025 1456271 1383695 2029512 1808174
13917A808174l6004k57785K5548l29070M88343k47528J57427p4573K30729K1246
$$ 1808174 1772170 1514385 1539933 1210863 1699206 1451678 1609105 1534532 1765261 1786507
13907A786507j98415n4269j03153J53391J01759l39261L98928l36650J35309k11873
$$ 1786507 1588092 1533823 1430670 1584061 1685820 1346559 1745487 1408837 1544146 1332273
13897A332273j66141R2800J91447j14596L3395k17487J24289J39347q9090J63567
$$ 1332273 1166132 1258932 1450379 1335783 1369178 1151691 1275980 1415327 1326237 1489804
13887A489804k13683R658J80566K62310n15688K99492N3876k66428j89916j56413
$$ 1489804 1276121 1285779 1466345 1728655 1212967 1512459 1566335 1299907 1109991 953578
13877I53578J61246M65918l38593j70077M5964R7618m9747q2760L22013k78020
$$ 953578 1114824 1580742 1242149 1072072 1118036 1215654 1165907 1083147 1405160 1127140
13867A127140K59910l00219o9720K09622j10027J52142J56637j05031l27004j6093
$$ 1127140 1387050 1086831 1017111 1226733 1116706 1268848 1425485 1320454 993450 977357
13857I77357K29194k10700J09117O0672L8776j70628k18090N78511l55490K16169
$$ 977357 1206551 995851 1104968 1165640 1204416 1033788 815698 1394209 1038719 1254888
13847A254888K8682l59704K17562j23806K17054l38442L97692j580l41793J41088
$$ 1254888 1283570 923866 1141428 1017622 1234676 896234 1293926 1292346 950553 1091641
13837A091641j64381j12874L0928K64597j25667J52911p3483k47672n2376M06240
$$ 1091641 927260 814386 845314 1109911 984244 1137155 1063672 816000 763624 1169864
13827A169864m51024K40387J19578m21650J65563K26184K2620L8644Q5284r7075
$$ 1169864 718840 959227 1078805 657155 822718 1048902 1071522 1110166 1195450 1098375
13817A098375j81635K57389n4084k40349M3570k65304p5211M29463R2892l03853
$$ 1098375 916740 1174129 1120045 879696 923266 657962 582751 1012214 1105106 801253
13807H01253k32580K02003K70558P565l67669N4361p3514L85206n8884n5087l56250
$$ 801253 568673 770676 1041234 1048799 681130 735491 661977 1047183 988299 933212 576962
13796E76962K36410j30116L32872l09278K1660j47243M31252J361k15596M349
$$ 576962 813372 683256 1016128 706850 728510 581267 1012519 1013880 798284 802633
13786H02633Q4990J91380n8992j63847r3123q2108K13419j33312J02021J16697
$$ 802633 887623 1079003 1020011 856164 763041 680933 894352 761040 863061 979758
13776I79758l77766k7761j20171L88833J81850l73311R8001J6883j12686j31179
$$ 979758 601992 574231 454060 842893 1024743 651432 749433 766316 653630 522451
13766E22451K86734J20535k76402q2557J43919r2748O4145K6503k73654K34370
$$ 522451 809185 929720 653318 570761 714680 621932 686077 712580 438926 673296
13756F73296P5554k38194j4270L97922k10996j92678O2947j6435J95797J16274
$$ 673296 748850 510656 496386 894308 683312 490634 553581 537146 732943 849217
13746H49217j8518q5983k51280R7157k90617R6443j6523J94829J59630j49128
$$ 849217 830699 744716 493436 590593 299976 396419 379896 574725 734355 585227
13736E85227j00821j84324K55162J30667K41846l64313J36905K6472j29499L67099
$$ 585227 484406 300082 555244 685911 927757 563444 700349 726821 597322 964421
13726I64421k53746j27865k79570N84343p9395l07118M5790K04463j13022J9050
$$ 964421 710675 582810 303240 887583 808188 501070 546860 751323 638301 657351
13716F57351j58915q462K68943Q6680k05861K11725m3056j39351J93400C80459
$$ 657351 498436 489974 758917 845597 639736 851461 808405 669054 862454 380459
13705D38419P7823K01544n6716j06635K56884l8611Q6752A62886L87836J54484
$$ 438419 516242 717786 661070 554435 811319 772708 859460 162886 550722 705206
13695G05206J01606k66519p715K57832j43011j50363K5067O6360o0524j14449
$$ 705206 806812 540293 532578 790410 647399 497036 522103 588463 527939 413490
13685D13490J45172J34008L527B59318O9788J06334K0537K80918j3634C01168
$$ 413490 558662 692670 696197 259318 329106 435440 455977 736895 723261 301168
13674F19860j83333J32099p8463n049J11051j73768m7456K9891l6539N9738k4782
$$ 619860 436527 568626 490163 485114 596165 422397 374941 404832 368293 428031 403249
13663D03249K35140j31402j12676J85717j64224M57868k95167k59886K93722j28128
$$ 403249 638389 506987 394311 580028 415804 873672 578505 318619 612341 484213
13653D84213J46313k43251L53117k87812A13223M14026A64869L00587R1098k36604
$$ 484213 630526 387275 740392 452580 113223 527249 164869 465456 556554 319950
13643C19950J15598j15377L56861l14424j18948J63217j49497K66873K41491l63316
$$ 319950 435548 320171 677032 362608 243660 406877 257380 524253 765744 402428
13633D02428j91679N25062k31734j29664a4977E81775j1914k81494J08110K23865
$$ 402428 210749 735811 504077 374413 -14977 581775 569861 288367 396477 620342
13623F20342C0041O51314j00738B67292P2566K48003k12638k0110j68392M99084
$$ 620342 30041 681355 580617 267292 339858 587861 375223 355113 186721 685805
13613F85805k73445L40500j15374C16239p382K25340B45872K85615o4982l6455
$$ 685805 412360 752860 637486 316239 308857 534197 245872 531487 466505 430050
13603D30050R5037k04697J76875R1278k68926j09806O1331p0267K87016B33140
$$ 430050 525087 320390 497265 588543 319617 209811 271142 200875 487891 233140
13592F89904p8686k34816J41990j74709M07000B42277P82L55899j34303j09760
$$ 689904 611218 376402 518392 343683 750683 242277 243059 598958 464655 354895
13582C54895A03706J46236k4929J00769J29585j67240J18210A45497m2563K71847
$$ 354895 103706 249942 225013 325782 455367 288127 406337 145497 102934 374781
13572C74781J93288P7587B02321J43225A49555h7838D69568l9286n9145F4655
$$ 374781 568069 645656 202321 345546 149555 -87838 469568 430282 371137 64655
13561E32359m8560p2158j8595J4614K7326J33890k37170j05181L65972B76315
$$ 532359 483799 411641 393046 407660 434986 568876 331706 226525 592497 276315
13550C58675j20391J77586q8587J13175j07157j39568J58568j75037J55160K38381
$$ 358675 238284 415870 327283 440458 333301 193733 352301 177264 332424 570805
13540E70805B47039Q2356A61729B5172P1827N01654k24941m365r0674a684C32904
$$ 570805 247039 329395 161729 25172 96999 598653 373712 369347 278673 -1684 332904
13528B13710J57210Q9936K6641q7395j16564K76417A12687d7172B50862K28423
$$ 213710 370920 460856 487497 400102 283538 559955 112687 -47172 250862 479285
13518D79285n6619J12428B61025A06529M58699k33612Q5708p1507A49545N10440
$$ 479285 422666 535094 261025 106529 565228 331616 417324 345817 149545 659985
13508F59985k66654k6662r581j4051j48666o8750J13084J48959O9079j38119n1883
$$ 659985 393331 366669 357088 343037 194371 125621 238705 387664 456743 318624 266741
13497B66741A3115a42898D99485B32899E2186K30067L8194o0693K1632b401A56930
$$ 266741 13115 -142898 499485 232899 52186 282253 320447 259754 281386 -2401 156930
13485B99232j13811f9937C59381a54596C13935k832p5121q0046P2657K7168K15476
$$ 299232 185421 -69937 359381 -154596 313935 311103 235982 155936 228593 255761 471237
13474D71237m8958r0845A49312L32945c0826B38769j15437J15156p9826J39103
$$ 471237 422279 331434 149312 482257 -30826 238769 123332 238488 158662 297765
13464B97765p6865q3766L25466j51570n0246Q6980j15019L28821m0523A33528
$$ 297765 220900 137134 462600 311030 260784 347764 232745 561566 521043 133528
13453D67595r5206r5220K5828K86298j85805m2794m3168f8334E5407J50210J00409
$$ 467595 372389 277169 302997 589295 403490 360696 317528 -68334 55407 205617 306026
13442C06026A37923O7242i9099E52551j34387I6662r91J10416l1378P497N7522
$$ 306026 137923 205165 -99099 552551 418164 96662 95671 206087 174709 182206 239728
13431B39728L5957B6592g2460D64330A13791K83932F7337J56246K3367E9053a48404
$$ 239728 275685 26592 -72460 464330 113791 397723 67337 223583 246950 59053 -148404
13419A63284J77140A39089R0867p6089C5939A3203J53249k4990L12461M4711A87016
$$ 163284 340424 139089 229956 153867 35939 13203 166452 141462 453923 498634 187016
13407C32970J89944A60775C3004K97797A36328K06441J8196j09269h718D598K8591
$$ 332970 522914 160775 33004 330801 136328 342769 360965 251696 -8718 4598 33189
13396C3189f2480C17098n8863O4114a54744B23947M6780K55742r1051B08655K34414
$$ 33189 -62480 317098 258235 322349 -154744 223947 270727 526469 435418 208655 443069
13385D43069A31467L01095E1019J96581J63331p3438j17678q2916n6409C1254
$$ 443069 131467 432562 51019 247600 410931 337493 219815 136899 80490 31254
13374B31019J21257l8232f3518A19323J20552Q212K426i93B13211J0417J998L93392
$$ 231019 352276 314044 -63518 119323 239875 248087 250513 -993 213211 223628 225626 619018
13362F19018k40925q0181D5805N4552P5374R2913J26085Q0761j22695A35504a70783
$$ 619018 378093 297912 45805 100357 175731 268644 394729 475490 352795 135504 -170783
13350D64017A28058J08522p1668L47663B36021J13270j29406K08729j90021E1161
$$ 464017 128058 236580 164912 512575 236021 349291 219885 428614 238593 51161
13339D28844K41429c2655B93037a36292C33592I4129l1167J10996P7946N0680
$$ 428844 670273 -32655 293037 -136292 333592 94129 62962 173958 251904 302584
13329C02584J02660C4308M96998r6142A84414J06236C6930L03466d5685C86341
$$ 302584 405244 34308 531306 435164 184414 290650 36930 340396 -45685 386341
13318i1069A53042n4975J07416J94568P9050G5822L68193a0750B22741M7071J06992
$$ -91069 153042 98067 205483 400051 479101 75822 444015 -10750 222741 269812 376804
13307C76804r821F9012J9199K56090j03541j0449J76223b5427B95278a1002A94837
$$ 376804 366983 69012 88211 344301 240760 230311 406534 -25427 295278 -11002 194837
13295G4868J57713i3474A80468J41657j32042c73829D83242j95175k7159o9707
$$ 74868 232581 -93474 180468 322125 190083 -373829 483242 288067 260908 191201
13285A91201R3098e7818G5545m959L0843N4315o0421J40558H7024L74256n0134
$$ 191201 284299 -57818 75545 70586 101429 155744 95323 235881 87024 461280 411146
13274D11146H0193K53089G2980J77937k6814M53578b28794B91193A06788a92322
$$ 411146 80193 333282 72980 250917 224103 677681 -228794 291193 106788 -192322
13263C56240H1724K13084b9118B00963p8604Q5073r1881f1385H8179R192l6223
$$ 356240 81724 294808 -29118 200963 122359 207432 115551 -61385 88179 97371 61148
13252F1148K5b08994A42571E5584J97459r9672b4297A75077J48892m3721c3587
$$ 61148 61173 -208994 142571 55584 253043 153371 -24297 175077 323969 280248 -33587
13240A79417C8518a61500d4636A59446i0511J0626k4463A85957i0960k32574I4409
$$ 179417 38518 -161500 -44636 159446 -90511 -79885 -104348 185957 -90960 -323534 94409
13228A5198O5712R3954Q9570C6493A8130J3877P3325R0302o2648J69908m0208
$$ 15198 80910 174864 264434 36493 18130 32007 105332 195634 132986 302894 262686
13217B62686D6331a36141M6664A49806E2495L77473C0518K03796I0027J8876j3791
$$ 262686 46331 -136141 -89477 149806 52495 429968 30518 234314 90027 108903 95112
13206I5112L90096B42034M1260A11614B1363O5836A448K19380J9235K8236a99456
$$ 95112 485208 242034 283294 111614 21363 87199 1448 220828 240063 268299 -199456
13194I0471D1921a21731C83881M1345b929B19866i550D62779j74165c10909B55291
$$ 90471 41921 -121731 383881 425226 -2929 219866 -9550 462779 288614 -310909 255291
13182B91047o2088a44564L2432A32008a92705k0837e0340j4799A09819O5459j0817
$$ 291047 228959 -144564 -112132 132008 -192705 -213542 -50340 -65139 109819 175278 164461
13171A64461n5575n1317J01383h5108f456A19621J27543m9428J80847A62623i7244
$$ 164461 108886 57569 158952 -85108 -6456 119621 247164 197736 378583 162623 -97244
13159B01692L3662J89333k01211a17231C14794a85166C23717E1372b8189h220
$$ 201692 235354 424687 223476 -117231 314794 -185166 323717 51372 -28189 -8220
13148b36502A19483a3262A32368o5067O4245k4803L4721l6116J6021k9913K683
$$ -236502 119483 -13262 132368 67301 131546 106743 141464 105348 121369 91456 94139
13137I4139f8113I5338L9946O93P9962l8715C2279J77203P7512a85071A04609
$$ 94139 -68113 95338 135284 135977 215939 177224 32279 209482 286994 -185071 104609
13125a75539b494C2311b4507j08251E8756N5865n0710P7428B5913g7230J6999
$$ -175539 -2494 32311 -24507 -132758 58756 114621 63911 141339 25913 -77230 -60231
13114f0231m6311C12090A9358f9389A98829F8170i8844C11449d3830A09935m1122
$$ -60231 -106542 312090 19358 -69389 198829 68170 -98844 311449 -43830 109935 68813
13103F8813K79414G9941C6001J33086M1200a04831b6530m6420C07613B8018L24949
$$ 68813 348227 79941 36001 169087 210287 -104831 -26530 -72950 307613 28018 352967
13092C52967a64611A52135N0184r5604J92525A15090j506J25484k9312b40158
$$ 352967 -164611 152135 202319 106715 299240 115090 113584 239068 209756 -240158
13081a25475B70248j21544J63005I1502g5178A94238i4519F6010c02432D3487
$$ -125475 270248 148704 311709 91502 -75178 194238 -94519 66010 -302432 43487
13070B67232A19687L32003a68759g0527j03293B95662j12734A9534R3042J27847
$$ 267232 119687 451690 -168759 -70527 -173820 295662 182928 19534 112576 240423
13060B40423M7360a70729C9373h7591H7827K29887f2803B78711a30729e243D29498
$$ 240423 287783 -170729 39373 -87591 87827 317714 -62803 278711 -130729 -5243 429498
13048A94627O8753G8414c2846A32028m7791L5094j678k9665C7073c6975B9593
$$ 194627 263380 78414 -32846 132028 84237 119331 117653 87988 37073 -36975 29593
13036b81418A51703h5472A49302E915b2486k52582C01893A359J8105L33059a24095
$$ -281418 151703 -85472 149302 5915 -22486 -275068 301893 1359 19464 352523 -124095
13024C58760i7092k6641a8409Q177B03091F6961J44486C9937a17528A91561p5944
$$ 358760 -97092 -123733 -18409 -10232 203091 66961 211447 39937 -117528 191561 115617
13013A15617R1618i4239A65013M6767I2222j0062B1264Q3727B0129R1630a38449
$$ 115617 207235 -94239 165013 211780 92222 82160 21264 104991 20129 111759 -138449
13001B1675A0221J01003M7522a48907A68037a6543n611A34552a07377C70206A37764
$$ 21675 10221 111224 158746 -148907 168037 -16543 -22154 134552 -107377 370206 137764
12989b98842C98865E0374K24908J8854G2323J96777L1850G9340J3061M9183l7712
$$ -298842 398865 50374 275282 294136 72323 269100 300950 79340 92401 141584 103872
12978A03872N3211R6510A25895h9870q1877A83065D6489c4304B16936F0169J83093
$$ 103872 157083 253593 125895 -89870 -171747 183065 46489 -34304 216936 60169 243262
12967B43262f0527A38453K7406A7648l039K63301i8694A72123e8770A8230f5045
$$ 243262 -60527 138453 165859 17648 14609 277910 -98694 172123 -58770 18230 -65045
12955e2245A26540b10872A26093b41098A80604J73082m4323d5469B77952D6186
$$ -52245 126540 -210872 126093 -241098 180604 353686 309363 -45469 277952 46186
12944c8503A57684c59991H0425h0272A12546J950c25886A70713P9485a62464b8899
$$ -38503 157684 -359991 80425 -80272 112546 114496 -325886 170713 250198 -162464 -28899
12932B10770g7857D9295J13868J2458l6726J04137o0472g5675k6903C06041e5728
$$ 210770 -77857 49295 163163 175621 138895 243032 182560 -75675 -102578 306041 -55728
12920h1679o3950E4202K12495c6912F27573b29731B12918b23472B71831A31679
$$ -81679 -145629 54202 266697 -36912 627573 -229731 212918 -223472 271831 131679
12909C25931n0854A12843K12645b51072m80A65037a89564O5042B103b47914e5811
$$ 325931 275077 112843 325488 -251072 -251552 165037 -189564 -124522 2103 -247914 -55811
12897c6272q1412B32136b9753C67448a70500O8915C27917o9795A18595J23410
$$ -36272 -117684 232136 -29753 367448 -170500 -101585 327917 258122 118595 242005
12887B42005C5461P4433B3856f4710B14982I8225M7485i8622B91455d01229C0649
$$ 242005 35461 109894 23856 -64710 214982 98225 145710 -98622 291455 -401229 30649
12875C21444k4292i8157G2003c683F6871J6220c125A50280a70680A5083O5291
$$ 321444 297152 -98157 72003 -3683 66871 83091 -3125 150280 -170680 15083 80374
12864H0374b29574A48714e7A6534J45993o8361f8129C6849J87356a52601A39572
$$ 80374 -229574 148714 -57 16534 162527 94166 -68129 36849 224205 -152601 139572
12852A58293Q2746l5595L1508b94736E2945a62513A10647a48481D0881Q3802b28841
$$ 158293 241039 205444 236952 -294736 52945 -162513 110647 -148481 40881 124683 -228841
12840a839F1126K06392B6244R8104c31158d0630E2053k5571J71263m5852i0574
$$ -1839 61126 267518 26244 124348 -331158 -40630 52053 26482 197745 151893 -90574
12828b14314A35154C5446E222j491b00620b6709m444A40825l1751Q6730m0278
$$ -214314 135154 35446 5222 3731 -200620 -26709 -31153 140825 109074 195804 155526
12817A55526a93453N3962B9686b8643B2553f4755k08970F3505a36617c1101o8690
$$ 155526 -193453 -139491 29686 -28643 22553 -64755 -273725 63505 -136617 -31101 -99791
12806i9791G3696f0500j58286P2169j90753B86879c38116C50966g7076I9842M9782
$$ -99791 73696 -60500 -218786 -146617 -337370 286879 -338116 350966 -77076 99842 149624
12795A49624J15173a49894a6108A59454a41478A39256q805b93916J16227B03957
$$ 149624 264797 -149894 -16108 159454 -141478 139256 130451 -293916 -177689 203957
12784B38373g5214C01918j25762G0298A8459K86153j37942b00224A17098a28597
$$ 238373 -75214 301918 176156 70298 18459 304612 166670 -200224 117098 -128597
12773d2744a4797l85592C27026G5285J09331j4612b95052h2307L4978n6186l18
$$ -42744 -14797 -400389 327026 75285 184616 170004 -295052 -82307 -47329 -103515 -103833
12762a03833j51548G2217B1133j211L12634A41924d7173D67308B8007N3297J00472
$$ -103833 -255381 72217 21133 19922 332556 141924 -47173 467308 28007 81304 181776
12751A81776N7498e0862a9131j25674G7298M4441h9840A52605K19475F6756R0759
$$ 181776 239274 -50862 -19131 -144805 77298 121739 -89840 152605 372080 66756 157515
12740A57515b23175A9276c9661A04179O241L0782E2565L13632A04766a45744A65719
$$ 157515 -223175 19276 -39661 104179 110420 141202 52565 366197 104766 -145744 165719
12728a01893M2990G6813B6809a95408B98637f8564A3251P9743a8132p9699A16483
$$ -101893 -58903 76813 26809 -195408 298637 -68564 13251 92994 -18132 -97831 116483
12716a7276G0379N5590C1806a5380F5586J24794a15355B62405m9704h6352A02069
$$ -17276 70379 125969 31806 -15380 65586 190380 -115355 262405 212701 -86352 102069
12704C8195L01938J525K5481a3437B0760n707b23623I0229R3126N5346J2459e9129
$$ 38195 340133 341658 367139 -13437 20760 15053 -223623 90229 183355 238701 251160 -59129
12691a44297A24288R8388J36341a73152q0620A59513O9895G3512M65506D9704
$$ -144297 124288 222676 359017 -173152 -253772 159513 229408 73512 539018 49704
12680A80441F3386J56446E463N0236Q7730O8858f6031D18206r4524M1781e54320
$$ 180441 63386 219832 5463 55699 143429 212287 -66031 418206 323682 365463 -554320
12668h5984G830R2973J07708b4579q5266a0908B16040p7897g964J394G5499a49920
$$ -85984 7830 100803 208511 -24579 -109845 -10908 216040 138143 -7964 -6570 75499 -149920
12655a79722C9011M41890A65122H0035K41094J17353D3162a46697h217k9125d732
$$ -179722 39011 480901 165122 80035 321129 438482 43162 -146697 -8217 -37342 -4732
12643A50221J12836b50989B694O6955K88105a13297A30584j6177L7212J86872
$$ 150221 263057 -250989 2694 69649 357754 -113297 130584 114407 151619 338491
12633C38491J8778r3577r4387H0177a3166B65881e975B90936K17962e65A75767
$$ 338491 357269 263692 169305 80177 -13166 265881 -5975 290936 508898 -565 175767
12621B63148l8405n0562J54397j09294J15259a29922B96630a03167o311n6843
$$ 263148 224743 174181 328578 219284 334543 -129922 296630 -103167 -109478 -166321
12611a66321A59340m7788J7603K660g3712m4565E0584M4152C7113a2069G3237
$$ -166321 159340 111552 129155 131815 -73712 -118277 50584 94736 37113 -12069 73237
12599a16656A78437B1797K04744K00767A47007c8470A74076E9659a47611B64485
$$ -116656 178437 21797 226541 427308 147007 -38470 174076 59659 -147611 264485
12588A43218C07L99986d1506n6456E45281c018l4895A25849a69466B64710a0154
$$ 143218 307 400293 -41506 -97962 545281 -3018 -37913 125849 -169466 264710 -10154
12576B1260e9439o0113e8623B32767i1714A32753k5078O3582a66630C79563a02464
$$ 21260 -59439 -119552 -58623 232767 -91714 132753 107675 171257 -166630 379563 -102464
12564a36801A77406m7672H44f5186I5682c7951B68801a80379B87170D0066c38436
$$ -136801 177406 129734 844 -65186 95682 -37951 268801 -180379 287170 40066 -338436
12552A17338b3245k63673g2970K9402B92457B5281a09946B48926i7414A46735
$$ 117338 -23245 -286918 -72970 -43568 292457 25281 -109946 248926 -97414 146735
12541a97742D162K27023l7257j1472N2435p6368a3674C2536J50359f1221B42095
$$ -197742 4162 231185 193928 182456 234891 158523 -13674 32536 182895 -61221 242095
12529B19266J81574a0097j72329b2407j11521c9425F4383a0081B26959A3659c93006
$$ 219266 400840 -10097 -182426 -22407 -133928 -39425 64383 -10081 226959 13659 -393006
12517c19613B29124e758A38437o3570K24111a07775i418E13b44139F5274b40608
$$ -319613 229124 -5758 138437 74867 298978 -107775 -9418 513 -244139 65274 -240608
12505a20107o3799g0601A16581A2286L05588b3032G4644f2328A00311O3504n0055
$$ -120107 -183906 -70601 116581 12286 317874 -23032 74644 -62328 100311 163815 113760
12494A13760C9269h4291a7364j4492C00088G1580K7724C5208a84117C0110b66024
$$ 113760 39269 -84291 -17364 -31856 300088 71580 99304 35208 -184117 30110 -266024
12482A54091J36040a32528A83599e2878C47424g2903r8348H5126d3007p4592B2997
$$ 154091 290131 -132528 183599 -52878 347424 -72903 -171251 85126 -43007 -117599 22997
12470I1278f1785H7372b31575R2029j41229e343l15294N4690N9637O8076B45273
$$ 91278 -61785 87372 -231575 -139546 -280775 -5343 -320637 -265947 -206310 -138234 245273
12458A12244I947a67013P4299C07604a84787i757j31161p8940r6638D6058b93588
$$ 112244 9947 -167013 -92714 307604 -184787 -9757 -140918 -219858 -316496 46058 -293588
12446b06948B23436j9860B4816J32711a0894A59173K2705a67098G5004c4905F9195
$$ -206948 223436 203576 24816 157527 -10894 159173 181878 -167098 75004 -34905 69195
12434A44955b1357A1148N880J43928i4843A1309K17872B1653a45649i756A51405
$$ 144955 -21357 11148 17028 160956 -94843 11309 229181 21653 -145649 -9756 151405
12422a48563J5432A64014L4402f0158C02685f397I996R753e1764i821k1992l9085
$$ -148563 -133131 164014 198416 -60158 302685 -6397 9996 19749 -51764 -9821 -31813 -70898
12410g0898G3099O6496a09060k34450H6327c0982C9429K03290c0421j74944C9744
$$ -70898 73099 139595 -109060 -343510 86327 -30982 39429 242719 -30421 -205365 39744
12398D9026e094A55806L4401M2261c1998m27299J11773A6913K17322b27504A71956
$$ 49026 -5094 155806 190207 232468 -31998 -459297 -347524 16913 234235 -227504 171956
12386I5796J1622j5696p999a82765A10263P4859n9695C6155a27514B5643L4335
$$ 95796 107418 91722 83723 -182765 110263 185122 125427 36155 -127514 25643 59978
12375E9978K02361g0890j8557r8511A17712a36846c5087A3596J24194a89127L3709
$$ 59978 262339 -70890 -89447 -187958 117712 -136846 -35087 13596 137790 -189127 -155418
12364a55418B36831h0976C5732c7298o3803D3461j7626J36525J83662c0042I038
$$ -155418 236831 -80976 35732 -37298 -101101 43461 25835 162360 346022 -30042 9038
12352f3359A02289J89573a4192j05145M7846A25999i1768b2587l43310A09950
$$ -63359 102289 291862 -14192 -119337 -71491 125999 -91768 -22587 -365897 109950
12341B45270i5537j26882I3482a23406c3187C43343a37382G1312a5941n5036p5566
$$ 245270 -95537 -222419 93482 -123406 -33187 343343 -137382 71312 -15941 -70977 -146543
12330a46543A42084a62940A4244J96759i3737A67037a64756E0842O0608E5038
$$ -146543 142084 -162940 14244 211003 -93737 167037 -164756 50842 111450 55038
12319c5481k60092B15681a06956n7553P1027k4792B79975c50747A55898F6170
$$ -35481 -295573 215681 -106956 -164509 -93482 -118274 279975 -350747 155898 66170
12308B28508d3385B10731C3048K48357b09166J4258f1422a3356G6698k4507N5505
$$ 228508 -43385 210731 33048 281405 -209166 -194908 -61422 -13356 76698 52191 107696
12297A07696c66820a4568H180M50560c710m4781C09868a22214o2838B02482B3232
$$ 107696 -366820 -14568 8180 458740 -3710 -48491 309868 -122214 -185052 202482 23232
12285b16022A90641H725A84P1066g9673A41763a87295m6392B44472E2997J71873
$$ -216022 190641 8725 184 71250 -79673 141763 -187295 -233687 244472 52997 224870
12274B24870Q1127J8698K18311B23328d76542A84465H252K60308d5788C07661
$$ 224870 305997 324695 543006 223328 -476542 184465 8252 268560 -45788 307661
12263a10280j6757B27269K2267H658L26716H891c04062B60738j15193j1429l6622
$$ -110280 -127037 227269 249536 8658 335374 8891 -304062 260738 145545 134116 97494
12252I7494e9764A39053B6786R0049k4126N4161J27955D8462b19455b0893q3594
$$ 97494 -59764 139053 26786 116835 92709 146870 274825 48462 -219455 -20893 -104487
12241a04487I6845J34248n4491m2949B6341J07033l5482j1143J82718n6652J45014
$$ -104487 96845 231093 176602 133653 26341 133374 97892 86749 269467 212815 357829
12230C57829m0899C9657d5263C42983j15200J0687J93373r5569K1244A42461J98657
$$ 357829 316930 39657 -45263 342983 227783 238470 431843 336274 357518 142461 341118
12219C41118j16464K83938k17157R0043J00445B29097o2403G2670J52450N772
$$ 341118 224654 508592 291435 381478 481923 229097 166694 72670 225120 230892
12209B30892c5867A92372d6798B12630M25004c8659j30994A92132r0516J51454
$$ 230892 -35867 192372 -46798 212630 637634 -38659 -169653 192132 101616 253070
12199B53070E502L60503j69371P248M4638m696K24862A22619J19611k7821H6127
$$ 253070 5502 366005 196634 203882 248520 243824 468686 122619 242230 214409 86127
12187B12530m2703K25462j76960Q2918q7889o7229F4763j8556J15025k9731N3898
$$ 212530 169827 395289 218329 301247 213358 146129 64763 46207 161232 131501 185399
12176A85399C4510A390L6612K30942A416f4962D33240A61481i0827A4489O8800
$$ 185399 34510 1390 38002 268944 1416 -64962 433240 161481 -90827 14489 83289
12165H3289g2193j14425d9544A59718P514m7534E3799c04541D15979F1675a77761
$$ 83289 -72193 -186618 -49544 159718 167232 119698 53799 -304541 415979 61675 -177761
12153a32721B1350e4252n4372F6186b04300b8625B30580B2901K20088a63463G8516
$$ -132721 21350 -54252 -108624 66186 -204300 -28625 230580 22901 242989 -163463 78516
12141A2263a73752A95366M3668M8392A08716J47753c4035k3517A19441e7018C19794
$$ 12263 -173752 195366 239034 287426 108716 256469 -34035 -57552 119441 -57018 319794
12129A09032K950d1264B71242c4231A08917d6039B21269K0874A5519J03928L23796
$$ 109032 111982 -41264 271242 -34231 108917 -46039 221269 242143 15519 119447 443243
12118D43243a36808b3876j08410B0384i6927E9037K7900L9977K97265b3720k8227
$$ 443243 -136808 -23876 -132286 20384 -96927 59037 86937 126914 424179 -23720 -51947
12107e1947A36496k1025L9981J20008j32755n2794a07541c6905D9799R1722c29562
$$ -51947 136496 115471 155452 275460 142705 89911 -107541 -36905 49799 141521 -329562
12095c21500a56576A28759k9481l2381b10323A13638N0735a89860B96252b17253
$$ -321500 -156576 128759 99278 66897 -210323 113638 164373 -189860 296252 -217253
12084A50637b31565i7794F8925M4665a13807B04608J23126A60599M53066J698990
$$ 150637 -231565 -97794 68925 113590 -113807 204608 327734 160599 613665 2312655
12074B312655A033112C61784j43386J55622b14100c4659A81160h377B4182c02841
$$ 2312655 1033112 361784 218398 374020 -214100 -34659 181160 -8377 24182 -302841
12063h6850J5079A98018N0779A07942a24792b1608q2860d9273a9695B54439P1543
$$ -86850 -71771 198018 248797 107942 -124792 -21608 -104468 -49273 -19695 254439 325982
12052C25982j04732I3128f5165b8885m6594B3764a36207L6494B12239g8394L9104
$$ 325982 221250 93128 -65165 -28885 -75479 23764 -136207 -99713 212239 -78394 -39290
12041c9290j8902C1862c6071H0684a38029a4266I2736B7055a21991N4995r8087
$$ -39290 -58192 31862 -36071 80684 -138029 -14266 92736 27055 -121991 -66996 -165083
12030a65083A85125a00338k5970i451o1961r9866j1461D8913b1903A29505D901
$$ -165083 185125 -100338 -126308 -9451 -71412 -171278 -182739 48913 -21903 129505 4901
12018A66891b03101j20845I9362c87813A54527E6692d39160A27394b33491b167
$$ 166891 -203101 -323946 99362 -387813 154527 56692 -439160 127394 -233491 -2167
12007a85168D5549Q6344B1373a09943H3293a05140d0021I9381a0728L489A18169
$$ -185168 45549 131893 21373 -109943 83293 -105140 -40021 99381 -10728 -7239 118169
11995g8129k372k1907D0317a31438o6469B01094b42802A6779K4069i5147B45386
$$ -78129 -80501 -102408 40317 -131438 -197907 201094 -242802 16779 40848 -95147 245386
11983c87400d2845j80405e4245n0031M3616G0377N2812Q8432J15537A28997b30591
$$ -387400 -42845 -223250 -54245 -104276 -60660 70377 123189 211621 327158 128997 -230591
11971a0313l67666a6858B02258a4992B68b91506A16607J42124d04641a25796B37647
$$ -10313 -377979 -16858 202258 -14992 268 -291506 116607 258731 -404641 -125796 237647
11959d648m33088C2382K51102j39277A4154J3559g0728D8855M1619R4747L5034
$$ -4648 -437736 32382 283484 144207 14154 27713 -70728 48855 90474 185221 220255
11948B20255A7335d339D2644A8465K25919a05411B07313G0468a29646o0795c9952
$$ 220255 17335 -4339 42644 18465 244384 -105411 207313 70468 -129646 -190441 -39952
11936E20513a22371e9560j85759A02262B3631M6649L57119A22437A6015K8704
$$ 520513 -122371 -59560 -245319 102262 23631 70280 427399 122437 16015 44719
11926D4719J58769D9865c16436A7713a18372K2267F4935g127A0071K7067a22857
$$ 44719 203488 49865 -316436 17713 -118372 -96105 64935 -7127 10071 37138 -122857
11914G634L8205a64276K1752B19366D968K4191K07780C0663M0300h0742c3454
$$ 7634 45839 -164276 -142524 219366 4968 29159 236939 30663 70963 -80742 -33454
11902a36945C37145g998j92258o6819M1321Q6909K4000l6744B06549a71970A25831
$$ -136945 337145 -7998 -200256 -267075 -225754 -138845 -114845 -151589 206549 -171970 125831
11890F6040b61096a03100C05393a25370A3674a25270g602D5513a49928D58728
$$ 66040 -261096 -103100 305393 -125370 13674 -125270 -7602 45513 -149928 458728
11879i656B21848e2754I5730A3547b06584b1092j35478q3654B10566r1238a71160
$$ -9656 221848 -52754 95730 13547 -206584 -21092 -156570 -240224 210566 119328 -171160
11867E1088a01478B714J14715b49119i114B15196a34795D41812b37745p5107I8672
$$ 51088 -101478 2714 117429 -249119 -9114 215196 -134795 441812 -237745 -312852 98672
11855B1290J28955C6060a99110B64152r6908g6759p9553f8620q4910q4548G6930
$$ 21290 150245 36060 -199110 264152 167244 -76759 -156312 -68620 -153530 -238078 76930
11843A68660b93569A46700j2339l7544l8370K9854c5599l5638A06200k3799o318
$$ 168660 -293569 146700 134361 96817 58447 88301 -35599 -71237 106200 82401 76083
11832G6083b95233F6540N1418O8142A3242a10940N3661k04950h5800L9428D3087
$$ 76083 -295233 66540 117958 186100 13242 -110940 -57279 -262229 -85800 -46372 43087
11820a52274j64222r1059c6458l6074m5564e0268o3612A6401a4487j3878n0667
$$ -152274 -316496 -407555 -36458 -72532 -118096 -50268 -113880 16401 -14487 -28365 -79032
11809g9032k91886C8551a18349C10934d5144k3495A42845i2196H1966a54598j0303
$$ -79032 -370918 38551 -118349 310934 -45144 -68639 142845 -92196 81966 -154598 -164901
11798a64901j4394B0065i9024k22185c3857A79032E4746j7291P7025b04058I950
$$ -164901 -179295 20065 -99024 -321209 -33857 179032 54746 37455 114480 -204058 9950
11786a16169C56398b29796B700J67168J86935B6530a74755k53694G7047b624l9491
$$ -116169 356398 -229796 2700 169868 356803 26530 -174755 -428449 77047 -2624 -42115
11775d2115j94412f303j2510B82825b35522A29276c768D0853f7450a2835j03537
$$ -42115 -236527 -6303 -18813 282825 -235522 129276 -3768 40853 -67450 -12835 -116372
11764a16372n6454A97939b18200C18644b4155B13183a47468d7928K309l9126m1557
$$ -116372 -172826 197939 -218200 318644 -24155 213183 -147468 -47928 -45619 -84745 -126302
11753a26302j03813a3296k01411a06758j82513e2989g913j04146j34526e920D6670
$$ -126302 -230115 -13296 -214707 -106758 -289271 -52989 -7913 -112059 -246585 -5920 46670
11741G9947f66q1920l3294A50815e551m20832b5620E075b78253Q1554B65032A9236
$$ 79947 -666 -82586 -115880 150815 -5551 -426383 -25620 5075 -278253 -196699 265032 19236
11728b04432M5510N0969k16959a07298j64169B16636a38349B18604d6187A58165
$$ -204432 -158922 -107953 -324912 -107298 -271467 216636 -138349 218604 -46187 158165
11717A94913e2357j08673P8475b7096k3569A68189d70411C0968L36243j71770
$$ 194913 -52357 -161030 -82555 -27096 -50665 168189 -470411 30968 367211 195441
11707A95441a32487G7870C595K6687O1449R7475H6803h9318B14710q9342e8052
$$ 195441 -132487 77870 3595 30282 91731 189206 86803 -89318 214710 125368 -58052
11695i3168o4141I6464C7798N7951M1194b26203C8263D361L09149E5672d63353
$$ -93168 -157309 96464 37798 95749 136943 -226203 38263 4361 313510 55672 -463353
11683B87115j13424c41970G4082J34425A1245M71026b4445H9106B5755c46531
$$ 287115 173691 -341970 74082 208507 11245 482271 -24445 89106 25755 -346531
11672a3190n9536L2012m1117F1729Q7753a98755f4670B8367J88243j3458n1647
$$ -13190 -72726 -40714 -81831 61729 149482 -198755 -64670 28367 216610 203152 151505
11661A51505m882b51056d44k18677q0760c5369A16937c128l17786B3140c8129
$$ 151505 146623 -251056 -444 -219121 -299881 -35369 116937 -3128 -320914 23140 -38129
11649B86234a0689A21452N4306J45225a55844e3225B09513a24972B6826K69626
$$ 286234 -10689 121452 175758 320983 -155844 -53225 209513 -124972 26826 296452
11639B96452g4225j33313A90195h101B14035J50153a02799a674F2606j7362b33594
$$ 296452 -74225 -207538 190195 -8101 214035 364188 -102799 -1674 62606 45244 -233594
11627C84662g4003B22686D3908Q8695a85134A47023d1271r6686D2836b00186A10287
$$ 384662 -74003 222686 43908 132603 -185134 147023 -41271 -137957 42836 -200186 110287
11615b10757H3892L9254L3817h3430m1403b2112A30427b84453a6256j01434a2105
$$ -210757 83892 123146 156963 -83430 -124833 -22112 130427 -284453 -16256 -117690 -12105
11603a0028A87551C7941K34647H9863k5931J24639b0237B39971j11775a31327
$$ -10028 187551 37941 272588 89863 63932 188571 -20237 239971 128196 -131327
11592G6112f2201A90169b01629f0544A61816r220g5461L1423A56109G0604a16334
$$ 76112 -62201 190169 -201629 -60544 161816 152596 -75461 -44038 156109 70604 -116334
11580b33853h4402b2077l081A34092J53740a07843b2396D2898J35112f4028j6019
$$ -233853 -84402 -22077 -25158 134092 287832 -107843 -22396 42898 178010 -64028 -80047
11569h0047A67612p195k7627L1954d1980a0027n6436A31029A9239i9456a066l9500
$$ -80047 167612 160417 132790 164744 -41980 -10027 -66463 131029 19239 -99456 -1066 -40566
11557d0566j31892r5595J31601A76255a40688k4684A30130R9386a38044J9539
$$ -40566 -172458 -268053 -136452 176255 -140688 -165372 130130 229516 -138044 -118505
11547a18505H0277J50963f4736F976J30510N6902F1830O3454a06055k5457A50485
$$ -118505 80277 231240 -64736 6976 137486 194388 61830 125284 -106055 -131512 150485
11535B45142l0103K2357b1182B07323K6515A07822J75571c29264G7120J62512
$$ 245142 215039 237396 -21182 207323 233838 107822 283393 -329264 77120 239632
11525B39632H1113b00379F5080J60243a42737g0125B88585A17089A7274l833J43067
$$ 239632 81113 -200379 65080 225323 -142737 -70125 288585 117089 17274 13441 156508
11514A56508L7370j7293p3825R2260M5072J65095k2951d1257B36967h6938L0825
$$ 156508 193878 176585 102760 195020 240092 405187 382236 -41257 236967 -86938 -56113
11503e6113H0612J04848J342o5569D5665K03276M0717r2595a65754C4092J16622
$$ -56113 80612 185460 186802 121233 45665 248941 289658 197063 -165754 34092 150714
11492A50714i9388c7569k7884I6464R2677J72433m0064j40354H9459B556b2418
$$ 150714 -99388 -37569 -65453 96464 189141 361574 321510 181156 89459 2556 -22418
11480A92299a53717B55076j9537o7806l7772C678a19530B72420d9313A34968J8716
$$ 192299 -153717 255076 235539 167733 129961 3678 -119530 272420 -49313 134968 153684
11469A53684O7916k0493J06099j58K727k0101h2024D5471R0382j8337K13871e1881
$$ 153684 221600 201107 307206 307048 309775 289674 -82024 45471 135853 117516 331387 -51881
11456a36881I9506e520G8115d16571h595k4023A49044J48658a9169B68976o0042
$$ -136881 99506 -5520 78115 -416571 -8595 -32618 149044 297702 -19169 268976 208934
11445B08934g6907A8280a7536A2576b09573B25346a1776A74440i2128B94064p5483
$$ 208934 -76907 18280 -17536 12576 -209573 225346 -11776 174440 -92128 294064 218581
11434B18581b52736C5986L40796A51940b93011A73464F4104O4230N5610C2421
$$ 218581 -252736 35986 376782 151940 -293011 173464 64104 128334 183944 32421
11423I2655b22748j86377c0776o2323d0415C29288h3807C8936f540q292q7225
$$ 92655 -222748 -409125 -30776 -93099 -40415 329288 -83807 38936 -6540 -14832 -102057
11412a02057B9449K34680A8599a00073B17592A00790C5767g8414k76148F2453
$$ -102057 29449 264129 18599 -100073 217592 100790 35767 -78414 -354562 62453
11401c2597j89839B85852c2388n9841j6496A49451m1080e811E9936R4603J34386
$$ -32597 -222436 285852 -32388 -92229 -108725 149451 108371 -5811 59936 154539 288925
11390B88925E0217K28649j25702a62410A40546c15381A19273a87396F9404a83354
$$ 288925 50217 278866 153164 -162410 140546 -315381 119273 -187396 69404 -183354
11379I3713Q679Q2652d5382A37743L5850h5003k25462A45313K18938a5980r3458
$$ 93713 102392 185044 -45382 137743 173593 -85003 -310465 145313 364251 -15980 -109438
11368a09438A45017b1220M583F6673a08434k29460b260l9353n8169M2991m8526
$$ -109438 145017 -21220 -16637 66673 -108434 -337894 -2260 -41613 -99782 -56791 -105317
11357a05317a4836a347k07149D4603O6988K179b32723B5779Q3858a71895J4567
$$ -105317 -14836 -1347 -208496 44603 111591 113770 -232723 25779 109637 -171895 -157328
11346a57328F991J45405c48456d5275j45913a917k5094k23094Q7469E1838k3414
$$ -157328 6991 152396 -348456 -45275 -191188 -1917 -27011 -250105 -162636 51838 28424
11335B8424e071o0310A87427D8885c44058a11344A46749m2120K04178d076m8960
$$ 28424 -5071 -65381 187427 48885 -344058 -111344 146749 104629 308807 -4076 -53036
11324e3036m6620o1577F5666c72108a17162l4441A41501K11615A52994J12034
$$ -53036 -99656 -161233 65666 -372108 -117162 -151603 141501 353116 152994 265028
11314B65028j684j4819I7123l3563d58927d1190A9433d49856D6497c8208k12521
$$ 265028 263344 248525 97123 63560 -458927 -41190 19433 -449856 46497 -38208 -250729
11303b50729F1955a4800n8557I2415e3126j12658B9344h4028h832A23119d9725
$$ -250729 61955 -14800 -73357 92415 -53126 -165784 29344 -84028 -8832 123119 -49725
11291e0215A06567d75471k91046c4823j98472D56706e2001G3213f3725E3781J42175
$$ -50215 106567 -475471 -766517 -34823 -233295 456706 -52001 73213 -63725 53781 195956
11280A95956a37629C27574c22508B4066f4178D7891d1154A32260L6507e5712A22600
$$ 195956 -137629 327574 -322508 24066 -64178 47891 -41154 132260 168767 -55712 122600
11268d3019l76749B1569K78133c8212k29051A86649a95115i2769H3231a22995
$$ -43019 -419768 21569 299702 -38212 -267263 186649 -195115 -92769 83231 -122995
11257e8283k11969B84655m0500J9572E6419O3596n9542K2480a56754r8799J20244
$$ -58283 -270252 284655 244155 263727 56419 120015 60473 82953 -156754 -255553 -135309
11246a35309B37914B8958c2941j57282q9323I9860a5477j59455A07552A7738K4659
$$ -135309 237914 28958 -32941 -190223 -279546 99860 -15477 -174932 107552 17738 42397
11235D2397g5045b6812C2407b06225K6691A04706Q5672A3436c1350k2335B01084
$$ 42397 -75045 -26812 32407 -206225 -179534 104706 190378 13436 -31350 -53685 201084
11223f3572E3407A9433N3254B1729i6931b2003A16568A1037a15143E0128e6280
$$ -63572 53407 19433 72687 21729 -96931 -22003 116568 11037 -115143 50128 -56280
11211C339a35796H5352a49505e5085H5821a45587j08305H0297a64241m9743A22439
$$ 3339 -135796 85352 -149505 -55085 85821 -145587 -253892 80297 -164241 -213984 122439
11199a18982M6934A0038L41896b01370p299B3077J18043i6201J9562j06676L1103
$$ -118982 -72048 10038 351934 -201370 -208669 23077 141120 -96201 -76639 -183315 -152212
11188a52212H2145C5290h150A2972M2556f194j45711e7273K2492k418K715B92098
$$ -152212 82145 35290 -8150 12972 55528 -6194 -151905 -57273 -34781 -37199 -34484 292098
11175a80932O0799J7147A12454D7375a64731B69876g0832e861k18464j2946d088
$$ -180932 -120133 -102986 112454 47375 -164731 269876 -70832 -5861 -224325 -237271 -4088
11163B13869B8118P5893N8105e839A43532J65872a27368E15J95413a5036B23869
$$ 213869 28118 104011 162116 -5839 143532 309404 -127368 515 195928 -15036 223869
11151d02010A28728b02895E545a63728j03065C12574A31746J51215G0482h6583
$$ -402010 128728 -202895 5545 -163728 -266793 312574 131746 282961 70482 -86583
11140i2844j12734A82710G6346J7734l7543f558B01995c2335A45732a70187B00600
$$ -92844 -205578 182710 76346 94080 56537 -6558 201995 -32335 145732 -170187 200600
11128c12091J54977H0468f9022A08022F096b2297G1313a93333c6231k34918h3920
$$ -312091 -157114 80468 -69022 108022 6096 -22297 71313 -193333 -36231 -271149 -83920
11116A49121o8661e1529E3865J91675b11188B51218j24442k6719C4770K07043
$$ 149121 80460 -51529 53865 245540 -211188 251218 126776 100057 34770 241813
11106B41813E8157B3051h2513A63845J35676p556A44156d1006B42869r0467P9225
$$ 241813 58157 23051 -82513 163845 299521 291965 144156 -41006 242869 152402 231627
11095B31627j10938N3444b8231A81220K45754A5619M06190j06507c813C27802
$$ 231627 120689 174133 -28231 181220 426974 15619 421809 315302 -3813 327802
11084A11525o328Q6034F9510L89551E2936K42655a52941E35550B43152p4901l40
$$ 111525 105197 191231 69510 459061 52936 295591 -152941 535550 243152 168251 167911
11073A67911K83193j37696C4054J97018L7888M44877k63456J40419m9426I7406
$$ 167911 451104 313408 34054 231072 268960 713837 450381 590800 541374 97406
11062B40164M39775p8506B64907J58519q1776J18191K90119Q210J5766K81084
$$ 240164 679939 601433 264907 423426 341650 459841 749960 758170 773936 1055020
11052A055020n01234L86690j86247K21111k12808m5028M0379j70494K15752l08503
$$ 1055020 553786 940476 754229 975340 762532 717504 757883 587389 803141 494638
11042D94638M0703M8765A21249M84716N9431J23983L78733m39078j12196B51158
$$ 494638 535341 584106 121249 605965 665396 789379 1168112 729034 616838 251158
11031E45617J17648K70852l15738j24184M08624l45206O7773N4859C07190K37770
$$ 545617 663265 934117 618379 494195 902819 557613 625386 680245 307190 544960
11021E44960L0773m9202J23271K55040k09086K5769l3873k56084j2863K8063j6288
$$ 544960 575733 526531 649802 904842 695756 721525 687652 431568 418705 446768 430480
11010D30480J86839L6303l6634q7156M4513J70083B92480J06889m4899L44986
$$ 430480 617319 653622 616988 529832 574345 744428 292480 399369 354470 699456
11000F99456q2898j22359m6201J24773K1512J26256k03576K52622n9541l11647
$$ 699456 616558 494199 447998 572771 594283 720539 516963 769585 710044 398397
10990C98397R6950n191M79905k61175J19706n6644K41114P8735J17137j89882
$$ 398397 495347 490156 970061 708886 828592 771948 1013062 1091797 1208934 1019052
10980A019052K18178k3315k97109N80845J27710n270L24771J67890K93297M27474
$$ 1019052 1237230 1213915 916806 1497651 1625361 1620091 1944862 2112752 2406049 2833523
10970B833523l70985O14990n23435n8563l30756l95546j42914j04565j28226J66949
$$ 2833523 2462538 3077528 2554093 2495530 2164774 1769228 1626314 1521749 1393523 1560472
10960A560472k36250K99769k7029k28975J70504K59353k82457J2689l73314n7324
$$ 1560472 1324222 1623991 1596962 1367987 1538491 1797844 1515387 1528076 1154762 1097438
10950A097438k48414j01075j42433j96812m3210p9220J86126H6786L8914Q7269
$$ 1097438 849024 747949 605516 408704 365494 286274 472400 86786 125700 212969
10940B12969o0402o5098M1763E634J23987K01723j43162J06350a1269j06938L9993
$$ 212969 152567 87469 129232 5634 129621 331344 188182 294532 -11269 -118207 -78214
10929g8214H6677K64325G4242b29623I1633Q6918j6529a78848D02991b74281J134
$$ -78214 86677 351002 74242 -229623 91633 178551 162022 -178848 402991 -274281 -273147
10918b73147A06592J05770g6452F901P6973b82271c4335F0163b53696A10977m2004
$$ -273147 106592 212362 -76452 6901 83874 -282271 -34335 60163 -253696 110977 68973
10907F8973N4153a15435B8089J4746K21414a6067k15115N5062A04750C0925c30180
$$ 68973 123126 -115435 28089 42835 264249 -16067 -231182 -176120 104750 30925 -330180
10895A75603N4747f5934A00065b85372A63991B1802d7439H9459a6190A40862d34587
$$ 175603 230350 -65934 100065 -285372 163991 21802 -47439 89459 -16190 140862 -434587
10883B51131a46499B26935k1048q5222D0584K3339J12745c7682j59608M5624D1208
$$ 251131 -146499 226935 205887 120665 40584 63923 176668 -37682 -197290 -151666 41208
10871A08419a55296A55304o59a69979e4786j84364A0288P6670D0605K409J6308
$$ 108419 -155296 155304 154645 -169979 -54786 -239150 10288 86958 40605 43014 59322
10860E9322a35131k9360e7808k70754B28261a61247G4874C719a68720H2720a10256
$$ 59322 -135131 -164491 -57808 -328562 228261 -161247 74874 3719 -168720 82720 -110256
10848A61698C6574J18206J33582b82371a41108A85657f3647q8611L1286k81819
$$ 161698 36574 154780 288362 -282371 -141108 185657 -63647 -152258 -120972 -402791
10838d02791a48115I354L7116J49634m1191b40603B38532q9281P6314c1944j9497
$$ -402791 -148115 9354 46470 196104 154913 -240603 238532 149251 225565 -31944 -51441
10827e1441k06135b5528A14172b99778a23315J978c3293l9427g461m9985B81587
$$ -51441 -257576 -25528 114172 -299778 -123315 -121337 -33293 -72720 -7461 -57446 281587
10815D0243a06191E7347a58137a4791j28685P0064K1924j57265j60190B27075
$$ 40243 -106191 57347 -158137 -14791 -143476 -73412 -51488 -208753 -368943 227075
10804a51822A64228b68719J11934A18622a79247A8331O4248c33007H7183h8456
$$ -151822 164228 -268719 -156785 118622 -179247 18331 82579 -333007 87183 -88456
10793e2678j72263a0598A58898c51187A1576a8841j72205D9324f4597A23563g9722
$$ -52678 -224941 -10598 158898 -351187 11576 -18841 -191046 49324 -64597 123563 -79722
10781c46136N4154A12010b36343B1552a53278I5731a82589H5331K51833A53025
$$ -346136 -291982 112010 -236343 21552 -153278 95731 -182589 85331 337164 153025
10770a31102I9444g0921I6372a83147O452m5947m0538A61061c22657e5128l71867
$$ -131102 99444 -70921 96372 -183147 -176695 -222642 -263180 161061 -322657 -55128 -426995
10759d26995H8044a0094A16562d7405E370J19480n4142J46576F3178a20245e6742
$$ -426995 88044 -10094 116562 -47405 5370 124850 70708 217284 63178 -120245 -56742
10747B85536b9372j22209J8795p1775j0023j51099a59788J987I0090a95523B63205
$$ 285536 -29372 -151581 -132786 -204561 -214584 -365683 -159788 -157801 90090 -195523 263205
10735C6045K2667O7905a1981A45054C8527e1881A69245a67462O2006k86178i1183
$$ 36045 58712 126617 -11981 145054 38527 -51881 169245 -167462 -105456 -391634 -91183
10723a71923E0756O676b71127a0383k76707a7054r1708l03848D17484c1974A78379
$$ -171923 50756 57432 -271127 -10383 -287090 -17054 -108762 -412610 417484 -31974 178379
10711i062B50615A00870d5247E4852k887j8064O8460K5886b62095F4254a21627
$$ -9062 250615 100870 -45247 54852 51965 33901 102361 128247 -262095 64254 -121627
10699b22021A04946a93338j4290e9287j41411j17544a08633d5367j41660q7774
$$ -222021 104946 -193338 -207628 -59287 -200698 -318242 -108633 -45367 -187027 -274801
10689b74801R4325L7085A90390a54690C1003j408e3467n8143k32001J9787j20732
$$ -274801 -180476 -143391 190390 -154690 31003 29595 -53467 -111610 -343611 -323824 -444556
10678d44556A2027a10914j76516o5544B65681D8282K85561j04342E1990Q1099
$$ -444556 12027 -110914 -287430 -352974 265681 48282 333843 229501 51990 133089
10668A33089c0410k29457J08815G7560e10256C7487a60469E271b53040A73070
$$ 133089 -30410 -259867 -151052 77560 -510256 37487 -160469 5271 -253040 173070
10657a15705N7252q7402B41177A19228a64496O2796j64852B53350F5678A0277
$$ -115705 -58453 -145855 241177 119228 -164496 -101700 -266552 253350 65678 10277
10646B37085b59194e2172E2091b4944A85499b65370a21093r9071A37426i2077
$$ 237085 -259194 -52172 52091 -24944 185499 -265370 -121093 -220164 137426 -92077
10635b710m8097k33995i5466o6826B26552o1132E6455J41287m4901b5945j12414
$$ -2710 -50807 -284802 -95466 -162292 226552 165420 56455 197742 152841 -25945 -138359
10624a38359D2007a71058B78612a37140N4464c1880j88942D420a62531Q0255j79830
$$ -138359 42007 -171058 278612 -137140 -82676 -31880 -220822 4420 -162531 -82276 -262106
10613b62106B24067c76592C80817A07963A6080e9337I2122H456J54681b62002
$$ -262106 224067 -376592 380817 107963 16080 -59337 92122 8456 163137 -262002
10602a23849b621m1772p0338J2001r1253A12655b28345J5078L5450P0310m283
$$ -123849 -2621 -44393 -114731 -102730 -193983 112655 -228345 -213267 -177817 -107507 -111790
10591a11790B88976j12474o8185g3804A84216a15877n3335r3468B84793d5673
$$ -111790 288976 176502 108317 -73804 184216 -115877 -169212 -262680 284793 -45673
10580g9676n7758O1006G1914b27900A24141h3518a1726B3477a37202D461M1348
$$ -79676 -137434 -76428 71914 -227900 124141 -83518 -11726 23477 -137202 4461 45809
10569D5809f5582I2039b56723Q2377j62632A4633a08139A47059D7849b03821O5600
$$ 45809 -65582 92039 -256723 -174346 -336978 14633 -108139 147059 47849 -203821 -138221
10558a38221m81m7030l0844B2495K03304a3481B1848M1497K80856c18802E3838
$$ -138221 -138702 -185732 -216576 22495 225799 -13481 21848 63345 344201 -318802 53838
10546D5862o805a78201B3291a91218C60573I0781K16799j12195b27312j18769
$$ 45862 39057 -178201 23291 -191218 360573 90781 307580 195385 -227312 -346081
10536c46081p8523a20297c6447j16418H6785Q9229M2734a97004N6159j39615B75233
$$ -346081 -424604 -120297 -36447 -152865 86785 176014 218748 -197004 -140845 -280460 275233
10524A00253A6954d93050b04874A4600P0584J12024a70993P9257n7201i661n6394
$$ 100253 16954 -493050 -204874 14600 85184 197208 -170993 -91736 -148937 -9661 -66055
10513f6055k07501K7022o7425a06259q946k05188a30227A6844J52085n919m606
$$ -66055 -273556 -246534 -313959 -106259 -115205 -320393 -130227 16844 168929 163010 158404
10502A58404J3690a57116A02811P7594b76468I3663O7275n0649N5376b18866f6656
$$ 158404 172094 -157116 102811 180405 -276468 93663 160938 110289 165665 -218866 -66656
10490G5918J96124A2663c28946i5292o250D9354d2511G3044a49683C34854J63646
$$ 75918 272042 12663 -328946 -95292 -101542 49354 -42511 73044 -149683 334854 498500
10479D98500j67502r5428l2720o0912a88106A79066b27231N827C84033c5033A24060
$$ 498500 330998 235570 202850 141938 -188106 179066 -227231 -221404 384033 -35033 124060
10467B59031D6088P5993a27756A52895c45697F5872N6098D7702c77781B20827
$$ 259031 46088 122081 -127756 152895 -345697 65872 121970 47702 -377781 220827
10456a96755J8396J300q1526L3271C5069M7584e7373b5290q3062r2679A6254a25774
$$ -196755 -178359 -177059 -258585 -225314 35069 82653 -57373 -25290 -108352 -201031 16254 -125774
10443B08397q0185h6391B32085a11230r373j26805c6415A21184a655B20748b78731
$$ 208397 128212 -86391 232085 -111230 -120603 -247408 -36415 121184 -1655 220748 -278731
10431a14198H0866i4143q2881G3237g3322l0016b2909D3210P4832c80007h5618
$$ -114198 80866 -94143 -177024 73237 -73322 -103338 -22909 43210 118042 -380007 -85618
10419D04232D2696a42501E9643j0792L1537j7243c18958Q2227l0700G5967b56618
$$ 404232 42696 -142501 59643 48851 80388 63145 -318958 -236731 -267431 75967 -256618
10407g1590a651A37182F2740i6304A19460J83140a73352A79219d1034C537K9444
$$ -71590 -1651 137182 62740 -96304 119460 302600 -173352 179219 -41034 3537 32981
10396C2981b13804A73180h7963A62652o2414N3515n4332e609A88364j6544q0936
$$ 32981 -213804 173180 -87963 162652 100238 153753 99421 -5609 188364 171820 90884
10385I0884C8154L7561h5541D2796a31500O727A44736a03843j01301B54806O9655
$$ 90884 38154 75715 -85541 42796 -131500 -124773 144736 -103843 -205144 254806 324461
10374C24461J48727A92022B2834K31693l1062J12157K47730k76052K23234B39972
$$ 324461 473188 192022 22834 254527 223465 335622 583352 307300 530534 239972
10363D83907j62220J14873j16893J59415j51763G3614K54714a4986o8212B57793
$$ 483907 321687 436560 319667 479082 327319 73614 328328 -14986 -83198 257793
10352c8006C07501n7181J03601L0545K33758j69230o9378J03504K98480B97888
$$ -38006 307501 250320 353921 384466 618224 448994 379616 483120 781600 297888
10341A28833M81524B32721K72063C2758K46222Q7729q7881I0234h4863D41173
$$ 128833 610357 232721 504784 32758 278980 366709 278828 90234 -84863 441173
10330a96119P8512C48899m5000q3152p2869n1787A2152R5084P0963K1065b0010
$$ -196119 -117607 348899 303899 220747 147878 96091 12152 107236 178199 199264 -20010
10318a35720B74075d05B01721G4805J67925A07011L39066A15093J14194a50897
$$ -135720 274075 -405 201721 74805 242730 107011 446077 115093 229287 -150897
10307D7301J35775E840b74230a33968G9885J46176q0757a88207B8511a58802B07190
$$ 47301 183076 5840 -274230 -133968 79885 226061 145304 -188207 28511 -158802 207190
10295B21461F2523J71748A4219a26035q4087a7968E69441a10391q1260e7101K0608
$$ 221461 62523 234271 14219 -126035 -210122 -17968 569441 -110391 -191651 -57101 -36493
10284c6493j02799j29677D6094b73681B58888b0469m6624k8930B63386f3687A30848
$$ -36493 -139292 -268969 46094 -273681 258888 -20469 -67093 -96023 263386 -63687 130848
10272h7016E0604J08328c70814h3162B63038j01007a95413A83612b69360L4776
$$ -87016 50604 158932 -370814 -83162 263038 162031 -195413 183612 -269360 -234584
10262b34584B87436K5737J94258j89166J19253A60371L07522B14405f2859n3335
$$ -234584 287436 313173 507431 318265 437518 160371 467893 214405 -62859 -116194
10252a16194b8199D1675c45797C94640h4121A20267J19653M6742C4971e844A19355
$$ -116194 -28199 41675 -345797 394640 -84121 120267 239920 286662 34971 -5844 119355
10240b11598h9463M604l2075l7662J63o184A5208f8438j25973A3899K20402b58712
$$ -211598 -89463 -84859 -116934 -154596 -154433 -160617 15208 -68438 -194411 13899 234301 -258712
10227b54268A84607a90525B94935e3589G7381a22203j92734A79843q5062a08675
$$ -254268 184607 -190525 294935 -53589 77381 -122203 -314937 179843 94781 -108675
10216d7595Q135k71656g2846j2410k04918K1145p3204J63366e35k9715p0401o1152
$$ -47595 -39460 -311116 -72846 -85256 -290174 -269029 -342233 -178867 -535 -30250 -100651 -161803
10204a61803H0102d6727B83631J33101A31608P9449b9350A25818d60397A04805
$$ -161803 80102 -46727 283631 416732 131608 211057 -29350 125818 -460397 104805
10193c8702j46923n4842i2145A35009C8653a21288E5314c0264l72891b0895C7365
$$ -38702 -185625 -240467 -92145 135009 38653 -121288 55314 -30264 -403155 -20895 37365
10181A77479b90349C9981J50174g9264h557m2611A21868d25914F4976b5346l2695
$$ 177479 -290349 39981 190155 -79264 -8557 -51168 121868 -425914 64976 -25346 -58041
10170e8041j6462K0211J8827j86370k17425A653J11131a72659h154j37447B6423
$$ -58041 -74503 -54292 -35465 -221835 -439260 1653 112784 -172659 -8154 -145601 26423
10158e16A4002a6507k59847e4990G5314a60293O0710L6197J490l18776b3101q5371
$$ -516 14002 -16507 -276354 -54990 75314 -160293 -99583 -63386 -61896 -380672 -23101 -108472
10146a08472j92836n645E8033b3563j14126j09572R2274R124J3042o2036G4750
$$ -108472 -301308 -306953 58033 -23563 -137689 -247261 -154987 -145863 -132821 -194857 74750
10134E6113c77800A16194B0188K12708a62840K5226j44420a9479p6419A71666
$$ 56113 -377800 116194 20188 232896 -162840 -137614 -282034 -19479 -95898 171666
10123c27150H855c2130k26002a17641K4957E747K41816f6719D5298a06617j24895
$$ -327150 8855 -32130 -258132 -117641 -92684 5747 247563 -66719 45298 -106617 -231512
10112b31512A665J30390e4423k14823a21156A5725a735l16756J27099j01042q149
$$ -231512 1665 132055 -54423 -269246 -121156 15725 -1735 -318491 -191392 -292434 -300583
10101c00583N6715e5639Q482m01295a77417h3265B93249c24671A14928a10508
$$ -300583 -243868 -55639 -47157 -448452 -177417 -83265 293249 -324671 114928 -110508
10090B06154P5090b83870f4454b2740k08070j29291R7207C43736a14831j5731
$$ 206154 281244 -283870 -64454 -22740 -230810 -360101 -262894 343736 -114831 -130562
10080a30562c5801B94177j33786a66732b2626A4876a53095C9391N6520a58091
$$ -130562 -35801 294177 160391 -166732 -22626 14876 -153095 39391 95911 -158091
10069b44813H8549c43360a02831I1263h1770d646B844a18609H3170d8237J8211
$$ -244813 88549 -343360 -102831 91263 -81770 -4646 2844 -118609 83170 -48237 -30026
10058c0026k30110G2995J02401b59934F9177l2638i9921c9544e352j60553h1997
$$ -30026 -260136 72995 175396 -259934 69177 36539 -99921 -39544 -5352 -165905 -81997
10046F9493a22031K7156j401k0362m3692B02710F716J54517G7905a61843j62853
$$ 69493 -122031 -94875 -96276 -116638 -160330 202710 6716 161233 77905 -161843 -324696
10035c24696J41090a0758k09636N0581d8367j94226d0256C29358d3413E5436a44706
$$ -324696 -183606 -10758 -220394 -169813 -48367 -242593 -40256 329358 -43413 55436 -144706
10023C02980b39171a14515L7875J4052k7867A00880b1642k50172f792B3247b24291
$$ 302980 -239171 -114515 -76640 -62588 -90455 100880 -21642 -271814 -6792 23247 -224291
10011f9176J8491B88575c6960q8417o4681f7411B59655a42916b939j09270A3633
$$ -69176 -50685 288575 -36960 -125377 -190058 -67411 259655 -142916 -2939 -112209 13633
9999G4664J44040b6225B24360g8255A64335n7571b97166j14145F2388J07101N73
$$ 74664 218704 -26225 224360 -78255 164335 106764 -297166 -411311 62388 169489 170062
9988A70062b02107k69860B66692a75202E6320b48040B8073f9058n9236H7021e7043
$$ 170062 -202107 -471967 266692 -175202 56320 -248040 28073 -69058 -128294 87021 -57043
9976b48577B07785a09577b1597r1438p0015B3588b68806A53084h8254j69917M6141
$$ -248577 207785 -109577 -21597 -113035 -183050 23588 -268806 153084 -88254 -258171 -212030
9965b12030L4665A6507c2711j84050N7860f4751A29375M6449o4842B4958b72708
$$ -212030 -177365 16507 -32711 -216761 -158901 -64751 129375 175824 110982 24958 -272708
9953a50613D7348a10999B24259a44851G8603a25713a2992r8386A22204M4439a17004
$$ -150613 47348 -110999 224259 -144851 78603 -125713 -12992 -111378 122204 166643 -117004
9941b25074E3987a74873q098a2845j09622b4463j86755k09138B19064a08038a1830
$$ -225074 53987 -174873 -182971 -12845 -122467 -24463 -211218 -420356 219064 -108038 -11830
9929i1638M943K6843A40134a51835a1745q4611k8237B25860b81697e8905j05958
$$ -91638 -86695 -59852 140134 -151835 -11745 -96356 -124593 225860 -281697 -58905 -164863
9918a64863B12722B2460J38452r564d4064j61700m2287d2732l65575a98666A85240
$$ -164863 212722 22460 160912 151348 -44064 -205764 -248051 -42732 -408307 -198666 185240
9906a40317J5275q16l7275r9832D1248f0738j56569B42359E4508a07072D1434
$$ -140317 -125042 -125858 -163133 -262965 41248 -60738 -217307 242359 54508 -107072 41434
9894A0531J26610o8511g3798p0632A83571q7136f57704a68276J3536j78283H5268
$$ 10531 137141 68630 -73798 -144430 183571 96435 -657704 -168276 -154740 -333023 85268
9882A46489i9770c9947k06307R9402F3029d17027K9772C4334b9627n7057b7645
$$ 146489 -99770 -39947 -246254 -146852 63029 -417027 -387255 34334 -29627 -86684 -27645
9870b05865C7771a17379N7911J5189k09025M8864e3030D2186h6194e677j2287
$$ -205865 37771 -117379 -59468 -44279 -253304 -204440 -53030 42186 -86194 -5677 -17964
9859a7964k54116A90117d91907J91003J0380c239A87950J64020g2433l6257e1360
$$ -17964 -272080 190117 -491907 -300904 -290524 -3239 187950 351970 -72433 -108690 -51360
9847d3343j94876j31764i0799m740j4314l5349D0328c14232Q820d7705k57923
$$ -43343 -238219 -369983 -90799 -95539 -109853 -145202 40328 -314232 -305412 -47705 -305628
9836c05628J37010A6509i4028a3192l65907B36295b78941I5097g0223C0018c5899
$$ -305628 -168618 16509 -94028 -13192 -379099 236295 -278941 95097 -70223 30018 -35899
9824a86902h1144A57781m6639a21494A23801b19432A56324a03194j56917q9318
$$ -186902 -81144 157781 111142 -121494 123801 -219432 156324 -103194 -260111 -349429
9814c49429A20701c51696J40468b5155l11955j27727A99194a72130r1183a11516
$$ -349429 120701 -351696 -211228 -25155 -337110 -464837 199194 -172130 -263313 -111516
9803A02157b71665J02748e10H7721J461B3686e379k95893A99456b20056B2273
$$ 102157 -271665 -168917 -510 87721 89182 23686 -5379 -301272 199456 -220056 22273
9791C6680O4781B4455H232R1932P3395e9367J481C58729g9098q8033C0394b20776
$$ 36680 101461 24455 8232 100164 173559 -59367 -57886 358729 -79098 -167131 30394 -220776
9778a39049O5844p8241G4721r404b24451A43395F5134B5565J7841a04591H3215
$$ -139049 -73205 -151446 74721 65317 -224451 143395 65134 25565 43406 -104591 83215
9766a45456B25855e8592A38540b82964g1809C8434a6072j82893J8816d3449k74672
$$ -145456 225855 -58592 138540 -282964 -71809 38434 -16072 -198965 -180149 -43449 -318121
9755c18121e5508q7265B28709a53j22910C0167b7640m12721C8301K375a88586
$$ -318121 -55508 -142773 228709 -153 -123063 30167 -27640 -440361 38301 40676 -188586
9743d6738B87876G0429r866b555I9918b17799A44638F0160J18917a16819C4467
$$ -46738 287876 70429 60563 -2555 99918 -217799 144638 60160 179077 -116819 34467
9731A36184f4884a0582B1011P1540a4706f533j83413J9013e4871j39273L3471
$$ 136184 -64884 -10582 21011 92551 -14706 -6533 -189946 -170933 -54871 -194144 -160673
9720a60673j324g449B0269a30588m6442K3609f5378E3942f6609k45836A9939b7028
$$ -160673 -161997 -7449 20269 -130588 -177030 -153421 -65378 53942 -66609 -312445 19939 -27028
9707A17120J03487a86635A94624b20011B4285Q8721a89868L0362B7951J74191
$$ 117120 220607 -186635 194624 -220011 24285 113006 -189868 -159506 27951 202142
9697B02142h7017F3508c00465g6720j82228d2457j32544j18532i2515d0576j29565
$$ 202142 -87017 63508 -300465 -76720 -258948 -42457 -175001 -293533 -92515 -40576 -170141
9686a70141f5025A02260J24265H8816a22428d9898J9494H895N5766a32649C29540
$$ -170141 -65025 102260 226525 88816 -122428 -49898 -30404 8895 64661 -132649 329540
9674G8556R5754f0671A84886a47336B37288e7130K5216e225O64j48424d6099m9305
$$ 78556 174310 -60671 184886 -147336 237288 -57130 -31914 -5225 -4561 -152985 -46099 -95404
9662i5404l8577A13252Q5349M6303o7037h3707j44952Q3571A78924F2708b76367
$$ -95404 -133981 113252 198601 244904 177867 -83707 -228659 -145088 178924 62708 -276367
9650F7081R381M2482n4780a553E467a72234A36467e6281r9875K5911p6031A0861
$$ 67081 76462 118944 64164 -1553 5467 -172234 136467 -56281 -156156 -130245 -206276 10861
9637i7323n93q0212A13026b75638a04265C35567A06532c96319C5485c1641A42286
$$ -97323 -97916 -178128 113026 -275638 -104265 335567 106532 -396319 35485 -31641 142286
9625E5297M0148J99855c7684a8684m100A4101M2701f0840I1852b27077b5490A87272
$$ 55297 95445 295300 -37684 -18684 -22784 14101 56802 -60840 91852 -227077 -25490 187272
9612B34101a77360g3196A51691b1819B46029P9001c0300A29924H52b10623a8063
$$ 234101 -177360 -73196 151691 -21819 246029 325030 -30300 129924 852 -210623 -18063
9600c20473B9706b20977G3879C1910c09883a02024m77534K31429E2272a11489
$$ -320473 29706 -220977 73879 31910 -309883 -102024 -579558 -348129 52272 -111489
9589g0226q0572J4531d7560b1655k18494A3293a06645j68036A64398e58305J74399
$$ -70226 -150798 -136267 -47560 -21655 -240149 13293 -106645 -274681 164398 -558305 -383906
9578c83906a69260G169a12475R296c5638m9248I3622a29B907a08154r5114b4599
$$ -383906 -169260 7169 -112475 -103179 -35638 -84886 93622 -129 2907 -108154 -203268 -24599
9565a20032A3848i010p61r8603A43554b82807J10176k9887k64547a38004B20994
$$ -120032 13848 -9010 -9771 -108374 143554 -282807 -172631 -202518 -467065 -138004 220994
9553a78470A11518R1270b86879j32809g2470o20B0920a04107i145k44043f1298
$$ -178470 111518 202788 -286879 -419688 -72470 -73090 20920 -104107 -9145 -253188 -61298
9541h1523j84007J11918P4171J5534A92707b29382C06892d06430a26694j22353
$$ -81523 -265530 -153612 -79441 -63907 192707 -229382 306892 -406430 -126694 -249047
9531b49047f9905j9372j8929j64706Q2538Q296C8551a33292m0013B45369a80973
$$ -249047 -69905 -89277 -108206 -272912 -190374 -182078 38551 -133292 -173305 245369 -180973
9519b04243J608j16867B5887a64891A22g1599k68031G0578i1988M1351A71994
$$ -204243 -202635 -319502 25887 -164891 122 -71599 -339630 70578 -91988 -50637 171994
9507a06369d01p6278b1086j19869N7906D3305a18699J808j21428L5798K9710f2450
$$ -106369 -401 -76679 -21086 -140955 -83049 43305 -118699 -116891 -238319 -202521 -172811 -62450
9494c49552a1992j07253j05206A01093a34564N4924l9854m2290j6509F2697j8239
$$ -349552 -11992 -119245 -224451 101093 -134564 -79640 -119494 -161784 -178293 62697 44458
9483D4458B140a99306P8665A06115a88397f5539L2487O63k21756H9326a46086
$$ 44458 2140 -199306 -120641 106115 -188397 -65539 -33052 -32389 -254145 89326 -146086
9471d2814A66625a39951d6343G3131b16971Q6906H1653p998J4069f6518q3378
$$ -42814 166625 -139951 -46343 73131 -216971 -130065 81653 73655 87724 -66518 -149896
9460a49896g4185A61598j7413a44251a0716B03263b98193D3821J66420d9208r1290
$$ -149896 -74185 161598 144185 -144251 -10716 203263 -298193 43821 210241 -49208 -140498
9449a40498c122A88922b88031i9247b9310q849n8164j2831j4662n7370N2862G3410
$$ -140498 -3122 188922 -288031 -99247 -29310 -38159 -96323 -109154 -123816 -181186 -128324 73410
9436D9238a06311J5761G7213J36665I6255O0941h4421L9637j14018n1436i2036
$$ 49238 -106311 -90550 77213 213878 96255 157196 -84421 -44784 -158802 -210238 -92036
9424b7589I3530J2987b51210j37792a7080l99371A92669i5020M6270a6614j44992
$$ -27589 93530 106517 -251210 -389002 -17080 -416451 192669 -95020 -48750 -16614 -161606
9413a61606K5908d7036l60185e1568D4083N6568f6943D9511M5996b00363h67j55753
$$ -161606 -135698 -47036 -407221 -51568 44083 100651 -66943 49511 95507 -200363 -867 -156620
9401a56620e8641a583j6153B14911b33102a06998A76079a9690C87361a64443B68612
$$ -156620 -58641 -1583 -17736 214911 -233102 -106998 176079 -19690 387361 -164443 268612
9389a76948b3147A36102n5413i8185B6968J034J05176b65118A32268a61607A80528
$$ -176948 -23147 136102 80689 -98185 26968 28002 133178 -265118 132268 -161607 180528
9377e02964B39750j16629d3086B2208a00304K5776o7054r7993k2688P38p5075
$$ -502964 239750 123121 -43086 22208 -100304 -74528 -141582 -239575 -262263 -261525 -336600
9366c36600R1419j24632a57185a382A35411a77973e9419b8036l7621h104C32430
$$ -336600 -245181 -369813 -157185 -1382 135411 -177973 -59419 -28036 -65657 -8104 332430
9354a84038M7027N8560D620J14025a86333A05157b80444P5760G760e0149j7452
$$ -184038 -137011 -78451 4620 118645 -186333 105157 -280444 -204684 7760 -50149 -67601
9343f7601l749C19954e7689B31529f3654A83909D7727a73444g6634D0244b1028
$$ -67601 -71350 319954 -57689 231529 -63654 183909 47727 -173444 -76634 40244 -21028
9331c1572A9971a11136j18680p6970A52026n2899P5903N0599E8655c01041O5992
$$ -31572 19971 -111136 -229816 -306786 152026 99127 175030 225629 58655 -301041 -235049
9320b35049B02330b72039M3908q5385d5647A22887B5294a87557B5202i2347B6606
$$ -235049 202330 -272039 -228131 -313516 -45647 122887 25294 -187557 25202 -92347 26606
9308A9601b25436B39747g6550A55713b87756e4388A57581A4504a23910b2505m55788
$$ 19601 -225436 239747 -76550 155713 -287756 -54388 157581 14504 -123910 -22505 -478293
9297d78293a13715C40384a62994d0660k33637B9104a08780A45824F0483a49926
$$ -478293 -113715 340384 -162994 -40660 -274297 29104 -108780 145824 60483 -149926
9286f5111n6442l5595B51082B0015a33641p6567A29795b09613g4431F0899K1395
$$ -65111 -121553 -157148 251082 20015 -133641 -210208 129795 -209613 -74431 60899 82294
9275H2294a03086A6906m723J16227c5344B98813a75029D5334a38540J1670c122
$$ 82294 -103086 16906 12183 128410 -35344 298813 -175029 45334 -138540 -126870 -3122
9263F7123K4396a70750A9840J4542J14658a30847k7130B05091n7025d8633k44429
$$ 67123 91519 -170750 19840 34382 149040 -130847 -157977 205091 148066 -48633 -293062
9252b93062I7859a43621I7051a29601j16576K5270K3007A42249A0315K63259r8972
$$ -293062 97859 -143621 97051 -129601 -246177 -220907 -197900 142249 10315 273574 174602
9241A74602a94810j8695O0214j18999a5018r4086D1246d2288A70527c11715I8083
$$ 174602 -194810 -213505 -153291 -272290 -15018 -109104 41246 -42288 170527 -311715 98083
9229E684a48987A15579a78891D7184K83067M0531c2531j86259h450B58167j25945
$$ 5684 -148987 115579 -178891 47184 330251 370782 -32531 -218790 -8450 258167 132222
9218A32222i5626k06779A01525J87183c50922a20549p1404n1526N4595K2726O8905
$$ 132222 -95626 -302405 101525 288708 -350922 -120549 -191953 -243479 -188884 -166158 -97253
9207i7253M263B09035F5346M6956e9459q1839d8085j00914n1344B58380c6377
$$ -97253 -92990 209035 65346 112302 -59459 -141298 -48085 -148999 -200343 258380 -36377
9195I5765c00778C16037A35349K8572a00504H4666b47642a10616k502j23625C93952
$$ 95765 -300778 316037 135349 163921 -100504 84666 -247642 -110616 -113118 -236743 393952
9183b11340E6047g1482r1987h272A71591a56018H8913b12148c2564j92639c9639
$$ -211340 56047 -71482 -163469 -8272 171591 -156018 88913 -212148 -32564 -225203 -39639
9171g9793a3545I0793M3779b92212C3840b93917l6940O7147a03632n557n0687
$$ -79793 -13545 90793 134572 -292212 33840 -293917 -330857 -263710 -103632 -109189 -159876
9160a59876A77M46490G3950f3743j33413L5909A83112I1228a7979j45370d5515
$$ -159876 177 446667 73950 -63743 -197156 -161247 183112 91228 -17979 -163349 -45515
9148I4364O3968a02752k0162r2798B1794a63634p0224E6182a24713j749a2392
$$ 94364 158332 -102752 -122914 -215712 21794 -163634 -233858 56182 -124713 -126462 -12392
9136i3618L6167E5421f9252A76185c52479J52890f9125c4114J496N407j55695
$$ -93618 -57451 55421 -69252 176185 -352479 -199589 -69125 -34114 -32618 -27211 -182906
9125a82906n7994h9884l34449D1129a5455E7072b01856P8995P084q143c166p3238
$$ -182906 -240900 -89884 -424333 41129 -15455 57072 -201856 -122861 -115777 -123920 -3166 -76404
9113g6404J5674D0631d62162h5762j5375m71908J82570Q9839a17724j21825f6523
$$ -76404 -60730 40631 -462162 -85762 -101137 -573045 -390475 -300636 -117724 -239549 -66523
9101b89505b4699B56204b25111c6361a7019r1203B39045a44885O8314D8295a44367
$$ -289505 -24699 256204 -225111 -36361 -17019 -108222 239045 -144885 -76571 48295 -144367
9089f5005L1905n3649q8736j11762L2631J10378k24411R9488g293k6299F0083
$$ -65005 -33100 -86749 -175485 -287247 -254616 -144238 -368649 -269161 -7293 -33592 60083
9077b51418g2509b2814E2185J81738B800K09203a59812N5187G6407a15598B095
$$ -251418 -72509 -22814 52185 233923 2800 212003 -159812 -104625 76407 -115598 2095
9065a51726A27584h2810r749d4830j31495B06770c05452I5a76634I7404g2424
$$ -151726 127584 -82810 -92559 -44830 -176325 206770 -305452 95 -176634 97404 -72424
9053A12280a74617F4160a43249g474k71395l404R7486o2060i323j07705p6986
$$ 112280 -174617 64160 -143249 -7474 -278869 -282273 -184787 -246847 -9323 -117028 -194014
9042a94014a1438r4416j44752b1111l39729a60576j32547J0663l4295A50495C9183
$$ -194014 -11438 -105854 -250606 -21111 -360840 -160576 -293123 -282460 -316755 150495 39183
9030a2769A01935N3115J66666o1560a09349k17812J4487e9527f302A66494a46441
$$ -12769 101935 155050 321716 260156 -109349 -327161 -312674 -59527 -6302 166494 -146441
9018b54004J25352F858f4815A99109Q0711a69379A91909B477a64113k1706n240
$$ -254004 -128652 6858 -64815 199109 279820 -169379 191909 2477 -164113 -185819 -191059
9007a91059M1140F0024a99192A29412b29979D8501b57060c5172D2621h4108o310
$$ -191059 -149919 60024 -199192 129412 -229979 48501 -257060 -35172 42621 -84108 -90418
8996i0418B0598J24006c44068J1746G8070J26338D5478a69624G8118f3490j21314
$$ -90418 20598 144604 -344068 -332322 78070 204408 45478 -169624 78118 -63490 -184804
8985a84804A01586b2234j29356Q350K5149M6234A06636K8072J0031B0337P4033
$$ -184804 101586 -22234 -151590 -143240 -118091 -71857 106636 134708 144739 20337 94370
8974I4370c08615E6791J48962i9900M7090B1554b024k23822D30682I026J13126
$$ 94370 -308615 56791 205753 -99900 -52810 21554 -2024 -225846 430682 9026 122152
8963A22152b41447K6869J4074A20683a51674l2438A4542c56251h3536A31364m5996
$$ 122152 -241447 -214578 -200504 120683 -151674 -184112 14542 -356251 -83536 131364 85368
8952H5368c03274A20339K1727A258a57304L1938f1979p348K9294r0711A870a24431
$$ 85368 -303274 120339 142066 1258 -157304 -125366 -61979 -69327 -40033 -130744 1870 -124431
8939a14307C4074a28036B8549K96687a69064B77119m8791R8327a48786e273D28500
$$ -114307 34074 -128036 28549 325236 -169064 277119 228328 326655 -148786 -5273 428500
8927B17096h3887F8967J80384K50968M09289J665561J0343730F268200A605739
$$ 217096 -83887 68967 249351 500319 909608 2575169 12918899 6268200 1605739
8917E44328A26619L49535k11964j12459k2068A8799a62160O7557E3883a00740
$$ 544328 126619 476154 264190 151731 129663 18799 -162160 -94603 53883 -100740
8906B17610a440A5443R3452K95082c94517i897B09483I5241a71111C04226D4994
$$ 217610 -1440 15443 108895 403977 -394517 -9897 209483 95241 -171111 304226 44994
8894A3163L976b39248B62994b05919k16919F9084b8312A3066a10922j7143D7044
$$ 13163 17139 -239248 262994 -205919 -422838 69084 -28312 13066 -110922 -128065 47044
8882A49284a86349F8673j6713a61008C8185B143J04690a158I1576b9589A96415
$$ 149284 -186349 68673 51960 -161008 38185 2143 106833 -1158 91576 -29589 196415
8870D4795L25923I4421a03050L9741j2405n4924K8623j27534j94811J67994L0298
$$ 44795 370718 94421 -103050 -63309 -75714 -130638 -102015 -229549 -424360 -256366 -226068
8859b26068C147b01628G682b36138e7536j3301j22955M5476j97545a00841A07108
$$ -226068 3147 -201628 7682 -236138 -57536 -70837 -193792 -148316 -345861 -100841 107108
$$ [...]
##END NTUPLES=NMR SPECTRUM
##END=
