
##TITLE=UV1292_M3_1216-1376_10_7535562_trwCHx6B9J
##JCAMPDX= 6.0         $$ Bruker NMR JCAMP-DX V2.0
##DATA TYPE= NMR SPECTRUM
##DATA CLASS= NTUPLES
##ORIGIN= BRUKER
##OWNER= Administrator
$$ 1.72 TOPSPIN		Version 2.1
$$ 2013-02-21 20:13:12.488 -0500  Administrator@X
$$ Compression mode = diff/dup
##.OBSERVE FREQUENCY= 400.02188249412
##.OBSERVE NUCLEUS= ^1H
##.ACQUISITION MODE= SIMULTANEOUS (DQD)
##.ACQUISITION SCHEME= undefined
##.AVERAGES= 64
##.DIGITISER RES= 22
##SPECTROMETER/DATA SYSTEM= spect
##.PULSE SEQUENCE= noesygpps1d.comp
##.SOLVENT NAME= COFFEE_meoh
##.SHIFT REFERENCE= INTERNAL, COFFEE_meoh, 1, 14.96137
##AUDIT TRAIL= $$ (NUMBER, WHEN, WHO, WHERE, PROCESS, VERSION, WHAT)
$$ ##TITLE= Audit trail, TOPSPIN		Version 2.1
$$ ##JCAMPDX= 5.01
$$ ##ORIGIN= Bruker BioSpin GmbH
$$ ##OWNER= Administrator
$$ $$ E:\/data/COFFEE/nmr/UV1292_M3_1216-1376_10_7535562_trwCHx6B9J/12/pdata/1/auditp.txt
$$ ##AUDIT TRAIL=  $$ (NUMBER, WHEN, WHO, WHERE, PROCESS, VERSION, WHAT)
(   1,<2013-02-21 20:13:06.358 -0500>,<Administrator>,<X>,<go>,<TOPSPIN 2.1>,
      <created by zg
	started at 2013-02-21 20:01:35.192 -0500,
	POWCHK enabled, PULCHK disabled,
       configuration hash MD5:
       86 BA 57 50 F2 9D 5C 9B 26 00 A9 28 5F 66 2E 89
       data hash MD5: 64K
       A2 4F 46 AB 5B 6F 36 E6 1A 58 BB 4C B0 2D 04 73>)
(   2,<2013-02-21 20:13:09.658 -0500>,<Administrator>,<X>,<proc1d>,<TOPSPIN 2.1>,
      <Start of raw data processing
       efp LB = 0.3 FT_mod = 6 PKNL = 1 PHC0 = 0 PHC1 = 0 SI = 128K 
       data hash MD5: 128K
       23 D7 CE 41 AA FA F8 80 E6 64 AB BD 93 4F 76 DC>)
(   3,<2013-02-21 20:13:10.756 -0500>,<Administrator>,<X>,<proc1d>,<TOPSPIN 2.1>,
      <pk PHC0 = 248.3789 PHC1 = 0 
       data hash MD5: 128K
       05 20 00 4C AD 00 20 7E 93 7C 68 07 24 45 F3 1D>)
(   4,<2013-02-21 20:13:11.468 -0500>,<Administrator>,<X>,<proc1d>,<TOPSPIN 2.1>,
      <abs ABSG = 1 
       data hash MD5: 128K
       56 6B A5 2B 5A 6F 13 6B 56 75 B7 89 EE 21 BB 2B>)
(   5,<2013-02-21 20:13:11.622 -0500>,<Administrator>,<X>,<proc1d>,<TOPSPIN 2.1>,
      <abs ABSG = 2 
       data hash MD5: 128K
       C9 74 DD 1D AF F3 92 A7 5D A2 6F 5A 96 CA 16 34>)
(   6,<2013-02-21 20:13:11.792 -0500>,<Administrator>,<X>,<proc1d>,<TOPSPIN 2.1>,
      <abs ABSG = 3 
       data hash MD5: 128K
       2F AD 5F C4 F1 FD 8D 43 46 86 6B 7A 00 A7 77 12>)
(   7,<2013-02-21 20:13:11.963 -0500>,<Administrator>,<X>,<proc1d>,<TOPSPIN 2.1>,
      <abs ABSG = 4 
       data hash MD5: 128K
       67 2B D0 A5 E9 2C 60 D7 47 86 C8 D8 1D 7F 75 E4>)
(   8,<2013-02-21 20:13:12.164 -0500>,<Administrator>,<X>,<proc1d>,<TOPSPIN 2.1>,
      <abs ABSG = 5 
       data hash MD5: 128K
       DA 75 65 9C 41 A7 59 EE A7 0A 5E F7 65 87 60 F6>)
$$ ##END=
$$ 
$$ $$ hash MD5
$$ $$ 2B 6B 03 C4 D4 6F 5F 00 E7 39 74 57 CE D6 2D E0
##$RELAX= 
##$RELAX= 
##$RELAX= 
##$RELAX= 
##$RELAX= 
##$RELAX= 
##$RELAX= 
##$RELAX= 
$$ Bruker specific parameters
$$ --------------------------
##$DU= <E:\>
##$EXPNO= 12
$$ [...]
150 150 150 150 150 150 150 150
##$TP07= 0
##$TPNAME0= <>
##$TPNAME1= <>
##$TPNAME2= <>
##$TPNAME3= <>
##$TPNAME4= <>
##$TPNAME5= <>
##$TPNAME6= <>
##$TPNAME7= <>
##$TPOAL= (0..7)
0.5 0.5 0.5 0.5 0.5 0.5 0.5 0.5
##$TPOFFS= (0..7)
0 0 0 0 0 0 0 0
##$TUNHIN= 0
##$TUNHOUT= 0
##$TUNXOUT= 0
##$USERA1= <user>
##$USERA2= <user>
##$USERA3= <user>
##$USERA4= <user>
##$USERA5= <user>
##$V9= 5
##$VALIST= <valist>
##$VCLIST= <CCCCCCCCCCCCCCC>
##$VD= 0
##$VDLIST= <DDDDDDDDDDDDDDD>
##$VPLIST= <PPPPPPPPPPPPPPP>
##$VTLIST= <TTTTTTTTTTTTTTT>
##$WBST= 1024
##$WBSW= 4
##$XGAIN= (0..3)
0 0 0 0
##$XL= 0
##$YL= 0
##$YMAX_a= 6115294
##$YMIN_a= -11316920
##$ZGOPTNS= <>
##$ZL1= 120
##$ZL2= 120
##$ZL3= 120
##$ZL4= 120
##$ABSF1= 14.96137
##$ABSF2= -5.596811
##$ABSG= 5
##$ABSL= 3
##$ALPHA= 0
##$AQORDER= 0
##$ASSFAC= 0
##$ASSFACI= 0
##$ASSFACX= 0
##$ASSWID= 0
##$AUNMP= <proc_prof1d_extract.lims>
##$AXLEFT= 0
##$AXNAME= <>
##$AXNUC= <1H>
##$AXRIGHT= 0
##$AXTYPE= 0
##$AXUNIT= <>
##$AZFE= 0.1
##$AZFW= 0.1
##$BCFW= 0
##$BC_mod= 0
##$BYTORDP= 0
##$COROFFS= 0
##$CY= 15
##$DATMOD= 1
##$DC= 0
##$DFILT= <>
##$DTYPP= 0
##$F1P= 0
##$F2P= 0
##$FCOR= 0.5
##$FTSIZE= 131072
##$FT_mod= 6
##$GAMMA= 0
##$GB= 0
##$INTBC= 1
##$INTSCL= 1
##$ISEN= 128
##$LB= 0.3
##$LEV0= 0
##$LPBIN= 0
##$MAXI= 10000
##$MC2= 0
##$MEAN= 0
##$ME_mod= 0
##$MI= 0
##$NCOEF= 0
##$NC_proc= -2
##$NLEV= 6
##$NOISF1= 0
##$NOISF2= 0
##$NSP= 0
##$NTH_PI= 0
##$NZP= 0
##$OFFSET= 14.96137
##$PC= 1
##$PHC0= 248.3789
##$PHC1= 0
##$PH_mod= 1
##$PKNL= yes
##$PPARMOD= 0
##$PPDIAG= 0
##$PPIPTYP= 0
##$PPMPNUM= 2147483647
##$PPRESOL= 1
##$PSCAL= 4
##$PSIGN= 0
##$PYNMP= <proc.py>
##$REVERSE= no
##$SF= 400.020009490663
##$SI= 131072
##$SIGF1= 0
##$SIGF2= 0
##$SINO= 400
##$SIOLD= 131072
##$SPECTYP= <>
##$SREGLST= <1H.CDCl3>
##$SSB= 0
##$STSI= 131072
##$STSR= 0
##$SW_p= 8223.68421052631
##$SYMM= 0
##$S_DEV= 0
##$TDeff= 65536
##$TDoff= 0
##$TI= <>
##$TILT= no
##$TM1= 0
##$TM2= 0
##$TOPLEV= 0
##$USERP1= <user>
##$USERP2= <user>
##$USERP3= <user>
##$USERP4= <user>
##$USERP5= <user>
##$WDW= 1
##$XDIM= 131072
##$YMAX_p= 470811052
##$YMIN_p= -22066
##$CURPLOT= <Network HP LaserJet P1505>
##$CURPRIN= <$Network HP LaserJet P1505>
##$DFORMAT= <normdp>
##$LAYOUT= <+/1D_H.xwp>
##$LFORMAT= <normlp>
##$PFORMAT= <normpl>
##$SURQMSG= 1
$$ End of Bruker specific parameters
$$ ---------------------------------
##NTUPLES= NMR SPECTRUM
##VAR_NAME=  FREQUENCY,     SPECTRUM/REAL,   SPECTRUM/IMAG
##SYMBOL=    X,             R,               I
##VAR_TYPE=  INDEPENDENT,   DEPENDENT,       DEPENDENT
##VAR_FORM=  AFFN,          ASDF,            ASDF
##VAR_DIM=   131072,        131072,          131072
##UNITS=     HZ,            ARBITRARY UNITS, ARBITRARY UNITS
##FACTOR=    0.0627417313425164, 1,          1
##FIRST=     8223.62146879497, 619,          -60986
##LAST=      0,             2491,            -61589
##MIN=       0,             -22066,          0
##MAX=       8223.62146879497, 470811052,    0
$$ Real data points
##PAGE= N=1
##DATA TABLE= (X++(R..R)), XYDATA
$$ [...]
63892H84162k6200k3779k2075k0578j9253j8388j8149j8377j8654j8523j7662
$$ 884162 857962 834183 812108 791530 772277 753889 735740 717363 698709 680186 662524
63881F62524j5984j3687j1297r338p730n712k795M34K982M808O778R239J1508
$$ 662524 646540 632853 621556 612218 604488 598776 595981 596415 599397 604205 610983 620222 631730
63868F31730J2997J4062J5211J6154J6367J6090J6047J6405J6605J6113J4829
$$ 631730 644727 658789 674000 690154 706521 722611 738658 755063 771668 787781 802610
63857H02610J2983J0937Q911O663L760M48k298m103n924q721j1900j4055j4940
$$ 802610 815593 826530 835441 842104 845864 846312 844014 839911 833987 825266 813366 799311 784371
63844G84371j5621j6715j7635j7867j7930j8514j9448k0204k0824k1596k2156
$$ 784371 768750 752035 734400 716533 698603 680089 660641 640437 619613 598017 575861
63833E75861k1793k0556j9389j8939j8789j8161j6932j5591j4391j3075j1451
$$ 575861 554068 533512 514123 495184 476395 458234 441302 425711 411320 398245 386794
63822C86794r810q596p916p638p644p775p682p149o395n716m939l773k523j847
$$ 386794 376984 368388 360472 352834 345190 337415 329733 322584 316189 310473 305534 301761 299238 297391
63808B97391j743j475p42k20m72r88r52n22n68j307k006k081j793j703j916k179
$$ 297391 295648 294173 293431 293211 292739 291751 290799 290277 289709 288402 286396 284315 282522 280819 278903 276724
63792B76724k345k427k419k275k067j982k075k145j923j507j441k073k899k916
$$ 276724 274379 271952 269533 267258 265191 263209 261134 258989 257066 255559 254118 252045 249146 246230
63778B46230j843o34m29j192j782j268J13J361J731J271N55R0m4o4j68m01p02
$$ 246230 244387 243753 243324 242132 240350 239082 239195 240556 242287 243558 244113 244203 244159 244095 243927 243526 242824
63761B42824q85o92q8N49P71N69K39j65q12j522j747j290o16j59K17P92J388J597
$$ 242824 241939 241247 241159 241708 242479 243048 243287 243122 242310 240788 239041 237751 237135 236976 237193 237985 239373 240970
63743B40970J408J252J458J915K216K083J758J843K600L463L662L192K703K437
$$ 240970 242378 243630 245088 247003 249219 251302 253060 254903 257503 260966 264628 267820 270523 272960
63729B72960K027J389J095J473K065K361K511K856L371M039N143O614P681P755
$$ 272960 274987 276376 277471 278944 281009 283370 285881 288737 292108 296147 301290 307904 315585 323340
63715C23340P179O454N318L453J553O76O99M76n29j674k302k565k831k971k668
$$ 323340 330519 336973 342291 345744 347297 347973 348672 349148 348619 346945 344643 342078 339247 336276 333608
63700C33608j967j176n29j50n8p9R9O00J255J864K420L048L748M214L950K821
$$ 333608 331641 330465 329936 329786 329728 329649 329748 330348 331603 333467 335887 338935 342683 346897 350847 353668
63684C53668J466P50P34O31j5p04q41o32n77o20m44j89j83k37P1N85P83O18N31
$$ 353668 355134 355884 356618 357249 357234 356530 355689 355057 354480 353860 353416 353227 353044 352807 352878 353463 354246 354864 355395
63665C55395O70P54P17Q50J300J846K160J961J015n82k224l394m160m814n295
$$ 355395 356065 356819 357536 358386 359686 361532 363692 365653 366668 366086 363862 360468 356308 351494 346199
63650C46199n502n708o031n879m694l025j987j828j856j595j118l97O38J443J298
$$ 346199 340697 334989 328958 323079 318385 315360 313373 311545 309689 308094 306976 306579 307217 308660 309958
63635C09958O00O87K061L769M822N362N943O533O800O741O466N934N400N594O841
$$ 309958 310558 311245 313306 317075 321897 327259 333202 339735 346535 353276 359742 365676 371076 376670 383511
63620C83511Q373R080Q758Q218Q352R454J1202J3027J4618J6187J8122K0366K2541
$$ 383511 391884 400964 409722 417940 426292 435746 446948 459975 474593 490780 508902 529268 551809
63607E51809K4671K7239L0343L3323L5489L6709L6996L5960L3109K8399K2170
$$ 551809 576480 603719 634062 667385 702874 739583 776579 812539 845648 874047 896217
63596H96217J4886P283M98m432p191q147p852o792n501m688n128p368j1284j6008
$$ 896217 911103 918386 918884 914452 907261 899114 891262 884470 878969 874281 869153 861785 850501 834493
63582H34493k0477k4123k6839k8488k8827k7965k6454k4757k2875k0552j7693
$$ 834493 814016 789893 763054 734566 705739 677774 651320 626563 603688 583136 565443
63571E65443j4520j1450q757o244l465m79J979L410M194M890N371N334N172N455
$$ 565443 550923 539473 530716 524472 521007 520528 522507 525917 530111 535001 540372 545706 550878 556333
63557E56333N844N625N153N625P306R192J0685J2390J4881J7718K0490K3743K8124
$$ 556333 562177 567802 572955 578580 585886 595078 605763 618153 633034 650752 671242 694985 723109
63544G23109L3395L9075M5137N0867N3658N0502M0997K7920J4722L165o378j3370
$$ 723109 756504 795579 840716 891583 945241 995743 1036740 1064660 1079382 1082547 1076169 1062799
63532A062799j6819j6407j3242r144n435k651j204j696m399q842j4363k0707k7579
$$ 1062799 1045980 1029573 1016331 1007187 1001752 999101 997897 996201 991802 982960 968597 947890 920311
63519I20311l3940l8450m0585m0733l9367l6805l3683l0762k8081k5108k1874
$$ 920311 886371 847921 807336 766603 727236 690431 656748 625986 597905 572797 550923
63508E50923j9176j7339j5656j3484j1228r675q913q495q106p604o805n748m847
$$ 550923 531747 514408 498752 485268 474040 464365 455452 446957 438851 431247 424442 418694 413847
63495D13847m335l893l154k253j528j056p97q24j084j273j205r90o39QP74J162
$$ 413847 409512 405619 402465 400212 398684 397628 396831 396007 394923 393650 392445 391455 390816 390824 391598 392760
63479C92760J162J406K133K735K849L147M340N883O541N867M403K686Q32r84k426
$$ 392760 393922 395328 397461 400196 403045 406192 410532 416415 422956 428823 433226 435912 436744 435760 433334
63464D33334l438m319n205n799n691m798l496k371j718j351j077j166j830k402
$$ 433334 429896 425577 420372 414573 408882 404084 400588 398217 396499 395148 394071 392905 391075 388673
63450C88673j871l23J057J652K200L430M918N945O652P435P976P853P604Q157
$$ 388673 386802 386479 387536 389188 391388 394818 399736 405681 412333 419768 427744 435597 443201 451358
63436D51358R570J1249J3155J5908J9813K4561K9537L3615L5014L2452K6588J9532
$$ 451358 460928 472177 485332 501240 521053 545614 575151 608766 643780 676232 702820 722352
63424G22352J2994P572L647J896K605N266R101J3597J8394K3269K8327L3693L8940
$$ 722352 735346 742918 746565 748461 751066 756332 765433 779030 797424 820693 849020 882713 921653
63411I21653M3172M5601M5621M2542L5982K6645J6252O539j399p005j0170j1245
$$ 921653 964825 1010426 1056047 1098589 1134571 1161216 1177468 1184007 1182608 1175603 1165433 1154188
63399A154188j0794r298p462o504p523j0653j5325k1079k7509l3626l8186m0705
$$ 1154188 1143394 1134096 1126634 1120130 1112607 1101954 1086629 1065550 1038041 1004415 966229 925524
63387I25524m1524m0926l8956l6110l3268l0749k8044k4791k1304j7992j4890
$$ 925524 884000 843074 804118 768008 734740 703991 675947 651156 629852 611860 596970
63376E96970j2072r825q058o098l487n26K243M696O836Q437R354R932J0682J1728
$$ 596970 584898 575073 567015 560917 557430 556904 559147 563843 570679 579116 588470 598402 609084 620812
63362F20812J2892J4096J5449J7106J9235K1905K4874K7761L0568L3745L7470
$$ 620812 633704 647800 663249 680355 699590 721495 746369 774130 804698 838443 875913
63351H75913M1189M3924M4872M3494L9387L2489K3436J3571M470k719p700j0810
$$ 875913 917102 961026 1005898 1049392 1088779 1121268 1144704 1158275 1162745 1160026 1152326 1141516
63339A141516j2304j2137j0638r016q627r820j2098j5253j9634k5154l0828l5616
$$ 1141516 1129212 1117075 1106437 1097421 1088794 1078974 1066876 1051623 1031989 1006835 976007 940391
63327I40391l9098m1053m1005l8782l5105l1010k6974k2920j8744j4288r203l679
$$ 940391 901293 860240 819235 780453 745348 714338 687364 664444 645700 631412 622209 618530
63315F18530O97J602j996q676j5523k0201k2069k1826k0476j8675j6640j4385
$$ 618530 619227 620829 618833 610157 594634 574433 552364 530538 510062 491387 474747 460362
63303D60362j1914r401p245n860n237m765l713j955j12J010J031J26j226k545
$$ 460362 448448 439047 431802 425942 420705 415940 412227 410272 410160 411170 412201 412327 411101 408556
63289D08556l587m427n246o033o518o424n677m458l165k233j835j796j917k239
$$ 408556 404969 400542 395296 389263 382745 376321 370644 366186 363021 360788 358953 357157 355240 353001
63275C53001k744k979k391j140j18J8l87m31L03J347J909J668J004N77P06J163
$$ 353001 350257 347278 344887 343747 343629 343647 343260 342829 343132 344479 346388 348056 349060 349637 350343 351506
63259C51506J586J924K340K740K787K460K268K597L066K947K196J622J931K914
$$ 351506 353092 355016 357356 360096 362883 365343 367611 370208 373274 376221 378417 380039 381970 384884
63245C84884L892M623N311N912O095N944O172P181Q397R041R317J0267J2466J5353
$$ 384884 388776 393399 398710 404622 410717 416661 422833 430014 438411 447452 456769 467036 479502 494855
63231D94855J7870J9338J9780J9752J9995K0839K1843K2330K2183K1739K1113
$$ 494855 512725 532063 551843 571595 591590 612429 634272 656602 678785 700524 721637
63220G21637K0169J9147J8585J8546J8606J8750J9504K0875K1915K1874K1055
$$ 721637 741806 760953 779538 798084 816690 835440 854944 875819 897734 919608 940663
63209I40663K0022J8571J6199J3052R600N705Q48m895j0723j5976k0517k4301
$$ 940663 960685 979256 995455 1008507 1018107 1023812 1024660 1019765 1009042 993066 972549 948248
63197I48248k7048k8402k8161k6453k3899k1357j9201j7042j4461j1642r019o670
$$ 948248 921200 892798 864637 838184 814285 792928 773727 756685 742224 730582 721563 714893
63185G14893m432k212K43L369P073J0404J2592J4014J5505J7109J8240J8746J9040
$$ 714893 710461 708249 708492 711861 718934 729338 741930 755944 771449 788558 806798 825544 844584
63172H44584J9277J9192J8688J7978J7232J6536J6073J5790J5172J3868J2198
$$ 844584 863861 883053 901741 919719 936951 953487 969560 985350 1000522 1014390 1026588
63161A026588J0380P713L421k004p203j1572j5590j9708k3794k7595l0769l2572
$$ 1026588 1036968 1044681 1048102 1046098 1038895 1027323 1011733 992025 968231 940636 909867 877295
63149H77295l2473l1132k9791k8686k7042k4675k2337k0315j7928j4939j2365
$$ 877295 844822 813690 783899 755213 728171 703496 681159 660844 642916 627977 615612
63138F15612j1185j0991j0643r563p897o002m341l330k829k246j460r39o84K20
$$ 615612 604427 593436 582793 573230 565333 559331 554990 551660 548831 546585 545125 544186 543502 543722
63124E43722K313M759O321O846P117P584P989P996P560O730N548M158K783J688
$$ 543722 546035 550794 557115 563961 571078 578662 586651 594647 602207 608937 614485 618643 621426 623114
63110F23114J137J175J342J064M43J91O42J286J451R97J47q72j799k444l006l774
$$ 623114 624251 625426 626768 627832 628275 628466 629108 630394 631845 632842 632989 632117 630318 627874 624868 621094
63094F21094m407m131k924j720j237j198j047o58m1Q53J554J208p7q55j04J320
$$ 621094 616687 612556 609632 607912 606675 605477 604430 603772 603731 604584 606138 607346 607269 606414 606310 607630
63078F07630J897J456J080J408K127K853L541M049M205M330M965O088P116P716
$$ 607630 609527 610983 612063 613471 615598 618451 621992 626041 630246 634576 639541 645629 652745 660461
63064F60461Q066Q429R036J0174J1859J3533J4745J5938J7911K0648K3469K6194
$$ 660461 668527 676956 685992 696166 708025 721558 736303 752241 770152 790800 814269 840463
63052H40463K9267L2665L5629L7835L9998M2839M6089M9011N1371N3261N4441
$$ 840463 869730 902395 938024 975859 1015857 1058696 1104785 1153796 1205167 1258428 1312869
63041A312869N4507N3584N2271N0886M9233M7225M5325M4139M3716M3516M3019
$$ 1312869 1367376 1420960 1473231 1524117 1573350 1620575 1665900 1710039 1753755 1797271 1840290
63030A840290M2238M1558M1061M0114L7682L3105K6535J8617R743k47j1559k3730
$$ 1840290 1882528 1924086 1965147 2005261 2042943 2076048 2102583 2121200 2130943 2130696 2119137 2095407
63018B095407l5586m5997n4474o0977o5418o7664o7840o6259o3114n8580n3134
$$ 2095407 2059821 2013824 1959350 1898373 1832955 1765291 1697451 1631192 1568078 1509498 1456364
63007A456364m7401m1576l5395k8698k1740j4810p922j044N650J1877J7353K1710
$$ 1456364 1408963 1367387 1331992 1303294 1281554 1266744 1258822 1257778 1263428 1275305 1292658 1314368
62995A314368K4690K6571K8081K9675L1213L2460L3449L4124L4133L3411L2575
$$ 1314368 1339058 1365629 1393710 1423385 1454598 1487058 1520507 1554631 1588764 1622175 1654750
62984A654750L2199L1924L0808K8518K5542K2232J8083J2286M697m023j3092k2117
$$ 1654750 1686949 1718873 1749681 1778199 1803741 1825973 1844056 1856342 1861039 1857016 1843924 1821807
62972A821807l0978l9398m6874n2941n7371o0124o1276o1112o0067n8371n5928
$$ 1821807 1790829 1751431 1704557 1651616 1594245 1534121 1472845 1411733 1351666 1293295 1237367
62961A237367n2660m8817m4778m0780l7085l4156l2241l0878k9293k7201k5010
$$ 1237367 1184707 1135890 1091112 1050332 1013247 979091 946850 915972 886679 859478 834468
62950H34468k3298k2349k2005k1622k0453j8517j6820j6181j6127j5603j4505
$$ 834468 811170 788821 766816 745194 724741 706224 689404 673223 657096 641493 626988
62939F26988j3617j3179j2527j1315j0101r351q697p642o353n259m394l591k865
$$ 626988 613371 600192 587665 576350 566249 556898 548201 540559 534206 528947 524553 520962 518097
62926E18097k291j833j564j544j435q10l5n8j048j998k125j870k035k589k980
$$ 518097 515806 513973 512409 510865 509430 508620 508585 508527 507479 505481 503356 501486 499451 496862 493882
62911D93882l089l176l345l613m109m666m642l746k647k160k263k406k435k509
$$ 493882 490793 487617 484272 480659 476550 471884 467242 463496 460849 458689 456426 454020 451585 449076
62897D49076k467j966j102l41M3N5k95q81j321j319j018o87m00k25k52j53P33
$$ 449076 446609 444643 443541 443200 443243 443298 443003 442122 440801 439482 438464 437777 437377 437152 436900 436747 437480
62880D37480K339L502L250K011R04L06j63n99o33j92K58K85j20o29p88l65J89
$$ 437480 439819 443321 446571 448582 449486 449792 449629 449030 448397 448205 448463 448748 448628 447999 447211 446846 447035
62863D47035O2q68j783k085k165k467k520j753o29l0J21N64J337J692J307O08
$$ 447035 447097 446229 444446 442361 440196 437729 435209 433456 432827 432797 432918 433482 434819 436511 437818 438426
62847D38426k0m67m36L18J221J306N33j51k39k55o89j178j191q78o99p06o82o51
$$ 438426 438406 437939 437503 437821 439042 440348 440881 440730 440491 440236 439547 438369 437178 436300 435601 434895 434213 433562
62829D33562q27j184j400j208o55n0L16M19N20Q45J409K116K805L134K837K211
$$ 433562 432735 431551 430151 428943 428288 428238 428554 428973 429493 430338 431747 433863 436668 439802 442639 444850
62813D44850J979K430L139L733M405N239N688N316M589M377M928N870O839P551
$$ 444850 446829 449259 452398 456131 460536 465775 471463 476779 481368 485745 490673 496543 503382 510933
62799E10933P689P356P264P844Q514Q494P947P673P980Q645R598J0992J2819J5120
$$ 510933 518622 525978 533242 541086 549600 558094 566041 573714 581694 590339 599937 610929 623748 638868
62785F38868J8169K1796K5086K7571L0155L3884L8435M2911M7569N3275N9637
$$ 638868 657037 678833 703919 731490 761645 795529 833964 876875 924444 977719 1037356
62774A037356O5212O9612P3759P7956Q1206Q2854Q3380Q2956Q0518P5053O6825
$$ 1037356 1102568 1172180 1245939 1323895 1405101 1487955 1571335 1654291 1734809 1809862 1876687
62763A876687N6582M4527L0792J6110J224j3738k8566m2239n3651o2640o9692
$$ 1876687 1933269 1977796 2008588 2024698 2025922 2012184 1983618 1941379 1887728 1825088 1755396
62752A755396p5012p8482q0193q0492p9602p7529p4275o9973o5081o0308n5955
$$ 1755396 1680384 1601902 1521709 1441217 1361615 1284086 1209811 1139838 1074757 1014449 958494
62741I58494n1396m5918m0094l5531l2964l1302k8979k5609k1987j9007j7027
$$ 958494 907098 861180 821086 785555 752591 721289 692310 666701 644714 625707 608680
62730F08680j5743j4283j1916q994o788n997n893n264l817k277j409j309j414
$$ 608680 592937 578654 566738 557744 550956 544959 539066 533802 529985 527708 526299 524990 523576
62717E23576j016J16J553K863M201N801P221P896Q273R446J1596J3829J5712J7914
$$ 523576 522560 522676 524229 527092 531293 537094 544315 552211 560484 569930 581526 595355 611067 628981
62703F28981K0925K4219K7244L0264L3574L6711L9340M2092M5725M9993N4234
$$ 628981 649906 674125 701369 731633 765207 801918 841258 883350 929075 979068 1033302
62692A033302N8484O3090O7623P1183P3557P5080P5419P3399O8277O0498N0929
$$ 1033302 1091786 1154876 1222499 1293682 1367239 1442319 1517738 1591137 1659414 1719912 1770841
62681A770841L9864K7105J2721k555j7642l1678m4217n4904o3235o8935p2438
$$ 1770841 1810705 1837810 1850531 1847976 1830334 1798656 1754439 1699535 1636300 1567365 1494927
62670A494927p4508p5360p4604p2124o8502o4395o0060n5691n1643m7978m4255
$$ 1494927 1420419 1345059 1270455 1198331 1129829 1065434 1005374 949683 898040 850062 805807
62659H05807m0132l5834l1695k7748k4065k0998j8694j6738j4704j2806j1586
$$ 805807 765675 729841 698146 670398 646333 625335 606641 589903 575199 562393 550807
62648E50807j1259j1607j2164j2274j1391r680p992o915o227n509m794m239l603
$$ 550807 539548 527941 515777 503503 492112 482432 474440 467525 461298 455789 450995 446756 443153
62635D43153k510r11J013K908L972L248Q10j812l095l095k998l407l817l614k887
$$ 443153 440643 439732 440745 443653 447625 450873 451683 449871 446776 443681 440683 437276 433459 429845 426958
62620D26958k166j794j705j513q84L8P90J297K061L302M350M427L795L476L913
$$ 426958 424792 422998 421293 419780 418896 418934 419724 421021 423082 426384 430734 435161 438956 442432 446345
62605D46345M533M714M637M908N662O504P238Q344J0427J3385J6420J9002K1373
$$ 446345 450878 455592 460229 465137 470799 477303 484541 492885 503312 516697 533117 552119 573492
62592E73492K3939K6562K8933L1241L3824L6435L8570M0304M1913M2704M1243
$$ 573492 597431 623993 652926 684167 717991 754426 792996 833300 875213 917917 959160
62581I59160L7062L1196K4814J8090J0830L330l967j0993j7679k3643k8682l2923
$$ 959160 996222 1027418 1052232 1070322 1081152 1084482 1080515 1069522 1051843 1028200 999518 966595
62569I66595l6092l7399l6762l5389l4438l3688l2305l0284k8252k6336k4157
$$ 966595 930503 893104 856342 820953 786515 752827 720522 690238 661986 635650 611493
62558F11493k1732j9514j7607j5625j3298j0799q552p023o413o242n638m427l394
$$ 611493 589761 570247 552640 537015 523717 512918 504366 497343 490930 484688 479050 474623 471229
62545D71229l047k799j991j069q30j035p87J8O11O24M95N95P71Q19P69O03L02
$$ 471229 468182 465383 463392 462323 461493 460458 459671 459689 460300 460924 461419 462014 462785 463604 464373 464976 465278
62528D65278J53N06J286K227L454N201P092Q400R127J0106J1913J4098J5815J6862
$$ 465278 465431 465937 467223 469450 472904 478105 485197 493597 502724 512830 524743 538841 554656 571518
62514E71518J8000K0292K4056K8370L1863L4165L6139L8525M0968M2864M4395
$$ 571518 589518 609810 633866 662236 694099 728264 764403 802928 843896 886760 931155
62503I31155M5943M6989M6613M4705M1695L7319L0772K2242J3278N418p91n217
$$ 931155 977098 1024087 1070700 1115405 1157100 1194419 1225191 1247433 1260711 1266129 1265338 1260121
62491A260121p447p191m823j152L069P314J1406J5610K0371K5844L1975L8836
$$ 1260121 1252674 1245483 1240660 1239508 1242577 1249891 1261297 1276907 1297278 1323122 1355097 1393933
62479A393933M6295N3324N8023N8411N3202M2503K8629J5631O518K92p360j9830
$$ 1393933 1440228 1493552 1551575 1609986 1663188 1705691 1734320 1749951 1756469 1756761 1749401 1729571
62467A729571l6335n2898o5801p3691p7316p8356p8423p8415p8157p6689p2982
$$ 1729571 1693236 1640338 1574537 1500846 1423530 1345174 1266751 1188336 1110179 1033490 960508
62456I60508o6700n8592n0119m2482l5938l0179k5076k0719j6976j3604j0800
$$ 960508 893808 835216 785097 742615 706677 676498 651422 630703 613727 600123 589323
62445E89323r019q133p301n874m016k203o14P65J810K473L080M009N136N836N627
$$ 589323 580304 572171 564870 558996 554980 552777 552163 552928 554738 557211 560291 564300 569436 575272 580899
62430E80899M586L202J867N65r52k786m754o632q282r500r964r595q780q055p637
$$ 580899 585485 588687 590554 591119 590167 587381 582627 575995 567713 558213 548249 538654 529874 521819 514182
62415E14182p402p160o819o423o078n712m981l758k696k685l638m428m325l709
$$ 514182 506780 499620 492801 486378 480300 474588 469607 465849 463153 460468 456830 452402 448077 444368
62401D44368l023j914k06J103R10k40o59L93K054L276L907M244M411M495M641
$$ 444368 441345 439431 439225 440328 441238 440998 440339 440732 442786 446062 449969 454213 458624 463119 467760
62386D67760M744M576M314M372M686M785M767N390O931Q574R333R151Q731Q616
$$ 467760 472504 477080 481394 485766 490452 495237 500004 505394 512325 520899 530232 539383 548114 556730
62372E56730Q803R019R056Q997R189R876J0876J1812J2615J3463J4474J5771J7752
$$ 556730 565533 574552 583608 592605 601794 611670 622546 634358 646973 660436 674910 690681 708433
62359G08433K0749K4553K8752L3429L8859M4647M9941N4597N9306O4175O7960
$$ 708433 729182 753735 782487 815916 854775 899422 949363 1003960 1063266 1127441 1195401
62348A195401O9173O7388O2986N6144M6893L6001K5063J5504P650Q04n973j3170
$$ 1195401 1264574 1331962 1394948 1451092 1497985 1533986 1559049 1574553 1582203 1583007 1577034 1563864
62336A563864k0659k7950l4528m0055m4464m7915n0411n1424n0209m6801m2390
$$ 1563864 1543205 1515255 1480727 1440672 1396208 1348293 1297882 1246458 1196249 1149448 1107058
62325A107058l8393l5343l2892l0634k8439k6338k4578k3671k3842k4517k4841
$$ 1107058 1068665 1033322 1000430 969796 941357 915019 890441 866770 842928 818411 793570
62314G93570k4562k4005k3303k2204k0586j8642j6600j4648j3003j1640j0127
$$ 793570 769008 745003 721700 699496 678910 660268 643668 629020 616017 604377 594250
62303E94250q250o528n516m863l805k352j152k58R53K555L827M498N291O719Q168
$$ 594250 586000 579472 573956 569093 565288 562936 561784 561526 562479 565034 568861 573359 578650 585369 593537
62288E93537Q796Q731Q784R333J0046J0406J0159R400Q498P695O685N001K934
$$ 593537 602333 611064 619848 629181 639227 649633 659792 669192 677690 685385 692070 697071 700005
62275G00005J509J307J759J966J736J410J153Q96P61J053J855K971M229N647P410
$$ 700005 701514 702821 704580 706546 708282 709692 710845 711741 712502 713555 715410 718381 722610 728257 735667
62260G35667R789J2990J6945K1404K6252L1585L7421M3561M9810N6066O2042O7083
$$ 735667 745456 758446 775391 796795 823047 854632 892053 935614 985424 1041490 1103532 1170615
62248A170615P0381P1253O9235O4095N5923M5298L3359K1620J1269K435n697j3953
$$ 1170615 1240996 1312249 1381484 1445579 1501502 1546800 1580159 1601779 1613048 1615483 1609786 1595833
62236A595833k2609l1665m0988m9843n6954o1608o4195o5140o4010o0545n5895
$$ 1595833 1573224 1541559 1500571 1450728 1393774 1332166 1267971 1202831 1138821 1078276 1022381
62225A022381n1656m7939m3603l8270l2943k8524k4823k1346j8094j5204j2631
$$ 1022381 970725 922786 879183 840913 807970 779446 754623 733277 715183 699979 687348
62214F87348j0558r420r140q896p990o525n059m081l783l855l497k249o99L23
$$ 687348 676790 667370 658230 649334 641344 634819 629760 625679 621896 618041 614544 612295 611596 611919
62200F11919R63J930L076L609L592L956M892N559N681N985O638O665N730N119
$$ 611919 612882 614812 617888 621497 625089 629045 633937 639496 645177 651162 657800 664465 670195 675314
62186F75314N971P633Q871R719J0949J2415J3291J3486J3678J4121J4277J3518
$$ 675314 681285 688918 697789 707508 718457 730872 744163 757649 771327 785448 799725 813243
62174H13243J1573Q630N563L630L297L844M706O547J0176J5046J9871K4400K9429
$$ 813243 824816 833446 839009 842639 845936 849780 854486 861033 871209 886255 906126 930526 959955
62161I59955L5252M1151M6391N0719N3721N4523N2436M7431L9976L0938K1649
$$ 959955 995207 1036358 1082749 1133468 1187189 1241712 1294148 1341579 1381555 1412493 1434142
62150A434142J3402O581O12n229j1245j7435k3681k9712l5150l9627m2735m4136
$$ 1434142 1447544 1454125 1454737 1449508 1438263 1420828 1397147 1367435 1332285 1292658 1249923 1205787
62138A205787m3982m2915m1277l8624l4531k9580k4917k1017j7532j4316j1926
$$ 1205787 1161805 1118890 1077613 1038989 1004458 974878 949961 928944 911412 897096 885170
62127H85170j0812j0555j0251r382q089o743n568m610l889l306k462q43J609M242
$$ 885170 874358 863803 853552 844170 836081 829338 823770 819160 815271 811965 809503 808660 810269 814511
62113H14511O298P683Q777R570R464P924M943Q59l675p434r029q015n320k427
$$ 814511 820809 828492 837269 846839 856303 864227 869170 870029 866354 858920 849891 841876 836556 834129
62099H34129m71j45j710m642p672r678j0330r770q140n796l494j864q98j62O97
$$ 834129 833658 833513 831803 827161 819489 809811 799481 789711 781571 775775 772281 770417 769519 769357 770054
62084G70054J818L119M267M956N400O191P556R260J1208J3552J6057J8102J9602
$$ 770054 771872 774991 779258 784214 789614 795805 803361 812621 823829 837381 853438 871540 891142
62071H91142K1194K3148K4758K5236K4693K3791K2964K2373K2216K2663K3880
$$ 891142 912336 935484 960242 985478 1010171 1033962 1056926 1079299 1101515 1124178 1148058
62060A148058K6147K9446L2780L4692L4661L3210L0493K5893J9400J2219N374
$$ 1148058 1174205 1203651 1236431 1271123 1305784 1338994 1369487 1395380 1414780 1426999 1432373
62049A432373j230p626j2905j6588j9917k4571l0650l7008m2818m7669n0753n1386
$$ 1432373 1431143 1423517 1410612 1394024 1374107 1349536 1318886 1281878 1239060 1191391 1140638 1089252
62037A089252n0173m8451m6720m4576m1979l9415l6899l3800k9906k5838k2336
$$ 1089252 1039079 990628 943908 899332 857353 817938 781039 747239 717333 691495 669159
62026F69159j9624j7454j5290j2645r729p414o117n224m186l530l906m797n180
$$ 669159 649535 632081 616791 604146 594417 587003 580886 575662 571476 567946 564040 559243 554063
62013E54063n032n076n391n382m975m632m311l471k157r85j03Q87J965K638K943
$$ 554063 549031 543955 538564 533182 528207 523575 519264 515793 513636 512651 512548 513435 515400 518038 520981
61998E20981L490M431N195N502N668N776N324L981K116L73p78j163j161j666l170
$$ 520981 524471 528902 534097 539599 545267 551043 556367 560348 562464 562837 562059 560896 559735 558069 554899
61983E54899n063o527p743r247j0539j0583r573q825q774q447p175n574m355l384
$$ 554899 549836 543309 535566 526319 515780 505197 495624 486799 478025 469578 462403 456829 452474 449090
61969D49090k491k137k544l086l188l059k919k373j323o61j128k049k164j355
$$ 449090 446599 444462 441918 438832 435644 432585 429666 427293 425970 425309 424181 422132 419968 418613
61955D18613n91m11l44J36Q63J405J682J934K284K672L135L966N365O970Q061
$$ 418613 418022 417611 417267 417403 418266 419671 421353 423287 425571 428243 431378 435344 440709 447679 455740
61940D55740Q484R037J0606J3035J5353J6952J8016J8870J9538K0005K0287K0089
$$ 455740 464224 473261 483867 496902 512255 529207 547223 566093 585631 605636 625923 646012
61928F46012J8996J7214J5587J4609J3831J2501J0311P362L912N14k102l761n177
$$ 646012 665008 682222 697809 712418 726249 738750 749061 756423 760335 760849 758747 754986 749809
61915G49809p033q960r867r293p891o503n139l204m95K529N472Q488J1639J4205
$$ 749809 742776 733816 723949 714656 706765 700262 695123 691919 691424 693953 699425 707913 719552 733757
61901G33757J5334J5192J4710J4114J2515R244M812K18l953p328r513j0721j1828
$$ 733757 749091 764283 778993 793107 805622 814866 819678 819896 815943 808615 799102 788381 776553
61888G76553j3091j3509j2333j0424r114q432p632o862o911p647q218q692r976
$$ 776553 763462 749953 737620 727196 718082 709650 702018 695156 688245 680598 672380 663688 653712
61875F53712j2003j3423j3489j2976j2742j2557j1867j0680r132p031m525k451
$$ 653712 641709 628286 614797 601821 589079 576522 564655 553975 544843 537812 533287 530836
61863E30836j331o54K53J222J776K178L266N386P993J0259J1823J2994J4354J6139
$$ 530836 529505 528851 529104 530326 532102 534280 537546 542932 550925 561184 573007 586001 600355 616494
61849F16494J8073J9985K2219K5039K7886K9840L0623L0592K9953K8586K6545
$$ 616494 634567 654552 676771 701810 729696 759536 790159 820751 850704 879290 905835
61838I05835K3864K0053J4619Q142K014k982p082j0506j2910j4008j3957j2881
$$ 905835 929699 949752 964371 972513 974527 971545 964463 953957 941047 927039 913082 900201
61826I00201j0706p643m192n12L529P623J1034J3463J5122J5864J5026J2250P838
$$ 900201 889495 881852 877660 877148 880677 888300 899334 912797 927919 943783 958809 971059 978897
61813I78897K147m445j0954j6123j9602k2075k4016k5122k5133k4350k3080k1447
$$ 978897 981044 976599 965645 949522 929920 907845 883829 858707 833574 809224 786144 764697
61801G64697j9898j9033j8688j8069j6976j5994j5269j4175j2490j0870r759q799
$$ 764697 744799 725766 707078 689009 672033 656039 640770 626595 614105 603235 593476 584677
61789E84677p738o883o266n377m240l634l738l589k544j256n51l52l99r43j948
$$ 584677 576939 570056 563790 558413 554173 550539 546801 543212 540668 539412 538861 538509 538110 537167 535219
61774E35219k580k394k111k320k383j588m67J24M73J344K493L049K961K939L308
$$ 535219 532639 530245 528134 525814 523431 521843 521376 521500 521973 523317 525810 528859 531820 534759 538067
61759E38067L898M731N836O709O917O952P579Q533Q761P773N982L892J740k82
$$ 538067 541965 546696 552532 559241 566158 573110 580689 589222 597983 605756 611738 615630 617370 617088
61745F17088k219m505p224r452j0178r669r075q813q248o989n658n042n095n075
$$ 617088 614869 610364 603140 593688 583510 573841 564766 555953 547705 540716 535058 530016 524921 519846
61731E19846m383l085j785r79n19J52J134J871J956J719J718K064K509K858K936
$$ 519846 515463 512378 510593 509614 509095 509247 510381 512252 514208 515927 517645 519709 522218 525076 528012
61716E28012K638K273K388K938L192K778K220K005J779R82k49j418k361l133l700
$$ 528012 530650 532923 535311 538249 541441 544219 546439 548444 550223 551205 550956 549538 547177 544044 540344
61701E40344m185m906n696n869n273m658m504m302l717l482m190n023m779l656
$$ 540344 536159 531253 525557 519688 514415 509757 505253 500951 497234 493752 489562 484539 479760 476104
61687D76104k933l224m075m840n082m437l064j957j901k399k460k045j838k016
$$ 476104 473171 469947 465872 461032 455950 451513 448449 446492 444591 442192 439732 437687 435849 433833
61673D33833k244k537k995l021j959l60M99L28l6n2O0K94J019J992K285J634R31
$$ 433833 431589 429052 426057 423036 421077 420717 421216 421544 421508 421456 421516 421810 422829 424821 427106 428740 429671
61656D29671J007J678K339K811L185L410L344K924K159J243O35N97Q00Q45R02
$$ 429671 430678 432356 434695 437506 440691 444101 447445 450369 452528 453771 454406 455003 455803 456648 457550
61641D57550J306J801J964K058K591L249L223K472J673R98O3q97r99k11L08j62
$$ 457550 458856 460657 462621 464679 467270 470519 473742 476214 477887 478885 478948 478051 477052 476841 477149 476987
61625D76987r91j472j973l060m267m719m449m206m239m082l438k541j669q57j66
$$ 476987 475996 474524 472551 469491 465224 460505 456056 451850 447611 443529 440091 437550 435881 435024 434858
61610D34858J24j96j044k115l115l929m698n591o453o784o258n188m289l952l931
$$ 434858 434982 434786 433742 431627 428512 424583 419885 414294 407841 401057 394799 389611 385322 381370 377439
61595C77439l717l214k786k763k992l053k775k334j988j913k168k518k447j749
$$ 377439 373722 370508 367722 364959 361967 358914 356139 353805 351817 349904 347736 345218 342771 341022
61581C41022r87q46j160j274j189j545k268k299j144K46P75O57Q08J363J673J343
$$ 341022 340035 339189 338029 336755 335566 334021 331753 329454 328310 328556 329331 329988 330796 332159 333832 335175
61565C35175N47l89j032q20L01J562K242K507K788K861K342J646J490J719J540
$$ 335175 335722 335333 334301 333481 333782 335344 337586 340093 342881 345742 348084 349730 351220 352939 354479
61550C54479Q36K98K93M21K70q5m34o24l95L82J261J567J264J031J400K208K854
$$ 354479 355315 355613 355906 356327 356597 356512 356078 355454 355059 355441 356702 358269 359533 360564 361964 364172 367026
61533C67026K837K213J685J955K725K829J777M76j02k40p16j376j540j386j727
$$ 367026 369863 372076 373761 375716 378441 381270 383047 383523 383421 383181 382465 381089 379549 378163 376436
61518C76436k640l291l162k519j708q15n1L15L68L57K51O7K76J060J589J009k14
$$ 376436 373796 370505 367343 364824 363116 362301 362250 362565 362933 363290 363541 363608 363884 364944 366533 367542 367328
61501C67328q66p01m35l37l9L93M23K21O19J706K588K801K827K970K761J937R83
$$ 367328 366462 365761 365326 364989 364950 365343 365766 365987 366606 368312 370900 373701 376528 379498 382259 384196 385179
61484C85179K66m33j124j211l83Q46J940K947L887M305L961L357L030K835K365
$$ 385179 385445 385012 383888 382677 382294 383140 385080 388027 391914 396219 400180 403537 406567 409402 411767
61469D11767J613Q41J46m66q49q75n59j8M86N14j47j135j905k283k273j703p05
$$ 411767 413380 414221 414367 413901 413052 412177 411618 411600 412086 412600 412453 411318 409413 407130 404857 403154 402449
61452D02449j35n96j370j259k92M22M03K10J82Rk42Q1J055J865K018J968K119
$$ 402449 402314 401718 400348 399089 398797 399219 399622 399832 400014 400023 399781 399862 400917 402782 404800 406768 408887
61435D08887K195K055K199K866L454L323K582J651P04r9m52l71k16n2M19J141
$$ 408887 411082 413137 415336 418202 421656 424979 427561 429212 429916 429817 429365 428994 428778 428726 429145 430286
61419D30286J643J912K402L023L007K155J233P31K00p43j624j982k127k359k239
$$ 430286 431929 433841 436243 439266 442273 444428 445661 446392 446592 445849 444225 442243 440116 437757 435518
61404D35518j409n27n60j484k342k349j503m48n3p49j891k160r49R26K114J993
$$ 435518 434109 433582 433022 431538 429196 426847 425344 424896 424843 424094 422203 420043 419094 420020 422134 424127
61388D24127R72m7l36R6N74O32O71J237J973K030J388Q57R39J493K408L532M148
$$ 424127 425099 425052 424716 424812 425386 426018 426689 427926 429899 431929 433317 434174 435113 436606 439014 442546 446694
61371D46694L695K983L340M584N177M561L777L529L256K634K382K786L020K771
$$ 446694 450389 453372 456712 461296 466473 471034 474811 478340 481596 484230 486612 489398 492418 495189
61357D95189K988L982M327L044J578K019M301O695Q311R521J0338R975Q090N343
$$ 495189 498177 502159 506486 509530 511108 513127 517428 524123 532434 541955 552293 562268 570358 575701
61343E75701K687P35k66n28n62n58k88J55K24j15j73J27j97j583k875k938k441
$$ 575701 578388 579123 578857 578329 577767 577209 576921 577076 577300 577185 577012 577139 576942 575359 572484 569546 567105
61326E67105k856m288n574n916n429m433l251k388j968j398k90Q18J435K133L579
$$ 567105 564249 559961 554387 548471 543042 538609 535358 532970 531002 529604 529314 530132 531567 533700 537279
61311E37279N248O255O891Q101R867J1392J2592J4112J5941J7148J7048J5642
$$ 537279 542527 548782 555673 563774 573641 585033 597625 611737 627678 644826 661874 677516
61299F77516J2982R148M870J255j239k910m000m564m954n639o473o923o908o808
$$ 677516 690498 699646 704516 705771 704532 701622 697622 693058 688104 682465 675992 669069 662161 655353
61285F55353o796o777o801o869o599n712m637l907l261k129p24K82R41J927L323
$$ 655353 648557 641780 634979 628110 621511 615799 611162 607255 603994 601865 601141 601423 602364 604291 607614
61270F07614M396M692M511M229L828L293K874K798L156M073N651P693R747J1303
$$ 607614 612010 616702 621213 625442 629270 632563 635437 638235 641391 645464 651115 658808 668555 679858
61256F79858J1797J0831Q697O276M040J754n17j877j802j232j498k625l600l884
$$ 679858 691655 702486 711183 717459 721499 723253 722736 720859 719057 717825 716327 713702 710102 706218
61242G06218l770l516l078k606k411k500k778l449m596n633n847n207m093k635
$$ 706218 702448 698932 695854 693248 690837 688337 685559 682110 677514 671881 666034 660827 656734 654099
61228F54099j004K19O77Q98J481K156K410K486K795K930K393J903K708M786O859
$$ 654099 653095 653314 653991 654889 656370 658526 660936 663422 666217 669147 671540 673443 676151 680937 687796
61213F87796Q075Q566Q484P570N873L903K010K93r72j563j737j621n57J938M940
$$ 687796 695871 704437 712921 720491 726364 730267 732277 732570 731598 730035 728298 726677 726120 728058 732998
61198G32998O975Q005R378J1931J5228J8648K1890K4215K4447K2222J8453J4275
$$ 732998 739973 747978 757356 769287 784515 803163 825053 849268 873715 895937 914390 928665
61186I28665J0204O471L421J277Q6j80P8j36j464l320m701n673p050q856j0227
$$ 928665 938869 945340 948761 950038 950124 949944 950022 949886 948422 945102 940401 934728 927678 918822 908595
61171I08595j0818j1157j1533j1580j1221j0969j1106j1357j1596j2077j2807
$$ 908595 897777 886620 875087 863507 852286 841317 830211 818854 807258 795181 782374
61160G82374j3372j3549j3415j2901j1875j0651r653q674p148m950k323P26M081
$$ 782374 769002 755453 742038 729137 717262 706611 696958 688284 681136 676186 673863 674589 678670
61147F78670O946Q433Q389O842L321k079p528j0881j1975j2202j2169j1405r993
$$ 678670 685616 694049 702438 709280 712601 710522 702994 692113 680138 667936 655767 644362 634369
61134F34369q713p428n180k104M16J765K754L902M785N433O760Q990J1108J2487
$$ 634369 625656 618228 613048 610944 611360 613125 615879 619781 624566 629999 636759 645749 656857 669344
61120F69344J3722J5273J6745J8000J9599K1507K2807K3296K3962K5292K6485
$$ 669344 683066 698339 715084 733084 752683 774190 796997 820293 844255 869547 896032
61109H96032K6983K7322K7673K7151K5457K3800K3113K2549K0781J7584J3282
$$ 896032 923015 950337 978010 1005161 1030618 1054418 1077531 1100080 1120861 1138445 1151727
61098A151727P836J597m151q500j1826j4631j6606j7653j8628j9972k0865k0778
$$ 1151727 1159563 1161160 1157009 1148509 1136683 1122052 1105446 1087793 1069165 1049193 1028328 1007550
61086A007550k0648k1333k2050k1597k0097j8326j6347j4080j2229j1231j0175
$$ 1007550 986902 965569 943519 921922 901825 883499 867152 853072 840843 829612 819437
61075H19437q109n619l827k672j491m23J98J014K775M907O368P295Q413R509R942
$$ 819437 811328 805709 801882 799210 797719 797296 797494 798508 801283 806190 812558 819853 828266 837775 847717
61060H47717J0170J1189J2902J4389J5436J6500J7580J8448J9579K1501K3642
$$ 847717 857887 869076 881978 896367 911803 928303 945883 964331 983910 1005411 1029053
61049A029053K5085K6053K7360K8942L0298L1800L4069L6440L7716L8129L8943
$$ 1029053 1054138 1080191 1107551 1136493 1166791 1198591 1232660 1269100 1306816 1344945 1383888
61038A383888M0267M0874M0261L9386L9226L9771M0489M0805M0215L8848L7632
$$ 1383888 1424155 1465029 1505290 1544676 1583902 1623673 1664162 1704967 1745182 1784030 1821662
61027A821662L7046L6398L5330L5058L6648L9079M0608M1094M1095L9877L6841
$$ 1821662 1858708 1895106 1930436 1965494 2002142 2041221 2081829 2122923 2164018 2203895 2240736
61016B240736L4055L4602L8861M5113N3196O4337P7558Q9830J00211J10704J22954
$$ 2240736 2274791 2309393 2348254 2393367 2446563 2510900 2588458 2678288 2778499 2889203 3012157
61005C012157J37878J58812J90471K33660K85573L46513M21151N11914O18699
$$ 3012157 3150035 3308847 3499318 3732978 4018551 4365064 4786215 5298129 5916828
60996E916828P49188R21967J154532J457157J842023K310427K790249L086638
$$ 5916828 6666016 7587983 8742515 10199672 12041695 14352122 17142371 20229009
60988B0229009K954419K287646J255359K22401m87743p59006o45949k47717L19910
$$ 20229009 23183428 25471074 26726433 26948834 26461091 25702085 25056136 24808419 25128329
60979B5128329Q52017J056152P17685j16452j144245k014253k531876k699039
$$ 25128329 25980346 27036498 27754183 27637731 26493486 24479233 21947357 19248318
60971A9248318k616691k387628k088396j776036j487256j235241j019536q38578
$$ 19248318 16631627 14243999 12155603 10379567 8892311 7657070 6637534 5798956
60963E798956o90571n69626m68811l85444l19468k68781k29717j99988j77818
$$ 5798956 5108385 4538759 4069948 3684504 3365036 3096255 2866538 2666550 2488732
60954B488732j59850j43126j27790j15060j03843r2104q0270p0193o1680n3119
$$ 2488732 2328882 2185756 2057966 1942906 1839063 1746959 1666689 1596496 1534816 1481697
60944A481697m5129m0503m0267m2327m4308m5574m6048m5223m3105m0559l8079
$$ 1481697 1436568 1396065 1355798 1313471 1269163 1223589 1177541 1132318 1089213 1048654 1010575
60933A010575l5440l2778l0691k9038k6985k4447k2206k0422j8472j6380j4892
$$ 1010575 975135 942357 911666 882628 855643 831196 808990 788568 770096 753716 738824
60922G38824j3854j2120r583p688p311p537p323o901o695o168m826l297k312j566
$$ 738824 724970 712850 703267 695579 688268 680731 673408 666507 659812 653644 648818 645521 643209 641643
60908F41643n50L27N59O58J318K131K128J212O2r03j570j666j189r95j967l794
$$ 641643 641093 641420 641979 642637 643955 646086 648214 649426 649488 648585 647015 645349 644160 643165 641198 637404
60892F37404n346o035o192o373o907p826q656q630p642o546n981n532m697l993
$$ 637404 632058 626023 619831 613458 606551 598725 590069 581439 573797 567251 561270 555738 551041 547048
60878E47048m173n000n784o579p695q494p974o422n193m830m529l602k413j539
$$ 547048 542875 537875 532091 525512 517817 509323 501349 494927 489734 484904 480375 476773 474360 472821
60864D72821r51l74K36R04J708K475K906L191M012N744P975R699R814P859M793
$$ 472821 471870 471496 471732 472636 474344 476819 479725 482916 486928 492672 500647 510346 520160 528019 532812
60849E32812K569K244K875L067L046M032N886O876N928L730J269j431m501p191
$$ 532812 535381 537625 540500 543567 546613 550645 556531 563407 569335 573065 574334 572903 568402 561211
60835E61211q580q744q550q573q671q375p388n983m946m800n120n035m394l766
$$ 561211 552631 543887 535337 526764 518093 509718 502330 496347 491401 486601 481481 476446 472052 468286
60821D68286l429l074k566k205k066j910j871k496l809n087n842o250o366n736
$$ 468286 464857 461783 459217 457012 454946 453036 451165 448669 444860 439773 433931 427681 421315 415579
60807D15579m295k934k571l098l701l809l374k674k176k224k570k531j799p22
$$ 415579 411284 408350 405779 402681 398980 395171 391797 389123 386947 384723 382153 379622 377823 377101
60793C77101K36Q39Q22O6q34q85O6J034J234J042J268J980K572K587K054J348
$$ 377101 377337 378176 378998 379064 378230 377345 377411 378445 379679 380721 381989 383969 386541 389128 391182 392530
60777C92530R82J221J678J657J048M89N04R75J555K045K218J798R50K84J70M47
$$ 392530 393512 394733 396411 398068 399116 399605 400109 401084 402639 404684 406902 408700 409650 409934 410104 410551
60761D10551Q70J329J518J026j1q48r52m46L17J020J232P28N2J3M73M18n51j570
$$ 410551 411421 412750 414268 415294 415283 414435 413483 413037 413354 414374 415606 416334 416386 416399 416872 417290 416739 415169
60743D15169j658q07L10R76M85j550m474o745p341o576n373m271l360k602j884
$$ 415169 413511 412704 413014 413990 414475 412925 408451 401706 394365 387789 382416 378145 374785 372183 370299
60728C70299j242j013j326j591j201n46l63l67K37J101J049J09l50J69O35N23
$$ 370299 369057 368044 366718 365127 363926 363380 363017 362650 362887 363988 365037 365146 364796 364965 365600 366123
60712C66123P75J872K658K183J274J037J104P33M75J199K380K846K588K404K364
$$ 366123 366898 368770 371428 373611 374885 375922 377026 377759 378234 379433 381813 384659 387247 389651 392015
60697C92015J939J220P69O18M61M80R57J493J591J473J409Q56o27k142k409j537
$$ 392015 393954 395174 395943 396561 397022 397502 398459 399952 401543 403016 404425 405281 404654 402512 400103 398566
60681C98566p29n68o85p69p81m22M84J315J341R47J099J909K676L124L471L462
$$ 398566 397837 397269 396584 395815 395034 394612 395096 396411 397752 398699 399798 401707 404383 407507 410978 414440
60665D14440K437M35j662l099l762l819l577l394l178k362j009k62p80j448q54
$$ 414440 416877 417312 415650 412551 408789 404970 401393 397999 394821 392459 391450 391188 390408 388960 388106
60650C88106N63J227R00R17J984L262L823L728L313K473J124m11j795k853l355
$$ 388106 388669 389896 390796 391713 393697 396959 400782 404510 407823 410296 411420 411009 409214 406361 403006
60635D03006l257l115l502m083l996l134k204j577r17j8Q38J406J693J596J049
$$ 403006 399749 396634 393132 389049 385053 381919 379715 378138 377221 377203 378041 379447 381140 382736 383785
60620C83785M85M80Q92J002M58m42j309j897j945j405o89j12N74J563K351K396
$$ 383785 384270 384750 385642 386644 387102 386660 385351 383454 381509 380104 379415 379303 379877 381440 383791 386187
60604C86187J977J580R70j69j227j409j070j101j304p40M42R81M26j59K58J495
$$ 386187 388164 389744 390714 390545 389318 387909 386839 385738 384434 383694 384136 385117 385543 385384 385642 387137
60588C87137K800L723M074L803L235K791K414J841J279J086R91M97j63l64j55
$$ 387137 389937 393660 397734 401537 404772 407563 409977 411818 413097 414183 415174 415671 415508 415144 414989
60573D14989k0J59Q16J677K197K801M355O500P929Q384Q988J0406J2050J3320
$$ 414989 414969 415128 415944 417621 419818 422619 426974 433474 441403 449787 458775 469181 481231 494551
60559D94551J4211J4351J2958J0278P689N729L267n25m556p098p829p634p068
$$ 494551 508762 523113 536071 546349 554038 559767 563034 562509 557953 550855 543026 535392 528324
60546E28324n953m102j748N32K019K349K076K230L170M415N706P418R766J2426
$$ 528324 522371 518269 516521 517053 519072 521421 523497 525727 528897 533312 539018 546436 556202 568628
60532E68628J5198J8311K1618K4266K5522K5305K3573J9968J4474P902J289m684
$$ 568628 583826 602137 623755 648021 673543 698848 722421 742389 756863 764765 766054 761370
60520G61370r547j2873j4669j5368j5238j4287j2788j1268r853q290o684n508
$$ 761370 751823 738950 724281 708913 693675 679388 666600 655332 645479 637189 630505 624997
60508F24997m725l733k367j198n23J79J466L242N176P306R863J2921J6466K0430
$$ 624997 620272 616539 614172 612974 612451 612630 614096 617338 622514 629820 639683 652604 669070 689500
60494F89500K4630K9030L3833L8959M3650M7205M9666N1082N0655M7670M2999
$$ 689500 714130 743160 776993 815952 859602 906807 956473 1007555 1058210 1105880 1148879
60483A148879L8353L4147K9288K2984J5530P204k291j2936k3997l4732m4567n2473
$$ 1148879 1187232 1221379 1250667 1273651 1289181 1296385 1294094 1281158 1257161 1222429 1177862 1125389
60471A125389n7297n8928n8232n5839n1954m7222m2490l7790l2752k7963k4418
$$ 1125389 1068092 1009164 950932 895093 843139 795917 753427 715637 682885 654922 630504
60460F30504k1762j8722j5418j3378j2935j2475j0811q589o731n265m413m927
$$ 630504 608742 590020 574602 561224 548289 535814 525003 516414 509683 504418 500005 495078
60448D95078o325o670n219l700l634m091l565k540k366k829k709k004j736k071
$$ 495078 488753 482083 476864 473164 469530 465439 461874 459334 456968 454139 451430 449426 447690 445619
60434D45619k199j838j414r72j43R00J457J221M62m76j219j294o69j4J03j60m78
$$ 445619 443420 441582 440168 439196 439053 439953 441410 442631 443093 442617 441398 440104 439435 439421 439524 439364 438886
60417D38886q33j006m12R24K032K242J985J824J628J375J647K472K739J797O72
$$ 438886 438053 437047 436635 437559 439591 441833 443818 445642 447270 448645 450292 452764 455503 457300 457972
60402D57972O39J496K311K906L459L507K711J859J806K128K051J988K712L681
$$ 457972 458611 460107 462418 465324 468783 472290 475001 476860 478666 480794 482845 484833 487545 491226
60388D91226L788L316L472M284M590M091L810M218M411L627K466J974K310K823
$$ 491226 495014 498330 501802 506086 510676 514767 518577 522795 527206 530833 533299 535273 537583 540406
60374E40406K977K838K878L438M193M371L751L088L106L460L266K315J185L60
$$ 540406 543383 546221 549099 552537 556730 561101 564852 567940 571046 574506 577772 580087 581272 581632
60360E81632j50m80o06l11P22K413L897M347M267N079P111R120J0316J1553J3573
$$ 581632 581482 581002 580396 580085 580807 583220 587117 591464 595731 600810 607921 617041 627357 638910 652483
60345F52483J5295J5142J3270J1042Q962O378K927j084n388r649j2837j3909j3167
$$ 652483 667778 682920 696190 707232 716194 722572 725499 724415 719027 709378 696541 682632 669465
60332F69465j2033j1446j1179j0571r229p207n140l905l683l771l782m283n567
$$ 669465 657432 645986 634807 624236 615007 607800 602660 598755 595072 591301 587519 583236 577669
60319E77669o630o420n367m525l844k554p26Q79K262M104O371Q295R712J1351
$$ 577669 571039 564619 559252 554727 550883 548329 547603 548482 550744 554848 561219 569514 579226 590577
60305E90577J3676J6292J8482J9587J9094J7226J5193J3921J2773J0415O724K796
$$ 590577 604253 620545 639027 658614 677708 694934 710127 724048 736821 747236 753960 756756
60293G56756o44l823p044j0353j3837j7263j9477j9324j7180j4553j2257j0019
$$ 756756 756112 752289 745245 734892 721055 703792 684315 664991 647811 633258 621001 610982
60281F10982p797o191n345m588l614l038l338m048m492m738n289o221p060p283
$$ 610982 603185 596994 591649 587061 583447 580409 577071 573023 568531 563793 558504 552283 545223 537940
60267E37940o759n735m521l224j953j185j416k327k965k941k734k495j590P3J277
$$ 537940 531181 525446 520925 517701 515748 514563 513147 510820 507855 504914 502180 499685 498095 498168 499445
60252D99445J013l6n07j60L20O78J106J435J409J369J647J761J208M47R2k16r49
$$ 499445 500458 500422 499915 499755 500075 500753 501859 503294 504703 506072 507719 509480 510688 511135 511227 511011 510062
60235E10062j439q70O1J3r01j381j038n64r0J034K711M011M706N465O301O330
$$ 510062 508623 507753 507814 507827 506926 505545 504507 503943 503853 504887 507598 511609 516315 521780 528081 534411
60219E34411N378M513M578N334O356P556Q614Q988Q864R062R720J0172J0275J0702
$$ 534411 539789 544302 548880 554214 560570 568126 576740 585728 594592 603654 613374 623546 633821 644523
60205F44523J1562J1906J1096R697Q588Q010P870Q084Q251P708O386M945L863
$$ 644523 656085 667991 679087 688784 697372 705382 713252 721336 729587 737295 743681 748626 752489
60192G52489K979K038J018j45j471k575l135l635m794o375p397p537p350p187
$$ 752489 755468 757506 758524 758379 756908 754333 751198 747563 742769 736394 728997 721460 714110 706923
60178G06923o886o501o347o214n601m745m439m732m795m137l050j864p71l41j063
$$ 706923 700037 693536 687189 680975 675374 670629 666190 661458 656663 652526 649476 647612 646841 646500 645437
60163F45437k267k674k077j428j255j229j315j902k582k239q37K72L16J71P36
$$ 645437 643170 640496 638419 636991 635736 634507 633192 631290 628708 626469 625632 625904 626220 626391 627127
60148F27127J500J494Q04K79L68R52J710K217K185J935K167L072M244N512P060
$$ 627127 628627 630121 630925 631204 631572 632524 634234 636451 638636 640571 642738 645810 650054 655566 662626
60133F62626Q659R653R881R800R584Q993Q187P695P407O547M866K978J386J20
$$ 662626 671285 680938 690819 700619 710203 719196 727383 735078 742485 749032 753898 756876 758262 758382
60119G58382n71k48P84J644K157K933L977M397L861L215L236L651L831L472K345
$$ 758382 757811 757563 758347 759991 762148 765081 769058 773455 777316 780531 783767 787418 791249 794721 797066
60104G97066L02k125m005n099n883o521o786o935p388p607o664m993m032l937
$$ 797066 797368 795243 791238 786139 780256 773735 766949 760014 752626 745019 738355 733362 729330 725393
60090G25393l369j855n67k21N0Q15J115J70j149j716j657j434p20N54J271N84
$$ 725393 722024 720169 719602 719381 719431 720246 721361 721531 720382 718666 717009 715575 714855 715409 716680 717264
60074G17264p13j561k395m175o452p948q527r186j0275j0966j0445q791o746n201
$$ 717264 716551 714990 712595 708420 701968 694020 685493 676307 666032 655066 644621 635830 629084 623883
60060F23883m689m886m903m378l775l359k702j708j189j692k499k572j825p73
$$ 623883 619194 614308 609405 605027 601252 597893 595191 593483 592294 590602 588103 585531 583706 582933
60046E82933M13J781L060M060N073O326P502Q329Q970R317Q715P047N391M750
$$ 582933 583346 585127 588187 592247 597320 603646 611148 619477 628447 637764 646479 653526 658917 663667
60032F63667M674L886J847q74l292m577m540m050m397n734o857o931o627o993
$$ 663667 668341 672227 674074 673200 669908 665331 660791 656741 652344 646610 639753 632822 626195 619202
60018F19202q060r277j0429j1337j1388j0308q835p798p081o201n313m781m294
$$ 619202 611142 601865 591436 580099 568711 558403 549568 541770 534689 528488 523175 518394 514100
60005E14100l282j883q15m96q45j487j736r37O15J671J522R38R82J540J784J607
$$ 514100 510818 508935 508120 507624 506779 505292 503556 502619 503234 504905 506427 507365 508347 509887 511671 513278
59989E13278J732K585L751M520M594M347M537N428O256O037M853L615K650J402
$$ 513278 515010 517595 521346 525866 530460 534807 539344 544772 551028 557065 561918 565533 568183 569585
59975E69585l21j902k975l889m727m902m229l438l119l067l000k949k567j230
$$ 569585 569264 567362 564387 560498 555771 550869 546640 543202 540083 537016 534016 531067 528500 527270
59961E27270P48K170K720L426M833O026O185N732N125L897J857j4r58j521k228
$$ 527270 528018 530188 532908 536334 541167 547193 553378 559110 564235 568132 569989 569975 569017 567496 565268
59946E65268k456j713q01m36LJ063J728R10o70j698k399l671m960m861l396j920
$$ 565268 562812 561099 560298 559862 559865 560928 562656 563566 562896 561198 558799 555128 550168 545307 541911 539991
59930E39991j034k12P08J267J620K646M621O841Q548R380R070P705O057M758L462
$$ 539991 538957 538745 539453 540720 542340 544986 549607 556448 564996 574376 583446 591151 597208 601966 605428
59915F05428J666m4o12m7P63J437K220K961L170L009L209L941M581M514L544J752
$$ 605428 607094 607050 606438 606391 607154 608591 610811 613772 616942 619951 623160 627101 631682 636196 639740 641492
59899F41492l51j789k010j599j434j545j426j019n83N0J240K877M566O112P239
$$ 641492 641141 639352 637342 635743 634309 632764 631338 630319 629736 629786 631026 633903 638469 644581 651820
59884F51820P424O742O271O794P685P922P600P511P764P865P775P910Q259Q272
$$ 651820 659244 665986 672257 679051 686736 694658 702258 709769 717533 725398 733173 741083 749342 757614
59870G57614P455N618K951K72j477k397l536n198o397o581o591p061p295o805
$$ 757614 765069 770687 773638 773910 772433 770036 766500 761302 754905 748324 741733 734672 727377 720572
59856G20572o590p367p888o772m920m139m174l261j123O82J361J814K904M511
$$ 720572 713982 706615 698727 691955 687035 682896 678722 675461 674338 675020 676381 678195 681099 685610
59842F85610O524R191J2000J3499J2670R721N519J146k040l000j855M95L382O241
$$ 685610 692134 701325 713325 726824 739494 749215 754734 755880 753840 750840 748985 749480 752862 759103
59828G59103P973P530N044J581j948m934o764p400p711q329q738q513q506r472
$$ 759103 767076 774606 779650 781231 779283 774349 767585 760185 752474 744145 735407 726894 718388 708916
59814G08916j0279r272o924n374n474n984n735n012m565m558m802n003m637l477
$$ 708916 698637 689365 682441 677067 671593 665609 659874 654862 650297 645739 640937 635934 631297 627820
59800F27820k227j781k047k305k449k812l190l074k589k189j787j177q61j319
$$ 627820 625593 623812 621765 619460 617011 614199 611009 607935 605346 603157 601370 600193 599332 598013
59786E98013j938j784j031m73j87J35J69m07q47k93O85R75P08P73J129J246J581
$$ 598013 596075 594291 593260 592787 592600 592735 592904 592497 591650 591357 592042 593017 593725 594498 595627 596873 598454
59769E98454K843M287M567L916L630L793L465K811L050M311N471O079O595O803
$$ 598454 601297 605584 610151 614067 617697 621490 624955 627766 630816 635127 640598 646677 653272 660075
59755F60075O060N113N577P384Q740Q893Q982R778J0553J0692J0612J0505R822
$$ 660075 666135 671248 676825 684209 692949 701842 710824 720602 731155 741847 752459 762964 772786
59742G72786Q558P528O928O034M672L426K244M32j729l087l540m064m587l872
$$ 772786 781344 788872 795800 801834 806506 809932 812176 812608 810879 807792 804252 800188 795601 791729
59728G91729j956o58q83j364r27k48k89o82p41p34j122j706k314l265m413m878
$$ 791729 789773 789115 788232 786868 785941 785693 785404 784722 783981 783247 782125 780419 778105 774840 770427 765549
59712G65549m303l309k305j108k3J24n35q71n42l06j50R72L000M281M133M024
$$ 765549 761246 757937 755632 754524 754501 754625 754090 753219 752677 752371 752221 753193 756193 760474 764607 768631
59696G68631N101O301O208N289M802M773M507M058L778L210J757o8j212j445j372
$$ 768631 773732 780033 786241 791530 796332 801105 805612 809670 813448 816658 818415 818347 817135 815690 814318
59681H14318j497j935k615l300l868m693o088p379p567o953o920p894q790q765
$$ 814318 812821 810886 808271 804971 801103 796410 790322 782943 775376 768423 761503 753609 744819 736054
59667G36054q131p230n852m250l284k950k155n61P55J149J452K447L667M580N618
$$ 736054 727923 720693 714841 710591 707307 704357 702202 701641 702396 703545 704997 707444 711111 715691 721309
59652G21309P151Q526R065Q993Q680P971O826N592M077J546j891n049p306r185
$$ 721309 728460 736986 746051 755044 763724 771695 778521 784113 788190 789736 787845 782796 775490 766305
59638G66305j0947j2075j2612j3379j4170j3436j0639p377n303m411m166m619
$$ 766305 755358 743283 730671 717292 703122 689686 679047 671670 666367 661956 657790 653171
59626F53171n413n403m490m299n736p377p578o784o330o252n828n200m903m690
$$ 653171 647758 642355 637865 633566 627830 620453 612875 606091 599761 593509 587681 582481 577578 572888
59612E72888m149l704l792l837l100j766k64J517L361M217L623K658K349K191
$$ 572888 568739 565035 561243 557406 554306 552540 552276 553793 557154 561371 564994 567652 570001 572192
59598E72192J345K61j47j5j4r5J09M03N49R10J583J763R60l7l25k19m81j051j466
$$ 572192 573537 573798 573651 573636 573622 573527 573636 574039 574588 575498 577081 578844 579804 579767 579442 579223 578742 577691 576225
59579E76225j707j866j783j666k154l091l399k743k100k035j870j301j214j900
$$ 576225 574518 572652 570869 569203 567049 563958 560559 557816 555716 553681 551811 550510 549296 547396
59565E47396k096j033Q6n8r87j619j936k127j567j75O70N1q88q26l29m07m44N47
$$ 547396 545300 544267 544353 544295 543308 541689 539753 537626 536059 535884 536554 536605 535717 534891 534562 534155 533711 534258
59547E34258J855K206J986K392L261L623L613M080M957N728O730Q511J0908J4277
$$ 534258 536113 538319 540305 542697 545958 549581 553194 557274 562231 567959 574689 583200 594108 608385
59533F08385K0106K7996L3238L0365J9283N678m620r844j1202j0251q098n568
$$ 608385 628491 656487 689725 720090 739373 745051 740431 730587 719385 709134 701036 695468
59521F95468l059p57R24J753K129K345J855K04j926l599n000o845q981j0640j1503
$$ 695468 692409 691652 692576 694329 696458 698803 700658 700862 698936 695337 690337 683492 674511 663871 652368
59506F52368j1592j0790r434q548q482q229p098n945n630n482m643l636l107k339
$$ 652368 640776 629986 620552 612004 603522 595293 588195 582250 576620 571138 566495 562859 559752 557413
59492E57413p29N36K76m00K63J726K127J391J103J805K681L471M525N270M812
$$ 557413 556684 557220 557496 557096 557359 559085 561212 562603 563706 565511 568192 571663 576188 581458 586270
59477E86270L831L791M451M283L176K653L312M085M149L721K884J428Rk34N52
$$ 586270 590101 593892 598343 602626 605802 608455 611767 615852 620001 623722 626606 628034 628043 627809 628361
59462F28361J079Q41M65K41n8qJ115K841M000M627N758P403Q441Q561Q578Q730
$$ 628361 629440 630281 630746 630987 630929 630921 632036 634877 638877 643504 649262 656665 665106 673667 682245 690975
59446F90975Q324P193N934M586K614K25j835l741o270q946j0284r955r114q403
$$ 690975 699299 706492 712426 717012 719626 719851 718016 714275 708005 699059 688775 678820 669706 661303
59432F61303p268n524m002l257k942k665k266j305M46K176L072L883N872Q609
$$ 661303 654035 648511 644509 641252 638310 635645 633379 632074 632520 634696 637768 641651 647523 656132
59418F56132J0647J2078J4232J6968J8651J9012J9670K1390K3326K5569K9590
$$ 656132 666779 678857 693089 710057 728708 747720 767390 788780 812106 837675 867265
59407H67265L4539L5507K7899J2614m579j7947k4862k5443k1371j4953p724M43
$$ 867265 901804 937311 965210 977824 973245 955298 930436 904993 883622 868669 860945 861388
59395H61388R994J9244K3975K0278Q250p251j9893k6281k7184k4978k1084j6247
$$ 861388 871382 890626 914601 934879 943129 935878 915985 889704 862520 837542 816458 800211
59383H00211j1673q413o253m443k939j970j049K67J363J589J572K079K363J285
$$ 800211 788538 780125 773872 769429 766490 764520 763471 763738 765101 766690 768262 770341 772704 773989
59369G73989n42j508j418j355j542j247n81m05n76q5J044J775J961K543L819N194
$$ 773989 773447 771939 770521 769166 767624 766377 765796 765391 764815 764730 765774 767549 769510 772053 775872 781066
59353G81066O598Q434J0235J1097J1439J2546J4411J5836J6663J7867J9411K0070
$$ 781066 787664 796098 806333 817430 828869 841415 855826 871662 888325 906192 925603 945673
59341I45673J9618J9210J9204J8468J6306J3341J0158O768L587J222r18m002p638
$$ 945673 965291 984501 1003705 1022173 1038479 1051820 1061978 1068746 1072333 1073555 1072637 1068635 1060997
59328A060997j0257j1796j3765j6427j8115j8007j7372j7314j7261j6556j5631
$$ 1060997 1050740 1038944 1025179 1008752 990637 972630 955258 937944 920683 904127 888496
59317H88496j4856j3860j2748j2310j2411j2010j1207j1276j2096j1769r766q164
$$ 888496 873640 859780 847032 834722 822311 810301 799094 787818 775722 763953 754187 746023
59305G46023q516r508r101p266n149l173j361j60N18J840M436P386R979J3149
$$ 746023 737507 727999 718898 711632 706483 703310 701949 701789 702307 704147 708583 715969 725948 739097
59291G39097J7713K2119K3261J9133J0112j369j1773j8207k0294j9805j8218j5631
$$ 739097 756810 778929 802190 821323 831435 830066 818293 800086 779792 759987 741769 726138
59279G26138j2129q594n546k613K83K588M454O891R974J2465J3882J5258J7058
$$ 726138 714009 705415 699869 697256 697539 700127 704581 711472 721446 733911 747793 763051 780109
59266G80109J8138J7719J6731J6006J4742J2068Q752N980L610R36j894m333o422
$$ 780109 798247 815966 832697 848703 863445 875513 884265 890245 893855 894791 892897 888564 882142
59253H82142q228r298r562r797j0285j0092q535o377m662l363k105j076m07M08
$$ 882142 873914 864616 855054 845257 834972 824880 816345 809968 805306 801943 799838 798762 798355 798763
59239G98763J622K761L674M943O530P341O918O335O417O284M735K067o08k879
$$ 798763 800385 803146 806820 811763 818293 825634 832552 838887 845304 851588 856323 858390 857782 854903
59225H54903m979o925q645j0234j1444j1716j1212j0924j1274j1641j1596j1480
$$ 854903 849924 842999 834354 824120 812676 800960 789748 778824 767550 755909 744313 732833
59213G32833j1250j0150q108o255n417n228n187n308n205m065k070n60j33J1M14
$$ 732833 721583 711433 703325 697070 691653 686425 681238 675930 670725 666660 664590 664030 663897 663908 664322
59198F64322O42P29J573L134L984L550L120L691M477M635M771N569O471O880P320
$$ 664322 664964 665693 667266 670400 674384 677934 681054 684745 689222 693857 698628 704197 710668 717548 724868
59183G24868Q197Q802Q597Q282Q484Q601P861O328M220J650m03n59P26J275L37
$$ 724868 733065 741867 750464 758746 767230 775831 783692 790020 794240 795890 795487 794928 795654 796929 797266
59168G97266l48L93J239Q33Pm5J30k78n68r3Lj438l508m757n476o688q098q849
$$ 797266 796918 797311 798550 799383 799390 799345 799475 799197 798629 798536 798539 797101 793593 788836 783360 776672 768574 759725
59150G59725r244r990j0717j0757j0362r859q799p280o720p846r194r229q493
$$ 759725 750481 740491 729774 719017 708655 698796 689997 682717 675997 668151 658957 649728 641235
59137F41235q160p928p082o240o155o012m831l314k469j645J79K231L100L056
$$ 641235 633075 625147 618065 611825 605670 599658 594827 591513 589044 587399 587578 589809 592909 595965
59123E95965L342M060M639N454P055Q677R346R725J1054J3049J4555J5447J6190
$$ 595965 599307 603367 608006 613460 620515 629192 638538 648263 659317 672366 686921 702368 718558
59110G18558J6423J5723J4863J4602J4105J2365J0226R102Q571P207N040L205
$$ 718558 734981 750704 765567 780169 794274 806639 816865 825967 834538 841745 846785 849990
59098H49990J779j1j988l342m301n657p092p654p437p139o488m759k384m94O40
$$ 849990 851769 851758 849770 846428 842127 836470 829378 821724 814287 807148 800660 795901 793517 793023 793663
59083G93663J267R19q87l352n247o521p637q260q063p961q762r541r130q295q407
$$ 793663 794930 795849 794962 791610 786363 779842 772205 763945 755882 747921 739159 729618 720488 712193 703786
59068G03786q827p831n638m208m293m722m615m427m633m992n204n107m408l285
$$ 703786 694959 687128 681490 677282 672989 668267 663652 659225 654592 649600 644396 639289 634881 631596
59054F31596k822l604m539m335l421k987k851j989n58L08L45K68L42L20L32N42
$$ 631596 628774 625170 620631 616296 612875 609888 607037 605048 604490 604798 605143 605411 605753 606073 606405 606947
59038F06947L90n22j318r51J86R97J392J967K657L056L404M042M629N042O209
$$ 606947 607337 606815 605497 604546 604732 605729 607121 609088 611745 614801 618205 622247 626876 631918 638127
59023F38127Q835J2186J5192J7708J9595K0014J8938J7821J7288J5691J1638O399
$$ 638127 646962 659148 674340 692048 711643 731657 750595 768416 785704 801395 813033 819432
59011H19432J937j761n395q074q733q389q522q468o832m308k520j199R02L259
$$ 819432 821369 819608 814213 806139 797406 789017 780495 772027 765195 760887 758367 757168 758070 761329
58997G61329M448M850N756O589N751L621K034J306L33q85j471j912l469n644o683
$$ 761329 765777 770627 776383 782972 788723 792344 794378 795684 796017 795132 793661 791749 788280 782636 775953
58982G75953o314n639m825l257j535p53l08J204L356M632N186O397Q130R143R688
$$ 775953 769639 764000 759175 755918 754383 753630 753322 754526 757882 762514 767700 774097 782227 791370 801058
58967H01058J1031J2802J3528J3380J3686J4122J3273J1548J0598J0147Q438N659
$$ 801058 812089 824891 838419 851799 865485 879607 892880 904428 915026 925173 933611 939270
58955I39270L709K517q4m538q780j1749j4606j7781j9757j9749j8989j8403j7326
$$ 939270 942979 945496 945412 940874 932094 920345 905739 887958 868201 848452 829463 811060 793734
58942G93734j5375j3445j2124j0878r337p672n595k826m43K73J12Q47K187K277
$$ 793734 778359 764914 752790 741912 732575 724903 719308 716482 716039 716312 716424 717271 719458 721735
58928G21735R63j28n91j543k897l231k567k477l177l272k590k497l095k985k195
$$ 721735 722698 722570 721979 720436 717539 714308 711741 709264 706087 702815 700225 697728 694633 691648 689453
58913F89453k367l587l899k605j183k92J192L425M818M992N720P879J0029J1063
$$ 689453 687086 683499 679600 676995 675812 675520 676712 680137 684955 689947 695667 703546 713575 724638
58899G24638J1879J3343J4931J6274J7767J8910J8334J6249J4601J4206J4072
$$ 724638 736517 749860 764791 781065 798832 817742 836076 852325 866926 881132 895204
58888H95204J4059J5544J8596K1219K2299K2848K3381K2671K0072J6766J3609
$$ 895204 909263 924807 943403 964622 986921 1009769 1033150 1055821 1075893 1092659 1106268
58877A106268J0079O212L158Q89k242o652j0577j2850j4320j5615j5898j4863
$$ 1106268 1116347 1122559 1125717 1126606 1124364 1117712 1107135 1094285 1079965 1064350 1048452 1033589
58865A033589j3624j2617j0907q543p231p677q517q822r324j0270j0570j0034
$$ 1033589 1019965 1007348 996441 987898 980667 972990 964473 955651 946327 936057 925487 915453
58853I15453j0108j1212j1747j0867r908r878r847q968p991p610p417p520q977
$$ 915453 905345 894133 882386 871519 861611 851733 841886 832918 824927 817317 809900 802380 793403
58840G93403j1566j3313j3272j2680j2491j1968j0660r546r144q593p511o650
$$ 793403 781837 768524 755252 742572 730081 718113 707453 697907 688763 680170 672659 666009
58828F66009o011m532k414j361j806k181j638r65k83J430L805M866M261L888M478
$$ 666009 659998 655466 653052 651691 649885 647704 646066 645101 644818 646248 650053 654919 659180 663068 667546
58813F67546M472L248K477L001L325K478J580J328P07n51j067n63o71j790k151
$$ 667546 672018 675266 677743 680744 684069 686547 688127 689455 690162 689611 688544 687981 687310 685520 683369
58798F83369j242j014k305l311l109l434n187o342n365l755l222l127k602k347
$$ 683369 682127 681113 678808 675497 672388 668954 663767 657425 652060 648305 645083 641956 639354 637007
58784F37007k451j201J919M821O107P102Q775R664Q804P759P764P668O602N724
$$ 637007 634556 633355 635274 640095 646202 653304 662079 671743 680547 688306 696070 703738 710340 716064
58770G16064N278L119j597o234q482r407j0486j0776r440q145q211q155o636n022
$$ 716064 721342 724461 722864 716630 708148 698741 688255 677479 668039 659894 651683 643528 636892 631870
58756F31870m563l831j573O79J471J976L164L429J803M71J113J811P17k53J162
$$ 631870 627307 623476 621903 622582 624053 626029 629193 632622 634425 634896 636009 637820 638537 638284 639446
58741F39446L416M087M233O078Q591R379Q896R059R520Q903Q024Q317Q719P534
$$ 639446 642862 646949 651182 657260 665851 675230 684126 693185 702705 711608 719632 727949 736668 744202
58727G44202N884N849O698O250M601L281K156L23j231r85M09J503K749N052P258
$$ 744202 750086 755935 762633 768883 773484 776765 778921 779244 778013 777028 777437 778940 781689 786741 793999
58712G93999P990Q285R523J0418R075O433M558L062K88l332o202q487j1283j4161
$$ 793999 801989 810274 819797 830215 839290 845723 850281 853343 853631 850299 844097 835610 824327 810166
58698H10166j6264j8378k1247k3406k3351k2190k1528k0584j8175j5531j4122
$$ 810166 793902 775524 754277 730871 707520 685330 663802 643218 625043 609512 595390
58687E95390j2711r758o800o103o763o494n533n395n462m357l105l424m294l638
$$ 595390 582679 572921 566121 560018 553255 546761 541228 535833 530371 526014 522909 519485 515191 511553
58673E11553j964j057n52Q07K138K093K041L952O585P506P511R299J2752J5188
$$ 511553 509589 508532 507980 508787 510925 513018 515059 519011 525596 533102 540613 549912 562664 577852
58659E77852J5348J3784J0392N010m02l595n130o798q181p922o941p092p878p745
$$ 577852 593200 606984 617376 622386 621984 618389 613259 606461 598280 590358 583417 576325 568447 560702
58645E60702p268p727q036o535m422l875m144l078j177n29r30o41K16L87L91J346
$$ 560702 553434 545707 537671 531136 526714 522839 518695 515617 514440 513911 512981 512340 512556 512943 513334 514680
58629E14680K333K157K016L083L407R79k195l071k487k866l149q57K613L857L281
$$ 514680 517013 519170 521186 524269 527676 528655 526460 523389 520902 518036 514887 514030 516643 520500 523781
58614E23781L945N771O115N247O001Q326R237Q075P059O709N349L180K359K856
$$ 523781 527726 533497 539612 544859 550860 559186 568423 576498 583557 590266 595615 598795 601154 604010
58600F04010K466R85L31N96Pj300j379l03j1n79l35O47R41J137L032N974P836
$$ 604010 606476 607461 607792 608388 608395 607095 605716 605413 605402 604823 604488 605135 606076 607213 610245 616219 624055
58583F24055Q934J1102J3703J4620J4335J4899J5731J4704J2506J1434J0828Q367
$$ 624055 632989 644091 657794 672414 686749 701648 717379 732083 744589 756023 766851 775218
58571G75218N029L975N197O157O992R994J4450J7333J8900K2331K7826L2232L4647
$$ 775218 780247 784222 789419 795576 802568 812562 827012 844345 863245 885576 913402 945634 980281
58558I80281L7141L9714L9595L6039L1052K5006J6428O411j489o212r594j1889
$$ 980281 1017422 1057136 1096731 1132770 1163822 1188828 1205256 1211667 1210178 1203966 1194372 1182483
58546A182483j1596r678r011r520q766p307q358j2050j5330j7744k1898k7780
$$ 1182483 1170887 1161209 1152198 1142678 1133912 1126605 1118247 1106197 1090867 1073123 1051225 1023445
58534A023445l2032l3467l4100l4173l1511k6511k2408j9847j6379j1988r643
$$ 1023445 991413 957946 923846 889673 858162 831651 809243 789396 773017 761029 751386
58523G51386r569q524n740m177m764m833l469l042m140m231k715k179l255l323
$$ 751386 741817 733293 727553 723376 718612 713779 710310 707268 703128 698897 696182 694003 690748 687425
58509F87425j688r65k024k539j725j600k377j746K11N89p86p04J403K205N37p35
$$ 687425 685737 684772 682748 680209 678484 676884 674507 672761 672972 673561 672775 672071 673474 675679 676216 675481
58493F75481k75k34j230q59J249K322J914L061O429Q802R008R840J2419J4307
$$ 675481 675206 674972 673742 672883 674132 676454 678368 681429 687858 696660 705668 715508 727927 742234
58479G42234J4976J7504K2721K7145K8722K9350K9741K7253K0927J3548O772p58
$$ 742234 757210 774714 797435 824580 853302 882652 912393 939646 960573 974121 980893 980135
58467I80135q772j4236j6479j8180j9801j8644j4726j1674j0257p204k013J586
$$ 980135 971363 957127 940648 922468 902667 884023 869297 857623 847366 840162 838149 839735
58455H39735K768N557J1356J6192J7852J9211K1627K1637J7216J1171N364k157
$$ 839735 842503 848060 859416 875608 893460 912671 934298 955935 973151 984322 989686 987529
58443I87529j1300j7556j8808j8551j9304j8790j5770j3309j2986j1842q427n855
$$ 987529 976229 958673 939865 921314 902010 883220 867450 854141 841155 829313 820886 815031
58431H15031n592m345m44K730L149L853O884R552J0211J1671J5254J7455J6032
$$ 815031 809439 805094 804650 807380 810529 814382 821266 830818 841029 852700 867954 885409 901441
58418I01441J3534J1524P429N38n120p398r310j2492j3854j2140j1144j2747j3416
$$ 901441 914975 926499 933928 934466 929346 921948 912638 900146 886292 874152 863008 850261 836845
58405H36845j1235r599j0287r815o517m125m378l396N45L075J922J453M383O630
$$ 836845 825610 816011 805724 795909 789392 785267 780889 777493 778038 781113 783035 784488 788871 795501
58391G95501N260L962N435N941K836nK81L7l243n295l037o90j932l258j249R40
$$ 795501 800761 804723 810158 816099 818935 818930 819211 819248 816005 810710 807673 806983 805051 801793 800544 801484
58375H01484O01J553O661J1455J1887J1366J3466J4858J2370R955J1531J3724
$$ 801484 802085 803638 810299 821754 833641 845007 858473 873331 885701 895656 907187 920911
58363I20911J2739J1659J3868J6167J5389J5026J8110K0429J8006J4364J3185
$$ 920911 933650 945309 959177 975344 990733 1005759 1023869 1044298 1062304 1076668 1089853
58352A089853J1062M933n95j141n07k983m996k485P35K60m74K636N928N185M158
$$ 1089853 1100915 1105848 1105253 1104112 1103605 1100622 1095626 1093141 1093876 1094136 1093662 1096298 1102226 1107411 1111569
58337A111569P325J1172J1297J1021J4293J7366J6367J5715J9824K3856K2119
$$ 1111569 1118894 1130066 1141363 1152384 1166677 1184043 1200410 1216125 1235949 1259805 1281924
58326A281924J8246J7490J6476J0517L762J886J810j319m111k032Q33n91k288
$$ 1281924 1300170 1317660 1334136 1344653 1348415 1350301 1352111 1350792 1346681 1344649 1345482 1344891 1342603
58313A342603R65N179M989M230P965J1753R977O994Q843J1707J0130Q479J2322
$$ 1342603 1343568 1348747 1353736 1357966 1365931 1377684 1387661 1394655 1403498 1415205 1425335 1433814 1446136
58300A446136J6636J4926J1846J4131J7251J4278R757J1273J5159J4406J2746
$$ 1446136 1462772 1477698 1489544 1503675 1520926 1535204 1544961 1556234 1571393 1585799 1598545
58289A598545J6855K2298K1609J8643K0622K3754K1327J8095K1689K7581K7632
$$ 1598545 1615400 1637698 1659307 1677950 1698572 1722326 1743653 1761748 1783437 1811018 1838650
58278A838650K5496K8406L2152K9900K7227L2105L8763L8142L5399L9844M6692
$$ 1838650 1864146 1892552 1924704 1954604 1981831 2013936 2052699 2090841 2126240 2166084 2212776
58267B212776M6657M4350M8681N4489N2939N0572N7958O8713P0443O7218P0062
$$ 2212776 2259433 2303783 2352464 2406953 2459892 2510464 2568422 2637135 2707578 2774796 2844858
58256B844858P4581P0160O2139O2177O5651O1766N6761O3005P4356P7133P6179
$$ 2844858 2919439 2989599 3051738 3113915 3179566 3241332 3298093 3361098 3435454 3512587 3588766
58245C588766Q4483R6480R8394R5716J02855J14778J17308J16163J26299J41872
$$ 3588766 3673249 3769729 3868123 3963839 4066694 4181472 4298780 4414943 4541242 4683114
58235D683114J47315J48594J61813J80586J87811J90049K05710K28984K41354
$$ 4683114 4830429 4979023 5140836 5321422 5509233 5699282 5904992 6133976 6375330
58226F375330K48845K70283K98917L15168L27001L56289L95756M23121M46795
$$ 6375330 6624175 6894458 7193375 7508543 7835544 8191833 8587589 9010710 9457505
58217I457505M91109N47424N89351O25485O84677P60241Q24667Q88405R84401
$$ 9457505 9948614 10496038 11085389 11710874 12395551 13155792 13980459 14868864 15853265
58208A5853265J105669J222085J347347J520576J734334J956316K209628K549852
$$ 15853265 16958934 18181019 19528366 21048942 22783276 24739592 26949220 29499072
58200B9499072K977242L463353M048952M811779N753398O836810Q122464R738427
$$ 29499072 32476314 35939667 39988619 44800398 50553796 57390606 65513070 75251497
58192G5251497J1747273J4217264J7410561K1702070K7325836L4381299M2802354
$$ 75251497 86998770 101216034 118626595 140328665 167654501 202035800 244838154
58185B44838154N1496982N7193653N5092364M2111033K0078866m674923k5320510
$$ 244838154 296335136 353528789 408621153 450732186 470811052 466136129 440815619
58178D40815619l8302887m3802583m3709490l9926567l4155252k8128998k3297919
$$ 440815619 402512732 358710149 315000659 275074092 240918840 212789842 189491923
58171A89491923k0263360j8680352j7718773j6654637j5205408j3487671j1735079
$$ 189491923 169228563 150548211 132829438 116174801 100969393 87481722 75746643
58164G5746643j0075487q542061p179711o040046n108400m324451l664278l136845
$$ 75746643 65671156 57129095 49949384 43909338 38800938 34476487 30812209 27675364
58156B7675364k717566k354872k033976j772721j562298j370059j194153j058955
$$ 27675364 24957798 22602926 20568950 18796229 17233931 15863872 14669719 13610764
58148A3610764r60112q66414p73179p03690o58908o13003n58901n14062m80382
$$ 13610764 12650652 11784238 11011059 10307369 9648461 9035458 8476557 7962495 7482113
58139G482113m40210l93231l57904l34775l05294k68157k41223k26816k09689
$$ 7482113 7041903 6648672 6290768 5955993 5650699 5382542 5141319 4914503 4704814
58130D704814j90005j84021j90487j89412j76447j67080j64659j55314j37346
$$ 4704814 4514809 4330788 4140301 3950889 3774442 3607362 3442703 3287389 3150043
58121C150043j25577j22838j15533j01132r2754r2831q8684p8009p3121p6096
$$ 3150043 3024466 2901628 2786095 2684963 2592209 2499378 2410694 2332685 2259564 2183468
58111B183468p4479o5651o1309o3776o1404n1755m6486m8794m8069m1421l8935
$$ 2183468 2108989 2043338 1982029 1918253 1856849 1805094 1758608 1709814 1661745 1620324 1581389
58100A581389m3074m3658l8026l5835l9306l8493l0883k6370k8040k6843k0134
$$ 1581389 1538315 1494657 1456631 1420796 1381490 1342997 1312114 1285744 1257704 1230861 1210727
58089A210727j7011k0165k0436j4464j0551j2012j1712p935q863j6188k0512j8281
$$ 1210727 1193716 1173551 1153115 1138651 1128100 1116088 1104376 1096441 1087578 1071390 1050878 1032597
58077A032597j7411k1263k2702j9132j7965k1801k3147j9186j7190k0039k0708
$$ 1032597 1015186 993923 971221 952089 934124 912323 889176 869990 852800 832761 812053
58066H12053j6492j4473j7503j8557j4456j1679j3067j2143o300k702n258q181
$$ 812053 795561 781088 763585 745028 730572 718893 705826 693683 687383 684681 679423 671242
58054F71242p946r287j3855j5297j1335q848j1158j1999p793m374n569o353l451
$$ 671242 663296 654009 640154 624857 613522 604674 593516 581517 573724 569350 563781 557428 553977
58041E53977j837m570o617m804l866o696q478o268m750o799p816n140l766o930
$$ 553977 552140 547570 540953 536149 532283 525587 517109 510841 506091 499292 491476 486336 482570 475640
58027D75640j0040r489q773j0528j1144q612p156q937r533o593m481n518n256
$$ 475640 465600 456111 447338 436810 425666 417054 409898 400961 391428 384835 380354 374836 369580
58014C69580j465Q45j422l716k482j189k604l274j026J50k018l218q26R24q38
$$ 369580 368115 368960 367538 363822 361340 360151 357547 354273 353247 353397 351379 348161 347335 348259 347421
57999C47421k119j14J220q02j822J481N044M956M141N589O137K988k25RQ65q56
$$ 347421 345302 345188 346408 345606 343784 345265 350309 355265 359406 364995 371132 374120 373895 373904 374769 373913
57983C73913k709k212k196m946p088n759m074n032o008m460l161m393m964k389
$$ 373913 371204 368992 366796 361850 354762 349003 344929 339897 333889 329429 326268 321875 316911 314522
57969C14522j02j053k027J21K396J486jJ108K423R62r36l76M60r43k115o25N17
$$ 314522 314420 313367 311340 311461 313857 315343 315342 316450 318873 319835 318899 318523 318983 318040 315925 315300 315817
57952C15817j833m916m947l504l630m017k497q63r43j69L539O930O722N441O687
$$ 315817 313984 309068 304121 300617 296987 292970 290473 289610 288667 288498 292037 298967 305689 311130 317817
57937C17817Q893R179R062J0877J2595J1771J0649J1833J2695R703M667J232j325
$$ 317817 326710 335889 344951 355828 368423 380194 390843 402676 415371 425074 429741 430973 429648
57924D29648n329r262j0546j0661j2225j3944j3520j2437j2942j3356j1280q423
$$ 429648 424319 415057 404511 393850 381625 367681 354161 341724 328782 315426 304146 295723
57912B95723p473p252n629l986m056l693o22K806L473K814L482L995J892r64j469
$$ 295723 288250 280998 275369 271383 267327 263634 263012 265818 269291 272105 275587 279582 281474 280510 279041
57897B79041p40j394k250r00J308J938K417N102Q069Q088O410O404P671P544O301
$$ 279041 278301 276907 274657 273757 275065 277003 279420 284522 292591 300679 307089 313493 321164 328708 335009
57882C35009N864N367K939Jr49r11k193l783l464k464l292m949m890l860m124
$$ 335009 340873 346240 349179 349180 348231 347320 345127 341344 337880 335416 332124 327175 322285 318425 314301
57867C14301m823l629j262MN75K066L495L221K608L640N027M835M572O248P844
$$ 314301 309478 305849 304587 304591 305166 307232 310727 313948 316556 320196 325223 330058 334630 340878 348722
57852C48722O484L812L233L987L008P55k5L23o47k553l127k784l479m441l697
$$ 348722 355206 359018 362251 366238 369246 370001 369976 370299 369652 367099 363972 361188 357709 353268 349571
57837C49571k404k934m047k873k68P27M24J470L453L709K541K595L679L214J311
$$ 349571 347167 344233 340186 337313 337045 337772 338196 339666 343119 346828 349369 351964 355643 358857 360168
57822C60168M94P91k02k551l912m006m770o182o238m989m495m816m024k072q28
$$ 360168 360662 361453 361251 358700 354788 350782 346012 339830 333592 328603 324108 319292 315268 313196 312368
57807C12368n67j81m81l372p920j1024j1772j1706j1184r231o570n198n072m548
$$ 312368 311801 311620 311139 307767 299847 288823 277051 265345 254161 244930 238360 233162 228090 223542
57793B23542l567l244k988j431N86J283J304K408L905M009L523M468O142O434
$$ 223542 219975 216731 213743 212312 212898 214181 215485 217893 221798 225807 229330 233798 239940 246374
57779B46374N940O741Q221Q213P324P779Q899Q082N570L825K885P31k302l948
$$ 246374 252314 259055 267276 275489 282813 290592 299491 307573 313143 316968 319853 320584 318282 314334
57765C14334m341n553p244p190n699n106n277m134k148j706k355j493N45R73N2
$$ 314334 309993 304440 297196 290006 284307 279201 273924 269790 267642 265936 263581 262088 262633 263606 263658
57750B63658Q98L593M668L090J779K248K564J763J684L080M116L924L725L519
$$ 263658 264556 268149 272817 275907 277686 279934 282498 284261 285945 289025 293141 297065 300790 304309
57736C04309J683j294k734k298k514l972m340l052k557l651l927k317r76r94l89
$$ 304309 305992 304698 301964 299666 297152 293180 288840 285788 283231 279580 275653 273336 272360 271366 270977
57721B70977J766L197K437J411J919K788K473J555Q66k3r47n94Q73J380L83k33
$$ 270977 272743 275940 278377 279788 281707 284495 286968 288523 289389 289366 288419 287825 288698 290078 290461 290228
57705B90228K56J14j366k297j602r42j674k718k941k950l181k880k195k584m046
$$ 290228 290484 290598 289232 286935 285333 284391 282717 279999 277058 274108 270927 268047 265852 263268 259222
57690B59222m683m004l802m724n009l819k817l048l191k205r66o0J329L146M013
$$ 259222 254539 250535 246733 242009 237000 233181 230364 227316 224125 221920 220954 220894 222223 225369 229382
57675B29382M106N632R262J3061J6106K0129K6325L3643M1685N2376O7124Q4574
$$ 229382 233488 239120 248382 261443 277549 297678 324003 357646 399331 451707 518831 603405
57663F03405J01582J13227J11487Q8967M6932k952m7026p7858r4075r6961r0155
$$ 603405 704987 818214 929701 1018668 1065600 1062648 1015622 937764 843689 746728 656573
57652F56573p9332o8569n8281m8065l9076l2039k5691j9256j4054j0874q293n386
$$ 656573 577241 508672 450391 402326 363250 331211 305520 286264 272210 261336 253043 247657
57640B47657l411l062k708j340n90j742l345l791l763m028l349r84J180J274K37
$$ 247657 244246 241184 238476 237136 236546 234804 231459 227668 223905 219877 216528 215544 216724 217998 218235
57625B18235k01k66q60j577j926k559l482l247j601o72j652k665j939o69o03j192
$$ 218235 218034 217768 216908 215331 213405 210846 207364 204117 202516 201844 200192 197527 195588 194919 194316 193124
57609A93124j362j774l025l758k976k143k641l189k180o05j85m56j75J50m48j182
$$ 193124 191762 189988 186963 183205 180229 178086 175445 172256 170076 169471 169286 168830 168655 168805 168357 167175
57593A67175j023q77j916l279l535l116l057k957k216j769k427k977k120q29o65
$$ 167175 166152 165275 163359 160080 156545 153429 150372 147415 145199 143430 141003 138026 135906 135077 134412
57578A34412j203j173q35j117j751k114k593l436l742l187l048l836l972k539
$$ 134412 133209 132036 131201 130084 128333 126219 123626 120190 116448 113261 110213 106377 102405 99866
57564I9866j265j679k513k169j551j979k371j249K90M63q7J56N57j96j098l59
$$ 99866 98601 96922 94409 92240 90689 88710 86339 85090 85380 85843 85756 85912 86469 86273 85175 84816
57548H4816J322J942J644K062L165L500K859K130J266j39j171q42j72o04j379
$$ 84816 86138 88080 89724 91786 94951 98451 101310 103440 104706 104567 103396 102554 102382 101778 100399
57533A00399r12K43L66m44q16p41j037j081J69J640J409q4o92n5J83o82j724k400
$$ 100399 99487 99730 100096 99652 98836 98095 97058 95977 96146 97786 99195 99111 98419 98364 98547 97865 96141 93741
57515I3741k929k958j964p58m95o38P7J310J742J425J316J201K79p63o62P1p6
$$ 93741 90812 87854 85890 85132 84637 83999 84076 85386 87128 88553 89869 91070 91349 90586 89924 89995 89919
57498H9919r92j398j369j955k830k703j747j274j351j029n55r23j629j254m9M17
$$ 89919 88927 87529 86160 84205 81375 78672 76925 75651 74300 73271 72716 71793 70164 68910 68861 69278
57482F9278m1k96l38j128k135j670K08J517J362Q18N79lj159k047k329k559k750
$$ 69278 69237 68941 68603 67475 65340 63670 63878 65395 66757 67575 68154 68151 66992 64945 62616 60057 57307
57465E7307k263j263o24l49K20P59L64n57p22j74n7l10K89J675K230J319J37l04
$$ 57307 55044 53781 53157 52808 53028 53787 54151 53594 52872 52698 52641 52331 52620 54295 56525 57844 57981 57677
57447E7677k94k53n2J91J06RM65J046R63O17R43J464Q80o69j698j652j288r47
$$ 57677 57383 57130 57078 57269 57375 57384 57849 58895 59858 60475 61418 62882 63762 63093 61395 59743 58455 57508
57429E7508l14K96K04j41K44R87Q77J8m01k53m19q11o02j48n80j564j661r13p69
$$ 57508 57194 57490 57694 57553 57797 58784 59661 59679 59278 59025 58606 57795 57193 57045 56465 54901 53240 52327 51558
57410E1558j370j229J32J409J799J926K124J760P20k48r40j792k479k281j748
$$ 51558 50188 48959 49091 50500 52299 54225 56349 58109 58829 58581 57641 55849 53370 51089 49341
57395D9341k004k548j903l78K93J03Q77K874M026L269K084J805J824J494J586
$$ 49341 47337 44789 42886 42508 42801 42904 43781 46655 50681 53950 56034 57839 59663 61157 62743
57380F2743K542L320L156K809K936K928K305J749J756J738J243O63L6j282l160
$$ 62743 65285 68605 71761 74570 77506 80434 82739 84488 86244 87982 89225 89888 89924 88642 85482
57365H5482m362m381m060l947l559k841k536k607k013o83L6l74p53k82L84Q50
$$ 85482 81120 76739 72679 68732 65173 62332 59796 57189 55176 54493 54529 54155 53402 53120 53504 54354
57349E4354J885L596M511L663K113J262R97N16j93p26j012r88m54J75Q2o88j231
$$ 54354 56239 59835 64346 68009 70122 71384 72381 72897 72704 71978 70966 69978 69524 69699 69781 69093 67862
57332F7862j280j338j362p78N2J58k67j86J67l85j502j614q60j172k805l674k937
$$ 67862 66582 65244 63882 63104 63156 63314 63047 62861 63028 62643 61141 59527 58667 57495 54690 51016 48079
57315D8079k392k993k924q70J350J570N65L30Q15O36l64j311k028k745k969k233
$$ 48079 45687 42694 39770 38900 40250 41820 42385 42715 43530 44166 43802 42491 40463 37718 34749 32516
57299C2516j164n48k01K15L10n8j73K29K85m22j021j021j265k134k550j937j503
$$ 32516 31352 30804 30603 30818 31128 31070 30897 31126 31411 30989 29968 28947 27682 25548 22998 21061 19558
57282A9558k187l011k983k969l964e71m726l528k760k578k411k295k169j028J557
$$ 19558 17371 14360 11377 8408 4444 -571 -5297 -8825 -11585 -14163 -16574 -18869 -21038 -22066 -20509
57267b0509M132N209N336e2F341O411O383P304Q656R104Q485P601O723N786N244
$$ -20509 -16377 -11168 -5832 -52 6341 12752 19135 26439 35095 44199 52684 60285 67008 72794 78038
57252G8038N292M998L617K026J448J618J579J402J649J932J546P89L72K37J77
$$ 78038 83330 88328 91945 93971 95419 97037 98616 100018 101667 103599 105145 105934 106306 106543 106720
57237A06720O38J632J990J117L23Q62J791J544N00J09M97Q54J361K687M193M677
$$ 106720 107358 108990 110980 112097 112420 113282 115073 116617 117117 117226 117723 118577 119938 122625 126818 131495
57221A31495M406M545N024M826M016L616L804L908L932M365M791M323L223K554
$$ 131495 135901 140446 145470 150296 154312 157928 161732 165640 169572 173937 178728 183051 186274 188828
57207A88828K481K368K153K253K438K262K126K535K841K254J487J762K826L589
$$ 188828 191309 193677 195830 198083 200521 202783 204909 207444 210285 212539 214026 215788 218614 222203
57193B22203M074M988N912N901N474N971P249Q005Q147Q721R626R575Q457P656
$$ 222203 226277 231265 237177 243078 248552 254523 261772 269777 277924 286645 296271 305846 314303 321959
57179C21959P700P549O664O006O361P174P668P890Q172Q605R292J0135J0448R801
$$ 321959 329659 337208 343872 349878 356239 363413 371081 378971 387143 395748 405040 415175 425623 435424
57165D35424R115R722J1578J3614J5432J7199J8276J7789J6415J5839J6402J6991
$$ 435424 444539 454261 465839 479453 494885 512084 530360 548149 564564 580403 596805 613796
57153F13796J7229J7928J9303K0586K1639K3228K5322K6854K7555K8372K9698
$$ 613796 631025 648953 668256 688842 710481 733709 759031 785885 813440 841812 871510
57142H71510L0739L1046L1177L1518L1904L2670L4447L6720L8275L9286M1156
$$ 871510 902249 933295 964472 995990 1027894 1060564 1095011 1131731 1170006 1209292 1250448
57131A250448M4008M6327M7539M8925N1271N3649N5349N7029N8976O0216O0533
$$ 1250448 1294456 1340783 1388322 1437247 1488518 1542167 1597516 1654545 1713521 1773737 1834270
57120A834270O1647O5054P0347P6760Q4635R4048J03624J12209J20271J28426
$$ 1834270 1895917 1960971 2031318 2108078 2192713 2286761 2390385 2502594 2622865 2751291
57110B751291J36356J44756J56471J73775J96004K21858K52589K90795L37601
$$ 2751291 2887647 3032403 3188874 3362649 3558653 3780511 4033100 4323895 4661496
57101D661496L93726M62424N49087O58947P97686R73400J195060J469475J801851
$$ 4661496 5055222 5517646 6066733 6725680 7523366 8496766 9691826 11161301 12963152
57092A2963152K197513K658981L181483L754310M364826M995543N617350O191044
$$ 12963152 15160665 17819646 21001129 24755439 29120265 34115808 39733158 45924202
57084D5924202O675845P031054P213532P191361O969871O588837O070770N371606
$$ 45924202 52600047 59631101 66844633 74035994 81005865 87594702 93665472 99037078
57076I9037078M404593L128262J607594j4524j596077l042780m299217n325765
$$ 99037078 103441671 106569933 108177527 108163003 106566926 103524146 99224929 93899164
57068I3899164o095495o601357o854892o879663o709338o386488n955595n456050
$$ 93899164 87803669 81202312 74347420 67467757 60758419 54371931 48416336 42960286
57060D2960286m922099m384824l869048l389245k951747k560316k217565j922854
$$ 42960286 38038187 33653363 29784315 26395070 23443323 20883007 18665442 16742588
57052A6742588j672301j460931j283069j131828j000882q86788p87968p02030
$$ 16742588 15070287 13609356 12326287 11194459 10193577 9306789 8518821 7816791
57044G816791o25906n58021m98223m45765l99028l57088l19867k86827k56922
$$ 7816791 7190885 6632864 6134641 5688876 5289848 4932760 4612893 4326066 4069144
57035D069144k29923k06412j86320j68587j52339j37431j23740j10771r8165q5823
$$ 4069144 3839221 3632809 3446489 3277902 3125563 2988132 2864392 2753621 2655456 2569633
57025B569633p3336n9717m4034k6010n228K0653N5243R7055J32023J36635R5552
$$ 2569633 2496297 2436580 2392546 2366536 2361308 2381961 2437204 2534259 2666282 2802917 2898469
57014B898469J7994o6806j32005j69112j83583j82386j70261j52811j35626j20354
$$ 2898469 2916463 2849657 2717652 2548540 2364957 2182571 2012310 1859499 1723873 1603519
57004A603519j05595r1408p9542p0134o1711n4182m8564m4074l8729l2734k8212
$$ 1603519 1497924 1406516 1326974 1256840 1195129 1140947 1092383 1048309 1009580 976846 948634
56993I48634k5566k2998j9773j7053j5149j2656q848m535j19N057J1125J7331
$$ 948634 923068 900070 880297 863244 848095 835439 826591 822056 821937 826994 838119 855450
56981H55450K3013K6823K5611J7063L620r100j7981k3952k7991k9059k6851k3348
$$ 855450 878463 905286 930897 947960 951580 942480 924499 900547 872556 843497 816646 793298
56969G93298k0235j7122j3543j0361p963n316j960J073L442O500J1091J6387K2031
$$ 793298 773063 755941 742398 732037 724074 718758 716798 717871 721313 727813 738904 755291 777322
56956G77322K9127L7290M2449L9634K7415Q835j0898k6954l6730m0596m0491l7677
$$ 777322 806449 843739 886188 925822 953237 962072 951174 924220 887490 846894 806403 768726
56944G68726l2693k6987k2474j9277j5845j1673p923m959j487L167Q043J2751
$$ 768726 736033 709046 686572 667295 651450 639777 631854 626895 625408 628575 636618 649369
56932F49369J8719K7231L7637M7854N4704N3553M0669J7664q188k9528m3558n0939
$$ 649369 668088 695319 732956 780810 835514 889067 929736 947400 939212 909684 866126 815187
56920H15187n2789n0426m5977m1105l5919l0237k4742k0047j5998j2677j0708
$$ 815187 762398 711972 665995 624890 588971 558734 533992 513945 497947 485270 474562
56909D74562r854q834p227n963n343m441l071k286k226j621k52L24l74n26J168
$$ 474562 464708 455874 448647 442684 437341 432900 429829 427543 425317 423696 423444 423768 423394 422868 424036
56894D24036L534N153O364P765Q880R748J1770J5563J9997K4577L0183L5682L6529
$$ 424036 427570 432723 439087 446852 455732 465480 477250 492813 512810 537387 567570 603252 639781
56881F39781K9289J5849J098j1671k1132k6100k6387k4181k1951j9671j6068j1424
$$ 639781 669070 684919 686017 674346 653214 627114 600727 576546 554595 534924 518856 507432
56869E07432p049l078J217N732R991J4447J9844K6286L4326M5569O0368P5766
$$ 507432 500383 497305 498522 504254 514245 528692 548536 574822 609148 654717 715085 790851
56857G90851Q6716Q8300P6575N0479J5115j9201m4055n8168o4355o4146n8075
$$ 790851 877567 965867 1042442 1092921 1108036 1088835 1044780 986612 922257 858111 800036
56846H00036m8789l9772l1717k3109j3729m845L317J1686K0509K9823M1070N5942
$$ 800036 751247 711475 679758 656649 642920 638075 641392 653078 673587 703410 744480 800422
56834H00422P4315R5159J17667J38141J46905J32900R3200L6599k2189p0468j01476
$$ 800422 874737 969896 1087563 1225704 1372609 1505509 1598709 1635308 1613119 1542651 1441175
56823A441175j14726j14484j06433r4586q1127o7820n5783m4545l3258k2342j2604
$$ 1441175 1326449 1211965 1105532 1010946 929819 861999 806216 761671 728413 706071 693467
56812F93467l402O553J7368K8697M1544N7377P5562R2548J02582R8528P5011L4142
$$ 693467 690065 696618 713986 742683 784227 841604 917166 1009714 1112296 1210824 1285835 1319977
56800A319977j2825n2510p8239r0925r3672q8949p9750o9346n9047m8606l8670
$$ 1319977 1307152 1254642 1176403 1085478 991806 902857 823107 753761 694714 646108 607438
56789F07438l0524k3734j6670r250k654L404J0573J9134K7983L7024M6539N3840
$$ 607438 576914 553180 536510 527260 524606 528010 538583 557717 585700 622724 669263 723103
56777G23103N3475M2107K1606k842k5806m2954n2130n4302n2254m7993m2471l6971
$$ 723103 776578 818685 840291 837449 811643 768689 716559 662257 610003 562010 519539 482568
56765D82568l2689k9140k5039k0638j7302j5109j2982j0860r544q678p147n283
$$ 482568 449879 420739 395700 375062 357760 342651 329669 318809 309265 300587 293440 288157
56753B88157m397m347l868l107l325m285m490l906l800l967k892q49O8o22j074
$$ 288157 283760 279413 275545 272438 269113 264828 260338 256432 252632 248665 245773 244924 244992 244370 243296
56738B43296m10J6o32j225r11n10p67j201j442j813k037j324j47O8o61q30j36
$$ 243296 242886 242902 242270 241045 240134 239624 238857 237656 236214 234401 232364 231040 230893 230961 230300 229470 229334
56721B29334J13l42p5J365K406J930P77N7j72J11J218K507K665J736J084J082
$$ 229334 229447 229105 229030 230395 232801 234731 235508 235565 235393 235504 236722 239229 241894 243630 244714 245796
56705B45796Q56N19J291L025L897L199K188J641Q36l95q69j67N40N48N12P30N33
$$ 245796 246652 247171 248462 251487 255384 258583 260771 262412 263248 262853 261984 261817 262357 262905 263417 264147 264680
56688B64680p2j77J79q0r21j131o47n94p72K76K315L220K417J756K236K534J706
$$ 264680 264608 264431 264610 264530 263609 262478 261831 261237 260465 260741 263056 266276 268693 270449 272685 275219 276925
56671B76925N94l43j924l907m505l423k706l402l944l135k099j811j314M5J067
$$ 276925 277519 277176 275252 271345 266840 263417 260711 257309 253365 250230 248131 246320 245006 245051 246118
56656B46118R64Q64J493J676P01j04K52O44R9l82J32O93L68r4%j38r54j295n63
$$ 246118 247082 247946 249439 251115 251816 251712 251964 252608 252707 252325 252457 253150 253518 253424 253424 253286 252332 251037 250474
56637B50474l1m98p24K58J325J404J333J914K126J014m44j089j361j823j792r83
$$ 250474 250443 249945 249221 249479 250804 252208 253541 255455 257581 258595 258151 257062 255701 253878 252086 251103
56621B51103n74j086j218l01K28o27j509j116l66m05n13O8L32n10j212o46J43
$$ 251103 250529 249443 248225 247924 248152 247525 246016 244900 244534 244129 243616 243684 244016 243506 242294 241648 241791
56604B41791k5k51O11J678J658J015O84K25q38j564j232p74r27q44r0O0r40j396
$$ 241791 241766 241515 242126 243804 245462 246477 247161 247386 246548 244984 243752 242978 242051 241207 241117 241177 240237 238841
56586B38841j66J184J064M42O31Q02L0m18O82J993J876J217J477J917J400R86
$$ 238841 238675 239859 240923 241365 241996 242798 242828 242410 243092 245085 246961 248178 249655 251572 252972 253958
56570B53958J942K994K457J417J883L245L562L009L215M290N339O768R434J2473
$$ 253958 255900 258894 261351 262768 264651 267896 271458 274467 277682 281972 287311 294079 303513 315986
56556C15986J4509J5855J7077J6641J2739O468O79l420o209p525p115o208o153
$$ 315986 330495 346350 363427 380068 392807 399275 399954 396534 390325 382800 375685 369477 363324
56543C63324o387n846n218n564o106n676n017n200n260l924k311k187k904k747
$$ 363324 356937 351091 345873 340309 334203 328527 323510 318310 313050 309126 306815 304628 301724 298977
56529B98977j985j867j908j027j57p67j867j430J68R78Q18R33J232P47RK54Q86
$$ 298977 296992 295125 293217 292190 292033 291266 289399 287969 288137 289115 289933 290866 292098 292845 292854 293108 293994
56512B93994M14q42j375j013n11K99J566J969O63o80l78L06n14j822j655r27j727
$$ 293994 294408 293566 292191 291178 290667 290966 292532 294501 295164 294484 294106 294412 293898 292076 290421 289494 287767
56495B87767l230l073j651j240j708j047M75O55m89o89M52R37R9n33k41R3K62
$$ 287767 284537 281464 279813 278573 276865 275818 276293 276948 276459 275770 276222 277159 277258 276725 276484 276577 276839
56478B76839Q82J246J9j976k513j370k95J79J010K079K213J588J384J361N00n04
$$ 276839 277721 278967 278986 277010 274497 273127 272832 273011 274021 276100 278313 279901 281285 282646 283146 282642
56462B82642k38O09L82k93M06J836J669k7r57n47l28o62m22J20m59j695j681m95
$$ 282642 282404 283013 283395 283102 283508 285344 287013 286986 286029 285482 285154 284492 284070 284190 283731 282036 280355 279860
56444B79860Q5Q1J136K962L421K261J381J245L75j395k446k415k549k865k080
$$ 279860 279945 280026 281162 284124 287545 289806 291187 292432 292807 291412 288966 286551 284002 281137 279057
56429B79057n00J79%N97J915K238J425R44Q28j33j387j204j02j79j171r10M64
$$ 279057 278557 278736 278736 279333 281248 283486 284911 285855 286683 286550 285163 283959 283857 283678 282507 281597 282061
56412B82061N93o79r39M37J463J424J801K816K789J551Q35Q65J61r71n97P53L08
$$ 282061 282654 281975 281036 281473 282936 284360 286161 288977 291766 293317 294152 295017 295178 294207 293610 294363 294671
56395B94671k030l104j695l28p37j463j162o01l1J772M512N734M535K890K236
$$ 294671 292641 289537 287842 287514 286777 285314 284152 283551 283520 285292 289804 295538 300073 302963 305199
56380C05199J735Q50N02Q30P80N11J188K093J240q30j430k19M48j07q1Q69R80
$$ 305199 306934 307784 308286 309116 309896 310407 311595 313688 314928 314098 312668 312449 312897 312790 312709 313578 314558
56363C14558K52P79K496K808J306O19J639K206J511J485K664K995K003J838K947
$$ 314558 314810 315589 318085 320893 322199 322818 324457 326663 328174 329659 332323 335318 337321 339159 342106
56348C42106L009J465O75J309J068n30p86J095K222J142K28R85J494P33R03L102
$$ 342106 345115 346580 347255 348564 349632 349102 348316 349411 351633 352775 353003 353988 355482 356215 357118 360220
56332C60220M888M572L941M417M469L185K433L247L842L344L559N029N336L517
$$ 360220 365108 369680 373621 378038 382507 385692 388125 391372 395214 398558 402117 407146 412482 415999
56318D15999J983J958J247j178k730j822p58j366j878p96J86l02o72J41N11k25
$$ 415999 417982 419940 421187 420009 417279 415457 414699 413333 411455 410659 410845 410543 409871 410012 410523 410298
56302D10298J4J828K585J330J047L388N604N524N131O086O274M163K330L143M824
$$ 410298 410312 412140 414725 416055 417102 420490 426094 431618 436749 442835 449109 453272 455602 458745 463569
56287D63569N130N050N691N546M148M346P458J0173R756Q335Q573R101P996O860
$$ 463569 468699 473749 479440 484986 489134 493480 500938 511111 520867 529202 537775 546876 554872 561732
56273E61732P596Q722Q635Q921J0939J2660J2454J2388J4274J6152J6232J6561
$$ 561732 569328 578050 586685 595606 606545 619205 631659 644047 658321 674473 690705 707266
56261G07266J9124K2042K3317K4713K8271L2572L6028M0130M6037N1749N6198
$$ 707266 726390 748432 771749 796462 824733 857305 893333 933463 979500 1031249 1087447
56250A087447O2094P1195Q0848Q8869R7463J08448J18970J26163J31782J37900
$$ 1087447 1149541 1220736 1301584 1390453 1487916 1596364 1715334 1841497 1973279 2111179
56240B111179J42250J42150J38948J34226J25810J11887R4875P6833N5558K9855
$$ 2111179 2253429 2395579 2534527 2668753 2794563 2906450 3001325 3078158 3133716 3163571
56230C163571M052j7725l7299n7345p5246q7550r6223j04557j10853j12212j10862
$$ 3163571 3167623 3149898 3112599 3055254 2980008 2892458 2796235 2691678 2580825 2468613 2357751
56219B357751j10652j10546j07474j02551r8689r5036q9361q3082p8563p4380
$$ 2357751 2247099 2136553 2029079 1926528 1827839 1732803 1643442 1560360 1481797 1407417
56209A407417o8432o2610n9235n6214n0938m5513m2800m0871l6813l2426l0460
$$ 1407417 1338985 1276375 1217140 1160926 1109988 1064475 1021675 980804 943991 911565 881105
56198H81105k8864k4651j9929j8156j7761j5499j2738j2342j2718j0961q690q632
$$ 881105 852241 827590 807661 789505 771744 756245 743507 731165 718447 707486 698796 690164
56186F90164q784o107k678k014k606j323K46p97k390j145J084Q05l09J133L452
$$ 690164 681380 675273 672595 670581 667975 666652 666898 666101 663711 662566 663650 664455 664146 665279 668731
56171F68731L236K104L377N311M544K915M027O279O228N452P117R298Q878Q352
$$ 668731 671967 674071 677448 682759 687303 690218 694245 700524 706752 712204 719321 728619 737497 745849
56157G45849J1314J4920J4622J2728J4315J8123J9712K0223K3608K8378L0626
$$ 745849 757163 772083 786705 799433 813748 831871 851583 871806 895414 923792 954418
56146I54418L2300L8026M6602N4178O2840P7411R6522J15364J34134J54786J72329
$$ 954418 986718 1024744 1071346 1125524 1188364 1265775 1362297 1477661 1611795 1766581 1938910
56135A938910J78650J72744J58849J37900J10241Q3431O6979O0975N8683N7302
$$ 1938910 2117560 2290304 2449153 2587053 2697294 2780725 2847704 2908679 2967362 3024664
56125C024664N6695N1219L4390J0111j0965k4667l3531l7220l4049l0294l6427
$$ 3024664 3081359 3132578 3166968 3177079 3166114 3141447 3107916 3070696 3036647 3006353 2969926
56114B969926n4365p7819j03254j30185j52879j63403j62328j56303j46540j30058
$$ 2969926 2915561 2837742 2734488 2604303 2451424 2288021 2125693 1969390 1822850 1692792
56104A692792j10136r4074q1755o7559n2299m2025l6417k9834k2615j9771j9682
$$ 1692792 1582656 1488582 1406827 1339268 1286969 1244944 1208527 1178693 1156078 1136307 1116625
56093A116625j5979r601p077p921n808j228m91k988k004K316L435J331K274O209
$$ 1116625 1100646 1091045 1083968 1076047 1070239 1069011 1068520 1065532 1063528 1065844 1069279 1070610 1072884 1079093
56079A079093P057N180O653J0654J0610P453Q336J2642J2920R397R625J3840J4864
$$ 1079093 1086150 1091330 1097983 1108637 1119247 1126700 1135036 1147678 1160598 1169995 1179620 1193460 1208324
56066A208324J2569J3948J8662J9159J5532J5488J9131J8741J4234J3535J6869
$$ 1208324 1220893 1234841 1253503 1272662 1288194 1303682 1322813 1341554 1355788 1369323 1386192
56055A386192J6193J1143R885J3153J3160R441R761J4286J4988J1776J2788J7888
$$ 1386192 1402385 1413528 1423413 1436566 1449726 1459167 1468928 1483214 1498202 1509978 1522766 1540654
56043A540654J8743J5978J8633K5839K7294K2936K3360K9447L1060K7490K9110
$$ 1540654 1559397 1575375 1594008 1619847 1647141 1670077 1693437 1722884 1753944 1781434 1810544
56032A810544L6591L9008L5179L6103M3351M6108M2822M4114N0922N1855M5902
$$ 1810544 1847135 1886143 1921322 1957425 2000776 2046884 2089706 2133820 2184742 2236597 2282499
56021B282499M5307N1896N3599M8476M8561N5475N6694N0837N1579O1152O5723
$$ 2282499 2327806 2379702 2433301 2481777 2530338 2585813 2642507 2693344 2744923 2806075 2871798
56010B871798O2728O6348P9528Q7653Q6759R0377J01394J05626J00875J03050
$$ 2871798 2934526 3000874 3080402 3168055 3254814 3345191 3446585 3552211 3653086 3756136
56000C756136J15395J21771J18748J23077J38484J47562J46298J52948J72139
$$ 3756136 3871531 3993302 4112050 4235127 4373611 4521173 4667471 4820419 4992558
55991D992558J85002J86256J95217K17924K35360K42053K57917K88237L11821
$$ 4992558 5177560 5363816 5559033 5776957 6012317 6254370 6512287 6800524 7112345
55982G112345L23152L44660L82381M13292M32337M65553N19423N66374N99040
$$ 7112345 7435497 7780157 8162538 8575830 9008167 9473720 9993143 10559517 11158557
55973A1158557O47102P20295P89947Q48910R31030J047262J165216J278374J428378
$$ 11158557 11805659 12525954 13315901 14164811 15095841 16143103 17308319 18586693 20015071
55964B0015071J630542J850407K085775K392733K796343L263990L806193M505536
$$ 20015071 21645613 23496020 25581795 27974528 30770871 34034861 37841054 42346590
55956D2346590N401273O456035P689033R220865J1139098J3482925J6439849K0378459
$$ 42346590 47747863 54203898 61892931 71113796 82252894 95735819 112175668 132554127
55948A32554127K5597161L2224587M0281621M9100637N6076805N6595516M6671246
$$ 132554127 158151288 190375875 230657496 279758133 335834938 392430454 439101700
55941D39101700K6567504J594151k1154883l7015199m5203762m7305806m5334246
$$ 439101700 465669204 467263355 446108472 409093273 363889511 316583705 271249459
55934B71249459m0995875l5673531l0320001k5381220k1013932j7314439j4296116
$$ 271249459 230253584 194580053 164260052 138878832 117864900 100550461 86254345
55927H6254345j1837272r802957q147967o839382n781242m889304m156717l582712
$$ 86254345 74417073 64614116 56466149 49626767 43845525 38956221 34799504 31216792
55919C1216792l110613k691039k336413k060756j827820j605451j412505j267134
$$ 31216792 28106179 25415140 23078727 21017971 19190151 17584700 16172195 14905061
55911A4905061j141978j011927q96227q13972p44032o65920n96882n53345n16164
$$ 14905061 13763083 12751156 11854929 11040957 10296925 9631005 9034123 8480778 7964614
55902G964614m67343m22958l98092l75546l39565l06079k90277k77006k51301
$$ 7964614 7497271 7074313 6676221 6300675 5961110 5655031 5364754 5087748 4836447
55893D836447k26960k17669k09708j89606j70452j65220j61201j45486j29844
$$ 4836447 4609487 4391818 4182110 3992504 3822052 3656832 3495631 3350145 3220301
55884C220301j26415j23799j10379r7148r4779r1570p6279o0209n5075n1188l9088
$$ 3220301 3093886 2970087 2859708 2762560 2667781 2576211 2499932 2439723 2384648 2333460 2294372
55873B294372l1092l9408n3089n8051o0646p0455p8610p4425o6218o5149o4733
$$ 2294372 2263280 2223872 2170783 2112732 2052086 1981631 1903021 1828596 1762378 1697229 1632496
55862A632496n6045m7079m7518m9512m2757l4134l3808l5866l0924k4515k5185
$$ 1632496 1576451 1529372 1481854 1432342 1389585 1355451 1321643 1285777 1254853 1230338 1205153
55851A205153k7220k2552j7339j9848k3945k1040j6688j9275k3697k2088j9441
$$ 1205153 1177933 1155381 1138042 1118194 1094249 1073209 1056521 1037246 1013549 991461 972020
55840I72020k2955k6913k3597j8607k0050k2839j8911j3017j3364j6024j3476
$$ 972020 949065 922152 898555 879948 859898 837059 818148 805131 791767 775743 762267
55829G62267r502j1148j4527j2648r071j0229j2464r913o958r820j3959j2661
$$ 762267 752765 741617 727090 714442 705371 695142 682678 672765 665807 655987 642028 629367
55817F29367r927j2094j4894j1769p087q055j1060q985m737m788o243l054J622
$$ 629367 619440 607346 592452 580683 573596 565541 554481 545496 540759 535971 529728 526674 528296
55804E28296J675J75L222P937Q436P538J0762J4733J3265R023P806P040J417n817
$$ 528296 529971 530146 533368 541305 549741 557279 568041 582774 596039 605062 612868 619908 621325 615508
55790F15508q527r119j3175j8127j8281j5814j5898j6106j1452m903k373k335
$$ 615508 606981 597862 584687 566560 548279 532465 516567 500461 489009 484106 481733 479398
55778D79398o82m45n978j2771j3818j1261j1208j2110q949l971k266j369L741
$$ 479398 478716 478271 472293 459522 445704 434443 423235 411125 402176 398205 395939 394570 398311
55765C98311R685R658N219K470P12m259r578r303n604n101p074n942k547k307
$$ 398311 407996 417654 422873 425343 426055 421796 412218 402915 397311 392210 385136 379194 376647 374340
55751C74340m587m320k033k369m700m745l488n136q356q611o972p740r687q499
$$ 374340 369753 365433 363400 361031 356331 351586 348098 342962 334606 325995 319023 311283 301596 293097
55737B93097n539n286o493m763j488j352l263k613k50m50k265j622K19r52l763
$$ 293097 287558 282272 275779 271016 269528 268176 264913 262300 262050 261600 259335 257713 257932 256980 253217
55722B53217l771k233l579o504o326m021m016n199l214M38P73j097k8L226L541
$$ 253217 249446 247213 243634 237130 230804 226783 222767 217568 214354 214792 215565 214468 214440 217666 221207
55707B21207J450K207N749O889M912L981M474K681j104k739k245l503o263o559
$$ 221207 222657 224864 230613 237502 242414 246395 250869 253550 252446 249707 247462 243959 237696 231137
55693B31137m698m773o568n995l226k386l395k184J096K067L65R6J959K576J776
$$ 231137 226439 221666 215098 209103 205877 203491 200096 197912 199008 201075 201440 201536 203495 206071 207847
55678B07847L001O144P370O288O183O996N309J417p13o13j537l566l578j938k010
$$ 207847 210848 216992 224362 230650 236833 243829 249138 250555 249842 249229 247692 244126 240548 238610 236600
55663B36600l242j929J199J642o28j056J173K158J063J320L480M140K856L005
$$ 236600 233358 231429 232628 234270 233642 232586 233759 235917 236980 238300 241780 245920 248776 251781
55649B51781M882M886K414P92O33r65l943m880l796m467p209q174o636o088p199
$$ 251781 256663 261549 263963 264755 265388 264423 260480 255600 251804 247337 240128 231954 225318 219230 212031
55634B12031o637m006l000m398m707k972k239k976j914J063J780p53k350j073
$$ 212031 205394 201388 198388 193990 189283 186311 184072 181096 179182 180245 182025 181272 178922 177849
55620A77849j10j273j867l70P34n4p46m23r56k593k999k060k381l924l696j734
$$ 177849 177739 176466 174599 174229 174963 174909 174163 173740 172784 170191 167192 165132 162751 158827 155131 153397
55604A53397j561l624m222k225p71j039n12J146Q73j481j939M50J572n47k546
$$ 153397 151836 148212 143990 141765 140994 139955 139443 140589 141462 139981 138042 138492 140064 139517 136971
55589A36971k116j570k512k776j286m85j303j067J070J948J94j106j11O02p12
$$ 136971 134855 133285 130773 127997 126711 126226 124923 123856 124926 126874 127068 125962 125851 126453 125741
55574A25741j659m83O82J21l90N23J256R89J635L692M551L190K177K896L199J848
$$ 125741 124082 123599 124281 124402 124012 124535 125791 126780 128415 132107 136658 139848 142025 144921 148120 149968
55558A49968Q26J095O37j222k082j139r13k280k528n97N52p85k095j391l57l65
$$ 149968 150794 151889 152526 151304 149222 148083 147170 144890 142362 141765 142317 141532 139437 138046 137689 137324
55542A37324J07J646K010M94j80J290K524K268K719M725N437L459J615J829J838
$$ 137324 137431 139077 141087 141581 141401 142691 145215 147483 150202 154927 160364 163823 165438 167267 169105
55527A69105j38j998k015j993l206l515j683k70j152k262j815j597k907l492j770
$$ 169105 168967 166969 164954 162961 159755 156240 154557 154287 153135 150873 149058 147461 144554 141062 139292
55512A39292j40o54j283J23J894J881J216J414J245k66j142J18J606J509J156
$$ 139292 139152 138498 137215 137338 139232 141113 142329 143743 144988 144722 143580 143698 145304 146813 147969
55497A47969J796J828J88j069n55m06k252l959l501k583l132l667k508j254j628
$$ 147969 149765 151593 151781 150712 150157 149751 147499 143540 140039 137456 134324 130657 128149 126895 125267
55482A25267k082r39K08l99j184k74R13M64m67j12O42N87R58K651L553J831o87
$$ 125267 123185 122246 122454 122055 120871 120597 121510 121974 121507 121395 122037 122624 123582 126233 129786 131617 130930
55465A30930j560j501k055k318j124J21q0n37M6L15j010k278j742o27n75o85N6
$$ 130930 129370 127869 125814 123496 122372 122493 122413 121876 121922 122237 121227 118949 117207 116580 116005 115320 115376
55448A15376L13p72j165O52K603K368J028M08k46j863k773j582o9l8j74Q70J301
$$ 115376 115689 114917 113752 114404 117007 119375 120403 120811 120565 118702 115929 114347 114278 114240 114066 114936 116237
55431A16237m41k179j528j26n05j551r45L76K61m34L09J636J498N30N42R71L52
$$ 116237 115796 113617 112089 111963 111458 109907 108962 109338 109599 109165 109474 111110 112608 113138 113680 114651 115003
55414A15003m44M7P17n0j045m09P08K08j019p52N20P66J10J8K06m51j233q69j47
$$ 115003 114559 114606 115323 115273 114228 113819 114527 114735 113716 112964 113484 114250 114360 114378 114584 114133 112900 112031 111884
55395A11884l43o22K59J279J043M93Q94J108k18j675j352j39J85J48Q33J043n06
$$ 111884 111541 110919 111178 112457 113500 113993 114887 115995 115777 114102 112750 112611 112796 112944 113777 114820 114314
55378A14314k187j886n26JL26J725K912K234J019J211J601J42j962k248j316j365
$$ 114314 112127 110241 109715 109716 110042 111767 114679 116913 117932 119143 120744 120886 118924 116676 115360 113995
55362A13995k016j467l28n12j523j519p92p19o41O87K019J492J77K18R15K77r82
$$ 113995 111979 110512 110184 109672 108149 106630 105838 105119 104478 105165 107184 108676 108853 109071 109986 110263 109281
55345A09281p89K85J99o32k85Q95J097N07M78N10m63j207j92J051L07j146p99
$$ 109281 108492 108777 108976 108344 108059 108954 110051 110558 111036 111546 111083 109876 109684 110735 111042 109896 109097
55328A09097L13n55k549k434k17J013L50k31n3l78j074o76L75L07m48j4J127R14
$$ 109097 109410 108855 106306 103872 103655 104668 105018 104787 104734 104356 103282 102606 102981 103288 102840 102826 103953 104867
55310A04867k55j74R06P67m32l91R05J125n2o14k97q89k221j919K78J827J557
$$ 104867 104612 104438 105344 106111 105679 105288 106193 107318 107266 106652 106355 105466 103245 101326 101604 103431 104988
55293A04988R61Q28J66r15p67O22J292P49O89J724K436K164J834J563M11j163
$$ 104988 105949 106777 106943 106028 105261 105883 107175 107924 108613 110337 112773 114937 116771 118334 118745 117582
55277A17582j507p05m14p64l69O15N69l09j04J220J623O45L3K58k48j837k738
$$ 117582 116075 115370 114956 114192 113823 114438 115007 114698 114594 115814 117437 118082 118115 118373 118125 116288 113550
55260A13550k167j398j134n80L20M68pL43J572K095J495R78Q89L79l25m0Q79R13
$$ 113550 111383 109985 108851 108271 108591 109059 109052 109395 110967 113062 114557 115535 116424 116803 116478 116438 117317 118230
55242A18230J80J23N40l5j186j034K13M90l37l90L93N1j407j531K73J560R17k19
$$ 118230 118410 118533 119073 119038 117852 116818 117031 117521 117184 116794 117187 117238 115831 114300 114573 116133 117050 116831
55224A16831p60j540k576k132L2J536R93o4j86j89q78j227m36M59M27K2n2p9j91
$$ 116831 116071 114531 111955 109823 109855 111391 112384 112320 112134 111945 111067 109840 109404 109863 110290 110312 110260 110181 109990
55205A09990P9N18L52m4M16J232Q62l70m88P28J342O63J89N99O01l88j090p55
$$ 109990 110069 110587 110939 110895 111311 112543 113405 113035 112547 113275 114617 115280 115469 116068 116669 116281 115191 114436
55187A14436k52n8M28R97N56n14m60Q79J691J318J030J272R43m0k65L72K96o94
$$ 114436 114184 114126 114554 115551 116107 115593 115133 116012 117703 119021 120051 121323 122266 122226 121961 122333 122629 121935
55169A21935q06M80J359P87m4j98k66m47M2Q89O74m13o52k0l51j732j996n95L69
$$ 121935 121129 121609 122968 123755 123711 123513 123247 122800 122842 123731 124405 123992 123340 123320 122969 121237 119241 118646 119015
55150A19015q4l07N23Q81P1k96N15R14J95l6Q02P11j187k610j764j80K31J54P69
$$ 119015 118931 118624 119147 120028 120099 119803 120318 121232 121427 121391 122193 122904 121717 119107 117343 117163 117394 117548 118317
55131A18317J222N47k08O9M89K5n81n56p31j646k064j124l8J5k69j4K07j2K19
$$ 118317 119539 120086 119878 119947 120436 120461 119880 119324 118593 116947 114883 113759 113721 113736 113467 113453 113660 113648 113867
55112A13867J183J590R19N51J204J497N82j67L39R74O10L6O0n6o37m05J031J847
$$ 113867 115050 116640 117559 118110 119314 120811 121393 121226 121565 122539 123149 123185 123245 123189 122552 122147 123178 125025
55094A25025J005K07R52J936J488L82M2j3o54j002r4R50O81k47l53K80P68J135
$$ 125025 126030 126237 127189 129125 130613 130995 131037 131024 130370 129368 129274 130224 130905 130658 130305 130585 131353 132488
55076A32488J614J581P84J90K77O8q16j053J5Q55J94r29j146q46p24j95R84J442
$$ 132488 134102 135683 136467 136657 136934 137002 136186 135133 135148 136003 136197 135268 134122 133276 132552 132357 133341 134783
55058A34783L95p17n54Qk67q16p56o20q43m93P95J469N23o59o49j68j82L8R83
$$ 134783 135178 134461 133907 133915 133648 132832 132076 131456 130613 130120 130915 132384 132907 132248 131599 131431 131249 131287 132270
55039A32270J221j20j287o08O70O01k57l39Ll95r98o43J64K78mM4j49j082j544
$$ 132270 133491 133371 132084 131476 132146 132747 132490 132151 132154 131759 130761 130118 130282 130560 130556 130600 130451 129369 127825
55020A27825m61J039J409J129J320J544R97M22O99J006M21k06J4J36o79j142p2
$$ 127825 127364 128403 129812 130941 132261 133805 134802 135224 135923 136929 137350 137144 137158 137294 136615 135473 135401
55003A35401J202J004J62J27J62q53j577k93J615J472m35j501q26K97J123J819
$$ 135401 136603 137607 137769 137896 138058 137205 135628 135335 136950 138422 137987 136486 135660 135957 137080 138899
54987A38899J756J89j753k220j353o02j61O73J397J007J38R1M27j45j197j260
$$ 138899 140655 140844 139091 136871 135518 134916 134755 135428 136825 137832 137970 138061 138488 138343 137146 135886
54971A35886l85L07Q86K079L171K913J865J483J458M32j229j828j132m85m16k93
$$ 135886 135501 135808 136694 138773 141944 144857 146722 148205 149663 150095 148866 147038 145906 145421 145005 144712
54955A44712k4m7j2N56Q95J75o81m12K30k55j346j397n35j96l91OO89K99r01j200
$$ 144712 144688 144641 144629 145185 146080 146255 145574 145162 145392 145137 143791 142394 141859 141663 141272 141278 141967 142266 141365 140165
54935A40165k33O33O41L01p9n13k93J195K920L401K999L121L778M048M298N653
$$ 140165 139932 140565 141206 141507 141428 140915 140622 141817 144737 148138 151137 154258 158036 162084 166382 172035
54919A72035P759R304J0315J1674J2840J2371J0295P743M734P17l294n679o942
$$ 172035 179794 189098 199413 211087 223927 236298 246593 254336 259070 259787 256493 250814 243872
54906B43872q770j0795j0981r169p397o599n722m365l663l972m124l563l096l009
$$ 243872 235102 224307 213326 204157 196760 190161 184439 180074 176411 172439 168315 164752 161656 158647
54892A58647k429j051L04J151J676J598N39n26j19J405K325K307K614L698M710
$$ 158647 156218 155167 155471 156622 158298 159896 160435 159909 159790 161195 163520 165827 168441 172139 176849
54877A76849N451O621P978Q444Q219Q603R445R020O746L916J338j563m811p149
$$ 176849 182300 188921 196899 205343 213562 222165 231610 240630 247376 251292 252630 251067 246256 239107
54863B39107q001q315q785q904q314p522o757n643m400l903m121l964k997j974
$$ 239107 231106 222791 214006 205102 196788 189266 182509 176866 172466 168563 164442 160478 157481 155507
54849A55507j470j283j265j460j478j026p75j361j965j520p54j129k207k200q78
$$ 155507 154037 152754 151489 150029 148551 147525 146750 145389 143424 141904 141150 140021 137814 135614 134736
54834A34736K41M83N69O40k4j150j511r41m19r3O58J320P25m70k74J406K432J754
$$ 134736 134977 135460 136029 136669 136645 135495 133984 133043 132624 132531 133189 134509 135234 134764 134490 135896 138328 140082
54816A40082O68J99l12j244j613r32j80M2M72J480K131J859J442J456J314N64
$$ 140082 140750 140949 140637 139393 137780 136848 136668 136710 137182 138662 140793 142652 144094 145550 146864 147428
54800A47428k13n11n56m27J49Q00P14P7j19K07K71J31O10J402J297M17K27R77
$$ 147428 147215 146704 146148 145721 145870 146670 147384 147461 147342 147549 147820 147951 148561 149963 151260 151677 151904 152881
54782A52881J236M39j92J25N74N22N61J017J218R90J219K219L131L522M041M954
$$ 152881 154117 154556 154364 154489 155063 155585 156146 157163 158381 159371 160590 162809 165940 169462 173503 178457
54766A78457N599N886O730Q475J0274J1350J1436R951O565K659K02j018k941n894
$$ 178457 184056 189942 196672 205147 215421 226771 238207 248158 254723 257382 257584 256566 253625 247731
54752B47731p965q241q131q679q902p870o362n286m313l159k445k344j950r28
$$ 247731 239766 231525 223394 214715 205813 197943 191581 186295 181982 178823 176378 174034 172084 171156
54738A71156k12l15n22m52o46j042o85L84Q94N91P30J640K014J522J812L782N991
$$ 171156 170944 170629 170107 169655 169009 167967 167282 167666 168560 169151 169881 171521 173535 175057 176869 180651 186642
54721A86642P055P606Q515R158Q900Q424Q065O593L245o13l432n552p859r800
$$ 186642 193697 201303 209818 218976 227876 236300 244365 250958 254203 253590 250158 244606 236747 226947
54707B26947j0356r741q668p069m957l381l063l144k569j751j550j639j221n92
$$ 226947 216591 206850 198182 191113 186156 182775 179712 176568 173999 172248 170698 169059 167838 167246
54693A67246o49j451k240k465k058j274o91p56j099j085r98j475j963j332J9N37
$$ 167246 166597 165146 162906 160441 158383 157109 156418 155662 154563 153478 152480 151005 149042 147710 147729 148266
54677A48266O3RO88P90m0m82j35l28j380j584k38P81R3q38k47J077J389P63K66
$$ 148266 148329 148338 149026 149816 149776 149294 149159 148831 147451 145867 145629 146410 146503 145665 145418 146495 147884 148647 148913
54658A48913p0o39r20n21k38n67n05O12J526J015l3j83K63L05K36P06R78Q9j183
$$ 148913 148843 148204 147284 146763 146525 145958 145453 146065 147591 148606 148573 148390 148653 148958 149194 149900 150878 150967 149784
54639A49784j395o34p0j6l0j24m08l19M26R10L77m59p03q12j434j816r96L56Q92
$$ 149784 148389 147755 147685 147669 147639 147515 147107 146788 147214 148124 148501 148042 147339 146527 145093 143277 142281 142637 143529
54620A43529O54O34R87J134J022R00N13l06q75o55k39l31n26k21K15K47K03M16
$$ 143529 144183 144817 145804 146938 147960 148860 149373 149067 148192 147537 147298 146967 146441 146220 146435 146682 146885 147301
54602A47301L82j28l12K13L43p18j906j858r35k46K14R17J397J128P55R91J190
$$ 147301 147683 147555 147243 147456 147799 147081 145175 143317 142382 142136 142350 143267 144664 145792 146547 147538 148728
54585A48728N66j91n5N32N60K53L40M90J26j45M03R60L31r70j508j106n82m1Q65
$$ 148728 149294 149103 149048 149580 150140 150393 150733 151223 151349 151204 151607 152567 152898 151928 150420 149314 148732 148691 149556
54566A49556J567J228L20r9j20n36j148j115n06OM84J316J972J710J008Q27R98
$$ 149556 151123 152351 152671 152572 152452 151916 150768 149653 149147 149153 149637 150953 152925 154635 155643 156470 157468
54549A57468P87N18R78J730J623O55j50m15n62n82j11N68Q72R60J261J424R58
$$ 157468 158255 158773 159751 161481 163104 163759 163609 163194 162632 162050 161939 162507 163379 164339 165600 167024 167982
54532A67982L49K86L20k44q64n45K93L83l91j041j173j226j238q47l03j76k87
$$ 167982 168331 168617 168937 168693 167829 167284 167577 167960 167569 166528 165355 164129 162891 162044 161741 161565 161278
54515A61278m8L87M28J86J23O6l34o02r9P61J072P77L94l0o18q99n45j35j98j78
$$ 161278 161230 161617 162045 162231 162354 162420 162086 161484 161385 162146 163218 163995 164389 164359 163741 162842 162297 162162 161964 161786
54495A61786M46R08L69m72n03p9k11o50l89L97P04M79M39M85r7j071j445r61k18
$$ 161786 162232 163140 163509 163037 162534 162455 162244 161594 161205 161602 162306 162785 163224 163709 163612 162541 161096 160135 159917
54476A59917M40R84J142Q94R99J856K616K590K462K835K710J210k88R8J770K567
$$ 159917 160357 161341 162483 163377 164376 166232 168848 171438 173900 176735 179445 180655 180367 180465 182235 184802
54460A84802K063J680J916J770Q83J26j33m68j030j301j306j489j594j094n48
$$ 184802 186865 188545 190461 192231 193114 193240 193107 192639 191609 190308 189002 187513 185919 184825 184277
54445A84277q38j444j177l27k44j034j531j403j396j517r70Q5N61L36L70P72O12
$$ 184277 183439 181995 180818 180491 180247 179213 177682 176279 174883 173366 172396 172481 173042 173378 173748 174520 175132
54428A75132j97n73j23L53M45N74P35L81j81M2R60J345Q63N45Q87J096O36N7j87
$$ 175132 174935 174362 174239 174592 175037 175611 176346 176727 176546 176588 177548 178893 179756 180301 181188 182284 182920 182977 182790
54409A82790l87o18m03K27N25K34l5J03L49M87N90M66q5n15j10P43J052Q01P98
$$ 182790 182403 181785 181382 181609 182134 182368 182333 182436 182785 183272 183862 184328 184243 183728 183618 184361 185413 186214 187012
54390A87012J127J024K51o70j398j845j550l09R09J021M67M31Q28O65Lj91J30
$$ 187012 188139 189163 189414 188744 187346 185501 183951 183642 184551 185572 186039 186470 187298 187963 187966 187775 187905
54373A87905J17k64k61O0k0k89J27J024J477J709K737M178M486L435K455K296
$$ 187905 188022 187758 187497 187557 187537 187248 187375 188399 189876 191585 194322 198500 202986 206421 208876 211172
54357B11172K252J889J625J373M85o90j041p07r63j894k145j373q84j427k252
$$ 211172 213424 215313 216938 218311 218796 218106 217065 216358 215395 213501 211356 209983 209099 207672 205420
54342B05420k801l419l911l385k079j451j778j641m32O01N63K45L31J29q25j580
$$ 205420 202619 199200 195289 191904 189825 188374 186596 184955 184523 185124 185687 185932 186263 186392 185567 183987
54326A83987j271m55N8L81P16O93K76J96P18J177J204J109P50m48j960k314j314
$$ 183987 182716 182261 182319 182700 183416 184109 184385 184581 185299 186476 187680 188789 189539 189091 187131 184817 183503
54309A83503m22l62j91N62P24m40j796k105j780j699j651j166o29m41j59M99Q71
$$ 183503 183081 182719 182528 183090 183814 183374 181578 179473 177693 175994 174343 173177 172548 172107 171948 172447 173318
54292A73318N05J37N31J296J616J334P08l4l79K08J285J763J511J399J544R98
$$ 173318 173823 173960 174491 175787 177403 178737 179445 179411 179032 179240 180525 182288 183799 185198 186742 187740
54276A87740l70j292r85j34N60J231J692J114l22j071m66K67J14k28RJ72m24r94
$$ 187740 187370 186078 185093 184959 185519 186750 188442 189556 189234 188163 187697 187964 188078 187850 187859 188031 187607 186613
54258A86613n64M25J034J370J964K472K186J179J16n24m74K47R35P51L7r7L33
$$ 186613 186049 186474 187508 188878 190842 193314 195500 196679 196795 196271 195797 196044 196979 197730 197767 197670 198003
54241A98003J44q60j339o00L53O40P28R82O92m26j346j341j099j189r61k6P26
$$ 198003 198147 197287 195948 195348 195701 196341 197069 198051 198743 198317 196971 195630 194531 193342 192381 192355 193081
54224A93081P06P55J483J912J098j58n76k25J04J90%q24j981k257j355p15j317
$$ 193081 193787 194542 196025 197937 199035 198877 198301 198076 198180 198370 198370 197546 195565 193308 191953 191238 189921
54207A89921k050j564m14N8j68k84k13k34L4Q84J578J367O54Q1n65j426j677q26
$$ 189921 187871 186307 185893 185951 185783 185499 185286 185052 185086 185970 187548 188915 189569 189650 189085 187659 185982 185156
54189A85156J76L52K56P51J308R47M6k56K69J039J786K305J937N23p58p52J26
$$ 185156 185332 185684 185940 186691 187999 188946 188992 188736 189005 190044 191830 194135 196072 196595 195837 195085 195211
54172A95211Q02J167J687K083J691O41l55r28j014n69l1k29j125j567r98l53m58
$$ 195211 196013 197180 198867 200950 202641 203282 202927 201999 200985 200416 200385 200156 199031 197464 196466 196113 195655
54155A95655q31q84j028j535j618q69l01o91j135n77L61N50K08J65K47j21o44
$$ 195655 194824 193940 192912 191377 189759 188890 188589 187898 186763 186186 186547 187097 187305 187470 187717 187596 186952
54138A86952q40j111j716j744n09R42J279R19J107J753J855J314Q54O18K92N5
$$ 186952 186112 185001 183285 181541 181032 181974 183253 184172 185279 187032 188887 190201 191055 191673 191965 192020
54122A92020J32N9m58o60N4Q27N93j59k36L70P85Q62J113J623K101K482K602K077
$$ 192020 192152 192211 191753 191093 191147 191974 192567 192408 192172 192542 193327 194189 195302 196925 199026 201508 204110 206187
54104B06187J338J653L205M374M120L655M347N330M878K995R14r30k713l939m095
$$ 206187 207525 209178 212383 216757 220877 224532 228879 234209 239087 242082 242996 242066 239353 235414 231319
54089B31319l749l492k732j075K99K95k34j1M75K14j20O06J641J517O21L27M23
$$ 231319 227570 224078 221346 220271 220570 220865 220631 220620 221095 221309 221189 221795 223436 224953 225574 225901 226324
54072B26324j71q78k63J120J287M2q39n85j87j99n0K44j81j237j718j215n17j3
$$ 226324 226153 225275 225012 226132 227419 227461 226622 226037 225850 225651 225601 225845 225664 224427 222709 221494 220977 220964
54054B20964O34J207R97K40p6J98M68Q40J859K979L090K413K159K524K731K818
$$ 220964 221598 222805 223802 224042 223966 224164 224632 225472 227331 230310 233400 235813 237972 240496 243227 246045
54038B46045L490M364M346L693L731M586N155N346O197P652Q239P409O341N954
$$ 246045 249535 253899 258245 261938 265669 270255 275410 280756 286953 294605 302844 310253 316594 322548
54024C22548N812N410M942M435L595K742K500K491J798P05L40P09P23J15n12j411
$$ 322548 328360 333770 338712 343147 346742 349484 351984 354475 356273 356978 357318 358027 358750 358865 358353 356942
54008C56942l400n828o958o617o360o716o451n134m169m418m813m335l618l599
$$ 356942 353542 347714 340756 334139 327779 321063 314612 309478 305309 300891 296078 291743 288125 284526
53994B84526l962l987l580k802j601o07q77k235l223l152k805k706k236j104j78
$$ 284526 280564 276577 272997 270195 268594 267987 267110 264875 261652 258500 255695 252989 250753 249649 249471
53979B49471p2k60l15o78j470j875j462r56r72j110r24p01n54P5J424K875L969
$$ 249471 249399 249139 248824 248146 246676 244801 243339 242383 241411 240301 239377 238676 238122 238197 239621 242496 246465
53962B46465M970O009O821P703R453J1748J2731J0985P016K334j973n302p232
$$ 246465 251435 257444 264265 271968 281421 293169 305900 316885 323901 326235 324262 318960 311728
53949C11728p836p585o662n009l074j516j87J438K892L116K352K194L391M982
$$ 311728 303892 296307 289645 284636 281562 280046 279859 281297 284189 287305 289657 291851 295242 300224
53935C00224N901O129N909N182M241L666L226K076L77n92k63N24J074J704K711
$$ 300224 306125 312254 318163 323345 327586 331252 334478 336554 336931 336339 336076 336600 337674 339378 342089
53920C42089L766M726N828O689O506N525N029N453N959O176O808Q121R272R762
$$ 342089 345855 350581 356409 363098 369604 375129 380158 385611 391570 397746 404554 412675 421947 431709
53906D31709J0127J0639J0673R857Q561O772L967N25k186l584m323m617l824k159
$$ 431709 441836 452475 463148 473005 481566 488338 492305 492830 490644 487060 482737 478120 474296 472137
53892D72137j093j332k071k880m506o979q856r400r774j0872j1626j0840r261
$$ 472137 471044 469712 467641 464761 460255 453276 444420 435020 425246 414374 402748 391908 382647
53879C82647q349q168p839p119o304n421m635m567n281n769n311m439l830l293
$$ 382647 374298 366130 358291 351172 344868 339447 334812 330245 324964 319195 313884 309445 305615 302322
53865C02322k628k366k840l482l788l972m083l669k888k656l031k840j683p52
$$ 302322 299694 297328 294488 291006 287218 283246 279163 275494 272606 269950 266919 264079 262396 261644
53851B61644q37j078p40n92j306k026j866j489j698j760p16P73J403J115O00j15
$$ 261644 260807 259729 258989 258397 257091 255065 253199 251710 250012 248252 247536 248309 249712 250827 251427 251312
53835B51312j137j670j013O1L20j51m48m27m85m58N6P66J183J390J445Q06n37
$$ 251312 250175 248505 247492 247553 247873 247722 247274 246847 246362 245904 245960 246726 247909 249299 250744 251550 251013
53818B51013j274m02J155J801J517J485K059K481K302J825J401J165J287J675
$$ 251013 249739 249337 250492 252293 253810 255295 257354 259835 262137 263962 265363 266528 267815 269490
53804B69490J894J969K623M022N171N321N149N538O138O256O257O810P483P381
$$ 269490 271384 273353 275976 279998 285169 290490 295639 301177 307315 313571 319828 326638 334121 341502
53790C41502O664O119N707M819L593K774K511K268J811J311P35p7r78j789k675
$$ 341502 348166 354285 359992 364811 368404 371178 373689 375957 377768 379079 379814 379737 378759 376970 374295
53775C74295l738m689n409o190o958p099o611o388o676o378m806l089k642l218
$$ 374295 370557 365868 360459 354269 347311 340212 333601 327213 320537 314159 309353 306264 303622 300404
53761C00404l684l819m074m255l840l078k551k169j668j538k214k912k519j268
$$ 300404 296720 292901 288827 284572 280732 277654 275103 272934 271266 269728 267514 264602 262083 260815
53747B60815l53k50m43n29n25l78j02j12n89r24o01r7j31n38p50p90r25q99m28
$$ 260815 260462 260212 259769 259240 258715 258337 258235 258123 257534 256610 256009 255912 255781 255243 254493 253703 252778 251879 251451
53728B51451P9J96K70P12J111R73P15R54J456J680J709J831J793J401J097J111
$$ 251451 251530 251726 251996 252708 253819 254792 255507 256461 257917 259597 261306 263137 264930 266331 267428 268539
53712B68539R37M67O75K009L209L045K239K199K734K676K033J842K243K407K109
$$ 268539 269476 269943 270618 272627 275836 278881 281120 283319 286053 288729 290762 292604 294847 297254 299363
53697B99363J962K242K744L602M954O052N922M770L651L044K707K557K554K120
$$ 299363 301325 303567 306311 309913 314867 320919 326841 331611 335262 338306 341013 343570 346124 348244
53683C48244Q14p43j590j709j625j406j002r27j415j616q68J0m7n96o16l39n65
$$ 348244 349058 348315 346725 345016 343391 341985 340983 340056 338641 337025 336157 336167 336120 335524 334908 334569 334004
53666C34004r08n26P0j93q43n47M43O47Qj2R07J306M22o47r10q34j059j228q87
$$ 334004 333096 332570 332640 332447 331604 331057 331500 332147 332155 332143 333050 334356 334778 334131 333221 332387 331328 330100 329213
53647C29213l69p0J82M81M74J14r3R2L57O00J118J881K420K553K489K239J765
$$ 329213 328844 328774 328956 329437 329911 330025 329932 330024 330381 330981 332099 333980 336400 338953 341442 343681 345446
53630C45446J524J990K720K909K641K552K597K421K616M054N996O535N217L623
$$ 345446 346970 348960 351680 354589 357230 359782 362379 364800 367416 371470 377466 384001 389218 392841
53616C92841K998K817K280J779J958K490K676K571K677L132L786M564N248N404
$$ 392841 395839 398656 400936 402715 404673 407163 409839 412410 415087 418219 422005 426569 431817 437221
53602D37221M947M333L875L366K652K105K120K455K375J425J9p86l70M84K81j232
$$ 437221 442168 446501 450376 453742 456394 458499 460619 463074 465449 466874 466893 466107 465737 466221 466502 465270
53586D65270k561k429j502j274j960k548k513k288k244k238k125j927j630j442
$$ 465270 462709 460280 458778 457504 455544 452996 450483 448195 445951 443713 441588 439661 438031 436589
53572D36589j879k878l341k468j037l79o27j024j290j561j433n40L25P8r47j439
$$ 436589 434710 431832 428491 426023 424986 424607 423980 422956 421666 420105 418672 418132 418457 418535 417588 416149
53556D16149j052n07n9P14J645J965J619J337J327J134Q02R27J501J835J696J456
$$ 416149 415097 414590 414531 415245 416890 418855 420474 421811 423138 424272 425074 426001 427502 429337 431033 432489
53540D32489J228R41J062K057L345M009M261M911N671N605N070N466O938Q024
$$ 432489 433717 434658 435720 437777 441122 445131 449392 454303 459974 465579 470649 476115 483053 491077
53526D91077P878P378P614Q684J0306J2244J3766J4013J3350J3239J4315J5691
$$ 491077 498955 506333 513947 522631 532937 545181 558947 572960 586310 599549 613864 629555
53514F29555J6407J6566J6731J7207J8181J9691K1354K2886K4642K6728K8147
$$ 629555 645962 662528 679259 696466 714647 734338 755692 778578 803220 829948 858095
53503H58095K8056K7400K7658K8465K8215K6835K5859K5759K5351K4115K3060
$$ 858095 886151 913551 941209 969674 997889 1024724 1050583 1076342 1101693 1125808 1148868
53492A148868K2735K2286K1176K0134J9675J9348J9016J9286J9995J9973J8973
$$ 1148868 1171603 1193889 1215065 1235199 1254874 1274222 1293238 1312524 1332519 1352492 1371465
53481A371465J8210J8305J8399J8083J8359J9682K0679K0047J8300J6451J4414
$$ 1371465 1389675 1407980 1426379 1444462 1462821 1482503 1503182 1523229 1541529 1557980 1572394
53470A572394J1853R318P274N193K715N13j143l468p428j1923j5108j6736j7788
$$ 1572394 1584247 1593565 1600839 1606032 1608747 1609260 1608117 1604649 1597221 1585298 1570190 1553454 1535666
53457A535666j8562j8507j7625j6704j6375j6804j8092k0098k2131k3459k3967
$$ 1535666 1517104 1498597 1480972 1464268 1447893 1431089 1412997 1392899 1370768 1347309 1323342
53446A323342k3961k3651k3228k2969k2919k2808k2435k1677k0128j7551j4668
$$ 1323342 1299381 1275730 1252502 1229533 1206614 1183806 1161371 1139694 1119566 1102015 1087347
53435A087347j2549j1112r303o875m762l494k530j539r50o36N21K927N367O721
$$ 1087347 1074798 1063686 1054383 1047508 1042746 1039252 1036722 1035183 1034233 1033597 1034118 1037045 1042412 1049133
53421A049133P519Q891J0896J2819J4350J5671J6943J8368K0129K1900K3152K4200
$$ 1049133 1056652 1065543 1076439 1089258 1103608 1119279 1136222 1154590 1174719 1196619 1219771 1243971
53409A243971K5947K8335L0202L1123L2022L3474L4742L5315L6063L7883M0308
$$ 1243971 1269918 1298253 1328455 1359578 1391600 1425074 1459816 1495131 1531194 1569077 1609385
53398A609385M2442M4364M6618M9198N1864N4668N7347N9098N9754O0327O1605
$$ 1609385 1651827 1696191 1742809 1792007 1843871 1898539 1955886 2014984 2074738 2135065 2196670
53387B196670O3060O3822O3897O3673O3055O1827O0083N7795N4808N1665M9330
$$ 2196670 2259730 2323552 2387449 2451122 2514177 2576004 2636087 2693882 2748690 2800355 2849685
53376B849685M7588M5005M0995L6604L2484K7713K1678J5631J0966P150K702k798
$$ 2849685 2897273 2942278 2983273 3019877 3052361 3080074 3101752 3117383 3128349 3135499 3138201 3135403
53364C135403r037j6294k4874l3916m2114m9099n4972n9211o1314o2009o2559
$$ 3135403 3126366 3110072 3085198 3051282 3009168 2960069 2905097 2845886 2784572 2722563 2660004
53353B660004o3218o3441o3140o2662o1895o0373n8026n5120n1883m8840m6910
$$ 2660004 2596786 2533345 2470205 2407543 2345648 2285275 2227249 2172129 2120246 2071406 2024496
53342B024496m6421m6605m6685m6801m7171m7154m5905m3358l9894l5846l1969
$$ 2024496 1978075 1931470 1884785 1837984 1790813 1743659 1697754 1654396 1614502 1578656 1546687
53331A546687k9402k8243k7024k4547k1432j8937j7097j5113j2936j1366j1055
$$ 1546687 1517285 1489042 1462018 1437471 1416039 1397102 1380005 1364892 1351956 1340590 1329535
53320A329535j2096j4051j5746j5827j4247j2431j1441j0822r894q892q081o885
$$ 1329535 1317439 1303388 1287642 1271815 1257568 1245137 1233696 1222874 1212980 1204088 1196007 1189122
53308A189122m930k842j035J136L947O152O645O206O325P254Q530J0393J3234
$$ 1189122 1184192 1181350 1180315 1181451 1185398 1191550 1198195 1204401 1210726 1217980 1226510 1236903 1250137
53295A250137J6306J8480J9754K0824K1900K3049K4909K7707L0342L1715L2269
$$ 1250137 1266443 1284923 1304677 1325501 1347401 1370450 1395359 1423066 1453408 1485123 1517392
53284A517392L2891L3135L1910K9389K6778K4665K2776K0885J8777J5918J2221
$$ 1517392 1550283 1583418 1615328 1644717 1671495 1696160 1718936 1739821 1758598 1774516 1786737
53273A786737Q554N511K401j457n441q684j1490j4435j7067j8876k0582k2989
$$ 1786737 1795291 1800802 1803203 1801746 1796305 1787621 1776131 1761696 1744629 1725753 1705171 1682182
53261A682182k5547k7463k9206l1277l2727l2623l2018l2525l3805l4533l4840
$$ 1682182 1656635 1629172 1599966 1568689 1535962 1503339 1471321 1438796 1404991 1370458 1335618
53250A335618l5613l6095l4757l2094l0192k9622k9111k8211k7928k8517k8829
$$ 1335618 1300005 1263910 1229153 1197059 1166867 1137245 1108134 1079923 1051995 1023478 994649
53239I94649k8316k7705k7313k6500k5196k4252k3780k2742k0619j8142j5976
$$ 994649 966333 938628 911315 884815 859619 835367 811587 788845 768226 750084 734108
53228G34108j4018j2265j1003r963q514o878n975o038o640p796r631j1210j1376
$$ 734108 720090 707825 696822 686859 678345 671467 665492 659454 652814 645018 635387 624177 612801
53215F12801j0714j0909j2173j3136j3295j3646j4481j4582j3243j1447j0283
$$ 612801 602087 591178 579005 565869 552574 538928 524447 509865 496622 485175 474892
53204D74892r609q962q450q095p464o531n837n501n171n082n866p111p521o833
$$ 474892 465283 456321 447871 439776 432312 425781 419944 414443 409272 404190 398324 391213 383692 376859
53190C76859o125n966n731n129m830n054n016m417m055m237m078l063k056j941
$$ 376859 370734 364768 359037 353908 349078 344024 339008 334591 330536 326299 322221 319158 317102 315161
53176C15161k374k706k952l074k459j000K16K22n97j271j545j739j955k098k107
$$ 315161 312787 310081 307129 304055 301596 300596 300812 301034 300437 299166 297621 295882 293927 291829 289722
53161B89722j823j158n90p53j375j451p30p6j37n93r39j104j001m56J15k6p65
$$ 289722 287899 286741 286151 285398 284023 282572 281842 281766 281629 281036 280097 278993 277992 277536 277651 277625 276860
53144B76860j152q35m44l42j12L64N06R7k90l28l74m94j44P33J341J259J035J132
$$ 276860 275708 274873 274429 274087 273975 274339 274845 274942 274652 274324 273950 273456 273312 274045 275386 276645 277680 278812
53126B78812J275J252J390J782K017J948J875J687R37J8J1J032J907J908J563
$$ 278812 280087 281339 282729 284511 286528 288476 290351 292038 292975 292993 293004 294036 295943 297851 299414
53111B99414J339Q41p2o52n04l13o75j246j655k113k584k518j979j848k206j901
$$ 299414 300753 301594 301522 300870 300366 300053 299378 298132 296477 294364 291780 289262 287283 285435 283229 281328
53095B81328m87P81Q13K55J15K7q03j947k354j867j066k07O04Q56L21k96k81N7
$$ 281328 280841 281622 282435 282690 282805 282832 282029 280082 277728 275861 274795 274588 275192 276048 276369 276073 275792 275849
53077B75849Q6q0j12k93q76j229o82L09P69N27O0m55j088j570j663j679j900j946
$$ 275849 275935 275855 275743 275450 274574 273345 272663 272972 273741 274268 274328 273873 272785 271215 269552 267873 265973 264027
53059B64027j480r32p38m52M10J161P61m50j008k45R80J575J417J153J369K096
$$ 264027 262547 261615 260877 260425 260835 261996 262757 262307 261299 261054 262034 263609 265026 266179 267548 269644
53043B69644K760K636J680P39N63Q08M91o69j834k016j182l13l88j302j939j479
$$ 269644 272404 275040 276720 277459 278022 278830 279321 278652 276818 274802 273620 273307 272919 271617 269678 268199
53027B68199l76L40M00L09L07J77J0K12P00R52R45J126J372J018J45k81J14N66
$$ 268199 267823 268163 268563 268872 269179 269356 269366 269578 270278 271230 272175 273301 274673 275691 275836 275555 275669 276235
53009B76235M82K82M09N21L11J73M43P61P49N32J32p21j725j938j214o38r13j264
$$ 276235 276717 276999 277408 277929 278240 278413 278856 279617 280366 280898 281030 280309 278584 276646 275432 274794 273881 272617
52991B72617p33M05J338J937K374K349J644Q55O87J048J472J816K085K214K541
$$ 272617 271884 272289 273627 275564 277938 280287 281931 282786 283473 284521 285993 287809 289894 292108 294649
52976B94649L550M675M449K597P43K12L17j55r81j286j177j146p30O07J961J941
$$ 294649 298199 302874 307323 309920 310663 310875 311192 311037 310056 308770 307593 306447 305717 306324 308285 310226
52960C10226P60j02RM63O62M83k99j730k954l068k493k345k677k606k010j718
$$ 310226 310986 310884 310893 311356 312018 312501 312202 310472 307518 304450 301957 299612 296935 294329 292319 290601
52944B90601j961j988j416p80m93l16j21j85m30l35J05K15k76p27n84j88j75o11
$$ 290601 288640 286652 285236 284456 283963 283647 283526 283341 282911 282576 282681 282896 282620 281893 281309 281121 280946 280335
52926B80335j098j290j026l40M08P35N68K61M9j87n15o71l28M89J338J593R59
$$ 280335 279237 277947 276921 276581 276989 277724 278292 278553 278602 278415 277900 277229 276901 277390 278728 280321 281280
52909B81280j14p37n32j5J94J71L43O29N29q7p47r94r05r69j511k170j973l29
$$ 281280 281166 280429 279897 279882 280076 280247 280590 281219 281748 281661 280914 279920 279015 278046 276535 274365 272392 272063
52891B72063K006L481L408K533J766J093K29m43m22p0k27r61j543j486j001m26
$$ 272063 274069 277550 280958 283491 285257 286350 286579 286136 285714 285644 285417 284456 282913 281427 280426 280000
52875B80000J57O80R31R09J010J636K690L510L486K780K185K158K247J911J482
$$ 280000 280157 280837 281768 282677 283687 285323 288013 291523 295009 297789 299974 302132 304379 306290 307772
52860C07772J647K203K276J599P17j52j326k632l293l205l249l834m217l814l237
$$ 307772 309419 311622 313898 315497 316214 316062 314736 312104 308811 305606 302357 298523 294306 290492 287255
52845B87255l287l836m317m524m334l458k179j391j334j157m02J67n2l60o5K35
$$ 287255 283968 280132 275815 271291 266957 263499 261320 259929 258595 257438 257036 257203 257151 256791 256726 256961
52829B56961k13p91m45N84J314J663K162K583K192J059p0r85j937k614k394j440
$$ 256961 256748 255957 255512 256096 257410 259073 261235 263818 266010 267069 266999 266014 264077 261463 259069 257629
52813B57629m89K53J043J618J447Q42Q01J647K675L164K961K075N52j192k500
$$ 257629 257140 257393 258436 260054 261501 262343 263144 264791 267466 270630 273591 275666 276218 275026 272526
52798B72526l071l036k657k259k099j978j453p34o67j291j384k54J009J053K16
$$ 272526 269455 266419 263762 261503 259404 257426 255973 255239 254572 253281 251897 251643 252652 253705 253921
52783B53921k45j20q3j18L90J276J663J353R54P81O66O80R44R37J59p36o89Q4
$$ 253921 253676 253556 253473 253355 253745 255021 256684 258037 258991 259772 260438 261118 262062 262999 263158 262422 261733 261817
52765B61817L61j57n10j80J54j69q71j377j509j264o50K2L09K17Q3K1RL07J052
$$ 261817 262178 262021 261511 261331 261485 261316 260445 259068 257559 256295 255645 255667 255976 256193 256276 256297 256306 256613 257665
52746B57665J707J718J463J700K356K741K732K721K685K308J863J868J972J299
$$ 257665 259372 261090 262553 264253 266609 269350 272082 274803 277488 279796 281659 283527 285499 286798
52732B86798r1j106j057k77O68J435J675J339J158J854K831K681J062q68k024
$$ 286798 286707 285601 284544 284267 284935 286370 288045 289384 290542 292396 295227 297908 298970 298102 296078
52717B96078k398k439k303k000j536q54j67j36j006j855j565l27P20J070J070
$$ 296078 293680 291241 288938 286938 285402 284548 284381 284245 283239 281384 279819 279492 280212 281282 282352
52702B82352R07M99K21M94Q31M02n13q58m79j64j58L2L46J40m28m56M0k0q73j359
$$ 282352 283259 283758 283979 284473 285304 285706 285193 284335 283856 283692 283534 283566 283912 284052 283624 283168 283208 283188 282315 280956
52682B80956p82M1K33R8J53J10l61q25q22o92q87j111q65k94J30K93L87N10O40
$$ 280956 280174 280215 280448 280546 280699 280809 280448 279623 278801 278109 277222 276111 275246 274952 275082 275375 275762 276272 276912
52663B76912O33K16n44q77j18J157J694J261Q68J238K046K822L617M413M883M968
$$ 276912 277545 277761 277217 276340 276222 277379 279073 280334 281202 282440 284486 287308 290925 295338 300221 305189
52647C05189M901M350K577k51k831m206m584m355l379j785n58n02j165j423p82
$$ 305189 310090 314440 317017 316766 313935 309729 305145 300790 297411 295626 295068 294566 293401 291978 291196
52632B91196K30P22K43p39j194o87J31O50J262K345K916J745n72k166k472k501
$$ 291196 291426 292148 292391 291652 290458 289771 289902 290552 291814 294159 297075 298820 298248 296082 293610 291109
52616B91109k598j740L21K068K232J341M01n45j570j878r38L31P00K34k50n77
$$ 291109 288511 286771 287092 289160 291392 292733 293134 292589 291019 289141 288203 288534 289234 289468 289218 288641
52600B88641j042j391j042j10O39P18K78k13k66L08J061J272Q26K84Kj73l02j97
$$ 288641 287599 286208 285166 285056 285695 286413 286691 286478 286212 286520 287581 288853 289679 289963 289965 289792 289490 289293
52582B89293No1j43M55J650K475K428J979J555J058N95N58O35j3j228j809j419
$$ 289293 289298 289237 289094 289549 291199 293674 296102 298081 299636 300694 301289 301847 302482 302469 301241 299432 298013
52565B98013j108j367j205o6Q69M54n82q97n71n47r00j014q81r80j257j302j142
$$ 298013 296905 295538 294333 294267 295136 295590 295008 294111 293540 292993 292093 291079 290198 289218 287961 286659 285517
52548B85517r52m82M17J224J447J313J078M35n58r19j72N68J86n69k43R08J300
$$ 285517 284565 284083 284500 285724 287171 288484 289562 289997 289439 288520 288348 288916 289102 288533 288290 289198 290498
52531B90498N03k30N3R17J589J871J719R62q4n94k19M84Q76R43R19P66M04R8K78
$$ 290498 291001 290771 290824 291741 293330 295201 296920 297882 297798 297204 296985 297469 298345 299288 300207 300973 301377 301475 301753
52512C01753J085K160K954L314L685M544N608O025N391M087K551P84j163k863
$$ 301753 302838 304998 307952 311266 314951 319495 325103 331128 336519 340606 343157 343941 342778 339915
52498C39915m019m774n174m890l886k736j926j356r99j275k191k828k416j437
$$ 339915 335896 331122 325948 321058 317172 314436 312510 311154 310155 308880 306689 303861 301445 300008
52484C00008q73q27o78k55rj16j41L11J095J717J777J284P01N46Q40J169J293
$$ 300008 299135 298308 297630 297375 297366 297250 297109 297420 298515 300232 302009 303293 303994 304540 305380 306549 307842
52467C07842J344J431J541J854K556L310L562L420L522L954M121L754L064J875
$$ 307842 309186 310617 312158 314012 316568 319878 323440 326860 330382 334336 338457 342211 345275 347150
52453C47150k82k897m539m708m459m579m398l249j918j539j930k144j971j852
$$ 347150 346868 343971 339432 334724 330265 325686 321288 318039 316121 314582 312652 310508 308537 306685
52439C06685j776j378p04j27K03J90l80j282j660j080j57L79N33M46j45j132j640
$$ 306685 304909 303531 302827 302700 302903 303093 302713 301431 299771 298691 298534 298913 299446 299892 299747 298615 296975
52422B96975j217n48j66M92J790K758K474J679J579J883J531P66P66J627K279
$$ 296975 295758 295210 295044 295536 297326 300084 302558 304237 305816 307699 309230 309996 310762 312389 314668
52407C14668K327K475L110L861M668O028P921R572J0445J0561R705P371L660n01
$$ 314668 316995 319470 322580 326441 331109 337137 345058 354630 365075 375636 385341 392712 396372 395871
52393C95871m215p002q406q152o799n487m739m106l087j839q26l11k92n07n04
$$ 395871 391656 384654 376248 368096 361297 355810 351071 346965 343878 342039 341213 340902 340610 340103 339599
52378C39599k6O66J153J410J688K123K736L547M389M899N028N131N339N318M917
$$ 339599 339573 340239 341392 342802 344490 346613 349349 352896 357285 362184 367212 372343 377682 383000 387917
52363C87917M376L607K076j29j996k907l433m092m306l484k217j385q22OP19O07
$$ 387917 392293 395900 397976 397847 395851 392944 389511 385419 381113 377629 375412 374027 373205 373211 373930 374537
52347C74537n0l99k87m3M70J398K012J581P87R73K193L292L674L802M011M092
$$ 374537 374487 374088 373801 373758 374228 375626 377638 379219 380006 380979 383172 386464 390138 393940 397951 402043
52331D02043M089M390N040N816O885Q511J0222J1250J1656J2129J2826J3404J3901
$$ 402043 406132 410522 415562 421378 428263 436774 446996 458246 469902 482031 494857 508261 522162
52318E22162J4589J5104J4751J3565J2117J0559Q968Q294R556J2104J3992J4381
$$ 522162 536751 551855 566606 580171 592288 602847 611815 620109 629665 641769 655761 670142
52306F70142J4447J5571J7593J9259J9690J9065J8337J8394J9168J9720J9467
$$ 670142 684589 700160 717753 737012 756702 775767 794104 812498 831666 851386 870853
52295H70853J8871J8402J7564J5749J3337J0965Q330M922J365j284l073m728o092
$$ 870853 889724 908126 925690 941439 954776 965741 974071 978993 980358 979074 976001 971273 965181
52282I65181o470o194o305o833o818n993n075m429l805l236k882k173n82R59J098
$$ 965181 958711 952517 946212 939379 932561 926568 921493 917064 913259 910023 907141 904968 904386 905345 906443
52267I06443M41J008L209N284O111O569P463Q006P476O771P147Q571J0347J2339
$$ 906443 906884 907892 911101 916385 922496 929065 936528 944534 952010 958781 965928 974499 984846 997185
52253I97185J4566J6443J7450J7917J8382J8744J8560J7559J5478J2151Q185M872
$$ 997185 1011751 1028194 1045644 1063561 1081943 1100687 1119247 1136806 1152284 1164435 1172620 1177492
52241A177492K899J809Q43l96k211m647o845p673p353p384q425r468r626r544
$$ 1177492 1180391 1182200 1183043 1182647 1180436 1175789 1168944 1161271 1153918 1146534 1138109 1128641 1119015 1109471
52227A109471j0162j1198j1675j1272j0347r286q478q307q579q561p946p145o311
$$ 1109471 1099309 1088111 1076436 1065164 1054817 1045531 1037053 1028746 1020167 1011606 1003660 996515 990204
52214I90204n047l400k207j845j602q50R8R69K266M197N791O055N333M564L885
$$ 990204 985157 981757 979550 977705 976103 975253 975351 976320 978586 982783 988574 994629 999962 1004526 1008411
52199A008411K991K282K522L599M608N126N624O643Q094R414R998R613Q614P584
$$ 1008411 1011402 1013684 1016206 1019805 1024413 1029539 1035163 1041806 1049900 1059314 1069312 1078925 1087539 1095123
52185A095123O627N365L721K138Q17o99k772n065p139r057j0879j2012j1708j0045
$$ 1095123 1101750 1107115 1110836 1112974 1113791 1113092 1110320 1105255 1098116 1089059 1078180 1066168 1054460 1044415
52171A044415p971o373n452m879m343l901l723l501k500n33J474K503K744L154
$$ 1044415 1036444 1030071 1024619 1019740 1015397 1011496 1007773 1004272 1001772 1001239 1002713 1005216 1007960 1011114
52157A011114L935M302L741K622J466M36l67q45j274j986k595k363j299j39P58
$$ 1011114 1015049 1019351 1023092 1025714 1027180 1027616 1027249 1026404 1025130 1023144 1020549 1018186 1016887 1016748 1017506
52142A017506J612K362K566K317K161K049J326qj125j554j537j095N7J505K342
$$ 1017506 1019118 1021480 1024046 1026363 1028524 1030573 1031899 1031891 1030766 1029212 1027675 1026580 1026637 1028142 1030484
52127A030484K749L999O475R003J0763J2453J4831J7388J9412K1179K3031K4300
$$ 1030484 1033233 1037232 1043707 1052710 1063473 1075926 1090757 1108145 1127557 1148736 1171767 1196067
52115A196067K4264K3406K2717K2375K1945K1218K0124J8461J6470J4924J4006
$$ 1196067 1220331 1243737 1266454 1288829 1310774 1331992 1352116 1370577 1387047 1401971 1415977
52104A415977J2890J1180R884J0104J1500J2969J4109J4966J5085J3878J1591
$$ 1415977 1428867 1440047 1449931 1460035 1471535 1484504 1498613 1513579 1528664 1542542 1554133
52093A554133Q970O256L252p9l706p709j1731j4912j6965j8677k0483k1358k0153
$$ 1554133 1563103 1569359 1572611 1572532 1568826 1561117 1549386 1534474 1517509 1498832 1478349 1456991 1436838
$$ [...]
##END NTUPLES=NMR SPECTRUM
##END=
