##TITLE=Coffee green (M1-ROVE10 + 1.5mL buffer 50/50,  450uL extracto + 50uL (D2O+TMS))
without heating, vortex and centrifuged, temperature 0oC.
##JCAMPDX= 6.0         $$ Bruker NMR JCAMP-DX V2.0
##DATA TYPE= NMR SPECTRUM
##DATA CLASS= NTUPLES
##ORIGIN= Bruker BioSpin GmbH
##OWNER= Administrator
$$ 1.72 TOPSPIN		Version 2.1
$$ 2012-05-22 16:10:56.434 -0700  Administrator@X
$$ Compression mode = diff/dup
##.OBSERVE FREQUENCY= 400.13188202
##.OBSERVE NUCLEUS= ^1H
##.ACQUISITION MODE= SIMULTANEOUS (DQD)
##.ACQUISITION SCHEME= undefined
##.AVERAGES= 64
##.DIGITISER RES= 22
##SPECTROMETER/DATA SYSTEM= spect
##.PULSE SEQUENCE= noesygppr1d
##.SOLVENT NAME= H2O+D2O
##.SHIFT REFERENCE= INTERNAL, H2O+D2O, 1, 14.97979
##AUDIT TRAIL= $$ (NUMBER, WHEN, WHO, WHERE, PROCESS, VERSION, WHAT)
$$ ##TITLE= Audit trail, TOPSPIN		Version 2.1
$$ ##JCAMPDX= 5.01
$$ ##ORIGIN= Bruker BioSpin GmbH
$$ ##OWNER= Administrator
$$ $$ c:\Bruker\TOPSPIN/data/jwist/nmr/11-coffee-green-quantification-2/21/pdata/1/auditp.txt
$$ ##AUDIT TRAIL=  $$ (NUMBER, WHEN, WHO, WHERE, PROCESS, VERSION, WHAT)
(   1,<2011-11-17 13:19:11.450 -0500>,<Administrator>,<TOPSPIN>,<go>,<TOPSPIN 2.1>,
      <created by zg
	started at 2011-11-17 13:10:16.825 -0500,
	POWCHK enabled, PULCHK disabled,
       configuration hash MD5:
       DA 63 81 1B EF 4C B5 72 B4 DF EA D9 B4 DB 4C 08
       data hash MD5: 64K
       11 F3 6E 10 07 38 C2 EC 21 DF C2 17 10 E5 E3 E6>)
(   2,<2011-11-17 18:14:00.544 -0500>,<Administrator>,<TOPSPIN>,<proc1d>,<TOPSPIN 2.1>,
      <Start of raw data processing
       efp LB = 0 FT_mod = 6 PKNL = 1 PHC0 = 0 PHC1 = 0 SI = 32K 
       data hash MD5: 32K
       85 12 03 D7 B5 56 C2 BC EA 80 D3 28 46 DF 56 D4>)
(   3,<2011-11-17 18:14:00.935 -0500>,<Administrator>,<TOPSPIN>,<proc1d>,<TOPSPIN 2.1>,
      <pk PHC0 = 19.25354 PHC1 = 0 
       data hash MD5: 32K
       BC 97 7D D4 68 07 E9 4A 58 E2 DD 54 A1 29 DF EA>)
$$ ##END=
$$ 
$$ $$ hash MD5
$$ $$ FA E2 AB DB CD CE 6B 1F 00 A6 A9 97 9F 41 26 4F
##$RELAX= 
##$RELAX= 
##$RELAX= 
##$RELAX= 
##$RELAX= 
##$RELAX= 
##$RELAX= 
$$ Bruker specific parameters
$$ --------------------------
##$DU= <Z:>
##$EXPNO= 21
##$NAME= <11-coffee-green-quantification-2>
##$PROCNO= 1
##$TYPE= <nmr>
##$USER= <jwist>
##$ACQT0= -8.14905778609495
##$AMP= (0..31)
100 100 100 100 100 100 100 100 100 100 100 100 100 100 100 100 100 100
100 100 100 100 100 100 100 100 100 100 100 100 100 100
##$ANAVPT= -1
##$AQSEQ= 0
##$AQ_mod= 3
##$AUNM= <au_prof>
##$AUTOPOS= <>
##$BF1= 400.13
##$BF2= 400.13
##$BF3= 400.13
##$BF4= 400.13
##$BF5= 400.13
##$BF6= 400.13
##$BF7= 400.13
##$BF8= 400.13
##$BYTORDA= 0
##$CFDGTYP= 0
##$CFRGTYP= 9
##$CHEMSTR= <none>
##$CNST= (0..63)
1 1 145 1 1 1 1 1 1 1 1 1 1 1 1 1 1 1 1 1 1 1 1 1 1 1 1 1 1 1 1 1 1 1 1
1 1 1 1 1 1 1 1 1 1 1 1 1 1 1 1 1 1 1 1 1 1 1 1 1 1 1 1 1
##$CPDPRG= <>
##$CPDPRG1= <>
##$CPDPRG2= <>
##$CPDPRG3= <>
##$CPDPRG4= <mlev>
##$CPDPRG5= <mlev>
##$CPDPRG6= <mlev>
##$CPDPRG7= <mlev>
##$CPDPRG8= <mlev>
##$CPDPRGB= <>
##$CPDPRGT= <>
$$ [...]
150 150 150 150 150 150 150 150
##$TP07= 0
##$TPNAME0= <>
##$TPNAME1= <>
##$TPNAME2= <>
##$TPNAME3= <>
##$TPNAME4= <>
##$TPNAME5= <>
##$TPNAME6= <>
##$TPNAME7= <>
##$TPOAL= (0..7)
0.5 0.5 0.5 0.5 0.5 0.5 0.5 0.5
##$TPOFFS= (0..7)
0 0 0 0 0 0 0 0
##$TUNHIN= 0
##$TUNHOUT= 0
##$TUNXOUT= 0
##$USERA1= <user>
##$USERA2= <user>
##$USERA3= <user>
##$USERA4= <user>
##$USERA5= <user>
##$V9= 5
##$VALIST= <valist>
##$VCLIST= <CCCCCCCCCCCCCCC>
##$VD= 0
##$VDLIST= <DDDDDDDDDDDDDDD>
##$VPLIST= <PPPPPPPPPPPPPPP>
##$VTLIST= <TTTTTTTTTTTTTTT>
##$WBST= 2048
##$WBSW= 25
##$XGAIN= (0..3)
0 0 0 0
##$XL= 0
##$YL= 0
##$YMAX_a= 5134004
##$YMIN_a= -2075849
##$ZGOPTNS= <>
##$ZL1= 120
##$ZL2= 120
##$ZL3= 120
##$ZL4= 120
##$ABSF1= 0
##$ABSF2= 0
##$ABSG= 0
##$ABSL= 0
##$ALPHA= 0
##$AQORDER= 0
##$ASSFAC= 0
##$ASSFACI= 0
##$ASSFACX= 0
##$ASSWID= 0
##$AUNMP= <proc_prof1d>
##$AXLEFT= 0
##$AXNAME= <>
##$AXNUC= <1H>
##$AXRIGHT= 0
##$AXTYPE= 0
##$AXUNIT= <>
##$AZFE= 0.1
##$AZFW= 0.1
##$BCFW= 0
##$BC_mod= 0
##$BYTORDP= 0
##$COROFFS= 0
##$CY= 15
##$DATMOD= 1
##$DC= 0
##$DFILT= <>
##$DTYPP= 0
##$F1P= 7.88227019145625
##$F2P= 6.17227355901223
##$FCOR= 0.5
##$FTSIZE= 32768
##$FT_mod= 6
##$GAMMA= 0
##$GB= 0
##$INTBC= 1
##$INTSCL= 1.217802e-010
##$ISEN= 128
##$LB= 0
##$LEV0= 0
##$LPBIN= 0
##$MAXI= 10000
##$MC2= 0
##$MEAN= 0
##$ME_mod= 0
##$MI= 0.1
##$NCOEF= 0
##$NC_proc= -6
##$NLEV= 6
##$NOISF1= 0
##$NOISF2= 0
##$NSP= 0
##$NTH_PI= 0
##$NZP= 0
##$OFFSET= 14.97979
##$PC= 1
##$PHC0= 19.25354
##$PHC1= 0
##$PH_mod= 1
##$PKNL= yes
##$PPARMOD= 0
##$PPDIAG= 0
##$PPIPTYP= 0
##$PPMPNUM= 2147483647
##$PPRESOL= 1
##$PSCAL= 4
##$PSIGN= 0
##$PYNMP= <proc.py>
##$REVERSE= no
##$SF= 400.13
##$SI= 32768
##$SIGF1= 0
##$SIGF2= 0
##$SINO= 400
##$SIOLD= 32768
##$SPECTYP= <>
##$SREGLST= <1H.H2O+D2O>
##$SSB= 0
##$STSI= 32768
##$STSR= 0
##$SW_p= 8223.68421052629
##$SYMM= 0
##$S_DEV= 0
##$TDeff= 65536
##$TDoff= 0
##$TI= <>
##$TILT= no
##$TM1= 0
##$TM2= 0
##$TOPLEV= 0
##$USERP1= <user>
##$USERP2= <user>
##$USERP3= <user>
##$USERP4= <user>
##$USERP5= <user>
##$WDW= 1
##$XDIM= 32768
##$YMAX_p= 421709396
##$YMIN_p= -56794934
##$CURPLOT= <Network HP LaserJet P1505>
##$CURPRIN= <integrals_lipp.txt>
##$DFORMAT= <normdp>
##$LAYOUT= <+/1D_H.xwp>
##$LFORMAT= <normlp>
##$PFORMAT= <normpl>
##$SURQMSG= 1
$$ End of Bruker specific parameters
$$ ---------------------------------
##NTUPLES= NMR SPECTRUM
##VAR_NAME=  FREQUENCY,     SPECTRUM/REAL,   SPECTRUM/IMAG
##SYMBOL=    X,             R,               I
##VAR_TYPE=  INDEPENDENT,   DEPENDENT,       DEPENDENT
##VAR_FORM=  AFFN,          ASDF,            ASDF
##VAR_DIM=   32768,         32768,           32768
##UNITS=     HZ,            ARBITRARY UNITS, ARBITRARY UNITS
##FACTOR=    0.250966925370065, 1,           1
##FIRST=     8223.43324360092, -12749,       -235159
##LAST=      0,             -106158,         -77070
##MIN=       0,             -56794934,       0
##MAX=       8223.43324360092, 421709396,    0
$$ Real data points
##PAGE= N=1
##DATA TABLE= (X++(R..R)), XYDATA
$$ [...]
19699B032745k89565J90526j70669J21827R4004p9771k2627j42352N7577L6546
19689A828241N4775j46674R9404J3700L888Q3002j20510k1118Q1867K250j78630
19678A700195k73682M86569k09538n8399J10701J04228p3132o0260J11843k37657
19668A600868J82905j97882J37539J13694j52781R0948k2028k06922J97979J73078
19658A917398l19661R8392J00475j0447J34632m39604L07115N6445n3492j10344
19648A680909l801q1993r2967K23330n8625J17871j85385K8219J00675J2367O3996
19637A804596j45579m5767K0041K17190j59073n001k42778J92232J08630m3102
19627A701389L2859Q3374j847k32993J28217j42758j46232J88497j23779J95578
$$ y = [2032745, 1743180, 1933706, 1763037, 1884864, 1978868, 1899097, 1876470, 1734118, 1791695, 1828241, 1883016, 1736342, 1835746, 1849446, 1853334, 1936336, 1815826, 1794708, 1876575, 1878825, 1700195, 1426513, 1913082, 1703544, 1645145, 1755846, 1860074, 1786942, 1726682, 1838525, 1600868, 1783773, 1585891, 1723430, 1837124, 1684343, 1775291, 1753263, 1546341, 1744320, 1917398, 1597737, 1696129, 1796604, 1786157, 1920789, 1481185, 1788300, 1844745, 1791253, 1680909, 1677108, 1595115, 1502148, 1725478, 1666853, 1784724, 1599339, 1627558, 1728233, 1740600, 1804596, 1659017, 1613250, 1633291, 1850481, 1691408, 1686407, 1443629, 1635861, 1744491, 1701389, 1734248, 1817622, 1815775, 1582782, 1710999, 1568241, 1422009, 1610506, 1486727, 1682305]
19617A682305k98648K50471l17160k552J82207J619J8423j66311O0094j47757
19607A262691J77962J84191m94702J85616J98577k04192j29560J76656j12003
19598A245236L3096N8489J46929r8245j56262j53726K96895j22097J78571k04166
19588A224720K96146l4976j88447J7851O8292M3750p0156r0533J13818j62394
19578A218071K44843j62763p2895p8871R6205Q0277q081K8416k7684K306J12875
19567A432699l31226R4486j62956K63826k85003J52321K59216r3117k98739K70624
19557A302131l04334O5550J50326j60458J85459o6368J076p883Q1445K1218J68307
19546A436469k50469J4672J26213j26472j7856L3304J53898r9116K26184k81024
$$ y = [1682305, 1383657, 1634128, 1316968, 1314416, 1496623, 1498242, 1516665, 1350354, 1410448, 1262691, 1440653, 1624844, 1130142, 1315758, 1514335, 1310143, 1180583, 1357239, 1245236, 1278332, 1336821, 1483750, 1385505, 1229243, 1075517, 1372412, 1250315, 1428886, 1224720, 1520866, 1485890, 1297443, 1315294, 1383586, 1427336, 1357180, 1266647, 1380465, 1218071, 1462914, 1300151, 1227256, 1148385, 1244590, 1324867, 1316786, 1345202, 1317518, 1319824, 1432699, 1101473, 1195959, 1033003, 1296829, 1011826, 1164147, 1423363, 1330246, 1031507, 1302131, 997797, 1063347, 1213673, 1053215, 1238674, 1172306, 1173382, 1165499, 1246944, 1268162, 1436469, 1186000, 1200672, 1326885, 1200413, 1182557, 1215861, 1369759, 1270643, 1496827, 1215803]
19536A215803J34038J01278k86577K06263j7959k72923J78231k61252P8308j04879
19526I70331K92831P2891K02577k32441o0811k82196K18167K27281J6021k78120
19516A146531J83904j91734n0789J12544O5404j14461J21177n7634m022j16149
19506A094771J52946n2412J0820K11728l98599K2928K17689k01618J59685k45561
19496I72377J53621l85l2468j41628L21625k10170K35172j9228j05127j10285
19486A063504r261j02885K55848O9681k45021J77947k1315k46008J24384M1816
19476A108690r6035p7958M6696k57459K97460K962j65079N5127k1695j02016K34223
19465A024916j61685r7759k1753J34410j60888p2399J10587j34492K10996j5699
$$ y = [1215803, 1349841, 1451119, 1164542, 1370805, 1352846, 1079923, 1258154, 996902, 1075210, 970331, 1263162, 1336053, 1538630, 1306189, 1245378, 963182, 1181349, 1408630, 1424651, 1146531, 1330435, 1138701, 1087912, 1200456, 1265860, 1151399, 1272576, 1214942, 1210920, 1094771, 1247717, 1195305, 1206125, 1417853, 1019254, 1042182, 1259871, 1058253, 1217938, 972377, 1125998, 1125613, 1093145, 951517, 1273142, 1062972, 1298144, 1278916, 1173789, 1063504, 1054243, 951358, 1207206, 1276887, 1031866, 1209813, 1188498, 942490, 1066874, 1108690, 1012655, 934697, 981393, 723934, 1021394, 1024356, 859277, 914404, 892709, 790693, 1024916, 863231, 765472, 743719, 878129, 717241, 644842, 755429, 620937, 831933, 816234]
19455H16234j9156l8232K2435q7684J04077Q138n4766n5325m4294J88875j36615
19444G03687L2895J43347l5892J66682m04667L0140M13970k97257J5430L18523
19434A086858k96395j55989K38684j45249k06454K99480o8857j1061R9565Q953
19424H49535r7410m1616J7350p8139L2507j10084M223K61102j51817k368N2301
19413G35584J27650P8541k45113R4183J67782n7781p4800k1362J26970j23872
19403H07782j08929J30518o4118P243k43615R4199K46064r3979R6266q9211r8333
19392F83887K53172k50555J29750k48843O9902K86531q7801J7882J2343L6945
19382I03213q7006j38975L46393m23010J95511J09959r7845J25448j14781j21241
$$ y = [816234, 797078, 758846, 781281, 693597, 797674, 805812, 751046, 695721, 651427, 840302, 703687, 736582, 879929, 844037, 1010719, 606052, 636192, 1050162, 752905, 768335, 1086858, 790463, 634474, 873158, 727909, 521455, 820935, 752078, 741017, 840582, 849535, 752125, 710509, 727859, 649720, 682227, 572143, 576366, 837468, 685651, 683283, 735584, 863234, 941775, 696662, 790845, 958627, 900846, 826046, 804684, 931654, 807782, 698853, 829371, 765253, 772496, 528881, 623080, 869144, 775165, 871431, 782220, 683887, 937059, 686504, 816254, 567411, 637313, 923844, 836043, 853925, 866268, 903213, 816207, 677232, 1023625, 600615, 796126, 906085, 808240, 933688, 818907, 697666]
19372F97666p8446K00442k46439K92460k14327J92587q6592J07275k08351R5954
19362G52229k5542R2790n3977q8484q8472P064K19165j19832K12415n2975o645
19351H47736j83137J32801j16559o7857R4350J36974L9357J5620j52826J52042
19341H98501J17663j6540k07930J88334l4314j70974K73924j21070O5048L5483
19331A028125K0219k20546J44069o3293k927q9196M508k0355m2230K9674P3882
19320H61930k11666K17586j99662L30902l08111l42K60283l89996j41330K85237
19310G04831J48085l65432K39124j40725J53964j59156J18835j32445K13596j61638
19300F19039N4741P4003q9363n773o4469K79430k91860l5215O3128j12136J19408
$$ y = [697666, 619220, 819662, 573223, 865683, 651356, 843943, 757351, 864626, 656275, 752229, 726687, 819477, 765500, 677016, 588544, 595608, 814773, 694941, 907356, 854381, 847736, 664599, 797400, 680841, 612984, 707334, 844308, 883665, 899285, 746459, 898501, 1016164, 999624, 791694, 980028, 945714, 774740, 1048664, 927594, 992642, 1028125, 1048344, 827798, 971867, 908574, 905647, 816451, 820959, 800604, 758374, 788048, 861930, 650264, 867850, 668188, 999090, 690979, 690637, 950920, 560924, 419594, 704831, 852916, 487484, 726608, 585883, 739847, 580691, 699526, 567081, 780677, 619039, 673780, 747783, 658420, 652647, 588178, 867608, 575748, 540533, 603661, 491525, 610933]
19289F10933K16738k55875J94096l70433J59889j1754Q9104P7495o4818m3191
19279F02184J36207O5749L3586j29223O0259j62669M2819K00229j80319R9565
19269G68387k39173O7560P4921K44974j30824o5529J24398o7222j28705j14292
19259E34495J94526K2189N0688j01970K32667k88131K22300k84472j06731K92480
19249G68041j80612l0736J91509O3073k8250K11191N6456O0980K18160l80569
19239I49243Q5540Q3154q480L0413q3383j73431k7664N7119j8065j70406N5477
19228G79517k61854R0486m2391P0035j1361K35579k57560j721K06071k12958j27477
19217D66366J45089J66496l18132L23978q3171r0942k5250J20495r5532J13475
$$ y = [610933, 827671, 571796, 765892, 395459, 555348, 543594, 632698, 710193, 645375, 602184, 738391, 804140, 837726, 708503, 768762, 606093, 648912, 849141, 668822, 768387, 529214, 596774, 671695, 916669, 785845, 720316, 844714, 777492, 648787, 534495, 729021, 751210, 801898, 699928, 932595, 644464, 866764, 582292, 475561, 768041, 587429, 556693, 748202, 811275, 783025, 994216, 1050672, 1111652, 1329812, 949243, 1034783, 1117937, 1109457, 1139870, 1056487, 883056, 855392, 912511, 894446, 724040, 779517, 517663, 608149, 565758, 635793, 624432, 860011, 602451, 600730, 806801, 593843, 466366, 611455, 777951, 459819, 783797, 700626, 609684, 584434, 704929, 609397, 722872]
19207G22872k6818q6458K52247j93764m7172j0401K90678j95729N228p3958K14998
19196H51723j52037k03134K05230j43688Q8605J26827K8679j52546j78961J27137
19186E97835Q6093J46812j93444J25120P5145k82180L94684o5577J29366M5918
19176A059772l66576L01511N5258k24964L39577l18476P1238k39713K24006R887
19166I11520l028L2531j16600K79876k88904K31071J02236l9124k89316K33459
19156A053721k02690K4652J18388K3836j42760m2845J80183q4679j83023J55693
19146I00476p7636J4662J08973m2541o6709Q8619J02493j33099j9934L76501j19475
19135A132330j75358J27500o2076k27288L9847K90640J51698j03938l12632J72925
$$ y = [722872, 696054, 609596, 861843, 668079, 620907, 610506, 901184, 705455, 710683, 636725, 851723, 699686, 496552, 701782, 558094, 646699, 773526, 802205, 649659, 470698, 597835, 683928, 830740, 637296, 762416, 837561, 555381, 950065, 884488, 1013854, 1059772, 693196, 994707, 1049965, 825001, 1164578, 846102, 917340, 677627, 901633, 911520, 908492, 941023, 824423, 1104299, 815395, 1046466, 1148702, 1109578, 820262, 1053721, 851031, 875683, 994071, 1017907, 875147, 832302, 1012485, 927806, 744783, 900476, 822840, 837502, 946475, 903934, 837225, 925844, 1028337, 895238, 875304, 1251805, 1132330, 956972, 1084472, 1022396, 795108, 834955, 1125595, 1277293, 1173355, 860723, 1033648]
19125A033648q5572o5879J81817J37255j97136J46904R7423J89908O3938l8154
19115A464152L525K20092K57746k3875N96534M30022N05746K77492J95170M32441
19105D359045J91065m4192M9018J41934p29912k51586o67651l87686j92099k66848
19095B201088k52407k38552N2003j49590o6182l7077r9754j21793M20616l08774
19085A399578J05935N00840l7362P87687M41641L03491J06607L89302M23503K36154
19075D657376k23334M36356R8853k10121j14431k94552k40492k4989J53787l19970
19065C918483m45004K88467o64705l66691m69381j32171k6761m25438M4547N7793
19055A779139j70917Q8236k7117J53802k57225L34955J40028L8056N05308N14272
$$ y = [1033648, 948076, 882197, 1064014, 1201269, 1004133, 1151037, 1248460, 1438368, 1502306, 1464152, 1467677, 1687769, 1945515, 1921640, 2518174, 2948196, 3453942, 3731434, 3926604, 4359045, 4550110, 4505918, 4554936, 4696870, 3966958, 3715372, 3047721, 2660035, 2467936, 2201088, 1948681, 1710129, 1762132, 1612542, 1546360, 1509283, 1409529, 1287736, 1708352, 1399578, 1505513, 2006353, 1968991, 2756678, 3198319, 3501810, 3608417, 3997719, 4421222, 4657376, 4434042, 4870398, 4969251, 4759130, 4644699, 4350147, 4109655, 4084666, 4238453, 3918483, 3473479, 3761946, 3097241, 2730550, 2261169, 2128998, 2102237, 1676799, 1721346, 1779139, 1608222, 1696458, 1669341, 1823143, 1565918, 1900873, 2040901, 2078957, 2584265, 3098537]
19045C098537N26952K66070L85864J41062K44170m3691N2704k67066m72878m37893
19035C493831m62028n33676m41640j79174j98595J07943j08541R4560L3911j20550
19025A686041J09718R2681q7775K01565L99886J95868J51692N77811M28700L93540
19015D149727N60373K70213J11056N43789K96841n2007M85651p3180j41886L68868
19005F519445O38393K72456Q13219Q91622J057121J446798J648417J995915J895541
18996A7178927J751320J268396J268762K69029O0153q22915j542186j871257k399018
18987A5161211k418099k040768k131376j204752j369611p40422q64751n07589
18979C883843j86635n66953l00076p9727l37718l73213J30505j99182j27690l3771
$$ y = [3098537, 3625489, 3891559, 4277423, 4418485, 4662655, 4618964, 4671668, 4404602, 3931724, 3493831, 3031803, 2498127, 2056487, 1877313, 1678718, 1786661, 1678120, 1772680, 1806591, 1686041, 1795759, 1888440, 1800665, 2002230, 2402116, 2597984, 2749676, 3327487, 3756187, 4149727, 4710100, 4980313, 5091369, 5635158, 5931999, 5879992, 6365643, 6292463, 6150577, 6519445, 7157838, 7430294, 8243513, 9135135, 10192256, 11639054, 13287471, 15283386, 17178927, 18930247, 20198643, 21467405, 21736434, 21796587, 20973672, 19431486, 17560229, 15161211, 12743112, 10702344, 8570968, 7366216, 5996605, 5256183, 4391432, 3883843, 3697208, 3130255, 2830179, 2750452, 2412734, 2039521, 2170026, 1970844, 1843154, 1809383]
18969A809383N5019j10536k08106R1033j24914J08045l4752K78419j96772k63767
18959A403052K68739j61460N9729J25176p9020K4534J13775M4027j3654J94756
18949A979654J60674P7250K31180K67137L3934N2922M41116L19351N19482P47024
18939D829724R43676J030646J341142J630573K130191K193923J681280J810493
18931A7591648J284772R46462K82668m09590j090441j600813k130864k002972
18923A2870870k059123k163979j575935j197741j024469q17698m19833m41737
18915C170355l23720o67269M0934k23197P4454m27955k26380r3322L7635J3192
18905A374727k71706j5935J5283j48585J96039l47415k00513M436K17897J42152
$$ y = [1809383, 1864402, 1753866, 1545760, 1636793, 1511879, 1619924, 1585172, 1863591, 1666819, 1403052, 1671791, 1510331, 1570060, 1695236, 1616216, 1640750, 1754525, 1798552, 1784898, 1979654, 2140328, 2217578, 2448758, 2715895, 2749829, 2802751, 3243867, 3563218, 4082700, 4829724, 5773400, 6804046, 8145188, 9775761, 11905952, 14099875, 15781155, 17591648, 18876420, 19822882, 20105550, 19695960, 18605519, 17004706, 14873842, 12870870, 10811747, 8647768, 7071833, 5874092, 4849623, 4031925, 3612092, 3170355, 2846635, 2179366, 2220300, 1997103, 2071557, 1643602, 1417222, 1323900, 1361535, 1374727, 1103021, 1087086, 1102369, 953784, 1149823, 802408, 601895, 606331, 824228, 966380]
18895I66380k48254J56332p368q9963j27744N3475j38854K39301p113j03218n4377
18884F38597J14843m0355q7335l65J5595N8584q6564L8188j96609K03197n6837
18873F00939j90305L9351K22868Q3684n6076n5206r4722J01962R0827o9451N9154
18862G33025j71747q5098K23596k34998K13549k77662M30327D14363L6998M9873
18852E01234J44896k0580n0963R4836j87635J00943R6423k7810m5448J95548j11495
18841F89949k54176n7152L4161J37725J80910j99785p5230J34043L1656o8258
18831E53843K77907k15478j66066Q6278l9604P7112r6660q6026L1039J67851R2165
18820F82361C36381L07630k4189M7820q6155J03775j64647P2641r0339J73564
$$ y = [966380, 718126, 874458, 867090, 777127, 649383, 702858, 564004, 803305, 796192, 692974, 638597, 753440, 713085, 625750, 625385, 640980, 699564, 613000, 651188, 454579, 657776, 600939, 410634, 449985, 672853, 756537, 700461, 645255, 550533, 652495, 743322, 673871, 733025, 561278, 476180, 699776, 464778, 678327, 400665, 830992, 414363, 451361, 501234, 646130, 625550, 574587, 669423, 481788, 582731, 679154, 651344, 605896, 801444, 689949, 435773, 378621, 412782, 550507, 731417, 531632, 456402, 590445, 622101, 553843, 831750, 616272, 450206, 536484, 496880, 573992, 477332, 391306, 422345, 590196, 682361, 336381, 644011, 619822, 667642, 581487, 685262, 520615, 593256, 502917, 676481]
18810F76481j49860K01004L2812o8903N9379j03911j94638K24039j53965K09312
18800G31750R0717j25661l4624N6814R357r3295k80373M46881j73772j82524J83725
18789F28995M5025o7477p7068L34392j70783K1037O4622o9843j50623P0450J39067
18778G67794q4j29020n2848j6736J24330q034j33646j396L3113N7888J30309l79089
18766C92581K55302n9273k72896K46729q5694O3695K8343j80014K74423j41779
18756E21417J20315m4958P1068j16386B69438L53446N6006j01576K95154k95860
18746E76608L0526j28532J53695p3646L6857m5246o4987J91728p0390N7026j24269
18735E39370l5797N1116O9492j33082K39411o3197q5433P9292j71119j03076J65248
$$ y = [676481, 526621, 727625, 760437, 691534, 750913, 647002, 452364, 676403, 522438, 731750, 822467, 696806, 662182, 718996, 728353, 635058, 354685, 801566, 627794, 445270, 628995, 674020, 606543, 529475, 863867, 693084, 714121, 778743, 708900, 558277, 628727, 767794, 767710, 638690, 585842, 569106, 693436, 685402, 551756, 550360, 583473, 641361, 771670, 392581, 647883, 588610, 315714, 562443, 476749, 540444, 568787, 388773, 663196, 521417, 641732, 596774, 667842, 551456, 269438, 622884, 678890, 577314, 872468, 576608, 607134, 478602, 632297, 558651, 595508, 550262, 485275, 677003, 606613, 663639, 539370, 503573, 554689, 624181, 491099, 730510, 667313, 581880, 661172, 490053, 386977, 552225]
18724E52225B61817Q7510R3537L01458k76708Q98J79457k39515J54718j30486
18714D32686J7753J8064n0466K43886m6034P920p6790j32334L9359N3973l4302
18703D73715P3308J21948j58659l6453J03398N6601p8094K2504j71124J53039
18693E60183J35326j65199r253p4694J76363q1886r1918J3096k9135L48681l24107
18682D57457L9962o3475K42353N4697k50817L4820n9893r4312M00777k6272k19863
18671E15434N5O8876R4958j7203m6686O2137C23065J53073K8317L00783k63706
18660E41532m5349j9824J63272k50611K55025k19729K06801Q306p2589m1823L33557
18649H58568B99742J34517P5605J06189m7855k07457K76048A80479L93149j45285
$$ y = [552225, 261817, 349327, 442864, 744322, 467614, 468512, 647969, 408454, 563172, 432686, 450439, 468503, 418037, 661923, 615889, 623809, 547019, 414685, 454044, 508017, 473715, 547023, 668971, 510312, 473859, 577257, 633858, 555764, 578268, 407144, 560183, 695509, 530310, 521057, 446363, 622726, 540840, 448922, 462018, 432883, 781564, 457457, 497419, 433944, 676297, 730994, 480177, 514997, 455104, 360792, 761569, 735297, 515434, 515489, 584365, 679323, 662120, 615434, 677571, 323065, 476138, 504455, 805238, 541532, 496183, 476359, 639631, 389020, 644045, 424316, 631117, 639423, 566834, 525011, 858568, 299742, 434259, 509864, 616053, 568198, 360741, 636789, 180479, 573628, 428343]
18639D28343j7418l4524K41907n2269j93246K6546J44513R13j25808J28808N8368
18628F06133k76193j3860K82109k4855o5237o2146n0805J49047N1385k4253Q875
18617E80200r5785J67648k90686J27604J00618J12619j17213k1368J38078o4244
18607F37471M780R0766J16567k35262j43578M5823K60974l25227O2138M04376
18597I18828k3069j45737k98845J86879J54197m9027L4256k47571J21012l9993
18587F10930j10201k0597Q6199K11470j20181q6712m2153K21177n6289k5727l2129
18576F35787j8437J24130k71814J95461j25740j39576j5518J9883L8213J33597
18566E75986m0573J28561j58182M8426J74089J3045l33261K17288q5340j14404
$$ y = [428343, 410925, 376401, 618308, 566039, 372793, 399339, 543852, 544765, 418957, 547765, 606133, 329940, 316080, 598189, 573334, 508097, 445951, 395146, 544193, 595578, 571325, 580200, 484415, 652063, 361377, 488981, 589599, 702218, 585005, 563637, 701715, 637471, 642251, 733017, 849584, 614322, 470744, 516567, 777541, 452314, 514452, 918828, 895759, 750022, 451177, 638056, 792253, 743226, 777482, 529911, 650923, 610930, 500729, 480132, 566331, 777801, 657620, 570908, 528755, 749932, 693643, 667916, 635787, 617350, 741480, 469666, 665127, 539387, 399811, 384293, 404176, 442389, 575986, 535413, 663974, 505792, 554218, 728307, 741352, 408091, 625379, 540039, 425635]
18556D25635R3945P8818B93056K35512N2414n22N1980B61559J49132j9504j2764
18545C78423J58427n1878k08790K48785K48023k17917P3611j22703J37192j53177
18535D89996j38257J35633j57905j3338J94230l0158n5335L9591K0591j4896R031
18524D79183k265n4059l4148K38883j55541K6623j94090K64793n6788n927j30071
18513C76593k1205A68174L84716o1850O0532B56584L39650k33334Q891M2737j36050
18502B78478J86492M9392j35571L06628k59115l2596K21049n276k7384m5867j74748
18491C61482m9264K60808j50692J69729k28113Q7447J8718J28235N0711k10517
18481D38544Q4856J64297l00350J76294L1763j38012j11003K54241L3155k84496
$$ y = [425635, 519580, 598398, 293056, 528568, 580982, 580460, 632440, 261559, 410691, 391187, 378423, 536850, 484972, 276182, 524967, 772990, 555073, 628684, 505981, 643173, 489996, 351739, 487372, 329467, 316129, 510359, 480201, 424866, 464457, 485048, 470152, 479183, 476918, 422859, 388711, 627594, 472053, 498676, 304586, 569379, 512591, 506664, 376593, 355388, 168174, 552890, 491040, 551572, 256584, 596234, 362900, 371791, 414528, 278478, 464970, 514362, 378791, 685419, 426304, 393708, 614757, 609481, 582097, 536230, 361482, 312218, 573026, 422334, 592063, 363950, 451397, 470115, 598350, 649061, 438544, 523400, 687697, 387347, 563641, 595404, 457392, 346389, 600630, 633785, 349289]
18471C49289K00620j41423K46121l0697R771k12547L8770J19473Q0683R6429l3928
18460G22561O2004l31316O8557O4394R5304Q0456p0025K05747k58643J26152j73456
18449E91735j30750K08882q1973M5851j72103P5816J11280q4371k71968J88543
18439D80942Q9225J3503N2233m4487l0392m1414K5589N3138Q1562Q1646L3360
18428G94905K01304j97407j05092O854k94631L00204k02924K1003N1137j39658
18418D35695J28394P97o7541m0788J055J55099k85630K28066j67322Q0102J25441
18407E93368q2153B33040L71037k24962j52279N1843J29926l6144m262K18657
18397E86856j90677N7027l1334J13026k08418L5062l4614J73922Q2357K030k63052
$$ y = [349289, 549909, 408486, 654607, 623910, 633681, 421134, 459904, 579377, 660060, 756489, 722561, 784565, 453249, 521806, 586200, 681504, 761960, 691935, 897682, 639039, 765191, 591735, 460985, 669867, 587894, 633745, 461642, 537458, 648738, 564367, 292399, 480942, 570167, 583670, 635903, 591416, 561024, 519610, 545199, 598337, 679899, 761545, 794905, 996209, 798802, 693710, 700564, 405933, 706137, 503213, 524216, 575353, 435695, 564089, 564886, 497345, 456557, 457612, 612711, 327081, 555147, 387825, 467927, 593368, 511215, 233040, 604077, 379115, 226836, 278679, 408605, 372461, 368199, 586856, 396179, 453206, 421872, 534898, 326480, 361542, 326928, 500850, 583207, 585237, 322185]
18386C22185M5163L63207l23957J52484j59682j18710J56907q0136K17000m2768
18376E31693k22914J97831o4879r5323L53998k04810m68J42756m4160k58071K20559
18365E56212p0572J25691j53329J00620j54666K10476l2427j13511k7317Q3665
18355E24842J45728r1570K7142o8703n0513K18584m898n0155L3508k42437K24833
18344F66361k08168K24647l27193K54949M3730j502j27890j10480R3196J61013
18334F68663p6549K65544C55872K41429j46316q525j10011J07324M1645j1184
18324D70234j7799M8001K31292j09336M3664M2977L6654j43960r308p568l3590
18313E51261l2050L7431O0176j88041K34969M1594o6504j0125j94988P4093l0832
$$ y = [322185, 367348, 730555, 406598, 559082, 399400, 280690, 437597, 357461, 574461, 531693, 308779, 506610, 441731, 346408, 700406, 495596, 495128, 637884, 593724, 335653, 556212, 485640, 611331, 458002, 558622, 403956, 614432, 582005, 468494, 441177, 524842, 670570, 579000, 606142, 537439, 486926, 705510, 700612, 650457, 683965, 441528, 666361, 458193, 682840, 355647, 610596, 654326, 652824, 524934, 414454, 507650, 668663, 592114, 857658, 355872, 597301, 450985, 442460, 332449, 439773, 481418, 470234, 452435, 500436, 731728, 622392, 666056, 709033, 745687, 601727, 592419, 584851, 551261, 519211, 556642, 616818, 428777, 663746, 705340, 638836, 628711, 433723, 507816, 476984]
18302D76984o919j0235m142P0204o6934J0150j43990J24378q3513A50407J89963
18291C40370K23564M9618k04795j66028L34793k67454J3802K58128k01223q6945
18281B93830J41512L2301K52802k54721O6712j27763A27588M16041q6209J50381
18271F07801O1932j08872P68j95636J08052r149J75042j11475k17653J16107p2971
18260C53946L15621j98277M2901l3089j04693K46601P6048k70038L27481q7686
18250F68815K628B68361K25568J08851m8542r0984j46222p117J84425q5292J72392
18239E81440l831R2319j35645r8189j8766j2834J86115k7103j59930r4294J14002
18228D23284K28634k05605J88796k27712O5558q953J10272k29104L31856j65838
$$ y = [476984, 470065, 459830, 455688, 525892, 458958, 469108, 325118, 449496, 365983, 150407, 340370, 563934, 613552, 408757, 242729, 577522, 310068, 323870, 581998, 380775, 293830, 435342, 467643, 720445, 465724, 532436, 404673, 127588, 543629, 457420, 607801, 669733, 560861, 561629, 365993, 474045, 464896, 639938, 528463, 310810, 426917, 353946, 669567, 471290, 514191, 481102, 376409, 623010, 699058, 429020, 756501, 668815, 671443, 268361, 493929, 602780, 554238, 463254, 317032, 309915, 494340, 409048, 581440, 577609, 669928, 534283, 436094, 417328, 404494, 590609, 563506, 403576, 309282, 423284, 651918, 446313, 635109, 407397, 472955, 464002, 574274, 345170, 677026, 511188]
18218E11188N6509j21570k22189M32712l10325N9413O9023L2585j34960K29407
18208F01793B53136J21722O1680K2023K7520j32195J29725N2179J22598j78147
18198D80241J79281j42656m4116K34785J27490l81030L19958k33343L0615J9894
18188E91119k1824j30500O7291J20950n7726p0432q084k19806J82203P4105j29421
18177C97875j07623R5849J56732j62005k7928K09379k49389K28641p5824J75317
18167F41024j51900K602r5222K16201q3050J08623j05997K08336k62671j73201
18157C04745M8280O4885j663J12266j74032K93745k11857j7865J14092K2739A75272
18145E89810j25627N5755j18049M42107j75954k10883N9754k03393P6023p4694
$$ y = [511188, 567697, 446127, 223938, 656650, 346325, 405738, 474761, 507346, 372386, 601793, 253136, 374858, 436538, 458561, 486081, 353886, 483611, 535790, 658388, 480241, 659522, 516866, 472750, 707535, 835025, 453995, 773953, 540610, 571225, 591119, 569295, 438795, 506086, 627036, 569310, 498878, 490794, 270988, 453191, 527296, 397875, 290252, 386101, 542833, 380828, 352900, 562279, 312890, 541531, 465707, 641024, 489124, 491726, 396504, 612705, 529655, 638278, 532281, 740617, 477946, 304745, 353025, 417910, 416247, 528513, 354481, 648226, 436369, 418504, 532596, 555335, 175272, 589810, 464183, 519938, 401889, 843996, 668042, 457159, 516913, 313520, 389543, 314849]
18135C14849J80824p5936j42618P8515K12140n6442P6563j07364j76886R1159
18125C94804J13891J33101B48664L43708j99258K43459m9317k69395J21710K02975
18115F42546j47765L60953m03813p063j14692K97657K9266j92707M88745C79590
18104D10682K90790j17919j75067o65L33428C24023L34116C02032A16908L75493
18094D92401L7654Q0394j08088k173J29984k20695J04458L545J69218j77355k32557
18083B76786J95939o7763J57617p3999k09341K98243J0411j73592K84645p3266
18073F25680k27430q3698O274K44893j95202p4728K78632K6491B55807R3041J75323
18062E24171P0488P9737B90213l2768K54548j55951K6278M0559m7812j56730J81181
$$ y = [314849, 495673, 419737, 277119, 355634, 567774, 511332, 587895, 480531, 303645, 394804, 508695, 641796, 248664, 592372, 393114, 636573, 587256, 317861, 439571, 642546, 494781, 855734, 451921, 444858, 330166, 627823, 657089, 464382, 953127, 379590, 410682, 701472, 583553, 408486, 407821, 741249, 324023, 658139, 302032, 116908, 492401, 530055, 610449, 502361, 500188, 630172, 409477, 513935, 517480, 686698, 509343, 276786, 472725, 404962, 562579, 488580, 279239, 577482, 587893, 414301, 698946, 625680, 398250, 314552, 320826, 565719, 370517, 295789, 574421, 600912, 255807, 348848, 524171, 594659, 674396, 290213, 257445, 511993, 356042, 382320, 422879, 375067, 218337, 399518]
18051C99518R9376o8275A66918L30467m9726j45255J53036J08699k63817J9221
18041C19543J63159J83913k39778P2682l3382A97173R2329m3537K05126K76724
18031G27815k25247j04168k5407R7053o3756O9221M6224o8685J5306J148j59673
18020C09831m7485R0629K08188k988B70717J91178j74226P8241J55638J495o0023
18009D63020m5187m3472L10739J634k12262O9833B62238K47917k37481K25614
17999D98288k3067j002p3355K34634q2305k00897J34769p2390J68777J86260l51398
17988D18314K6182K06614j92091k14611K05322J2232j26392J68674q5860J30147
17978E48531Q6457k11085q9985K53638m4294m4137k6482K05971k11556O0023j80298
$$ y = [399518, 498894, 430619, 166918, 497385, 447659, 302404, 455440, 564139, 300322, 319543, 482702, 666615, 426837, 499519, 466137, 197173, 289502, 245965, 451091, 727815, 502568, 398400, 372993, 470046, 406290, 475511, 521735, 453050, 468356, 469504, 309831, 262346, 352975, 561163, 558175, 270717, 461895, 287669, 365910, 521548, 523043, 463020, 417833, 374361, 685100, 686734, 474472, 544305, 262238, 510155, 272674, 498288, 475221, 474219, 400864, 635498, 553193, 352296, 487065, 414675, 583452, 769712, 418314, 444496, 651110, 459019, 244408, 449730, 461962, 335570, 504244, 418384, 548531, 634988, 423903, 333918, 587556, 543262, 499125, 472643, 678614, 467058, 527081, 346783]
17967C46783L3098K86014k57538J40572k8202j18865K44049B16647L62743j63919
17957D15471K7551j62805K37053M6545o9559J82610C31196O6892K55357j93214
17947D60231K38560l46106J0779K85414M5142n7582j85947K33834q8415k60668
17937C35242J92447j16691N3972J6164m6964J66849j26354J32529l1479j18981
17927D56734J85319j67129K06517r7661j02462K17837o0390j19308J51192l12201
17917C58448J32523j00059R8885J66817k13919K01462j50664J77801j46595o5394
17907D59305R6136n8868O6314K20605k87167J89834k43940Q9111j3590J98359
17897G16099r423k15456K12634l24430J19628J40783j41940Q1279r0004J82626
$$ y = [346783, 379881, 665895, 408357, 548929, 520727, 401862, 645911, 216647, 579390, 415471, 443022, 280217, 517270, 563815, 494256, 676866, 331196, 398088, 653445, 460231, 698791, 352685, 363464, 648878, 694020, 636438, 450491, 684325, 595910, 335242, 527689, 410998, 464970, 481134, 434170, 601019, 474665, 607194, 575715, 456734, 642053, 474924, 681441, 583780, 481318, 699155, 638765, 519457, 670649, 358448, 490971, 390912, 489797, 656614, 442695, 644157, 493493, 671294, 524699, 459305, 555441, 496573, 562887, 783492, 496325, 686159, 442219, 531330, 517740, 716099, 706676, 491220, 703854, 379424, 499052, 639835, 497895, 579174, 489170, 671796]
17887F71796K03176k35982R4619j85651m4406J23523Q6714k70634K65965j66751
17877E42369l8771L25501m07944K38892j987m3991J21017m6889j68597L17458
17867H37058C14691J96435P1374r0701o9726J55094Q3148k16975M70944j59173
17857G55111l17077N1628J05781K00222k09811J76300k19605K06258n2203r6950
17847E99654q5205J45350k33520J32125R4568J0363O0137j81537J3439O4909m2555
17836E77728L4559q3430N0428J71884l8937K689j45781k959J47995k57335j18799
17825C38042L72529l20632K89371k08834K20786J03822m0893J64225l8792j9992
17815H59632j1471J67028M5213j86857L66449k70769j21140l2583J74622j50077
$$ y = [671796, 874972, 638990, 733609, 547958, 503552, 627075, 713789, 443155, 709120, 542369, 503598, 829099, 421155, 660047, 658060, 614069, 735086, 688197, 519600, 837058, 314691, 511126, 582500, 491799, 422073, 577167, 660315, 443340, 914284, 755111, 438034, 489662, 595443, 795665, 585854, 762154, 542549, 748807, 696604, 599654, 514449, 659799, 426279, 558404, 652972, 663335, 723472, 541935, 555374, 620283, 577728, 612287, 528857, 579285, 751169, 712232, 714921, 569140, 566181, 714176, 456841, 338042, 710571, 389939, 679310, 470476, 691262, 795084, 754191, 918416, 879624, 859632, 848161, 1015189, 1060402, 873545, 1239994, 969225, 848085, 815502, 990124, 840047]
17805H40047j5306j47725N828J39724j6097m6928J70033J4887j70523K55755K662
17794A032357l31008J64372j89276J58594K3880k51373j03446L62754l23421K80582
17784H24015p2877q7473k69273K88726m1748K2503k44860M4314k5202L89780l13222
17773E14683j75457L93298j35958J06423j21077L6758l6675j28995J56597j21472
17763D88125P3389N5797J23461j21019K545k29833j05135N0109J17028P237M3535
17752E05239J51629J39188k41754j53680L54002p4449k93632L74211k3128l10078
17742D27548k555J82070Q5091Q2265L6673j37325k35478J88321J77184k35463
17732E68331K2906l2507j0926O5216L0202j01431n9623J51298L5406o3585j90091
$$ y = [840047, 824741, 677016, 682844, 822568, 806471, 759543, 929576, 944463, 773940, 1029695, 1032357, 701349, 865721, 676445, 835039, 858919, 607546, 504100, 866854, 543433, 824015, 751138, 663665, 394392, 683118, 641370, 663873, 419013, 463327, 438125, 827905, 514683, 339226, 732524, 596566, 702989, 581912, 618670, 581995, 453000, 609597, 488125, 561514, 617311, 740772, 619753, 622298, 392465, 287330, 337439, 454467, 461704, 505239, 656868, 796056, 554302, 400622, 754624, 680175, 386543, 760754, 737626, 427548, 424993, 607063, 692154, 774419, 811092, 673767, 438289, 626610, 803794, 568331, 591237, 558730, 547804, 613020, 643222, 541791, 482168, 633466, 668872, 605287, 415196]
17721D15196K31346q0568K41667l0912k75797R8854J99872j41661k2258J14605
17711G50344k86804j13972L81091j79629N3082Q0528j10589k31679M1133M7495
17701D31000K32994B90273L03233l1357K7437K48233l95160K51467J61316D17669
17690F82121k8082J8979j68849J79506p7270J9299J59342j73529J15365o8800
17680F58082j06508J7831r0426J40084L1578J12452j16657N701l2301l9878L1890
17669F11848M8491O4066J19735j49445r0603j9742K43419k69626J07244k2804
17659F42583L83J32674k36475J81595o1083p1996J73610j16911l1772J56118L3311
17648H02037l5287P4520j29597k5751p8274J72403L762o2827n9448K42620K1561
$$ y = [415196, 646542, 565974, 807641, 776729, 500932, 599786, 799658, 657997, 635739, 750344, 463540, 349568, 730659, 551030, 604112, 684640, 574051, 342372, 383505, 431000, 663994, 290273, 593506, 562149, 589586, 837819, 442659, 694126, 855442, 417669, 682121, 654039, 673018, 504169, 683675, 606405, 625704, 785046, 611517, 726882, 658082, 551574, 569405, 478979, 619063, 650641, 763093, 646436, 652137, 619836, 579958, 611848, 660339, 724405, 844140, 694695, 604092, 584350, 827769, 558143, 665387, 642583, 642966, 775640, 539165, 720760, 659677, 587681, 761291, 644380, 612608, 768726, 802037, 766750, 841270, 711673, 685922, 607648, 780051, 783813, 720986, 661538, 904158, 925719]
17637I25719q8857l36789L7577K27177M7682J12988j05375r5652o9945P1835J18827
17626H45187j02856P1620K05459j25370n0992J45734k9700J40304k4830N3016
17616A127572k4692n6403K06104m00414L28056O5434j85642l1412Q7214k3213
17606A092604J6805K01129l69146J95090L595j45098J07871m2554q9234J4574
17596I85636J54912n2217j53337J19712J15295l64967K95420J06065k10926P4500
17586A070093L3216l9140M5795p9837q080K18941j30271m8415J27896k40549L05305
17575A254954n2635j37697L84977l13502k0363K8637j0926j9241o9300J41615
17565A186519k5960l4330K9126J86137o2202l7356j53253j6394K73894k30572
$$ y = [925719, 836862, 500073, 537650, 764827, 812509, 925497, 820122, 724470, 654525, 726360, 845187, 742331, 813951, 1019410, 894040, 843048, 988782, 959082, 1099386, 1074556, 1127572, 1102880, 1046477, 1252581, 852167, 1180223, 1245657, 1060015, 1028603, 1115817, 1092604, 1109409, 1310538, 941392, 1136482, 1140077, 994979, 1102850, 1060296, 971062, 985636, 1140548, 1088331, 934994, 1054706, 1170001, 805034, 1100454, 1206519, 995593, 1070093, 1103309, 1064169, 1109964, 1030127, 1022047, 1240988, 1110717, 1062302, 1190198, 949649, 1254954, 1202319, 1064622, 1449599, 1136097, 1115734, 1144371, 1133445, 1114204, 1044904, 1186519, 1160559, 1126229, 1155355, 1341492, 1279290, 1241934, 1088681, 1072287, 1346181, 1115609]
17555A115609O1144o5478j55595Q6700L39389j60360j46770N7978k01354K24732
17545A155995J33453O7436K417N6367o8275K16914j83065r3455L7388q4009J28969
17534A370135R7478m78254N7308L92461j04306j49265J70815J51927k15711N4497
17524A347085j32696J09491j30137J08032Q7776J63388j74435J87856J12078j50751
17514A527687K18628q5608J67730J71607p3959J04150K12244q4596K57387J04930
17504B520200k19045J33016N5292j6248J8583J11567J93625L44481K3082N50616
17494C715169K09456M50050L60351M86011Q63591Q82591J433427K794621M643734
17485A5839001Q161874J1609972J3986327J2976582J0263652P294984N349251
$$ y = [1115609, 1176753, 1111275, 955680, 1042380, 1381769, 1221409, 1074639, 1132617, 931263, 1155995, 1289448, 1356884, 1359301, 1415668, 1347393, 1564307, 1381242, 1287787, 1325175, 1241166, 1370135, 1467613, 989359, 1046667, 1439128, 1334822, 1185557, 1356372, 1508299, 1292588, 1347085, 1214389, 1323880, 1193743, 1301775, 1389551, 1552939, 1378504, 1566360, 1678438, 1527687, 1746315, 1660707, 1828437, 2000044, 1926085, 2030235, 2242479, 2157883, 2415270, 2520200, 2301155, 2434171, 2489463, 2473215, 2491798, 2603365, 2796990, 3141471, 3164553, 3715169, 3924625, 4374675, 4735026, 5221037, 6084628, 6967219, 8400646, 11195267, 15839001, 24000875, 35610847, 49597174, 62573756, 72837408, 80132392, 85481643]
17478H5481643K607006n05718l270161p259389j0651112j2209928j0953572o624066
17470C6614703l80132N614452J0635396J1568537J0130775P089931N037255K378532
17462H8689449L2895l559576o753811j1002726j3258800j4130762j2278087q799637
17454A8938945n653724l546743k573682j135784q21708n83033o47826j04273J4130
17445C886302j73897k4543J098j4282n1230O32l92858R9149p7764n9965j54797
17434C037845l10207J81678M8093o1878J28427L64490l60100K79730k49959j7203
17424C040916m47104J39667K6433m11958N6265j98413J59302m12381L327K14930
17414B170984o4386j23736m4642J93884k94289J89561r6571J87731k3851R6962
$$ y = [85481643, 88088649, 87582931, 84312770, 77053381, 66402269, 54192341, 43238769, 36614703, 36234571, 41849023, 52484419, 64052956, 74183731, 81273662, 86310917, 88689449, 88722344, 85162768, 78408957, 67406231, 54147431, 40016669, 27738582, 18938945, 13285221, 9738478, 7164796, 6029012, 5207304, 4624271, 3976445, 3872172, 3886302, 3712405, 3687862, 3688960, 3674678, 3623448, 3624080, 3231222, 3330371, 3252607, 3192642, 3037845, 2727638, 2909316, 2957409, 2895531, 3023958, 3388448, 3028348, 3308078, 3058119, 3040916, 2593812, 2733479, 2759912, 2347954, 2404219, 2205806, 2365108, 1952727, 1956054, 2170984, 2106598, 1982862, 1938220, 2132104, 1837815, 2027376, 1930805, 2118536, 2094685, 2191647]
17404B191647N9127M735l9513K16562j2741l5559L67131J18132L86300l6006L47170
17393C566985L50719M22007K52654O25791N32495L75973K27302K73705l03166
17384F324465L13342j66307j04918j50557k50891k71046m09258M0775q1837J66983
17374E410751N3041J12562P38697K12588P4300L01552L47302J69750M7544P5822
17364G543909J85615k67678k48781k38558o6444K94182m19337k20905J02725L63898
17354G028626K84145L85862L34420O99348O02698N31538N16343P23794M09916
17345A1516690P82861K31211M7463N8727j41353l29105j33558m58436l96767k04787
17335A0972946n05750Q0173j5931q5635M27455m94M35719M22073L28732Q308O22092
$$ y = [2191647, 2250774, 2255509, 2215996, 2432558, 2419817, 2384258, 2751389, 2869521, 3255821, 3219815, 3566985, 3917704, 4339711, 4592365, 5218156, 5750651, 6126624, 6353926, 6627631, 6324465, 6637807, 6471500, 6366582, 6216025, 5965134, 5694088, 5284830, 5325605, 5243768, 5410751, 5463792, 5576354, 6315051, 6527639, 6601939, 6903491, 7250793, 7420543, 7468087, 7543909, 7729524, 7461846, 7213065, 6974507, 6908063, 7202245, 6782908, 6562003, 6664728, 7028626, 7312771, 7698633, 8033053, 8732401, 9335099, 9866637, 10382980, 11106774, 11516690, 12299551, 12530762, 12578225, 12636952, 12495599, 12166494, 12032936, 11574500, 11177733, 10972946, 10467196, 10547369, 10531438, 10445803, 10873258, 10872764, 11308483, 11730556, 12059288, 12067596, 12689688]
17324A2689688l56557M04122m46840o4641k47278l41400k65209n70117j01083
17315A0700685m75241k46179k80406n2831Q7464j17993l990L35318K99640M44522
17305A0690989J44353K79627K18277K67655k79354P0265j08431k76585m83357
17296A0523439l23992P7078m03639l00357j30677P4509q0996M26383O6709K44156
17286A0172613J31484j31072K6681k43502j94168l59627m15447l91886p54220
17277G840856o98791n32768p08918m54166l29188m82809j61357l57540j39308
17268C976011j77943j30462q4046K2977n8140j18899k11161n8682J64359j75666
17258C148348J1511n4468J4340k07610M9535J52225n80752L23705J8085j15344
$$ y = [12689688, 12333131, 12737253, 12290413, 12225772, 11978494, 11637094, 11371885, 10801768, 10700685, 10225444, 9979265, 9698859, 9646028, 9733492, 9615499, 9611509, 9946827, 10246467, 10690989, 10835342, 11114969, 11333246, 11600901, 11321547, 11391812, 11283381, 11006796, 10523439, 10199447, 10276525, 9872886, 9572529, 9441852, 9516361, 9435365, 9861748, 9928457, 10172613, 10304097, 10173025, 10199706, 9956204, 9762036, 9402409, 8986962, 8595076, 7840856, 7142065, 6609297, 5900379, 5446213, 5117025, 4634216, 4472859, 4115319, 3976011, 3798068, 3667606, 3583560, 3606537, 3548397, 3429498, 3218337, 3159655, 3324014, 3148348, 3159859, 3105391, 3119731, 2912121, 2961656, 3113881, 2533129, 2856834, 2874919, 2759575]
17248B759575j04359K14879k66799J81763k73798k2619K48151j45513j17408J30932
17238B604804j34132M998K0195k74028J55637k23371J82087j01094J52903l76285
17228B011714M21554k54255J78392J05610o8537j4178K84871m00143J88801k60731
17218B193098Q9805J49217J68257k03173k4859Q2584P1691L0318l5618j35332
17208B385988q1264J05024O8660q8758n8476J32393m72045J39160J19193J65936
17198B415811l04405l1312l1224j57940R1102l02221J93317q9688m8251j47035
17188A588154n4862J85534J48187k41886j34681n3711R9285n1172j45210J98808
17178A538446J47n9236n9091R8954k44499K93405K5954J45807j34468O044j58631
$$ y = [2759575, 2655216, 2870095, 2603296, 2785059, 2511261, 2488642, 2736793, 2591280, 2473872, 2604804, 2470672, 2475670, 2495865, 2221837, 2377474, 2154103, 2336190, 2235096, 2387999, 2011714, 2433268, 2179013, 2357405, 2463015, 2394478, 2380300, 2665171, 2265028, 2453829, 2193098, 2282903, 2432120, 2600377, 2397204, 2372345, 2454929, 2526620, 2556938, 2521320, 2385988, 2304724, 2409748, 2478408, 2389650, 2331174, 2463567, 1991522, 2130682, 2249875, 2415811, 2111406, 2080094, 2048870, 1890930, 1982032, 1679811, 1873128, 1783440, 1735189, 1588154, 1533292, 1718826, 1867013, 1625127, 1490446, 1436735, 1536020, 1484848, 1339638, 1538446, 1538593, 1479357, 1420266, 1519220, 1274721, 1568126, 1594080, 1739887, 1605419, 1611463, 1452832]
17167A452832K73055k17963O1054J11954j09609J62307k01426K35760K067K44007
17157B014038q5000Q3659j43328M3961m9908j10221p691R2650L27147l46758K49598
17146B068147M2230k66865L5850J20959j94397J25102J11054J66603J1342q4652
17136B135373l0064K7269J03942k44908j40665N9576J00498k82789J61482j80933
17126A708781M83011k60022J92668r9032l967J03249O2693p0641m1932J28293
17116B203101j51457K7663J34688j98139J50730p9142j41580K88470J15632o4403
17106B285563l8459J63808p9407k679K11552k96605J96209n17359L9386K17052
17096B179061l90802J82707M1301l82069R5216r7528j42146k53899K40544k59639
$$ y = [1452832, 1725887, 1507924, 1568978, 1680932, 1571323, 1733630, 1532204, 1767964, 1770031, 2014038, 1929038, 2012697, 1869369, 1913330, 1863422, 1753201, 1745510, 1838160, 2165307, 1818549, 2068147, 2110377, 1843512, 1879362, 2000321, 1805924, 1931026, 2042080, 2208683, 2220025, 2135373, 2105309, 2132578, 2236520, 1991612, 1850947, 1910523, 2011021, 1728232, 1889714, 1708781, 2191792, 1931770, 2124438, 2025406, 2021439, 2124688, 2187381, 2116740, 2074808, 2203101, 2051644, 2079307, 2213995, 2015856, 2166586, 2087444, 1945864, 2234334, 2349966, 2285563, 2247104, 2410912, 2331505, 2328826, 2540378, 2243773, 2439982, 1922623, 1962009, 2179061, 1788259, 1970966, 2012267, 1630198, 1725414, 1627886, 1485740, 1231841, 1472385, 1212746]
17086A212746k1419J7927L2011Q5462p2021M6877k00838k8251J13194j62787m0425
17075I82476J82989O3039j51231O1693j70819K19686j6662k30521K83894L0670
17065A255214L5860q4413j55671K05453j58316p4532K71920J91857m0596J23371
17055A570147J32880P6J78198J39399n6302N5271J65726K67387j35673K10436
17045B527545q9529n4081L09188O5431q0275M1161J85742J07944L6414j76568
17035B872972J1828j66930j39753j12570j44210q8853q8884l10648J036k56163
17025A577825L3442R7939j25027k51416Q2297J11283k25145l1810J68189k05996
17015A231581q7117K277n5805J44195j09530J01320l5636j718k86380J38241j11656
$$ y = [1212746, 1191327, 1209254, 1241265, 1326727, 1254706, 1301583, 1100745, 1072494, 1185688, 1022901, 982476, 1165465, 1228504, 1077273, 1138966, 968147, 1187833, 1171171, 940650, 1224544, 1255214, 1291074, 1206661, 1050990, 1256443, 1098127, 1023595, 1295515, 1487372, 1446776, 1570147, 1703027, 1703103, 1881301, 2020700, 1964398, 2019669, 2185395, 2452782, 2317109, 2527545, 2438016, 2383935, 2693123, 2758554, 2678279, 2719440, 2905182, 3013126, 3049540, 2872972, 2884800, 2717870, 2578117, 2465547, 2321337, 2232484, 2143600, 1832952, 1833988, 1577825, 1611267, 1709206, 1584179, 1332763, 1415060, 1526343, 1301198, 1269388, 1437577, 1231581, 1144464, 1146741, 1090936, 1235131, 1125601, 1226921, 1191285, 1189567, 903187, 1041428, 929772]
17004I29772K36773o6681o217N737J61416j51923k98823J23503P0105J7867K43636
16993A265165q8602J89838l28889J03298q5246R3024n5459K86310k33252K60633
16983A406820o4280k21870K32951k96563K49951j37677L38760l26828K01097K57651
16973A640012m4187j37714m982J8704J18775K23367o1340P2626J28862J38412
16963B092535r0190J83194k9282Q3290J12236j90421L53625m3973J00676j58853
16953B412837R8020p0264P4560j14856k40916m0413L0647j23718P0451j63426
16943A932922j46974M1673j69002k73917J17153n9146j1106l87217L21378j96530
16933A169234J16286k94557J14569j42044J27160l9889J54209j94246P6024k17512
$$ y = [929772, 1166545, 1099864, 1093647, 1099384, 1260800, 1108877, 810054, 933557, 1003662, 1021529, 1265165, 1176563, 1366401, 1037512, 1140810, 1055564, 1148588, 1093129, 1379439, 1146187, 1406820, 1342540, 1120670, 1353621, 1057058, 1307009, 1169332, 1508092, 1181264, 1382361, 1640012, 1595825, 1458111, 1453129, 1471833, 1590608, 1813975, 1752635, 1825261, 1954123, 2092535, 2002345, 2185539, 2156257, 2239547, 2351783, 2161362, 2514987, 2471014, 2571690, 2412837, 2510857, 2440593, 2515153, 2400297, 2159381, 2118968, 2149615, 2025897, 2096348, 1932922, 1785948, 1827621, 1658619, 1384702, 1501855, 1442709, 1431603, 1044386, 1365764, 1169234, 1285520, 990963, 1105532, 963488, 1090648, 1050759, 1204968, 1010722, 1086746, 869234]
16923H69234R8720j2804l5768R4898n7778j21951L6657P907j34266K94351N4811
16912A094011k88628J3951N2745k06774K74501N7112j99053O7006O9647K1207
16902I55725j03439j4159l7297l9141J55805L6018j58072n0521L6440n4299j03928
16891F23132M0740m0649J53341j6370j04203q8409J52522n6777P2891k00707K98332
16880H33843k8353j47656K07569j98634Q451K01503R5748m60688L07397R9951
16870I19131r5550N3674n1087J09300j35260R658o363p582l3257O8894p1443J64294
16858I24409j82454r4635J19513M8974q895J65987r2023j65855j6986J07151L9815
16847H45001j9160Q4495k05310l5384p8267J81779M1737O0701l17739M31317k62494
$$ y = [869234, 967954, 955150, 919382, 1014280, 956502, 834551, 871208, 879115, 744849, 1039200, 1094011, 805383, 819334, 872079, 665305, 939806, 996918, 797865, 864871, 934518, 955725, 852286, 838127, 800830, 761689, 917494, 953512, 795440, 744919, 781359, 727060, 623132, 663872, 623223, 776564, 760194, 655991, 567582, 720104, 663327, 736218, 535511, 833843, 805490, 657834, 865403, 666769, 675220, 876723, 972471, 511783, 819180, 919131, 823581, 877255, 826168, 935468, 800208, 809866, 803503, 795921, 762664, 831558, 760115, 924409, 741955, 647320, 766833, 815807, 806912, 972899, 880876, 715021, 698035, 805186, 845001, 825841, 910336, 705026, 669642, 591375, 773154, 814891, 875592, 557853, 989170, 726676]
16836G26676J69175L7073o9597P7569n0313J97188j73642K9680O7742K11531N973
16825A229055k41634K53411J24092k72390J13494J26040J16447K30302j94790
16816A484027L06944k17264L25431k16765o2520N3696O4097O9484k23350R3836
16806A677616K4312m3286J85812r5585o4002j16751M196o3475J90669j48644k09071
16795A341791M5720j3047m1660q6457j28100L1157j49259J74269j64887J7515
16785A027042j79824L5727j18832j39346Q0272j11781J51122K41209K0553k58948
16775G47194N9983J60562m66087J60003O8298J40455j37531O8299j28961J3210
16765F85425L45350j24044j55300l4289j5178J0403J7335L01574k17831O6221
$$ y = [726676, 895851, 932924, 863327, 940896, 890583, 1087771, 914129, 943809, 1011551, 1223082, 1229055, 987421, 1240832, 1364924, 1092534, 1206028, 1332068, 1448515, 1678817, 1484027, 1790971, 1573707, 1899138, 1682373, 1619853, 1673549, 1737646, 1807130, 1583780, 1677616, 1701928, 1658642, 1844454, 1748869, 1684867, 1568116, 1572312, 1508837, 1699506, 1550862, 1341791, 1387511, 1374464, 1332804, 1246347, 1118247, 1149404, 1000145, 1174414, 1009527, 1027042, 847218, 882945, 764113, 624767, 705039, 593258, 744380, 985589, 1006142, 747194, 807177, 967739, 501652, 661655, 729953, 870408, 732877, 801176, 672215, 685425, 1030775, 906731, 751431, 717142, 701964, 712367, 729702, 1031276, 813445, 879666]
16755H79666L2005k6846K177j59800J76829k00444J56500j52824j9723K16252
16745I03792k09342J34470m922o6721o0725J20737n0613r1397K98712k48227j19635
16734F06129K24020O8162J2903Q9466j00915k2574L18J7748q034P1711K12831
16723A171765j45208l89610K97818M3068l4950j373K54163j75872J6067L7390
16713A073258m2200j92164Q7964K36806j92538J65595J65313J57168J76797N4736
16703A690735J53480j58596P363P0384j6081J26189r5612L3295j71306J6938L2887
16692A689676o7002L09220o9253j79694J24144J02844k76330N7195l8573N5703
16682A707930k81411j12422k50465J83339j67433O562j21244K23880M8908N4388
$$ y = [879666, 911671, 884825, 887002, 727202, 904031, 703587, 860087, 707263, 687540, 903792, 694450, 828920, 823998, 757277, 696552, 817289, 766676, 675279, 973991, 725764, 606129, 830149, 898311, 911214, 1000680, 899765, 877191, 877509, 895257, 887223, 958934, 1171765, 1026557, 636947, 934765, 977833, 942883, 941510, 1195673, 1019801, 1035868, 1073258, 1031058, 838894, 926858, 1163664, 971126, 1136721, 1302034, 1459202, 1635999, 1690735, 1844215, 1685619, 1692982, 1763366, 1747285, 1873474, 1777862, 1811157, 1639851, 1656789, 1689676, 1622674, 1931894, 1862641, 1682947, 1807091, 1909935, 1633605, 1690800, 1652227, 1707930, 1426519, 1314097, 1063632, 1246971, 1079538, 1086100, 964856, 1188736, 1237644, 1292032]
16672A292032O8904L115K16755J67059M0900l9385p590p4652N7536K13544l6739
16661A901479n0873J016j33743L1252j26075J77653R3118J12078k07477l0212
16651A768216J1513j50503o7687L0189j40380p9261j22251k87913k01996P8521
16641H38448K53486o1310r5186P5930j15964j6323K04419j47668k0024j94495
16631G21313J9820K87618k87992J35596k33243M22347k90556m9830R7760J22895
16621I45728j08155j0813k52972J93319j30182J04020N8274j80275K34350n527
16611H47767p435j55435j8727L32761n2817K5149k48362J59325O3634O9352j13780
16600I01432j23736J84633m9249J67766k94106k0014K66457l4469p3374J53617
$$ y = [1292032, 1360936, 1364051, 1580806, 1747865, 1788765, 1749380, 1741790, 1667138, 1724674, 1938218, 1901479, 1850606, 1851622, 1717879, 1749131, 1623056, 1800709, 1893827, 2005905, 1798428, 1768216, 1779729, 1629226, 1561539, 1591728, 1451348, 1372087, 1249836, 961923, 759927, 838448, 1091934, 1030624, 935438, 1011368, 895404, 879081, 1083500, 935832, 915808, 721313, 741133, 1028751, 740759, 876355, 643112, 1065459, 774903, 725073, 822833, 945728, 837573, 826760, 573788, 767107, 636925, 740945, 799219, 618944, 853294, 847767, 840332, 684897, 666170, 998931, 946114, 971263, 722901, 882226, 945860, 1015212, 901432, 777696, 962329, 913080, 1080846, 786740, 766726, 1033183, 998714, 925340, 1078957]
16590A078957k1057r6980K22197n6427k53805J89573j13666j69565o6494J5750
16580G28483J44300R2179l87904L04527j4611m876R0541J3053q0402J36285k24656
16569G96919J50384l6775J11745k61626l0583J26382O1116l020r2036J54235j0536
16558I66205Q5898j36603K47197k02966l0871r1055j12909o7313p3174O3467q5878
16547E61998J12909L42314j96101N2645k41758J14674m5298J57301J89252l71183
16537F76753K26203k20357J96768J65560l89625R1831J83638o7408k5445J16629
16527I54547m57655L00611J76780K451l29612O7781L02514j11011j00691l5020
16517G70695J79293Q2593j21830j11130Q0284j93213J26974r7127L35169j48991
$$ y = [1078957, 1057900, 960920, 1183117, 1126690, 872885, 1062458, 948792, 779227, 712733, 728483, 872783, 964962, 577058, 881585, 866974, 862098, 952639, 965692, 885290, 1021575, 796919, 947303, 910528, 1022273, 760647, 730064, 856446, 917562, 914542, 822506, 976741, 966205, 1052103, 915500, 1162697, 959731, 928860, 837805, 724896, 657583, 584409, 647876, 561998, 674907, 1017221, 821120, 873765, 632007, 746681, 701383, 858684, 1047936, 676753, 902956, 682599, 879367, 1044927, 655302, 747133, 930771, 863363, 837918, 954547, 496892, 797503, 974283, 976734, 647122, 714903, 1017417, 906406, 805715, 770695, 949988, 1032581, 910751, 799621, 879905, 686692, 813666, 716539, 1051708, 902717]
16507I02717K07783n5056L228J75480j68653R5728k23952p2240M6831R4037j13242
16496H92661q504O2523r515k74485N44112j83012j36541L1016N7422k47921K91788
16485A019544J03272M280l82567M81363m18755J0992M2408q5202J0647R1075l2109
16474H44948k24843j8080J58366J52919O4217J57813Q5542q6436K30504j53121
16464A211829J80706K17771j91973J39472J11014J70963k12701J27078p4731K0970
16454A700398J61800j11489Q1336K52399j40748L92674j03512J84130M25660J87881
16444C030529r9870O07418k5927L95330R3483r6661j38354q6959J39893m67332
16434C351550R8129P1332K49624L76808L31390P09176Q08496M09903P90152P02059
$$ y = [902717, 1110500, 1055444, 1058672, 1234152, 1065499, 1161227, 937275, 865035, 911866, 1005903, 892661, 884157, 946680, 937165, 662680, 1206792, 1023780, 887239, 918255, 975677, 727756, 1019544, 1122816, 1127096, 744529, 1225892, 807137, 818129, 860537, 775335, 785982, 877057, 844948, 620105, 602025, 760391, 913310, 977527, 1135340, 1220882, 1134446, 1364950, 1211829, 1392535, 1610306, 1418333, 1557805, 1668819, 1839782, 1627081, 1754159, 1679428, 1700398, 1862198, 1750709, 1832045, 2084444, 1943696, 2336370, 2232858, 2416988, 2842648, 3030529, 2930659, 3538077, 3512150, 3907480, 4000963, 3904302, 3765948, 3678989, 3818882, 3351550, 3449679, 3521011, 3770635, 4147443, 4478833, 5188009, 5996505, 6406408, 7196560, 7898619]
16424G898619J080064Q93203J195353J350273J433416J785486J784643J860023
16416A9281080J689572K145397K203551K656847K424777K890061L047305K947316
16408C9285906K971640K882045L142054L002682L264339L197221K922444L236547
16400F3904878K830050K542343J873965P99871Q38088R71647J165994L539017
16392G8465853P129754J1582124J4534104J1514281K812253n910624j0271646
16385A09856099j2921826j3675802j4382144j4344619j5291256j7584819D20817
16377b3788517k1754810j1251607J360712J0092199J2315177J0389887P551615
16370a5085344N018736L663378K225388J406254Q01127L89303J88505J70355l03387
$$ y = [7898619, 8978683, 9871886, 11067239, 12417512, 13850928, 15636414, 17421057, 19281080, 20970652, 23116049, 25319600, 27976447, 30401224, 33291285, 36338590, 39285906, 42257546, 45139591, 48281645, 51284327, 54548666, 57745887, 60668331, 63904878, 66734928, 69277271, 71151236, 71951107, 72789195, 73760842, 74926836, 78465853, 85595607, 97177731, 111711835, 123226116, 126038369, 120127745, 109856099, 96934273, 83258471, 68876327, 54531708, 39240452, 21655633, 420817, -23788517, -45543327, -56794934, -55434222, -45342023, -33026846, -22636959, -15085344, -10066608, -6403230, -4177842, -2771588, -1970461, -1581158, -1392653, -1222298, -1525685]
16361a525685J0633m18958k69639p1724R6881K40247J74780L33788L28181M45270
16351f56226j536c03023e3789B20307j5938m8318n4590M45858B53719K3423L3619
16340C10761K10123J19132R3791L4446n9884k03875m8992j61349R4141F9472D096
16328h2677k92329Q9656M0353j4390q6850a29345A2088K45047o1446R7364k6370
16317B66683N3047j44710L24140k23247B5507J12221D0464O2495K4033M0402n2906
16306A14488C6907J60916P0781j09235J18238P4063j31416L2910J50658j80082
16296B23740J99619n3519j24319J01314J7431a70259B03935F5009R5529p2691
16286H7847a5180A15619m7714P6512O2987O4409o6148J12028j44162J29080J39144
$$ y = [-1525685, -1515052, -1934010, -2203649, -2275373, -2178492, -1938245, -1763465, -1429677, -1101496, -656226, -657762, -303023, -53789, 220307, 204369, 156051, 101461, 547319, 253719, 277142, 310761, 520884, 640016, 733807, 768253, 708369, 504494, 455502, 294153, 388294, 69472, 4096, -82677, -375006, -285350, -244997, -259387, -346237, -129345, 12088, 257135, 195689, 293053, 266683, 319730, 175020, 499160, 275913, 25507, 137728, 40464, 102959, 126992, 167394, 114488, 36907, 197823, 268604, 159369, 277607, 351670, 220254, 253164, 403822, 223740, 423359, 369840, 245521, 346835, 364266, -170259, 203935, 65009, 160538, 87847, -15180, 115619, 67905, 144417, 207404, 271813, 205665, 317693, 173531, 302611, 441755]
16275D41755P3481k28373J71727n4217j14736L26479r3285m1991J98330j61387
16265E17783J12957A91875J24154K29123R2401k25879r385j08294J33761J21754
16255E49510K8754j89651O0118p0760L9836O0464j01140K62875o9462j19925K35387
16244F86006j26607L2741J35885N1114r7397O6588J09360j72653J88735q3738
16234G90034k43446M1891n5688P1967k12167K10206p2862j67476K51494M7341
16224F61294k49890O1228K03837j52604K9351m1982K57206k44777j71848K74413
16214F26228J66017j44233k8307K6855p0783j51990O5554O3603K92994k97710
16204E48228P161q5127p833L82470C87417J06714O7248J32652L695N0345j68227
$$ y = [441755, 515236, 286863, 458590, 404373, 289637, 616116, 522831, 480840, 679170, 517783, 630740, 191875, 316029, 545152, 637553, 411674, 402289, 293995, 427756, 549510, 578264, 388613, 448731, 377971, 417807, 478271, 377131, 640006, 570544, 450619, 686006, 559399, 592140, 728025, 779139, 681742, 748330, 857690, 685037, 873772, 790034, 546588, 588479, 532791, 604758, 392591, 602797, 529935, 362459, 613953, 661294, 411404, 472632, 676469, 523865, 553216, 511234, 768440, 523663, 351815, 626228, 792245, 648012, 619705, 646560, 575777, 423787, 489341, 552944, 845938, 548228, 555389, 470262, 462429, 844899, 387417, 494131, 561379, 694031, 697726, 748071, 579844]
16193E79844m6175N7514K05066j51052L3216j4184Q2301j22936Q953J72597k28781
16182E76363P592N1965r9232L36524k33115J89244O9266P3120r687l00744M0860
16171G02156L54430l01212n3229J39475r3282j56474M85408k01764k24419M07873
16161A058962k01428j55024j74522R8744O9040R9731j9193n7452q0149J34755
16151G73464J33479j27938j91498O3848k02916J79027L70830j97361p9571N7848
16141G79212l82490m5769L43233l8103Q4771L7556m0920l6056K75514k16358K8524
16130G89114k6271k2074P5765P6796k32735L04757P4229j31283j92575J42796
16120H58519K9264j17989M4755R77j43263K06480k63049N9993K37622k03230l0539
$$ y = [579844, 533669, 591183, 796249, 645197, 678413, 664229, 746530, 623594, 632547, 805144, 576363, 583955, 635920, 536688, 873212, 640097, 829341, 898607, 971727, 962040, 661296, 702156, 1056586, 755374, 702145, 841620, 748338, 591864, 1077272, 875508, 651089, 1058962, 857534, 702510, 527988, 626732, 695772, 795503, 776310, 718858, 638709, 773464, 906943, 779005, 587507, 651355, 448439, 627466, 998296, 800935, 721364, 779212, 396722, 350953, 694186, 656083, 740854, 778410, 737490, 701434, 976948, 760590, 789114, 762843, 740769, 816534, 893330, 660595, 965352, 1039581, 908298, 715723, 858519, 887783, 769794, 814549, 815526, 672263, 878743, 615694, 675687, 913309, 710079, 679540]
16109F79540Q1455R9798m8977P665l5864J39284j06360q1908J22202j02014K44267
16098I99088m19693L31343p708m7029j02941J51335j2619P0087j15431n8951L1021
16087H18502Q1073L556j75932K57562l4339K07210j47469j31227P719J81043p7095
16076I90603j05280L12648r851P5388j09720j42687j07422M40314q5035j24850
16066A134108L40687j19412j54712J51549R9031j55624j17395Q7859K60246k4190
16056A502147n4057J055O0683o8291J60670j23362Q0676K25223j67758k8577j886
16045A586523O9713k32446j11506n124J60424j8093N5576L3503j01862N2913j40358
16034A349263K75760q9530J39029o7418Q4383k46094L41235r8645N8775O0891
$$ y = [679540, 760995, 860793, 811816, 819481, 783617, 922901, 816541, 734633, 856835, 754821, 999088, 579395, 910738, 903030, 856001, 753060, 904395, 891776, 961863, 846432, 787481, 818502, 899575, 903131, 727199, 984761, 950422, 1157632, 1010163, 878936, 886655, 1067698, 990603, 885323, 1197971, 1188120, 1263508, 1153788, 1011101, 903679, 1343993, 1258958, 1134108, 1474795, 1355383, 1200671, 1352220, 1451251, 1295627, 1178232, 1266091, 1526337, 1502147, 1448090, 1449145, 1509828, 1441537, 1602207, 1478845, 1559521, 1784744, 1616986, 1588409, 1586523, 1656236, 1423790, 1312284, 1307160, 1467584, 1449491, 1505067, 1538570, 1436708, 1489621, 1349263, 1625023, 1535493, 1674522, 1607104, 1691487, 1445393, 1786628, 1687983, 1746758, 1807649]
16024A807649m9664l0950j812K83996k91606L83625r2906p0784K99592k65136
16014A972004o1759J29101j12517L8195r8894l3206J33381q4029J18318J31918
16004B132512r715l90653L03844q0584j62506J66461K0153k33187K35679J3162
15994A995166K530k80517j29761L09071j19381j3022K65686j68937r551J80185
15984B031469n1081m2701n2194K10228P6745o9084k11771N0377K27876r2058J08165
15973B185971K43023m9720l60948J35008k08145n3031K21431q9266j19792J04299
15963B008830M7880j22523K04729Q5991k21073M6655j0209o203O3129k2623j16525
15952A958058J62889o7678q6193K6187J61948N8480J536l46697J12488L26242
$$ y = [1807649, 1757985, 1727035, 1725223, 2009219, 1717613, 2101238, 2008332, 1937548, 2237140, 1972004, 1910245, 2039346, 1926829, 1965024, 1866130, 1832924, 1966305, 1882276, 2000594, 2132512, 2122797, 1732144, 2035988, 1955404, 1792898, 1959359, 1979512, 1746325, 1982004, 1995166, 1997696, 1717179, 1587418, 1896489, 1777108, 1764086, 2029772, 1860835, 1851284, 2031469, 1980388, 1937687, 1885493, 2095721, 2172466, 2103382, 1891611, 1941988, 2169864, 2077806, 2185971, 2428994, 2379274, 2018326, 2153334, 1945189, 1892158, 2113589, 2024323, 1904531, 2008830, 2056710, 1934187, 2138916, 2224907, 2003834, 2050489, 2040280, 2034077, 2097206, 2074583, 1958058, 2120947, 2053269, 1967076, 1993263, 2155211, 2213691, 2215227, 1868530, 1981018, 2307260]
15942B307260l17954P0925j75102M06361l06344L60141r568K0476j28103P9270
15932B307362M4099J0697J00749J42955k25828L09512n6683J32713K24727j67397
15922B822906K34074K00964J27923N07962Q8620L89214L31585N71418R50965R06197
15912G131828J358594K026696L635737M617572O294105P277187P885349P385540
15904D7612608O458467M572513L490627Q12026j326782l591331n752198p318096
15896D4957834p648070q243881o877660n371665m054749k520894j966023j694825
15888F580067r08670r49724l23691o13019o7992n81427k03552k48270K16301l74746
15878B525277J89395k39428K08013k44630M8307l2412k6421j07932J69080k57163
$$ y = [2307260, 1989306, 2060231, 1885129, 2291490, 1985146, 2345287, 2335719, 2356195, 2228092, 2307362, 2351461, 2362158, 2462907, 2605862, 2380034, 2689546, 2632863, 2765576, 2990303, 2822906, 3056980, 3257944, 3385867, 3893829, 3982449, 4371663, 4703248, 5274666, 6225631, 7131828, 8490422, 10517118, 14152855, 18770427, 25064532, 32341719, 40227068, 47612608, 54071075, 58643588, 62134215, 62946241, 61619459, 58028128, 52275930, 44957834, 37309764, 29065883, 22188223, 16816558, 12761809, 10240915, 8274892, 6580067, 5671397, 4721673, 4397982, 3784963, 3716971, 3135544, 2931992, 2683722, 2900023, 2525277, 2714672, 2475244, 2683257, 2438627, 2486934, 2454522, 2428101, 2320169, 2489249, 2232086]
15868B232086K07494J48114k73124k7567J07670K717m65110K82045j76633l5778
15858B001914k81625M01359l5505m5130J07720j40726m08359M09335j96578J90505
15848B002910j86252K75008j00834j36193Q2322J96483M0542r8498j06350J35720
15838B104858K46655M6633N9127k8403m59J23654j45671j26964J46057j82620
15828B242867J1820j8j41416J15405r4956p1808P562J5550p3378n0681R6052r4334
15816A962665j8750P7825j79726J94860K29112k80142K45993k09899L69329k80196
15806B111071J86185j83907J41965r2326R5453J55620K4181k30226J14748K87807
15796B610571L94623m8077O8683p651J14406J78009O3302r3227Q4219j18155o4687
$$ y = [2232086, 2439580, 2587694, 2314570, 2287003, 2394673, 2397390, 1932280, 2214325, 2037692, 2001914, 1720289, 2121648, 2086143, 2041013, 2148733, 2008007, 1599648, 2008983, 1812405, 2002910, 1816658, 2091666, 1990832, 1854639, 1936961, 2133444, 2173986, 2075488, 1969138, 2104858, 2351513, 2398146, 2457273, 2428870, 2428411, 2552065, 2406394, 2279430, 2425487, 2242867, 2254687, 2254669, 2113253, 2228658, 2133702, 2061894, 2069456, 2085006, 2011628, 1960947, 2056999, 1962665, 1943915, 2021740, 1842014, 2036874, 2265986, 1985844, 2231837, 2021938, 2391267, 2111071, 2297256, 2113349, 2255314, 2162988, 2258441, 2414061, 2438242, 2208016, 2322764, 2610571, 3005194, 2957117, 3025800, 3018149, 3132555, 3310564, 3373866, 3280639, 3364858, 3246703, 3182016]
15785C182016K03213K2733M91362j78485L21859O1072J26213K79927P4653N9301
15775D643864J06381j7793j19000j33701m7181n0292L31129l60787J68610J53357
15765D674587M0566K95575n6281j85718K05237m1041Q5347j88066J15108Q577
15755D953891J11643m11995J29248J13483l4061J90863J54536L1923M9631J45397
15745E434559M30932P0481J52958K92931K79229O0379K07027J87511J68108j32007
15735G152108j05425K9910R8942K65450J1916J081p7352J49361l1251j71326j6429
15724G306985j65511j66949j72442j27902o8629j91929n8639j74446J11679J4541
15714F306758J6158J8548J05490l00360k28762K62359j29896J39253K22502J08572
$$ y = [3182016, 3385229, 3407962, 3899324, 3720839, 4042698, 4103770, 4229983, 4509910, 4584563, 4643864, 4750245, 4732452, 4613452, 4479751, 4432570, 4382278, 4713407, 4352620, 4521230, 4674587, 4715153, 5010728, 4954447, 4768729, 4973966, 4932925, 5018272, 4830206, 4945314, 4953891, 5065534, 4653539, 4782787, 4896270, 4862209, 5053072, 5207608, 5239531, 5289162, 5434559, 5865491, 5935972, 6088930, 6381861, 6661090, 6721469, 6928496, 7116007, 7284115, 7152108, 7046683, 7076593, 7175535, 7440985, 7452901, 7453982, 7376630, 7525991, 7494740, 7323414, 7306985, 7141474, 6974525, 6802083, 6674181, 6605552, 6413623, 6354984, 6180538, 6292217, 6306758, 6322916, 6341464, 6446954, 6146594, 5917832, 6180191, 6050295, 6189548, 6412050, 6520622]
15704F520622K75794J71153K87272J25743K37547j75420L95803k4825J71825J38089
15694H123603k07325P948R2300N4472j73205j30475J32192l94383j20315j16520
15684G268292k30309q6737M801j36285k09386O013m5533j64615q2916l4109k08140
15673F081076k47988p0884k7840J25314j65153M8218J74358p1560L05528o2424
15663F088645L81146K11716m0168L38002L67173M93812K17213M87815L70906M20680
15653I336940Q86824M65219N53771P24618L64117M95256O91157L96808N48435
15644A4463145O23637M52157P97822Q55645J034079R04040R38892Q86748N14702
15635B1470867K44625M45293J9226n6863j26388k27410l66073m2966M1829P1155
$$ y = [6520622, 6796416, 6967569, 7254841, 7380584, 7618131, 7442711, 7838514, 7813689, 7985514, 8123603, 7916278, 7924226, 8016526, 8070998, 7897793, 7767318, 7899510, 7505127, 7384812, 7268292, 7037983, 6951246, 6956047, 6819762, 6610376, 6616389, 6570856, 6406241, 6323325, 6289216, 6081076, 5833088, 5762204, 5734364, 5859678, 5694525, 5742743, 5917101, 5845541, 6151069, 6088645, 6469791, 6681507, 6641339, 6979341, 7346514, 7840326, 8057539, 8545354, 8916260, 9336940, 10223764, 10688983, 11242754, 11967372, 12331489, 12826745, 13517902, 13914710, 14463145, 15086782, 15538939, 16336761, 17192406, 18226485, 19130525, 20069417, 20956165, 21470867, 21715492, 22160785, 22180011, 22123148, 21996760, 21769350, 21403277, 21360311, 21402140, 21473295]
15625B1473295m3739O1245L03908m76996m79713o49568o56181j113309o63167
15616A7755775j061752j035897p36180p39394n38408k78395o16061m7961m66219
15607A2235508k34560m41768o5939o11155k34090m26591j30306k46330j2386N3111
15597I885494j9977J91391l3627P94670R20054J682173L682083Q350377J5646569
15588D1099207J6535493J1395532Q030360N722408L897500J560414q01298m729828
15580H2709788r815052j4487392j6632229j3354705q164943n043218k954135j811515
15572A0446599j022991o15276k59270j90800M12338j5243M2548K31839J23546
15563I153290K92765J04101O95666J87285Q27999J447978K403473O292708J3313777
$$ y = [21473295, 21429556, 21490801, 21794709, 21317713, 20838000, 20188432, 19532251, 18418942, 17755775, 16694023, 15658126, 14921946, 14182552, 13644144, 13365749, 12749688, 12701727, 12235508, 12000948, 11559180, 11493241, 10882086, 10647996, 10221405, 10091099, 9844769, 9832383, 9885494, 9865517, 10056908, 10023281, 10817951, 11738005, 13420178, 17102261, 25452638, 41099207, 57634700, 69030232, 77060592, 82783000, 86680500, 88240914, 87439616, 82709788, 72894736, 58407344, 41775115, 28420410, 20255467, 15212249, 12258114, 10446599, 9423608, 8808332, 8549062, 8358262, 8770600, 8755357, 8797905, 9029744, 9153290, 9446055, 9550156, 10245822, 10433107, 11261106, 12709084, 15112557, 21405265, 34719042]
15554C4719042K1931924K0076084J3542475R531881O747989L881204J231817k290659
15546A09371757p999098j4840949j9536865k1801024j5812484r266509n633050
15539A4481778l310949k248028j267733p37622p55314j26907j49341R5576k78211
15530E703249k51829j64435j84348j13560m0572l70800J9075j19639j12976j02034
15520D262131l31166J46309K94080m04803j2485J17817N5018N1512J68244l09478
15510D037179L42603j2220L80226j57426q927J99856k01554r5687m9782L5066
15500D469334J4818o393n12787J04123O2376q6280J84737J50981N8553j48604
15490D290858Q9607K72664k46523J43512L04823J89713L30822J34476J85842J58607
$$ y = [34719042, 56650966, 76727050, 90269525, 99801406, 106549395, 110430599, 111662416, 109371757, 101372659, 86531710, 66994845, 45193821, 29381337, 20114828, 14481778, 11170829, 8922801, 7655068, 6917446, 6162132, 6035225, 5885884, 5981460, 5703249, 5451420, 5286985, 5102637, 4989077, 4948505, 4577705, 4596780, 4477141, 4364165, 4262131, 3930965, 4077274, 4371354, 3966551, 3954066, 4071883, 4126901, 4178413, 4346657, 4037179, 4379782, 4367562, 4747788, 4590362, 4581435, 4781291, 4579737, 4484050, 4434268, 4469334, 4484152, 4477759, 3964972, 4069095, 4131471, 4045191, 4229928, 4380909, 4439462, 4290858, 4380465, 4653129, 4406606, 4550118, 4854941, 5044654, 5375476, 5509952, 5695794, 5854401]
15480E854401j85250L94715J8944M8171J09171j33034L28383l9315K54970P66838
15470G417994N04292R80844O32013M76869M20009N11698N6147l81783k89209l17228
15460A0011646l83356l71261j54602N627M78263O15546M71481M41239L19834K9358
15450A1463775K67279k38248M9190q42476l62395o19816m28079l77847J12507
15441I023890R2035O0454K98147q1309j01709l4841j70400j99918l12851k65363
15431H308135j85503l65680m26876k42101j13822p7518m34727j40259j96264m1852
15421F083533j48199n4822l67663j36188p2879j77788k22127l1606m1644j63538
15411D667079J76484l98089K94735j6843O6608j25233M3140J32445l1034p04K19943
$$ y = [5854401, 5669151, 6063866, 6082810, 6130981, 6240152, 6107118, 6435501, 6396186, 6651156, 7417994, 7922286, 8903130, 9535143, 10012012, 10432021, 10943719, 10999866, 10618083, 10328874, 10011646, 9628290, 9257029, 9102427, 9108054, 9586317, 10201863, 10673344, 11114583, 11434417, 11463775, 11731054, 11492806, 11541996, 10699520, 10337125, 9717309, 9289230, 8911383, 9023890, 9115925, 9176379, 9474526, 9393217, 9291508, 9256667, 9086267, 8886349, 8573498, 8308135, 8122632, 7756952, 7330076, 7087975, 6974153, 6896635, 6461908, 6321649, 6125385, 6083533, 5935334, 5880512, 5512849, 5376661, 5303782, 5125994, 4903867, 4872261, 4830617, 4667079, 4843563, 4445474, 4740209, 4723366, 4789974, 4664741, 4707881, 4840326, 4809292, 4808588, 5028531]
15400E028531l75675N21078P326j1300M4914q9323j5885M3326k09228J36158J04602
15389E184524l63543K30658J1042m2038J93055m3870p7778J30696j85713K50279
15379E287312j391j57945l7374J34199M394P9025K8565k38922L13621r0661P564
15368E328387J7715j88681J97997L47506k787J28122J86351Q085J16673L9689
15358F179057K61094l7478L89566j23593L91850L87899M05259L95318J034456
15349I283428J487504K987225N576843Q864785Q726961O263968M743426L329709
15341E1263849K065625J153164p94724k806752n372696p820307q156133o829797
15333B2702229l815762k018590j543592j001917k44020m98906n27727n18065n24910
$$ y = [5028531, 4652856, 5173934, 5181260, 5169960, 5214874, 5125551, 5109666, 5152992, 4943764, 5079922, 5184524, 4820981, 5051639, 5062681, 5020643, 5213698, 5169828, 5092050, 5222746, 5037033, 5287312, 5285921, 5127976, 5090602, 5224801, 5229195, 5308220, 5336785, 5097863, 5411484, 5320823, 5328387, 5346102, 5157421, 5355418, 5702924, 5700137, 5828259, 6014610, 6022695, 6139368, 6179057, 6440151, 6402673, 6792239, 6668646, 7060496, 7448395, 7853654, 8248972, 9283428, 10770932, 13758157, 19335000, 28199785, 36926746, 43190714, 47934140, 51263849, 53329474, 54482638, 53687914, 50881162, 45508466, 37688159, 29532026, 22702229, 18886467, 16867877, 15324285, 14322368, 14078348, 13579442, 13051715, 12533650, 12008740]
15324A2008740R6978j68100K75766N5870N33623L20628Q46615J145564K058067
15315A7173751M269676P809925J2896883J5396911J4462198J1234689P869469
15308I1113502N430127K627337r223l797513q453090j3193500j5633753j5146771
15300D2937116j1701316p868926m589138k904464j757348p55876m08094l24727
15292A2627227M8162k03042k71796j5603l9240k26025J40619o8707k06605N60470
15282A2345460O49954J468697L155251N982898R046310P777472N229744M017241
15274D9673027K672666J579158J3004j279040l428938o489268q021171q494544
15266B6224894n824303m002255k516180j478772j330972r37304m52263o11452
$$ y = [12008740, 12105718, 11937618, 12213384, 12269254, 12802877, 13123505, 13970120, 15115684, 17173751, 21443427, 29253352, 42150235, 57547146, 72009344, 83244033, 91113502, 96543629, 99170966, 99161743, 95364230, 86911140, 73717640, 58083887, 42937116, 31235800, 23366874, 18777736, 15873272, 14115924, 13360048, 12951954, 12627227, 12675389, 12472347, 12200551, 12184948, 12145708, 11919683, 12060302, 11991595, 11784990, 12345460, 12995414, 14464111, 17619362, 23602260, 32648570, 40426042, 45655786, 49673027, 52345693, 53924851, 53937855, 52658815, 49229877, 42740609, 34719438, 26224894, 20400591, 16398336, 13882156, 12403384, 11072412, 10135108, 9682845, 9071393]
15258I071393l77786K42151j87237j98049M53114J10242L60873J5110M46936J22913
15248A0059660J59686k08258l38678l19266N197l91146l38925j06474l35605o8809
15238H117382j00293M27080j17489L77080M45933N90764O61217M6624P6800K08680
15228A0733778m3100j7117q4870l02299q45218j25933n18232k27083j08867J29782
15218H590841P9490L81960M43974J60334R1471N97078J32596J658K00224l90978
15208A0288648l87509m92182k50533o78028o85015k76275o37363o7897l59782
15199F454064j76853k10046Q743l01307R1260J37814l6264J93768J17486J02032
15189F380697M3765J91884K34329o8344N8911O3335j12675J62810o7850K22624
$$ y = [9071393, 8693607, 8935758, 8748521, 8550472, 9003586, 9113828, 9474701, 9489811, 9936747, 10059660, 10219346, 10011088, 9672410, 9353144, 9358341, 8967195, 8628270, 8521796, 8186191, 8117382, 8017089, 8444169, 8326680, 8703760, 9149693, 9740457, 10401674, 10448298, 10525098, 10733778, 10690678, 10673561, 10588691, 10286392, 9441174, 9315241, 8797009, 8569926, 8461059, 8590841, 8670331, 9052291, 9496265, 9656599, 9748070, 10345148, 10477744, 10479402, 10679626, 10288648, 9901139, 9408957, 9158424, 8480396, 7795381, 7519106, 6881743, 6813846, 6454064, 6277211, 6067165, 6075908, 5774601, 5865861, 6003675, 5967411, 6161179, 6278665, 6380697, 6424462, 6616346, 6850675, 6782331, 6841242, 6904577, 6791902, 6954712, 6886862, 7109486]
15179G109486j11913M03564R4481j5422R8535K83660L0086n7937l1668j95605
15169G607267J7040j16449j11238K9274J09844L7088K0417K9574R8649J98888
15159G920354k113K73485J2580L40133k11486L18102l02744J42053J28537j70312
15149H448589j62823l6623M2405j36388k25137J4516J45258J80373k59184L14525
15139H325511j96620k15709L80733j63239M0671r955Q4574k60972P6795j58834
15129G902955J62079J47721k94644K40200j91566M5657k1848n0463L1131k52280
15119G718942J04902M4698j96464p3794j03375J52742j36464r6849M31779k06673
15109G639444K3039N5398M7359m8858M52533L60853M3227K54055K6101L66167
$$ y = [7109486, 6997573, 7401137, 7495618, 7480196, 7578731, 7862391, 7892477, 7834540, 7802872, 7607267, 7624307, 7507858, 7396620, 7425894, 7535738, 7572826, 7593243, 7622817, 7721466, 7920354, 7918241, 8191726, 8204306, 8544439, 8332953, 8651055, 8348311, 8490364, 8618901, 8448589, 8285766, 8249143, 8291548, 8155160, 7930023, 7944539, 8089797, 8270170, 8010986, 8325511, 8128891, 7913182, 8293915, 8130676, 8171347, 8161392, 8245966, 7984994, 8061789, 7902955, 8065034, 8212755, 7918111, 8158311, 7966745, 8012402, 7990554, 7940091, 7971222, 7718942, 7823844, 7868542, 7672078, 7598284, 7494909, 7647651, 7511187, 7414338, 7846117, 7639444, 7662483, 7717881, 7765240, 7716382, 8168915, 8529768, 8572995, 8827050, 8853151, 9219318]
15099I219318J84433M19616l7942L71622P4413O72602O56828J017282J412620
15090A3990792K586903L502685L336899K508328J987765J431162P90621M6671
15082C0181826j10835r31491j725701k314893j866062r45836R03096K518945K886651
15073B8595700K958535J605633J385775J164740O15101K49261o89029j253389
15065C4632327n92711J625047L705885L439007K536719K667606K768559K735272
15057E3517711K511908K368676M45892j502775k745052k771484l81008K144362
15049E3588230L472079L330483K347762J286421P00286J571587J641855K118582
15041G0057285N35574j403868k574852l489635k756147j718846j360775o95912
$$ y = [9219318, 9403751, 9823367, 9785425, 10157047, 10231460, 10904062, 11560890, 12578172, 13990792, 16577695, 20080380, 23417279, 25925607, 27913372, 29344534, 30135155, 30181826, 30070991, 29139500, 27413799, 25098906, 23232844, 22287008, 23190104, 25709049, 28595700, 31554235, 33159868, 34545643, 35710383, 36325484, 36574745, 35885716, 34632327, 34039616, 35664663, 39370548, 42809555, 45346274, 48013880, 50782439, 53517711, 56029619, 58398295, 58844187, 57341412, 54596360, 51824876, 51443868, 53588230, 57060309, 60390792, 62738554, 64024975, 64725261, 66296848, 67938703, 70057285, 70592859, 69188991, 66614139, 63124504, 60368357, 58649511, 57288736, 56592824]
15033E6592824o63590P24959K844100O326967P278786P281200P030196O747693
15025I4163135O368468M937581L206602J586342j571963l174260m516730m192217
15017I6806958k552595j615993j880659k900587k616409k532137k207080k348492
15009G8153006k648499l465136m464255m989367n067685l922517k209948j796046
15001D9589553j210282K5988Q95559J658554K071621J360949R25333J352112Q02694
14992E7472081m66687j432221j907790j911622j045183j57880O10155M5422K03781
14983E1410056P04033N65056N75716l52988j215527k644024l451550m147414l837442
14974C7605916k733260k865651k400782j837131r88779p88186M7801N73383O50995
$$ y = [56592824, 55929234, 56654193, 59498293, 65825260, 73104046, 80385246, 87415442, 94163135, 100531603, 105469184, 108675786, 110262128, 108690165, 105515905, 100999175, 96806958, 94254363, 92638370, 90757711, 87857124, 85240715, 82708578, 80501498, 78153006, 75504507, 72039371, 67575116, 62585749, 57518064, 53595547, 51385599, 49589553, 48379271, 48405259, 49300818, 50959372, 53030993, 54391942, 55317275, 56669387, 57472081, 57005394, 55573173, 53665383, 51753761, 50708578, 50550698, 51160853, 51206275, 51410056, 52114089, 52679145, 53254861, 52901873, 51686346, 49042322, 45590772, 41443358, 37605916, 34872656, 32007005, 29606223, 27769092, 26780313, 25992127, 26039928, 26613311, 27264306]
14965B7264306O31860R33489N14795R21397J249803J900809K674614L958512O103061
14956D6152646Q598897J2225449J7452818K3472795K7452479L0845458L6114024
14949B02314566L9249797L9202273L8523755L9268484L4354088K1631807P164626
14942D21709396m744570j2471317j8293867k2245584k6143060k9949822l2459158
14935B75402018l2689021k7605562j9505343j2831292j1024872j1511657j2920585
14928A47313686j4088142j2907747j1371041p886061m763913k466507k608063
14921I1222212l554783l705938l444424l779064m140728m969293o975187q909640
14913E1743155r796729r077312p033608m628740k862667k181307j226640m39028
$$ y = [27264306, 27896166, 28829655, 29344450, 30265847, 31515650, 33416459, 36091073, 40049585, 46152646, 54751543, 66976992, 84429810, 107902605, 135355084, 166200542, 202314566, 241564363, 280766636, 319290391, 358558875, 392912963, 414544770, 421709396, 416964826, 404493509, 386199642, 363954058, 337810998, 307861176, 275402018, 242712997, 215107435, 195602092, 182770800, 171745928, 160234271, 147313686, 133225544, 120317797, 108946756, 101060695, 96296782, 93830275, 91222212, 87667429, 83961491, 80517067, 76738003, 72597275, 67627982, 60652795, 51743155, 41946426, 32869114, 25835506, 21206766, 18344099, 16162792, 14936152, 14497124]
14905A4497124l5679N32564K41295J090094J361277J133558J542201J773857L021681
14896B5157972M650379O190731O151267M597282K929317J752562O35332p3921
14888E1990921j369646l094258m801701o735315o553165n583159l888843k140147
14880A7824687j143623r02634j17852L12691P62936J292944J165356Q99085J83188
14871B0276778L24582M25047K80714J62533j53635k27945j24413o65740M55079
14862B0753000J780427K634469N239294Q551855J0132682J0867821J1766106J1941428
14854H3667082J0367223O878859L981037N19645l169841p450234r832713j1831375
14846G3129683j2046759j1907547j0649127q084020n258855l389862k158576j607317
$$ y = [14497124, 14461445, 14994009, 15235304, 16325398, 17686675, 18820233, 20362434, 22136291, 25157972, 29808351, 35999082, 42150349, 46747631, 49676948, 51429510, 52064842, 51990921, 50621275, 47527017, 42725316, 35990001, 29436836, 23853677, 19964834, 17824687, 16681064, 15778430, 15660578, 15973269, 16736205, 18029149, 19194505, 20093590, 20276778, 20601360, 21026407, 21307121, 21469654, 21316019, 21088074, 20963661, 20297921, 20753000, 22533427, 25167896, 30407190, 38959045, 49091727, 59959548, 71725654, 83667082, 94034305, 100913164, 104894201, 105413846, 102244005, 94793771, 84961058, 73129683, 61082924, 49175377, 38526250, 30442230, 25183375, 21793513, 19634937, 18027620]
14838A8027620n86141j038320p33540m95820m5477l60312L69974k19923j00956
14829A4817105K84819M68314M76902J019184Q69663R65676J356322K319440M275621
14820B6853046P199133R367057R682941P738185N082828L308308J637580L5844
14812G0904922k028212m598352p980858r822194j0456923q816642o256205l969595
14804A6975941k301590j310324j023408j010317l93491l45687j76400l36011l17276
14795I761437k05106k50647m39960j98229j99872J35554m87171l0469k28394J99826
14785H056969J88672K9243M9652N63498K55368N54999J065687R93083M03203N17580
14775A2677954O66345j33283L5496l23152l43626r30671o96067q35951q87420
$$ y = [18027620, 17441479, 16403159, 15669619, 15173799, 15128322, 14768010, 15137984, 14918061, 14817105, 15101924, 15570238, 16047140, 17066324, 17935987, 18901663, 20257985, 22577425, 26853046, 34052179, 43419236, 53102177, 60840362, 65923190, 69231498, 70869078, 70904922, 68876710, 64278358, 56297500, 46475306, 36018383, 27201741, 20945536, 16975941, 14674351, 13364027, 12340619, 11330302, 10936811, 10591124, 10414724, 10078713, 9761437, 9556331, 9305684, 8865724, 8667495, 8467623, 8603177, 8116006, 8085537, 7857143, 8056969, 8245641, 8274884, 8324536, 8888034, 9143402, 9698401, 10764088, 11757171, 12160374, 12677954, 13344299, 13211016, 13246512, 12923360, 12579734, 11649063, 10952996, 10117045, 9229625]
14766I229625j01827n02428J20296q5514J99052J35450J18422L96016K61976L32550
14756A0103618m9714J96451k5080M66474j11898Q0921O7454K33911p9942K30119
14746A1112314q3543L15258K3466O09738P31043N57652Q23775J074705J284361
14737A6448769J717911K609671L238818M571567O765120J0495747J6526012K6662352
14729H9035967L5094156L9244189M0725051L7475380K9124270J9653338J0529801
14722C00882152J190906j0305080k2866298l3925745m0779320m1896581l8490185
14715A13809849l1206901k2398826j5049359j0072308o994456m470602l406118
14708B0211279k575204k079978r75145j338663p70216p37347r47823j155231l15851
$$ y = [9229625, 9127798, 8625370, 8745666, 8660152, 8859204, 8994654, 9113076, 9509092, 9771068, 10103618, 10053904, 10250355, 10225275, 10691749, 10579851, 10660772, 10728226, 10962137, 10882195, 11112314, 11028771, 11344029, 11367495, 11977233, 12708276, 13265928, 14089703, 15164408, 16448769, 18166680, 20776351, 24015169, 28586736, 35351856, 45847603, 62373615, 89035967, 124130123, 163374312, 204099363, 241574743, 270699013, 290352351, 300882152, 302073058, 291767978, 268901680, 234975935, 194196615, 152300034, 113809849, 82602948, 60204122, 45154763, 35082455, 28087999, 23617397, 20211279, 17636075, 15556097, 14580952, 13242289, 12472073, 11734726, 10786903, 9631672, 9315821]
14699I315821m51340m58536k55860k08149l05612j23830k76836k26541J80922
14690G190039O6727q8721m3991L7712j7083J46122j68610K38639M80992j56864
14680G684962O0225L79647M27714P51285J099407N24292P85442L71788K15813
14671A2300575k08285k62796j1357r66913j076858j012724p61578l37406n78591
14662G084067l99911L4577q8118J07824k85515k20758P6923j87533k38609l00914
14652E582033M3803K147J974n745J10047J85978Q7509K95935K9388L02925Q3020
14641F719014P1207O3522J40251N65298K69467M04794O54173O15972P6941J23432
14631I704071J98663m53192l96270r41295o66167n35802r28637n41085m53633
$$ y = [9315821, 8864481, 8405945, 8150085, 7941936, 7636324, 7512494, 7235658, 7009117, 7190039, 7256766, 7168045, 7124054, 7161766, 7144683, 7290805, 7122195, 7360834, 7841826, 7684962, 7745187, 8124834, 8552548, 9303833, 10403240, 10927532, 11712974, 12084762, 12300575, 12092290, 11829494, 11818137, 10851224, 9774366, 8761642, 8000064, 7662658, 7084067, 6684156, 6718733, 6630615, 6738439, 6452924, 6232166, 6309089, 6121556, 5882947, 5582033, 5625836, 5627983, 5629957, 5624212, 5734259, 5920237, 6007746, 6303681, 6333069, 6635994, 6719014, 6790221, 6853743, 6993994, 7559292, 7828759, 8233553, 8887726, 9503698, 9580639, 9704071, 9902734, 9449542, 9053272, 8111977, 7445810, 6910008, 5981371, 5440286, 4986653]
14622D986653l58120j75910j69422L99172N7220l71689j65965j93956R6079P8899
14612D182961N2529l93412j87794k278j0506k69205J14668j44517K2470j76224
14602C188692L09205K63697L94200O23139Q79502O46953K49198M63217L14801
14593G332604P939q6071l90595o0612q36360r11546n07329l23171j54037l15800
14583C755022K03399j57687M5758N2921R0382J47413r3056J07720q391K5675M1434
14572D210590J58777n2112L40145K14255M09549L94319M43473L00628P86057R98548
14562H204229J292583K725113N385942Q990763R877413P562769N498562L527081
14554E3064455K931629J369423l02083k126265n359164p704917r345649p058602
$$ y = [4986653, 4628533, 4452623, 4283201, 4682373, 4739593, 4367904, 4201939, 4007983, 4104062, 4182961, 4235490, 3842078, 3654284, 3652006, 3641500, 3372295, 3486963, 3342446, 3364916, 3188692, 3497897, 3761594, 4155794, 4778933, 5658435, 6305388, 6554586, 7017803, 7332604, 7340543, 7254472, 6863877, 6803265, 5966905, 5055359, 4548030, 4224859, 4070822, 3755022, 3958421, 3800734, 3846492, 3899413, 3989795, 4137208, 4044152, 4151872, 4143481, 4169156, 4210590, 4369367, 4317255, 4657400, 4871655, 5281204, 5675523, 6118996, 6419624, 7205681, 8204229, 9496812, 12221925, 17607867, 26598630, 36476043, 44038812, 49537374, 53064455, 55996084, 57365507, 57063424, 54937159, 49577995, 41873078, 32527429, 25468827]
14546B5468827l151836J135014N944942R242455Q750939O079228M273199L037465
14538F0780233J559343P348j887244m916799q233333r600901r705984o297753
14530B1704910l721888k185335j158784n09716k74350L3993Q6059o6322O68236
14521A4576803J733462M058478O427611O202711N028823L300398K554505J746419
14513D5629210P59159m02744j866877l957241n617618o256404l722343p53085
14505B3812057K024295N372383O852192M987444L423708K113272J183242O81453
14497E0450046j171851k108739m458936o129303o946010o677544m265288k825926
14489A5866449k248066j719807j477902q96186r28810j242234r09607j241487
$$ y = [25468827, 22316991, 23452005, 29396947, 38639402, 47390341, 53469569, 57742768, 60780233, 62339576, 62346924, 60459680, 55542881, 47309548, 37708647, 28002663, 21704910, 17983022, 15797687, 14638903, 14129187, 13854837, 13888830, 13974889, 13908567, 14576803, 16310265, 20368743, 26796354, 32999065, 38027888, 41328286, 43882791, 45629210, 46388369, 45985625, 44118748, 40161507, 34543889, 28287485, 24565142, 23812057, 25836352, 31208735, 38060927, 43048371, 46472079, 48585351, 49768593, 50450046, 49278195, 47169456, 42710520, 36581217, 29635207, 22957663, 18692375, 15866449, 13618383, 11898576, 10420674, 9524488, 8595678, 7353444, 6443837, 5202350]
14481E202350m94942l42193Q3569j83532k89513o9801q423l7135J71024J64311
14471D195715N43974M34246M68113J45592K64363L73235j10401J17254L2645L9761
14461F504497k98955l6972L58772K14666K43734J43369K10826J82873N2556l51078
14451G224288O615l57559l46257l61889l45935k4593M75383Q6613L84047L60229
14441G100942K20979L90377L15598N8176R9169O61049j445K58522N07035O54487
14431A0264889J040293K410336L863340N898537P303596P081387N470430M266230
14423D7599038L177832K436054Q50000j823632l312382n744175o783374p258306
14415B9141055n813472m642661l264918k569894j453428j450357o85880n79775
$$ y = [5202350, 4707408, 4365215, 4448784, 4265252, 3975739, 3905938, 3897515, 3860380, 4031404, 4195715, 4739689, 5173935, 5642048, 5787640, 6052003, 6425238, 6314837, 6432091, 6464736, 6504497, 6205542, 6168570, 6527342, 6742008, 6985742, 7129111, 7339937, 7522810, 7575366, 7224288, 7230903, 6873344, 6527087, 6165198, 5819263, 5794670, 6270053, 6356666, 6740713, 7100942, 7321921, 7712298, 8027896, 8086072, 8185241, 8846290, 8844845, 9103367, 9610402, 10264889, 11305182, 13715518, 17578858, 23477395, 30780991, 37862378, 43332808, 47599038, 50776870, 53212924, 54062924, 52239292, 48926910, 43182735, 36399361, 29141055, 23327583, 18684922, 15420004, 12850110, 11396682, 9946325, 9260445, 8680670]
14407H680670k60532j53711j12709L7148J09116J70755l8251M5900M19707M99211
14397I397304P71481J244792J852053L339904N168476Q236682J0822593J2061854
14389E2895139J1256914R356043O959677M839699K129660n72215m044972p492846
14381G5327099j0679952j1900306j1438630r741246p603015n000788l566497k532027
14373A2864638j633499r36999o96897n72807n4998n51747R8258J13468l23967
14364H305450K0597J39328P9102N92564L75125J110131J087761K038132K911506
14355A6659696L856500M914502N536537N367010N112630L633579K888771K273042
14347E0242267J701185J107990J184163K333488M332936N839756P173602O690395
$$ y = [8680670, 8420138, 8266427, 8153718, 8190866, 8299982, 8470737, 8432486, 8478386, 8898093, 9397304, 10168785, 11413577, 13265630, 16605534, 21774010, 30010692, 40833285, 52895139, 64152053, 73508096, 80467773, 85307472, 87437132, 86864917, 82819945, 75327099, 64647147, 52746841, 41308211, 31566965, 23963950, 18963162, 15396665, 12864638, 11231139, 10294140, 9597243, 9024436, 8969438, 8417691, 8515949, 8629417, 8305450, 8326047, 8465375, 8544477, 9137041, 9512166, 10622297, 11710058, 13748190, 16659696, 20516196, 25430698, 30967235, 36334245, 41446875, 45080454, 47969225, 50242267, 51943452, 53051442, 54235605, 56569093, 60902029, 66741785, 73915387, 80605782]
14339H0605782N850793N095871M521753L744308P39354l736635p669312j1711346
14331G7440568j2687362j1753328r583398p826756o935432n915279n155621l586621
14323A3996771k284163j816263j578368p71454p29327q25814k39316o52637l45816
14314D753613k78804k43745l6267j38710k08348k92362j92830J52369m54810J49705
14304C209811J5772l74266K52202j23801p0459o7492r2518j9228J4644k25880
14294B518785L38654k30364j56125k11195R9165m1209n6584M2744j64281L10698
14284B450288j76689M9205J84566l1689l1859l30945L62592q667L0671j70422
14274B327051O2683Q9590R8092j13197M2069j7962J9482J08150k12932Q761j82480
$$ y = [80605782, 86456575, 91552446, 96074199, 99818507, 100557861, 96821226, 89151914, 77440568, 64753206, 52999878, 43416480, 35589724, 28654292, 22739013, 17583392, 13996771, 11712608, 9896345, 8317977, 7546523, 6817196, 5991382, 5752066, 5099429, 4753613, 4474809, 4231064, 4194797, 4056087, 3847739, 3555377, 3362547, 3514916, 3060106, 3209811, 3225583, 2851317, 3103519, 2979718, 2909259, 2841767, 2749249, 2730021, 2744665, 2518785, 2857439, 2627075, 2470950, 2259755, 2358920, 2317711, 2261127, 2303871, 2139590, 2450288, 2273599, 2322804, 2507370, 2475681, 2443822, 2112877, 2475469, 2466802, 2497473, 2327051, 2389734, 2479324, 2577416, 2464219, 2506288, 2488326, 2507808, 2615958, 2403026, 2411787, 2229307]
14263B229307J25841k14210L53500l44784K73639l75166P5967O5453k96816L64799
14253B257530k75550j94750K32649J65498j93610j96507J26889p810K4217l4877
14243A903679p0201k23979L3564K08219k67813J89051j01374l813L09480n3666
14233A923147o1676j18157J64710j76746k5652L0489n4560M0201k45700L03482
14223A779538r5037L1303K11038Q4298L1772R1345j97348J22340K39383m2019
14213B256613Q5370j55931q4922J74543J75712Q84763N03057K51640J81117k18832
14203D053130K62500j05030O3041j38088o44656n32017o54861k61452j87616l34159
14193A520792K59538p8013j3772K5897J49397K23744m1786k11887j86594R7505
$$ y = [2229307, 2355148, 2140938, 2494438, 2149654, 2423293, 2048127, 2124094, 2189547, 1892731, 2257530, 1981980, 1787230, 2019879, 2185377, 1991767, 1795260, 1922149, 1914339, 1938556, 1903679, 1833478, 1609499, 1643063, 1851282, 1583469, 1772520, 1671146, 1667333, 1976813, 1923147, 1861471, 1743314, 1908024, 1731278, 1705626, 1736115, 1681555, 1721756, 1476056, 1779538, 1684501, 1715804, 1926842, 2011140, 2042912, 2134257, 1936909, 2059249, 2298632, 2256613, 2341983, 2186052, 2101130, 2275673, 2451385, 3336148, 3839205, 4090845, 4271962, 4053130, 4315630, 4210600, 4273641, 4135553, 3490897, 2958880, 2304019, 2042567, 1854951, 1520792, 1780330, 1702317, 1688545, 1714442, 1863839, 2087583, 2045797, 1833910, 1647316, 1744821]
14183A744821L31825l08457J92435k25405M52044J17907m3387J91078n4787k00312
14173B197762L85500o7336j00388j61631j52446l7019M0257m41972J99275j5031
14163A846971k28941J57126o6801J11694l674m474L7628j4833K54787o2843L7310
14152B063950K9514Q7102p3953J60236k81278k76520O73160j27675L61342L8391
14142B654269J21256N77239J058271R07995Q39451O83529K54810Q43186K29080
14133H169086n9279l78035l98591q38757p69917q58391p68939n96206j30406l43399
14123C027166j34908j11962M86382j20248L99186P215J29423N6637p8977J12597
14113C772511r5003l3066l56083j85967m96598Q2459k1356n18650K22758N1805
$$ y = [1744821, 2076646, 1768189, 1960624, 1735219, 2187263, 2305170, 2261783, 2452861, 2398074, 2197762, 2583262, 2515926, 2415538, 2253907, 2101461, 2064442, 2104699, 1662727, 1862002, 1846971, 1618030, 1775156, 1708355, 1820049, 1816375, 1811901, 1849529, 1834696, 2089483, 2026640, 2063950, 2093464, 2180566, 2106613, 2266849, 1985571, 1709051, 2382211, 2254536, 2615878, 2654269, 2775525, 3352764, 4411035, 5319030, 6158481, 6842010, 7096820, 7940006, 8169086, 8109807, 7731772, 7333181, 6494424, 5724507, 4866116, 4097177, 3500971, 3370565, 3027166, 2892258, 2780296, 3266678, 3146430, 3545616, 3552831, 3682254, 3738891, 3659914, 3772511, 3677508, 3644442, 3288359, 3102392, 2605794, 2688253, 2666897, 2148247, 2371005, 2422810]
14103B422810R8865r1391L32763N8091L45127J99195M86970J41833M20333O3281
14093D477877J91888Q3251J20827M7014j91308k148l62959K5168K49921M52978
14083E092509O78902M95537M61560M50839L31857M53251M47150N10502J57223
14074I079330N83586O26561P29208J510432K054654L084863M364921O074278Q873593
14065C6981426J1412112J2074425J0987373Q773318O932506M982931K697126J63764
14057I5004981l276526p837696j1472012j3445012j3065504j0245454p722663
14050B7940114n754843m500282l140387k108233j368769j162870r96578n72407
14042H335745m09737p88970q0422n64096n29305k72568p54148l27501q2972m83279
$$ y = [2422810, 2521675, 2430284, 2763047, 2821138, 3166265, 3365460, 3852430, 3994263, 4414596, 4477877, 4669765, 4753016, 4873843, 4920857, 4729549, 4727401, 4364442, 4389610, 4639531, 5092509, 5771411, 6266948, 6728508, 7179347, 7511204, 7964455, 8411605, 8922107, 9079330, 9662916, 10289477, 11018685, 12529117, 14583771, 17668634, 22033555, 28107833, 36981426, 48393538, 60467963, 71455336, 80228654, 87161160, 92144091, 94841217, 95004981, 91728455, 83890759, 72418747, 58973735, 45908231, 35662777, 27940114, 22185271, 17684989, 14544602, 12436369, 11067600, 9904730, 8908152, 8335745, 7926008, 7137038, 7056616, 6492520, 5963215, 5690647, 4936499, 4608998, 4526026, 4042747]
14032D042747k77686m77114L075O4416j63122r1475l12594p805k85418J17575
14022B612599k6645j75077m069p8702P0537j35159M5431o9650j08760m4681N7160
14011B142984j6609M6786L1430J38132k7065j6691k53338K37933k36984j30918
14001A915660K05233k04867K6376J4026j77396K73706l990m0947J16076K16196
13991B340073J59661j6718M13783N57503K41198R39572R44210J209145P70238
13982G558665M51354N87936K64327K68475k89053l56731r06002p51116r37270
13973E890585j060711n17185j07503p07297k05269J3095j02425O2287j54709n4484
13963C056384k11011j45634k73206j17882q9884j52723r6540K6886l08632L30403
$$ y = [4042747, 3765061, 3287947, 3291022, 3355438, 3192316, 3100841, 2788247, 2780442, 2495024, 2612599, 2585954, 2410877, 2406808, 2328106, 2398643, 2263484, 2308915, 2239265, 2130505, 2085824, 2142984, 2126375, 2173161, 2204591, 2342723, 2315658, 2298967, 2045629, 2283562, 2046578, 1915660, 2120893, 1916026, 1942402, 1956428, 1779032, 2052738, 2048748, 2007801, 2123877, 2340073, 2499734, 2483016, 2896799, 3454302, 3695500, 4635072, 5579282, 6788427, 7558665, 8010019, 8597955, 8862282, 9130757, 8841704, 8484973, 7578971, 6827855, 5890585, 4829874, 4312689, 4205186, 3497889, 3292620, 3305715, 3203290, 3265577, 3110868, 3056384, 2845373, 2699739, 2426533, 2308651, 2218767, 2066044, 1969504, 1996390, 1687758, 2018161]
13953B018161j64031J109K54078J42257n8381J82593J27163K65270o43J20193
13943B887769M45518P48348R91478J651291J724350K412080K220255K133652J759192
13934A6973933R76520O98282n26406j121015j642351k300171k409098k270289
13926H379405j952147j956073j133507l74386l04206k24783k88530l1755l07866
13917A806152J2780k24729J11310n7217M9001J22676k40099N524j24146J43463
13907A604715p1462j10072n7987k02949L48574L4450j00640k25331j6691M60288
13897A662895o407m8597l25746J59954j91118K1814K25325m6593o0509m4514M9870
13886A396374l5805j26257N46460l70333J18459m6734k10559K26586j16224m214
$$ y = [2018161, 1854130, 1855239, 2109317, 2251574, 2193193, 2375786, 2502949, 2768219, 2767576, 2887769, 3333287, 4081635, 5073113, 6724404, 8448754, 10860834, 13081089, 15214741, 16973933, 17950453, 18648735, 18122329, 17001314, 15358963, 13058792, 10649694, 8379405, 6427258, 4471185, 3337678, 2963292, 2659086, 2434303, 2145773, 2114018, 1806152, 1818932, 1594203, 1705513, 1648296, 1697297, 1819973, 1579874, 1585398, 1461252, 1604715, 1533253, 1423181, 1365194, 1162245, 1510819, 1545269, 1444629, 1219298, 1202607, 1662895, 1656488, 1607891, 1282145, 1442099, 1250981, 1272795, 1498120, 1451527, 1391018, 1346504, 1396374, 1360569, 1234312, 1780772, 1410439, 1528898, 1482164, 1271605, 1498191, 1381967, 1377753]
13876A377753j91111K48710k54044Q3243pl8635J10853K5307k5711O9555P5668
13865A481581k83838J67789J53834j23649J60050N1800K17216l90175J49399k84434
13855A299573J00480j57152j4020J31833J47075J42486j33607k71125K82602J5026
13845A543171o9754k90802L28655Q9769l13729n9640K11206l00199K72304k21091
13835A189890L7314L2754J02314L0624j88412J26642J06564j21643J03858Q1404
13825A501309k9930r4299N2963k10583J6665k6460Q0106N8587j15168m756K6350
13814A254784j15266L09833l31498P1894r4418n196K0853J27693J6603j29059
13804A126223j3306J95279k37610J19747K97665j32353J27484j34709J55491o8090
$$ y = [1377753, 1186642, 1435352, 1181308, 1264551, 1264544, 1225909, 1336762, 1362069, 1336358, 1405913, 1481581, 1197743, 1365532, 1519366, 1395717, 1555767, 1607567, 1824783, 1434608, 1584007, 1299573, 1400053, 1242901, 1228881, 1360714, 1507789, 1650275, 1516668, 1245543, 1528145, 1543171, 1473417, 1182615, 1511270, 1601039, 1287310, 1227670, 1438876, 1138677, 1410981, 1189890, 1227204, 1259958, 1362272, 1392896, 1204484, 1331126, 1437690, 1316047, 1419905, 1501309, 1471379, 1377080, 1430043, 1219460, 1236125, 1209665, 1289771, 1348358, 1233190, 1228434, 1254784, 1139518, 1449351, 1117853, 1189747, 1095329, 1090133, 1110986, 1238679, 1255282, 1126223, 1112917, 1308196, 1070586, 1190333, 1487998, 1355645, 1483129, 1348420, 1503911, 1435821]
13794A435821n930k52311M4464l0990J5561J09306k17912L36569k89226J89619
13784A334971k12745N595l7189K20258M0199M6178L94345k36982m0423Q0666N4882
13773A649755k2811K50686j56922j40579K75017j87003j45456r3175K50938m01363
13763A279087n5872J57327N3672K05951l42515j87556K98078j81043n8101l1390
13753A137638J28841m0974L72636k7580K0411l32168O138K75537k5964q2997J1545
13742A443063J84255L5292K2821k40509K75936o4285j36091Q5752L10508l74656
13732A542086J22683J57189k01357O2382P2248j96843J11138N3095o0123R7200
13722A759698J70762m1783J17021o1125k17950L26273J83927j66040R8134k83888
$$ y = [1435821, 1429891, 1177580, 1222044, 1191054, 1206615, 1315921, 1098009, 1434578, 1145352, 1334971, 1122226, 1127821, 1090632, 1310890, 1351089, 1397267, 1791612, 1554630, 1514207, 1594873, 1649755, 1626944, 1877630, 1720708, 1580129, 1855146, 1668143, 1522687, 1429512, 1680450, 1279087, 1223215, 1380542, 1434214, 1640165, 1297650, 1110094, 1408172, 1227129, 1169028, 1137638, 1266479, 1225505, 1598141, 1570561, 1590972, 1258804, 1264942, 1540479, 1514515, 1431518, 1443063, 1627318, 1662610, 1685431, 1444922, 1720858, 1656573, 1520482, 1606234, 1916742, 1542086, 1664769, 1821958, 1620601, 1682983, 1755231, 1558388, 1669526, 1722621, 1662498, 1759698, 1930460, 1888677, 2005698, 1944573, 1726623, 2052896, 2236823, 2070783, 2168917, 1885029]
13712A885029K36185j00494K671K70215k07258J28191J63399k07312J15899l17595
13702A968930K18592k42485J63392r73j47775k4177L24571N4858M72N2026K52501
13691B619932j46178K41069r5450o8766m4775n577k72476p8838j70397j55473
13681A823071R0925k27240J4520m7532J39772j1340O5636K22567k43581J33281
13671A960079J9829j27783k237L82857l64021K27622L00459m8771P5679M565L02892
13660B731170p0117m9396r450j83414k1258m9302J20738l38434o1293k30347k38260
13649A600637J95133n7893L52632o0086p5181j1410J42208l03504L7225n4975
13639A764786J43398j6910j13267L55087J47627j32470M03660j01873K77917M2101
$$ y = [1885029, 2121214, 2020720, 2023391, 2293606, 2086348, 2214539, 2377938, 2170626, 2286525, 1968930, 2187522, 1945037, 2108429, 2107456, 1959681, 1935504, 2260075, 2314933, 2315405, 2367431, 2619932, 2473754, 2714823, 2619373, 2550607, 2505832, 2500255, 2227779, 2148941, 1978544, 1823071, 1913996, 1686756, 1701276, 1653744, 1793516, 1782176, 1847812, 2070379, 1826798, 1960079, 1979908, 1852125, 1849888, 2232745, 1868724, 2096346, 2396805, 2348034, 2423713, 2428278, 2731170, 2661053, 2611657, 2602207, 2418793, 2397535, 2348233, 2468971, 2130537, 2069244, 1838897, 1600637, 1795770, 1737877, 2090509, 2030423, 1955242, 1943832, 2086040, 1782536, 1819761, 1764786, 1908184, 1891274, 1778007, 2133094, 2280721, 2148251, 2551911, 2450038, 2727955, 2770056]
13629B770056j28125j43252j32804k91287J60257l38229j8468j55381j6102J1474
13619A718139q8757J37222k44297O134N11586j98034o6171j32318R8168K62497
13609B004169j62801P9907K23633j72648Q3382j08834J82999k75174o5195O5356
13599A854794k53121P2978K45243j17504J46796L4622j45181j3464J84634K22
13589B010019l8038n2931m0548k56250K96061k28717n3688o3973M1617K88581
13579A902133l97986K20380k48453O5139k9197R1682j25114R3621j03305J42190
13569A611090O4523L2637k71538J19537k45634R8597L50450k93260j55694O1643
13559A372351M6952o5490K01959j62517J23125R9509j97863J05105j65375K16199
$$ y = [2770056, 2641931, 2498679, 2365875, 2074588, 2234845, 1896616, 1878148, 1722767, 1706665, 1718139, 1629382, 1766604, 1522307, 1528441, 2040027, 1841993, 1775822, 1643504, 1741672, 2004169, 1841368, 1921275, 2144908, 1972260, 2055642, 1946808, 2129807, 1854633, 1789438, 1854794, 1601673, 1674651, 1919894, 1802390, 1949186, 1983808, 1838627, 1825163, 2009797, 2010019, 1971981, 1919050, 1878502, 1622252, 1918313, 1689596, 1635908, 1571935, 1613552, 1902133, 1504147, 1724527, 1476074, 1541213, 1512016, 1603698, 1478584, 1572205, 1468900, 1611090, 1675613, 1708250, 1436712, 1556249, 1310615, 1409212, 1759662, 1466402, 1310708, 1372351, 1419303, 1353813, 1555772, 1393255, 1516380, 1615889, 1418026, 1523131, 1357756, 1573955]
13549A573955k498r8694J88784j42890J01960J61286O5120J15767K02757q6215
13539B079332o5884J22723q5518J77089j59189k28644j4704m0571n3605j80604
13529A550425n392N1992K19045K9111K45326k29034M76812m47542M7575J10720
13519B049038L56314l17785l47402l02543K8072k73554J86897q6695O4413n0744
13509A306011j43828k46108L47124N7880l1384j9190j5070r3111M8198Q7262j75517
13498A122267n6817L40000r8409l7636k1521r3013q5869K88617q0115k78258K82769
13487A282015j07497K037m9471J41967j63622K64478k14533O6976k59434L35914
13477A298830r6870n1844J81773j12640O897K56700n72500K04929K12102j74680
$$ y = [1573955, 1571457, 1472763, 1661547, 1518657, 1620617, 1781903, 1847023, 1962790, 2165547, 2079332, 2013448, 2136171, 2050653, 2227742, 2068553, 1839909, 1825205, 1784634, 1731029, 1550425, 1545033, 1597025, 1816070, 1845181, 2090507, 1861473, 2338285, 1890743, 1938318, 2049038, 2405352, 2087567, 1740165, 1437622, 1465694, 1192140, 1379037, 1292342, 1356755, 1306011, 1162183, 916075, 1263199, 1321079, 1289695, 1270505, 1255435, 1162324, 1210522, 1297784, 1122267, 1065450, 1405450, 1307041, 1269405, 1247884, 1154871, 1069002, 1357619, 1277504, 999246, 1282015, 1174518, 1176555, 1127084, 1269051, 1105429, 1369907, 1155374, 1222350, 962916, 1298830, 1201960, 1150116, 1331889, 1219249, 1226146, 1482846, 910346, 1115275, 1327377, 1152697]
13467A152697M8807M8203k17015J43125j93453l4154J37293Q9638k4575Q289L01878
13456A460733l43796M87555o1607Q6530J31445J64574J60792K16022q7986J82344
13446B396606k33249o5334j95839k47646l7177j19864k77212L05657k58517j13284
13436A154141L04216j11728n8996n7319R2431J14220j78079O6058K27543j54973
13426A397514O0458j01967J80861K02002J50659K41511L0974K54176l68899N6240
13416B103529J18131J67469k62383j34565j04226k22084J4869o6603q2778O7789
13406A599148j77039k4078P3615j81880K00314p1066J01498n1387J25658p7268
13396A517515j0941j41070L54699J1540n1786K97735r6193j31246j27863K68796
$$ y = [1152697, 1201504, 1249707, 1032692, 1175817, 982364, 948210, 1085503, 1175141, 1150566, 1158855, 1460733, 1116937, 1604492, 1542885, 1629415, 1760860, 1925434, 2086226, 2302248, 2214262, 2396606, 2163357, 2098023, 1902184, 1654538, 1617361, 1497497, 1220285, 1525942, 1267425, 1154141, 1458357, 1346629, 1287633, 1230314, 1322745, 1436965, 1258886, 1324944, 1552487, 1397514, 1457972, 1356005, 1536866, 1738868, 1889527, 2131038, 2162012, 2416188, 2047289, 2103529, 2221660, 2389129, 2126746, 1992181, 1887955, 1665871, 1680740, 1614137, 1531359, 1599148, 1422109, 1398031, 1471646, 1289766, 1490080, 1419014, 1520512, 1469125, 1594783, 1517515, 1506574, 1365504, 1720203, 1731743, 1679957, 1977692, 1881499, 1750253, 1622390, 1891186]
13386A891186J3833J57589K18814Q2160K0068k30222K28250L8746k37017P4358
13376B257765p8294k8360j6845k28720P2701k54875K1242L63479l06421J22534
13366A924206j43770l7610K01533J22714j72295K65301q0461J5335o1191k79688
13356A754074J42240n6215K25490N228K03056k64038J45704P5614j69237K46607
13346B308523j87748j67153N1738p3738j33668K22398j98988K60570l46902R1911
13336A826943K0258J6585o7963J20652l7746K34016l94053L90811k23224J09096
13326A995375j50986J91938J69628p2229j85307o8104J44123M9651r8409J91302
13316B166982N7900K44641J2404J36855K31395r690J48101j65552L7712r406j52336
$$ y = [1891186, 1905019, 2062608, 2281422, 2363582, 2383650, 2153428, 2381678, 2420424, 2183407, 2257765, 2179471, 2151111, 2134266, 1905546, 1978247, 1723372, 1744614, 2108093, 1801672, 1924206, 1780436, 1742826, 1944359, 2067073, 1894778, 2160079, 2079618, 2094953, 2033762, 1754074, 1896314, 1840099, 2065589, 2070817, 2273873, 2009835, 2155539, 2231153, 2061916, 2308523, 2120775, 1953622, 2005360, 1931622, 1797954, 2020352, 1821364, 2081934, 1735032, 1826943, 1847201, 1863786, 1795823, 1916475, 1878729, 2112745, 1718692, 2109503, 1886279, 1995375, 1844389, 2036327, 2205955, 2133726, 1948419, 1880315, 2024438, 2074089, 1975680, 2166982, 2224882, 2469523, 2481927, 2618782, 2850177, 2840487, 2988588, 2823036, 2860748, 2851342, 2699006]
13305B699006j39405j17418J67528P3549j82085j70202M95785K97842l43950L02170
13295C082820k2351J8298K16491R5700k32513O5918k12520o8211Q4228m5384O7002
13284C049478k34752k454L04901l48570L38148m6203n0775J84996O9944j85460
13274C079253K22764j2039L7493j50464R7831J82045o453R9076k1293p8832L76152
13263C825533l4374O2203L1398l0726K61378j44603J29606P2547L1844K66101
13253D470907m3873J33088L6096K51440K07493N4786J95152K3008j01253K27446
13243E454290j21144M11259l14517L51091K77355j83629m7020J53662j28989J02504
13233E954862K72933J38521K4487J56715K25837p0619R6950K66793L71518Q9931
$$ y = [2699006, 2559601, 2442183, 2609711, 2683260, 2501175, 2330973, 2826758, 3124600, 2780650, 3082820, 3060469, 3078767, 3295258, 3390958, 3158445, 3224363, 3011843, 2943632, 3027860, 2982476, 3049478, 2814726, 2812272, 3117173, 2768603, 3106751, 3060548, 3009773, 3194769, 3264713, 3079253, 3302017, 3289978, 3327471, 3177007, 3274838, 3456883, 3450430, 3549506, 3528213, 3449381, 3825533, 3791159, 3853362, 3884760, 3854034, 4115412, 3970809, 4100415, 4172962, 4204806, 4470907, 4427034, 4560122, 4596218, 4847658, 5055151, 5109937, 5305089, 5328097, 5226844, 5454290, 5333146, 5744405, 5429888, 5780979, 6058334, 5874705, 5827685, 5981347, 5852358, 5954862, 6227795, 6366316, 6390803, 6547518, 6773355, 6702736, 6799686, 7066479, 7437997, 7527928]
13223G527928K73921r3516J11848q4944j5553L81475j41707N598q806Q6985j88114
13212G855115M5853k87461J6212j66019o5815q0630j23928L6500Q1162l89400
13202F921589L11243k30963L6972K9817p462K0944o6691J05884l54321o5827p4238
13191F626947J70406K6711l17243j60417k72772K87241P7878o18069O3577q0974
13181E803285M0307l92773J97396k50011k6470o4478k6090j50254J47309k85529
13171D992692j084j61823L23818j16319L2482o4933K32181J15920M5406L52753
13161E751093K75285m8164P64224J18124K30386M62084J8746P0089L9074K799
13151G683740o1487j34003n7735k01674p7870J83382k8556k80703j2600k41176
$$ y = [7527928, 7801849, 7708333, 7820181, 7735237, 7719684, 8101159, 7959452, 7965050, 7956244, 8043229, 7855115, 7900968, 7613507, 7629719, 7463700, 7397885, 7317255, 7193327, 7229827, 7310989, 6921589, 7232832, 7001869, 7038841, 7068658, 7061196, 7082140, 7015449, 7121333, 6767012, 6701185, 6626947, 6797353, 6824064, 6506821, 6346404, 6073632, 6360873, 6438751, 5820682, 5884259, 5803285, 5843592, 5450819, 5648215, 5398204, 5371734, 5307256, 5281166, 5130912, 5278221, 4992692, 4991608, 4829785, 5153603, 5037284, 5069766, 5004833, 5237014, 5352934, 5398340, 5751093, 6026378, 5978214, 6742438, 6860562, 7090948, 7553032, 7571778, 7641867, 7680941, 7683740, 7622253, 7488250, 7430515, 7228841, 7150971, 7334353, 7305797, 7025094, 7012494, 6771318]
13141F771318J93389j53180k05014o24506J92997o31099m17910k62670j21056
13132D742269m86046r3374j9608k9405p2297J10947k52909R5819J1028J1088M7353
13121D064865k58391o5123j31526j8521j06412r9551n2883m6071n8169o1670R1896
13110C258444k79142K49269l1026n4811L00314J25983J824n3151J45868Q9828
13100C753400L96451K4608L67502N80562M12868L04459M50569N45357K41512L18777
13090G396065R9342j60472J67442j38002j70646J27797j24568j50224M0068k20594
13080F866208K9844q2430m42024m38466j35111l46603o45749l72090j20611n30132
13070C782836l16292j20085r7438j50641k97899K76371r12Q0917j61375q3546
$$ y = [6771318, 6964707, 6811527, 6606513, 5982007, 6175004, 5543905, 5125995, 4863325, 4742269, 4256223, 4162849, 4143241, 4113836, 4041539, 4152486, 3899577, 3995396, 4006424, 4017512, 4064865, 3806474, 3741351, 3609825, 3591304, 3484892, 3385341, 3332458, 3286387, 3228218, 3166548, 3258444, 2979302, 3228571, 3197545, 3142734, 3443048, 3569031, 3570855, 3517704, 3663572, 3753400, 4149851, 4174459, 4541961, 5122523, 5535391, 5839850, 6290419, 6835776, 7077288, 7396065, 7495407, 7334935, 7502377, 7364375, 7193729, 7321526, 7196958, 7046734, 7086802, 6866208, 6896052, 6813622, 6371598, 5933132, 5798021, 5451418, 4805669, 4433579, 4312968, 3782836, 3466544, 3346459, 3249021, 3098380, 2800481, 3076852, 3075940, 3156857, 2995482, 2911936]
13060B911936K00960j05726M9471q8549J35003M7714K54912j11461j56913k00184
13050B937163L19675l2061j88405j46341J26516K906o7219J9924j7226J10853
13040C065785r7020K13259j72234K11040k8475L4299M9095J57612k34378L16868
13030C515851j03892J88408j83316J63901L15426m53851L87976J59993k67251
13021C723245j40940K88956p0233L32535J05231J7711l0137K62954p5864N7832
13011D471290J19368Q097J38800L04929j26219j06945J9534L50561N8258L421
13001E241094J44632J6272o163J69117J07107J4915J65098J415J1107J64359K04892
12990F233845p5244J96633n4355M6357M866j03506K55753j96082j68839j0484
$$ y = [2911936, 3112896, 3007170, 3056641, 2968092, 3103095, 3150809, 3405721, 3294260, 3137347, 2937163, 3256838, 3224777, 3036372, 2890031, 3016547, 3019453, 2952234, 2972158, 2954932, 3065785, 2968765, 3182024, 3009790, 3220830, 3192355, 3226654, 3275749, 3433361, 3198983, 3515851, 3411959, 3600367, 3417051, 3580952, 3896378, 3442527, 3830503, 3990496, 3723245, 3582305, 3871261, 3801028, 4133563, 4238794, 4256505, 4226368, 4489322, 4413458, 4471290, 4590658, 4598755, 4737555, 5042484, 4916265, 4809320, 4828854, 5179415, 5237673, 5241094, 5385726, 5401998, 5395835, 5564952, 5672059, 5686974, 5852072, 5853487, 5864594, 6028953, 6233845, 6158601, 6355234, 6300879, 6347236, 6352102, 6248596, 6504349, 6308267, 6139428, 6128944]
12980F128944M114J9596Q8549Q8903k1114n3023l22465k6783n8411p2480j28752
12969E647078r5899k5907J34324K5979k00992j25605J80002k49338J9847K06718
12959E516207p6968k75605N22299l51564j64027K67738j24097L17918k40260Q3850
12949E475491k03552J04222P668j73332R6062k8429J66179J12909j51737j56964
12939E248517K36353L07004l70199L4603J5866R4636J5712j37628M26242j93412
12929E677694N9746Q3510k55092k59953J78685p427q5000R959k91458K92893m9001
12918E354556M564k53428j4820l9029k28136J81307k81307l2396j90473p1474
12908D429364j70222N7303o8996n9523N3415j47180k08101r4725O1003l3165j93844
$$ y = [6128944, 6133058, 6152654, 6241203, 6330106, 6308992, 6255969, 5933504, 5906721, 5848310, 5775830, 5647078, 5551179, 5525272, 5659596, 5685575, 5484583, 5358978, 5538980, 5289642, 5309489, 5516207, 5439239, 5163634, 5685933, 5334369, 5170342, 5438080, 5313983, 5631901, 5391641, 5475491, 5271939, 5376161, 5383829, 5210497, 5306559, 5278130, 5444309, 5557218, 5405481, 5248517, 5484870, 5791874, 5421675, 5456278, 5472144, 5566780, 5582492, 5444864, 5871106, 5677694, 5737440, 5820950, 5565858, 5305905, 5484590, 5477163, 5392163, 5402122, 5110664, 5403557, 5354556, 5359120, 5105692, 5090872, 5051843, 4823707, 5005014, 4723707, 4691311, 4500838, 4429364, 4259142, 4316445, 4247449, 4187926, 4241341, 4094161, 3886060, 3791335, 3852338, 3819173, 3625329]
12897C625329j20l02628K91569q2366p5651K08692p8691m7539o1847Q2993j59437
12886C400304j20078Q7469o3707m3304N1753k05039K95184j06737j87389K51202
12876C359658l54271Q8L9099N281j705k03667J65280l2813l00993j20046J74174
12865B730085Q7910j7277j77703K14287j42207Q4207k19328R8699L1195N245Q4765
12854B779878r1464r6101p1547L34299l7002j4819k71618L05194j87811j13607
12844B535402J12433p298R8841l46843L74312N0531k40421O6063j21931J61798
12834B682887n3959l10191J18292Q5546J54263k20279K64621j55742m4057Q3475
12824B604856j42414p4081K72263j024k01092n8392J62894j05076q8022K79693
$$ y = [3625329, 3625209, 3322581, 3614150, 3531784, 3456133, 3664825, 3586134, 3538595, 3476748, 3559741, 3400304, 3280226, 3367695, 3303988, 3260684, 3312437, 3107398, 3402582, 3295845, 3108456, 3359658, 3005387, 3005475, 3044574, 3049855, 3048150, 2844483, 3009763, 2976950, 2675957, 2555911, 2730085, 2817995, 2800718, 2623015, 2837302, 2695095, 2779302, 2559974, 2658673, 2689868, 2695113, 2779878, 2688414, 2592313, 2520766, 2855065, 2818063, 2803244, 2531626, 2836820, 2649009, 2535402, 2647835, 2640537, 2739378, 2392535, 2766847, 2817378, 2576957, 2643020, 2521089, 2682887, 2628928, 2318737, 2437029, 2522575, 2676838, 2456559, 2721180, 2565438, 2521381, 2604856, 2462442, 2388361, 2660624, 2659600, 2458508, 2400116, 2563010, 2457934, 2369912, 2649605]
12814B649605j74368L6941L51281k00164k29262L01398r0289J29154j63848q3311
12804B527137k4510q4935J59024n0159j6276J74967k55270L87298k07027K628
12794B612877n1921J28434q015k57838K04727r4233L9761J51265M2472k10634
12784B556895Q584J02419R5051k26376N3209j7390J78329k28791J67424j40327
12774B549027L28104k46448L5172K0193R7755K6524j84060O1579J33621R7217
12764B918684k63503p6838J18865J54911j66350O8175J55237k78154N3690J69294
12754B854011j32927K69738j65208Q2905K1643k66119j748N9992O8261n9128J16507
12743B847927Q5885l8887j64387K83045k38339L0569J79254o6999O1834p9008
$$ y = [2649605, 2475237, 2512178, 2863459, 2663295, 2434033, 2735431, 2645142, 2774296, 2610448, 2527137, 2502627, 2417692, 2576716, 2526557, 2510281, 2685248, 2429978, 2817276, 2610249, 2612877, 2560956, 2689390, 2681375, 2423537, 2628264, 2534031, 2573792, 2725057, 2767529, 2556895, 2565479, 2667898, 2762949, 2536573, 2589782, 2572392, 2750721, 2521930, 2689354, 2549027, 2877131, 2630683, 2665855, 2686048, 2783803, 2810327, 2626267, 2687846, 2821467, 2918684, 2655181, 2578343, 2697208, 2852119, 2685769, 2753944, 2909181, 2631027, 2684717, 2854011, 2721084, 2990822, 2825614, 2908519, 2930162, 2664043, 2662295, 2722287, 2790548, 2731420, 2847927, 2933812, 2894925, 2730538, 3013583, 2775244, 2805813, 2985067, 2918068, 2979902, 2900894]
12733B900894k8129J22395L2163j73657J05502J8531j8243J13723j44632k7153
12723B901394m1273j43829J84998J3498q1815J40766J78249k7288j80423J92780
12713C137057j0492J09517q9291K21503j87182P5219J42585p9563J53000P3229
12703C545582J86961m4420J54491R5454J96734n4048M29007J68547J07426L93776
12693E179510K40636L42045K65209M40322O16166K56156M54523N5918l22322p5086
12683G453077j01455m86637m22793m63470l66794o95065n8393n56052J301j8716
12673D285003N3456j34618P5530J6583J70579Q3259j50678N1134L75992q537m2357
12662D775346K31478m09084L21898q0627R6143L53874q9197J36229M82898R4276
$$ y = [2900894, 2872765, 2995160, 3027323, 2853666, 2959168, 2977699, 2959456, 3073179, 2928547, 2901394, 2860121, 2716292, 2901290, 2914788, 2832973, 2973739, 3151988, 3124700, 2944277, 3137057, 3126565, 3236082, 3146791, 3368294, 3181112, 3256331, 3398916, 3319353, 3472353, 3545582, 3732543, 3688123, 3842614, 3938068, 4134802, 4080754, 4509761, 4678308, 4785734, 5179510, 5420146, 5762191, 6027400, 6467722, 7083888, 7340044, 7794567, 7850485, 7528163, 7453077, 7351622, 6864985, 6442192, 5978722, 5611928, 4916863, 4858470, 4302418, 4303719, 4285003, 4338459, 4203841, 4279371, 4295954, 4466533, 4549792, 4399114, 4450248, 4826240, 4817703, 4775346, 5006824, 4597740, 4919638, 4839011, 4935154, 5289028, 5199831, 5336060, 5818958, 5913234]
12652E913234K63525K331J63930L33701K67560k86185j7635j39478j16199P6627
12642F461411m82187K91263j43696j10140N2485K07435P7043K23741l5891J44397
12632F685861M41148j56169K42769K32681O3635m6429j9297k43286m39605q246
12622F753062l89645j32362l50155k88976l11256k13678k36112O3749P671q2095
12612D820203K59617K66591M73180M69055N01855M29296N24157K32242L43386
12603H319582j11343l28669j10031n21540J50834o91473n07377k31616l11489
12594E656878j9662k14742K23137L19276L1208K20853M0753l3079K6013N5038
12584F305673O5501m64838L5662k90790K94895K5856M43651l07681K21980J84699
$$ y = [5913234, 6176759, 6179090, 6343020, 6676721, 6944281, 6658096, 6640461, 6500983, 6384784, 6461411, 5979224, 6270487, 6126791, 6016651, 6069136, 6276571, 6353614, 6577355, 6541464, 6685861, 7127009, 6970840, 7213609, 7446290, 7509925, 7463496, 7444199, 7200913, 6761308, 6753062, 6363417, 6231055, 5880900, 5591924, 5280668, 5066990, 4830878, 4894627, 4902298, 4820203, 5079820, 5346411, 5819591, 6288646, 6790501, 7219797, 7743954, 7976196, 8319582, 8208239, 7879570, 7769539, 7247999, 7398833, 6707360, 6199983, 5968367, 5656878, 5637216, 5422474, 5645611, 5964887, 5996095, 6216948, 6257701, 6224622, 6250635, 6305673, 6371174, 5906336, 5941998, 5651208, 5946103, 5971959, 6415610, 6107929, 6329909, 6514608]
12574F514608q5156l45j75161j7362l94990j24100k29176n29437l07780k3285
12564D627816j11808j13358l114L8547j51240K95109j12227J41015n9971J11691
12554D662460L3627k37530K53671j18527J38633j39319R8114J30062l37492K90406
12544D774105o6944o9930L78577l7471k0594K38421m57763K82506M8183j95714
12534D873376R2051j36303l1960j69057O7789m84699N8424K5680J41481j13878
12524D322904M4723K04718j1191J78030p9542j65291J13696l0654N9782p7031
12514D560144K43959K86942K17976K82248L40953r6527K51291Q3490O3472k59294
12504E974654l6525l13020n8704m10057k95846J74127l89225K23033j03507r9309
$$ y = [6514608, 6429452, 6429107, 6253946, 6236584, 5841594, 5717494, 5488318, 4958881, 4651101, 4627816, 4516008, 4402650, 4399536, 4438083, 4286843, 4581952, 4469725, 4610740, 4550769, 4662460, 4696087, 4458557, 4712228, 4593701, 4732334, 4593015, 4691129, 4821191, 4483699, 4774105, 4707161, 4637231, 5015808, 4978337, 4957743, 5196164, 4738401, 5020907, 5069090, 4873376, 4965427, 4829124, 4797164, 4628107, 4695896, 4211197, 4269621, 4295301, 4436782, 4322904, 4367627, 4572345, 4561154, 4739184, 4659642, 4494351, 4608047, 4577393, 4637175, 4560144, 4804103, 5091045, 5309021, 5591269, 5932222, 5835695, 6086986, 6170476, 6233948, 5974654, 5938129, 5625109, 5566405, 5156348, 4860502, 5034629, 4645404, 4868437, 4764930, 4665621]
12494D665621J00461l7160r0074O9604m8784J37338J4428j11453j5751L65501
12484E049731J04095j60837L69875j65634K92932P7708P422l73291M26723j15855
12474E512869l04032l6541j53498j53944k6668m8217P564K23260j53193J26671
12464D994271j86000K16505Q0258j65697J33092k8702J35461j41892L01128M1650
12454E380074j89249K08601R8162n6888J63553J07627R9540K81430r1886L3876
12444F034840K86698J38366J58387L8116J94474M42591j7578K41530Q181R1193
12434G616798q5566J25646L97422j01334K83350q5349R6733K33106j68356P0674
12424H383124J75116J20839k72390N03958K7594J13067Q503K27364J50069M02110
$$ y = [4665621, 4766082, 4728922, 4638848, 4708452, 4659668, 4797006, 4811434, 4699981, 4684230, 5049731, 5153826, 4992989, 5362864, 5197230, 5490162, 5567870, 5575292, 5202001, 5628724, 5512869, 5208837, 5172296, 5018798, 4864854, 4838186, 4789969, 4797533, 5020793, 4867600, 4994271, 4808271, 5024776, 5105034, 4939337, 5072429, 5043727, 5179188, 5037296, 5338424, 5380074, 5190825, 5399426, 5497588, 5440700, 5604253, 5711880, 5811420, 6092850, 6000964, 6034840, 6321538, 6459904, 6618291, 6656407, 6850881, 7293472, 7275894, 7517424, 7525605, 7616798, 7531232, 7656878, 8054300, 7952966, 8236316, 8150967, 8247700, 8480806, 8312450, 8383124, 8558240, 8679079, 8406689, 8910647, 8938241, 9051308, 9059811, 9287175, 9437244, 9839354]
12414I839354P8903L69955M27789K11562L64351M08319J28349r3760L72690m29981
12404A1677531j71872k38866L27681j72496k12417j03589q3277J5575j42941J70160
12394A1065489R0393l73450N17650K01767j61961N01136J52256M02017N92961
12385A2988258K02539K48669N62572J65796K09164K85122J34193L9622K05730
12376A5041665K32850P6059K35394k63546M0646L28088l5970j3248l2241r7577
12366A5512120n891l48127J08223j52390p7751J69641k36286j42968n4534j08068
12356A4663969j86651J0542j80070r1071l02269m1075q6406k97278k77553j81486
12346A3030652m01723P160p6381P159j37530K35383L85939J05992J96884M15687
$$ y = [9839354, 9918257, 10288212, 10716001, 10927563, 11291914, 11700233, 11828582, 11734822, 12107512, 11677531, 11505659, 11266793, 11594474, 11421978, 11209561, 11105972, 11022695, 11038270, 10895329, 11065489, 11155882, 10782432, 11300082, 11501849, 11339888, 11841024, 11993280, 12395297, 12988258, 13190797, 13439466, 14002038, 14167834, 14376998, 14662120, 14796313, 14835935, 15041665, 15274515, 15350574, 15585968, 15322422, 15363068, 15691156, 15655186, 15641938, 15609697, 15512120, 15506229, 15158102, 15266325, 15113935, 15036184, 15205825, 14969539, 14826571, 14772037, 14663969, 14477318, 14487860, 14307790, 14216719, 13914450, 13873375, 13786969, 13489691, 13212138, 13030652, 12628929, 12636089, 12559708, 12566867, 12429337, 12664720, 13050659, 13156651, 13353535, 13769222]
12336A3769222M40219M82183L44117J40341N84278J94254K48018O40660R7910
12327A6941202K31787L04720K39749J61839o4082L40110Q6151K2940k52052J56439
12317A8168803J75989k6154P8570r0174k7220j93559M40143J9100N2919M43822
12307A9042239K88649K62222K92728O69472K85771J78031R0310p1106k26718J396
12297B0812994k86335p20198m90741o24689k43711n67980J2389n31157N9814k18021
12287A7202365k07774k40562m63788m47643j99740n06308p07537n69486l93034
12278A3466493m76927j50230n97230o5259l33821k21280k80054J43557j31055
12269A1354194N3850r9524k39430K88854k87484K991k09624q9679K06039m12712
$$ y = [13769222, 14209441, 14691624, 15035741, 15176082, 15760360, 15954614, 16202632, 16843292, 16941202, 17172989, 17477709, 17717458, 17879297, 17815215, 18155325, 18241476, 18264416, 18012364, 18168803, 18344792, 18318638, 18397208, 18307034, 18279814, 18086255, 18526398, 18545498, 18598417, 19042239, 19330888, 19593110, 19885838, 20555310, 20841081, 21019112, 21109422, 21038316, 20811598, 20812994, 20526659, 19806461, 19315720, 18691031, 18447320, 17879340, 17891729, 17360572, 17420386, 17202365, 16994591, 16754029, 16290241, 15842598, 15642858, 15136550, 14429013, 13859527, 13466493, 12989566, 12839336, 12242106, 12176847, 11843026, 11621746, 11341692, 11485249, 11354194, 11408044, 11308520, 11069090, 11357944, 11070460, 11073451, 10863827, 10774148, 10980187, 10567475]
12259A0567475M6979L06346k6894J87598K77517K43498K46190M87280P26092O15068
12249A3677149O17633P89129R91826R66792J063713J035111J081699J086470P29779
12240B2039301M08025K85885K93032n4779j77341O5483l02276k84671J82169j09288
12230B2345540l00887l63172j42634n55010n77104p71239q88038j077730j085532
12221A6584194p98083j177646q91683p97908o58495l78362m15246l17410m00282
12212A0749079j41617j96205m37300j56809r4916l85005k34907j72973J6721j5306
12202H930762j28287l0951K05324q5632O5510j14211J18376N6650j5021q8658
12192H913862J59310L38149K44273j37737L68435r5355N15882J42115K43006O5508
$$ y = [10567475, 10614454, 10920800, 10893906, 11081504, 11359021, 11602519, 11848709, 12335989, 13062081, 13677149, 14294782, 15083911, 16075737, 17042529, 18106242, 19141353, 20223052, 21309522, 22039301, 22447326, 22733211, 23026243, 22971464, 22794123, 22859606, 22557330, 22272659, 22454828, 22345540, 22044653, 21681481, 21538847, 20983837, 20406733, 19635494, 18747456, 17669726, 16584194, 15786111, 14608465, 13716782, 12918874, 12260379, 11882017, 11466771, 11149361, 10749079, 10607462, 10411257, 9973957, 9817148, 9722232, 9337227, 9102320, 8929347, 8946068, 8930762, 8802475, 8771524, 8976848, 8891216, 8956726, 8842515, 8960891, 9017541, 9002520, 8913862, 9073172, 9411321, 9655594, 9517857, 9886292, 9790937, 10306819, 10448934, 10691940, 10757448]
12182A0757448K46998J06482j10193n8668L64733o8048j16830k05906k1468Q1847
12172A0976395j47557p0248k4699R1503K28683J1022L06512N9114M71775K06099
12162A2108599N18193K58027L11872O25060K63730L12203j90978J29225J53215
12153A4489146m69465j14115l58732r6346n2515L27177O0392N28635M16715N28500
12143A5259392L55621L40100J53278M45573K02778J85479O49815O91499O21711
12134A8905246J137645R17459J175294J768048J519566K011830J581143J768890
12126C0785121K257272J666992J300997J186931J083154M19016M91869o5876j09043
12117C9016433n84453m74559p29209n97420j126819m78271p07079n98130m24552
$$ y = [10757448, 11004446, 11110928, 11000735, 10942067, 11306800, 11238752, 11121922, 10916016, 10894548, 10976395, 10828838, 10758590, 10733891, 10825394, 11054077, 11065099, 11371611, 11430725, 11902500, 12108599, 12626792, 12884819, 13196691, 13821751, 14085481, 14397684, 14206706, 14335931, 14489146, 14019681, 13905566, 13546834, 13450488, 13397973, 13725150, 13785542, 14314177, 14730892, 15259392, 15615013, 15955113, 16108391, 16553964, 16756742, 16942221, 17592036, 18283535, 18905246, 20042891, 20960350, 22135644, 23903692, 25423258, 27435088, 29016231, 30785121, 33042393, 34709385, 36010382, 37197313, 38280467, 38699483, 39191352, 39125476, 39016433, 38431980, 37957421, 37228212, 36630792, 35503973, 35025702, 34318623, 33720493, 33295941]
12108C3295941j007549k53702n78014k67667j63708K39015R2321L35368L32753
12099C2024758J98011m22249o9162p4867n93769p57072o97677o45481p61616k99535
12089B7901341l91354M62345K91345P18293L59868R34501P72934N98767N02117
12080C2150157L12968J83685k02563J83357k68775J13552J98838l06016K3593
12071C2388796j84024k21642o90786o07146q13390j001487q09186j034835r94335
12062B6031965j032936q43003n66735o87904m21805k93688l36784m09483n18115
12053B0921512l43761j84461p83911j522m93508k35289o24848k71232j50014o94863
12043A7138103k9304m14820k64739m06294k34655m85827l78757j18736n91359
$$ y = [33295941, 32288392, 32034690, 31456676, 31189009, 31025301, 31264316, 31356637, 31692005, 32024758, 32222769, 31800520, 31731358, 31656491, 31062722, 30305650, 29607973, 28962492, 28200876, 27901341, 27509987, 27972332, 28263677, 28981970, 29341838, 30276339, 31049273, 31648040, 32150157, 32463125, 32646810, 32444247, 32627604, 32358829, 32472381, 32671219, 32365203, 32388796, 32204772, 31983130, 31292344, 30685198, 29871808, 28870321, 28061135, 27026300, 26031965, 24999029, 24156026, 23589291, 22901387, 22479582, 22185894, 21849110, 21439627, 20921512, 20577751, 20393290, 19609379, 19607857, 19114349, 18879060, 18254212, 17982980, 17832966, 17138103, 17108799, 16693979, 16429240, 16022946, 15788291, 15302464, 14923707, 14804971, 14213612]
12034A4213612J46325j29498j57184L00810O39659N78079M65257L83533K81739
12025A6722332J7913L99056l49768m68331m18899p54935l36119p24883j02431
12016A3983935n77050m79764k6642l30393n04463j98226m14286j6074n94527K896
12006A0845406l1041l98899K66334K55366K81472K72455J95053J63396L0202m67412
11996A1412332m11282l78444j11687n31377q2948k52534l67464o5618L7187j62671
11986I085494n6233j66826J5371k79909n2782m38466p38444n2895J41354j14651
11976G342013q0982q4923O1903l33371r5274j42714Q2256k95048m32481k01318
11966E820061Q8791n06209l2795l0128J94923o5425l8219J15389M2937J85968
$$ y = [14213612, 14359937, 14230439, 14073255, 14374065, 15013724, 15591803, 16057060, 16440593, 16722332, 16740245, 17139301, 16789533, 16321202, 15902303, 15147368, 14811249, 14086366, 13983935, 13406885, 12927121, 12900479, 12570086, 12065623, 11867397, 11453111, 11437037, 10842510, 10845406, 10814365, 10415466, 10681800, 10937166, 11218638, 11491093, 11686146, 11849542, 11879744, 11412332, 11001050, 10622606, 10510919, 9979542, 9896594, 9644060, 9276596, 9210978, 9248165, 9085494, 9029261, 8862435, 8877806, 8597897, 8545115, 8106649, 7368205, 7315310, 7456664, 7342013, 7261031, 7176108, 7238011, 6904640, 6809366, 6666652, 6748908, 6453860, 6021379, 5820061, 5908852, 5402643, 5369848, 5339720, 5534643, 5469218, 5430999, 5546388, 5589325, 5775293]
11956E775293J29719K67045k03106J73463J83278j82360K02311j86970k2358k4026
11946F112289K04705n5993L16690J9904K54739J77222L33993j01970Q2847j16010
11936G228416K31020N3528N4287l0460J65996K51667k90526k00850R3581Q1188
11926G637847j30731L866k65705p3444l55454k79465K0067k75860j33097M4489
11916F192513k2170k98029j27180N2894j07772J76614N51008J626106K292398
11907A0336382J019322N65450N91067M53697q9162J75625m34972j276003j349045
11898I992361k210784j512698q19264j43613j85570l84393J02780M3345L37851
11889E220015J52385K13262N89075O53946O36850O98016O11479M58621J46838
$$ y = [5775293, 5905012, 6172057, 5968951, 6142414, 6325692, 6143332, 6345643, 6158673, 6136315, 6112289, 6316994, 6261001, 6577691, 6597595, 6852334, 7029556, 7363549, 7261579, 7344426, 7228416, 7459436, 7512964, 7567251, 7536791, 7702787, 7954454, 7663928, 7463078, 7556659, 7637847, 7507116, 7510982, 7245277, 7171833, 6816379, 6536914, 6556981, 6281121, 6148024, 6192513, 6170343, 5872314, 5745134, 5798028, 5690256, 5866870, 6417878, 8043984, 10336382, 11355704, 11921154, 12512221, 12965918, 12876756, 13052381, 12617409, 11341406, 9992361, 7781577, 6268879, 5449615, 5306002, 5120432, 4736039, 4838819, 4882164, 5220015, 5372400, 5585662, 6174737, 6828683, 7465533, 8163549, 8775028, 9233649, 9380487]
11880I380487M94120k07503J75886l09835p24845l66705o14100p22640l92802
11871F712063m40943l69134k32461n31875o1579n15106J90809r4180k44936m1196
11861D371462K5646Q1732m5964q5881j4333q0011l8457J57376J46316r2828j20628
11850D304430K57087J20004K53484p6151K30614N22458L85974N11611P62876M32656
11840G705043J67160L12263q2344J71638L73508l93099j51321k75267l60504r9127
11830G367950r0686j11605k76781N2576j12102J97473n45945p07374k84063k43698
11820E245745n27448l32727n20820q0739P6557j75287Q555J02140l01082l6037
11810C458857O5648M2558j42420l15235L63930J1440q3093j24297L5509j75518
$$ y = [9380487, 9874607, 9667104, 9842990, 9533155, 8808310, 8441605, 7827505, 7104865, 6712063, 6271120, 5901986, 5669525, 5137650, 5076071, 4560965, 4751774, 4657594, 4412658, 4371462, 4397108, 4478840, 4432876, 4346995, 4332662, 4252651, 4214194, 4371570, 4517886, 4425058, 4304430, 4561517, 4681521, 4935005, 4858854, 5089468, 5611926, 5997900, 6509511, 7272387, 7705043, 7872203, 8184466, 8102122, 8273760, 8647268, 8254169, 8102848, 7827581, 7467077, 7367950, 7277264, 7165659, 6888878, 6941454, 6829352, 7026825, 6480880, 5773506, 5489443, 5245745, 4718297, 4385570, 3864750, 3784011, 3860568, 3685281, 3693836, 3795976, 3494894, 3458857, 3524505, 3567063, 3424643, 3109408, 3473338, 3484778, 3401685, 3277388, 3312897, 3137379]
11800C137379L82858j60291j25536J33708O4215P2442j8795K78523J99196m7386
11790C916313O83950K37467L72255M64419K26028K0919L2313K77981j49006m37256
11780E645383q7080p80314m89566j40833l67985k54596k59796N0203l13557J3623
11770C015482l9710k68735r1845K96291l2625m5694L04899n4203m10663R5100
11760B768297K9082j40332M34176j74369j62301j48093M1874O4852r4176J07596
11750B726606J11026l30587K06917J53190k73949L17266k13604J39873l5026k83077
11740B518635J56130l6963k34351J67385l0506K0333N7624j82712J24700J19181
11730B679456j46758l2553Q9241k99505M3626J77182l03848L26896r047N4672
$$ y = [3137379, 3520237, 3359946, 3234410, 3368118, 3432333, 3504775, 3485980, 3764503, 3963699, 3916313, 4600263, 4837730, 5209985, 5674404, 5900432, 5921351, 5953664, 6231645, 6082639, 5645383, 5558303, 4777989, 4288423, 4147590, 3779605, 3525009, 3265213, 3315416, 3001859, 3015482, 2975772, 2707037, 2615192, 2911483, 2878858, 2833164, 3138063, 3083860, 2673197, 2768297, 2797379, 2657047, 3091223, 2916854, 2754553, 2606460, 2648334, 2713186, 2619010, 2726606, 2837632, 2507045, 2713962, 2867152, 2593203, 2910469, 2696865, 2836738, 2801712, 2518635, 2674765, 2637802, 2403451, 2570836, 2540330, 2560663, 2618287, 2435575, 2560275, 2679456, 2532698, 2500145, 2589386, 2289881, 2333507, 2510689, 2206841, 2533737, 2524690, 2579362]
11720B579362j62667j0508J325J99406l40048K86681j17633j7698q2580l1179
11710B304461J97242j25839l9882j8535K50182L9164o9115j25208J93534M2980
11700B648984k22375K83144N5452J60739o7663q3156J21391k03199K64320j04523
11690B853114K9964j2478j15593J47150J29242P7272n1935J35341j72498J31641
11680C151220o6564R2493N4082j521J65997q6161j50477N22301l09904j49637
11670C221829K60859k4992p3322m7384M3885j72949J88734q1238J01430K2024
11660C438876J24135n6849k60792Q7929O0919M7495l49733R0070J27469k99937
11650C009582L83188k99924j3850K58572m73258J49062M3426J26092j86962j8285
$$ y = [2579362, 2416695, 2406187, 2407512, 2606918, 2266870, 2553551, 2435918, 2418220, 2335640, 2304461, 2501703, 2375864, 2335982, 2317447, 2567629, 2606793, 2537678, 2412470, 2606004, 2648984, 2426609, 2709753, 2765205, 2925944, 2858281, 2775125, 2896516, 2693317, 2957637, 2853114, 2883078, 2870600, 2755007, 2902157, 3031399, 3108671, 3056736, 3192077, 3019579, 3151220, 3084656, 3177149, 3231231, 3229710, 3395707, 3309546, 3159069, 3681370, 3371466, 3221829, 3482688, 3457696, 3384374, 3336990, 3380875, 3207926, 3396660, 3315422, 3416852, 3438876, 3563011, 3506162, 3245370, 3333299, 3394218, 3441713, 3091980, 3182050, 3309519, 3009582, 3392770, 3092846, 3078996, 3337568, 2864310, 3013372, 3056798, 3182890, 2995928, 2977643]
11640B977643p7219j03125K03820j83937K031L7081r5615J54471n9329K22358
11630C078179p4607l65807J00558j23028J35676j32582K35268l15336J26057J44468
11620B808846J26718k88432j9945l104n293j27365R6899Q0096m8928Q2452N8380
11609B760324J9821j31475L25237k77795J50819r4420K24874K5585O2094K9330
11599C094394R1995Q8243j17223r7667m4675m7035k2849K25125l52123L71212
11589C189397l30438n2245J45628N9738k65387K74617r2191j3950M77804q6028
11579C306945l00635J79624l9540k37307J03298K88134n4561K1575L6715j55939
11569C148309J37375k10113j18965K15662q4470p6565o2859j7537R1042R4649
$$ y = [2977643, 2900424, 2797299, 3001119, 2817182, 2819213, 2856294, 2760679, 2915150, 2855821, 3078179, 3003572, 2637765, 2738323, 2615295, 2750971, 2618389, 2853657, 2538321, 2664378, 2808846, 2935564, 2647132, 2627187, 2624083, 2618790, 2491425, 2588324, 2668420, 2619492, 2701944, 2760324, 2780145, 2648670, 2973907, 2696112, 2846931, 2752511, 2977385, 3002970, 3065064, 3094394, 3186389, 3274632, 3157409, 3059742, 3015067, 2968032, 2945183, 3170308, 2818185, 3189397, 2858959, 2806714, 2952342, 3012080, 2746693, 3021310, 2929119, 2915169, 3392973, 3306945, 3006310, 3185934, 3146394, 2909087, 3012385, 3300519, 3245958, 3267533, 3304248, 3148309, 3285684, 3075571, 2956606, 3172268, 3087798, 3011233, 2948374, 2930837, 3021879, 3116528]
11559C116528R9036k2302j90077K55640O3288j1622k12515L81432l16706J76799
11549C339501k43197J14806m8102k3966k52470L33305m03326K07515j78570J2008
11539B857504O9395K37054q7899p9621J28503j34837J85715j23073p3225J04363
11529C083879m7766K4407q5767j63775K12193R9999k6185r8973J19623l641p7701
11518C036293l4381J95635j41831o6940J75024O0541p6284j64181J18456J95516
11508C297848l03487L37011j2882Q7684P1482M9800k86085m1567J79315j00225
11498C278894K26146k16317n0719j44210J35921J6103k52654L09945M3893p9881
11488C267121J62202j14193K91981j94536L15150m23958J79001p8077L9828J42762
$$ y = [3116528, 3215564, 3193262, 3003185, 3258825, 3322113, 3310491, 3097976, 3479408, 3162702, 3339501, 3096304, 3211110, 3163008, 3139042, 2886572, 3219877, 2816551, 3024066, 2845496, 2857504, 2926899, 3163953, 3076054, 2996433, 3124936, 2990099, 3175814, 3052741, 2979516, 3083879, 3036113, 3060520, 2974753, 2810978, 3023171, 3123170, 3096985, 2998012, 3117635, 3113994, 3036293, 3001912, 3197547, 3055716, 2988776, 3163800, 3224341, 3148057, 2983876, 3102332, 3297848, 2994361, 3331372, 3318490, 3406174, 3477656, 3527456, 3241371, 3199804, 3379119, 3278894, 3505040, 3288723, 3238004, 3093794, 3229715, 3245818, 2993164, 3303109, 3347002, 3267121, 3429323, 3315130, 3607111, 3412575, 3727725, 3303767, 3482768, 3404691, 3444519, 3587281]
11478C587281q1448R0986n3223o4060o9775J96494k60933O3515m3351J46673p4239
11467C437920K7161P4166J2482l2088j95756J08706p3453P7196k1532l6897r0427
11456C287478R4245l1446J4560k59061P0489J57527P8423j19183m559J11657j8157
11445C381973L2549J37600O1339j54509M09622l34704J7447J60676R6765k26188
11435C582570K01085R5438l75M6651j09625K87491j81516J12102p9563L1454J9476
11424D005188N7995P1401q7696OJ79883m35912K51164J38216M3020R282k05063
11413D027484J29838q6683O5378M9132J05322K33979J6394l13683K15219l9183
11403D403197K17216P0633l8339J64896J13138Q0517k21598K60625L4684p1784
$$ y = [3587281, 3505833, 3596819, 3543596, 3479536, 3409761, 3606255, 3345322, 3408837, 3365486, 3512159, 3437920, 3465081, 3539247, 3551729, 3519641, 3323885, 3432591, 3359138, 3436334, 3414802, 3377905, 3287478, 3381723, 3350277, 3364837, 3105776, 3176265, 3333792, 3412215, 3293032, 3288473, 3400130, 3381973, 3414522, 3552122, 3613461, 3458952, 3868574, 3533870, 3551317, 3711993, 3808758, 3582570, 3783655, 3879093, 3878718, 3925369, 3815744, 4103235, 3921719, 4033821, 3954258, 3985712, 4005188, 4063183, 4134584, 4046888, 4046894, 4226777, 3790865, 4042029, 4180245, 4223265, 4232547, 4027484, 4157322, 4070639, 4136017, 4185149, 4290471, 4524450, 4540844, 4227161, 4442380, 4403197, 4620413, 4691046, 4652707, 4817603, 4930741, 5011258, 4789660, 5050285, 5084969, 5013185]
11393E013185K11493L7255J71096o1942K47834r1782J44675j61839K99817q3514
11383E726278J36521j05230J96333K84549k84503O1438O082M89154k85348O5156
11373F290430O3500j17496K43158k74907N1408J99259K44476l40327M20920j92273
11363F588148J82527k51205P8522k41187J81350J77655l5667k50421L81985j53742
11353F657965J1316n3420J06524R2281J7141o3758Q3483r8599K16747j60477k38653
11342F570550M26142l23358K2512p3293j92716J20377J18737N4645o1948j42506
11332F519142K8289k051l04756J5017l7743q712j5951k03638o1701R365r7341
11321E839920O17k05159K06309l59906J04758k0635m48755L51773l26315K76556
$$ y = [5013185, 5224678, 5261933, 5433029, 5371087, 5618921, 5527139, 5671814, 5509975, 5809792, 5726278, 5862799, 5757569, 5953902, 6238451, 5953948, 6015386, 6021468, 6510622, 6225274, 6290430, 6353930, 6236434, 6479592, 6204685, 6256093, 6455352, 6699828, 6359501, 6780421, 6588148, 6770675, 6519470, 6597992, 6356805, 6538155, 6715810, 6680143, 6429722, 6811707, 6657965, 6669281, 6615861, 6722385, 6814666, 6831807, 6768049, 6851532, 6752933, 6969680, 6809203, 6570550, 6996692, 6673334, 6695846, 6622553, 6429837, 6550214, 6668951, 6723596, 6661648, 6519142, 6547431, 6545380, 6240624, 6255641, 6217898, 6209186, 6193235, 5989597, 5927896, 5937261, 5839920, 5840537, 5635378, 5841687, 5481781, 5586539, 5565904, 5117149, 5468922, 5142607, 5419163]
11311E419163l80094K1499l33241j36916R8755o0405p7499n4687j44312j43683
11301D208580n295k13544k3290Q7111j8114k06101n9144K52335m05946o3214R9491
11290C652869k19547R4028k66813k59666M27204j44821Q0083p1583j08248j25393
11280C058113J04610j71003l4017k8446J268j935q9792R892O8380m0423q9562
11269B787085K7543K0604n8424n3763o7791J62089n3680j75521J11915j98677
11259B501380K18181k41707L31814k18630r0004l8364j19872L20999k90276P7342
11249B450863J86082k08164p0329Q8425p9010P0595m7052K02501Q9192k14239
11239B468864P8537K72196k44969j79530P4646K28300j75058R743J27062j5084
$$ y = [5419163, 5039069, 5060568, 4727327, 4590411, 4689166, 4628761, 4551262, 4496575, 4352263, 4208580, 4203285, 3989741, 3966451, 4053562, 4035448, 3829347, 3770203, 4022538, 3616592, 3553378, 3652869, 3433322, 3527350, 3260537, 3000871, 3428075, 3283254, 3363337, 3291754, 3183506, 3058113, 3162723, 2991720, 2957703, 2929257, 2930525, 2928590, 2838798, 2848690, 2917070, 2876647, 2787085, 2814628, 2835232, 2776808, 2723045, 2655254, 2817343, 2763663, 2588142, 2700057, 2501380, 2719561, 2477854, 2809668, 2591038, 2501034, 2462670, 2342798, 2663797, 2373521, 2450863, 2636945, 2428781, 2358452, 2446877, 2367867, 2438462, 2391410, 2593911, 2683103, 2468864, 2547401, 2819597, 2574628, 2395098, 2469744, 2698044, 2522986, 2532729, 2659791, 2644707]
11229B644707n6932J04209J98934j6151L66080J071419P67181Q31314N80429L38110
11219F829300K42082K40211j45941o5214n95631o60074r39465r27115k21178n76116
11209C180859m75905J06902l19629K14596k88720K72142L2912k08858K0891R1758
11199B626948N5510J96238L37794L60227P14423Q94217J054068K60712M52660
11190F952797K00032J61223p0255n0650n70173p30739r73821q85562n19582l15473
11180C197797j14686j55306K8002k53612J41246l5714J69209K9931j34521n9208
11170B813138J04702j62671l0048R4927J41876j54337K13271J04629j67261P5134
11160C033360J7438L7799j32448P2069j76330K629R791j46381M8004L70137m6808
$$ y = [2644707, 2587775, 2691984, 2890918, 2874767, 3240847, 4312266, 5079447, 5910761, 6491190, 6829300, 7071382, 7311593, 7165652, 7100438, 6504807, 5844733, 4905268, 3978153, 3756975, 3180859, 2704954, 2811856, 2492227, 2706823, 2418103, 2690245, 2723157, 2514299, 2535190, 2626948, 2682458, 2878696, 3216490, 3576717, 4291140, 5185357, 6239425, 6500137, 6952797, 7152829, 7314052, 7243797, 7193147, 6622974, 5892235, 4918414, 4032852, 3513270, 3197797, 3083111, 2927805, 2955807, 2702195, 2843441, 2807727, 2976936, 3006867, 2872346, 2813138, 2917840, 2755169, 2725121, 2820048, 2961924, 2807587, 3020858, 3125487, 2958226, 3033360, 3050798, 3088597, 2956149, 3028218, 2851888, 2854517, 2864308, 2717927, 2765931, 3136068, 3089260]
11149C089260k01685K20866K0972j67974M5575K5827K71219l3325j45352j03031
11139C022352J69554L4890j5663j4267J1660Q2932J6675j17674j00984K15180
11129C304655O4534k7374J10232q3452O8428m747K28084k17440J14697k5102J11459
11118C643974l19288M85289m61736K97118k6356Q0468J6831r3691L66428l39310
11108C649727m9592p7085R7114o9590J35322m5623r1384L31168l01613K2707N9014
11097C660165j87510K77482l94971j32627J86224J5839R6928k84097M9641J41685
11087C428759j3758j66479p0653N7662K5987k698K14074j73140K3469K2374J335
11076C346932p014J71892r6407J65280j95913j87107M9406J53357m8476K17982
$$ y = [3089260, 2887575, 3108441, 3129413, 2961439, 3007014, 3032841, 3304060, 3270735, 3125383, 3022352, 3191906, 3226796, 3211133, 3196866, 3208526, 3291458, 3308133, 3190459, 3089475, 3304655, 3369189, 3341815, 3452047, 3368595, 3437023, 3432276, 3660360, 3442920, 3557617, 3532515, 3643974, 3324686, 3809975, 3348239, 3645357, 3619001, 3699469, 3716300, 3622609, 3989037, 3649727, 3600135, 3523050, 3620164, 3550574, 3685896, 3640273, 3548889, 3880057, 3578444, 3601151, 3660165, 3472655, 3750137, 3355166, 3222539, 3408763, 3424602, 3521530, 3237433, 3287074, 3428759, 3415001, 3248522, 3177869, 3235531, 3261518, 3258820, 3472894, 3299754, 3323223, 3345597, 3346932, 3339918, 3511810, 3415403, 3580683, 3384770, 3197663, 3247069, 3400426, 3351950, 3569932]
11066C569932J10745j3355J58637q3912r0821O5177r528q3197J68382Q1902M1431
11055C915393r2850M2153J12224m8991j1957k8096j34758M0028K07161j76025
11045C824282J29990q4668J18883P4325j8823N0334j16226q7827J86828O3639
11035D140737P7682K33041l5916J74251L05492k86170K00177k7758L44016j55867
11025D969685L07305j44051M13842R7557j31317J58525K42691r1944K6984K86163
11015F135440l00221K84886M0803J39552k5187R2946J51051q4157L0291R3473
11005F558877J34908J47027N6660J77492J32779J28814J54139K24768J2031L44348
10995H071843l7790p5258K63611J97702K08707j05552J23895R2796J00172J33830
$$ y = [3569932, 3680677, 3667322, 3825959, 3742047, 3651226, 3716403, 3706875, 3623678, 3792060, 3873962, 3915393, 3822543, 3864696, 3976920, 3927929, 3915972, 3887876, 3753118, 3793146, 4000307, 3824282, 3954272, 3869604, 3988487, 4062812, 4043989, 4094323, 3978097, 3890270, 4077098, 4140737, 4218419, 4451460, 4415544, 4589795, 4895287, 4609117, 4809294, 4781536, 5125552, 4969685, 5276990, 5132939, 5546781, 5644338, 5513021, 5671546, 5914237, 5822293, 5849277, 6135440, 5835219, 6120105, 6160908, 6300460, 6275273, 6368219, 6519270, 6435113, 6465404, 6558877, 6693785, 6840812, 6897472, 7074964, 7207743, 7336557, 7490696, 7715464, 7727495, 8071843, 8034053, 7958795, 8222406, 8420108, 8628815, 8523263, 8647158, 8739954, 8840126, 8973956]
10985H973956J90667n5882L36698j469K88053j11171L46278M58647K52904j13062
10975A0565619J99122M12929k71512K43723k00758L03089J61867O14031o505p4431
10965A1947174K45601L60006L85491j32213L70005J99605M26806k6087L89975
10956A4166363L35531K55227M63647L23131O3199K80216K36344O04610m3292J63157
10946A6848133K92525L10369K75660K71412K39876M68288J40727N11154J08328
10937A9466472M76478L23905O3861N23441M14866J96610K68089N01744M51304
10928B2686770L58986L78147O00797N30038K83358Q36065L40473M41681K84585
10919B6740900L53344M61091m0993J11906l232R7727k12677J8784J13246k98578
$$ y = [8973956, 9164623, 9108741, 9445439, 9443970, 9732023, 9620852, 9967130, 10425777, 10678681, 10565619, 10764741, 11177670, 10906158, 11149881, 10949123, 11252212, 11414079, 12028110, 12021605, 11947174, 12192775, 12552781, 12938272, 12806059, 13176064, 13375669, 13802475, 13776388, 14166363, 14501894, 14757121, 15220768, 15543899, 15607098, 15887314, 16123658, 16728268, 16684976, 16848133, 17140658, 17451027, 17726687, 17998099, 18237975, 18706263, 18846990, 19358144, 19466472, 19942950, 20266855, 20330716, 20854157, 21269023, 21465633, 21733722, 22235466, 22686770, 23045756, 23423903, 24024700, 24554738, 24838096, 25674161, 26014634, 26456315, 26740900, 27094244, 27555335, 27514342, 27626248, 27623016, 27720743, 27508066, 27526850, 27640096, 27341518]
10909B7341518N17614k14243Q1292P2034k78422J7856Q6846J62064p9178P4735
10899B7782116L47087R0517R5448Q044K34867M53716K35995J57310N18427L86099
10889C0309626O23534M12123Q48016M65043R31626Q35596R27914J393658J124542
10880C7871678J604538J387343J799802K285737K291668J887074K411899K235226
10872E3774965K511363K063097J740098J818265J095862R07454J79541J70807
10864F4261452r32994j024208j149116j526661j882872k064554k357543k305876
10856E1017628k298488k369117k237037k401510k355248k064418k093200j946431
10848C3252179j806071j845450j717679j588699j563217j454493j493208j027451
$$ y = [27341518, 27859132, 27644889, 27726181, 27798215, 27519793, 27537649, 27624495, 27786559, 27707381, 27782116, 28129203, 28219720, 28315168, 28323212, 28558079, 29011795, 29247790, 29405100, 29923527, 30309626, 30933160, 31345283, 32193299, 32658342, 33589968, 34425564, 35353478, 36747136, 37871678, 39476216, 40863559, 42663361, 44949098, 47240766, 49127840, 51539739, 53774965, 56286328, 58349425, 60089523, 61907788, 63003650, 63911104, 64090645, 64261452, 63328458, 62304250, 61155134, 59628473, 57745601, 55681047, 53323504, 51017628, 48719140, 46350023, 44112986, 41711476, 39356228, 37291810, 35198610, 33252179, 31446108, 29600658, 27882979, 26294280, 24731063, 23276570, 21783362, 20755911]
10840B0755911r36375j161945j284418o49443p41261q03566q53290o54607n09905
10831A3161101p64611m85038o00634j56623p27156l23641m81365m82121l04795
10822H835117j68114m49769l47005J42040m80103k18799N2891j13270m8483r8183
10812G106322n0713k68267j19563L4431j09333k16716k97760q7153j36616l51822
10802E502810k97176K1755l95386K5684k08360k53814J01976l38357j6200L1832
10792D174764J73376n5438l2415j61205o0120P5413k28339q4337O2150l18280
10782C545569N4284j27079K65133n7971k61370J34284r6020k217j80991O8185
10772C341807j2360k59588J2140j13794p6006J97628p7567j40069J69500k46991
$$ y = [20755911, 19819536, 18657591, 17373173, 16723730, 15982469, 15178903, 14325613, 13671006, 13161101, 12396490, 11911452, 11310818, 11154195, 10427039, 10103398, 9622033, 9139912, 8835117, 8667003, 8217234, 7870229, 8012269, 7532166, 7313367, 7366258, 7252988, 7204505, 7106322, 7055609, 6787342, 6667779, 6702210, 6592877, 6376161, 6078401, 5991248, 5854632, 5502810, 5205634, 5227389, 4832003, 4857687, 4649327, 4395513, 4497489, 4159132, 4142932, 4174764, 4348140, 4292702, 4260287, 4099082, 4038962, 4114375, 3886036, 3801699, 3863849, 3545569, 3599853, 3472774, 3737907, 3679936, 3418566, 3552850, 3456830, 3454613, 3273622, 3341807, 3329447, 3069859, 3081999, 2968205, 2892199, 3089827, 3012260, 2872191, 3041691, 2794700]
10762B794700J0633N8148j709m2934M2432j4493j9152N4750k1321J5156L00432
10751C176642o8050m5651r8648J12412k02253J818J04319l86847j40882j07210
10741B345650L19192K0401k20259L9837q8183L02192k47760K56828j08768j40280
10731B478850J70749o3298l3731K30091j02641Q6652J09599n2140L2587o1405
10721B795313k6613k42627j61219K19601L309J3264o9260J32383j01046R8163
10711B661268r7016O1441j6359k79302K97117k8520J27530j230J1175k19499J11407
10700B628012j19671p5059L42834m52737J31436k93985M58660k38375K18994k41981
10690B358128l9177j47503K65412l13031N32637L2017l44299J27637j97527K7919
$$ y = [2794700, 2805333, 2863481, 2861772, 2818838, 2861270, 2846777, 2827625, 2882375, 2861054, 2876210, 3176642, 3108592, 3062941, 2964293, 3076705, 2874452, 2876270, 2980589, 2593742, 2452860, 2345650, 2664842, 2685243, 2464984, 2504821, 2416638, 2718830, 2471070, 2727898, 2619130, 2478850, 2649599, 2586301, 2552570, 2782661, 2680020, 2766672, 2876271, 2824131, 2856718, 2795313, 2768700, 2526073, 2364854, 2584455, 2587764, 2601028, 2531768, 2664151, 2563105, 2661268, 2564252, 2625693, 2609334, 2330032, 2627149, 2598629, 2726159, 2724929, 2736104, 2516605, 2628012, 2508341, 2433282, 2776116, 2323379, 2454815, 2160830, 2619490, 2381115, 2600109, 2358128, 2318951, 2171448, 2436860, 2123829, 2656466, 2688483, 2344184, 2471821, 2274294, 2302213]
10680B302213j01068K83627k48301j2767K01781p1407Q7400n2142n9770M1164
10670B370730l25436N4856j2645L5462m4068j10636J58403K7256o3601Q67k04491
10659A886697M2726o2310J09891k2918j14068K638J06535K9048J94300k30563
10649A941976R4188K26005q6809k94982k3530o9141R6267j17448J24805j36936
10639A754395O4834q7359r5145J72995j15845P8366J3332J02204k79326J27402
10629A735853J86195j96429P0220q4768o3131J3964j08665L33096k24527k8201
10619A633607J70732m30178L34693L7569j3659N3692q9717o3093J06764k59102
10609A481308J61890n1275p4818J31475J89827n2600j22848j87670L61219k15430
$$ y = [2302213, 2201145, 2484772, 2236471, 2223704, 2425485, 2354078, 2441478, 2389336, 2329566, 2370730, 2045294, 2100150, 2087505, 2122967, 2078899, 1968263, 2126666, 2153922, 2090321, 2091188, 1886697, 1929423, 1867113, 1977004, 1954086, 1840018, 1842656, 1949191, 1978239, 2172539, 1941976, 2036164, 2262169, 2175360, 1880378, 1856848, 1787707, 1883974, 1766526, 1891331, 1754395, 1819229, 1731870, 1636725, 1809720, 1693875, 1772241, 1785573, 1887777, 1608451, 1735853, 1922048, 1725619, 1795839, 1711071, 1647940, 1661904, 1553239, 1886335, 1661808, 1633607, 1804339, 1374161, 1708854, 1746423, 1732764, 1786456, 1696739, 1633646, 1740410, 1481308, 1643198, 1591923, 1517105, 1648580, 1838407, 1785807, 1662959, 1475289, 1836508, 1621078]
10599A621078j52135J03053K8562J90335j45982m5496K52682l08577n1756J29025
10589A620789Q5395K1631J48016k28497J06863j44670P5821K2577K3093p9181
10579A651837J50784j78552k09145J76096J781J31288j39911k17724K10349P4713
10569A651516K9309k98164k0975J90692P8926k71003n0103J95602k04920Q1820
10559A382700O4014j44607k2609Q3389J9267j45175R9924k58660r4670M55094
10549A438667j99485J99553j57461o280K22338j71494k82672J27812J62845j15542
10539A218281Q3023O6494l841k78290K51188J08495j40940J65088m7545K1392
10529A443345J54073K2402q0178J77292k19443K15401j22993P6130J30134J72747
$$ y = [1621078, 1468943, 1571996, 1600558, 1790893, 1644911, 1599415, 1852097, 1543520, 1491764, 1620789, 1706184, 1727815, 1875831, 1647334, 1754197, 1609527, 1685348, 1707925, 1731018, 1651837, 1802621, 1624069, 1414924, 1591020, 1592801, 1724089, 1584178, 1366454, 1576803, 1651516, 1680825, 1382661, 1361686, 1552378, 1631304, 1360301, 1310198, 1505800, 1300880, 1382700, 1446714, 1302107, 1279498, 1362887, 1382154, 1236979, 1336903, 1078243, 983573, 1438667, 1239182, 1438735, 1281274, 1274994, 1497332, 1325838, 1043166, 1170978, 1333823, 1218281, 1301304, 1367798, 1363957, 1085667, 1336855, 1445350, 1304410, 1469498, 1421953, 1443345, 1597418, 1619820, 1539642, 1716934, 1497491, 1712892, 1589899, 1666029, 1796163, 1968910]
10519A968910K30109j3506N7481K17923j76794K8332J13788j09382k15975j08499
10509A992387j08159j09834k99552J19361K26754r9621j73234J41204k3167r005
10499A657134r5026L47610j26293M5213l7960K282P5580K32542J67547J60020
10489B428649j1413L08250j56512J94283o1371j25871l80113m0825l2016j72494
10479A950567Q0115k645P143l09787J77016k66622K91894l7411j02786N4685K45337
10468B087506m3465J30694K14798J50572q1225K36605m2435j20575O4044j60937
10458B435582K8645j76733L25362k83443J61117O4512k05993M27588j0967k92749
10448B472921J59451k54808J54608o1355K6474L6926j64448J87166q1881K20213
$$ y = [1968910, 2199019, 2185513, 2242994, 2460917, 2284123, 2312455, 2426243, 2316861, 2100886, 1992387, 1884228, 1774394, 1474842, 1594203, 1820957, 1721336, 1548102, 1689306, 1666139, 1657134, 1562108, 1909718, 1783425, 1828638, 1790678, 1792960, 1868540, 2101082, 2268629, 2428649, 2417236, 2725486, 2568974, 2763257, 2701886, 2576015, 2195902, 2155077, 2123061, 1950567, 2030682, 2028037, 2035180, 1725393, 1902409, 1635787, 1927681, 1890270, 1787484, 1842169, 2087506, 2044041, 2174735, 2389533, 2540105, 2458880, 2695485, 2653050, 2532475, 2596519, 2435582, 2464227, 2287494, 2612856, 2329413, 2490530, 2555042, 2349049, 2776637, 2765670, 2472921, 2632372, 2377564, 2532172, 2470817, 2497291, 2534217, 2369769, 2556935, 2475054, 2695267]
10438B695267J55574L02185M18099j32037L1728j86526J94886k56144k11766j02349
10428B908917o22457o8764j89586l9678j9370R5066O0817k54786k2245K53513
10418B101427k4896Q9973j33700O8814K88313m462K67019k9375N49591L09810
10408C482514M3334M58497n0806M62589R42k2752J43135L73572k93076J38981
10398D736930L8629Q6888P3080K37888L28790J19004J08667N85384l9828P3966
10388F349398j40110L9117q5160K29884k42888j55503m3150j05861K44839o9059
10378F021507L5722m8542j26739O8709L57837n7156m297K27340J34851m9636M3533
10367F603129M4126L74170q9405K73800k14125j13973k38749j79330J6360k82918
$$ y = [2695267, 2850841, 3153026, 3571125, 3439088, 3470816, 3284290, 3479176, 3223032, 3011266, 2908917, 2286460, 2217696, 2028110, 1988432, 1969062, 2064128, 2124945, 1870159, 1847914, 2101427, 2076531, 2166504, 2032804, 2101618, 2389931, 2385469, 2652488, 2623113, 3172704, 3482514, 3525848, 3984345, 3933539, 4396128, 4397070, 4374318, 4517453, 4891025, 4597949, 4736930, 4775559, 4862447, 4935527, 5173415, 5502205, 5621209, 5729876, 6315260, 6275432, 6349398, 6209288, 6248405, 6163245, 6393129, 6150241, 5994738, 5951588, 5845727, 6090566, 6021507, 6057229, 6008687, 5881948, 5950657, 6308494, 6251338, 6247041, 6474381, 6609232, 6559596, 6603129, 6647255, 7021425, 6932020, 7205820, 6991695, 6877722, 6638973, 6459643, 6476003, 6193085]
10357F193085j4635l26306M3183n31480J16180l04603q7215k24990N3624l78589
10347D538254R5883j66465j34985P2877k96946n8146K4949P4460J90503m0915
10337D299469n5587K35889j76349M8144q2822J13869j89126R2533l31113K6387
10327C981294j11206K89081M3139o2308P5645k13835j04124K14172j75746M1091
10317C977203m4051J64325R4651Q1609k32166k5081M44552p7595L7690L29866
10307D751003j487k34039L17178J16650j14370J70769m49292J33976j2877k53733
10297D423778n5097l4809K31424j47063l5701L11259L1022K17915k4951K74618
10287E192395K1511R9925M85787P1539P03796J09814K29753L79169n7794L27595
$$ y = [6193085, 6178450, 5852144, 5895327, 5363847, 5480027, 5175424, 5088209, 4863219, 4916843, 4538254, 4634137, 4467672, 4332687, 4405564, 4108618, 4050472, 4075421, 4149881, 4340384, 4299469, 4243882, 4479771, 4303422, 4351566, 4268744, 4382613, 4193487, 4286020, 3954907, 3981294, 3870088, 4159169, 4202308, 4140000, 4215645, 4001810, 3897686, 4111858, 3936112, 3977203, 3933152, 4097477, 4192128, 4273737, 4041571, 4016490, 4461042, 4383447, 4421137, 4751003, 4749516, 4515477, 4832655, 4949305, 4834935, 5005704, 4556412, 4690388, 4677511, 4423778, 4368681, 4333872, 4565296, 4418233, 4382532, 4693791, 4724813, 4942728, 4917777, 5192395, 5213906, 5313831, 5799618, 5871157, 6574953, 6684767, 6914520, 7293689, 7235895, 7563490]
$$ [...]
##END NTUPLES=NMR SPECTRUM
##END=
