##TITLE=Coffee green (M1-ROVE20 + 1.5mL buffer 50/50,  450uL extracto + 50uL (D2O+TMS))
without heating, vortex and centrifuged, temperature 0oC.
##JCAMPDX= 6.0         $$ Bruker NMR JCAMP-DX V2.0
##DATA TYPE= NMR SPECTRUM
##DATA CLASS= NTUPLES
##ORIGIN= Bruker BioSpin GmbH
##OWNER= Administrator
$$ 1.72 TOPSPIN		Version 2.1
$$ 2012-05-22 16:12:10.122 -0700  Administrator@X
$$ Compression mode = diff/dup
##.OBSERVE FREQUENCY= 400.13188198
##.OBSERVE NUCLEUS= ^1H
##.ACQUISITION MODE= SIMULTANEOUS (DQD)
##.ACQUISITION SCHEME= undefined
##.AVERAGES= 64
##.DIGITISER RES= 22
##SPECTROMETER/DATA SYSTEM= spect
##.PULSE SEQUENCE= noesygppr1d
##.SOLVENT NAME= H2O+D2O
##.SHIFT REFERENCE= INTERNAL, H2O+D2O, 1, 14.97969
##AUDIT TRAIL= $$ (NUMBER, WHEN, WHO, WHERE, PROCESS, VERSION, WHAT)
$$ ##TITLE= Audit trail, TOPSPIN		Version 2.1
$$ ##JCAMPDX= 5.01
$$ ##ORIGIN= Bruker BioSpin GmbH
$$ ##OWNER= Administrator
$$ $$ c:\Bruker\TOPSPIN/data/jwist/nmr/11-coffee-green-quantification-2/81/pdata/1/auditp.txt
$$ ##AUDIT TRAIL=  $$ (NUMBER, WHEN, WHO, WHERE, PROCESS, VERSION, WHAT)
(   1,<2011-11-17 15:20:51.107 -0500>,<Administrator>,<TOPSPIN>,<go>,<TOPSPIN 2.1>,
      <created by zg
	started at 2011-11-17 15:11:56.622 -0500,
	POWCHK enabled, PULCHK disabled,
       configuration hash MD5:
       DA 63 81 1B EF 4C B5 72 B4 DF EA D9 B4 DB 4C 08
       data hash MD5: 64K
       3B 49 31 B9 11 FD 23 97 E8 F2 CA F2 69 E9 EF 3F>)
(   2,<2011-11-17 18:15:59.482 -0500>,<Administrator>,<TOPSPIN>,<proc1d>,<TOPSPIN 2.1>,
      <Start of raw data processing
       efp LB = 0 FT_mod = 6 PKNL = 1 PHC0 = 0 PHC1 = 0 SI = 32K 
       data hash MD5: 32K
       ED 2F 59 E9 9E 46 97 5E 83 CC 81 D3 E7 9A 16 C5>)
(   3,<2011-11-17 18:15:59.841 -0500>,<Administrator>,<TOPSPIN>,<proc1d>,<TOPSPIN 2.1>,
      <pk PHC0 = 22.58789 PHC1 = 0 
       data hash MD5: 32K
       DC FA 0B 30 9B 44 18 29 54 81 BF B9 15 2A E2 44>)
$$ ##END=
$$ 
$$ $$ hash MD5
$$ $$ 64 05 43 E9 DA B4 B8 38 05 5C 57 2B D6 C9 96 40
##$RELAX= 
##$RELAX= 
##$RELAX= 
##$RELAX= 
##$RELAX= 
##$RELAX= 
$$ Bruker specific parameters
$$ --------------------------
##$DU= <Z:>
##$EXPNO= 81
##$NAME= <11-coffee-green-quantification-2>
##$PROCNO= 1
##$TYPE= <nmr>
##$USER= <jwist>
##$ACQT0= -8.18511563644234
##$AMP= (0..31)
100 100 100 100 100 100 100 100 100 100 100 100 100 100 100 100 100 100
100 100 100 100 100 100 100 100 100 100 100 100 100 100
##$ANAVPT= -1
##$AQSEQ= 0
##$AQ_mod= 3
##$AUNM= <au_prof>
##$AUTOPOS= <>
##$BF1= 400.13
##$BF2= 400.13
##$BF3= 400.13
##$BF4= 400.13
##$BF5= 400.13
##$BF6= 400.13
##$BF7= 400.13
##$BF8= 400.13
##$BYTORDA= 0
##$CFDGTYP= 0
##$CFRGTYP= 9
##$CHEMSTR= <none>
##$CNST= (0..63)
1 1 145 1 1 1 1 1 1 1 1 1 1 1 1 1 1 1 1 1 1 1 1 1 1 1 1 1 1 1 1 1 1 1 1
1 1 1 1 1 1 1 1 1 1 1 1 1 1 1 1 1 1 1 1 1 1 1 1 1 1 1 1 1
##$CPDPRG= <>
##$CPDPRG1= <>
##$CPDPRG2= <>
##$CPDPRG3= <>
##$CPDPRG4= <mlev>
##$CPDPRG5= <mlev>
##$CPDPRG6= <mlev>
##$CPDPRG7= <mlev>
##$CPDPRG8= <mlev>
##$CPDPRGB= <>
##$CPDPRGT= <>
$$ [...]
150 150 150 150 150 150 150 150
##$TP07= 0
##$TPNAME0= <>
##$TPNAME1= <>
##$TPNAME2= <>
##$TPNAME3= <>
##$TPNAME4= <>
##$TPNAME5= <>
##$TPNAME6= <>
##$TPNAME7= <>
##$TPOAL= (0..7)
0.5 0.5 0.5 0.5 0.5 0.5 0.5 0.5
##$TPOFFS= (0..7)
0 0 0 0 0 0 0 0
##$TUNHIN= 0
##$TUNHOUT= 0
##$TUNXOUT= 0
##$USERA1= <user>
##$USERA2= <user>
##$USERA3= <user>
##$USERA4= <user>
##$USERA5= <user>
##$V9= 5
##$VALIST= <valist>
##$VCLIST= <CCCCCCCCCCCCCCC>
##$VD= 0
##$VDLIST= <DDDDDDDDDDDDDDD>
##$VPLIST= <PPPPPPPPPPPPPPP>
##$VTLIST= <TTTTTTTTTTTTTTT>
##$WBST= 2048
##$WBSW= 25
##$XGAIN= (0..3)
0 0 0 0
##$XL= 0
##$YL= 0
##$YMAX_a= 5027113
##$YMIN_a= -2032681
##$ZGOPTNS= <>
##$ZL1= 120
##$ZL2= 120
##$ZL3= 120
##$ZL4= 120
##$ABSF1= 0
##$ABSF2= 0
##$ABSG= 0
##$ABSL= 0
##$ALPHA= 0
##$AQORDER= 0
##$ASSFAC= 0
##$ASSFACI= 0
##$ASSFACX= 0
##$ASSWID= 0
##$AUNMP= <proc_prof1d>
##$AXLEFT= 0
##$AXNAME= <>
##$AXNUC= <1H>
##$AXRIGHT= 0
##$AXTYPE= 0
##$AXUNIT= <>
##$AZFE= 0.1
##$AZFW= 0.1
##$BCFW= 0
##$BC_mod= 0
##$BYTORDP= 0
##$COROFFS= 0
##$CY= 15
##$DATMOD= 1
##$DC= 0
##$DFILT= <>
##$DTYPP= 0
##$F1P= 14.9796895980835
##$F2P= -5.57284135567231
##$FCOR= 0.5
##$FTSIZE= 32768
##$FT_mod= 6
##$GAMMA= 0
##$GB= 0
##$INTBC= 1
##$INTSCL= 1
##$ISEN= 128
##$LB= 0
##$LEV0= 0
##$LPBIN= 0
##$MAXI= 10000
##$MC2= 0
##$MEAN= 0
##$ME_mod= 0
##$MI= 0
##$NCOEF= 0
##$NC_proc= -6
##$NLEV= 6
##$NOISF1= 0
##$NOISF2= 0
##$NSP= 0
##$NTH_PI= 0
##$NZP= 0
##$OFFSET= 14.97969
##$PC= 1
##$PHC0= 22.58789
##$PHC1= 0
##$PH_mod= 1
##$PKNL= yes
##$PPARMOD= 0
##$PPDIAG= 0
##$PPIPTYP= 0
##$PPMPNUM= 2147483647
##$PPRESOL= 1
##$PSCAL= 4
##$PSIGN= 0
##$PYNMP= <proc.py>
##$REVERSE= no
##$SF= 400.13
##$SI= 32768
##$SIGF1= 0
##$SIGF2= 0
##$SINO= 400
##$SIOLD= 32768
##$SPECTYP= <>
##$SREGLST= <1H.H2O+D2O>
##$SSB= 0
##$STSI= 32768
##$STSR= 0
##$SW_p= 8223.68421052631
##$SYMM= 0
##$S_DEV= 0
##$TDeff= 65536
##$TDoff= 0
##$TI= <>
##$TILT= no
##$TM1= 0
##$TM2= 0
##$TOPLEV= 0
##$USERP1= <user>
##$USERP2= <user>
##$USERP3= <user>
##$USERP4= <user>
##$USERP5= <user>
##$WDW= 1
##$XDIM= 32768
##$YMAX_p= 418286200
##$YMIN_p= -11988787
##$CURPLOT= <Network HP LaserJet P1505>
##$CURPRIN= <$Network HP LaserJet P1505>
##$DFORMAT= <normdp>
##$LAYOUT= <+/1D_H.xwp>
##$LFORMAT= <normlp>
##$PFORMAT= <normpl>
##$SURQMSG= 1
$$ End of Bruker specific parameters
$$ ---------------------------------
##NTUPLES= NMR SPECTRUM
##VAR_NAME=  FREQUENCY,     SPECTRUM/REAL,   SPECTRUM/IMAG
##SYMBOL=    X,             R,               I
##VAR_TYPE=  INDEPENDENT,   DEPENDENT,       DEPENDENT
##VAR_FORM=  AFFN,          ASDF,            ASDF
##VAR_DIM=   32768,         32768,           32768
##UNITS=     HZ,            ARBITRARY UNITS, ARBITRARY UNITS
##FACTOR=    0.250966925370066, 1,           1
##FIRST=     8223.43324360094, 113269,       -224998
##LAST=      0,             21876,           -179294
##MIN=       0,             -11988787,       0
##MAX=       8223.43324360094, 418286200,    0
$$ Real data points
##PAGE= N=1
##DATA TABLE= (X++(R..R)), XYDATA
$$ [...]
19697A911369p500L9413J65140j83155q1895J19039J6476k14619J40955L0736
19687A935959M3935l1083j76431o2135m9468K82194j87414q4815R0893O7084M4187
19676A872906j59611M3837n1607O3935j76350K09166N9466k7938j26650j5593
19666A691561J58877J4116L446k12861K40123j11632m2921Q1787o8013Q4947r0316
19655A749114n8079K62479k75057J7199O5196O581Q121k36113p4476Q9360J94591
19644A748916j8423Q6023o7313K09875p1613j17147J41614j49413O185n1115O5774
19633A783363p7395m5756R2727k37805J90399L7194r29j29196J82798j61754K52728
19622A886374j45136p3131O0670l47063R9774K83599k36453J83977k01423l9225
$$ y = [1911369, 1903869, 1943282, 2108422, 1925267, 1843372, 1962411, 1978887, 1764268, 1905223, 1935959, 1979894, 1948811, 1772380, 1710245, 1660777, 1942971, 1755557, 1670742, 1761635, 1828719, 1872906, 1713295, 1757132, 1705525, 1769460, 1593110, 1802276, 1861742, 1833804, 1707154, 1691561, 1850438, 1864554, 1868000, 1655139, 1895262, 1783630, 1740709, 1822496, 1754483, 1839430, 1749114, 1691035, 1953514, 1678457, 1695656, 1760852, 1767433, 1775554, 1539441, 1464965, 1554325, 1748916, 1730493, 1816516, 1749203, 1959078, 1887465, 1770318, 1911932, 1762519, 1768704, 1717589, 1783363, 1705968, 1660212, 1752939, 1515134, 1705533, 1742727, 1741798, 1612602, 1795400, 1633646, 1886374, 1741238, 1668107, 1728777, 1381714, 1481488, 1765087, 1528634, 1712611, 1511188, 1471963]
19612A471963L2007j9415n0047L36909k94196j57869K06666j41672K36103L5160
19602A655609k55851J83203j15627J9594N8159J1802k17430K2942k834K36820
19592A596387j77480p5231K2294q2300K49773m2897j43368J4148Q0814J43071
19582A585211j09782l561n9068n8167k3207K06790j45741q1516n1270J79033j80529
19571A258193o3031J24678q945j36746L40019m31974L24884J07069j35525j58336
19561A220286L6508L5199j48921Q5494K09759l9662m2364o1493P940k23425K56252
19550A335573k60760N23833k23924k61758K14105j71856J85055k7123J81621k05203
19540A289563n3690l9861J31294j29423J69605o1955m6799K64403l86423K14808
$$ y = [1471963, 1503970, 1484555, 1434508, 1771417, 1477221, 1319352, 1526018, 1384346, 1620449, 1655609, 1399758, 1582961, 1467334, 1486928, 1545087, 1556889, 1339459, 1362401, 1359567, 1596387, 1418907, 1343676, 1365970, 1283670, 1533443, 1490546, 1347178, 1361326, 1442140, 1585211, 1475429, 1471868, 1412800, 1354633, 1331426, 1538216, 1392475, 1310959, 1259689, 1438722, 1258193, 1195162, 1319840, 1310895, 1174149, 1514168, 1082194, 1407078, 1514147, 1378622, 1220286, 1256794, 1291993, 1143072, 1228566, 1438325, 1398663, 1356299, 1294806, 1302746, 1079321, 1335573, 1074813, 1598646, 1374722, 1112964, 1327069, 1155213, 1340268, 1313145, 1494766, 1289563, 1235873, 1196012, 1327306, 1197883, 1367488, 1305533, 1258734, 1523137, 1136714, 1351522]
19530A351522j82404J12445J33066j37015J1706K5446j17560Q6992P6622r5122
19520A265698J90096k32682L05404j74331l43204M85669m21784L04743p8672j5068
19510A285869k19560j92167M36827p0288j15494O5252j05973N8363N607j87589
19500I60847L48299o7892j38780P0201L9717j29840J50093M7993J8830j62640
19490A136828N2709J1955o1292m8050J3824j72076L06467k57115K81015k02211
19480A062054M9337j05095n8158J81153k15739K13180j65641M2495J03531j08406
19470I98711Q340j54988K58638k8811k27208k9618j5174m3877o974J08822j51121
19459G16740M195K80220k07155N827M4464k50465J84994J53519j89920p6350L8619
$$ y = [1351522, 1169118, 1281563, 1414629, 1277614, 1289320, 1314766, 1197206, 1284198, 1360820, 1265698, 1455794, 1223112, 1528516, 1354185, 1010981, 1496650, 1074866, 1379609, 1300937, 1285869, 1066309, 874142, 1310969, 1240681, 1125187, 1190439, 1084466, 1142829, 1148436, 960847, 1309146, 1241254, 1102474, 1172675, 1212392, 1082552, 1232645, 1280638, 1299468, 1136828, 1189537, 1201492, 1140200, 1092150, 1105974, 933898, 1240365, 983250, 1264265, 1062054, 1111391, 1006296, 948138, 1129291, 913552, 1126732, 961091, 1003586, 1107117, 998711, 1007051, 852063, 1110701, 1081890, 854682, 825064, 809890, 766013, 759039, 867861, 716740, 720935, 1001155, 794000, 799827, 844291, 593826, 778820, 932339, 742419, 666069, 704688]
19448G04688J00190O8918P1278k96016j733K25046J23859l02655K00465M3713
19438I37753R4380k43307M3585O1320k3772J19160k88992K1346j0048L41890m9718
19427A003597q1394m9408L14428l21631L1833j74685q5575K47427l36384O2942
19417F11150K79110R1070j06811k5286k6749m4072J2087J5684j56553Q5302p4752
19406F60180J30849L0167j06364L08059j99359j78822K12252k4513j72310K0657
19396F80796k4383K31486o1612P9241k34110J51234O491q4332M7360j21787j0827
19385F59557K02829L0562j18837L8814q7457Q4423M6357j20269J65307j17983
19375G83303L5935j42086J42428j33472J61242m290k3854m7549N1836J1010k2618
$$ y = [704688, 804878, 873796, 945074, 649058, 647325, 872371, 996230, 693575, 894040, 937753, 1032133, 788826, 832411, 893731, 869959, 989119, 700127, 721473, 711425, 1053315, 1003597, 922203, 872795, 1187223, 865592, 897425, 722740, 637165, 884592, 548208, 611150, 890260, 981330, 874519, 849233, 822484, 778412, 790499, 806183, 649630, 734932, 660180, 791029, 821196, 714832, 1022891, 823532, 644710, 856962, 832449, 660139, 680796, 656413, 887899, 826287, 905528, 671418, 822652, 829143, 744811, 792171, 670384, 659557, 862386, 892948, 774111, 812925, 725468, 809891, 856248, 735979, 901286, 783303, 819238, 677152, 819580, 686108, 847350, 843060, 819206, 771657, 823493, 834503, 811885]
19364H11885k5432q5367n8205O1356J12575N9898k54492L17731j88391m4910j78274
19353E28374K76391n165n1067J08012o0681k45253P2429J28655j07243K3763O5327
19342G33542L60269k62315Q5595k01864k1367J23566J77937j84646L13669j76546
19332I47840k03455J34311K13239J4271j27783o963j8157j42958J04338O2655
19322I77338k7852J72520j93550j37265K10886q5105r1659J75392J23480l90918
19312G33267L62744j79495j33118l0590l2996J49892n7901j11495O4846K17234
19302I82388l50710N9086r8472K04295k82245L33996j03220j38623K68577j70773
19292G04299l4278O4901k1346j57154J85782r0271O1471M5737m1921j12329J20641
$$ y = [811885, 786453, 701086, 642881, 704237, 816812, 876710, 622218, 939949, 751558, 706648, 528374, 804765, 799600, 748533, 856545, 795864, 550611, 623040, 751695, 644452, 668215, 733542, 1093811, 831496, 917091, 715227, 693860, 817426, 995363, 810717, 1124386, 947840, 744385, 878696, 1091935, 1106206, 978423, 971460, 953303, 810345, 914683, 977338, 949486, 1122006, 928456, 791191, 1002077, 916972, 825313, 1000705, 1124185, 733267, 1096011, 916516, 783398, 752808, 719812, 869704, 811803, 700308, 765154, 982388, 631678, 690764, 592292, 796587, 514342, 848338, 745118, 606495, 875072, 704299, 670021, 734922, 713576, 556422, 742204, 651933, 713404, 759141, 717220, 604891, 725532]
19281G25532n9479L2004j8025k5397r8685M2783M5088r3724P6692J29408L4511
19270G90708l2005Q4626K7797j45964Q2512l1486m187O8992k0713k4927j02592
19259F92761q1578L78J2703J06285L3375m7039J52269k14785J39584r7656J6653
19248G12950q7426Q6534r0983J35419p6819K53809J70288L8007K44746K02072
19238A588597l13119J56778j0327n2985j92226j21965l98322J78961j22257l9559
19228F73576j2897R3835K67808j45406j47562n778j06770J18645J12229k95543
19218E52137K47601j49521j16998p9702K38558J00897k11265j0522r656K62022
19208H23551j30067j28400k1792J91694j88337K33913j41555l626J28792j28042
$$ y = [725532, 666053, 698057, 680032, 654635, 555950, 598733, 643821, 550097, 626789, 756197, 790708, 758703, 843329, 871126, 725162, 807674, 776188, 772001, 840993, 820280, 795353, 692761, 611183, 611561, 624264, 730549, 763924, 716885, 869154, 654369, 793953, 696297, 712950, 625524, 712058, 621075, 756494, 679675, 933484, 1103772, 1141779, 1386525, 1588597, 1275478, 1432256, 1421929, 1368944, 1176718, 1054753, 656431, 835392, 713135, 673576, 660679, 754514, 1022322, 876916, 729354, 723576, 616806, 735451, 847680, 552137, 799738, 650217, 533219, 453517, 692075, 792972, 581707, 571185, 561529, 823551, 693484, 565084, 543292, 734986, 546649, 780562, 639007, 635381, 764173, 636131]
19198F36131J09415j39571M7691J83219k25074j09150O0250K2113r7281p955L50068
19187H29856j67706l6513K06205L515m4590j10900j1356j86383K92402k72994
19177E01536L24849j04280L55353k14186J63275J58891J16373n23052M21033J36222
19167A336014k69913k65425n9315R8257k08978J52357K03654P5757M3200l82197
19157G23411K29945K1980L6460M2713J88207j87706Q0954k59099K74006k71546
19147H79325J37970j47133o9460O5369j00546M7770k07237K66022J35560m5708
19137I61932m28530M18868J26240j59412n4221J6130r5499J76463k33278K34621
19127I63314j35489K7825L31914l04915N1611J86489k59374J44004N8542J00380
$$ y = [636131, 745546, 605975, 653666, 836885, 611811, 502661, 562911, 585024, 487743, 479788, 829856, 662150, 625637, 831842, 835357, 790767, 679867, 668511, 482128, 774530, 501536, 826385, 722105, 1077458, 863272, 1026547, 1185438, 1301811, 778759, 1199792, 1336014, 1066101, 800676, 741361, 839618, 630640, 782997, 986651, 1062408, 1105608, 723411, 953356, 975336, 1011796, 1054509, 1242716, 1055010, 1135964, 876865, 1150871, 879325, 1017295, 870162, 800702, 866071, 765525, 813295, 606058, 872080, 1007640, 961932, 533402, 952270, 1078510, 919098, 864877, 881007, 785508, 961971, 728693, 963314, 827825, 855650, 1187564, 882649, 934260, 1120749, 861375, 1005379, 1063921, 1164301]
19117A164301j19887J53230r9200J95489j5882j10056N31368j59298K45977J94365
19107A980407K65601P731L27395L98192Q54337M89248K32663M90704J70749l03239
19097D913788k18706m72006m54736q33474m16857l85033m9915r5848m16769J50946
19087A721390q6783j19658N4241J44041j63614r224J78045M0739J37111N03157
19077B399445M61132N04475M78017K30452M03381K1993Q6584J50822n73585k23566
19067C939150l3725L92J05164K49025n6136J72054J50448j68525m0427n63657
19057C753763n06961k68428o00860k40013l27911O0351m1327k98282l960J08723
19047A635095J15777j86586K23232M1555M37962J48791L92812O27908O43229K67000
$$ y = [1164301, 1044414, 1197644, 1098444, 1293933, 1278051, 1167995, 1699363, 1540065, 1786042, 1980407, 2246008, 2253739, 2581134, 2979326, 3833663, 4322911, 4555574, 5046278, 5217027, 4913788, 4695082, 4223076, 3768340, 2934866, 2518009, 2132976, 2083061, 1987213, 1570444, 1721390, 1634607, 1514949, 1569190, 1713231, 1549617, 1540393, 1718438, 1759177, 1896288, 2399445, 2860577, 3365052, 3843069, 4073521, 4476902, 4498895, 4585479, 4736301, 4162716, 3939150, 3905425, 3905817, 4010981, 4260006, 4203870, 4375924, 4526372, 4357847, 4317420, 3753763, 3246802, 2978374, 2377514, 2137501, 1809590, 1869941, 1828614, 1530332, 1526372, 1635095, 1750872, 1564286, 1787518, 1829073, 2267035, 2415826, 2808638, 3436546, 4079775, 4346775]
19037D346775K36883L05316J16884n2510n73876l30988q01052n20538l88530l80275
19027A958089k8581j67285J93017n24587K66308L5825L63079j24721j09362j9037
19017A842745L11020J43326N38464L02459O13148L54941L01044N34819J62432
19008E104398K10081P7608j57230N1613j89358K40535M4222M60114P08058O13328
18998G163369P79842P72547O70386J146809J180751J757888K107870K129904K081469
18989A9790835J359000J009863M38789k51682j644117j975482k549431k996738
18981A3181037k468342j827467j526462j150510j048547n37194o39891l61532
18973C621092m26353l74163m24011J6266q5419j93486m00775J11503l6123j25832
$$ y = [4346775, 4583658, 4888974, 5005858, 4953348, 4379472, 4048484, 3247432, 2726894, 2338364, 1958089, 1929508, 1762223, 1955240, 1430653, 1696961, 1732786, 2095865, 1971144, 1861782, 1842745, 2153765, 2297091, 2835555, 3138014, 3751162, 4106103, 4407147, 4941966, 5104398, 5314479, 5392087, 5234857, 5286470, 5097112, 5337647, 5381869, 5841983, 6550041, 7163369, 7943211, 8715758, 9386144, 10532953, 11713704, 13471592, 15579462, 17709366, 19790835, 21149835, 22159698, 22598487, 22346805, 20702688, 18727206, 16177775, 13181037, 10712695, 8885228, 7358766, 6208256, 5159709, 4622515, 3982624, 3621092, 3194739, 2820576, 2396565, 2412831, 2327412, 2133926, 1733151, 1844654, 1808531, 1682699]
18963A682699R870N7032m00258K13529k39021p402J47198q3060O0188M6457q7629
18952A399603L31426k0412k9181O6306R811L5345J64998n8618N5297r2208J95444
18941B057811N30185k24510L89736M41491K2646O39780R3654R17379O92459J103059
18931F663690J332525J945081K172064K108050K354617J682140J559562Q22049
18923B0639778M0510o87829j588403k403873k571957k415330k150372j551785
18915G310739j498322r56622o27310m08647q60250k62458l05577k30935j56754
18906B003864k16490l86972L12953k31668j29517J15464l29988J7602K2631m01611
18896G76268K24856j12295J38052j60406l3212r5406L8484K73012l12523k2645
$$ y = [1682699, 1692569, 1749601, 1349343, 1562872, 1323851, 1316449, 1463647, 1380587, 1440775, 1487232, 1399603, 1731029, 1710617, 1681436, 1747742, 1757553, 1792898, 1957896, 1899278, 1954575, 1862367, 2057811, 2587996, 2363486, 2753222, 3194713, 3217359, 3857139, 3950793, 4868172, 5560631, 6663690, 7996215, 9941296, 12113360, 14221410, 16576027, 18258167, 19817729, 20639778, 20680288, 19992459, 18404056, 16000183, 13428226, 11012896, 8862524, 7310739, 5812417, 4855795, 4228485, 3819838, 2959588, 2697130, 2391553, 2160618, 2003864, 1787374, 1400402, 1713355, 1481687, 1352170, 1467634, 1137646, 1155248, 1177879, 776268, 1001124, 888829, 1026881, 866475, 833263, 737857, 776341, 1049353, 736830, 714185]
18886G14185J00690r9436J37090m0597j27621l4942j175J37898k32820Q8574o9936
18875E71910m8124J16456l7163N4840p3829P4174J30211k18856m1943Q7391Q9706
18864G04773j66498J75348p0026j26138J58769r6901J84746k30970j59085K89426
18854F63444j38287M6448j2157L67816l50922J20408o3158j8050j58451K09967
18844F67058j08451J23441k4694P9214j43192o1523l031r8734J32938J58911j91662
18833E30275J24565o3459J83848Q322K0309j41926r274L5437k3375q8506Q9292
18822F65508P2516j59485l1030j54121K13102J19524K2910C65770J86263L0936
18812E82969L72639l89806K50292j42862j76343N9565N8604K5319p5218J29567
$$ y = [714185, 814875, 715439, 852529, 811932, 684311, 649369, 648194, 786092, 553272, 641846, 571910, 523786, 640242, 603079, 657919, 584090, 658264, 788475, 569619, 527676, 615067, 704773, 538275, 713623, 643597, 517459, 676228, 579327, 764073, 533103, 374018, 663444, 525157, 571605, 559448, 927264, 576342, 696750, 633592, 615542, 457091, 667058, 558607, 682048, 657354, 736568, 593376, 531853, 528822, 430088, 563026, 721937, 530275, 654840, 591381, 775229, 783551, 803860, 661934, 652660, 688097, 664722, 576216, 665508, 738024, 578539, 547509, 393388, 606490, 726014, 748924, 365770, 552033, 582969, 955608, 565802, 816094, 673232, 496889, 556454, 615058, 640377, 565159, 694726]
18802F94726j6975j21040K13035j05036J8999j56767J54071J49081j19359r6615
18792F14120J34841k30751K72543o8553l3947R5006J6428j74010K39601J43519
18782A008797l71261J77142l6487J29052l03839k02779L33667j26446j52166J60488
18772F16168J88811k96260J50186L6760q6360O5453j11100J61441J03834k94123
18762E34810J65127j11732j08262J96259j65756j32978J71955J29304l26814J15538
18752D67451J57645M7128j23269Q2767k45337M12512j18953o6752L0598j01259
18742E42531J443K38030j81617r4613J79656j80148K36714j23367j10664j034
18732E06931J07947j86710J05568p7848K46989k65493m3002J59160L6827j42780
$$ y = [694726, 677751, 556711, 769746, 664710, 683709, 526942, 681013, 830094, 710735, 614120, 748961, 518210, 790753, 722200, 688253, 783259, 799687, 625677, 865278, 1008797, 637536, 814678, 778191, 907243, 603404, 400625, 734292, 607846, 455680, 616168, 804979, 508719, 658905, 695665, 609305, 674758, 563658, 725099, 828933, 534810, 699937, 588205, 479943, 676202, 510446, 377468, 549423, 678727, 351913, 467451, 625096, 672224, 548955, 631722, 386385, 798897, 679944, 613192, 643790, 542531, 543974, 782004, 600387, 505774, 685430, 505282, 741996, 618629, 507965, 506931, 614878, 428168, 533736, 455888, 702877, 437384, 394382, 553542, 590369, 447589]
18722D47589K64353j86114m8281K18424l35985R7640K06384n0673K0033j99128
18712D34242J73925n1484L6903m8885N469O1008K1069J62053r2446k36930O6277
18701E31201n4059M7612j08879Q0786J38206q0669K9661k02068K38392l1037Q0840
18690F69986K35062l56724j1788j17789K82549k33230L23602l10201O0417J14401
18680F56285M6967k14728J23942K6677N6001j87896o1099J32905o0165k7632m7309
18669D43948J70179k33151L47749j13050k1737J03168l01875J75483Q8633p2369
18659E86978m8063N4836J74965k04269O2930M0706n2163m8148j22952L04232l59453
18648C89599J30086k8887j6580Q8136j18408J39609L2560L0151q8910j4125J01923
$$ y = [447589, 711942, 525828, 477547, 695971, 359986, 457626, 664010, 613337, 633370, 434242, 608167, 556683, 593586, 544701, 550170, 611178, 632247, 794300, 701854, 464924, 531201, 477142, 524754, 415875, 496661, 634867, 554198, 583859, 381791, 620183, 589146, 669986, 905048, 548324, 536536, 418747, 701296, 468066, 791668, 481467, 541884, 656285, 703252, 488524, 612466, 639143, 695144, 507248, 446149, 579054, 518889, 491257, 443948, 614127, 380976, 728725, 615675, 593938, 697106, 395231, 570714, 659347, 586978, 538915, 593751, 768716, 564447, 627377, 668083, 615920, 567772, 444820, 749052, 389599, 519685, 490798, 474218, 562354, 443946, 583555, 616115, 646266, 557356, 543231, 645154]
18637F45154k00079j14452L48879B66828K0112K65162k8388A87721L95247L4701
18627F17669o9768k24869L84898j44910k11381R4306j21156P3132L31275k06395
18617E22801J93191L5720j29620k25227j5881P3952K9965Q9515j27432j901q004
18606D37079k8182L21728J3473j94778J33676j44025J32310j18038J43482r0575
18596F06150K55081j47711j09778J19197P9782k7474j26985Q4946j36261O8296
18586F65243n6015J22893l0335k23826L81460j55401q1399n6177O607M7245p8419
18575E41876n9116k0181Q5174q3018O6943p8715J57678o6664J65268j65405m3781
18564E00059J5541R7625j99820K2376K40984B90933K24837r8016J45688k02161
$$ y = [645154, 445075, 330623, 679502, 266828, 286940, 552102, 523714, 187721, 582968, 617669, 547901, 323032, 707930, 563020, 351639, 445945, 324789, 397921, 729196, 522801, 715992, 751712, 622092, 396865, 380984, 454936, 484901, 574416, 446984, 445083, 437079, 408897, 730625, 744098, 549320, 682996, 538971, 671281, 553243, 696725, 606150, 861231, 713520, 603742, 722939, 802721, 775247, 648262, 733208, 596947, 665243, 609228, 732121, 701786, 477960, 859420, 704019, 622620, 566443, 573050, 620295, 541876, 482760, 462579, 547753, 464735, 531678, 452963, 610641, 543977, 709245, 543840, 500059, 515600, 613225, 413405, 435781, 676765, 290933, 515770, 417754, 563442, 361281]
18554C61281p7623J88638j84113J85402p2093K19250n4895j47148q2781K00575
18544E36493K2656J47093C21726L10609o3695j65694J66064O9032r4649j51609
18534C91784N2782N4554o0078K14634k10400J04458j79731J57436M6731Q0360
18524F52530B93208K95786B61077K69174J24087q5626L8342k92924L7390K27728
18514E79248p1461l6093r5524J22945B25614L72821k22168K76657k7757k9437
18504E95730j73184J34000r2934J2697l0247J14299o9893j87304M23993j14737
18494F12420O6709j16713L614J40274j93427j12664J90466k28839R4362J30770
18484E86972j23488o3426K66740K7042j28290j15904l949K81474j90320o4464
$$ y = [361281, 283658, 472296, 288183, 473585, 401492, 620742, 565847, 418699, 335918, 536493, 559149, 706242, 321726, 632335, 568640, 402946, 569010, 638042, 543393, 391784, 444566, 499120, 439042, 653676, 443276, 547734, 368003, 525439, 572170, 652530, 293208, 588994, 261077, 530251, 654338, 568712, 607054, 314130, 351520, 579248, 507787, 471694, 376170, 499115, 225614, 598435, 376267, 652924, 625167, 595730, 422546, 556546, 463612, 476309, 446062, 560361, 490468, 303164, 727157, 612420, 679129, 562416, 566030, 706304, 512877, 400213, 590679, 361840, 456202, 586972, 463484, 400058, 666798, 693840, 565550, 449646, 445697, 727171, 536851, 472387]
18474D72387J33997j31359q7823J65822k40353K88502j3399J6660j06053k2367
18464D76014L4679K77855r7776j49616L3917J39674K8503o4892J67652j93129
18454F52881J35098J09661l35757q697j21423L33382k21688K12568j90133l7753
18444E28139K14916q3283o8838j46185J71205j43481P0722j08418J05716m594
18434E35899J09355j34808O4721J05948j10313K03774k94212K28883j02731l3159
18424E73357P8858j04568K09019j67434J1590j64264K0857J01838j08539J62592
18414F13306q6256k49876J93241O7249K8073p7716J10548J17966k02749O6368
18404E80154j34214P8251p3311q002P2297j03981J05990J3401j08057J9862Q7556
$$ y = [472387, 606384, 475025, 387202, 553024, 312671, 601173, 587774, 604434, 498381, 476014, 510693, 788548, 690772, 541156, 575073, 714747, 743250, 678358, 846010, 652881, 787979, 897640, 561883, 553186, 431763, 765145, 543457, 756025, 565892, 528139, 743055, 659772, 590934, 444749, 615954, 472473, 543195, 434777, 540493, 535899, 645254, 510446, 575167, 681115, 570802, 774576, 480364, 709247, 606516, 573357, 652215, 547647, 756666, 589232, 600822, 436558, 457415, 559253, 450714, 613306, 527050, 277174, 470415, 537664, 565737, 488021, 598569, 716535, 513786, 580154, 445940, 524191, 450880, 442878, 515175, 411194, 517184, 530585, 422528, 442390, 529946]
18393E29946j96589K10463p4066r0J9524j7653J41236J7999q8804I0913J47238
18382B38151J55580K71371n8185k04542K95423k13677m826n9243J86120q2230
18372E23942j05918K85783m7295B60309J92063r894J51311j60100j07498M49106
18362G75297l04558j65279M3362L0069J69268J12690A61157L28362A77062N05873
18352F82935l272l805k60571L65761q1609k16229R1044J39905k15707K29687L7966
18341G66105C57217J64676P5403j5886p1187J02039j34683K8890p2279K45658
18331F79848k24591J18384j49842K6436n4946o5932J88603q9938n3497K03759
18321E78284R2725B50253L18082j32784K06660O1445q5197m7556J43995C08786
$$ y = [529946, 333357, 543820, 469754, 469664, 489188, 471535, 612771, 630770, 541966, 90913, 238151, 393731, 665102, 606917, 402375, 697798, 484121, 479295, 420052, 606172, 523942, 418024, 703807, 656512, 260309, 452372, 442478, 593789, 433689, 326191, 775297, 470739, 305460, 348822, 378891, 548159, 660849, 161157, 489519, 177062, 682935, 679663, 675858, 415287, 781048, 699439, 483210, 574254, 714159, 498452, 728139, 766105, 357217, 521893, 597296, 581410, 510223, 612262, 477579, 506469, 434190, 679848, 455257, 573641, 423799, 450235, 395289, 329357, 517960, 428022, 374525, 578284, 671009, 250253, 568335, 435551, 642211, 703656, 618459, 570903, 714898, 308786]
18310H07111k59131K53644k04339R1705j43305j54148K56202B11705J18412J22587
18300D52704O2882r2215J09920m0507j73918P0451Q1150J34975l1313k72678L62210
18289F63661k00240J19610N5374j21170M4968k56495j6030J64957K66418j21007
18279F00046o3989q1751J53017k17308K5442L30967k78785m3867K80900q8516
18269F16156j92951o8726Q4277j87603K93323j59382m5320q0356M22388B65939
18258D07084K12579k50342K49067j18751k7132K25636j94618o9406O8834L4423
18248E37374J11219m1160j81812p6825M6700J94947j07244N656J05697O3030j50696
18237E06886L8126k3442j23362j2824K09218J6033k03152O0291Q5096p7536R780
$$ y = [807111, 547980, 801624, 597285, 688990, 545685, 391537, 647739, 211705, 330117, 452704, 515586, 423371, 533291, 492784, 318866, 389317, 470467, 605442, 574129, 301451, 663661, 463421, 583031, 638405, 517235, 562203, 305708, 289678, 454635, 721053, 600046, 536057, 454306, 607323, 390015, 415457, 746424, 467639, 423772, 704672, 616156, 423205, 354479, 438756, 251153, 544476, 385094, 339774, 259418, 681806, 265939, 407084, 619663, 369321, 618388, 499637, 472505, 698141, 503523, 434117, 502951, 537374, 648593, 607433, 425621, 348796, 395496, 590443, 483199, 488855, 594552, 657582, 506886, 545012, 521570, 398208, 385384, 594602, 610635, 407483, 467774, 552870, 475334, 485114]
18226D85114k04312J48246K2970m5664N5375J60905J58194k26315J20254B11499
18215E09472O1533q8744P1899n4383J4765m4156P2601j01795M462J42934j90999
18204C97589J67543L2267k68061P3533q8257L82526j55221k1384J40942j06674
18194E54803J36448J21820N3843l92007J27619O0590C27672j32875L68568P889
18184E71254l7165r6339J95435k5938p0365r2669K882P3695J4665n5694J40860
18173F20621n0924M6509j85567K3577K19214l1852k62187K04608n0456J5340j05404
18162D43479J11570Q537k45236K01052l1300o9076q7448O6406J09164J48470j99590
18151D56028J24153j9512r0707J15976R9372j04927J0150k55356K65968r5892
$$ y = [485114, 280802, 429048, 452018, 406354, 461729, 622634, 780828, 554513, 674767, 211499, 509472, 571005, 482261, 554160, 499777, 514542, 470386, 542987, 441192, 445654, 588588, 397589, 565132, 597399, 329338, 402871, 314614, 697140, 541919, 520535, 661477, 554803, 691251, 813071, 866914, 474907, 602526, 663116, 327672, 194797, 563365, 571254, 534089, 437750, 633185, 607247, 536882, 444213, 447095, 520790, 535455, 479761, 620621, 569697, 616206, 430639, 454216, 673430, 641578, 379391, 583999, 533543, 548883, 443479, 555049, 563586, 318350, 519402, 488102, 419026, 331578, 397984, 507148, 655618, 456028, 580181, 560669, 469962, 585938, 685310, 580383, 590533, 335177, 601145, 505253]
18141E05253N9866P6034k93472L51759j67554j6690N682j84243K5016J78931L6415
18130E76997B35835K10259L6149k8330J16099m3684j79957P8104P531L7227K03751
18119F72984j77424L7987j6653k2097L1326J18299k2095J15863k60659K91547
18109G69078j79941p1461o5978L20283k03279Q9203p0091j01788J13636A48532
18098D17583K0219K8705r6371L13089j03300K10913k79836m4603J72282B40056
18087D60298J64381k96915J20222j03919K46232B50391K37368j89485J83987p8173
18077D04088J34270j30901J04828j07455K72252k13595J53964p0390j17754j57498
18067B71809J89430j02429p6011J81316K04998k95784P4530O0839j12295o2443
$$ y = [505253, 565119, 641153, 347681, 699440, 531886, 515196, 520878, 336635, 361651, 540582, 576997, 235835, 446094, 482243, 453913, 570012, 526328, 346371, 424475, 432006, 469233, 672984, 495560, 533547, 516894, 494797, 526123, 644422, 622327, 738190, 477531, 769078, 589137, 517676, 451698, 771981, 568702, 657905, 587814, 486026, 599662, 148532, 417583, 437802, 466507, 370136, 683225, 579925, 790838, 511002, 466399, 638681, 240056, 460298, 624679, 327764, 447986, 344067, 590299, 250391, 487759, 298274, 482261, 404088, 538358, 407457, 512285, 404830, 677082, 463487, 617451, 547061, 429307, 271809, 461239, 358810, 282799, 464115, 669113, 373329, 447859, 508698, 396403, 333960]
18057C33960K93731k39925J5805n6084Q6134M7831B23498K74797j08662K1014
18047D10647p6199O0366J94494J02666C23374J04488N6943n1682j0511O8307N757
18036D96676q2658m2234K48108j08848r306m9924l3820j38073J18861J3622j31672
18025B80732P8295J66359r4456J35823j35292j62408r13k0149K66093A93113J66607
18014C59720J12933K0897j11991K7537A79768M53711k39815J78402K7582B83204
18003F13483j30316K24196C34714J45212O5385k72109J40954K45568q3482j49740
17993D26502L1799J28663j79928j0371K6156j52004J4862K44627j88329L01611
17983F43588k49489J66087j71352J29825K8413k00443J17476K1176K6521j83131
$$ y = [333960, 627691, 387766, 403571, 347487, 433621, 481452, 223498, 498295, 389633, 410647, 334448, 394814, 589308, 691974, 323374, 427862, 484805, 433123, 422612, 490919, 496676, 414018, 371784, 619892, 511044, 501738, 451814, 417994, 279921, 398782, 412404, 280732, 359027, 525386, 430930, 566753, 431461, 269053, 268140, 247991, 514084, 193113, 359720, 472653, 493550, 381559, 409096, 179768, 633479, 393664, 572066, 599648, 283204, 613483, 483167, 707363, 334714, 479926, 545311, 273202, 414156, 659724, 576242, 426502, 458301, 586964, 407036, 396665, 422821, 270817, 285679, 530306, 341977, 643588, 394099, 560186, 388834, 518659, 547072, 346629, 464105, 485281, 511802, 328671]
17973C28671R4246J53348j25527L8884J0940J42823k39772N4100Q1987j23243
17963D16457R111k5269N1891R8413n9721K59245C22390O9271K41299k15025J40488
17952E58423R0851m5441m6627q300j84766J85975Q8951r5786k30236J47101q1883
17941C78262K6046K4291J27557N9870N4265l22791l9553K93984j5942J81903l73998
17930C93894M6607p2817K19379j32586J44126n6918J32773k32969J22510q9591
17920D74408P8975j91420J1942M07371j87473j23464K782J50109k4195n8585J58970
17909F99420j21033o4300K2030K04530k34045J12152j2434p8722J03048O2895
17899F93541p8421R445N9894j51176r7864K29244m0047J96951k25646l7694O0037
$$ y = [328671, 422917, 576265, 450738, 489622, 500562, 643385, 403613, 457713, 539700, 416457, 425568, 400299, 452190, 550603, 490882, 750127, 322390, 391661, 632960, 417935, 558423, 649274, 603833, 557206, 548906, 364140, 550115, 639066, 543280, 313044, 460145, 378262, 404308, 428599, 556156, 616026, 670291, 347500, 307947, 601931, 585989, 767892, 393894, 440501, 367684, 587063, 454477, 598603, 541685, 674458, 441489, 563999, 474408, 553383, 361963, 373905, 781276, 593803, 470339, 473121, 623230, 599035, 540450, 699420, 578387, 514087, 536117, 740647, 506602, 618754, 606320, 527598, 630646, 693541, 615120, 624565, 684459, 533283, 435419, 664663, 624616, 821567, 595921, 558227, 618264]
17888F18264j38570J76748R7060r7288m9375j47622L14936k42624J67326k89872
17878D08983K02856R570Q904m246l6604p3096K73489P4965j19734k51260k6452
17867D67375R5277N9234j6883p9136J49498j5102r8753m9518j12485n3479L18686
17856F64714k51210l6239J66840K36006C48999J60170P2273l7713J27939m9408
17846F22260J34788k12888k2205j10953J43005p4978j2479L07404C37376M35695
17836G73071j97032M8316k1473P7967P023n0211n5627k2213m3021O1753k03344
17825C75209M15926p5941k14291Q9190K69659l95362L74984k90740J61486K04111
17815I14231k965K939J3786J65489j77349O2986j30108K11095k46416o8486N3210
$$ y = [618264, 479694, 656442, 753502, 656214, 606839, 459217, 774153, 531529, 698855, 408983, 611839, 621409, 630313, 626067, 589463, 516367, 789856, 864821, 745087, 493827, 467375, 562652, 621886, 605003, 525867, 675365, 660263, 561510, 511992, 399507, 346028, 664714, 413504, 377265, 544105, 780111, 348999, 509169, 581442, 543729, 671668, 622260, 757048, 544160, 521955, 411002, 554007, 479029, 466550, 773954, 337376, 773071, 576039, 624355, 602882, 680849, 687872, 637661, 582034, 559821, 516800, 578553, 375209, 791135, 715194, 500903, 590093, 859752, 464390, 839374, 548634, 710120, 914231, 911266, 914205, 927991, 1093480, 916131, 979117, 849009, 1060104, 813688, 745202, 798412]
17804G98412o0538n3985M05659l73519J58952L9403N2099j94655M6383M9038j17647
17793G49602J12483K8099j03556p0463R6899k47967O2002j06150J19340K5467
17783F65756j00218K34905l26959K45694J21899l69751J39973K39218l27940M2211
17773E64788M9366k5999l7916K4507K04207k60210k6150J17007k9905K30315r4947
17762G15063k43284K32725j27415K7524o0143k00545J96834J45904J65458j30163
17752G21958N1548j21862r9516Q0160k53314N23865l24163k17383L77976j84682
17742E54587K74266k49814J7156p177M8770J0205K30595l92925R134L78881k10860
17731F62818l27291L95692J84423k80191r024j14644L11763o797j61604j74661
$$ y = [798412, 737874, 683889, 1089548, 716029, 874981, 914384, 966483, 771828, 818211, 867249, 749602, 862085, 890184, 786628, 716165, 813064, 565097, 627099, 520949, 640289, 665756, 565538, 800443, 473484, 719178, 841077, 471326, 611299, 850517, 522577, 564788, 614154, 588155, 550239, 574746, 778953, 518743, 492593, 609600, 579695, 810010, 715063, 471779, 704504, 577089, 604613, 544470, 343925, 540759, 686663, 852121, 721958, 773506, 651644, 552128, 632288, 378974, 902839, 578676, 361293, 739269, 554587, 828853, 579039, 596195, 589018, 637788, 647993, 878588, 485663, 494797, 873678, 662818, 335527, 731219, 915642, 635451, 626427, 511783, 823546, 816749, 655145, 480484]
17721D80484j92279J82352J1216J54361Q8391C34849M31625C81751M18183J20688
17711I20622j44284n0519l6286k49142r79L20160m8672j82764K5209R4249j02434
17700E45160m9408K79275j45444j73719J26660j17899L37914j96077k57125J95931
17690E45268K58851o0301l41828K50395j18543L28039l53923R7400J2488K61657
17680H79503D19931K01975j45037Q3996L4831r3484K04791J28804k6773k43389
17670E65645j06454L88476k97411L6963l2145J00340p4939J33775j50361J99828
17660G63717J5221q8175o7903o2527J17795K52681k83129R963J36067k74619J6051
17649E35142R0063K19326k19134Q9749J71539j32973K1960k404r8546K29516n334
$$ y = [480484, 288205, 470557, 481773, 636134, 724525, 334849, 766474, 381751, 799934, 920622, 776338, 725819, 689533, 440391, 439412, 759572, 710900, 528136, 553345, 647594, 545160, 495752, 775027, 629583, 455864, 582524, 464625, 802539, 606462, 349337, 545268, 804119, 743818, 401990, 652385, 533842, 861881, 507958, 605358, 617846, 879503, 419931, 621906, 476869, 560865, 595696, 502212, 707003, 835807, 809034, 565645, 459191, 847667, 550256, 587219, 555074, 655414, 580475, 714250, 563889, 763717, 778938, 690763, 622860, 560333, 678128, 930809, 647680, 657643, 793710, 519091, 535142, 625205, 844531, 625397, 715146, 886685, 753712, 775672, 773268, 674722, 904238, 898904]
17638H98904q7570j06303l3084J61879p3591j04887J97038j4376n9875K3183l3207
17627G68111N3088J05901J43004J7412j95552j31326K01459J78444l5031j17541
17617I87969j69816J09729l3179R7223J37486m5775j83831o5232K62233j05259
17607I91548L47770k28907j24568j10942J32269Q4879J4387j18031J12248R6154
17597A196807L1577k99310J1735K47897r5723k60869K21436K3456q8674J4520
17587A002852m5071L64615m4661l9200l49245L17244q30R4960j76871J88356k17294
17576A094855j58877J10184K27758j1794J66576k40591J85181J01366l20641P8244
17566A232261L3006j74152q0070J1969P9763K566n8008J4372J5766m8408J62434
$$ y = [898904, 811334, 705031, 671947, 833826, 760235, 655348, 852386, 838010, 778135, 801318, 768111, 821199, 927100, 1070104, 1087516, 891964, 760638, 962097, 1140541, 1105510, 987969, 818153, 927882, 894703, 991926, 1129412, 1083637, 899806, 834574, 1096807, 991548, 1339318, 1110411, 985843, 874901, 1007170, 1092049, 1106436, 988405, 1100653, 1196807, 1228384, 929074, 940809, 1188706, 1092983, 832114, 1053550, 1077006, 988332, 1002852, 957781, 1322396, 1277735, 1238535, 889290, 1206534, 1205704, 1300664, 1123793, 1312149, 1094855, 935978, 1046162, 1273920, 1262126, 1428702, 1188111, 1373292, 1474658, 1154017, 1232261, 1265267, 1091115, 1011045, 1023014, 1102777, 1105343, 1047335, 1061707, 1077473, 1029065, 1191499]
17555A191499j97313J17471n7704l5026K1124M0905J76717m0570k13262l6086
17545I67755n2323N38313m00276L39897k44871J48773p818Q4707r7117K1381k5630
17534A272791k50412L28655l5361k75057J02010J34541J20868k64921L06278j67067
17524A272325p3465P7634n0167K01341m9423m2844L0776N6413R9108N5431J67592
17513A744721J8164j2660k053L00531J36559M0348K07174l68164K82607J26481
17503B473708j76204K03682l4754L5099k2250K06724p4422J94284M93208K29419
17493C528494M83564N25845K81107N37981N49016R92776J446499K538123M520237
17484A5403642Q000784J1380121J4085813J5414086J2652547R578078N807179
$$ y = [1191499, 994186, 1111657, 1053953, 1018927, 1040051, 1080956, 1257673, 1217103, 1003841, 967755, 915432, 1453745, 1053469, 1393366, 1148495, 1297268, 1289450, 1374157, 1277040, 1298421, 1272791, 1022379, 1351034, 1315673, 1040616, 1142626, 1277167, 1398035, 1133114, 1439392, 1272325, 1198860, 1276494, 1226327, 1427668, 1378245, 1335401, 1366177, 1422590, 1521698, 1577129, 1744721, 1762885, 1750225, 1748172, 2048703, 2185262, 2225610, 2432784, 2064620, 2347227, 2473708, 2297504, 2501186, 2466432, 2501531, 2479281, 2686005, 2611583, 2805867, 3299075, 3528494, 4012058, 4537903, 4819010, 5356991, 5906007, 6898783, 8345282, 10883405, 15403642, 23404426, 34784547, 48870360, 64284446, 76936993, 86515071, 92322250]
17477I2322250J444942l141204q759340j3850351j6381815j3827076q524280k796838
17469B6486288K883380P821191J1989294J4027135J3133376R891255O330695K204526
17461I4767140k398470p585595j3565018j6970143j6848729j3093940q342856
17454A5962389m619870k841488j632848j124711j039073o19609m35844n6783m1412
17445C550751K1501J61815Q953j5461o3458j44413J26907r0641m66645j52289
17435B937020o3598j72999J29631J66335L7150J87262j40280P7616r8564K48875
17425C308448k43821q0403j86240k43571j96109k39959Q1109j06971j00330K59119
17415B251272j81844J11266j39991K21751j60690k02128J45514k21224J64835
$$ y = [92322250, 93767192, 90625988, 81866648, 68016297, 51634482, 37807406, 29283126, 26486288, 29369668, 37190859, 49180153, 63207288, 76340664, 86231919, 92562614, 94767140, 92368670, 84783075, 71218057, 54247914, 37399185, 24305245, 15962389, 11342519, 8501031, 6868183, 5743472, 4704399, 4084790, 3648946, 3592163, 3550751, 3572252, 3734067, 3743020, 3727559, 3664101, 3519688, 3646595, 3555954, 3089309, 2937020, 2873422, 2700423, 2830054, 2996389, 3033539, 3220801, 3080521, 3158137, 3059573, 3308448, 3064627, 2984224, 2797984, 2554413, 2358304, 2118345, 2199454, 2092483, 1992153, 2251272, 2069428, 2180694, 2040703, 2262454, 2101764, 1899636, 2045150, 1823926, 1988761]
17406A988761j12059n6732K65785J86227J89580l0679J15257J14790k6445K60259
17396B894744K542L62295J62351L14930M18835J88399M30341O72894M61947M36603
17386F345881K9872M52651J20340k9185l97022k47801j65104l19761k29116k93366
17376E267389j59494R3633r4702J48709L01395M27262L49245L98923O05071J30735
17366G468166J87700J27585k31749K42103k70114l17096m8343l04559m5122m9930
17356F758641q6230L04351K96909l4263O72306M56391K19688Q14993O24187Q89991
17346A0916964K56464N74814N78829L31952P5273R0130k57635l01309k70085n90768
17336A1404629l56943o03037q7281O18J02362M1134K23863L36290L10282O30205
$$ y = [1988761, 1876702, 1819970, 2085755, 2271982, 2461562, 2430883, 2546140, 2660930, 2634485, 2894744, 2897286, 3259581, 3421932, 3736862, 4155697, 4344096, 4774437, 5447331, 5909278, 6345881, 6375753, 6828404, 6948744, 6919559, 6522537, 6274736, 6109632, 5789871, 5560755, 5267389, 5107895, 5201528, 5106826, 5255535, 5556930, 5984192, 6333437, 6732360, 7337431, 7468166, 7655866, 7783451, 7551702, 7793805, 7523691, 7206595, 7158252, 6853693, 6808571, 6758641, 6672411, 6976762, 7273671, 7239408, 7911714, 8368105, 8587793, 9402786, 10026973, 10916964, 11173428, 11748242, 12327071, 12659023, 12734296, 12824426, 12566791, 12265482, 11995397, 11404629, 11047686, 10444649, 10357368, 10357986, 10460348, 10501482, 10725345, 11061635, 11371917, 12002122]
17326A2002122O2999L17135N07887r6597p3281J67362k30769m92614r0062m81421
17316A1592761j81990o05683o28206Q0559k93119k4867j72463J85974j54743M95868
17306A0294091K67495L17458N06521L23760K26076R5088K65023k49436l32326
17297A1713750l92736j12263p50203j93680j79244j6265k30705k4705o0180L28473
17287A0082242J69910R3993K44561k23913L29950n89524j85789m18274n28640
17278H974516r32110n43070o84516o06044n80400m26189l74582l46014j72676
17269D308915j90320o8541K1761l19840j01324J49426k92305J3199l35188J71531
17259C357314r1352l223k8852Q0857m34318J92237k41200J50066O4859r0522N5268
$$ y = [12002122, 12065121, 12382256, 12890143, 12793546, 12720265, 12887627, 12656858, 12164244, 12074182, 11592761, 11410771, 10805088, 10176882, 10257441, 9964322, 9939455, 9766992, 9952966, 9798223, 10294091, 10561586, 10879044, 11385565, 11709325, 11935401, 12030489, 12295512, 12046076, 11713750, 11321014, 11208751, 10458548, 10264868, 10085624, 10069359, 9838654, 9813949, 9753769, 10082242, 10252152, 10346145, 10590706, 10366793, 10696743, 10107219, 9921430, 9503156, 8974516, 8042406, 7499336, 6814820, 6208776, 5628376, 5202187, 4827605, 4481591, 4308915, 4118595, 4050054, 4071815, 3751975, 3650651, 3800077, 3507772, 3520971, 3185783, 3357314, 3265962, 3262739, 3233887, 3314744, 2880426, 3072663, 2831463, 2981529, 3046388, 2955866, 3011134]
17248C011134l94918L04491j64072J4347M0175j87100J52759k11936J61147l7070
17238B688957J44214J33688k05365j99958M948r6538K7062k20935J1362R9658
17228B387093k08576J90550l385j93700K75960j0868J27836j5675J31637m64101
17218B216771L92797k7652O1691j69069j10891L06480k04098j66692L49427k99021
17208B349743k7681J72736o6094j74801J75359J51040n6942o8804k3295l17421
17198B113840L95216K9643l45827r6404j82130n2978l08689J17989J1311o7014
17188A614957J80795r6960j10804J21205l00734K74189J4357J8060j70952k4224
17178A519889j71573J30662M1488K34377k3935k9348l5036j63431J83472J02805
$$ y = [3011134, 2616216, 2920707, 2756635, 2770982, 2811157, 2624057, 2776816, 2564880, 2726027, 2688957, 2833171, 2966859, 2761494, 2561536, 2566484, 2469946, 2497008, 2276073, 2287435, 2387093, 2178517, 2369067, 2365682, 2171982, 2447942, 2437074, 2564910, 2549235, 2680872, 2216771, 2609568, 2581916, 2643607, 2474538, 2363647, 2670127, 2466029, 2299337, 2648764, 2349743, 2322062, 2494798, 2428704, 2253903, 2429262, 2580302, 2523360, 2454556, 2431261, 2113840, 2509056, 2538699, 2192872, 2096468, 1914338, 1861360, 1552671, 1670660, 1681971, 1614957, 1795752, 1698792, 1587988, 1709193, 1408459, 1682648, 1697005, 1715065, 1544113, 1519889, 1348316, 1478978, 1520466, 1754843, 1730908, 1701560, 1666524, 1503093, 1686565, 1789370]
17168A789370k1226q668k8730L6453L9970K0017j73473Q8450J434O3580J57526
17157A964703q5701L6034M8799K98908m71997j5975Q218K55424j97541L33942
17147B174814l68012J67428k5936j5616J49346j53815k7488J94075p0026R070
17137B033840J51771m0549Q4308Q3592k90808j80361N8908o3352K35206j38798
17127A933757N8811o5299J53176r9714n2365K0280K39844K3181q5342N6956k01678
17116A981607j45788K61606q8275k3322L0412R0293r966o5826m5734J16705K21545
17105B323257o0414J50166l58550j6257Q4601Q9753l5059k46065J81674k48094
17095A865012j51031j00971M2059j78469J68817l40762R4133j48847K22601l33551
$$ y = [1789370, 1768144, 1759476, 1730746, 1767199, 1807169, 1827186, 1653713, 1742163, 1743597, 1807177, 1964703, 1879002, 1915036, 1963835, 2262743, 1790746, 1774771, 1782989, 2038413, 1840872, 2174814, 1806802, 1974230, 1948294, 1932678, 2082024, 1928209, 1900721, 2094796, 2024770, 2033840, 2185611, 2145062, 2229370, 2312962, 2022154, 1841793, 1900701, 1837349, 2072555, 1933757, 1992568, 1927269, 2080445, 1980731, 1928366, 1948646, 2188490, 2211671, 2126329, 2183285, 1981607, 1835819, 2097425, 2009150, 1985828, 2016240, 2106533, 2096567, 2030741, 1985007, 2101712, 2323257, 2262843, 2413009, 2054459, 2038202, 2122803, 2212556, 2177497, 1931432, 2113106, 1865012, 1713981, 1613010, 1655069, 1476600, 1645417, 1304655, 1398788, 1249941, 1472542, 1138991]
17085A138991j99570K71210j87964J01822p4423R4998q0168J98269k11180J47605
17075A199590j532J47244l56633K49148j25561J8663q0541J23055k39650K73293
17065A207076k04777K72052n0304j46459K3769K17146k33087J20729p3577J20550
17055A253118L96562J15319m8251J08955K22302k22571M03759K860p1354P1005
17045B231704k25991R1001J4544R9101K97625Q7155J55171L560L9528r8519m1520
17034B653359j25853p8439k58485J9239j14331j98882k53932M0563j21968k4089
17024A537182J53046j51786j0991k30734J6113p2846K04982k58994p3903J56900
17014A268969j5714j04701j37220J16559j33949J74826p2429j17544L8341K37082
$$ y = [1138991, 939421, 1210631, 1022667, 1124489, 1050066, 1145064, 1064896, 1263165, 1051985, 1199590, 1198058, 1345302, 988669, 1237817, 1112256, 1130919, 1050378, 1173433, 933783, 1207076, 1002299, 1274351, 1224047, 1077588, 1101357, 1318503, 1085416, 1206145, 1132568, 1253118, 1649680, 1764999, 1716748, 1825703, 2048005, 1825434, 2229193, 2232053, 2160699, 2231704, 2005713, 2096714, 2111258, 2210359, 2507984, 2595139, 2750310, 2753870, 2793398, 2694879, 2653359, 2527506, 2449067, 2190582, 2209821, 2095490, 1896608, 1642676, 1683239, 1561271, 1537182, 1690228, 1538442, 1527451, 1296717, 1312830, 1239984, 1444966, 1185972, 1112069, 1268969, 1253255, 1148554, 1011334, 1127893, 993944, 1168770, 1096341, 978797, 1017138, 1254220]
17004A254220j88186l6418j46614L19732K0329j18021K04298j69721k20348K63879
16994A183150j96495K28766j49426n2679K2217K18389q8642q9156J24286k30270
16984I70140L72900j03426j57732l9283J31684l4395j5769Q8421M2886o3396Q3998
16973A276028J24649L19259l76020Q0882J25984J7830l779j19501K52726J29308
16963A827366R5083K2970K16574J47952m5241J78780m211L33593m39114J25578
16953B459330M3187k50410K69999j68081O843j52323j00384o3200J21971k69144
16943A897788J11453n19000O224J04298k09666l4619J34041l41458J42906j44633
16933A147334m5646K25511j69109p0280L9669j23984J23307J74447l49292K58921
$$ y = [1254220, 1066034, 1029616, 883002, 1202734, 1223063, 1105042, 1309340, 1139619, 919271, 1183150, 986655, 1215421, 1065995, 1013316, 1035533, 1253922, 1165280, 1076124, 1200410, 970140, 1343040, 1239614, 1081882, 1042599, 1174283, 1139888, 1124119, 1212540, 1255426, 1192030, 1276028, 1400677, 1719936, 1343916, 1424798, 1550782, 1568612, 1564833, 1445332, 1698058, 1827366, 1922449, 1945419, 2161993, 2309945, 2264704, 2443484, 2439273, 2772866, 2333752, 2459330, 2502517, 2252107, 2522106, 2354025, 2360868, 2208545, 2108161, 2044961, 2166932, 1897788, 2009241, 1490241, 1496465, 1600763, 1391097, 1356478, 1490519, 1149061, 1291967, 1147334, 1101688, 1327199, 1158090, 1087810, 1127479, 1003495, 1126802, 1301249, 951957, 1210878]
16923A210878k52799J5991J88572j76875Q531k53323K68472j1942k35583K32394
16913I94316l3333k14613K79162k54113K07753j23383k5220P1738p7433k10257
16903F14617K89768l932m282k63597K46940j07039K74893l19393K14307m27342
16893E14940L41332l2415J0706j78475J06729l54109L86543j52583K35945p8954
16883G99659P6605j8913k75898J33483N3253r7752N6722P0142k22213L4761P8008
16872F87857J70226P1026k45452K65402k39563L29351q6122k38685Q2253K2552
16862H18845L5633J9788L3407j82533J8145R1091L11860k61080j84289J60620
16852H61487P095q8455J85794j17027j30040K44878o8334O8171k09904K66378
$$ y = [1210878, 958079, 974070, 1162642, 985767, 994298, 740975, 1009447, 997505, 761922, 994316, 960983, 746370, 1025532, 771419, 979172, 855789, 830569, 902307, 824874, 614617, 904385, 900453, 896171, 632574, 879514, 772475, 1047368, 727975, 942282, 514940, 856272, 823857, 834563, 656088, 762817, 408708, 795251, 642668, 878613, 799659, 876264, 857351, 581453, 714936, 768189, 670437, 727159, 797301, 575088, 609849, 687857, 858083, 929109, 683657, 949059, 709496, 1038847, 952725, 714040, 796293, 818845, 854478, 874266, 907673, 725140, 743285, 834376, 1146236, 885156, 700867, 861487, 868582, 780127, 965921, 848894, 718854, 963732, 895398, 963569, 753665, 1020043]
16842A020043k46318o2468j03550J15867m2593J36233k49885L24325J27426j11450
16832I07630j84665L50736k29810K75814q5330L0115J01530L058k08225R9930
16822A060783J42669J64054n4012M5680J90245j0333K62457n810j12556J4009
16812A697186J21013q9651l01943L13511j10913k9751M1279M1501p0551k74220
16802A337461K22425r5269m62l4779n267N3962O4046K2757l75088K23227j66538
16791A246475j59859O1683j57549o1368K4492k52089L45193k87233K57313k45234
16781G71824n6266K88076k63280j18926K08370J37534j53183j43073M706J53658
16771H29440j40738N9389N0083J34177M113j33295M0018Q3942p1741m1744q8871
$$ y = [1020043, 773725, 711257, 607707, 723574, 680981, 817214, 567329, 891654, 1019080, 907630, 722965, 1073701, 843891, 1119705, 1034375, 1064490, 1166020, 1169078, 960853, 1060783, 1203452, 1367506, 1313494, 1359174, 1549419, 1539086, 1801543, 1795733, 1683177, 1697186, 1818199, 1728548, 1426605, 1740116, 1629203, 1599452, 1640731, 1682232, 1611681, 1337461, 1559886, 1464617, 1464155, 1429376, 1424109, 1478071, 1542117, 1564874, 1189786, 1413013, 1246475, 1086616, 1148299, 990750, 929382, 953874, 701785, 1046978, 759745, 1017058, 771824, 715558, 1003634, 740354, 621428, 829798, 967332, 814149, 671076, 675782, 829440, 688702, 748091, 798174, 932351, 936464, 803169, 843187, 927129, 855388, 813644, 724773]
16760G24773j05157Q3679P8363q461P037J55683m8739p8137J21137o1997k7305
16749H40876P7182j89126r143K1102J85198l37562K02981n0125m8095J78897R5761
16738I67946D70883L47430L6154j28531J30120j40645J58507o6581J19737M1518
16728I68592m13791L73734M3767R278j76691p2561J62258L2371J00370J5496N1633
16717A094456k55912P4804K8695J11760j33328M440J56610l18622J66258J86936
16707A116097P5194N134K21982K19869J46702m2441k05023L60079p3582j23363
16697A700648N0988j04025j73363n9752J21555J93461J87334j43823O7320R857
16687A850200l4465K4179j76447M075Q8193m65466P9864k97371K73846q5175j15626
$$ y = [724773, 619616, 703295, 781658, 773197, 780234, 935917, 887178, 809041, 930178, 868181, 840876, 918058, 728932, 719789, 740891, 926089, 588527, 791508, 741383, 693288, 872185, 967946, 470883, 818313, 854467, 725936, 856056, 715411, 873918, 807337, 927074, 968592, 554801, 928535, 972302, 981580, 804889, 732328, 894586, 926957, 1027327, 1042823, 1094456, 838544, 913348, 942043, 1053803, 920475, 924915, 1081525, 762903, 929161, 1116097, 1191291, 1196425, 1418407, 1638276, 1784978, 1742537, 1537514, 1897593, 1824011, 1700648, 1751636, 1647611, 1474248, 1414496, 1536051, 1729512, 1916846, 1773023, 1840343, 1850200, 1815735, 1839914, 1663467, 1667542, 1755735, 1290269, 1370133, 1072762, 1346608, 1261433, 1145807]
16676A145807j24486J9242n541J8533P4106K17659J64662o5164J69517J24474
16666A738809J10164m0113J75992n367k5819L7706k80165j88772K06034o1079
16656A667390O9116j6401O6008k5637J81263p1492j30380p6971k84490J09536
16646A487942k96100j42054j08253M2900l8013q3270J63826j98516M7037l82188
16636D93311L12851k91597J45042L738J25642q5185R1408j17682j58163J41231
16626F60596J15523j22365J58725O4835j94658k33757P7748K66017j91073K41393
16616H42984l38425R0228K7715n5956O6329J08443q7153K54746J70573k50604
16606H28880j38773J15878N7150o7895J2117J56367j01542n975J63164j69072
$$ y = [1145807, 1021321, 1040563, 1035022, 1053555, 1127661, 1345320, 1509982, 1444818, 1614335, 1738809, 1848973, 1808860, 1984852, 1979485, 1953666, 1991372, 1711207, 1522435, 1728469, 1667390, 1736506, 1720105, 1786113, 1760476, 1941739, 1870247, 1739867, 1662896, 1378406, 1487942, 1191842, 1049788, 941535, 984435, 946422, 863152, 1026978, 828462, 875499, 493311, 806162, 514565, 659607, 663345, 788987, 703802, 795210, 677528, 519365, 660596, 776119, 653754, 812479, 877314, 682656, 448899, 526647, 792664, 601591, 842984, 504559, 594787, 622502, 566546, 632875, 741318, 654165, 908911, 1079484, 828880, 690107, 805985, 863135, 795240, 807357, 963724, 862182, 856207, 1019371, 850299]
16596H50299J17457k53120K36366n2177K36526k13737K19045l16020k7057K93376
16586A090958n6783j51034J13022Q1537r192q993l40272L39185l46063L14847
16576A027212J70567m00697O6159j68631P7928q7377p7445P7019K5226m5820O2978
16565G27119p3224q1369K06814j11319n9665M84K79107p5467J62479j32676P2566
16554I14849q8628M3595K64919j52885L0370k6995O0159o7102P9645j48633R2844
16543A002138R222k48420R2528n0706O3972N9758l29093J45410N8710j99793K00034
16532H03760o7681J76116j49711k8640J04421j26592j4673q9942K495l4204K26044
16521H01393k19227j22977O4855P9612J19843n0182M2551N7374j21762J59905
$$ y = [850299, 967756, 714636, 951002, 898825, 1135351, 921614, 1140659, 824639, 797582, 1090958, 1034175, 883141, 996163, 1077700, 1068508, 1059515, 719243, 1058428, 712365, 1027212, 1197779, 797082, 863241, 694610, 772538, 685161, 607716, 684735, 709961, 664141, 727119, 653895, 572526, 779340, 668021, 608356, 608840, 887947, 812480, 974959, 842283, 914849, 826221, 869816, 1134735, 981850, 1012220, 985225, 1045384, 978282, 1057927, 909294, 1002138, 1011360, 762940, 855468, 804762, 868734, 928492, 599399, 744809, 803519, 603726, 803760, 736079, 912195, 762484, 733844, 838265, 711673, 697000, 607058, 609553, 575349, 801393, 582166, 459189, 524044, 603656, 723499, 673317, 715868, 773242, 651480, 811385]
16511H11385k1913J02068L68508j85926j3783n5147J42298M2391P9810k3133j5792
16500A230766N5158p4786L5397L3882l02391J20870m996J1705m5732K29492j75953
16489A113412p8814J67420Q7658p2211j3560l6074P2612J17582n943j05320m979
16478A241783l8317j0930L78387o3408j43780k6523O3627l47086L76035k08480
16468A221308j97021K67063j40656o7256j4215K21607K9773j22315M02076l4669
16458A565695k232J28422j79903L13728k93698j47164k4504j28250K95103p427
16448A519770k34404K99892P3332k60400J86655r435j86409M48376J6701o7167
16438A786911K60353K03343N697J62465K95577L68914M11421O00916K48712O96406
$$ y = [811385, 789472, 891540, 1260048, 1074122, 1060339, 1005192, 1147490, 1189881, 1269691, 1246558, 1230766, 1285924, 1211138, 1246535, 1280417, 978026, 1098896, 1093900, 1105605, 1059873, 1289365, 1113412, 1034598, 1202018, 1289676, 1217465, 1203905, 1167831, 1240443, 1358025, 1352082, 1246762, 1241783, 1203466, 1192536, 1570923, 1507515, 1363735, 1337212, 1400839, 1053753, 1429788, 1221308, 1024287, 1291350, 1150694, 1083438, 1069223, 1290830, 1320603, 1198288, 1600364, 1565695, 1563463, 1691885, 1511982, 1825710, 1532012, 1384848, 1360344, 1232094, 1527197, 1519770, 1285366, 1585258, 1658590, 1398190, 1584845, 1575410, 1389001, 1837377, 1854078, 1786911, 2047264, 2250607, 2256304, 2418769, 2714346, 3083260, 3494681, 4095597, 4344309, 5040715]
16428E040715N93602N90062R97423N89233Q11342R46271O21576J299867R73368
16419A2463459R82734J286229J562047J830079J364814K180427K009285J875607
16411B5554681K347822K150720K505753K058379K724368K615725K303935K686568
16403D4947951K438650K310021K091432K815091K755628K065647J264038Q12633
16395F1501091O29154j57792r99471o02284J383744N995410J0018161J1077973
16387H8845986P248916J580131l907648q154205j2511110j6219675j9140645A8580209
16378B217947h798370l190417L027403c618302G91482K741296J370528K14571
16370E117877j91790j62095n9908J09373l33336j97772m62352j95707l13260l63564
$$ y = [5040715, 5634317, 6224379, 7221802, 7811035, 8622377, 9568648, 10190224, 11490091, 12463459, 13446193, 14732422, 16294469, 18124548, 19489362, 21669789, 23679074, 25554681, 27902503, 30053223, 32558976, 34617355, 37341723, 39957448, 42261383, 44947951, 47386601, 49696622, 51788054, 54603145, 57358773, 59424420, 60688458, 61501091, 62130245, 61972453, 60972982, 60370698, 61754442, 67749852, 77768013, 88845986, 96094902, 97675033, 93767385, 85613180, 73102070, 56882395, 37741750, 18580209, 2217947, -8798370, -11988787, -8961384, -3618302, 791482, 3532778, 4903306, 5117877, 4926087, 4763992, 4704084, 4813457, 4480121, 4282349, 3819997, 3624290, 3311030, 2947466]
16360B947466l07056j42505k68466j24215J38170L00753j60940m4729L4075p7020
16350B295533l7585l44175J62839l25762k48568n2464O0289l05160o1430K8879
16340A172396j9442k02916J40587n6591K7062q2880l2969J92642j14227K10851
16330A234513j98044L90421l88503K41221j11056k2625J8901k26469J5859o71
16320I53547l27954J78169L7333j73100k55468J0859Q8934j08378A52671R7036
16310B49707J2750q9742J37854C6708K27877p2962n7889Q6198j05975M6603D2747
16298B82660i1920B30736A1055a39860k2666P942N7997D5526a26786I2089C6800
16286B31930b49488D0376l648J32849p7685a60537A42500e179C6250K1789M7370
$$ y = [2947466, 2640410, 2497905, 2229439, 2105224, 2243394, 2544147, 2383207, 2338478, 2372553, 2295533, 2257948, 1913773, 2076612, 1750850, 1502282, 1449818, 1510107, 1204947, 1143517, 1172396, 1152954, 950038, 1090625, 1034034, 1061096, 978216, 945247, 1137889, 1023662, 1234513, 1036469, 1426890, 1038387, 1279608, 1168552, 1145927, 1164828, 938359, 954218, 953547, 625593, 803762, 841095, 667995, 412527, 423386, 512320, 403942, 152671, 249707, 262457, 172715, 310569, 36708, 264585, 191623, 133734, 219932, 113957, 160560, 42747, 282660, -91920, 230736, 11055, -139860, -162526, -154584, -96587, 45526, -126786, 92089, 36800, 231930, -249488, 40376, 36728, 169577, 91892, -160537, 142500, -5179, 36250, 58039, 105409]
16275A05409J16793D3855L93259j43447L22421j21877J16972J38716L6343o8161
16265G18081q4769r1272k3745L98153m21163J38709R384j32375P3227o0817J7476
16254E40889k8526L5057J56021j70046l3913J3821K3327j86039J62683L4166j33670
16243D13770K58977J31438l6769j84911K5696J69385n2997J35453n4541j33583
16233F71918p135J04700k43487j16982J96343q4378J77734O6853k40376J90456
16223G15646n3423J9378j01631N5408C14773L68292J53101j81192Q5869k31541
16213E09302J55630k4973M3648j67798N7578L9882j86922L13885R0282k22172
16203F08342n5448J1598l6192N5370L8048j01955K33910l34534K41287j184k75497
$$ y = [105409, 222202, 43855, 437114, 293667, 616088, 494211, 611183, 749899, 786242, 718081, 633312, 542040, 518295, 916448, 495285, 633994, 643378, 511003, 584230, 523413, 540889, 512363, 547420, 703441, 533395, 499482, 513303, 536630, 350591, 513274, 547440, 413770, 672747, 804185, 767416, 582505, 608201, 777586, 724589, 860042, 805501, 671918, 664783, 769483, 525996, 409014, 605357, 520979, 698713, 765566, 525190, 715646, 662223, 681601, 579970, 635378, 314773, 683065, 836166, 654974, 740843, 509302, 664932, 639959, 683607, 515809, 573387, 613269, 426347, 740232, 830514, 608342, 552894, 564492, 528300, 583670, 621718, 519763, 753673, 419139, 660426, 659242, 383745]
16192C83745L60328r1738P2596J5810j66706K61969j1764l12299M7169k729K09500
16181G65881K8118K996r7700m3868P3794j12932J51228j95227N8748J91458j58625
16170F63871M73576m65821j44534K10050J07522Q4888l58754J74718o0801R8549
16160G83264j17824J2603j19561K04693j51532J71131L1907q1050j20264J51980
16150G65347j93279J50871k3403J58344l78994M53777j75375k44078J08843j7625
16140F04428P2871k3563J00016N4370p9213q443r5394L104r5814q6670L79009
16129H24701l94463K1827L23452m1592j39101M0989l9858K16995k36859K19837
16119G95928k60638N0030K11926j83894K29898k46850R9701K6874L7972J26672
$$ y = [383745, 744073, 652335, 724931, 740741, 574035, 836004, 824240, 511941, 559110, 556381, 765881, 793999, 796995, 699295, 655427, 729221, 616289, 767517, 572290, 631038, 822496, 663871, 1137447, 671626, 527092, 737142, 844664, 929552, 570798, 745516, 684715, 783264, 665440, 678043, 558482, 763175, 611643, 782774, 814681, 733631, 613367, 765347, 572068, 722939, 699536, 857880, 478886, 932663, 757288, 513210, 622053, 604428, 677299, 653736, 753752, 808122, 728909, 720466, 625072, 628176, 532362, 445692, 824701, 430238, 452065, 775517, 733925, 594824, 635813, 595955, 812950, 576091, 795928, 535290, 585320, 797246, 613352, 843250, 596400, 696101, 722975, 760947, 887619]
16109H87619J60625k27384J12906k74822j40248M04164R7378r9269k5104o9201
16099H26664J43651n8457K2652m0701k6800K79426l88008r4353L47142K083j01089
16088I12210N8717P8249j73150l3206K2730L47083j12082J02522l10666J63067
16078A055474r6825R8247L7621R0355J19392j92661k2269Q0453J65064j38038
16068A196813j85901J79447J27174j67688o2354J45081Q4231r1618M6592q3451
16058A188326L22955l72436K51364O239j3944J36557J07110p3515M7314M8854
16048A648824o0180j84065K67897m4601j48753J78890j31785l8663J49493p463
16038A629594k14048q9034K35328L4658n4003N2965J52940q8227K1701k94087
$$ y = [887619, 1048244, 820860, 933766, 658944, 518696, 922860, 1020238, 920969, 895865, 826664, 970315, 911858, 934510, 893809, 867009, 1146435, 758427, 664074, 1011216, 1013299, 912210, 970927, 1049176, 876026, 842820, 865550, 1212633, 1100551, 1203073, 892407, 1055474, 958649, 1056896, 1094517, 1184872, 1304264, 1111603, 1089334, 1169787, 1334851, 1196813, 1010912, 1190359, 1317533, 1149845, 1087491, 1232572, 1316803, 1225185, 1271777, 1188326, 1511281, 1138845, 1390209, 1396448, 1382504, 1519061, 1626171, 1552656, 1599970, 1648824, 1588644, 1404579, 1672476, 1627875, 1479122, 1658012, 1526227, 1487564, 1637057, 1629594, 1415546, 1326512, 1561840, 1596498, 1542495, 1595460, 1748400, 1660173, 1681874, 1387787]
16028A387787M4231P079K97420j55957j50579K73980K39068m7287k92686L19372
16018A922428o2466K50946k47394J56704r740r1882J21905j69996L22613k27480
16008A965638k67043J2703j37732M49268j44718n9393j02282P1220K1204k8176
15998A780689j0486J99617j12366j50305K84520k9875l86639M71213j72386q4702
15988A789280M6625L4009K17830j42692j5488K30510J8210J2669q4846J75228
15978B281335j49875Q262j03018R0210o9980J9558J5562o1533J21146j84314J43197
15967B110550L1658j13689R4203l8599j26854J2981r0756K50424j93248o614K21959
15956B152015Q0713O8417r9212m7705k13493K43731j36437J43702j61275R0022
$$ y = [1387787, 1432018, 1439097, 1736517, 1580560, 1429981, 1703961, 1943029, 1895742, 1603056, 1922428, 1859962, 2110908, 1863514, 2020218, 2010478, 1918596, 2040501, 1870505, 2193118, 1965638, 1698595, 1711298, 1573566, 2022834, 1878116, 1818723, 1716441, 1787661, 1808865, 1780689, 1770203, 1969820, 1857454, 1707149, 1991669, 1961794, 1575155, 2046368, 1873982, 1789280, 1835905, 1869914, 2087744, 1945052, 1929564, 2160074, 2178284, 2190953, 2106107, 2281335, 2131460, 2139722, 2036704, 2126914, 2056934, 2076492, 2092054, 2030521, 2151667, 1967353, 2110550, 2142208, 2028519, 2122722, 2084123, 1957269, 1970250, 1879494, 2129918, 1936670, 1930056, 2152015, 2232728, 2301145, 2201933, 2154228, 1940735, 2184466, 2048029, 2191731, 2030456, 2120478]
15946B120478j2459j13515J87628K5445k9687j89897O0980J28788Q985L3149J38028
15935B357923J6260M2336m5875J26476o3457P4635N5460n7411J32467R6478J71178
15924B906470j9584O0933Q5661L98639J09505q391K74269L01298J85089M62184
15914D756073N56279P69431J217714J114424J770683L219565M167055N940258
15906B3511482P004433Q852982Q110641Q140353O061703L888195O62500k248155
15898F3984134n323558q068314r257608r056570p707446o480662m461547k886953
15890A0741476k172108j378107j434543n22942n65488p32471k55702k22600k47264
15881C210251l28295k01391J7495k14915k377q9320K7275J48661k14772K14933
$$ y = [2120478, 2108019, 1994504, 2182132, 2207577, 2177890, 1987993, 2048973, 2177761, 2186746, 2219895, 2357923, 2374183, 2416519, 2370644, 2497120, 2433663, 2508298, 2563758, 2506347, 2638814, 2735292, 2906470, 2886886, 2947819, 3033480, 3432119, 3541624, 3533233, 3807502, 4108800, 4293889, 4756073, 5312352, 6081783, 7299497, 8413921, 10184604, 13404169, 17571224, 23511482, 30515915, 39368897, 47479538, 55619891, 61681594, 65569789, 66232289, 63984134, 58660576, 50592262, 41334654, 32278084, 24570638, 18089976, 13628429, 10741476, 8569368, 7191261, 5756718, 5233776, 4668288, 3935817, 3680115, 3457515, 3210251, 2881956, 2680565, 2698060, 2483145, 2480768, 2391448, 2418723, 2567384, 2352612, 2567545]
15871B567545k41595K9746J15873k0374J59289j83971N524k84115n3037P2242
15861B167127j23467o5183K83732k63342J04781m6464k52477Q3949j2911j7453
15851A858292q9317J91165q2307K6934j03597K57765j56849R6342k71268L46731
15841B073891j73387L03830m81676M31928K4428j9413K08975O7300j9480R6947
15831B513343j85300o2134k46486J13310J14830o8829l5450M9831k67721J43962
15821B069356k6725k6968O6736J35220j02794k68648J39011m3724J55428J01338
15811B198230M8146l9897M9156j00280K2968J80493k10877K59461k38072K58031
15801B427359j99545J88420r9391L87817R0967j4127o0053L55887K4992k19164
$$ y = [2567545, 2325950, 2355696, 2471569, 2451195, 2610484, 2426513, 2432037, 2147922, 2094885, 2167127, 2043660, 1978477, 2262209, 1998867, 2103648, 2057184, 1804707, 1888656, 1875745, 1858292, 1768975, 1960140, 1877833, 1904767, 1801170, 2058935, 1902086, 1998428, 1727160, 2073891, 1900504, 2204334, 1722658, 2154586, 2179014, 2159601, 2368576, 2435876, 2416396, 2513343, 2328043, 2265909, 2019423, 2132733, 2247563, 2178734, 2143284, 2193115, 1925394, 2069356, 2042631, 2015663, 2082399, 2217619, 2114825, 1846177, 1985188, 1941464, 2096892, 2198230, 2246376, 2206479, 2255635, 2155355, 2178323, 2358816, 2147939, 2407400, 2169328, 2427359, 2227814, 2416234, 2316843, 2704660, 2795627, 2781500, 2721447, 3077334, 3102326, 2883162]
15791B883162L76752J91394j54232K16327r5769j02213J2699n6837K68662L40553
15781C880498L1076K30285K95446n4058K63770J59847j85142J6312J8777L156
15771D659967L5881l3825j43260J23080n2056l2093L8026J68145K78225k22461
15761D819629K95659j88665R6402L9476J15334k54815k57744p6350J67966j48735
15751D608157M4334K00379j86928K80393J28673L59778N3483K55596N78417k82502
15741F039780K68166K39788L56581K34670j45835J49487k3679j26286j26778l6585
15731F829309J62633M59651j13676M16851j10547J852q3291j98512j61443l00342
15721F902485n06965r5253j57933K42195k56045L6093J23007j07433N1934J3127
$$ y = [2883162, 3259914, 3451308, 3297076, 3513403, 3417634, 3315421, 3328120, 3271283, 3539945, 3880498, 3911574, 4141859, 4437305, 4383247, 4647017, 4806864, 4621722, 4638034, 4656811, 4659967, 4695848, 4662023, 4518763, 4641843, 4589787, 4557694, 4595720, 4763865, 5042090, 4819629, 5115288, 4926623, 5023025, 5062501, 5177835, 4923020, 4665276, 4588926, 4756892, 4608157, 4652491, 4852870, 4665942, 4946335, 5075008, 5434786, 5488269, 5743865, 6322282, 6039780, 6307946, 6547734, 6904315, 7138985, 6993150, 7142637, 7118958, 6992672, 6865894, 6829309, 6991942, 7451593, 7337917, 7754768, 7644221, 7646073, 7562782, 7364270, 7202827, 6902485, 6395520, 6300267, 6142334, 6384529, 6128484, 6164577, 6287584, 6180151, 6232085, 6245212]
15711F245212L8460k27119k0645k02431j93618K01621K84099L56830K96087N69265
15701G347761J9023p152R0998L24692L46N8187J44771n1008Q3563j24784k191
15690G884206j54745J06971r4766k64050j21837j25481j16037j48654j05642k21480
15680F638485J17775j12103j63300N8427j71269k148n45566M4014o8873r9521
15670E695921k09355K6763K61097J4367L086J7238L79997J6358K86610K24019
15660F716101L86372N36289J06499J49721N40011L95640K29635P36947N90416
15651A0387631O82308P06214N00900M64402N84239O59852L82652K14587Q16383
15642A5399168N99858N50731Q62912R98498J008833R64218J093683L74980M96707
$$ y = [6245212, 6283672, 6056553, 6035908, 5833477, 5639859, 5841480, 6125579, 6482409, 6778496, 7347761, 7366784, 7359632, 7450630, 7775322, 7775668, 7833855, 7978626, 7927618, 8011181, 7886397, 7884206, 7729461, 7836432, 7741666, 7477616, 7355779, 7230298, 7114261, 6965607, 6859965, 6638485, 6756260, 6644157, 6480857, 6539284, 6368015, 6365867, 5820301, 5864315, 5795442, 5695921, 5486566, 5513329, 5774426, 5788793, 5791879, 5809117, 6189114, 6205472, 6492082, 6716101, 7102473, 7638762, 7745261, 7894982, 8434993, 8830633, 9060268, 9797215, 10387631, 11069939, 11776153, 12277053, 12741455, 13325694, 13985546, 14368198, 14582785, 15399168, 15999026, 16549757, 17412669, 18411167, 19420000, 20384218, 21477901, 21852881, 22349588]
15633B2349588k2822N4510n85878l02298n17237m14443l1929J89148M21373M9484
15623B1189496K44449r068k04811o21709o95764j482308q02579j123809j128349
15614A5365548q39543o22851l49541m12767l60571m38305j01434l20090m06366
15605A1514080l80915n40134l48689k22233j03491j82142k18366L5931Q7417j97283
15595I444175L45722L04534N22842R68993J929881L713408Q282050J4129084J7997282
15586E7637971J5686621J0426932O891452L741376O54524l376342j2668901k2048198
15578E6945435k1813175j2376908o110071l881033k060141j181831p41943l05968
15570H474365k78867K8298Q9858O0650K0519J45265L17178K04064J77606J11027
$$ y = [22349588, 22326766, 22381276, 21795398, 21493100, 20975863, 20561420, 20529491, 20718639, 21140012, 21189496, 21433945, 21424877, 21220066, 20598357, 19902593, 18420285, 17617706, 16493897, 15365548, 14526005, 13903154, 13553613, 13140846, 12780275, 12341970, 12240536, 11920446, 11514080, 11133165, 10593031, 10244342, 10022109, 9918618, 9736476, 9518110, 9554041, 9641458, 9444175, 9789897, 10094431, 10617273, 11586266, 13516147, 17229555, 25511605, 39640689, 57637971, 73324592, 83751524, 90642976, 94384352, 95038876, 91662534, 78993633, 56945435, 35132260, 22755352, 16645281, 12764248, 10704107, 9522276, 8780333, 8474365, 8195498, 8223796, 8313654, 8374304, 8394823, 8540088, 8857266, 9061330, 9238936, 9349963]
15560I349963L47117M25482P82409J324429L076383N824826J2821082K0296142
15552E4247833K3724458J9052161J2379141P450079L889279m31735p322882k0397062
15544I2591272l0114569k5850480j3541314o943404m077132k382118j637184r29190
15536G115881n95918n40542r6308l25899P0806j46836P2325l49786k8619j78962
15526D996142M8160m23908l56594K96252j15434k88157j22556q7727l9340j35543
15516C771295K13291K2737l0017q4322K82681J14300J08319J74577j9811M1134
15506D594184R2331j25782K14329j16515l05696J07293J04530j45445j58010k6884
15496D234335j15214j45394M00746K2953j79022J98712J9282r2774J26722L52995
$$ y = [9349963, 9697080, 10122562, 10904971, 12229400, 15305783, 21130609, 33951691, 54247833, 77972291, 97024452, 109403593, 116853672, 120742951, 120311216, 112988334, 92591272, 62476703, 36626223, 23084909, 16141505, 12064373, 9682255, 8045071, 7115881, 6519963, 5979421, 5883113, 5557214, 5628020, 5481184, 5553509, 5203723, 5175104, 4996142, 5044302, 4620394, 4263800, 4560052, 4444618, 4156461, 4033905, 3946178, 3906838, 3771295, 3984586, 4007323, 3977306, 3892984, 4175665, 4289965, 4398284, 4572861, 4553050, 4594184, 4686515, 4560733, 4775062, 4658547, 4352851, 4460144, 4564674, 4419229, 4261219, 4234335, 4119121, 3973727, 4374473, 4397426, 4218404, 4417116, 4436398, 4343624, 4470346, 4823341]
15486D823341l6505J31170Q9131J14820K46373L00687K84909J62980r7317J06680
15476F126269K38468j93312l30574J25327J54674M29310P93453P67685J025709
15467I137009O56798Q70735L45720M43771m82354k80085m83719q64392n46649
15458H796834l99464k7539J64477P29051Q05904N24474O70779M70879L11599j0992
15448A2036002k66362n29595p93771p99515n86421m18211o1940k00106N59220
15439H939301j4845L82549J57497j87537R945j25111m33585o2092n99744l67921
15429G698457k03933k52702k28988k83242m039k37089J58101j96221k79652k98552
15419E872140j92033j97014o3833k06174j82750Q7595k00766l24968J33466K18904
$$ y = [4823341, 4786836, 4918006, 5007137, 5121957, 5368330, 5669017, 5953926, 6116906, 6019589, 6126269, 6364737, 6171425, 5840851, 5966178, 6120852, 6550162, 7343615, 8111300, 9137009, 9793807, 10664542, 11010262, 11454033, 10971679, 10691594, 10207875, 9343483, 8796834, 8397370, 8369831, 8534308, 9263359, 10069263, 10593737, 11264516, 11735395, 12046994, 12036002, 11769640, 11240045, 10446274, 9646759, 9060338, 8642127, 8580187, 8380081, 8939301, 8924456, 9307005, 9464502, 9276965, 9286910, 9161799, 8728214, 8666122, 8066378, 7698457, 7494524, 7241822, 7012834, 6729592, 6725553, 6488464, 6646565, 6450344, 6170692, 5872140, 5680107, 5483093, 5419260, 5213086, 5030336, 5117931, 4917165, 4592197, 4725663, 4944567]
15409D944567j53878j59482J70052j19339J80074j30634K40118k84921L12236
15400D998793K40497n320p5888K19393J4610K18437k31298o7375J9645j27691
15390E203803m9585L3007l05561j0869M8702J83352R968K25256L2538J13826j22402
15379E362035J65611l35776P8890J35886n0334J00654j92662r6278K50527j66085
15369E252468j40248L93055j32035J9323L28739N1084P287J30435J86527r5296
15359F001339J78716K20018J08632K79370o693Q979K17400O40197M18318L54321
15349H420597R62508J739362K752381N498863Q248508R798934Q742191N807046
15341E1970390M236611J859115K71170l011418p833360j1088490j0401531o001595
$$ y = [4944567, 4790689, 4631207, 4801259, 4681920, 4861994, 4731360, 4971478, 4686557, 4998793, 5239290, 5233970, 5158082, 5377475, 5392085, 5610522, 5379224, 5311849, 5331494, 5203803, 5154218, 5187225, 4881664, 4870795, 4919497, 5102849, 5112817, 5338073, 5370611, 5484437, 5362035, 5527646, 5191870, 5270760, 5406646, 5356312, 5456966, 5264304, 5168026, 5418553, 5252468, 5112220, 5505275, 5373240, 5392563, 5721302, 5772386, 5779673, 5910108, 6096635, 6001339, 6180055, 6400073, 6508705, 6788075, 6781382, 6790361, 7007761, 7647958, 8066276, 8420597, 9383105, 11122467, 13874848, 19373711, 27622219, 37421153, 46163344, 51970390, 56207001, 58066116, 58337286, 55325868, 47492508, 36404018, 26002487, 20000892]
15333B0000892k856474j424937p81456n70122m58436j57358k16932r48524o39549
15324A1947104l74922J8790o2998L61219N82741K14728O91537O41432J317215
15315A5336846J925782L740928P823584J2577181J6520810J6639817J4047847
15308H8612795J0193015N703433K036705l098825j0292121j7478227k0472634
15301E5204141j7071176j1585551o424143l565019j907577j342824p60470j23504
15293A2423877l40362P3408M9828Q6996k43984P2323m03964N02694j56455k45034
15283A1819327j71133L40441O63548J734178L609594N415264Q414497R390327
15275D1216043P267240M859963K937373J412928j095860l962715q494378j1299677
$$ y = [20000892, 17144418, 15719481, 14938025, 14367903, 13909467, 13752109, 13535177, 12586653, 11947104, 11572182, 11590972, 11527974, 11889193, 12471934, 12686662, 13378199, 14019631, 15336846, 17262628, 21003556, 28827140, 41404321, 57925131, 74564948, 88612795, 98805810, 104509243, 106545948, 103447123, 93155002, 75676775, 55204141, 38132965, 26547414, 20123271, 16558252, 14650675, 13307851, 12547381, 12423877, 12083515, 12156923, 12206751, 12293747, 12049763, 12122086, 11718122, 12220816, 12064361, 11819327, 11648194, 11988635, 12652183, 14386361, 17995955, 23411219, 31825716, 41216043, 48483283, 53343246, 56280619, 57693547, 56597687, 52634972, 44140594, 32840917]
15267C2840917r560587n585990k878258j681685j377093o88274r72806o29907
15259I466317o21817k37741m15387o4038N00410o0812M69265K37544N5967K77446
15249I607154L09696j04359n2168K4059j79940l0308k86923l29175l92567n64286
15239H001183o9815j97759J83805M30964k5817Q53631L62750Q63991K00493M63930
15229A1067356K71739j82316l7356k32867m91985n83206n34476k76789l59363
15220H640737k94404K9224J60296J41010J61519M28178N63528L23604O20248R8337
15210A0872277O5604k85866l93654o61910k66966o05699q34864q45746j75171
15201F868005q2498o05485q1567j89006o0288p8819k28224K25293J21687k45945
$$ y = [32840917, 23280330, 17694340, 14816082, 13134397, 11757304, 11069030, 10096224, 9466317, 8844500, 8606759, 8191372, 8127334, 8627744, 8566932, 9036197, 9273741, 9329708, 9607154, 9916850, 9812491, 9760323, 9784382, 9604442, 9574134, 9287211, 8958036, 8565469, 8001183, 7931368, 7733609, 7917414, 8348378, 8322561, 9176192, 9538942, 10402933, 10603426, 11067356, 11339095, 11156779, 11119423, 10886556, 10394571, 9811365, 9276889, 9000100, 8640737, 8346333, 8375557, 8535853, 8676863, 8838382, 9266560, 9830088, 10153692, 10773940, 10872277, 10937881, 10652015, 10258361, 9596451, 9329485, 8723786, 7888922, 7043176, 6868005, 6785507, 6180022, 6098455, 5909449, 5849161, 5770342, 5542118, 5767411, 5889098, 5643153]
15191E643153L87130K77739k1799K69217j0446K3626J72791k03n4440Q3258Q9643
15180F859669o1619N3408J22286M94948K50649j50952L03827R9942k42818q157
15170G721183j79430n2005K16351j04232j71516J19610J68501k40780j92187J59464
15160G444959J36357K17297J12745O4082K02218J43914K61962k99417L36628m69187
15150H151558K12796L397m09483o6605p4164K54019k7740j42546l6538j05141
15140G759553K64232j13689J40267N3262K07040p2142l25326J35937j68152j50293
15130G730689J6182J16119J17905k5535J3043P1605p8527J68621O7551n27366
15120G670287Q8105L1872j44809j4070m5326q1521j94767J64217k4497Q8146j60469
$$ y = [5643153, 6030283, 6308022, 6286223, 6555440, 6544994, 6568620, 6741411, 6741208, 6686768, 6770026, 6859669, 6798050, 6851458, 6973744, 7468692, 7719341, 7568389, 7872216, 7972158, 7729340, 7721183, 7541753, 7489748, 7706099, 7601867, 7430351, 7549961, 7718462, 7477682, 7285495, 7444959, 7581316, 7798613, 7911358, 7975440, 8177658, 8321572, 8583534, 8284117, 8620745, 8151558, 8364354, 8367751, 7958268, 7891663, 7817499, 8071518, 8043778, 7901232, 7864694, 7759553, 8023785, 7910096, 8050363, 8103625, 8310665, 8238523, 7913197, 8049134, 7880982, 7730689, 7746871, 7862990, 7980895, 7955360, 7968403, 8040008, 7961481, 8130102, 8197653, 7670287, 7758392, 7790264, 7645455, 7631385, 7586059, 7504538, 7309771, 7473988, 7449491, 7537637, 7377168]
15109G377168m1313L4879J25873K24757K51737m817J80704J99833K15256L37467
15099H901544J23201K67182M40129K22993p217N22233L09920L94201J319123J426657
15089A3919966K291492L655268L374024L292858K494739J428160Q37068L02804
15081C1596379j522740k570971l463987k761155j588201J98805J487029K829479
15073B4204638L834847L177199K882493J829169J151652N8151o23344k367359
15065C4147446k786926k186700J686011M690919N778867M577727L881524K960564
15057E2749432K389034K294587P50422k674828m815333k889975Q1323J157886
15049D9042548K551417L213574L393038K310223J419280J825279J423617J247222
$$ y = [7377168, 7335855, 7370734, 7496607, 7721364, 7973101, 7968284, 8148988, 8348821, 8564077, 8901544, 9024745, 9291927, 9732056, 9955049, 9947832, 10470065, 10779985, 11174186, 12493309, 13919966, 16211458, 19866726, 23240750, 26533608, 29028347, 30456507, 31293575, 31596379, 30073639, 27502668, 24038681, 21277526, 19689325, 19888130, 21375159, 24204638, 28039485, 31216684, 34099177, 35928346, 37079998, 37138149, 36514805, 34147446, 31360520, 29173820, 30859831, 35550750, 41329617, 45907344, 49788868, 52749432, 55138466, 57433053, 58183475, 55508647, 50693314, 47803339, 47884662, 49042548, 51593965, 54807539, 58200577, 60510800, 61930080, 63755359, 65178976, 66426198]
15041F6426198P06052j569621l337849l623314k511376j473629j353066j949080
15033E1314315k441968k611499j064270J749829M387180P064937Q049614P243614
15025G3691752O701842O794020O327936N566793L128937J64341p99647O13394
15017A02189368K407953K836894K675774J840754j24082k474443l765131m877262
15009A00709825n339301o501992p583177q912444p507954n392822l631796l088738
15001E2751601k132973j363923l10555Q53441K037592K030589J784221J007511
14993E6657504R16222j4696r84035k260170l148082k915585j789109K45529J406598
14984D8114176P17616N62416J585417J929329P48222m79916l122856m624657m583967
$$ y = [66426198, 67132250, 65562629, 62224780, 58601466, 56090090, 54616461, 53263395, 51314315, 48872347, 46260848, 45196578, 46946407, 51333587, 58398524, 66448138, 73691752, 80393594, 87187614, 93515550, 99082343, 102211280, 102375621, 101575974, 102189368, 104597321, 107434215, 110109989, 111950743, 111826661, 109352218, 105587087, 100709825, 95370524, 88868532, 81285355, 72372911, 64864957, 59472135, 55840339, 52751601, 50618628, 49254705, 48944150, 49797591, 51835183, 53865772, 55649993, 56657504, 57573726, 57559030, 56574995, 54314825, 51166743, 48251158, 46462049, 46707578, 48114176, 48831792, 49394208, 50979625, 52908954, 53657176, 53177260, 50054404, 45429747, 40845780]
14975D0845780l509429k942691l241314k971404j877583j009363k97712J35512
14967B5131796K58352P06909Q58112P45946L19278P02804J006259J466233J935938
14958C3131627K488809L709145N829990Q837140J2736607J7987840K3636071K9289599
14950A37646828L3482210L7455562M0308599M0832070L9151853L7033209L0132343
14943C96042674J7912833M330693r086392k0762893k8080299k9330258l1816722
14936B99209636l7223462l6141057k6838305j4729764q512720p396848j0048719
14929A58318761j3502396j4617703j3161688j1042080r726256p492538m210880
14922H4565220j734986l30151n95408j346063k114404k858158m412019p480476
$$ y = [40845780, 37336351, 34393660, 31152346, 28180942, 26303359, 25293996, 24996284, 25131796, 25390148, 26097057, 26955169, 27701115, 28020393, 28723197, 29729456, 31195689, 33131627, 35620436, 39329581, 45159571, 53996711, 66733318, 84721158, 108357229, 137646828, 171129038, 208584600, 248893199, 289725269, 328877122, 365910331, 396042674, 413955507, 418286200, 409199808, 388436915, 360356616, 331026358, 299209636, 261986174, 225845117, 199006812, 184277048, 175764328, 168367480, 158318761, 144816365, 130198662, 117036974, 105994894, 96268638, 88776100, 84565220, 82830234, 82500083, 81904675, 80558612, 78444208, 75586050, 71174031, 63693555]
14914F3693555j1220411j2468318r844446o373154m106486k492640j785332j011138
14906A4391630o61768J5258m5038P74539R01704R28779J568439J523345J438264
14897B0835152J876514K525674M353577N932269O715186N608665M170819J744641
14889E3762497R91622n56978k956371o756296q236565q296397n985355l258287
14881A8707870j592860j024065n15394k78274R058L38146R34052J431670J250129
14872A9260332J251503L35071L95343L20548K3632j26306n17007j006773m95335
14863A9441008j02351J351270J510306K911386N289977P801784J0613448J2594255
14855F1411083J2903683J2980588J1505881Q289125L203714l004344q323972j1606259
$$ y = [63693555, 52473144, 40004826, 30160380, 23787226, 19680740, 17188100, 15402768, 14391630, 13729862, 13745120, 13700082, 14474621, 15376325, 16305104, 17873543, 19396888, 20835152, 22711666, 25237340, 29590917, 35523186, 42238372, 47847037, 52017856, 53762497, 54754119, 54197141, 51240770, 44484474, 36247909, 27951512, 21966157, 18707870, 17115010, 16090945, 15575551, 15297277, 15306335, 15644481, 16578533, 18010203, 19260332, 20511835, 20846906, 21242249, 21562797, 21586429, 21460123, 20943116, 19936343, 19441008, 19338657, 20689927, 22200233, 25111619, 30401596, 38203380, 48816828, 61411083, 74314766, 87295354, 98801235, 107090360, 110294074, 107289730, 98965758, 87359499]
14847H7359499j3014199j4041953j3615144j1507096p658576m445597k816062
14840B0260872j470707j522666n42975o97076l05719o15852q0268k94140N8868
14831A4790337k18673j88284p621N07278M24435O73130Q30045J099444P43725
14822A8653816J699599K012792M255559O886904R119175J0656205R294390P058591
14814F9637031L948730J925855j547280m831316j0108528j3186343j2653307r147652
14806B4037190n183374l219761j684675j497363o15512n02741p61302R9473j15375
14797A0556560j88346k25597k76861l53680k83087j02865j33750l80780n9834
14788H551760l00330n0165k5726j249j8390L80751M3595J92427N94314M56394
$$ y = [87359499, 74345300, 60303347, 46688203, 35181107, 27522531, 23076934, 20260872, 18790165, 17267499, 16724524, 16027448, 15721729, 15105877, 15025609, 14731469, 14790337, 14571664, 14383380, 14375759, 14883037, 15307472, 15980602, 16810647, 17910091, 18653816, 20353415, 22366207, 26621766, 33508670, 42627845, 53284050, 62578440, 69637031, 73585761, 75511616, 73964336, 69133020, 59024492, 45838149, 33184842, 24037190, 18853816, 15634055, 13949380, 12452017, 11836505, 11333764, 10572462, 10671935, 10556560, 10368214, 10142617, 9865756, 9512076, 9228989, 9126124, 8992374, 8611594, 8551760, 8251430, 8201265, 8175539, 8174290, 8155900, 8536651, 8580246, 8772673, 9366987, 9823381]
14778I823381J214812Q49693R05281O07136Q7478R7784J31683l87259r05408j398942
14768A1025639j291390m61252n76946l17032K21571J34297j74497M79222m20254
14759H619358O37852O2762N36618K77565l6859K21368J87121J9046L27426J75294
14749A1027551Q8582j61064L18349l7616L85610K04057J38181L97962L49658O62094
14739A3373364P67667P87898J713405J982296K165079L470728M625909O684566
14731C5570912J0492325J6133286K5310720L5093749M2125843M4781980M2258341
14724B51767156L4665365K2681711R183151p557403k5791138m0378747m7813645
14717A96756450m8011326m2430720l1948271k0302055j3500733q587502n568680
$$ y = [9823381, 11038193, 11887886, 12793167, 13400303, 13487781, 13585565, 13717248, 13329989, 12424581, 11025639, 9734249, 9272997, 8696051, 8379019, 8600590, 8734887, 8560390, 9039612, 8619358, 9257210, 9319972, 9856590, 10134155, 10097296, 10318664, 10505785, 10524831, 10852257, 11027551, 11116133, 10955069, 11273418, 11235802, 11621412, 11825469, 11963650, 12361612, 12711270, 13373364, 14141031, 14928929, 16642334, 18624630, 20789709, 24260437, 28886346, 35570912, 46063237, 62196523, 87507243, 122600992, 164726835, 209508815, 251767156, 286432521, 309114232, 318297383, 310739980, 284948842, 244570095, 196756450, 148745124, 106314404, 74366133, 54064078, 40563345, 31975843, 26407163]
14710B6407163m058689k819118k112690j945442r86755q42112q98994j141522
14702A1601841j139944o93899n70848m84502m48888r009o74158k30329k5732l18240
14692G006292K92200r4978j64123L94993N7992l647j82407l0043l0742J57977
14682G403514N7890J53069J40144J79839L00629N40133Q82647R06210J023719
14673A1587794N27149O99824O2698j89161j92726j146520j308384j312006r68241
14664G760427n75490n4648L8180J94040J7482K9805R3074k23698n72127o65692
14654F041353r6903j23029k22416J40951J982m3903J32093K92713K29363L1558
14644F383762J26505K99792L90588l974J75948j60958K78927O3939O15216P19750
$$ y = [26407163, 22348474, 19529356, 17416666, 15471224, 14484469, 13642357, 12743363, 11601841, 10461897, 9767998, 9197150, 8712648, 8263760, 8254751, 7580593, 7350264, 7324532, 7006292, 7298492, 7203514, 7039391, 7434384, 7492376, 7488729, 7306322, 7276279, 7245537, 7403514, 7461404, 7614473, 7754617, 7934456, 8235085, 8775218, 9657865, 10564075, 11587794, 12114943, 12814767, 12877465, 12688304, 12495578, 11349058, 10040674, 8728668, 7760427, 7184937, 7130289, 7168469, 7362509, 7379991, 7409796, 7502870, 7279172, 6707045, 6041353, 5944450, 5821421, 5599005, 5739956, 5741938, 5698035, 5830128, 6122841, 6352204, 6383762, 6510267, 6810059, 7200647, 7196673, 7372621, 7211663, 7490590, 7554529, 8169745, 8889495]
14634H889495Q26789N46355O28616J82133l54098n68351q00085j278013j014323
14625G058518j023163r74223m21564j65372k42346k41784N52399j67502m8416
14616D326547o2621L17582j97084M5501r9311j71246K06234l37019K08219n23881
14606C712921j55711k34875j69740K57928J69090j35839M25476N88624P94791
14597E252665P31647R48119P15061P10272l4970Q8706l30943r41182q64896r66605
14587E307874q44097l88654k16802L4156j20661P5285k89269K31918q7450K38304
14577C940604l7897K7803J85133k45872K33809J81203J30384K68159O5700L82794
14567E131820K39689N86594N83187P64118O36460J305236J011127K604415N321349
$$ y = [8889495, 9716284, 10262639, 10891255, 11073388, 10719290, 10150939, 9350854, 8072841, 7058518, 6035355, 5061132, 4639568, 4474196, 4231850, 3990066, 4542465, 4374963, 4326547, 4263926, 4581508, 4384424, 4429925, 4330614, 4159368, 4365602, 4028583, 4236802, 3712921, 3557210, 3322335, 3152595, 3410523, 3579613, 3443774, 3869250, 4457874, 5252665, 5984312, 6932431, 7647492, 8357764, 8322794, 8411500, 8080557, 7139375, 6274479, 5307874, 4463777, 4075123, 3858321, 3892477, 3771816, 3847101, 3557832, 3789750, 3702300, 3940604, 3902707, 3930510, 4115643, 3869771, 4103580, 4284783, 4415167, 4683326, 4749026, 5131820, 5371509, 5958103, 6541290, 7305408, 7941868, 9247104, 10258231, 12862646, 18183995]
14558A8183995P708459J0384189R729429P087985N097008K922030P10751j957546
14550E9866300o795720j1678854j2108005p806750l592012k34963K698069O518213
14542B6866278R370457J1034952Q915442O150902L522293J444572j095716n581734
14534F0627446j0763705j3910013j0733451o502527l274572j717852k15647l3507
14526A3476172L31671J15414j76020N0464j49241j64937J512897L590156O319381
14517B4905957P765068O910502M513110L326345J896879J04347k308933n951219
14509D1162056q280681p509679l773002j016474J233675K838168N429930P021202
14501C7105195O545151M459156K776685J701781J38058k003767n120932q476015
$$ y = [18183995, 25892454, 36276643, 46006072, 53094057, 58191065, 61113095, 61823846, 59866300, 53070580, 41391726, 29283721, 21476971, 17884959, 17649996, 20348065, 26866278, 36236735, 47271687, 56187129, 62338031, 65860324, 67304896, 66209180, 60627446, 49863741, 35953728, 25220277, 18717750, 15443178, 13725326, 13509679, 13476172, 13807843, 13923257, 13747237, 13797701, 13648460, 13483523, 14996420, 18586576, 24905957, 32671025, 39581527, 44094637, 47420982, 49317861, 49422208, 47113275, 41162056, 32881375, 25371696, 21598694, 20582220, 21815895, 24654063, 30083993, 37105195, 43650346, 48109502, 50886187, 52587968, 52726026, 50722259, 45601327, 37125312]
14493C7125312r685082o095767l547336k490405j766054j624795j116588r50877
14485I848408j139102j570951r94948j152412l84787o39973K1674l24128o84R3416
14475C756513J92316k00712K83288m3331K42857M19047M20379P36005L39466L05943
14465F451771M67842k50437R4571k47738n74080m39078M65691M55954N95582N58269
14455G578347J81461M00691R7184p0411m36426p62796q18277o89057N8067J36317
14445E675100K86919Q2962L39367L33704K56247L37432J9672L99196O3458M41098
14435H235155j62341L44395N81315O05658M51909J304212K136954L971357N616018
14426B3084632P336122Q002462O887398N159539L777189J941586n69709l749643
$$ y = [37125312, 27440230, 21344463, 17797127, 15306722, 13540668, 11915873, 10799285, 9848408, 8709306, 7138355, 6143407, 4990995, 4606208, 3966235, 3987909, 3663781, 3663097, 3756513, 3948829, 3748117, 4031405, 3988074, 4230931, 4649978, 5070357, 5806362, 6145828, 6451771, 6919613, 6669176, 6763747, 6516009, 5941929, 5502851, 5968542, 6424496, 7020078, 7578347, 7759808, 8160499, 8257683, 8187272, 7750846, 6988050, 6169773, 5480716, 5538783, 5675100, 5962019, 6044981, 6384348, 6718052, 6974299, 7311731, 7331403, 7730599, 7794057, 8235155, 8072814, 8417209, 8998524, 9604182, 10056091, 11360303, 13497257, 17468614, 23084632, 30420754, 38423216, 45310614, 50470153, 54247342, 56188928, 55619219, 51869576]
14418E1869576p371545q292227p910356n956028m318705l295524k263535j572146
14410A0889510j114372p96930o58660j63447j30301j64189m1647J82783l3359
14401G969388q1467k3729K37602M14054P51060P24791J087780J978893L059509
14392A6117881N560778P776091J0816334J2867515J3090651J1050973Q445444
14385H5725667M634712J201244l723242q597625j2818849j4665740j2757263r867190
14377B9131714p017962n006844l372660j965617j107340j028488n78510l59373
14369H694920k46597m4786j65806j29820j11887j53536k80447L54129N1416N00910
14359H468496N64105R18938J341318J869465K864802L770560N001776N475243
$$ y = [51869576, 44498031, 36205804, 28295448, 22339420, 18020715, 14725191, 12461656, 10889510, 9775138, 8978208, 8319548, 8156101, 8025800, 7861611, 7819964, 8002747, 7969388, 7887921, 7864192, 8101794, 8515848, 9266908, 9991699, 11079479, 13058372, 16117881, 21678659, 29454750, 40271084, 53138599, 66229250, 77280223, 85725667, 90360379, 91561623, 87838381, 79240756, 66421907, 51756167, 38998904, 29131714, 22113752, 17106908, 13734248, 11768631, 10661291, 9632803, 9054293, 8694920, 8448323, 8403537, 8237731, 8107911, 7996024, 7842488, 7562041, 7916170, 7967586, 8468496, 9032601, 9951539, 11292857, 13162322, 16027124, 19797684, 24799460, 30274703]
14351C0274703N689331M848607L843900J926209Q50243n10801k533227l692422
14343D0696543l565232j964104N28346L116069O758877R911086J1989181J3418057
14335H0888823J3145845J0986936P111804K786969j335818p479147j1776683j5504964
14327G8823765j6583789j5104566j1711118p590841n795969m205212k904597k120526
14319A2807147j905989j551562j001755q70817p18440o95541m10996n8821o96122
14310D897104o831m59609j723l93033K33448m80808j06159j32040l11186j7756
14300C221407k06238K24670l15593J13692n0533n8512j58345m6177j29433K02153
14290B797091k24603j84157J20865l82192K11051P1234K7398j32145M366K03722
$$ y = [30274703, 35964034, 40812641, 44656541, 46582750, 47432993, 46922192, 44388965, 40696543, 37131311, 35167207, 35695553, 38811622, 45570499, 55481585, 67470766, 80888823, 94034668, 105021604, 112133408, 114920377, 113584559, 106105412, 94328729, 78823765, 62239976, 47135410, 35424292, 27833451, 22037482, 17832270, 14927673, 12807147, 10901158, 9349596, 8347841, 7477024, 6758584, 6063043, 5652047, 5593226, 4897104, 4890273, 4430664, 4428941, 4035908, 4269356, 3788548, 3682389, 3550349, 3239163, 3221407, 3015169, 3239839, 2924246, 3037938, 2987405, 2928893, 2770548, 2724371, 2594938, 2797091, 2572488, 2388331, 2509196, 2127004, 2338055, 2409289, 2436687, 2304542, 2308908, 2512630]
14280B512630L499J082K11971k94487J18955K08986q8508N5852n369l58835K76740
14269B642516K28961m05835k7204K6019m3998p7179j02194J06062m3425J21717
14259B425440j77753k1521j31520j38754L16286r6983n8215j49503j8396P8485
14249B027566J33613j84258J0848j13569M5119R0888q0942J9800j38356R1975
14239A902684r4321k39607K06056J70179L6240k863O0788k7436j68800J0790l29976
14228A523734L58824j99581J43114j00316l7393n0854L77428k22863P8870K1874
14218A892837L2700n3687K71661R3451l29302K91768j17861J7022M7643R3134
14208B239366K62198M81529P18932N74746K95291P5261J69108k27223k69001n90925
$$ y = [2512630, 2516129, 2517211, 2729182, 2434695, 2553650, 2762636, 2674128, 2729980, 2724611, 2365776, 2642516, 2871477, 2465642, 2438438, 2464457, 2420459, 2343280, 2241086, 2347148, 2303723, 2425440, 2247687, 2226166, 2094646, 1955892, 2272178, 2175195, 2116980, 1967477, 1949081, 2027566, 2161179, 1976921, 1987769, 1874200, 1919319, 2010207, 1929265, 1949065, 1810709, 1902684, 1808363, 1568756, 1774812, 1944991, 1981231, 1978368, 2039156, 2011720, 1842920, 1853710, 1523734, 1882558, 1682977, 1826091, 1725775, 1688382, 1637528, 2014956, 1792093, 1870963, 1892837, 1925537, 1871850, 2143511, 2236962, 1907660, 2199428, 2081567, 2098589, 2146232, 2239366, 2501564, 2983093, 3702025, 4276771, 4572062, 4647323, 4816431, 4589208, 4320207, 3729282]
14198C729282j022698r00230r2891j14571K25526O9546j70155J08163L2660J27553
14188A992185k01548j979O3877m8210O8899n285J10558k65070n6668J05677N6982
14177A819418J3811K99436J43773J17622Q8287j05971J68826m23316O3126j18221
14167B066791j35098M0811j93285k09746L66206j32712L2462n5589o1954J6673
14157A734559K80177o3225K45703k98693K16618k31643K29419J29552K3966j23402
14147B143031N589k06479J45894R7592K29682K74858O8856P36980Q72101R50764
14137E318868J385808P20937P20989O26304K02982j05639m02113j108330j444308
14128E915498j024213r16763m13293o58120j71019j57228J94574j66521M16262
$$ y = [3729282, 2706584, 1806354, 1713463, 1598892, 1824418, 1893964, 1723809, 1831972, 1864632, 1992185, 1790637, 1788658, 1852535, 1804325, 1873224, 1867939, 1978497, 1713427, 1656759, 1762436, 1819418, 1833229, 2132665, 2276438, 2394060, 2482347, 2376376, 2545202, 2121886, 2185012, 2066791, 1931693, 1972504, 1779219, 1569473, 1935679, 1802967, 1835429, 1779840, 1717886, 1734559, 2014736, 1951511, 2197214, 1898521, 2115139, 1883496, 2112915, 2242467, 2266433, 2143031, 2148620, 1942141, 2088035, 2185627, 2415309, 2690167, 2759023, 3496003, 4368104, 5318868, 6704676, 7425613, 8146602, 8772906, 8975888, 8870249, 8468136, 7359806, 5915498, 4891285, 3974522, 3561229, 2903109, 2732090, 2574862, 2769436, 2602915, 3019177]
14119C019177L10502L25266J82118J07179K98160M4454r7576k40199n36904n39804
14109B872373j78200J927n05871L18131j05629L1713L7436j35262J82547K35072
14099B754237K78196O0366N52915L58613K18785N00454j871L65185n2796P6451
14089E110535l40290l53875k18206J83641k69171M74508N26132P25511M00666
14080F239451N82786O73455M32094k8397J82477o8865k56353q5914l819O43063
14070H309978P55644Q48848J497711J778187K799241L355175M465135O342832
14062C0152751Q717796J1425468J3247224J3913702J2502718R674456O154791
14055A05788906K079436j983259p888003j2692225j5778494j5507181j2560565
$$ y = [3019177, 3329679, 3654945, 3837063, 3944242, 4242402, 4286856, 4189280, 3949081, 3412177, 2872373, 2694173, 2696100, 2190229, 2508360, 2402731, 2434444, 2471880, 2336618, 2519165, 2754237, 3032433, 3092799, 3645714, 4004327, 4223112, 4723566, 4721695, 5086880, 5034084, 5110535, 4770245, 4416370, 4198164, 4381805, 4112634, 4587142, 5113274, 5838785, 6239451, 6822237, 7495692, 7927786, 7899389, 8081866, 8013001, 7756648, 7670734, 7666915, 8309978, 9065622, 9914470, 11412181, 13190368, 15989609, 19344784, 23809919, 30152751, 38870547, 50296015, 63543239, 77456941, 89959659, 99634115, 105788906, 107868342, 105885083, 97997080, 85304855, 69526361, 54019180, 41458615]
14048D1458615r347482o597127m846358l228584j995994j998889j368497r24403
14040A1151281r28449j023337o42434j131819n68834q66173l21104o13367m30323
14031D625441m83864l75659m0744q4858m07548K389j59193K17216k38015j5137
14021C040028K23646o19301K20407k44062J78493l64509K50375k64054l9071J92348
14011B574300n5627q8364o7220K23308l20212O3384o2973j90520J05189j43364
14001B037901j7915j48604q5040L07976k84688J63351k1747J46313L8099m8091
13991B087555K73238p5774K54717L77622P08545L12457J061352P36707J017323
13982F753742R71007O56554L92451L37445r5710j12621j230318o07919j443658
$$ y = [41458615, 32111133, 25514006, 20667648, 17439064, 15443070, 13444181, 12075684, 11151281, 10222832, 9199495, 8557061, 7425242, 6856408, 5990235, 5669131, 5055764, 4625441, 4141577, 3765918, 3725174, 3640316, 3232768, 3235157, 3075964, 3293180, 3055165, 3040028, 3263674, 2644373, 2864780, 2620718, 2799211, 2434702, 2685077, 2421023, 2381952, 2574300, 2518673, 2430309, 2363089, 2586397, 2266185, 2329569, 2266596, 2076076, 2181265, 2037901, 2019986, 1871382, 1786342, 2094318, 1809630, 1972981, 1951234, 2097547, 2135646, 2087555, 2360793, 2285019, 2539736, 2917358, 3625903, 3938360, 4999712, 5736419, 6753742, 7724749, 8381303, 8773754, 9111199, 9015489, 8902868, 7672550, 7064631, 5620973]
13973E620973q80532k42028o78234l53489j61542J32670l82250j59654L04610
13964C200524k63752j21189M5753k79282k05952j18547l00618K38383k28660l7404
13954A929256J36571j55619J1604j00419L37681Q5319J2342L13047K55430r9933
13944B725279L13976L73893O3274O16856R73751J850101K415202K724238L108148
13935A5164718K844575K302575J725291N89259j389913k201055k436736l400832
13927A3197882l080313k909953j916094j425476o78955o33451l36229m10706K51601
13918B058306j21462j62769j5636j09555J21329k30214K03250l38746J39717q7927
13908A456293j28600J7842L00024r8587k62691K3594J0032P4506j23076J96640
$$ y = [5620973, 4740441, 4498413, 3820179, 3466690, 3305148, 3437818, 3055568, 2895914, 3200524, 2936772, 2815583, 2861336, 2582054, 2376102, 2257555, 1956937, 2195320, 1966660, 1929256, 2065827, 1910208, 1921812, 1821393, 2159074, 2244393, 2256735, 2569782, 2825212, 2725279, 3039255, 3413148, 3476422, 4093278, 5067029, 6917130, 9332332, 12056570, 15164718, 18009293, 20311868, 22037159, 22626418, 21236505, 19035450, 16598714, 13197882, 10117569, 7207616, 5291522, 3866046, 3187091, 2553640, 2217411, 1806705, 2058306, 1936844, 1774075, 1758439, 1648884, 1770213, 1539999, 1743249, 1404503, 1544220, 1456293, 1327693, 1345535, 1645559, 1546972, 1284281, 1307875, 1317907, 1392413, 1269337, 1465977]
13898A465977L0630o8580m3773R9090M9624J79885l36294P0028N3356Q8490k5392
13887A563041j10315k6237k2590O0358j84915J66428K6058j10443k5677J0803
13877A346511J24282M0640m14119m4611L12960J51346O850j11066P3993r246N9116
13866A536656l5251O8359j85938J27045j37469K22477N9953j7756J68131l22067
13856A484140N751j00666j136K18244K7533j31820J15068k46963L7147M6829k2457
13845A431670L2411q993J11153k86478K88899n6025j30973n0803n4424Q3702q8016
13834A272123J29791r3744j28569J71545q4310R4346j64453R4248J93488L869
13824A488334k01988J38209j68734J40102k7026k98942J35975j28072J07595Q5195
$$ y = [1465977, 1496607, 1428027, 1384254, 1483344, 1532968, 1712853, 1376559, 1446587, 1499943, 1588433, 1563041, 1452726, 1426489, 1403899, 1464257, 1279342, 1445770, 1471828, 1361385, 1335708, 1346511, 1470793, 1511433, 1097314, 1052703, 1365663, 1517009, 1523859, 1412793, 1486786, 1477540, 1536656, 1501405, 1569764, 1383826, 1510871, 1373402, 1595879, 1655832, 1638076, 1806207, 1484140, 1489891, 1389225, 1388089, 1606333, 1633866, 1502046, 1617114, 1370151, 1407298, 1454127, 1431670, 1464081, 1455088, 1566241, 1279763, 1568662, 1512637, 1381664, 1330861, 1276437, 1360139, 1272123, 1401914, 1308170, 1179601, 1351146, 1266836, 1361182, 1196729, 1290977, 1484465, 1488334, 1286346, 1424555, 1255821, 1395923, 1368897, 1069955, 1205930, 1077858, 1185453, 1270648]
13814A270648n7128R8379j66651P9584J974j55821N5179K30638P0574j66990J71374
13803A431760k59962K55712P2928J5090p8565O5337j40147j19679R1394J47373
13793A481241k35779J08038k56633J90496J7647J07897m39925K71575p1533L7836
13783A210860j62859J67468n289J0266j31416L07983j11605K01227j50149j19778
13773A216708M76729l6397L2406r2830K89135q3378J37610l69587P9038K0161
13763A669595P4366k40068k17744M620O3420j3522k7931J6069j12837j17827K89926
13752A388067j58821J6723J06833r8382N6522J42282j42223M2027O2684K50422
13742A666134r0743p9114j16686L82639l29186J65038K65251m36149J60507k12622
$$ y = [1270648, 1213520, 1311899, 1145248, 1224832, 1226806, 1070985, 1126164, 1356802, 1427376, 1260386, 1431760, 1171798, 1427510, 1500438, 1515528, 1436963, 1502300, 1362153, 1242474, 1333868, 1481241, 1245462, 1353500, 1096867, 1287363, 1305010, 1412907, 972982, 1244557, 1173024, 1210860, 1048001, 1215469, 1210180, 1220446, 1089030, 1397013, 1285408, 1486635, 1336486, 1216708, 1693437, 1657040, 1689446, 1596616, 1885751, 1802373, 1939983, 1570396, 1649434, 1669595, 1743961, 1503893, 1286149, 1290769, 1354189, 1340667, 1312736, 1328805, 1215968, 1098141, 1388067, 1229246, 1245969, 1352802, 1254420, 1310942, 1453224, 1311001, 1353028, 1415712, 1666134, 1575391, 1496277, 1379591, 1762230, 1433044, 1598082, 1863333, 1427184, 1587691, 1375069]
13732A375069J24575Q0129O2645J1746r7533N4585Q6992r8969J71604k67901K45441
13721A748383K12412j18229Q0725n5479j27922N8018J45968j41677N5695o859
13711A851035L55480l11699K51724j13817j26412Q0972j99095K71865j99551J47258
13701B007760j39276Q5946J91752k04284k00795K89207j03910L25211K3204K83959
13691B558774J08809R8477l6362j20391L2437j29980m26328j26746j40410M2829
13681A861109J19388j57280J4528l9839J05394p2487J82490k42178n0319L7765
13671A758571K3579k6216L42579l65501K00080L09587J56351J56112N1703M34758
13661C041603j69965J21676r2547n0052j3249m8881n12896K3208j98242M8080
$$ y = [1375069, 1499644, 1579773, 1642418, 1654164, 1556631, 1611216, 1698208, 1599239, 1770843, 1502942, 1748383, 1960795, 1842566, 1923291, 1867812, 1739890, 1797908, 1943876, 1802199, 1857894, 1851035, 2206515, 1894816, 2146540, 2032723, 1906311, 1987283, 1788188, 2060053, 1860502, 2007760, 1868484, 1954430, 2146182, 1941898, 1741103, 2030310, 1926400, 2251611, 2274815, 2558774, 2667583, 2766060, 2729698, 2609307, 2641744, 2511764, 2085436, 1958690, 1818280, 1861109, 1980497, 1823217, 1837745, 1797906, 1903300, 1830813, 2013303, 1771125, 1720806, 1758571, 1782150, 1755934, 2098513, 1733012, 1933092, 2242679, 2399030, 2555142, 2606845, 3041603, 2871638, 2993314, 2900767, 2850715, 2837466, 2788585, 2275689, 2298897, 2100655, 2148735]
13651B148735r8650L6027k41674j18891L63122k44940J20423k85123J08030R7783
13641A884842p3288j7536l392j58765K15717m6109M00537P8633J71343K3359k2492
13630B452849K6490M56928k89294m7835k11331l00830l09576J07189m3853m15977
13620A424760L07155q6773R2032K9910j04289Q5211q8948R071j37818J00251J64753
13609A795315K52132j87895J63261O1368n7660o2638p3748p353J35947m8467l50152
13598A620110j4167J55160K13115k61128j48609L53196o1515L67433o2855j91570
13588A969170j2272j46855L7936J18919k82846K46891l27663j49453J89612o91
13578A642748j53799J14430J4113l18232K31736j35079R2592n2025J36817j68534
$$ y = [2148735, 2050085, 2086112, 1844438, 1725547, 2088669, 1843729, 1964152, 1679029, 1787059, 1884842, 1811554, 1794018, 1790626, 1631861, 1847578, 1801469, 2202006, 2280639, 2451982, 2475341, 2452849, 2479339, 2936267, 2646973, 2599138, 2387807, 2086977, 1777401, 1884590, 1840737, 1424760, 1731915, 1645142, 1737174, 1767084, 1662795, 1748006, 1659058, 1668129, 1530311, 1630562, 1795315, 2047447, 1859552, 2022813, 2084181, 2026521, 1963883, 1890135, 1882782, 2018729, 1970262, 1620110, 1605943, 1761103, 1974218, 1713090, 1564481, 1917677, 1856162, 2223595, 2160740, 1969170, 1956898, 1810043, 1847979, 1966898, 1684052, 1930943, 1603280, 1453827, 1643439, 1642748, 1488949, 1603379, 1617492, 1299260, 1530996, 1395917, 1488509, 1436484, 1573301, 1404767]
13568A404767K29376k70819J90628j25835N2088r1081K40307j45582j45462K80660
13558A619047O4948l27168j17250K97411l4771J69479l98203Q6336q230N4022
13548A405621P5975k13836K84769j40304J36925J40524K29268J99996J70008L12363
13538B601309l00323j1222J6410k2204n41991J16824l47995J85309n1379p7244
13528A567494J3768N1379m2361J92987K86294K71958j22222K89441l85481j22295
13518B000962j18628k9669k28941k28106j1590L4356Q8621j13048m06253M65934
13508A453638k49874J02198j0809o3818o236l5846k01804J44386J87549j49043
13498A170341J39656j84681o8528l3508L49837k17940K517L57789j71925j46666
$$ y = [1404767, 1634143, 1363324, 1553952, 1428117, 1480205, 1389124, 1629431, 1483849, 1338387, 1619047, 1683995, 1356827, 1239577, 1536988, 1502217, 1671696, 1273493, 1359829, 1351599, 1405621, 1481596, 1267760, 1552529, 1412225, 1549150, 1689674, 1918942, 2118938, 2288946, 2601309, 2300986, 2289764, 2306174, 2283970, 1741979, 1858803, 1510808, 1696117, 1644738, 1567494, 1581262, 1632641, 1590280, 1783267, 2069561, 2341519, 2219297, 2508738, 2123257, 2000962, 1882334, 1852665, 1623724, 1395618, 1384028, 1418384, 1507005, 1393957, 987704, 1453638, 1203764, 1305962, 1295153, 1231335, 1225099, 1189253, 987449, 1131835, 1319384, 1170341, 1309997, 1125316, 1056788, 1023280, 1373117, 1155177, 1157694, 1515483, 1343558, 1196892]
13488A196892K8040r6806K03348q8775K56391l01827K36562j40990j34398n4438
13478A103999L25531k70229R06P0031O0621J6883j7649Q6124r3993m4262K6557
13467A264519o3184n4774j5415L0900K73221m33819J41803L07826l07216q0910
13457A062951K88085p2815P3671N5210L7833K62926R9690K44162J11975L10441
13447B474129k3955k33594k34356n758J11663l61958l25287k820K05009j93385
13437A409688j60389L46766n6104j87341J4738r0185L01554l75842K22054m0763
13427A384176j08938m929j2397K86766j33446K08908J86337J83711K52416j85335
13417B057269M14379l03737j50409M77618l79953l62929k20862P8351J57484k57286
$$ y = [1196892, 1224932, 1128126, 1331474, 1242699, 1499090, 1197263, 1433825, 1292835, 1158437, 1103999, 1429530, 1159301, 1160207, 1230238, 1290859, 1307742, 1290093, 1376217, 1282224, 1237962, 1264519, 1201335, 1146561, 1131146, 1162046, 1435267, 1001448, 1143251, 1451077, 1143861, 1062951, 1351036, 1278221, 1351892, 1407102, 1444935, 1707861, 1807551, 2051713, 2163688, 2474129, 2450174, 2216580, 1982224, 1976466, 2088129, 1726171, 1400884, 1398064, 1603073, 1409688, 1249299, 1596065, 1539961, 1352620, 1367358, 1277173, 1578727, 1202885, 1424939, 1384176, 1275238, 1270309, 1257912, 1544678, 1411232, 1620140, 1806477, 1990188, 2242604, 2057269, 2471648, 2167911, 2017502, 2495120, 2115167, 1752238, 1531376, 1609727, 1767211, 1509925]
13407A509925K33168k87428k7191L36225l04018m944J52781j66656N4795J80485
13397A677142k36365j85527L52706j35814N7611j4391J3661J21894J44346j1633
13387A783630K07250N4603k2303J30131n2384J64858J09273K8699J81439k97096
13377B288100K2286j15925k63732K5111n9057m41472J67259K46151J23985k03680
13367A789026k4869K70727k7993p6192J75698J0762p2149k05613Q0847k52239
13357A668005J84398N8830j7813j034J174J61798J59150k92152L77427j20991
13347B178792J87106k64964k88422L23636m78261J92664k04924k7658L48589q4330
13337A882228p4161j72266J17257J6738J79108J79432j53655k14650K09318k7940
$$ y = [1509925, 1743093, 1455665, 1428474, 1764699, 1460681, 1455737, 1608518, 1441862, 1496657, 1677142, 1440777, 1255250, 1607956, 1472142, 1529753, 1515362, 1529023, 1650917, 1795263, 1783630, 1990880, 2045483, 2023180, 2153311, 2100927, 2265785, 2375058, 2403757, 2585196, 2288100, 2310386, 2194461, 1930729, 1955840, 1896783, 1455311, 1622570, 1868721, 1992706, 1789026, 1764157, 2034884, 2006891, 1930699, 2106397, 2117159, 2045010, 1839397, 1920244, 1668005, 1852403, 1911233, 1893420, 1892386, 1893560, 2055358, 2214508, 1922356, 2299783, 2178792, 2365898, 2100934, 1812512, 2136148, 1657887, 1850551, 1645627, 1617969, 1966558, 1882228, 1808067, 1635801, 1753058, 1769796, 1948904, 2128336, 1974681, 1760031, 1969349, 1941409]
13327A941409K7470k56885K34174R4605p1037m1385p0916J54653l8036Q815j36835
13316A846032L72445J37460R3121j56729K07892J15949K31789q4158J25690m1111
13306B848380j03651K9549k03267n9368J52440k27234M34785k49555K56751J13935
13296B992765R3348J51838j70741N8526L8176N1879k10818j54367K88477l37239
13286B801844m5836Q4769k0412K00722k56176K78467q6830j2133N3058q8053J67856
13275C077276j53319K42437k5003l4540J99397J60167j66275L8102L04086j46653
13265C495675J35370N8945n9829J27494L11651P0550m76239N09960j5946j99635
13255C957996J94240J73795m498K09883P5554L91886j9793R0785J22249O9579
$$ y = [1941409, 1968879, 1711994, 1946168, 2040773, 1969736, 1928351, 1857435, 2012088, 1974052, 1982867, 1846032, 2218477, 2355937, 2449058, 2292329, 2500221, 2616170, 2847959, 2763801, 2889491, 2848380, 2744729, 2774278, 2571011, 2511643, 2664083, 2436849, 2871634, 2622079, 2878830, 2992765, 3086113, 3237951, 3067210, 3125736, 3163912, 3215791, 3004973, 2850606, 3139083, 2801844, 2756008, 2840777, 2820365, 3021087, 2764911, 3043378, 2956548, 2944415, 2997473, 2909420, 3077276, 2923957, 3166394, 3141391, 3106851, 3306248, 3466415, 3300140, 3338242, 3642328, 3495675, 3631045, 3689990, 3630161, 3757655, 4069306, 4139856, 3663617, 4173577, 4157631, 3957996, 4152236, 4326031, 4321533, 4531416, 4606970, 4998856, 4979063, 5069848, 5192097, 5261676]
13245E261676K49370k5066q3547L60836j28003K66210p1588J21343k61627J10295
13235E799899K38161j23213Q7972N4179K99592K99023j28413K91848j40919M66131
13225G144260O9601M75031m4027M5334J74925K60023J97532k23230N2106J41951
13215H293506j71131n1771j67426j0868l28255J18325j30249L6467j31130o0298
13205G397170m9141k1986k80487J74481K1839K19354j88090r125J5129j54047
13195G125097L5895k88531K21227j12099k09833p2773q2979j07953o2962j52943
13185F292146j83334k81144J77641r2848K228j37766l00867j11309N5455r7576
13175E322626k34837J06639J91012l44499j13172L6243m5363J41186k6168N883
$$ y = [5261676, 5511046, 5485980, 5402433, 5763269, 5635266, 5901476, 5829888, 5951231, 5689604, 5799899, 6038060, 5914847, 6002819, 6056998, 6356590, 6655613, 6527200, 6819048, 6678129, 7144260, 7213861, 7688892, 7644865, 7690199, 7865124, 8125147, 8322679, 8099449, 8151555, 8293506, 8122375, 8070604, 7903178, 7892310, 7564055, 7682380, 7552131, 7588598, 7457468, 7397170, 7348029, 7326043, 7045556, 7220037, 7241876, 7461230, 7273140, 7264015, 7279144, 7125097, 7160992, 6872461, 7093688, 6981589, 6771756, 6698983, 6616004, 6508051, 6445089, 6292146, 6108812, 5827668, 6005309, 5912461, 5914689, 5776923, 5476056, 5364747, 5420202, 5322626, 5087789, 5194428, 5385440, 5040941, 4927769, 4964012, 4918649, 5059835, 5033667, 5039550]
13165E039550l902q9003L55143K49625K22227K06866L81223L08855L01445K24736
13155G196765L60299n4463J15412J7421N9405o4952m84219j27087J51559k65090
13145F905050J228q1033L60238n3480r3687L0665j33631n44030k84517l89941
13135E716862n44272k42475l80064m36800N7706M0531j66922k47881J58469l8100
13125C917054N685Q9222j72990J93882J29578k97313m11m44681j45544J8916k00691
13114C092707R0118P2842R363k5786j3222r6740J72820j46150J03524J3736R4681
13103C367893J04063N6895J05909K26695L7900N67992K76825N16615J71401M32988
13093E865176N59733M81123L39831K49231P4339l02770q6492l79725q2272k951
$$ y = [5039550, 5035648, 4946645, 5301788, 5551413, 5773640, 5980506, 6361729, 6670584, 6972029, 7196765, 7557064, 7502601, 7618013, 7635434, 7694839, 7629887, 7145668, 7018581, 7170140, 6905050, 6906278, 6825245, 7185483, 7132003, 7038316, 7068981, 6935350, 6391320, 6106803, 5716862, 5172590, 4930115, 4550051, 4113251, 4170957, 4211488, 4044566, 3796685, 3955154, 3917054, 3922739, 4011961, 3838971, 4032853, 4162431, 3865118, 3864707, 3420026, 3274482, 3293398, 3092707, 3182825, 3255667, 3265030, 3239244, 3226022, 3129282, 3302102, 3155952, 3259476, 3273212, 3367893, 3471956, 3528851, 3634760, 3861455, 3899355, 4467347, 4744172, 5260787, 5432188, 5865176, 6424909, 6906032, 7245863, 7495094, 7569433, 7266663, 7180171, 6800446, 6718174, 6715223]
13083F715223O3516J40643k75246N02880k22693k19964l60919l43836m70668m91203
13073E037733m93057k53658m66255j60718k31248k11877K9618m02816M6954j25396
13063B769280J93361n3236N0853L8537J56959k07659L4711J04113k1589J1070
13053C076400K17005j59507k77594K66584q5146r1070o8063R3230l31453K56769
13043B897155J94193n1554j26952J15891R1335q7848j05907K73265l46993K41445
13033C094030K87374n4819j33006Q6433k3968J21255P1627K59638l49154J38256
13023C497666L07341j47366q4480J13340K16274q008j7497J79992Q5246J33531
13013D276039k96065M41691K0228j05043N1586J86811J5642r4894L61643n3849
$$ y = [6715223, 6778739, 6919382, 6644136, 7147016, 6924323, 6704359, 6343440, 5999604, 5528936, 5037733, 4544676, 4291018, 3824763, 3664045, 3432797, 3220920, 3250538, 2847722, 2894676, 2769280, 2962641, 2909405, 2960258, 2998795, 3155754, 2948095, 2982806, 3086919, 3065330, 3076400, 3293405, 3133898, 2856304, 3122888, 3037742, 2946672, 2878609, 2971839, 2640386, 2897155, 3091348, 3039794, 2912842, 3028733, 3120068, 3032220, 2926313, 3199578, 2852585, 3094030, 3381404, 3326585, 3193579, 3280012, 3256044, 3377299, 3448926, 3708564, 3359410, 3497666, 3805007, 3657641, 3573161, 3686501, 3902775, 3894767, 3877270, 4057262, 4142508, 4276039, 3979974, 4421665, 4441893, 4336850, 4388436, 4575247, 4590889, 4495995, 4857638, 4803789]
13003D803789J86973N4044K4041J93388O6298k6173K07296P2226K2226J11427
12993E715535L62125j5091K31018j10043l0473J24554K0243j24657N1623m2565
12983F182269j27531J00737Q527J36425k24424J23180J41404k26986N3752j42875
12973F024478l42905K38227k65494p7722P3058k29965J80855j25895j9283k41592
12963E213762J51730J01643k48079J05861o7547O241q4824K4151J32414k35876
12953E099476K31515r3880J13203J9342o5738j56896p7198L46143j31256J4432
12943E299143J76649k91495J69104j79787K21907j00735k89792L29702j47127
12934E187569M06550P1242m3013J49769k50099K10750J20890j77106N9971l36478
$$ y = [4803789, 4990762, 5044806, 5068847, 5262235, 5328533, 5302360, 5509656, 5581882, 5604108, 5715535, 6077660, 6062569, 6293587, 6183544, 6153071, 6277625, 6297868, 6173211, 6224834, 6182269, 6054738, 6155475, 6164002, 6300427, 6076003, 6199183, 6340587, 6113601, 6167353, 6024478, 5681573, 5919800, 5654306, 5576584, 5649642, 5419677, 5600532, 5474637, 5455354, 5213762, 5365492, 5467135, 5219056, 5324917, 5257370, 5263611, 5178787, 5202938, 5335352, 5099476, 5330991, 5237111, 5350314, 5369656, 5303918, 5147022, 5069824, 5415967, 5284711, 5299143, 5475792, 5184297, 5353401, 5173614, 5395521, 5294786, 5004994, 5334696, 5187569, 5594119, 5665361, 5622348, 5772117, 5522018, 5732768, 5853658, 5676552, 5736523, 5400045]
12924E400045o2726n9639k5015J8101j66025J94053k2758n3913O1035l9936j93195
12913E050027j9036k15090j43941k21677n3176N0243q0321J6376J0667l50146
12903D043926J07029k42341j93348J63678p0625j86277L5022j21502L16394k78641
12893C573315r1637r5718j9744K5606j33153K86118j92824n0342K84047j16628
12883C469040k14117J2543k28467J84758l1638m4640k00028O741k36J33634k17570
12872B870020J37093q0976N7134j33870p6282Q1376p6868R106l06410J17451n1939
12861B545835J59256j01155l5436P7088N0580L9770k18534J00092l8645R9327
12851B678178K01446l94304Q2945j53896L4706m6955K6168K55584J837j47958
$$ y = [5400045, 5337319, 5277680, 5252665, 5270766, 5104741, 5298794, 5276036, 5222123, 5283158, 5243222, 5050027, 5030991, 4815901, 4671960, 4450283, 4397107, 4447350, 4367029, 4383405, 4394072, 4043926, 4150955, 3908614, 3715266, 3878944, 3808319, 3622042, 3657064, 3535562, 3851956, 3573315, 3481678, 3385960, 3366216, 3391822, 3258669, 3544787, 3351963, 3301621, 3585668, 3469040, 3254923, 3267466, 3038999, 3223757, 3192119, 3147479, 2947451, 2954192, 2953956, 3087590, 2870020, 3007113, 2926137, 2983271, 2849401, 2773119, 2854495, 2777627, 2786733, 2480323, 2597774, 2545835, 2705091, 2603936, 2568500, 2645588, 2696168, 2735938, 2517404, 2617496, 2578851, 2678178, 2879624, 2485320, 2568265, 2414369, 2449075, 2402120, 2428288, 2683872, 2685709, 2537751]
12841B537751N7109m4127j16331J15737n0943K45718k92167L6414k5556K52953
12831B716558l96249K60259P3154j49116P9312k39386J73285j78003J55962O4703
12821B560479P207J56224j47561j83846K14840l4156j32648N7019L9514q2772
12811B454300J48382o1120J34864j93675o4727j17168L69088k91462J48293J3623
12801B540398L3547N1193K4321Q2877R641m1397q9552N1996j6484J25155M4892
12790B816587r5199o5569J53062j73471J6713q0695J8108K12732l1674L6192j25054
12779B681732L9113k43644K29171L3350j67944o1878J82930K8299P6949j07917
12769B690161J47807j05155l08044M30289j05692j72532L25375j98196R5500K7973
$$ y = [2537751, 2594860, 2550733, 2434402, 2550139, 2499196, 2744914, 2452747, 2489161, 2463605, 2716558, 2320309, 2580568, 2653722, 2504606, 2583918, 2344532, 2517817, 2339814, 2495776, 2560479, 2567686, 2723910, 2576349, 2392503, 2607343, 2573187, 2440539, 2497558, 2537072, 2454300, 2602682, 2541562, 2676426, 2482751, 2418024, 2300856, 2669944, 2378482, 2526775, 2540398, 2573945, 2625138, 2649459, 2732336, 2741977, 2700580, 2611028, 2663024, 2646540, 2771695, 2816587, 2721388, 2655819, 2808881, 2635410, 2652123, 2571428, 2589536, 2802268, 2770594, 2806786, 2681732, 2720845, 2477201, 2706372, 2739722, 2571778, 2509900, 2692830, 2721129, 2798078, 2690161, 2837968, 2732813, 2424769, 2855058, 2749366, 2576834, 2902209, 2704013, 2799513, 2827486]
12759B827486m5724L0908k56155K23405q2124o5066J81527j85503K96149j14030
12749B810873J02625l9545R3038j93959l5463L418R5082K8299j68779r182J26835
12738B813242K55393m12402J99565J33468k26277Q6762L8134M1139m7475l4051
12728B847498J54753k31076L75928j23667j76995n2101K7486R4573j70277K49754
12718B995876l46605Q6928J78359o5228J06076J49034j2793p6168q996O7990O677
12707C081150Q7526n4030L42788K79870p4606j50825K58082n8478K29386J34833
12697D075696k14782L71776K37244J49745J54110J99922M30749M29298M07733
12688F241491P86482O93434J99035K57384k69749l34526j46100m13277n37212
$$ y = [2827486, 2781762, 2812670, 2556515, 2779920, 2697796, 2632730, 2814257, 2628754, 2924903, 2810873, 2913498, 2873953, 2966991, 2773032, 2737569, 2740987, 2836069, 2864368, 2695589, 2686407, 2813242, 3068635, 2656233, 2855798, 2989266, 2762989, 2849751, 2887885, 2929024, 2881549, 2847498, 3002251, 2771175, 3147103, 3023436, 2846441, 2794340, 2821826, 2916399, 2746122, 2995876, 2649271, 2736199, 2914558, 2849330, 2955406, 3104440, 3091647, 3015479, 3006483, 3074473, 3081150, 3168676, 3114646, 3457434, 3737304, 3662698, 3511873, 3769955, 3711477, 3940863, 4075696, 3860914, 4232690, 4469934, 4619679, 4773789, 4973711, 5404460, 5833758, 6241491, 7027973, 7721407, 7920442, 8177826, 7908077, 7573551, 7427451, 7014174, 6476962]
12679F476962q02613p73700k25895k65573M4835k04049J69303r3930j95637J80028
12669D309731J16677k80041J43355K90556K02451l48401Q8929L6336K52070P0678
12659D882341j31646k12924P3274J27771K1303L44153K9208O64429J89327J94651
12649F181887J98856M47919J65613j52824m6940m98894K06492l00056J22188l03664
12639F020577K8232J04139k5749J05098J5478N8948K93890k43349R1139L84836
12629F833239K12369L33539j52390K92986k53486k56656J1265k62762k52446m62267
12619F043391l27043M009n27409k58157j37265k20188P9650J81924L28978L81332
12609E549222M80118K43622O45964L34732L70869K25050K45769m4486j46878m44950
$$ y = [6476962, 5674349, 4900649, 4674754, 4409181, 4454016, 4249967, 4419270, 4325340, 4129703, 4309731, 4426408, 4146367, 4289722, 4580278, 4782729, 4434328, 4523257, 4559593, 4811663, 4882341, 4750695, 4537771, 4611045, 4738816, 4760119, 5104272, 5133480, 5797909, 5987236, 6181887, 6380743, 6828662, 6994275, 6841451, 6794511, 6295617, 6502109, 6202053, 6324241, 6020577, 6048809, 6152948, 6127199, 6232297, 6247775, 6306723, 6600613, 6357264, 6448403, 6833239, 7045608, 7379147, 7226757, 7519743, 7266257, 7009601, 7020866, 6758104, 6505658, 6043391, 5716348, 5720357, 5192948, 4934791, 4797526, 4577338, 4656988, 4838912, 5167890, 5549222, 6029340, 6272962, 6918926, 7253658, 7624527, 7849577, 8095346, 8050860, 7903982, 7459032]
12599G459032m39539m01534m29693n27428m91950k47M9489j82538L40956L69282
12589E745830K97198J36184j07362K97196J00795k39492O5568n3663n03281m6319
12579E692654j47894M61161K39283J72737K13115K21131N131k27037k45370l74726
12569F010185m26885m47478j25294n21952l2317N8978k5960q0333j60317J51984
12559D400611K19544r3084j0597M2871J61915o0461j07956n2811N8052K986J53738
12548D714808R57q4416k03348J07787L11267j41882k22660R8079M01369K57782
12538E239743j00351k7307J51343K7876j46415k6320q4299l98930j59022k55770
12528D220548j34397Q3985J55135j241Q9731O5682J49086J38581m64791N34406
$$ y = [7459032, 7019493, 6617959, 6188266, 5660838, 5168888, 5168641, 5218130, 5035592, 5376548, 5745830, 6043028, 6179212, 6071850, 6369046, 6469841, 6230349, 6295917, 6242254, 5738973, 5692654, 5544760, 6005921, 6245204, 6417941, 6631056, 6852187, 6857318, 6630281, 6384911, 6010185, 5583300, 5135822, 5010528, 4488576, 4456259, 4515237, 4489277, 4408944, 4248627, 4400611, 4620155, 4527071, 4516474, 4559345, 4721260, 4660799, 4552843, 4500032, 4558084, 4561070, 4714808, 4715765, 4631349, 4428001, 4535788, 4847055, 4705173, 4482513, 4580592, 4981961, 5239743, 5139392, 5112085, 5263428, 5291304, 5144889, 5118569, 5034270, 4635340, 4476318, 4220548, 4086151, 4170136, 4325271, 4324030, 4413761, 4479443, 4628529, 4767110, 4302319, 4836725]
12518D836725j21179o8980J34458j6776J38976L815L46878L20490K05913J86877
12508E967197M19045K04098K21423j34024k47098m23061k97645m17140l61785
12499D931010k46735J250o7257l9856j21902L77089k03284Q3425j79819J93969
12489D727890K98385j53829j7092p1081J61411J30229n07197O78483L11164J070
12479E559433P7800J05753R7378o9524L902k592k85151l31571R8918l90863k2286
12468D841197M7253J51261O2061l17708M25199l55484K52513J5677j88136K20194
12458E154027j16858L12240k11307K35446n3951J83159K208J35559Q1786J05068
12448E827377J39477O7552J46506K20020l4696L48191K36498J60242J97005K76612
$$ y = [4836725, 4715546, 4646566, 4781024, 4764248, 4903224, 4907039, 5253917, 5574407, 5780320, 5967197, 6386242, 6590340, 6811763, 6677739, 6430641, 6007580, 5709935, 5292795, 4931010, 4684275, 4685525, 4618268, 4578412, 4456510, 4833599, 4630315, 4713740, 4533921, 4727890, 5026275, 4872446, 4855354, 4784273, 4945684, 5075913, 4568716, 5247199, 5558363, 5559433, 5637233, 5742986, 5840364, 5770840, 5774742, 5772150, 5486999, 5155428, 5254346, 4863483, 4841197, 4888450, 5039711, 5101772, 4784064, 5209263, 4853779, 5106292, 5121969, 4933833, 5154027, 5037169, 5349409, 5138102, 5373548, 5319597, 5502756, 5504964, 5640523, 5722309, 5827377, 5966854, 6034406, 6180912, 6400932, 6366236, 6714427, 6950925, 7111167, 7308172, 7584784]
12438G584784K117K9012K88658p6681J13214j46221K53534J82980r8156K31154
12428H364395M1725J65049J40310j24000K71945J25640J42832J53137Q7348j50332
12418I218049M11977J8109L23470O1693N10744L99628M72672J93753M83990J12649
12408A2206734K15513l8591L1719j03809j97993L5125j15489k09643j03940o731
12398A1712895j25194j95657k77114Q9113P1554j4703J70298K46199R3300K86733
12388A2057424K65300M60674K76362N75079K85549L75281J86001L39376N6800
12379A4877846J13920K47286l5686K65903Q7270J46443L1958j43091Q8354q4273
12369A5595930q8897K2087l9289j62620j66076L38989j52900j8423j41579k08472
$$ y = [7584784, 7586901, 7615913, 7904571, 7827890, 7941104, 7794883, 8048417, 8231397, 8133241, 8364395, 8406120, 8571169, 8711479, 8587479, 8859424, 8985064, 9127896, 9281033, 9368381, 9218049, 9630026, 9648135, 9971605, 10033298, 10544042, 10943670, 11416342, 11610095, 12094085, 12206734, 12422247, 12383656, 12415375, 12311566, 12113573, 12148698, 12033209, 11823566, 11719626, 11712895, 11587701, 11392044, 11114930, 11204043, 11275597, 11260894, 11431192, 11677391, 11770691, 12057424, 12322724, 12783398, 13059760, 13634839, 13920388, 14295669, 14481670, 14821046, 14877846, 14991766, 15239052, 15203366, 15469269, 15556539, 15702982, 15734940, 15591849, 15680203, 15595930, 15507033, 15529120, 15489831, 15327211, 15161135, 15500124, 15347224, 15328801, 15187222, 14978750]
12359A4978750J23947l88884k30363j7772j21647p324m04294L67785k65223q3664
12349A3951311k44564m79748l74561J29417l77829j69004J39380q8132K71944
12340A2758214N177L05797N07239Q8823M35283L98077K51080L44147M08164N61021
12330A6063022K7518N30114Q3370N44083J67233J12912L13023J13047o4293K03559
12320A8093588J7662N9064J19047J06077m46563J53684k1218n7501q0504Q803
12310A7952139K08722O7677M17988L25382M7535M38140M36990L57157M66633M06977
12300B1125340K21953j59974k10209n22258m91206o58778q12291k52346p36779
12291A7503452J58773m34909O867j52479j7044j75135l90579k98018p35141m72913
$$ y = [14978750, 15102697, 14713813, 14483450, 14465678, 14344031, 14336707, 13932413, 14300198, 14034975, 13951311, 13706747, 13226999, 12852438, 12981855, 12604026, 12435022, 12574402, 12486270, 12758214, 12763391, 13069188, 13576427, 13665250, 14100533, 14498610, 14749690, 15093837, 15502001, 16063022, 16090540, 16620654, 16704024, 17248107, 17415340, 17528252, 17841275, 17954322, 17890029, 18093588, 18111250, 18170314, 18289361, 18395438, 17948875, 18102559, 18081341, 18023840, 17943336, 17952139, 18160861, 18228538, 18646526, 18971908, 19019443, 19457583, 19894573, 20251730, 20718363, 21125340, 21347293, 21187319, 20977110, 20454852, 19963646, 19304868, 18492577, 18240231, 17503452, 17662225, 17227316, 17234183, 17081704, 17064660, 16889525, 16498946, 16200928, 15465787, 14992874]
12281A4992874o79979l70706o51484m82913r3189l91291l72040l21277K36525
12272A1866520m79955j14436j47870L5308K19412l6866m9403j62330j8120j26850
12262A0985410K44497j64846k63801K74720l12451J43670R1684K43149k1707M72765
12252A1693090M74812O00176N00100P76296P46999Q80380J191583O91977R44664
12243A8500077J239886R58296J280135O00208L27520K85618o9535k97785j68359
12234B2656061m22259j04296k35211j78827L47256l50685l14073k08628m60160
12225B0729178p65390j067673r50588j318271q96340j247383p02397j017113m22958
12216A2341065n62412o05466j22036k66703k50774j31799k16568k08919j70936
$$ y = [14992874, 14312895, 13942189, 13290705, 12807792, 12714603, 12323312, 11951272, 11629995, 11866520, 11386565, 11272129, 11124259, 11159567, 11378979, 11342113, 11292710, 11130380, 11112260, 10985410, 11229907, 11065061, 10801260, 11075980, 10763529, 10907199, 10998883, 11242032, 11220325, 11693090, 12167902, 12768078, 13268178, 14044474, 14791473, 15671853, 16863436, 17555413, 18500077, 19739963, 20698259, 21978394, 22578602, 22906122, 23191740, 23122205, 22824420, 22656061, 22233802, 22129506, 21894295, 21715468, 22062724, 21712039, 21397966, 21189338, 20729178, 19963788, 18896115, 17945527, 16627256, 15730916, 14483533, 13781136, 12764023, 12341065, 11778653, 11173187, 11051151, 10784448, 10533674, 10401875, 10185307, 9976388, 9805452]
12207I805452m35873k76294l91038r1610K70049j26230J72553N725K5688J73303
12197I131725j39873k47082J61123K27637l0279j7455J24071K24775K96687J60013
12187I891342K7307K68900K85148J92858J65196R3053K596K56299j70531K49933
12177A1262101O6918j79825j47378L3391k03586j59473j39101J53319L4233L82072
12167A1102671o1258J22267K27735j46539M76726K41179N19406K92688P08071
12158A3482946L24447N24547L76231o3192j17333m82534l29914k32365m06754
12149A3076079m5418L13854L33474L04162O47469K78964N53905K28984L42242
12140A6033715M90665J78644L52388L98428N67763M89256J061068R73416J084811
$$ y = [9805452, 9369579, 9093285, 8702247, 8610637, 8880686, 8754456, 8927009, 8932734, 8958422, 9131725, 8991852, 8744770, 8905893, 9133530, 9103251, 9085796, 9209867, 9434642, 9731329, 9891342, 9918649, 10187549, 10472697, 10665555, 10830751, 10923804, 10926400, 11182699, 11012168, 11262101, 11329019, 11149194, 11001816, 11035207, 10831621, 10672148, 10533047, 10686366, 10720599, 11102671, 11041413, 11163680, 11391415, 11244876, 11721602, 11962781, 12482187, 12774875, 13482946, 13807393, 14331940, 14708171, 14644979, 14527646, 14045112, 13715198, 13482833, 13076079, 13030661, 13344515, 13677989, 13982151, 14629620, 14908584, 15462489, 15691473, 16033715, 16524380, 16703024, 17055412, 17453840, 18021603, 18510859, 19571927, 20545343, 21630154]
12131B1630154J179290J644569J718193J973068J924423J977289J961317J710956
12123C5719259J509341Q27741N92133M53797L0055j49886o71154m79318o04973
12114C7226995n21534q82743l78550j071098q86277o42514o92346n73800k70558
12105C1307575k26891k19400j21897K59150K57479O5606L80195L02351L3855J5635
12095C2053658k93189n36104j107696q89573j105083p05749l94316J83225M44271
12086B7649444Q81104Q64178Q40477R06262P96482M97850M42648p3805R2795j60264
12076C2737171j48549Q3990n9303K7646L5592l02988j21876n18215o87196m91157
12066C0555115q46154j083382j101847j267958j018355j052532n77040p52310
$$ y = [21630154, 22809444, 24454013, 26172206, 28145274, 30069697, 32046986, 34008303, 35719259, 37228600, 38056341, 38648474, 39102271, 39132326, 38982440, 38311286, 37831968, 37226995, 36705461, 35822718, 35444168, 34373070, 33486793, 32844279, 32151933, 31578133, 31307575, 31080684, 30861284, 30739387, 30998537, 31256016, 31321622, 31701817, 32004168, 32038023, 32053658, 31760469, 31224365, 30116669, 29227096, 28122013, 27416264, 27021948, 27205173, 27649444, 28530548, 29394726, 30235203, 31141465, 31937947, 32435797, 32878445, 32804640, 32897435, 32737171, 32588622, 32672612, 32613309, 32640955, 32676547, 32373559, 32251683, 31733468, 31046272, 30555115, 29708961, 28625579, 27523732, 26255774, 25237419, 24184887, 23607847, 22855537]
12058B2855537j94835l76672j63299l82738l15870k53723o08051k77451p80597
12049A9502301j24736m84660j89915n58965o0814l59014l60425r1436m51853m08774
12039A6411709j90716n17831l15912k09549n85072k44035n2113j59908L14532
12030A4451105J98975L38314O37893M37993O05978M99588j78618K1824k94903
12021A6718149m18073q30000p05444p33728l30181m45166k15277l90711J08361
12012A2757930l90357l27873j24444n69785l66038o28766J03278m08766M36396
12003A0481575L13108n7457M17449L07062K89395l3624m07847J34110l50193n41427
11993A0552151n02601m87089j00971l63252m523k2078L03591k46334L0080k74004
$$ y = [22855537, 22660702, 22284030, 22120731, 21737993, 21422123, 21168400, 20560349, 20282898, 19502301, 19377565, 18892905, 18702990, 18144025, 18083211, 17724197, 17363772, 17272336, 16820483, 16411709, 16220993, 15703162, 15387250, 15177701, 14592629, 14348594, 14296481, 14136573, 14451105, 14650080, 14988394, 15626287, 16064280, 16670258, 17169846, 16991228, 17013052, 16718149, 16300076, 15470076, 14764632, 14030904, 13700723, 13255557, 13040280, 12649569, 12757930, 12367573, 12039700, 11915256, 11345471, 10979433, 10350667, 10453945, 10045179, 10481575, 10794683, 10737226, 11154675, 11461737, 11751132, 11717508, 11309661, 11443771, 11093578, 10552151, 10049550, 9562461, 9461490, 9098238, 9093715, 9071637, 9375228, 9128894, 9158974, 8884970]
11983H884970j75213l45310m83495l53250k15447J72307N599l74545K11518k3833
11973G303301q6367j28911N5573k74643l66668l86771j89814J01978l57539j23176
11963E546963k57771K7835O5830p1159J15595J90448L59371j38964L52031j50971
11953F039208J68970J20012j34800K31079m80260J11715j05928Q7265J92412l9828
11943F189845K08010K40414K16555K89160J79076J40180m5877j82167L16114O2142
11933G613452o31q7730p7035L57050K30285k48911J4292k41324m4572j44940k61427
11922G108509j37486l42495k61083j38831p5185j72324J17347K0633l43921n8112
11912E717052L9926k40512J43413R83291J685943K068152K155118J259408J064023
$$ y = [8884970, 8709757, 8364447, 7880952, 7527702, 7312255, 7484562, 7490161, 7115616, 7327134, 7303301, 7216934, 7088023, 7143596, 6868953, 6502285, 6115514, 5925700, 6027678, 5670139, 5546963, 5289192, 5317027, 5382857, 5311698, 5427293, 5617741, 5977112, 5838148, 6190179, 6039208, 6208178, 6328190, 6193390, 6424469, 5944209, 6055924, 5949996, 6037261, 6229673, 6189845, 6397855, 6638269, 6854824, 7143984, 7323060, 7463240, 7417363, 7235196, 7551310, 7613452, 7612821, 7525091, 7448056, 7805106, 8035391, 7786480, 7800772, 7559448, 7514876, 7369936, 7108509, 6971023, 6628528, 6367445, 6228614, 6153429, 5981105, 6098452, 6119085, 5775164, 5717052, 5756978, 5516466, 5659879, 6643170, 8329113, 10397265, 12552383, 13811791, 14875814]
11903A4875814K06356k00042L42185j554844l184985l501899j081985p28933j96183
11894D975484j87102J76930p3662n862K38338O8709L0190L27245N49694O43390
11884F743354P97236P35091O67455N13033N66248J31967R7235l25248o76204o59220
11874H590947n29227l94823q14725l80590m80790m15687m14994j19196k11945
11865D828970j29545q7827k9398o4782k38503N7885l03999K53876k26012J64723
11855D225388k19981L50512j7503J38066j32178K78431R4725L4505L48301O9031
11845E169297J79376K38873N45818L52937P04657O27959L34137K22270j0183m3956
11835H321185L4232l84235m16084n06170j97036j48752K45276N2669L69908k22901
$$ y = [14875814, 15082170, 14882128, 15224313, 13669469, 10484484, 6982585, 5900600, 5171667, 4975484, 4788382, 4965312, 4891650, 4885788, 5124126, 5192835, 5223025, 5550270, 6099964, 6743354, 7540590, 8275681, 8943136, 9456169, 10022417, 10154384, 10251619, 9926371, 9250167, 8590947, 8061720, 7666897, 6852172, 6471582, 5990792, 5575105, 5160111, 5040915, 4828970, 4699425, 4611598, 4582200, 4517418, 4278915, 4336800, 4032801, 4286677, 4060665, 4225388, 4005407, 4355919, 4338416, 4476482, 4344304, 4622735, 4717460, 4751965, 5100266, 5169297, 5348673, 5587546, 6133364, 6486301, 7190958, 7818917, 8153054, 8375324, 8365141, 8321185, 8355417, 7971182, 7555098, 7048928, 6851892, 6703140, 6948416, 7001085, 7370993, 7148092]
11825G148092O7236n84692o13576p21512l68528n14010j21834l53926p1976n6592
11815C808682l05370K99272l37833J52918l05260J62293p2551O4472o6581k28914
11805C171128J38066q1330R1662p2796m6344P9235k7397l4371J0183Q0648M8286
11794C356970M1003J02094J43287J8118N58787l2706O67633N03840M89932m833
11784E844125P19520k83804k67495k3026m55800r04822m82730k39618k62727l44681
11774C298942k29277M9761k09453l4937n4324j10139p330J85538j25763J05342
11764B868360k61234P8707P3353N0353k16441L26540j43020j02203j93956K37769
11754B718228M2469q381j39792l11Q142J45623j57985L89229j84509N5091q4991
$$ y = [7148092, 7215328, 6630636, 6017060, 5295548, 4927020, 4413010, 4291176, 3937250, 3865274, 3808682, 3503312, 3802584, 3464751, 3617669, 3312409, 3474702, 3402151, 3466623, 3400042, 3171128, 3309194, 3227864, 3319526, 3246730, 3200386, 3279621, 3252224, 3217853, 3228036, 3308684, 3356970, 3397973, 3500067, 3643354, 3661472, 4220259, 4187553, 4855186, 5359026, 5848958, 5844125, 6563645, 6279841, 6012346, 5989320, 5533520, 4628698, 4145968, 3906350, 3643623, 3298942, 3069665, 3119426, 2909973, 2875036, 2820712, 2710573, 2703243, 2888781, 2763018, 2868360, 2607126, 2685833, 2759186, 2809539, 2593098, 2919638, 2776618, 2674415, 2480459, 2718228, 2760697, 2752316, 2612524, 2612213, 2620355, 2765978, 2607993, 2997222, 2812713, 2867804, 2782813]
11743B782813j60058j14902n9686J12289J21579j57915O6663P670k92876L04999
11733B610576q2050q1998O0735l7784j43110J92180q8254j62475J90485j88006
11723B270299J23015L271P1512j45097k3149J88826Q7819j29668R7100N2426m9200
11712B547154K5525k6918M54j25303J26565k53643J33155j49321J60903m7531
11702B391040K60826n3428k00826M2259J28192J16376j67554O3081J16234L0992
11692B727192K3761J28310j29097J69302k12931K2233m4296J60256J34495L7192
11682C016417N598O9191j752j76955K24790K1795j9110O0586M7994k07883Q0872
11671C121543j56109M08959j24697R2205O5195r0315q9508j33063J64076K5966
$$ y = [2782813, 2622755, 2507853, 2448167, 2560456, 2682035, 2524120, 2590783, 2598453, 2305577, 2610576, 2528526, 2446528, 2507263, 2469479, 2326369, 2518549, 2430295, 2267820, 2458305, 2270299, 2393314, 2396585, 2468097, 2323000, 2299851, 2488677, 2576496, 2446828, 2543928, 2596354, 2547154, 2572679, 2545761, 2546215, 2420912, 2547477, 2293834, 2426989, 2277668, 2438571, 2391040, 2651866, 2598438, 2397612, 2439871, 2568063, 2684439, 2516885, 2579966, 2696200, 2727192, 2750953, 2879263, 2750166, 2919468, 2706537, 2728770, 2684474, 2844730, 2979225, 3016417, 3022015, 3091206, 3089454, 2912499, 3137289, 3159084, 3139974, 3200560, 3248554, 3040671, 3121543, 2965434, 3374393, 3249696, 3341901, 3407096, 3316781, 3227273, 3094210, 3258286, 3284252]
11661C284252l5712J25757k08787J42096n5842m31538J54593K24085j77269K38067
11651C259702l64015J31399l4872n2262J35016o3213q9967l6463J51899j72011
11641B865213J29428j78171K01764p7420l106j72091R8997r4377p4030J32368
11631B828575Q7427j77825j75387K21774j07165p6877J40023L895M4979k36146
11621B553273Q9343q7334R6763m9087J18539Q0595j88122n5793J46131k75207
11611B429101L19137j56600J81923n6239K40720k33703J28785J37035j51314M7084
11601B885929j00147J62522k071N4448J10327p7268O1684l18802L18968k1676
11591C073914K1607q5650l6977J68706j68907k7164K1578m9733J13355L3327j26994
$$ y = [3284252, 3248540, 3374297, 3165510, 3307606, 3251764, 2820226, 2974819, 3198904, 3021635, 3259702, 2895687, 3027086, 2992214, 2939952, 3074968, 3011755, 2921788, 2885325, 3037224, 2865213, 2994641, 2816470, 3018234, 2940814, 2937708, 2765617, 2864614, 2770237, 2696207, 2828575, 2916002, 2738177, 2562790, 2784564, 2677399, 2600522, 2740545, 2744440, 2789419, 2553273, 2642616, 2555282, 2652045, 2602958, 2721497, 2802092, 2613970, 2558177, 2704308, 2429101, 2748238, 2591638, 2773561, 2717322, 2958042, 2724339, 2853124, 2990159, 2838845, 2885929, 2785782, 2948304, 2946233, 3000681, 3111008, 3033740, 3095424, 2776622, 3095590, 3073914, 3095521, 3009871, 2972894, 3141600, 2972693, 2945529, 2967107, 2917374, 3030729, 3064056, 2937062]
11580B937062K66001p6465M6952k9381J76498j02340j25408P9996M6831K3041
11570C242787k82427J81233Q6265j85154q4044q7622J35759J1424J80427j69122
11560C029526k54361K15611O5522p0395J98404k2274q1995K18364j16924J48718
11550C330196j12709l8420r5712k853q6413J69326J74477j64383k79277P4168
11540B968400j20477J81641k5606j93112N7799L62052j11212j88375K02355j99040
11530B934425N4584j10150p1272R3596j23087J22131j75610L56162l24685M4584
11520B800678K73224l61885L19455r7245J72774n7966J7120n5482o3552L29881
11510C277002k1721p8904j64242j4825L09084k06694K19417j15920M4487J55889
$$ y = [2937062, 3203063, 3126598, 3173550, 3144169, 3320667, 3218327, 3092919, 3172915, 3219746, 3242787, 2960360, 3141593, 3227858, 3042704, 2958660, 2871038, 3006797, 3018221, 3198648, 3029526, 2775165, 2990776, 3056298, 2985903, 3184307, 3162033, 3080038, 3298402, 3181478, 3330196, 3217487, 3179067, 3083355, 3080502, 2994089, 3163415, 3337892, 3173509, 2894232, 2968400, 2847923, 3029564, 3003958, 2810846, 2868645, 3230697, 3119485, 2931110, 3133465, 2934425, 2989009, 2878859, 2807587, 2901183, 2778096, 2900227, 2724617, 3080779, 2756094, 2800678, 3073902, 2712017, 3031472, 2934227, 3107001, 3049035, 3066155, 3010673, 2947121, 3277002, 3255281, 3176377, 3012135, 2997310, 3306394, 3099700, 3319117, 3203197, 3247684, 3403573]
11500C403573M8572j41250j60826o3614J64272K4349l65007M87040k80107J3242
11490C130244K7013J08079R957J91018k44240K72359q7539N0245J95667l28669
11480C324134j1108m2051J11455J83639j59772J18087Q0341j5612M9423m7934
11470C590602K0635j23297j16960q4305L00079k18935j61792L3896q2430Q1126
11460C238619M6173k94611L04414k56835N9143K33991j93506n1088Q9548J06219
11450C282067j90860J34080L6138k4807M1391J24472l46369Q3738K42956K03902
11440C586708P4966J9797r6561K2198j99436K41968l8201N0089N6096L557L30974
11429D052155o6501M3056j97293J40013k4028j22542L30595j63256K14117k60878
$$ y = [3403573, 3452145, 3310895, 3150069, 3086455, 3250727, 3275076, 2910069, 3397109, 3117002, 3130244, 3157257, 3265336, 3275293, 3466311, 3222071, 3494430, 3406891, 3457136, 3652803, 3324134, 3313026, 3270975, 3382430, 3566069, 3406297, 3524384, 3604725, 3589113, 3638536, 3590602, 3611237, 3487940, 3370980, 3286675, 3586754, 3367819, 3206027, 3239923, 3157493, 3238619, 3284792, 2990181, 3294595, 3037760, 3096903, 3330894, 3137388, 3086300, 3175848, 3282067, 3091207, 3225287, 3261425, 3236618, 3278009, 3402481, 3056112, 3139850, 3382806, 3586708, 3661674, 3681471, 3584910, 3607108, 3407672, 3649640, 3611439, 3661528, 3717624, 3721181, 4052155, 3985654, 4028710, 3831417, 3971430, 3947402, 3824860, 4155455, 3992199, 4206316, 3945438]
11419C945438R0708n1022L25954l80952J21245P8700R5464j76030J8175K06058
11409D273738J16033l17242K49747r0525O9528J25922R0903J52097K23141j4273
11399D879069n3753J92327k96186J80464J22122J14046J28215Q8969J19934j48245
11389E326962J11488N2915Q5777J96526P9805m7595j0382L03370k19337K90176
11379F169705Q8278j5471K7865L882J3630J26525O777J06205J29163k55674L33719
11368F734604j3642K09621r0949K6361o8139M9010p5159j8911q8525L92178l35101
11357F721348J91458K86508k4412k36404l04689L72987P7229n8387J45926k80100
11347F891464K12269j19937j30745L45761j83019L377k2085J75802j53986P466
$$ y = [3945438, 4036146, 3985124, 4311078, 3930126, 4051371, 4130071, 4225535, 4049505, 4067680, 4273738, 4389771, 4072529, 4322276, 4231751, 4301279, 4427201, 4518104, 4670201, 4893342, 4879069, 4825316, 5017643, 4721457, 4901921, 5024043, 5138089, 5266304, 5355273, 5475207, 5326962, 5438450, 5491365, 5577142, 5773668, 5853473, 5805878, 5795496, 6098866, 5879529, 6169705, 6257983, 6242512, 6270377, 6274259, 6287889, 6414414, 6421191, 6527396, 6656559, 6400885, 6734604, 6720962, 6930583, 6839634, 6865995, 6797856, 6846866, 6771707, 6752796, 6664271, 7056449, 6721348, 6912806, 7199314, 7174902, 6938498, 6633809, 7006796, 7084025, 7025638, 7171564, 6891464, 7103733, 6983796, 6853051, 7198812, 7015793, 7019170, 6997085, 7172887, 7018901, 7026367]
11337G026367j88113J40368J4811j51589l49291Q9494j4720o2660J35908l01846
11327F338729k00976K33447j49081k84838J62188j94456K02810j55632j18477
11318E833714q542n3868j49451J518m3318k46343q6980o2659j62084K22934k61988
11307D982933k22347j16631p7204n5897j42568P0220j8601k31581J07270k11990
11297D083604j57805J10337J869j19421j52698j70660R060J23854j35329l17113
11287C275698L3357L36780j80403k7439j83733K0625q4425k52132L7042J05738
11277C081108l61445M1817M9211J67449j90191o2049o606J42971j55510j8535
11267B688220N207M4240L8456R3151N6968k61803r7922J61757j5223q4594j96598
$$ y = [7026367, 6838254, 6978622, 6993433, 6841844, 6492553, 6582047, 6567327, 6504667, 6640575, 6338729, 6137753, 6371200, 6222119, 5937281, 6099469, 5905013, 6107823, 5952191, 5833714, 5825172, 5771304, 5621853, 5623371, 5580053, 5333710, 5246730, 5184071, 5021987, 5244921, 4982933, 4760586, 4643955, 4566751, 4510854, 4368286, 4438506, 4419905, 4188324, 4295594, 4083604, 3925799, 4036136, 4038005, 3918584, 3765886, 3595226, 3604286, 3728140, 3592811, 3275698, 3309055, 3645835, 3465432, 3437993, 3254260, 3274885, 3190460, 2938328, 2975370, 3081108, 2719663, 2761480, 2810691, 2978140, 2787949, 2725900, 2719294, 2862265, 2706755, 2688220, 2693427, 2737667, 2776123, 2869274, 2926242, 2664439, 2566517, 2728274, 2713051, 2628457, 2431859]
11256B431859K19058j50684L0086r3780K01596n7009j66956J31314K9804L4626
11246B609914j00744j61029K40242r7524j03269O6478K08083j72359K8928R3417
11236B612137j15460j20448J16298J9720J45395J30762j34112k02604K16348J82527
11226B850563J69028M4546O63023O54618Q24118R43915R88676L77016M29906L7282
11216G982691j64951m93071j230281j359967q39195m25323n03350n451L3857l04052
11206B690907J59928m20749O7482N6867O6009r1467K18656p6379M9708K71251
11196B992213J52496M19292R45137Q82828J058049N29004N35055N31612l76963
11187G668723K53214p31712j294561j294918q36210m74999k36323k21617J22376
$$ y = [2431859, 2650917, 2500233, 2530319, 2436539, 2638135, 2581126, 2414170, 2545484, 2575288, 2609914, 2509170, 2348141, 2588383, 2490859, 2387590, 2454068, 2662151, 2489792, 2518720, 2612137, 2496677, 2376229, 2492527, 2512247, 2657642, 2788404, 2654292, 2451688, 2668036, 2850563, 3019591, 3064137, 3727160, 4381778, 5205896, 6149811, 7138487, 7515503, 7945409, 7982691, 7817740, 7324669, 6094388, 4734421, 3895226, 3469903, 2966553, 2961102, 2994959, 2690907, 2850835, 2430086, 2497568, 2554435, 2620444, 2528977, 2747633, 2671254, 2720962, 2992213, 3144709, 3564001, 4509138, 5391966, 6450015, 6979019, 7514074, 8045686, 7668723, 7921937, 7190225, 5895664, 4600746, 3764536, 3289537, 3053214, 2831597, 2953973]
11178B953973q6467q4081j31218J83334n5070j15650M9404K8261Q9914j41219
11168B691181P0952n0968N3473O8173J3584O0771l1837J62628j67778m5247o1010
11157B763922J92520K9336P2472k16646J04017O9728n6552R510j6339K6996Q3118
11146C062082p4189q9107J54573j20958L10175Q016j84884m9990J34268J24360
11136C274346n3753k5362J48776k07475K18584j34081J52919L353l5862J57215
11126C498660k16827J49987l9505N088J54180p6481P7998O7790j2595j81855n368
11115C421072K08832N434J17232j23775K0306O1084l50688J46866J05914Q8635
11105C700912j77901R4819J02931j65707M9261k02890P5438J68515j68180l38921
$$ y = [2953973, 2867506, 2783425, 2652207, 2835541, 2780471, 2664821, 2714225, 2742486, 2832400, 2691181, 2762133, 2711165, 2764638, 2832811, 2846395, 2907166, 2875329, 3037957, 2870179, 2824932, 2763922, 2956442, 2985778, 3058250, 2841604, 2945621, 3015349, 2958797, 2968307, 2951968, 2978964, 3062082, 2987893, 2898786, 3053359, 2932401, 3242576, 3250592, 3065708, 3015718, 3149986, 3274346, 3220593, 3195231, 3344007, 3136532, 3355116, 3221035, 3373954, 3377307, 3341445, 3498660, 3281833, 3431820, 3392315, 3397403, 3551583, 3475102, 3553100, 3620890, 3608295, 3426440, 3421072, 3629904, 3635338, 3752570, 3628795, 3649101, 3710185, 3359497, 3506363, 3612277, 3700912, 3523011, 3617830, 3720761, 3555054, 3604315, 3401425, 3476863, 3645378, 3477198, 3138277]
11095C138277J29771K25180l26993L05322k53180J22767J2340n3157J54412j63794
11085C290945j78037L03241J44589k76142J00862j41090K50789l93315L6732J59768
11075C298342P3158l7583o8484p5933J32672j39653L19977J84158k37358K12033
11065C661329k25033j12505L72708k6440o1780L793J91937J42976k66699J53340
11055C833626K28451p7682j94428J84688r0867j04622R774L1140P5517q1593K90057
11044D104061k78022M8534K51470J8367n0912l6570L7033M3952K45471R1331J56466
11033D631181r1030O4554O8719K29003J55998M2646o3086K13775j40589N55569
11023E666740J11111O3915J8984Q5916K2887j4799R590P3008M4852J2185M16100
$$ y = [3138277, 3268048, 3493228, 3166235, 3471557, 3218377, 3341144, 3353484, 3300327, 3454739, 3290945, 3112908, 3416149, 3560738, 3284596, 3385458, 3244368, 3495157, 3101842, 3138574, 3298342, 3371500, 3333917, 3265433, 3189500, 3322172, 3182519, 3502496, 3686654, 3449296, 3661329, 3436296, 3323791, 3696499, 3670059, 3608279, 3612072, 3804009, 3946985, 3680286, 3833626, 4062077, 3984395, 3789967, 3974655, 3883788, 3779166, 3788940, 3820080, 3895597, 3814004, 4104061, 3826039, 3874573, 4126043, 4144410, 4093498, 4056928, 4093961, 4137913, 4383384, 4474715, 4631181, 4540151, 4604705, 4673424, 4902427, 5058425, 5101071, 5037985, 5251760, 5111171, 5666740, 5777851, 5841766, 5860750, 5946666, 5969553, 5954754, 5964344, 6037352, 6082204, 6094389, 6510489]
11012F510489m4474J89150l14293J29841K6658K82753K96887j41878K69807J87631
11002G392571N7026J24140J75757J81402K04188Q7079K2925L55880m5639L38557
10992H893886j89881J16470K63657k7449J93279K9857J5350J753K65814j03213
10982I459523M33778K76816L31539K81738J10009N33590k4264K21670r728P5339
10972A1690010J01320k3942o6513K82967J93319L12311K07297K48592L00850K38151
10962A3484362J67342M9947O96708R5724J64180K02307K59449M63050M25881M34129
10952A6443079K97882J52735K43476O05426J12644K37658M56168j74524M15817
10943A8790361J22418K86847K66940L67906N70885M28492J63043L03850N24350
$$ y = [6510489, 6466015, 6655165, 6340872, 6470713, 6497371, 6780124, 7077011, 6935133, 7204940, 7392571, 7449597, 7573737, 7749494, 7930896, 8135084, 8222163, 8245088, 8600968, 8555329, 8893886, 8704005, 8820475, 9084132, 9056683, 9249962, 9279819, 9295169, 9296922, 9562736, 9459523, 9893301, 10170117, 10501656, 10783394, 10893403, 11426993, 11402729, 11624399, 11614671, 11690010, 11791330, 11767388, 11700875, 11983842, 12177161, 12489472, 12696769, 12945361, 13246211, 13484362, 13651704, 13701651, 14398359, 14494083, 14658263, 14860570, 15120019, 15583069, 16008950, 16443079, 16740961, 16893696, 17137172, 17742598, 17855242, 18092900, 18549068, 18374544, 18790361, 18912779, 19199626, 19466566, 19834472, 20405357, 20833849, 20996892, 21300742, 21825092]
10934B1825092M04764L94468K96495O17564O51133K21016L62195M54855L05195
10925B5532777N53116N95966N21993O85870K75415O54643L16137M61281J58069
10916B9755267N0476L8641j81582J9203P9223j10268k34323J82209m4158N6233
10906B9610921p9001K25347q501n2823J91481J5678K12686m1255J27483K77621
10896C0479637K69121K72725J56763K61049L04694N37647N06242K86589Q70302
10887C3944769P82037N59566Q04436R55205J278802J122129J417824J991399J596611
10878D4452778K008732K212183K415725K723700K471191K886485K610456K259924
10870F4041174K134594J956881J222165Q63881K47860l98276m26202j338067j558425
$$ y = [21825092, 22229856, 22624324, 22920819, 23538383, 24189516, 24410532, 24772727, 25227582, 25532777, 26085893, 26681859, 27203852, 27889722, 28165137, 28819780, 29135917, 29597198, 29755267, 29805743, 29844384, 29662802, 29682005, 29761228, 29650960, 29416637, 29598846, 29554688, 29610921, 29531920, 29757267, 29748766, 29695943, 29887424, 29903102, 30115788, 30074533, 30202016, 30479637, 30748758, 31021483, 31178246, 31439295, 31743989, 32281636, 32787878, 33074467, 33944769, 34726806, 35286372, 36090808, 37046013, 38324815, 39446944, 40864768, 42856167, 44452778, 46461510, 48673693, 51089418, 53813118, 56284309, 59170794, 61781250, 64041174, 66175768, 68132649, 69354814, 70218695, 70466555, 70068279, 69642077, 68304010, 66745585]
10861F6745585j887825k120888k552538k484082k790610k731560k232812k620218
10853D7325052k465955k612761k206786k319147k179938k052048j731310j956282
10845B9800825j730825j612014j578369j290791j327809j225774j213675j193194
10837A8628374q70847p56996j025051o41600r48059l91106r41033m69228l66581
10828A2217873p14185m99353m55258n20505j26677m74239j96355m99710l95507
10819H336084k79228j37578k14105M2538l43483j24941j04577m0810j47523m1979
10809F944398m7866k07546k18699p6788k57538m08172R2169l25104j83257l22134
10799D989463j47736R3759m30359O0008j75358r9299M366N8131q6139j95215m35
$$ y = [66745585, 64857760, 62736872, 60184334, 57700252, 54909642, 52178082, 49945270, 47325052, 44859097, 42246336, 40039550, 37720403, 35540465, 33488417, 31757107, 29800825, 28070000, 26457986, 24879617, 23588826, 22261017, 21035243, 19821568, 18628374, 17757527, 17000531, 15975480, 15333880, 14385821, 13994715, 13053682, 12584454, 12217873, 11503688, 11004335, 10549077, 10028572, 9901895, 9427656, 9231301, 8731591, 8336084, 8056856, 7919278, 7705173, 7747711, 7404228, 7279287, 7174710, 7133900, 6986377, 6944398, 6896532, 6688986, 6470287, 6393499, 6135961, 5727789, 5819958, 5494854, 5311597, 4989463, 4841727, 4935486, 4505127, 4565135, 4389777, 4290478, 4294844, 4352975, 4266836, 4071621, 4071186]
10788D071186k67660L2541R6321k4514k31838K6582L73072j96816k81390J15673
10778C713157j43137Q6803k42757r1903K8956j23594l6486l3902o3180k69807
10768B824150J97712J67003j10605k49870J21996m5023N9722j29329J70976k25224
10758B781508J16995j6758j40294N2135K39387j69487K4639J21148P3411k5533
10748C057151l7548J70713l21380J58572l17526j00875j82924R9972k8259k9061
10738B468835j92439L80443j69078j62480L26904q2392n5419J68353n5716p7408
10728B549603J17320J1928K02493j86421M7094l1133j20091N5719n868l25709
10718B314935L55266k14892K11343r7831J60827l35126K08537L4238M3137j25203
$$ y = [4071186, 3803526, 3836067, 3932388, 3907874, 3676036, 3702618, 4075690, 3878874, 3597484, 3713157, 3570020, 3656823, 3414066, 3322163, 3351119, 3227525, 3191039, 3157137, 3093957, 2824150, 3021862, 3188865, 3078260, 2828390, 2950386, 2905363, 2965085, 2835756, 3006732, 2781508, 2898503, 2881745, 2741451, 2793586, 3032973, 2863486, 2888125, 3009273, 3082684, 3057151, 3019603, 3190316, 2868936, 3027508, 2709982, 2609107, 2426183, 2526155, 2497896, 2468835, 2276396, 2656839, 2487761, 2325281, 2652185, 2569793, 2514374, 2682727, 2627011, 2549603, 2666923, 2678851, 2881344, 2694923, 2742017, 2710884, 2590793, 2646512, 2640644, 2314935, 2670201, 2455309, 2666652, 2568821, 2729648, 2394522, 2603059, 2637297, 2680434, 2555231]
10708B555231j07237L24821j54862Q532o426j4897j11155K75763k94246j00727
10698B374797J35344J18848l47701M1199k34353L70109r9222n3135P7496J12056
10688B495438j85798K00905j88523K07019l63650J00633P144M3150J54846j90750
10678B280414J11591k11794J08296K375K8109J05559r4018r704K20631n61068
10668A980391K49149j53232j90909J30358Q0160p5977r3121O0428J65400l36495
10658A816152J12996r5580L3419L6266j01568L03077J674M2213j35858K38103
10648B250894n2102L4072o5274j81164n463o4932N9725k15498o6628K11241k1053
10637A883818O5012k35906M4265k10266N1642r0833O4877J38167r608j34772o9628
$$ y = [2555231, 2447994, 2772815, 2617953, 2626485, 2620059, 2605162, 2494007, 2769770, 2475524, 2374797, 2510141, 2628989, 2281288, 2322487, 2088134, 2458243, 2359021, 2305886, 2383382, 2495438, 2309640, 2510545, 2322022, 2529041, 2165391, 2266024, 2273168, 2316318, 2471164, 2280414, 2392005, 2180211, 2288507, 2290882, 2318991, 2424550, 2330532, 2320828, 2541459, 1980391, 2229540, 2076308, 1885399, 2015757, 2095917, 2019940, 1926819, 1987247, 2152647, 1816152, 1929148, 1833568, 1866987, 1903253, 1801685, 2104762, 2106436, 2148649, 2012791, 2250894, 2198792, 2232864, 2167590, 1986426, 1980963, 1916031, 1975756, 1760258, 1693630, 1904871, 1883818, 1948830, 1712924, 1757189, 1546923, 1598565, 1507732, 1572609, 1710776, 1701168, 1566396, 1496768]
10626A496768J00305J26263j02558j1627J26951o8815J12055j69325j16769L35844
10616A829092j96964j51354K40500J6193l500J1835o1465K2095j31821Q5602j50066
10605A510147J39928K04103j67142K23404k06480J01866o9383j55120j4374n773
10595A561176p5236J33282P2843l9190j11597q4327J48909J54888j87884k6073
10585A546791J88519q0074j55576P4276M31329j71112r6872N2464j94408m8212
10575A547125J1047q5322L40601j45956j17382K29491j73288l05085O0602J96309
10565A558142m5824J34983j61898k74676K00496k82208J15663J77652j69048k04662
10555A048620P6591L22265J00311j37524N945j1621k36013L36906j28719r9548
$$ y = [1496768, 1597073, 1723336, 1620778, 1609151, 1736102, 1667287, 1779342, 1610017, 1493248, 1829092, 1632128, 1480774, 1721274, 1737467, 1733967, 1745802, 1684337, 1706432, 1574611, 1660213, 1510147, 1650075, 1854178, 1687036, 1910440, 1703960, 1805826, 1736443, 1581323, 1566949, 1561176, 1485940, 1619222, 1692065, 1652875, 1541278, 1456951, 1605860, 1760748, 1572864, 1546791, 1735310, 1655236, 1499660, 1573936, 2005265, 1834153, 1737281, 1789745, 1595337, 1547125, 1558172, 1472850, 1813451, 1667495, 1550113, 1779604, 1606316, 1301231, 1361833, 1558142, 1512318, 1647301, 1485403, 1210727, 1411223, 1129015, 1244678, 1422330, 1253282, 1048620, 1125211, 1447476, 1547787, 1410263, 1416208, 1404587, 1168574, 1505480, 1376761, 1277213]
10545A277213j52102L12442k51729k5447M0940J34975l5944j32247K55595N6230
10535A479926j24826P472L1728q9505J24469L0736M3194o9934o9917Q9572j66798
10524A286117L26713j11511J14022p6090J40659K96635L3098K27955K8525L93077
10514B659200j20222j89363M3844j15813k97937k02004l2501j82098o5954q340
10504A488812Q9577J07489k13240M5927K33820l08069M13669l4216j21543M2215
10494A744441o6735J10984O4107J02555J92081N8436L40783q7424J33222P3615
10484B666065k7610j16842j97763l06037j16735j40031p3289J12048O4560j87352
10474A677014K52767k11207k505K24402j37217M1468K13480P6251L6667P5676
$$ y = [1277213, 1125111, 1437553, 1185824, 1160377, 1201317, 1336292, 1300348, 1168101, 1423696, 1479926, 1355100, 1362572, 1394300, 1304795, 1429264, 1460000, 1503194, 1433260, 1363343, 1452915, 1286117, 1612830, 1501319, 1615341, 1539251, 1679910, 1976545, 2009643, 2237598, 2266123, 2659200, 2538978, 2349615, 2393459, 2277646, 1979709, 1777705, 1745204, 1563106, 1497152, 1488812, 1578389, 1685878, 1472638, 1518565, 1752385, 1444316, 1857985, 1823769, 1702226, 1744441, 1677706, 1788690, 1852797, 1955352, 2147433, 2205869, 2546652, 2459228, 2592450, 2666065, 2638455, 2521613, 2323850, 2017813, 1901078, 1761047, 1687758, 1799806, 1864366, 1677014, 1929781, 1718574, 1716069, 1940471, 1803254, 1844722, 2058202, 2134453, 2171120, 2246796]
10464B246796J68585J23391q5551J18574n3041K80785l30744k92817l3719J83913
10454B326172k51047L68539J18453J5019k5663J12927j95994K35082K2808k84951
10444B441345l574K859p5373N1277j52534L05985N10860r9380M22374N3917K89229
10433C746985n7498O9065m70992j30503n95344k62549k02440J1058q9161o1971
10423A956650J59441j2030k9230n5073J9294K29989M6877l10092n9335K62656
10413B209147j49772J60558K48672J61168M11314K53336O9567L74614K18893J36998
10403D094495M41763k3468j70694l58467J94101R3313M7715K26475M3710K02991
10393D791934K68043L95650J72069m1023M02311j82169P4821K54331l62950k4604
$$ y = [2246796, 2415381, 2538772, 2453221, 2571795, 2518754, 2799539, 2468795, 2175978, 2142259, 2326172, 2075125, 2443664, 2562117, 2577136, 2551473, 2664400, 2468406, 2703488, 2726296, 2441345, 2437771, 2440630, 2365257, 2416534, 2264000, 2569985, 3080845, 2981465, 3403839, 3457756, 3746985, 3689487, 3758552, 3287560, 3157057, 2561713, 2299164, 2096724, 2107782, 2018621, 1956650, 2116091, 2104061, 2074831, 2019758, 2039052, 2269041, 2315918, 2005826, 1946491, 2209147, 2059375, 2219933, 2468605, 2629773, 3041087, 3294423, 3363990, 3738604, 3957497, 4094495, 4536258, 4512790, 4342096, 3983629, 4177730, 4271043, 4318758, 4545233, 4588943, 4791934, 5059977, 5455627, 5627696, 5586673, 5988984, 5806815, 5881636, 6135967, 5773017, 5748413]
10383E748413N7399k30363K1383Q757j04622r1076J2747J51156L49065j05543
10373E817316n8802K74503J3029J76086o1903J52283P6149K36170J95655Q3969
10363F904455n06520j55726l9321M0211k51129k30128j68271M8361r5109K6826
10353E573649j01469R7164l32139m23038J44684k81247k14436P7656l72979l2723
10343D135122j77484j77692J99049l33618J88132N9866K63013L15691j06187J72203
10333D538095k484p2473k8224j4132j89495o3146l04045l1477K81028l79655Q3976
10322C817968L22119k44311O3296n5331o4817o6065J56898J81662j87148K7124
10312C951395j6849J06243J07635K93400P6163K12086J16178K21821j92044J32658
$$ y = [5748413, 5805812, 5575449, 5596832, 5605589, 5500967, 5409891, 5422638, 5573794, 5922859, 5817316, 5758514, 6033017, 6046046, 6222132, 6160229, 6312512, 6388661, 6624831, 6820486, 6904455, 6397935, 6242209, 6202888, 6243099, 5991970, 5761842, 5593571, 5641932, 5546823, 5573649, 5472180, 5569344, 5237205, 4814167, 4958851, 4677604, 4463168, 4540824, 4167845, 4135122, 3957638, 3779946, 3978995, 3645377, 3833509, 3893375, 4156388, 4472079, 4365892, 4538095, 4535611, 4463138, 4434914, 4420782, 4231287, 4168141, 3864096, 3832619, 4113647, 3733992, 3817968, 4140087, 3895776, 3959072, 3903741, 3838924, 3772859, 3929757, 4111419, 3924271, 3951395, 3934546, 4040789, 4148424, 4441824, 4517987, 4730073, 4846251, 5068072, 4876028, 5008686]
10302E008686M81K9067j69019l78549o3105J46005j58006P2682r5524K38401k19720
$$ y = [5008686, 5009167, 5038234, 4869215, 4490666, 4427561, 4573566, 4415560, 4488242, 4392718, 4631119, 4411399]
$$ [...]
##END NTUPLES=NMR SPECTRUM
##END=
