##TITLE=Coffee green (M1-ROVE40 + 1.5mL buffer 50/50,  450uL extracto + 50uL (D2O+TMS))
without heating, vortex and centrifuged, temperature 0oC.
##JCAMPDX= 6.0         $$ Bruker NMR JCAMP-DX V2.0
##DATA TYPE= NMR SPECTRUM
##DATA CLASS= NTUPLES
##ORIGIN= Bruker BioSpin GmbH
##OWNER= Administrator
$$ 1.72 TOPSPIN		Version 2.1
$$ 2012-05-22 16:13:03.387 -0700  Administrator@X
$$ Compression mode = diff/dup
##.OBSERVE FREQUENCY= 400.13188198
##.OBSERVE NUCLEUS= ^1H
##.ACQUISITION MODE= SIMULTANEOUS (DQD)
##.ACQUISITION SCHEME= undefined
##.AVERAGES= 64
##.DIGITISER RES= 22
##SPECTROMETER/DATA SYSTEM= spect
##.PULSE SEQUENCE= noesygppr1d
##.SOLVENT NAME= H2O+D2O
##.SHIFT REFERENCE= INTERNAL, H2O+D2O, 1, 14.97969
##AUDIT TRAIL= $$ (NUMBER, WHEN, WHO, WHERE, PROCESS, VERSION, WHAT)
$$ ##TITLE= Audit trail, TOPSPIN		Version 2.1
$$ ##JCAMPDX= 5.01
$$ ##ORIGIN= Bruker BioSpin GmbH
$$ ##OWNER= Administrator
$$ $$ c:\Bruker\TOPSPIN/data/jwist/nmr/11-coffee-green-quantification-2/141/pdata/1/auditp.txt
$$ ##AUDIT TRAIL=  $$ (NUMBER, WHEN, WHO, WHERE, PROCESS, VERSION, WHAT)
(   1,<2011-11-17 17:00:34.482 -0500>,<Administrator>,<TOPSPIN>,<go>,<TOPSPIN 2.1>,
      <created by zg
	started at 2011-11-17 16:51:35.200 -0500,
	POWCHK enabled, PULCHK disabled,
       configuration hash MD5:
       DA 63 81 1B EF 4C B5 72 B4 DF EA D9 B4 DB 4C 08
       data hash MD5: 64K
       E0 C1 1D FB 0A 5C 85 FB 58 99 86 24 B1 A4 DC 43>)
(   2,<2011-11-17 18:22:03.091 -0500>,<Administrator>,<TOPSPIN>,<proc1d>,<TOPSPIN 2.1>,
      <Start of raw data processing
       efp LB = 0 FT_mod = 6 PKNL = 1 PHC0 = 0 PHC1 = 0 SI = 32K 
       data hash MD5: 32K
       BA 28 28 23 BB 42 B3 35 87 2E 3A 33 8F 64 03 EE>)
(   3,<2011-11-17 18:22:03.482 -0500>,<Administrator>,<TOPSPIN>,<proc1d>,<TOPSPIN 2.1>,
      <pk PHC0 = 23.19214 PHC1 = 0 
       data hash MD5: 32K
       43 78 28 F2 FD F9 FB 1D 71 03 D4 8A DD 9D 8D 38>)
$$ ##END=
$$ 
$$ $$ hash MD5
$$ $$ 81 04 D6 87 A7 37 7E 9E CB 35 64 D1 FA 8F 55 D3
##$RELAX= 
##$RELAX= 
##$RELAX= 
##$RELAX= 
##$RELAX= 
$$ Bruker specific parameters
$$ --------------------------
##$DU= <Z:>
##$EXPNO= 141
##$NAME= <11-coffee-green-quantification-2>
##$PROCNO= 1
##$TYPE= <nmr>
##$USER= <jwist>
##$ACQT0= -8.2241975839186
##$AMP= (0..31)
100 100 100 100 100 100 100 100 100 100 100 100 100 100 100 100 100 100
100 100 100 100 100 100 100 100 100 100 100 100 100 100
##$ANAVPT= -1
##$AQSEQ= 0
##$AQ_mod= 3
##$AUNM= <au_prof>
##$AUTOPOS= <>
##$BF1= 400.13
##$BF2= 400.13
##$BF3= 400.13
##$BF4= 400.13
##$BF5= 400.13
##$BF6= 400.13
##$BF7= 400.13
##$BF8= 400.13
##$BYTORDA= 0
##$CFDGTYP= 0
##$CFRGTYP= 9
##$CHEMSTR= <none>
##$CNST= (0..63)
1 1 145 1 1 1 1 1 1 1 1 1 1 1 1 1 1 1 1 1 1 1 1 1 1 1 1 1 1 1 1 1 1 1 1
1 1 1 1 1 1 1 1 1 1 1 1 1 1 1 1 1 1 1 1 1 1 1 1 1 1 1 1 1
##$CPDPRG= <>
##$CPDPRG1= <>
##$CPDPRG2= <>
##$CPDPRG3= <>
##$CPDPRG4= <mlev>
##$CPDPRG5= <mlev>
##$CPDPRG6= <mlev>
##$CPDPRG7= <mlev>
##$CPDPRG8= <mlev>
##$CPDPRGB= <>
##$CPDPRGT= <>
##$D= (0..63)
$$ [...]
##$TP= (0..7)
150 150 150 150 150 150 150 150
##$TP07= 0
##$TPNAME0= <>
##$TPNAME1= <>
##$TPNAME2= <>
##$TPNAME3= <>
##$TPNAME4= <>
##$TPNAME5= <>
##$TPNAME6= <>
##$TPNAME7= <>
##$TPOAL= (0..7)
0.5 0.5 0.5 0.5 0.5 0.5 0.5 0.5
##$TPOFFS= (0..7)
0 0 0 0 0 0 0 0
##$TUNHIN= 0
##$TUNHOUT= 0
##$TUNXOUT= 0
##$USERA1= <user>
##$USERA2= <user>
##$USERA3= <user>
##$USERA4= <user>
##$USERA5= <user>
##$V9= 5
##$VALIST= <valist>
##$VCLIST= <CCCCCCCCCCCCCCC>
##$VD= 0
##$VDLIST= <DDDDDDDDDDDDDDD>
##$VPLIST= <PPPPPPPPPPPPPPP>
##$VTLIST= <TTTTTTTTTTTTTTT>
##$WBST= 2048
##$WBSW= 25
##$XGAIN= (0..3)
0 0 0 0
##$XL= 0
##$YL= 0
##$YMAX_a= 5009991
##$YMIN_a= -2013970
##$ZGOPTNS= <>
##$ZL1= 120
##$ZL2= 120
##$ZL3= 120
##$ZL4= 120
##$ABSF1= 0
##$ABSF2= 0
##$ABSG= 0
##$ABSL= 0
##$ALPHA= 0
##$AQORDER= 0
##$ASSFAC= 0
##$ASSFACI= 0
##$ASSFACX= 0
##$ASSWID= 0
##$AUNMP= <proc_prof1d>
##$AXLEFT= 0
##$AXNAME= <>
##$AXNUC= <1H>
##$AXRIGHT= 0
##$AXTYPE= 0
##$AXUNIT= <>
##$AZFE= 0.1
##$AZFW= 0.1
##$BCFW= 0
##$BC_mod= 0
##$BYTORDP= 0
##$COROFFS= 0
##$CY= 15
##$DATMOD= 1
##$DC= 0
##$DFILT= <>
##$DTYPP= 0
##$F1P= 0
##$F2P= 0
##$FCOR= 0.5
##$FTSIZE= 32768
##$FT_mod= 6
##$GAMMA= 0
##$GB= 0
##$INTBC= 1
##$INTSCL= 1
##$ISEN= 128
##$LB= 0
##$LEV0= 0
##$LPBIN= 0
##$MAXI= 10000
##$MC2= 0
##$MEAN= 0
##$ME_mod= 0
##$MI= 0
##$NCOEF= 0
##$NC_proc= -6
##$NLEV= 6
##$NOISF1= 0
##$NOISF2= 0
##$NSP= 0
##$NTH_PI= 0
##$NZP= 0
##$OFFSET= 14.97969
##$PC= 1
##$PHC0= 23.19214
##$PHC1= 0
##$PH_mod= 1
##$PKNL= yes
##$PPARMOD= 0
##$PPDIAG= 0
##$PPIPTYP= 0
##$PPMPNUM= 2147483647
##$PPRESOL= 1
##$PSCAL= 4
##$PSIGN= 0
##$PYNMP= <proc.py>
##$REVERSE= no
##$SF= 400.13
##$SI= 32768
##$SIGF1= 0
##$SIGF2= 0
##$SINO= 400
##$SIOLD= 32768
##$SPECTYP= <>
##$SREGLST= <1H.CDCl3>
##$SSB= 0
##$STSI= 32768
##$STSR= 0
##$SW_p= 8223.68421052631
##$SYMM= 0
##$S_DEV= 0
##$TDeff= 65536
##$TDoff= 0
##$TI= <>
##$TILT= no
##$TM1= 0
##$TM2= 0
##$TOPLEV= 0
##$USERP1= <user>
##$USERP2= <user>
##$USERP3= <user>
##$USERP4= <user>
##$USERP5= <user>
##$WDW= 1
##$XDIM= 32768
##$YMAX_p= 366942123
##$YMIN_p= -73738116
##$CURPLOT= <Network HP LaserJet P1505>
##$CURPRIN= <$Network HP LaserJet P1505>
##$DFORMAT= <normdp>
##$LAYOUT= <+/1D_H.xwp>
##$LFORMAT= <normlp>
##$PFORMAT= <normpl>
##$SURQMSG= 1
$$ End of Bruker specific parameters
$$ ---------------------------------
##NTUPLES= NMR SPECTRUM
##VAR_NAME=  FREQUENCY,     SPECTRUM/REAL,   SPECTRUM/IMAG
##SYMBOL=    X,             R,               I
##VAR_TYPE=  INDEPENDENT,   DEPENDENT,       DEPENDENT
##VAR_FORM=  AFFN,          ASDF,            ASDF
##VAR_DIM=   32768,         32768,           32768
##UNITS=     HZ,            ARBITRARY UNITS, ARBITRARY UNITS
##FACTOR=    0.250966925370066, 1,           1
##FIRST=     8223.43324360094, -12686,       -108170
##LAST=      0,             6892,            -138796
##MIN=       0,             -73738116,       0
##MAX=       8223.43324360094, 366942123,    0
$$ Real data points
##PAGE= N=1
##DATA TABLE= (X++(R..R)), XYDATA
$$ [...]
19683A934797J17174k621q3884O8244j31963n8325K36221l09226J76929R2940
$$ 1934797 2051971 2049350 1965466 2033710 1901747 1843422 2079643 1770417 1947346 2040286
19673B040286k6279m6141p7292Q4985m9867j23893J84531k66619K25668k12089
$$ 2040286 2014007 1967866 1890574 1975559 1925692 1801799 1986330 1719711 1945379 1733290
19663A733290L36366k57155K22521q9627j87185O0440o1332M0275K19237j05555
$$ 1733290 2069656 1812501 2035022 1945395 1758210 1818650 1757318 1797593 2016830 1911275
19653A911275K3404O4582n7346j16447K18098P7255k18331m1567k0518j85674
$$ 1911275 1934679 1999261 1941915 1825468 2043566 2120821 1902490 1860923 1840405 1654731
19643A654731K24617O7641r3762L43167k61301p4511Q4316L5946J01898k39589
$$ 1654731 1879348 1946989 1853227 2196394 1935093 1860582 1944898 1980844 2082742 1843153
19633A843153Q7228J29948j72465P88j8877j32836J79107j81230J25121m517M6685
$$ 1843153 1930381 2060329 1887864 1888652 1869775 1736939 1916046 1734816 1859937 1855420 1902105
19622A902105r3878n4986j49710K93465k14603J32880N1363k15009J85668j98008
$$ 1902105 1808227 1753241 1603531 1896996 1682393 1815273 1866636 1651627 1837295 1639287
19612A639287J67728J10135k61390J76161j1225k53785M4034J2517J33285j98612
$$ 1639287 1807015 1917150 1655760 1831921 1820696 1566911 1610945 1623462 1756747 1558135
19602A558135Q1460M3334l7769r808J8923O2166k11838J94193M3118m69085L69112
$$ 1558135 1639595 1682929 1645160 1635352 1654275 1716441 1504603 1698796 1741914 1272829 1641941
19591A641941J10806l0893k15808J16516Q0355j57251k2218j0960j47800J93264
$$ 1641941 1752747 1721854 1506046 1622562 1702917 1545666 1523448 1512488 1364688 1557952
19581A557952j9007K6302n054M6487k34915J38400M9816o0296K9626M9906J1666
$$ 1557952 1538945 1565247 1560193 1606680 1371765 1510165 1559981 1499685 1529311 1579217 1590883
19570A590883j70410N0363q2162L62308l46276J01128j04620L76044l2701l49661
$$ 1590883 1420473 1470836 1388674 1750982 1404706 1505834 1401214 1777258 1744557 1394896
19560A394896j22904K23245j268n6109r7292R5708O404m7068J77182k81990J99986
$$ 1394896 1271992 1495237 1493969 1437860 1340568 1436276 1442680 1395612 1572794 1290804 1490790
19549A490790m9636k5995O5020L1881j10155k5372K19342n27555L64730Q3591
$$ 1490790 1441154 1415159 1480179 1512060 1401905 1376533 1595875 1068320 1433050 1516641
19539A516641k29613L68143k11820K5626K05855l42858L90836m65390J51176k03812
$$ 1516641 1287028 1655171 1443351 1468977 1674832 1331974 1722810 1257420 1408596 1204784
19529A204784K44222J0101J70780j07016J17061k62110P6516k25493K18557K1234
$$ 1204784 1449006 1459107 1629887 1522871 1639932 1377822 1454338 1228845 1447402 1468636
19519A468636r3016J98682o0352Q2855n5892L5543r8106k08540J3621J51833q9135
$$ 1468636 1375620 1574302 1513950 1596805 1540913 1576456 1478350 1269810 1283431 1435264 1346129
19508A346129L82247l39492j54467k0310K64984j46946j42758J7668K1866K26748
$$ 1346129 1728376 1388884 1234417 1214107 1479091 1332145 1189387 1207055 1228921 1455669
19498A455669J0907p0547j30240j47322L07335j54788j19776K22973L4249k4309
$$ 1455669 1466576 1396029 1265789 1118467 1425802 1271014 1151238 1374211 1408460 1384151
19488A384151r8547N6643Q4426q9730j08110j01449J80427j95494L219J60305
$$ 1384151 1285604 1342247 1426673 1336943 1228833 1127384 1307811 1112317 1115536 1275841
19478A275841j47256j16457k3441m9860L25804j46780r1028J16936j65392J22573
$$ 1275841 1128585 1012128 988687 938827 1264631 1117851 1026823 1143759 978367 1100940
19468A100940K7221j4847N9186q7395j06264M017K57579j24284m0149n9171J22657
$$ 1100940 1128161 1113314 1172500 1085105 978841 982858 1240437 1116153 1076004 1016833 1139490
19457A139490l544j36392j32128L8430m7331J21996K1436o8224q7509R8306n5721
$$ 1139490 1135946 999554 867426 905856 858525 980521 1001957 933733 846224 944530 888809
19446H88809p0814J55386l04685L83927l9624m6885O0531k37165J88690j97961
$$ 888809 817995 973381 668696 1052623 1012999 966114 1026645 789480 978170 780209
19436G80209l2303K35683j48376N1090k07920R6442o1092j17513L57108k0474
$$ 780209 747906 983589 835213 886303 678383 774825 713733 596220 953328 932854
19426I32854k21689J6609Q8615J81909r4037r7192K2151r464r663J64521q4478
$$ 932854 711165 727774 816389 998298 904261 807069 829220 819756 810093 974614 890136
19415H90136n6563p2212K75205k66782J12586j36323j99147N48354j36641n5077
$$ 890136 833573 761361 1036566 769784 882370 746047 546900 1095254 958613 903536
19405I03536k86638J43182Q1446j6388M9857k66882L87688k6155k31947O9726
$$ 903536 616898 760080 841526 825138 874995 608113 995801 969646 737699 807425
19395H07425K75930j85933J01057j53235J89731j96046o2772J09988J20924j43452
$$ 807425 1083355 897422 998479 845244 1034975 838929 776157 886145 1007069 863617
19385H63617J31998l40241J40706K15268J4686k46367L5854K48038k82971O1071
$$ 863617 995615 655374 796080 1011348 1026034 779667 815521 1063559 780588 841659
19375H41659J42160J1337j4332j4658o7632k09849J97104N5387o0839j8629l24812
$$ 841659 983819 995156 980824 966166 898534 688685 885789 941176 880337 861708 536896
19364E36896L70394M1694j25496k1005o9975J33039P2124j63647L91087l31934
$$ 536896 907290 948984 823488 802483 732508 865547 937671 774024 1165111 833177
19354H33177o287o6837J3856J27716Q4413k80256K30768k5698j037j19004j69033
$$ 833177 826890 760053 773909 901625 986038 705782 936550 910852 909815 790811 621778
19343F21778K92128q8732P0109J6266j78719q79Q8227j6690o4812j9337J25349
$$ 621778 913906 825174 895283 911549 732830 731951 820178 803488 738676 719339 844688
19332H44688J16666j87728K93299Q8641l75135J25551m1997j63355M40613l93162
$$ 844688 961354 773626 1066925 1155566 780431 905982 863985 700630 1141243 748081
19322G48081n6120l0981M9131K55983j41165L648P8287L15565k52916j82382M4579
$$ 748081 691961 660980 710111 966094 824929 828577 906864 1222429 969513 787131 831710
19311H31710M6452n4578K0297L4618N3234L2952n4559N752p8312J08414n3566
$$ 831710 878162 823584 843881 878499 931733 964685 910126 915878 837566 945980 892414
19300H92414M5262j69722J65366l8491N5215J57293k85948L814O7167p8061O5234
$$ 892414 937676 767954 933320 894829 950044 1107337 821389 825203 892370 814309 879543
19289H79543k09810K47700o0009k2368k89444L27159k43401J9885K78248k15695
$$ 879543 669733 917433 857424 835056 545612 872771 629370 649255 927503 711808
19279G11808o1912Q417L87004l24295Q3997L6543L2045k91756R6518k194J08383
$$ 711808 649896 658313 1045317 721022 805019 841562 873607 581851 678369 676175 784558
19268G84558R3473j22030J35110j67351j12733R8099J67046k18780R9889N993
$$ 784558 878031 756001 891111 723760 611027 709126 876172 657392 757281 763274
19258G63274L633j3244O2737j02865j0986n2953K50852K898j81488j15598Q4780
$$ 763274 766907 753663 816400 713535 702549 649596 900448 903346 721858 606260 691040
19247F91040o7868K27749n2821J52412l1792K76784L3763J94633J42572k46398
$$ 691040 623172 850921 798100 950512 918720 1195504 1229267 1423900 1566472 1320074
19237A320074J23614p5203j0449k05434m1326j12660J26674J37710m68967j54488
$$ 1320074 1443688 1368485 1358036 1152602 1111276 998616 1125290 1263000 794033 639545
19227F39545K2402J64717J36458o832Q413l55750J86915Q0703J04114l61361K10701
$$ 639545 661947 826664 963122 956290 964703 608953 795868 876571 980685 619324 830025
19216H30025m805r4664l57964K84928J41911n1923m5470J32047R0689l28717N3236
$$ 830025 825220 730556 372592 657520 799431 747508 702038 834085 924774 596057 649293
19205F49293K66440j29573J35243k26535j7035q004P4453L230k04360N8833J11081
$$ 649293 915733 786160 921403 694868 677833 669829 744282 747512 543152 601985 713066
19194G13066o7289J49Q8925J26084l39513K00947J3708r1272M2546K359M3986
$$ 713066 645777 645926 734851 860935 521422 722369 736077 644805 687351 689710 733696
19183G33696K94048k33873N9590j19497q6044J04309Q8308r9551k6851J21222
$$ 733696 1027744 793871 853461 733964 647920 752229 840537 740986 714135 835357
19173H35357p5877O2966j37962N1717j22438L2050J59362L47589j63824K18207
$$ 835357 759480 822446 684484 736201 613763 645813 805175 1152764 988940 1207147
19163A207147K0575k008J05003o909j96142K16721k77648m597q9067J18808j06240
$$ 1207147 1227722 1225714 1330717 1323808 1127666 1344387 1066739 1062142 973075 1091883 985643
19152I85643O53K00210j62438K83826k51827N1545J87893M6387j77797k48671
$$ 985643 986296 1186506 1024068 1307894 1056067 1107612 1295505 1341892 1164095 915424
19142I15424L4476J50748o5821J38236j80472K3464P7714k64694P4772J29470
$$ 915424 949900 1100648 1034827 1173063 992591 1016055 1093769 829075 903847 1033317
19132A033317n4906k13289K06033N8336j23934N2418j19718K21742k1561k8626
$$ 1033317 978411 765122 971155 1029491 905557 957975 838257 1059999 1038438 1009812
19122A009812j35497K71716p6516k8562J40028M2963k33832l6535j0441K46148
$$ 1009812 874315 1146031 1069515 1040953 1180981 1223944 990112 953577 943136 1189284
19112A189284k05802L0771J4104m0635K57202j79980K8141J4663l7630K73113
$$ 1189284 983482 1014253 1028357 987722 1244924 1064944 1093085 1107748 1070118 1343231
19102A343231J14243P9065Q1029K29144J98974K61156K3126L70569K84578M15318
$$ 1343231 1457474 1536539 1617568 1846712 2045686 2306842 2329968 2700537 2985115 3400433
19092C400433P52026K5801M23702N4253M56988k42424j88096m88310j69293n28743
$$ 3400433 4152459 4178260 4601962 4656215 5113203 4870779 4682683 4194373 4025080 3496337
19082C496337n25291l30223j69764k82962j98919j90161j09171R4709L28305n47060
$$ 3496337 2971046 2640823 2471059 2188097 1989178 1799017 1689846 1784555 2112860 1565800
19072A565800M53576J22267J71770K84322N75114O13955M90958k71937M08323
$$ 1565800 2019376 2141643 2313413 2597735 3172849 3786804 4277762 4005825 4414148
19063D414148M0313j14161K9691l01093n16176l8401l95867l9073O8326L8769
$$ 4414148 4454461 4340300 4369991 4068898 3552722 3514321 3118454 3079381 3147707 3186476
19053C186476N01997K85520L75423L6465M70817q3725J13958k91802k26593o50516
$$ 3186476 3688473 3973993 4349416 4385881 4856698 4772973 4886931 4595129 4368536 3718020
19043C718020l23267m29496m63250k78562J8005k54327K8259k07832J48163K77033
$$ 3718020 3394753 2965257 2502007 2223445 2241450 1987123 2015382 1807550 1955713 2232746
19033B232746m3954L58988R1742N76680L66921O38078J71935K95222J4367M7944
$$ 2232746 2188792 2547780 2639522 3216202 3583123 4221201 4393136 4688358 4702725 4750669
19023D750669k19583k37823m03629m83768k04033m74267l48612k89455j16473
$$ 4750669 4531086 4293263 3889634 3405866 3201833 2727566 2378954 2089499 1973026
19014A973026K186K19102m67723J01632J51272j16124O06823Q1136J25458M63979
$$ 1973026 1975212 2194314 1726591 1828223 1979495 1863371 2470194 2551330 2676788 3140767
19004C140767N31938L97677L59182L78858Q5571J75650j80945l42467j20095m8610
$$ 3140767 3672705 4070382 4429564 4808422 4893993 5069643 4888698 4546231 4426136 4377526
18994D377526j85429P46m3976P75391K28755Q70537N17430Q09392P51881J029333
$$ 4377526 4192097 4192843 4148867 4924258 5153013 6023550 6540980 7350372 8102253 9131586
18984I131586Q91987J226919J400899J621616J739855J957000J366268J113905
$$ 9131586 10023573 11250492 12651391 14273007 16012862 17969862 19336130 20450035
18976B0450035N13289J34620k17043j295058j498458j908323k223091k158796
$$ 20450035 20963324 21097944 20880901 19585843 18087385 16179062 13955971 11797175
18968A1797175j831242j696509j165006r74348r64692l51163p53975n11067m73286
$$ 11797175 9965933 8269424 7104418 6130070 5165378 4814215 4060240 3549173 3075887
18959C075887m50086K25156k98874j05374k80206l16846K26708j98718j92934
$$ 3075887 2625801 2850957 2552083 2446709 2166503 1849657 2076365 1877647 1684713
18950A684713K58577j22173k53800J02426m2970J62620J98865r6985K483L9191
$$ 1684713 1943290 1821117 1567317 1669743 1626773 1789393 1988258 1891273 1893756 1932947
18940A932947k62259j4534J46511m2580J94694l05261K10211o3965L05911m1278
$$ 1932947 1670688 1656154 1802665 1760085 1954779 1649518 1859729 1795764 2101675 2060397
18930B060397K21793J75941J0012N47631J3713N19778K39806P10207K12249Q17635
$$ 2060397 2282190 2458131 2468143 3015774 3029487 3549265 3789071 4499278 4711527 5529162
18920E529162J062414J431152K019555J695000J937464J992280J536913J047829
$$ 5529162 6591576 8022728 10042283 11737283 13674747 15667027 17203940 18251769
18912A8251769P80598l02412l86716r44166j879464j875642j835512k020641j584415
$$ 18251769 19032367 18729955 18343239 17399073 15519609 13643967 11808455 9787814 8203399
18903H203399j332173j104911q52577p92420n92567m26948m13799K1715k80585
$$ 8203399 6871226 5766315 4913738 4121318 3528751 3101803 2688004 2709719 2429134
18894B429134n29107m2353l24072J50625K6231k64320p3039j09082k15048J3302
$$ 2429134 1900027 1857674 1533602 1684227 1710458 1446138 1373099 1264017 1048969 1062271
18884A062271L2350q6878j1532k1j60104j26576o565J45693J81538j53322K68809
$$ 1062271 1094621 1007743 996211 996190 836086 709510 702945 848638 1030176 876854 1145663
18873A145663k47311k27251J03001K3933j16701P4010M5857k36825J98151K20863
$$ 1145663 898352 671101 774102 798035 681334 755344 801201 564376 762527 983390
18863I83390j63401j1695l6735M0137P1647q586m6087j59733R6635o9592K48627
$$ 983390 819989 808294 771559 811696 883343 874757 828670 668937 765572 695980 944607
18852I44607K3829j25796k3484j9385k97935M33599k64239l12972M12775l2447
$$ 944607 968436 842640 819156 799771 501836 935435 671196 358224 770999 738552
18842G38552P0718k69914J84347J51407k03204k08242M05239k20276N1290k61106
$$ 738552 809270 539356 723703 875110 671906 463664 868903 648627 699917 438811
18832D38811J56354j19554J7902K80948j70605K1549K83453l29590m1242K61214
$$ 438811 595165 475611 493513 774461 603856 625405 908858 579268 538026 799240
18822G99240j12717j04719J72474j67238P5781l21691J38099K49424j66512J84665
$$ 799240 686523 581804 754278 587040 662821 341130 479229 728653 562141 746806
18812G46806l634q0424K4698n4939N9087j16077K01806j1226k39143K76232k75623
$$ 746806 743172 662748 687446 632507 691594 575517 777323 766097 526954 803186 527563
18801E27563J84544k9714j13330J36200M0054q3573J39964K09718k23691L787
$$ 527563 712107 682393 569063 705263 745317 661744 801708 1011426 787735 791522
18791G91522j90685R0115M25737k28822p7293j68344L47403j86013L4422Q2169
$$ 791522 600837 690952 1116689 887867 810574 642230 989633 803620 838042 920211
18781I20211j09919k41j42807K02246j60339J23645m7410o9077l11938L98145
$$ 920211 810292 810051 667244 869490 709151 832796 785386 716309 404371 802516
18771H02516L3711n3373k2944j69797o1672J23348j27333J55299k37601J93957
$$ 802516 836227 782854 759910 590113 528441 651789 524456 679755 442154 636111
18761F36111r2068J76424j52045j5Q2077j34006J0205J63951j47837P8720J36950
$$ 636111 544043 720467 568422 568407 650484 516478 526683 690634 542797 621517 758467
18750G58467p6415m7453j5271L5064j8872N006m2192J77334q1213m5492j49575
$$ 758467 682052 634599 619328 654392 635520 640526 598334 775668 694455 648963 499388
18739D99388J65670k14318K09665L3066j41285R5345q1770J14443Q4352j35785
$$ 499388 665058 450740 660405 693471 552186 647531 565761 680204 764556 628771
18729F28771j80131L84564j0406j47884j32385K97216o3001o426p9742j1070j49576
$$ 628771 448640 833204 822798 674914 542529 839745 776744 770318 690576 679506 529930
18718E29930J94648R983J6412m6877j19166O7799j040R3271k12436Q6202Q3591
$$ 529930 724578 734561 750973 704096 584930 652729 651689 744960 532524 618726 702317
18707G02317k47839K59924o9669J27465o0274k11826j01127J71347o4443R5407
$$ 702317 454478 714402 644733 772198 711924 500098 398971 570318 505875 601282
18697F01282k1623M5824j27744K92775K3135q3587k25168j19784N2693P3065L83966
$$ 601282 579659 625483 497739 790514 813649 730062 504894 385110 437803 510868 894834
18686H94834l25968K02223m1373j12000j47529K79727l20820Q593K01397J37353
$$ 894834 568866 771089 729716 617716 470187 749914 429094 437687 639084 776437
18676G76437J2463p9435L06055l73280j97679K31179j55434J29899R1932l3913
$$ 776437 788900 709465 1015520 642240 444561 675740 520306 650205 742137 708224
18666G08224j33634O4006j65640J39512P5202K2547j26578J18245P5409k56951
$$ 708224 574590 638596 472956 612468 687670 710217 583639 701884 777293 520342
18656E20342N5023J18277j38279N5394O568J07768L5537M4336k26232J38809r6189
$$ 520342 575365 693642 555363 610757 617325 725093 760630 804966 578734 717543 621354
18645F21354j6167r4153J44891K65551k77475j64013Q9638J50307j96368l9669
$$ 621354 605187 511034 655925 921476 644001 479988 569626 719933 523565 483896
18635D83896N377k3188J21299m692J07106m7552j14021K9511J6373j88448J91371
$$ 483896 489273 466085 587384 582692 689798 642246 528225 557736 574109 385661 577032
18624E77032j76711l6119J26247J6063K72418j30056k23010R7185J41823k37189
$$ 577032 400321 364202 490449 506512 778930 648874 425864 523049 664872 427683
18614D27683N6129K17268k98093R0390J39947j17557J91290O1224j24390B91963
$$ 427683 483812 701080 402987 493377 633324 515767 707057 768281 643891 291963
18603F78526j90034J69521l7192p5390J20393Q6869j78923Q0403j02866J43888
$$ 678526 488492 658013 620821 545431 665824 752693 573770 654173 551307 695195
18593F95195J08531J8510k69928J38949O9970j54317Q0841J08054o7119r3962
$$ 695195 803726 822236 552308 691257 761227 606910 687751 795805 728686 634724
18583F34724j33068J48770j897p3508O2130J95015j22153P8656l20448L01810
$$ 634724 501656 650426 648529 575021 637151 832166 710013 788669 468221 770031
18573G70031k22325n0154Q9878q1623j21552P9307J95354j12850K6485O8812q5608
$$ 770031 547706 497552 587430 505807 384255 463562 658916 546066 572551 641363 555755
18562E55755J82671j97204m4076K23936j26062Q6172j01048q7643K34571k15175
$$ 555755 738426 541222 497146 721082 595020 681192 580144 492501 727072 511897
18552E11897L8260j09280J45084k7463k12793Q4528j1164K56202j41433J12618
$$ 511897 550157 440877 585961 558498 345705 430233 419069 675271 533838 646456
18542F46456N9075j22822j28209J02573M165j20364J50488l561K67657m02478
$$ 646456 705531 582709 454500 557073 561238 440874 591362 587801 855458 452980
18532D52980j03743K43969J39329l03858N0739n3670n2802K94975k1974l3233
$$ 452980 349237 593206 732535 428677 479416 425746 372944 667919 645945 612712
18522F12712j66790M800J97073k60526K02443r5654J8061n9307J00209P945k63355
$$ 612712 445922 450722 647795 387269 589712 494058 512119 452812 553021 560966 297611
18511B97611K73453J15984k70508M9424J36783k24418K08361Q3071m5927j19295
$$ 297611 571064 687048 416540 465964 602747 378329 586690 669761 623834 504539
18501E04539J96444r3466J91661k69885J32674j25395m5798J09108k07901K46941
$$ 504539 700983 607517 799178 529293 661967 536572 490774 599882 391981 638922
18491F38922N3015j77993J16106M6669q5478P6185j48909l0115J28385k73143
$$ 638922 691937 513944 630050 676719 591241 667426 518517 488402 616787 343644
18481C43644J49196J12920j30628J03511o1943n0990J86670j39810O8048r5382
$$ 343644 492840 605760 475132 578643 516700 465710 652380 512570 580618 485236
18471D85236o055J13569m4652j14248M5646J78944k32463K5735K6734K21289L8998
$$ 485236 479181 592750 548098 433850 479496 658440 425977 451712 478446 699735 738733
18460G38733j49156O2472k2943K58026j63591L7302M2979r7897j46768J37639
$$ 738733 589577 652049 629106 887132 723541 760843 803822 705925 559157 696796
18450F96796J0282q6071J08882m9468O7924J11939j71862k40468J52470K23107
$$ 696796 707078 621007 729889 680421 748345 860284 688422 447954 600424 823531
18440H23531k03777P4805q9012Q3604j0407O291q8244o3674k14864J14718J65049
$$ 823531 619754 694559 605547 689151 678744 685035 596791 533117 318253 432971 598020
18429E98020o9834p5432J95947j758j03157J7085R7036k3111N0792j94437M14990
$$ 598020 528186 452754 648701 646943 543786 560871 657907 634796 685588 491151 906141
18418I06141j81966j69888J71804k88522K47405O8973j29248q8729J14355j4930
$$ 906141 724175 554287 726091 437569 684974 753947 624699 535970 650325 635395
18408F35395k41173J93867P2056n0838k78756L3933J20177l8475J06148o6824
$$ 635395 394222 588089 660145 609307 330551 364484 484661 446186 552334 485510
18398D85510r0269K18701j01292J43409o7343Q9995k03794K1492R985j15713K23499
$$ 485510 395241 613942 512650 656059 588716 678711 474917 496409 506394 390681 614180
18387F14180M447j78383K10869k45960K57120j76367q3039B00256J04550J45718
$$ 614180 618627 440244 651113 405153 662273 485906 402867 200256 304806 450524
18377D50524J36103J38788j98205R5502L2096k92888K13668J44397B62090l2591
$$ 450524 586627 725415 527210 622712 654808 361920 575588 719985 262090 229499
18367B29499M48335n3625k80871K22313p4029q771J13242j45012j81130J35460
$$ 229499 677834 624209 343338 565651 491622 482851 596093 451081 269951 405411
18357D05411R2303j43793J26683K02624k72345L01736k87509J06437p8416O1424
$$ 405411 497714 353921 480604 683228 410883 712619 425110 531547 453131 514555
18347E14555N661m1197J56031j33170K95728q0568o5305j17129J14504k7051M9706
$$ 514555 520216 479019 635050 501880 797608 717040 651735 534606 649110 622059 671765
18336F71765Q1269J56046l93570M8844P4859j46214K39304j20191j69779j16993
$$ 671765 753034 909080 515510 564354 639213 492999 732303 612112 442333 325340
18326C25340K99812l6988j86602m2369J84869j34256L14512o8375B23796J75392
$$ 325340 625152 588164 401562 359193 544062 409806 724318 655943 223796 399188
18316C99188O8283K51409p0256q1340j17006J7749J73531K13782k01710P6825
$$ 399188 467471 718880 648624 567284 450278 468027 641558 855340 653630 730455
18306G30455J323L5530k69661J06729j09284L19111l28086L4126J43977k64103
$$ 730455 731778 767308 497647 604376 495092 814203 486117 520243 664220 400117
18296D00117J82510j39211J60863k90220K31630j59250J31984J40290j52709J58969
$$ 400117 582627 443416 604279 314059 545689 386439 518423 658713 506004 664973
18286F64973j19303l0778J39152k31292j3007K83010l36964O1385P4346j756R3304
$$ 664973 545670 514892 654044 422752 409745 692755 355791 417176 491522 489766 583070
18275E83070J82633k79242N6238p3789J62339Q0147k99075N9437Q6341j91092
$$ 583070 765703 486461 542699 468910 631249 711396 412321 471758 558099 367007
18265C67007J08489n0491L38524l13062J84736m1219J31J50811J9875j49409j18837
$$ 367007 475496 425005 763529 450467 635203 593984 594115 744926 764801 615392 496555
18254D96555J64345J55242l32817j64344K86058K4159p170j0133J5051J05979
$$ 496555 660900 816142 483325 318981 605039 629198 622028 611895 626946 732925
18244G32925k58916K2433O3388N5838Q5799l06317L6821p9604L79979l16511J01102
$$ 732925 474009 496442 559830 615668 701467 395150 431971 352367 732346 415835 516937
18233E16937K9420R943q1419J17408M0995A55648L31096l3144K15144B08417L00075
$$ 516937 546357 556300 474881 592289 633284 155648 486744 453600 668744 208417 508492
18222E08492N1473J4655J28359k01022j3924J04718k6934K48551k99594M5131
$$ 508492 559965 574620 702979 501957 488033 592751 565817 814368 514774 559905
18212E59905j46634m2101R0043J26442K8543p2617R4777r6421j23903N6936Q3540
$$ 559905 413271 371170 461213 587655 616198 543581 638358 541937 418034 474970 558510
18201E58510r645j37464J24428M6454k43567L76645j71456Q1273k2153J17784
$$ 558510 548865 411401 535829 582283 338716 715361 543905 625178 603025 720809
18191G20809j8890R7075j6546j16975k11893m0834J13318j3626Q5641j01647L4972
$$ 720809 701919 798994 782448 665473 453580 412746 526064 512438 598079 496432 531404
18180E31404L2239k11752J50839k44150K38648K96572k41308K8682j71182p2962
$$ 531404 563643 351891 502730 258580 497228 793800 552492 581174 409992 337030
18170C37030K84592B85015J64806m8196J60912J38901r9886j56931J88515C07095
$$ 337030 621622 285015 449821 401625 562537 701438 601552 444621 633136 307095
18159E34848J17297R597j82569J3120O1664j27711N9812J32589K05981l03370
$$ 534848 652145 661742 479173 492293 553957 426246 486058 618647 824628 521258
18149E21258Q5512j43954K37925j52808O20j65063O9933Q7395j55464K36871P915
$$ 521258 606770 462816 700741 547933 548553 383490 453423 540818 385354 622225 630140
18138F30140k9244J5892j2648J04850j25252j29445N2301J99243n9671n5021j66005
$$ 630140 600896 616788 604140 708990 583738 454293 506594 705837 646166 591145 425140
18127D25140L22581k64677J53593k20739J21702M7842j22471k2472K5251j9202
$$ 425140 747721 483044 636637 415898 537600 585442 462971 440499 465750 446548
18117D46548P7191M3309l471l0457B52246L61442M1251r4976r744k55580Q3330
$$ 446548 523739 567048 563577 533120 252246 613688 654939 559963 550219 294639 377969
18106C77969O6889J2694J42147j85446Q6245J27654j75933o4927K29611j01594
$$ 377969 444858 457552 599699 414253 500498 628152 452219 387292 616903 515309
18096E15309B29172L15911k0985m6689q7312J24613j41814o8803K96524r9685
$$ 515309 229172 545083 524098 477409 390097 514710 372896 304093 600617 500932
18086E00932J23577K7686k78495J31877o7176K17355p2543k32884j09864K57088
$$ 500932 624509 652195 373700 505577 438401 655756 583213 350329 240465 497553
18076D97553L5448J83657k57095K428J1356r3264J53853j23471K09393k23291
$$ 497553 533001 716658 459563 461991 473347 380083 533936 410465 619858 396567
18066C96567J22643K0407n5928r4780r0520K85104j04361k19875M62569o8354
$$ 396567 519210 539617 483689 388909 298389 583493 479132 259257 721826 653472
18056F53472j96985O051K50405j96494J8201B45762L53771Q605A56599J37740
$$ 653472 456487 462538 712943 516449 534650 245762 599533 608138 156599 294339
18046B94339K60811k48679P0700p9937K64049k25775J21702L2056B28104K63884
$$ 294339 555150 306471 377171 297234 561283 335508 457210 489266 228104 491988
18036D91988J53454k03967q6644n0421M15847k81784j785j19649K00685o3657
$$ 491988 645442 441475 354831 304410 720257 438473 436688 317039 517724 454067
18026D54067n2471J24735j01105A99175K79951J90820C25281j9797J45042N0372
$$ 454067 401596 526331 425226 199175 479126 669946 325281 305484 450526 500898
18016E00898k30519J91354k0955J17790j00762K28913k81604L7202n2349J80077
$$ 500898 270379 461733 440778 558568 457806 686719 405115 442317 389968 570045
18006E70045n7414l5247J29122J8700p1345J9809B33102J26799K46931K3671q0522
$$ 570045 512631 477384 606506 625206 553861 573670 233102 359901 606832 630503 549981
17995E49981B71685K76032P2345j68248j33514K06832m3563J59435K9809k13637
$$ 549981 271685 547717 620062 451814 318300 525132 481569 641004 670813 457176
17985D57176l1196q1481J49078J04226k44227K33509j395l9379J67498m5103o915
$$ 457176 425980 344499 493577 597803 353576 587085 585690 546311 713809 668706 661791
17974F61791l6756P307j73028n7792J66212q5483j37086K09646N3966B66754L66897
$$ 661791 625035 632342 459314 401522 567734 482251 345165 554811 608777 266754 633651
17963F33651l219j27160K47946l30827R9469P6665O152P270M4339j66801K26540
$$ 633651 630432 503272 751218 420391 519860 596525 602677 609947 654286 487485 714025
17952G14025k51703Q0570j88886R3778m5130J19880r4450J40713J36077l46765
$$ 714025 462322 542892 354006 447784 402654 522534 428084 568797 704874 358109
17942C58109K42192J44964j84651j17476K24060l3834m5587p0296p8451l32L34324
$$ 358109 600301 745265 560614 443138 667198 633364 587777 517481 439030 438698 773022
17931G73022j98580j06043J29921J8836j46813K6138o9149r250k0008K14946R7934
$$ 773022 574442 468399 598320 617156 470343 496481 427332 418082 398074 613020 710954
17920G10954k7504r5535J216J40979k20689K27641j82683j63540K8289K28938
$$ 710954 683450 587915 589131 730110 509421 737062 554379 390839 419128 648066
17910F48066J0084j51149J65575K94545l66883j69158J65082J57721p7054M885
$$ 648066 658150 507001 672576 967121 600238 431080 596162 753883 676829 681714
17900F81714J39168k3290j76915J44968j64303M4565P5247j2733q060k14252J950
$$ 681714 820882 797592 620677 765645 601342 645907 721154 708421 700361 486109 488059
17889D88059J62430J22465j25400Q5591n1411K4662j24529K32353j22909j02256
$$ 488059 650489 772954 647554 733145 681734 706396 581867 814220 691311 589055
17879E89055J59041j19278K283k2107J07972P6321j51751j5178N9879J0994r2126
$$ 589055 748096 628818 631101 608994 716966 793287 641536 626358 686237 697231 605105
17868F05105J74814r2973k07530M8536L60580l59383K36695j50923j20352J52065
$$ 605105 779919 686946 479416 527952 888532 529149 765844 614921 494569 646634
17858F46634m1657k3443J81275j64557R6689j1258B82453M69063j87953J65219
$$ 646634 604977 581534 762809 598252 694941 683683 282453 751516 563563 728782
17848G28782j71550L2465J95764k43358J30299j07083Q2842q376J18014k2578
$$ 728782 557232 589697 785461 542103 672402 565319 648161 639785 757799 735221
17838G35221J73995l00685Q2255l43243L12520n3864J00901m7252j0913p6649
$$ 735221 909216 608531 690786 347543 660063 606199 707100 659848 648935 572286
17828E72286J76515N9670l9854j45152p3521K60180j94650K02127k72507P3950
$$ 572286 748801 808471 768617 623465 549944 810124 615474 817601 545094 619044
17818F19044J32610L9132J00249J58569l45499K49471k923o4943J25221q0155
$$ 619044 751654 790786 891035 1049604 704105 953576 950653 885710 1010931 930776
17808I30776n7880q8488J9894j15588K95681k24644j07790J44015J55839K1922
$$ 930776 872896 784408 804302 688714 984395 759751 651961 795976 951815 973737
17798I73737j36490p012P4917k9723K08674k81911j29491J57959m4065k385j69342
$$ 973737 837247 830235 905152 875429 1084103 802192 672701 830660 786595 784210 614868
17787F14868q7944n5773K47360l16615J20273R6300J04750p7570M0360K4690R3166
$$ 614868 526924 471151 718511 401896 522169 618469 723219 645649 686009 710699 803865
17776H03865j8092J5355k56686J45271n9815R0920r2512l1305j78598J14597N9812
$$ 803865 785773 801128 544442 689713 629898 720818 628306 597001 418403 533000 592812
17765E92812j3334K19467j54660j16032l8066P9469P2555L6046o8300J49118k77607
$$ 592812 579478 798945 644285 528253 490187 569656 642211 678257 609957 759075 481468
17754D81468J53201q2321J69439j73588q1599O6095J67838R803m3710q8697Q9066
$$ 481468 634669 552348 721787 548199 466600 532695 700533 710336 666626 577929 666995
17743F66995Q9473k91050K97415l32441N00474m11812J68283n2593k5267J89572
$$ 666995 756468 465418 762833 430392 930866 519054 687337 634744 609477 799049
17733G99049l23684K67218k25523O9349J68648k62059K19533j06674K7936R5293
$$ 799049 475365 742583 517060 586409 755057 492998 712531 605857 633793 729086
17723G29086n7438k87189K64284L3261C12687L52744J83327k35045k7770J0446
$$ 729086 671648 384459 648743 682004 312687 665431 848758 613713 585943 596389
17713E96389J58136o9409p4468J2625J26100k05195R6438L8390J06198l61412
$$ 596389 754525 685116 610648 623273 749373 544178 640616 679006 785204 423792
17703D23792K35886r8239J12807k76563M90953l59016J97624r2318J6449J00565
$$ 423792 659678 561439 674246 397683 888636 529620 727244 634926 651375 751940
17693G51940M0794j41478j59024K14926j78780L11549C64059L79318k05536M48242
$$ 751940 792734 651256 492232 707158 528378 839927 364059 743377 537841 986083
17683I86083k25560j62550n7084o6971K50278J35328j57212L7342j60638K17266
$$ 986083 760523 597973 540889 473918 724196 859524 702312 739654 579016 796282
17673G96282k94444J01187J14551M8486p8179p5817m9024P0456p9293K06363j84108
$$ 796282 501838 603025 717576 766062 687883 612066 563042 633498 554205 760568 576460
17662E76460J43658N6044j84578l0735M3944P7252l8571j66039M39448j76937
$$ 576460 720118 776162 591584 560849 604793 682045 643474 477435 916883 739946
17652G39946o3869J31316Q0364j97892j49424J47904K03830o87j14121q6144J25288
$$ 739946 676077 807393 887757 689865 540441 688345 892175 891488 777367 691223 816511
17641H16511O0667J10051j62241j23138k4595N8194J19867q4996J45876j601o8230
$$ 816511 877178 987229 824988 701850 677255 735449 855316 770320 916196 914595 846365
17630H46365K71115r8668k44209J20864J9112p3168K31046k00259N9931J68617
$$ 846365 1117480 1018812 774603 895467 914579 841411 1072457 872198 932129 1100746
17620A100746j68359J67440j72975r7885L39255P071k37872l892J02031r2997
$$ 1100746 932387 1099827 926852 828967 1168222 1175293 937421 933529 1035560 942563
17610I42563J56106J80228j95242K45218k50621K34990L5429j10304q3568k89203
$$ 942563 1098669 1278897 1083655 1328873 1078252 1313242 1348671 1238367 1154799 865596
17600H65596j033L85249l6411O9848k75563L98691m27172K34331o7530m3095P5942
$$ 865596 864563 1249812 1213401 1283249 1007686 1406377 979205 1213536 1146006 1102911 1178853
17589A178853j55947M3330L37171k87657k6441J16338J06486j94943N4093k39068
$$ 1178853 1022906 1066236 1403407 1115750 1089309 1205647 1312133 1117190 1171283 932215
17579I32215K82423L1444M2918r6702o9272K11586j66871J34706K3249j74388
$$ 932215 1214638 1246082 1289000 1192298 1123026 1334612 1167741 1302447 1325696 1151308
17569A151308O3127k29903M11321j70389Q4962k51650J95969k25226J7602K0675
$$ 1151308 1214435 984532 1395853 1225464 1310426 1058776 1254745 1029519 1047121 1067796
17559A067796J21090q1344k07536L32410k03973j59939L65175j11992m9389O433
$$ 1067796 1188886 1107542 900006 1232416 1028443 868504 1233679 1121687 1072298 1078731
17549A078731l2042O2426M2613q4219K73734j08929J58052j48536j07882K30926
$$ 1078731 1046689 1109115 1151728 1067509 1341243 1232314 1390366 1241830 1133948 1364874
17539A364874o2630l7626J9622J10565q3870K18260k69285J45602j58222J21006
$$ 1364874 1302244 1264618 1284240 1394805 1310935 1529195 1259910 1405512 1247290 1368296
17529A368296k35297K31104Q5441k17411J35209n8443k2586n2478J59719j1171
$$ 1368296 1132999 1364103 1449544 1232133 1367342 1308899 1286313 1233835 1393554 1382383
17519A382383Q5871P8474j80745O5694j22924m5683K91121J53536K92385j68357
$$ 1382383 1468254 1546728 1365983 1431677 1308753 1263070 1554191 1707727 2000112 1831755
17509A831755K22356j10594J57030n8091J40028K89160l61928P0937J06757k21086
$$ 1831755 2054111 1943517 2100547 2042456 2182484 2471644 2109716 2180653 2287410 2066324
17499B066324K20625K98497n1038K92537J18297L32505L31154L89682K85735Q18798
$$ 2066324 2286949 2585446 2534408 2826945 2945242 3277747 3608901 3998583 4284318 5103116
17489E103116M61439R45753J800529L147507N478092Q723979J1446085J3383654
$$ 5103116 5564555 6510308 8310837 11458344 16936436 25660415 37106500 50490154
17481E0490154J1331060Q511860M963329K350190n09630m127688o852470r335017
$$ 50490154 61821214 70333074 75296403 77646593 77136963 73009275 66156805 56821788
17473E6821788j0624650q973589n914217j801930L498416P855897J1032167J0987369
$$ 56821788 46197138 37223549 31309332 29507402 33005818 40861715 51893882 62881251
17465F2881251Q440098N502475K462131n60592l855023o633915r492973j1731482
$$ 62881251 71321349 76823824 79285955 78725363 74870340 68236425 58743452 47011970
17457D7011970j1628362r548571p504835m813512l374795k292990j381444j230374
$$ 47011970 35383608 25835037 18330202 13516690 10141895 7848905 6467461 5237087
17449E237087p22590l93484k64586P4180j26691O2582j0513J42099k22800J75618
$$ 5237087 4514497 4121013 3856427 3930607 3803916 3866498 3855985 3998084 3775284 3950902
17439C950902m1635l10561j20210k28565q8263p1597r7484J7368M8099o0487J43724
$$ 3950902 3909267 3598706 3478496 3249931 3161668 3090071 2992587 3009955 3058054 2997567 3141291
17428C141291J16794L88610m22588k7767Q2882n98281k6103j83424j63716j75881
$$ 3141291 3258085 3646695 3224107 3196340 3279222 2680941 2654838 2471414 2307698 2131817
17418B131817J88541k79201j4461J83774R5734N2166n3379n2486n0335j51452
$$ 2131817 2320358 2041157 2026696 2210470 2306204 2358370 2304991 2252505 2202170 2050718
17408B050718k19181J94467K52225J49330j2993r682K22110K23283l30802L32141
$$ 2050718 1831537 2026004 2278229 2427559 2414566 2404884 2626994 2850277 2519475 2851616
17398B851616o8651K87858l4252J82217Q3991M90093K13533M47976N74693K55275
$$ 2851616 2782965 3070823 3036571 3218788 3302779 3792872 4006405 4454381 5029074 5284349
17388E284349N24890J13845M97171K33903P2609q1738K21399l74742l71244r3027
$$ 5284349 5809239 5923084 6420255 6654158 6726767 6645029 6866428 6491686 6120442 6027415
17378F027415j53445l38914J05156k76313L07560M7044K95922L76931K07044N30737
$$ 6027415 5873970 5535056 5640212 5363899 5671459 5718503 6014425 6391356 6598400 7129137
17368G129137K15710K53764L8607L16711J80790m13744J48056J06921m12247J14051
$$ 7129137 7344847 7598611 7637218 7953929 8134719 7720975 7869031 7975952 7563705 7677756
17358G677756k80357o6133J0415N5746K23993J89556R8264N15157P82985M31085
$$ 7677756 7397399 7331266 7341681 7397427 7621420 7810976 7909240 8424397 9207382 9638467
17348I638467P23585N46024L43442P55642N55147J51856K20821o8587R2918j87227
$$ 9638467 10362052 10908076 11251518 12007160 12562307 12714163 12934984 12866397 12959315 12772088
17338A2772088o74785k79664m20019j94787r6246j56827j60059J76529L09216
$$ 12772088 12097303 11817639 11397620 11202833 11106587 10949760 10789701 10966230 11275446
17329A1275446K68939J67173O64505N83205J08753L38240K73100l36086L34098
$$ 11275446 11544385 11711558 12376063 12959268 13068021 13406261 13679361 13343275 13677373
17320A3677373j843l14193l00730k38353k79404l75253l62477m20701l87667l4560
$$ 13677373 13675530 13361337 13060607 12822254 12542850 12167597 11805120 11384419 10996752 10962192
17310A0962192j87319r808M7906N5356K69960L30782M23292K00435K80572J85216
$$ 10962192 10774873 10765065 10812971 10868327 11138287 11469069 11892361 12092796 12373368 12558584
17300A2558584Q5176j07758l44586J64918n69190l9259m31859l33484o7102M6454
$$ 12558584 12643760 12536002 12191416 12356334 11787144 11747885 11316026 10982542 10915440 10961894
17290A0961894j12333p5254j35837K41619j95652L49057l09317n6926m12885j73067
$$ 10961894 10849561 10774307 10638470 10880089 10684437 11033494 10724177 10667251 10254366 10081299
17280A0081299o47673k10970o76941n28774o95656n61086n36342l28776m53782
$$ 10081299 9433626 9222656 8545715 8016941 7321285 6760199 6223857 5895081 5441299
17271E441299l97431o3917l28291j33689K3110m45378J43481j04200j82214k2970
$$ 5441299 5043868 4979951 4651660 4517971 4541081 4095703 4239184 4134984 3952770 3929800
17261C929800k04889J63859k41783K6486j00374l06440K10700k44666J72158l62919
$$ 3929800 3724911 3888770 3646987 3673473 3573099 3266659 3477359 3232693 3404851 3041932
17251C041932J71476k45247R1116k0551J19899P0698j35698l442k06771k0653
$$ 3041932 3213408 2968161 3059277 3038726 3158625 3229323 3093625 3090183 2883412 2862759
17241B862759O7670J01963j78586n1854p3803J85700n62444J67766K64168l51292
$$ 2862759 2930429 3032392 2853806 2801952 2728149 2913849 2351405 2519171 2783339 2432047
17231B432047J48314k80438N5300K36093O427k81464N06875j28247J79276j27808
$$ 2432047 2580361 2299923 2355223 2591316 2597743 2316279 2823154 2694907 2874183 2746375
17221B746375j9207J09960j29303p3230M283j48913K06938m7003K57496q9260
$$ 2746375 2727168 2837128 2707825 2634595 2638878 2489965 2696903 2649900 2907396 2818136
17211B818136j47723J86427l17458J56542J63597n0912p5682j35193N03539j98668
$$ 2818136 2670413 2856840 2539382 2695924 2859521 2808609 2732927 2597734 3101273 2902605
17201B902605k00059K92108k55368r6232M0610k02662j76616l9855j83803K75177
$$ 2902605 2702546 2994654 2739286 2643054 2683664 2481002 2304386 2264531 2080728 2355905
17191B355905l99226J34215k17145L15927j57935j76814J00974n9056K04855M019
$$ 2355905 1956679 2090894 1873749 2189676 2031741 1854927 1955901 1896845 2101700 2105719
17181B105719l10621l1649O2035q053r3239j24979K24580M8636R5414l61980J54290
$$ 2105719 1795098 1763449 1825484 1817431 1724192 1599213 1823793 1872429 1967843 1605863 1760153
17170A760153k05381L71365Q9951l60537J08124M50578l99219J53800p0808K54920
$$ 1760153 1554772 1926137 2016088 1655551 1763675 2214253 1815034 1968834 1898026 2152946
17160B152946k77426j5629K46995j14784J03011J44180k32483K85812j13163j27708
$$ 2152946 1875520 1859891 2106886 1992102 2095113 2239293 2006810 2292622 2179459 2051751
17150B051751K21252k20252k1825p708J85763j21501O6182o285j19257J32866
$$ 2051751 2273003 2052751 2030926 2023218 2208981 2087480 2153662 2147377 2028120 2160986
17140B160986r8728L48863L0591l46599J60138q1874J82323P1703k9551j27508
$$ 2160986 2062258 2411121 2441712 2095113 2255251 2173377 2355700 2427403 2397852 2270344
17130B270344j01688j25665q8272K44537j05067p9349K3320j576J79870m6006
$$ 2270344 2168656 2042991 1954719 2199256 2094189 2014840 2038160 2036584 2216454 2170448
17120B170448J28932N8405k03359J84401j42097j00201J0698k71499N4323J43941
$$ 2170448 2299380 2357785 2154426 2338827 2196730 2096529 2107227 1835728 1890051 2033992
17110B033992p1825p4144m1250J66738r7551J07813j46153K52650j61004J5185
$$ 2033992 1962167 1888023 1846773 2013511 1915960 2023773 1877620 2130270 1969266 1984451
17100A984451j07758Q3340k8364J29198j85090o5958k25560R553J37727j32719
$$ 1984451 1876693 1960033 1931669 2060867 1875777 1809819 1584259 1593812 1731539 1598820
17090A598820o9432k38719J98549p4031k26269n1450p2120K56031p6610j02273
$$ 1598820 1529388 1290669 1489218 1415187 1188918 1137468 1065348 1321379 1244769 1142496
17080A142496J3886l7474J5006J42984J31524j17749p4601M5252L9350j08518
$$ 1142496 1156382 1118908 1133914 1276898 1408422 1290673 1216072 1261324 1300674 1192156
17070A192156o7862K8417K13041n35603N43218j74020p3555r9878L46720j53847
$$ 1192156 1124294 1152711 1365752 830149 1373367 1199347 1125792 1025914 1372634 1218787
17060A218787l23303J81354J38785K14283r4237K55983J14655k54253K21627q1104
$$ 1218787 895484 1076838 1215623 1429906 1335669 1591652 1706307 1452054 1673681 1592577
17050A592577K21269M3059N4158k72666L33021k97660K94491r0527L19175o0637
$$ 1592577 1813846 1856905 1911063 1638397 1971418 1673758 1968249 1877722 2196897 2136260
17040B136260L6229L55594k33979J8105K35938k52463M7769l7130r4743l96535
$$ 2136260 2172489 2528083 2294104 2312209 2548147 2295684 2343453 2306323 2211580 1815045
17030A815045R7852J1170l15650J52763n1891j51872J02834J64883p16934L26340
$$ 1815045 1912897 1924067 1608417 1761180 1709289 1557417 1660251 1825134 1108200 1434540
17020A434540n5354k31764K28874j43622m4019M0227j37687J35464n9991K43777
$$ 1434540 1379186 1147422 1376296 1232674 1188655 1228882 1091195 1226659 1166668 1410445
17010A410445p7733q1894J4396q121k47466J57157o6195J54910k34266K9087k7721
$$ 1410445 1332712 1250818 1265214 1257093 1009627 1166784 1100589 1255499 1021233 1050320 1022599
16999A022599M7492R1068j32941L05402l21498K2450J40622J47755K53j53394
$$ 1022599 1070091 1161159 1028218 1333620 1012122 1034572 1175194 1322949 1323202 1169808
16989A169808j007j060r7071J76908j24446M0694k0557m1003Q3070M3431R7514
$$ 1169808 1168801 1167741 1070670 1247578 1123132 1163826 1143269 1102266 1185336 1228767 1326281
16978A326281k8941J361j26851J85967M2213j62794L80892j19070M7371n7490
$$ 1326281 1297340 1298701 1171850 1357817 1400030 1237236 1618128 1499058 1546429 1488939
16968A488939M49623k99148J69074Q9124k2897L04404k58139L25994J78340K19242
$$ 1488939 1938562 1639414 1808488 1897612 1874715 2179119 1920980 2246974 2425314 2644556
16958B644556k31450R8179l2353K81440K7920k10162j06760J90614j95740j95452
$$ 2644556 2413106 2511285 2478932 2760372 2788292 2578130 2471370 2661984 2466244 2270792
16948B270792J40588K2206j53644l47488R2692k14685L0778j77219J67525l00614
$$ 2270792 2411380 2433586 2279942 1932454 2025146 1810461 1841239 1664020 1831545 1530931
16938A530931j35077k9515r907k5004k43131K61918j06282K7196j9441j02469
$$ 1530931 1395854 1366339 1356432 1331428 1088297 1350215 1243933 1271129 1251688 1149219
16928A149219K74217k68038P6599k8803k85218Q5752R363J40092j33233J56021
$$ 1149219 1423436 1155398 1231997 1203194 917976 1003728 1013091 1153183 1019950 1175971
16918A175971j34915j1718l958J31148j63765J42604k75866N3928J50793j22038
$$ 1175971 1041056 1029338 1025380 1156528 992763 1135367 859501 913429 1064222 942184
16908I42184O319j2396O2163l4231l8244n9798P0814J62176l51978J80761L22426
$$ 942184 948503 936107 998270 964039 925795 865997 936811 1098987 747009 927770 1250196
16897A250196k37994j80849J76082k42864P8819J32028k53540P3543Q3273j32106
$$ 1250196 1012202 831353 1007435 764571 843390 975418 721878 795421 878694 746588
16887G46588K25609q4870n4611L6918J584J9795j35097J70149j91766K37715k15026
$$ 746588 972197 887327 832716 869634 871218 891013 755916 926065 734299 972014 756988
16876G56988K18908p6143j56904O4577j23677J42070k4400J62416k82339M34071
$$ 756988 975896 899753 742849 807426 683749 825819 801419 963835 681496 1115567
16866A115567k29922J33477o7819j22338P9236Q333k36143K14812J83480k92062
$$ 1115567 885645 1019122 951303 828965 908201 916534 680391 895203 1078683 786621
16856G86621J44186k9248J14024K5806j79548o3439o785L9173L20642k17091m0206
$$ 786621 930807 901559 1015583 1041389 861841 798402 791617 830790 1151432 934341 894135
16845H94135j32816L0937N8985m0625k29303M16537j74677k17699K55632O5632
$$ 894135 761319 792256 851241 810616 581313 997850 823173 605474 861106 926738
16835I26738M3459R6803k0855n1323k03483J22556J17404r2909K9199L37929l38077
$$ 926738 970197 1067000 1046145 994822 791339 913895 1031299 938390 967589 1305518 967441
16824I67441m4791J26717j92678J87068R1431R0041K00819j42242K64660L9592
$$ 967441 922650 1049367 856689 1043757 1135188 1225229 1426048 1283806 1548466 1588058
16814A588058k13180J40194K03704k47783J03014J34623k36206K00658k35099
$$ 1588058 1374878 1515072 1718776 1470993 1574007 1708630 1472424 1673082 1437983
16805A437983l2577P5067Q5344l64782L36762J72519l96639K22816n8311l72145
$$ 1437983 1405406 1480473 1565817 1201035 1537797 1710316 1313677 1536493 1478182 1106037
16795A106037L08860l36886K97863n08594K62091R8522k64011j75442K36913N8772
$$ 1106037 1414897 1078011 1375874 867280 1129371 1227893 963882 788440 1025353 1084125
16785A084125l83847P3007m1264j2328n8424Q1548L01606j70710r2666J070N5268
$$ 1084125 700278 773285 732021 719693 661269 742817 1044423 873713 781047 782117 837385
16774H37385j73481M9470n6492J35405N6315Q5861j44050J30920j47398J77013
$$ 837385 663904 713374 656882 792287 848602 934463 790413 921333 773935 950948
16764I50948L2512j14773m1587N9188n7844K68136k28061J30150j40078j6220
$$ 950948 983460 868687 827100 886288 828444 1096580 868519 998669 858591 842371
16754H42371m4340M8998j32055o1828K56212j66425K47385q4083P1520q8556J05930
$$ 842371 798031 847029 714974 653146 909358 742933 990318 906235 977755 889199 995129
16743I95129j04654L1113O0786j60789J94370o0639j77756J46943j78495L63389
$$ 995129 890475 921588 982374 821585 1015955 955316 777560 924503 746008 1109397
16733A109397l29705K928K72235j15566L6792m1480P8353j83992L7498J78925
$$ 1109397 779692 782620 1054855 939289 976081 934601 1012954 828962 866460 1045385
16723A045385k5646k696j00025K40228n3641j50160r8078L7034j8644M5442j34028
$$ 1045385 1019739 1017043 917018 1157246 1103605 953445 855367 892401 873757 919199 785171
16712G85171J76559J21511j20976k896J43134R9188L69060j0063j16305K39877
$$ 785171 961730 1083241 962265 959369 1102503 1201691 1570751 1560688 1444383 1684260
16702A684260K75J37976J07257j75205j47146N1020r5572J84026l39404L15634
$$ 1684260 1684535 1822511 1929768 1754563 1607417 1658437 1562865 1746891 1407487 1723121
16692A723121j5300j56292J07430P2912P0478n8082N045n8166j10337L04365m10033
$$ 1723121 1707821 1551529 1658959 1731871 1802349 1744267 1749312 1691146 1580809 1885174 1475141
16681A475141m37696K39139M1114j6700j40414k15432J06291k036N0227O1457
$$ 1475141 1037445 1276584 1317698 1300998 1160584 945152 1051443 1049407 1099634 1161091
16671A161091J31322O9625r417J32035L51824r5241N2824R308J73574j6637j60877
$$ 1161091 1292413 1362038 1352621 1484656 1836480 1741239 1794063 1803371 1976945 1960308 1799431
16660A799431J11888k57291L3823j12689J55901J02878n6980j08779J82956j49480
$$ 1799431 1911319 1654028 1687851 1575162 1731063 1833941 1776961 1668182 1851138 1701658
16650A701658n5270N9825j81352O776j22471k87852j11326j97233L687J70202
$$ 1701658 1646388 1706213 1524861 1531637 1409166 1121314 1009988 812755 816442 986644
16640I86644k57947N4803J11046o9031M2086K79583l30090r3492J35895m8318
$$ 986644 728697 783500 894546 825515 867601 1147184 817094 723602 859497 811179
16630H11179k18473L21946k56302K50772k27680K2361J27337Q956Q558R3256j45296
$$ 811179 592706 914652 658350 909122 681442 703803 831140 840096 848654 941910 796614
16619G96614k66111K56732K55085r6597j37004J90851k90720N9957J24086J14015
$$ 796614 530503 787235 1042320 945723 808719 999570 708850 768807 892893 1006908
16609A006908j56262J40785o7243k5620K17628l05435Q4382o7596K67925j91386
$$ 1006908 850646 991431 924188 898568 1116196 810761 895143 827547 1095472 904086
16599I04086m9836J31426k12055L16279j86482K34953n6238q3069j5042J81369
$$ 904086 854250 985676 773621 1089900 903418 1138371 1082133 999064 984022 1165391
16589A165391R7794k68001O0190K70698q4232O1520n4940K3393j65609j91529
$$ 1165391 1263185 995184 1055374 1326072 1241840 1303360 1248420 1271813 1106204 914675
16579I14675J03645J3527o36j04859K9966K1387O3007j71969J18870j69592J84987
$$ 914675 1018320 1031847 1031211 926352 956318 977705 1040712 868743 987613 818021 1003008
16568A003008l19313L1798K02189q5390j83560K40373j06279k4882q7399M3514
$$ 1003008 683695 715493 917682 832292 648732 889105 782826 757944 670545 714059
16558G14059q6004J60955j73577L4177J43043K85867l61074p0743J21049o5784
$$ 714059 628055 789010 615433 649610 792653 1078520 717446 646703 767752 701968
16548G01968K469J86879j70626j06073K31585J7642J41537j50773l3512O0555
$$ 701968 704437 891316 720690 614617 846202 863844 1005381 854608 821096 881651
16538H81651j53737Q0917k4611J03204q4850M2459r5933k03729Q5682K8098r0669
$$ 881651 727914 808831 784220 887424 802574 845033 749100 545371 631053 659151 568482
16527E68482J4405N0471J12238j63256k2053R9347K75203q8168K4253j79478J45338
$$ 568482 582887 633358 745596 582340 560287 659634 934837 846669 870922 691444 836782
16516H36782J15073j88397K75460j10517M8786k3204J09580J08801n7940o3895
$$ 836782 951855 763458 1038918 928401 977187 953983 1063563 1172364 1114424 1050529
16506A050529q980J29870j66576j4332l2675Q4532j36320O8029j54769j0389J23907
$$ 1050529 1041549 1171419 1004843 990511 957836 1042368 906048 974077 819308 808919 932826
16495I32826O7202k19041K11177k19975K31666K35889k44717J59340J01845j16168
$$ 932826 1000028 780987 992164 772189 1003855 1239744 995027 1154367 1256212 1140044
16485A140044j59525J27544p6396P8294j29197L09584k67585J04328j71789j0907
$$ 1140044 980519 1108063 1031667 1109961 980764 1290348 1022763 1127091 955302 944395
16475I44395M3264r9931p0505K44182r2317l96418M10940r6563n0669P5085J5631
$$ 944395 987659 887728 817223 1061405 969088 572670 983610 887047 836378 911463 927094
16464I27094k41384J19659J68599j79806j95987J82384C54942J08608J69128K57824
$$ 927094 685710 805369 973968 794162 598175 780559 354942 463550 632678 890502
16454H90502L1397K9660k34625L85290K00624j35216K94209J34223n1766L37373
$$ 890502 921899 951559 716934 1102224 1302848 1167632 1461841 1596064 1544298 1881671
16444A881671o5371l523O8352J17535N18J11518J3810m6490l8165J66948J41838
$$ 1881671 1816300 1812777 1881129 1998664 1999182 2110700 2124510 2078020 2039855 2206803 2348641
16433B348641O4926K88114r1653J42133K77815N0674j0233Q11687m2002M86469
$$ 2348641 2413567 2701681 2610028 2752161 3029976 3080650 3070417 3882104 3840102 4326571
16423D326571L76236K14531O03408M45216P07580J146652J018486J020272R39369
$$ 4326571 4702807 4917338 5520746 5965962 6673542 7820194 8838680 9858952 10798321
16414A0798321J098212J201573J175912J335771J230790J556028J740761J850555
$$ 10798321 11896533 13098106 14274018 15609789 16840579 18396607 20137368 21987923
16406B1987923J673813J839308J806245J641383J839049K055229J902015J989826
$$ 21987923 23661736 25501044 27307289 28948672 30787721 32842950 34744965 36734791
16398C6734791K129161J583834J409799J062607J665939L426634P585491J2063264
$$ 36734791 38863952 40447786 41857585 42920192 44586131 48012765 55598256 67661520
16390F7661520J4920553J4659130R644014J985210n266627j0712508j4615121
$$ 67661520 82582073 97241203 106885217 108870427 103603800 92891292 78276171
16383G8276171j6692928j7834616j7352983G625709a4424720k4176298k2055581
$$ 78276171 61583243 43748627 26395644 7625709 -14424720 -38601018 -60656599
16376f0656599j3081517K398114J6582761K4788002e921988A2790310J2178136
$$ -60656599 -73738116 -71340002 -54757241 -29969239 -5921988 12790310 24968446
16369B4968446O701241K771830o6808j740617k917583l293412l341521l153993
$$ 24968446 31669687 34441517 34374709 32634092 29716509 26423097 23081576 19927583
16361A9927583k713420k754148k280474j744411j510107j056508j372604r37479
$$ 19927583 17214163 14460015 12179541 10435130 8925023 7868515 6495911 5558432
16353E558432o46166p96204m73615m74576m75878m16372k73809k75689k90939
$$ 5558432 4912266 4116062 3642447 3167871 2691993 2275621 2001812 1726123 1435184
16344A435184j8736l78739J7764k03605j19554J98192P9145j98172J61186J66920
$$ 1435184 1416448 1037709 1055473 851868 732314 930506 1009651 811479 972665 1139585
16334A139585N2406L3293J55565M2676k81391j40877J00252j79582j91187j22277
$$ 1139585 1191991 1225284 1380849 1423525 1142134 1001257 1101509 921927 730740 608463
16324F08463J4232o8340J8219j78015j71610O7477o8784J27116r4867K14835o5342
$$ 608463 622695 554355 572574 394559 222949 290426 221642 348758 253891 468726 403384
16313D03384j17905k8756k823j07770K20696j12961m8633B4476a73792g3789q8521
$$ 403384 285479 256723 253900 146130 366826 253865 205232 24476 -173792 -73789 -162310
16302a62310O8356F2670g7708j01523n4477q890k60300f2798p0264k78838J96183
$$ -162310 -93954 62670 -77708 -179231 -233708 -242598 -502898 -62798 -133062 -411900 -215717
16291b15717j58842J03799h9854q8321h4537k76026a28235k22612M9303K7488
$$ -215717 -374559 -270760 -89854 -178175 -84537 -360563 -128235 -350847 -301544 -274056
16281b74056n8086J08297o812d8913j23746A09961P5886B8833M8043C5006J75807
$$ -274056 -332142 -223845 -230657 -48913 -172659 109961 185847 28833 76876 35006 210813
16270B10813K54799j38426k5968N7809J80410j83701j6445j14838J61H6741J36875
$$ 210813 465612 327186 301218 359027 539437 355736 339291 224453 224614 86741 223616
16259B23616B6781R0315k8337J81270j1108A28863A3487J8821J87359D2040K47954
$$ 223616 26781 117096 88759 270029 258921 128863 13487 32308 219667 42040 289994
16248B89994n1995M8367L23921k69133K09668j44989K17018J18641r7422J06556
$$ 289994 237999 286366 610287 341154 550822 405833 622851 741492 644070 750626
16238G50626Q9676n6878N2547n3243o697k38689P5143k07477J92852j30851B09911
$$ 750626 840302 783424 835971 782728 776031 537342 612485 405008 597860 467009 209911
16226B91359R3320j85651K34631p3866j03596N7404l5244K05766L2952Q910A14150
$$ 291359 384679 199028 433659 359793 256197 313601 278357 484123 517075 525985 114150
16214C60537K77184j84569K6793J61050j64556K82694k2305o5287q7669j01388
$$ 360537 637721 453152 479945 640995 476439 759133 736828 671541 583872 482484
16204D82484J64425J00241k57927J47203k44063K92428j54586J0077j25959G6874
$$ 482484 646909 747150 489223 636426 392363 684791 530205 540282 414323 76874
16193A62176K86776j5046A22975L45089L15448k86858M4651k52386J77194K8362
$$ 162176 448952 433906 122975 468064 783512 496654 541305 288919 466113 494475
16183D94475j77201K75155J38330j85484K5324J4440l682k09843N7683P3057J02774
$$ 494475 317274 592429 730759 545275 570599 585039 581357 371514 429197 502254 605028
16172F05028J09408k14127K72548l08244P1683R9962l1218o967J23510j71270
$$ 605028 714436 500309 772857 464613 536296 636258 605040 598073 721583 550313
16162E50313j1711j23288K08710j38357J22404p7957j82667p0518K93397J86263
$$ 550313 538602 415314 624024 485667 608071 530114 347447 276929 570326 756589
16152G56589j40928N2884j65673P7740L6987j21792J52040J5451k20793K88931
$$ 756589 615661 668545 502872 580612 617599 495807 647847 663298 442505 731436
16142G31436k55600L53838l36942L09611K0099J14065l87099j5693J21317J06624
$$ 731436 475836 829674 492732 802343 822442 936507 549408 533715 655032 761656
16132G61656n9166n6379n474j1837L3542j951q5033L54786K6785j68515K49488
$$ 761656 702490 646111 640637 628800 662342 660391 575358 930144 956929 788414 1037902
16121A037902j66083K4076k34093K49366M3383k34292m94K06886l45897K88077
$$ 1037902 871819 895895 661802 911168 954551 720259 719765 926651 580754 868831
16111H68831r2245J11464j64947K97004k54171J0334P8116k71007K01504O1626
$$ 868831 776586 888050 723103 1020107 765936 776270 854386 583379 784883 846509
16101H46509J21260k60072Q2997j00290J54566O3142j44353R3564j52232p2148
$$ 846509 967769 707697 790694 690404 844970 908112 763759 857323 705091 632943
16091F32943K1979J38644P0356l4486q4631J73918q9205L9394O7336r86P1228
$$ 632943 654922 793566 863922 829436 744805 918723 829518 868912 936248 935262 1006490
16080A006490J348j04331k3454k6729J03995j2459k4191L16904k75537K61570
$$ 1006490 1007838 903507 880053 853324 957319 944860 920669 1237573 962036 1223606
16070A223606l37959K5444K33670j13523K00940J91851j92191L9256k1963q0318
$$ 1223606 885647 911091 1144761 1031238 1232178 1424029 1231838 1271094 1249131 1168813
16060A168813J77274j08380N1939k07708K80099K1627R999l6067J41569L5797
$$ 1168813 1346087 1237707 1289646 1081938 1362037 1383664 1393663 1357596 1499165 1534962
16050A534962k26819P3353K19253k17536N5442J69165p4921P4382k45502J78593
$$ 1534962 1308143 1381496 1600749 1383213 1438655 1607820 1532899 1607281 1361779 1540372
16040A540372J5015r8890Q5984p006J03062k60148K60056j97118K27533R9946
$$ 1540372 1555387 1456497 1542481 1535475 1638537 1378389 1638445 1441327 1668860 1768806
16030A768806q2166j28850N8051K6910P0094j72010L20578k14730K19328K2508
$$ 1768806 1686640 1557790 1615841 1642751 1712845 1540835 1861413 1646683 1866011 1888519
16020A888519n6629L189J06246J49428p1538k4418M9771O4596j18027L26636k94773
$$ 1888519 1831890 1835079 1941325 2090753 2019215 1994797 2044568 2109164 1991137 2317773 2023000
16009B023000j66106q3400K54380k31694L64488O2133l94391P1601j63461K16530
$$ 2023000 1856894 1773494 2027874 1796180 2160668 2222801 1828410 1900011 1736550 1953080
15999A953080K02614m54921L65070j62540K08970k41763R7678R327P8628j99732
$$ 1953080 2155694 1700773 2065843 1903303 2112273 1870510 1968188 1977515 2056143 1856411
15989A856411K94577l72796J80902p1524R3432K9369J85394j1099M683k4344j21826
$$ 1856411 2150988 1778192 1959094 1887570 1981002 2010371 2195765 2184666 2189349 2165005 2043179
15978B043179O2801j47310J26501J04306J81183k32653J66027l5954p6099k01877
$$ 2043179 2105980 1958670 2085171 2189477 2370660 2138007 2304034 2268080 2191981 1990104
15968A990104J6632J39711j90581j38566K46006m398K5987J32926k31747n2062
$$ 1990104 2006736 2146447 1955866 1817300 2063306 2058908 2084895 2217821 1986074 1934012
15958A934012l5231R0589k23650L04928j57677J59854J4991R5508k48948J27595
$$ 1934012 1898781 1989370 1765720 2070648 1912971 2072825 2087816 2183324 1934376 2061971
15948B061971K44930J39889l91166J8935J02854l6211R9158j38318j2236K66276
$$ 2061971 2306901 2446790 2055624 2074559 2177413 2141202 2240360 2102042 2089806 2356082
15938B356082k96854K68584j27005M4955K6843K8380J30819j75569R6781N8733
$$ 2356082 2059228 2327812 2200807 2245762 2272605 2300985 2431804 2256235 2353016 2411749
15928B411749J51948L34970l25055J75458o5741J83266K75770q4418K77977J0741
$$ 2411749 2563697 2898667 2573612 2749070 2683329 2866595 3142365 3057947 3335924 3346665
15918C346665Q6574L67000K69227L36531L42030P34802M94993R41433J366702
$$ 3346665 3433239 3800239 4069466 4405997 4748027 5482829 5977822 6919255 8285957
15909H285957K144874L012316M347876N717817P114782P754391P486444O492607
$$ 8285957 10430831 13443147 17791023 23508840 30623622 38378013 45864457 52357064
15901E2357064M810140K515350N97048j809781m139981n764850p138656o981260
$$ 52357064 57167204 59682554 60279602 58469821 54329840 48564990 41426334 34445074
15893C4445074o732890n899579m805571l615973k715733j642544j767251j227165
$$ 34445074 27712184 21812605 17007034 13391061 10675328 9032784 7265533 6038368
15885F038368q32977n30677m65301m75958l84613k41536o2810j84834k80618J58968
$$ 6038368 5205391 4674714 4209413 3733455 3348842 3107306 3044496 2859662 2579044 2738012
15875B738012m928J892J206n8543j32869J45760l7662m790j47387k3449j86229
$$ 2738012 2733084 2734976 2736182 2677639 2544770 2690530 2652868 2648078 2500691 2477242 2291013
15864B291013K1007M7529l65073j20865L67289k01396j84766J16500o7061J92326
$$ 2291013 2312020 2359549 1994476 1873611 2240900 2039504 1854738 1971238 1904177 2096503
15854B096503j79402J63749K6290J00832n2058q0666j45651Q6682M0408n6588
$$ 2096503 1917101 2080850 2107140 2207972 2155914 2075248 1929597 2016279 2056687 2000099
15844B000099N4905O5285q6979J66611j19068L02382k61151L25318Q587r7992
$$ 2000099 2055004 2120289 2033310 2199921 2080853 2383235 2122084 2447402 2455989 2357997
15834B357997R4399L9430m7852j41789K68687n7278m24591J23815m00482J63487
$$ 2357997 2452396 2491826 2443974 2302185 2570872 2513594 2089003 2212818 1812336 1975823
15824A975823J11349r9317L15352k41013P8425Q4161m45892K29816j42143K58323
$$ 1975823 2087172 1987855 2303207 2062194 2140619 2224780 1778888 2008704 1866561 2124884
15814B124884m0027J34883J3719J88740r5323J44332k79196o5947K59166j11203
$$ 2124884 2084857 2219740 2233459 2422199 2326876 2471208 2192012 2126065 2385231 2274028
15804B274028M8880J24166l8401K63343r2841J27613n2682M83913l09239K43024
$$ 2274028 2322908 2447074 2408673 2672016 2579175 2706788 2654106 3138019 2828780 3071804
15794C071804O0145K84563j53675J56965K3964m2369j54m5199J71221J18119j96422
$$ 3071804 3131949 3416512 3262837 3419802 3443766 3401397 3401243 3356044 3527265 3645384 3448962
15783C448962M51034j48316M34132J06109J24406K0736M36167L0509k94057L61496
$$ 3448962 3899996 3751680 4185812 4291921 4416327 4437063 4873230 4903739 4609682 4971178
15773D971178l23283j85819J05740M6777n1592m9340J86133K1694m0268r3815
$$ 4971178 4647895 4462076 4567816 4614593 4563001 4513661 4699794 4721488 4681220 4587405
15763D587405M49590j74734J82650Q760M9356r622k91174k9982J46094j81275
$$ 4587405 5036995 4862261 5044911 5053671 5103027 5093405 4802231 4772249 4918343 4737068
15753D737068m2066P1262M3214K84429K5687j54961K11932M584R4457M50408J00834
$$ 4737068 4695002 4766264 4809478 5093907 5119594 4964633 5176565 5181149 5275606 5726014 5826848
15742E826848L62182P9414L21465J69957j3686K27041j895K58415j38565o4127
$$ 5826848 6189030 6268444 6589909 6759866 6746180 6973221 6971326 7229741 7091176 7027049
15732G027049j20589J88687K66750R5903L05115p8312p657j85324l7365o4660
$$ 7027049 6906460 7095147 7361897 7457800 7762915 7684603 7676946 7491622 7454257 7389597
15722G389597n00953l3365l08525j09718j592R4088j27376j51572o8709j28320
$$ 7389597 6888644 6855279 6546754 6437036 6435444 6529532 6402156 6250584 6181875 6053555
15712F053555M21751l48340n9718J51289l17435N4484K12458M5940K07606L58643
$$ 6053555 6475306 6126966 6067248 6218537 5901102 5955586 6168044 6213984 6421590 6780233
15702F780233K24284L18113J92291J1365K99060J87653j285j74696J39615J91600
$$ 6780233 7004517 7322630 7514921 7526286 7825346 8012999 8011714 7837018 7976633 8168233
15692H168233j69020j77129j82460L6052K11612l66442j09275q2755P7271l84860
$$ 8168233 7999213 7822084 7639624 7675676 7887288 7520846 7411571 7328816 7406087 7021227
15682G021227r4728O2308j38467j74050N6955J95764n22418j93423K0338j66977
$$ 7021227 6926499 6988807 6850340 6676290 6733245 6929009 6406591 6213168 6233506 6066529
15672F066529k56363J70896k7628j14188J0111J44659j81554M22486L8544M6348
$$ 6066529 5810166 5981062 5953434 5839246 5849357 5994016 5812462 6234948 6273492 6319840
15662F319840N07862K80401K55191L63820N84774K64058M92801M66020L50856
$$ 6319840 6827702 7108103 7363294 7727114 8311888 8575946 9068747 9534767 9885623
15653I885623O61960O11543P49182M22856N10071P42076K58095M83715M85382
$$ 9885623 10547583 11159126 11908308 12331164 12841235 13583311 13841406 14325121 14810503
15644A4810503P56866M20387O42180N48645J160151R62598R62750Q00949L54879
$$ 14810503 15567369 15987756 16629936 17178581 18338732 19301330 20264080 21065029 21419908
15635B1419908P95254k24747K89791k28671j04940o0926m38705j92384J33483
$$ 21419908 22215162 21990415 22280206 22051535 21946595 21885669 21446964 21254580 21388063
15626B1388063j77432N17185l46728o2424k65641m22374j035554l63639j192210
$$ 21388063 21210631 21727816 21381088 21318664 21053023 20630649 19595095 19231456 18039246
15617A8039246q50401j180652n86084q22598o17350m20286n22941k92656k84043
$$ 18039246 17188845 16008193 15422109 14599511 13982161 13561875 13038934 12746278 12462235
15608A2462235n36907l62810j17048n25114k92100j2752o40415j33754k23218
$$ 12462235 11925328 11562518 11445470 10920356 10628256 10615504 9975089 9841335 9618117
15599I618117r691k22910p690J22450J00877O07508O34636J214962K280004M964926
$$ 9618117 9608426 9385516 9377826 9500276 9601153 10208661 10843297 12058259 14338263 19303189
15589A9303189J0264101J5992664J4369454R076852N859610L532531Q79158j960514
$$ 19303189 29567290 45559954 59929408 69006260 74865870 78398401 79277559 77317045
15581G7317045n943590r354474j2087284j2965148j0820142o310349m186697l033097
$$ 77317045 71373455 62018981 49931697 36966549 26146407 19836058 15649361 12616264
15573A2616264j913200j169497o20946k45327l33292k77685L59460q1648L82294
$$ 12616264 10703064 9533567 8912621 8667294 8334002 8056317 8415777 8334129 8716423
15564H716423r4173J18254K02881P6698K81817N38089J301986J478826L863487
$$ 8716423 8622250 8740504 8943385 9020083 9301900 9839989 11141975 12620801 16484288
15555A6484288Q425548J5260855K2057483J6511672J0777368O817858L362717
$$ 16484288 24909836 40170691 62228174 78739846 89517214 96335072 99697789
15548I9697789j17151l846129r040379j3450182j6435031j6871905j2291935p647706
$$ 99697789 99580638 95734509 86694130 73243948 56808917 39937012 27645077 19997371
15540A9997371m984646l418309j996148j594389q03024p30189m66729k90467J81629
$$ 19997371 15012725 11594416 9598268 8003879 7200855 6470666 6003937 5713470 5895099
15531E895099l30655J84448j60098k27034k2451j78703k23654j55335r2659j50611
$$ 5895099 5564444 5748892 5588794 5361760 5339309 5160606 4936952 4781617 4688958 4538347
15521D538347j67538k9019q6768j83246Q4340R6917M0078K6995l6701J66577L1047
$$ 4538347 4370809 4341790 4255022 4071776 4156116 4253033 4293111 4320106 4283405 4449982 4481029
15510D481029j99765L81823K2031J59100l43587K86668j04417j26262J67016l31914
$$ 4481029 4281264 4663087 4685118 4844218 4500631 4787299 4682882 4556620 4723636 4391722
15500D391722R1590q7235P7688k00565P2963J21650q320J08558J15100J74298
$$ 4391722 4483312 4396077 4473765 4273200 4346163 4467813 4459493 4568051 4683151 4857449
15490D857449k97288J64681R7864l1586R8511L88075l2388M24171K235K73171
$$ 4857449 4560161 4724842 4822706 4791120 4889631 5277706 5245318 5669489 5671724 5944895
15480E944895J50308n3716J51852K10014R9145n05288J55983K23739K56909M31634
$$ 5944895 6095203 6041487 6193339 6403353 6502498 5997210 6153193 6376932 6633841 7065475
15470G065475P48995O01796Q42198O25770N58416K66115J5622j26371j43502o13067
$$ 7065475 7814470 8416266 9258464 9884234 10442650 10708765 10724387 10598016 10454514 9841447
15460I841447m45449l87765m05954M20837J30147O48116N26137M58538N63772
$$ 9841447 9395998 9008233 8602279 9023116 9153263 9801379 10327516 10786054 11349826
15451A1349826L94448l811j19525k27842k29807l12557q44292n49771j77855J10742
$$ 11349826 11744274 11740463 11620938 11393096 11163289 10850732 10006440 9456669 9278814 9389556
15441I389556j53746J94296L69832j29689J84233q5412j03526p5081q3193m47906
$$ 9389556 9235810 9430106 9799938 9670249 9854482 9769070 9665544 9590463 9507270 9059364
15431I059364n39614j43822j26941m98003k96638L6187k35457l76584K19966k03257
$$ 9059364 8519750 8375928 8248987 7750984 7454346 7490533 7255076 6878492 7098458 6895201
15421F895201l52830l21709j57977J71427l16761l49252j56360J96867k55796
$$ 6895201 6542371 6220662 6062685 6234112 5917351 5568099 5411739 5608606 5352810
15412E352810J43880k82630K03016j05997j9605j96398l5421L08855j91478J34252
$$ 5352810 5496690 5214060 5417076 5311079 5291474 5095076 5059655 5368510 5177032 5311284
15402E311284J48810m3403L68655N3203J17032m1712J85253k40861O7285q5643
$$ 5311284 5460094 5416691 5785346 5838549 5955581 5913869 6099122 5858261 5925546 5839903
15392E839903P2984k24997N0653q7658J75721j23010m3057j31672K96719J26982
$$ 5839903 5912887 5687890 5738543 5650885 5826606 5703596 5660539 5528867 5825586 5952568
15382E952568l62805K1857J58352P6295j09723o6471J10359j74757r616m7098
$$ 5952568 5589763 5611620 5769972 5846267 5736544 5670073 5780432 5605675 5596059 5548961
15372E548961l479j38061K98880j26130L38936j33504j04442L74098n345J53077
$$ 5548961 5545482 5407421 5706301 5580171 5919107 5785603 5681161 6055259 6049914 6202991
15362F202991r0223J95221L3045L77821N9110Q4381l9242J21647L65475K19040
$$ 6202991 6112768 6307989 6341034 6718855 6777965 6862346 6823104 6944751 7310226 7529266
15352G529266L91202O46025L07691J436196J978602M057020O840207Q616069P666688
$$ 7529266 7920468 8566493 8874184 10310380 12288982 16346002 23186209 31802278 39468966
15343C9468966M958357L210733J911025O2501j407549l665479n442976o408464
$$ 39468966 44427323 47638056 49549081 49611582 48204033 44538554 39095578 32687114
15335C2687114o147778m698148k983626j922358r60801r55474m28604p06395n20010
$$ 32687114 26539336 21841188 18857562 16935204 15974403 15018929 14590325 13883930 13363920
15326A3363920m91722n54702k36447K451K7025J02465O48371J78090M07705O76736
$$ 13363920 12872198 12317496 12081049 12083500 12110525 12212990 12861361 13039451 13447156 14123892
15316A4123892J470592K978594N640352R659872J3826569J4253311J2580578Q353949
$$ 14123892 15594484 18573078 24213430 33873302 47699871 61953182 74533760 82887709
15308H2887709M877287J651502j663089n196093q767800j2030046j2892350j1705809
$$ 82887709 87764996 89416498 87753409 82557316 73789516 61759470 48867120 37161311
15300C7161311r020677o021517l836739k744079j307314r18997n54535n28412
$$ 37161311 28140634 22119117 18282378 15538299 14230985 13311988 12757453 12229041
15292A2229041K26313N1792k00234L35702k48591o9728l7699O4320j10995P7983
$$ 12229041 12455354 12507146 12306912 12642614 12394023 12324295 12286596 12350916 12239921 12317904
15282A2317904M62563R16829K133194M357352P253302P612549O344836M251071
$$ 12317904 12780467 13697296 15830490 20187842 27441144 35053693 41398529 45649600
15274D5649600K276246J320165j056040k070387l819414o114430o696821o348241
$$ 45649600 47925846 49246011 48189971 46119584 42300170 36185740 29488919 23140678
15266B3140678m556257k597514k120937j800564r87190p79879p97473n64150j19004
$$ 23140678 18584421 15986907 13865970 12065406 11078216 10298337 9500864 8936714 8817710
15257H817710q3893p7304L42015L9579L5615O1851O70029J34998L62908l56731
$$ 8817710 8733817 8656513 8998528 9038107 9073722 9135573 9805602 9940600 10303508 9946777
15247I946777o1838J08473l01439k82940J25194m87157l06223m1195n3418j79590
$$ 9946777 9884939 9993412 9691973 9409033 9534227 9047070 8740847 8699652 8646234 8466644
15237H466644N14675N52562K74943N10459O16567N89508J33833J29162k45076
$$ 8466644 8981319 9533881 9808824 10319283 10935850 11525358 11659191 11788353 11543277
15228A1543277J9842l43809q2622m93581k91015k82696m00641k43252r5710r5664
$$ 11543277 11563119 11219310 11136688 10643107 10352092 10069396 9668755 9425503 9329793 9234129
15218I234129J76647Q7586N1184O12824J50938M80006K48817k06238Q8362l74568
$$ 9234129 9410776 9498362 9549546 10162370 10313308 10793314 11042131 10835893 10924255 10549687
15208A0549687l94511n61908l25794o93574o04315n80836m92092Q5985p53840
$$ 10549687 10155176 9593268 9267474 8573900 7969585 7388749 6896657 6982642 6228802
15199F228802J71101m92143J28135j46777l6792L89088l09815K45204l6251M94546
$$ 6228802 6399903 5907760 6035895 5889118 5852326 6241414 5931599 6176803 6140552 6635098
15189F635098q0235K41071j29922J23374R8528N7284R3321k1306L01435k51227
$$ 6635098 6554863 6795934 6666012 6789386 6887914 6945198 7038519 7017213 7318648 7067421
15179G067421L57482L76826p7332K08001J74495j06759L9091j703m4728J73776
$$ 7067421 7424903 7801729 7724397 7932398 8106893 8000134 8039225 8037522 7992794 8166570
15169H166570j94442q3778j80995Q8501j8604L2073K16932j02643p9010R2243
$$ 8166570 7972128 7888350 7707355 7795856 7777252 7809325 8026257 7923614 7844604 7936847
15159G936847K04241J05530R7532J57242k07606J99183K02592j43468J55380k38025
$$ 7936847 8141088 8246618 8344150 8501392 8293786 8492969 8695561 8552093 8707473 8469448
15149H469448o8091J1513j72145j04693r2659K68458k01222J2099m9102L05208
$$ 8469448 8401357 8412870 8240725 8136032 8043373 8311831 8110609 8122708 8073606 8378814
15139H378814M0981k16745p0108N01563l32978K81679k81540L37750m86140K17380
$$ 8378814 8419795 8203050 8132942 8634505 8301527 8583206 8301666 8639416 8153276 8370656
15129H370656q1843R5299L3370m3374R2424J7284k01635j93712K3701r7677J39303
$$ 8370656 8288813 8384112 8417482 8374108 8466532 8483816 8282181 8088469 8112170 8014493 8153796
15118H153796k25063r1556P4056k43683J3556J55627j66013l02726K19059J03227
$$ 8153796 7928733 7837177 7911233 7667550 7681106 7836733 7670720 7367994 7587053 7690280
15108G690280l0314K60095j8268l67262L11928N96850J51324J88928p305M08135
$$ 7690280 7659966 7920061 7901793 7534531 7846459 8443309 8594633 8783561 8776256 9184391
15098I184391O3557L40141L46263J48826L55516M23143R85278R68973J896330
$$ 9184391 9247948 9588089 9934352 10083178 10438694 10861837 11847115 12816088 14712418
15089A4712418K951466L279743K891938J900211J465401O15631M40479p04910
$$ 14712418 17663884 20943627 23835565 25735776 27201177 27816808 28257287 27552377
15081B7552377j060997j720844k019263j490668p56905N07507J823536L129677
$$ 27552377 26491380 24770536 22751273 21260605 20503700 21011207 22834743 25964420
15073B5964420K852817J908002J790755Q01807K88934n26763o85264j596709r06624
$$ 25964420 28817237 30725239 32515994 33317801 33606735 33079972 32394708 30797999 29891375
15064B9891375M3158K979448M647245L457410K559240K218078K075736J681359
$$ 29891375 29934533 32913981 37561226 41018636 43577876 45795954 47871690 49553049
15056D9553049J082423N12132q61973j871128j867101o3296J320105K321402L138747
$$ 49553049 50635472 51147604 50285631 48414503 46547402 46484106 47804211 50125613 53264360
15047E3264360K750739J275163O28793N68880P19414N23238k93879j573062k403149
$$ 53264360 56015099 57290262 57919055 58487935 59207349 59730587 59436708 57863646 55460497
15038E5460497l161782l051327k390549k635133k387748k019239j731108o50699
$$ 55460497 52298715 49247388 46856839 44221706 41833958 39814719 38083611 37432912
15030C7432912J390168L695610L887673K874666K140272K060429J766453J544336
$$ 37432912 38823080 42518690 46406363 49281029 51421301 53481730 55248183 56792519
15022E6792519J394310J388119J612364K364435L766555O249248Q609936R506351
$$ 56792519 58186829 59574948 61187312 63551747 67318302 73567550 82177486 91683837
15014I1683837R636921Q221004P233437O305084M611782K426193L48535k144728
$$ 91683837 101320758 109541762 116775199 123080283 127692065 130118258 130466793 128322065
15006A28322065m136354n934261o443993o945234p295579o816985n744649m632257
$$ 128322065 124185711 118251450 111807457 104862223 97566644 90749659 85005010 80372753
14998H0372753l193007k484332k195849k229411j840374j992167k309201l233045
$$ 80372753 77179746 74695414 72499565 70270154 68429780 66437613 64128412 60895367
14990F0895367l323914l030294k705109j108133K29196K31809k18566J62267N63733
$$ 60895367 57571453 54541159 51836050 50727917 50957113 51188922 50970356 51132623 51696356
14981E1696356K77134n42739j774892k709487l568575l220557l748574k532199
$$ 51696356 51973490 51430751 49655859 46946372 43377797 40157240 36408666 33876467
14973C3876467k692343k038993j626928j059916m62165k09745J9277K85534N07966
$$ 33876467 31184124 29145131 27518203 26458287 25996122 25786377 25805654 26091188 26599154
14964B6599154O25085O37617M60862J311803J121536J880878K723801M516576
$$ 26599154 27224239 27861856 28322718 29634521 30756057 32636935 35360736 39877312
14956C9877312O866966R646167J3006243J8379254K3554556K7077746K9663157
$$ 39877312 46744278 56390445 69396688 87775942 111330498 138408244 168071401
14949A68071401L3776211L5282032L3558825L2190517L0451989K3367493J0243655
$$ 168071401 201847612 237129644 270688469 302878986 333330975 356698468 366942123
14942C66942123k618127j1628623j7391021k1552990k3199230k4979329k6843634
$$ 366942123 364323996 352695373 335304352 313751362 290552132 265572803 238729169
14935B38729169k5586242k1942745j5829061j1363656j0606290j0187950j1331494
$$ 238729169 213142927 191200182 175371121 164007465 153401175 143213225 131881731
14928A31881731j1882243j1160640r798874q279571n286467k614294r47825j676970
$$ 131881731 119999488 108838848 99039974 90760403 85473936 82859642 81911817 80234847
14920H0234847k882774l104148l372037m653252n117088o967761p568873q374814
$$ 80234847 77352073 74247925 70875888 66222636 61105548 54137787 46568914 38194100
14912C8194100o929571n797863l963086l002588j816617j191051o38840k48576
$$ 38194100 31264529 25466666 21503580 18500992 16684375 15493324 14854484 14605908
14904A4605908K35169L28360Q62141J110922J409373J028463J618562K171969
$$ 14605908 14841077 15169437 16031578 17142500 18551873 19580336 21198898 23370867
14896B3370867L586391M947572O334153N062288L302822J746118Q02088p83071
$$ 23370867 26957258 31904830 38238983 43301271 46604093 48350211 49152299 48369228
14888D8369228j872360l272396m891638n323450n446224m050144k702530j947957
$$ 48369228 46496868 43224472 38332834 33009384 27563160 23513016 20810486 18862529
14880A8862529j008205o14444p72678M7403L61065R48248J222001Q57667N11955
$$ 18862529 17854324 17239880 16467202 16514605 16875670 17823918 19045919 19903586 20415541
14871B0415541K18035L17711O6856J90017q0477k11803o8299k42117L89017R88016
$$ 20415541 20633576 20951287 21018143 21208160 21127683 20915880 20847581 20605464 20994481 21982497
14861B1982497K243334L422678O853276R057785R963446J0584643J1038767R899662
$$ 21982497 24225831 27648509 34501785 43559570 53523016 64107659 75146426 85046088
14853H5046088O831871K949784p03015m363596p016102r409369j0357881j0652592
$$ 85046088 91877959 94827743 94124728 89761132 82745030 73335661 62977780 52325188
14845E2325188r592225q169788o281575l943513k968489j851988j280827j102674
$$ 52325188 42732963 34563175 28281600 24338087 21369598 19517610 18236783 17134109
14837A7134109p90377l37628m19921l88070j47839j01045n55208J97063m3243
$$ 17134109 16343732 16006104 15586183 15198113 15050274 14949229 14394021 14591084 14547841
14828A4547841N32312N30164M51611Q76294Q02355Q96212J855558L057952N272563
$$ 14547841 15080153 15610317 16061928 16938222 17740577 18636789 20492347 23550299 28822862
14819B8822862Q324844Q964053Q340817N871725L125777J538499q76594l018937
$$ 28822862 37147706 46111759 54452576 60324301 63450078 64988577 64111983 61093046
14811F1093046n335852p462872q746525q774902o592092m570454l154596j772016
$$ 61093046 55757194 48294322 39547797 30772895 24180803 19610349 16455753 14683737
14803A4683737j206375j172219m85010m47721k13488l01193R3043k76874j57102
$$ 14683737 13477362 12305143 11820133 11372412 11158924 10857731 10950774 10673900 10516798
14794A0516798l76746l339j50520k37528j87855l59839R2735k39127K32439o3039
$$ 10516798 10140052 10136713 9986193 9748665 9560810 9200971 9293706 9054579 9287018 9223979
14784I223979m9632N7879M26889L14118N25859N46678R82642Q05417M06705M24343
$$ 9223979 9174347 9232226 9659115 9973233 10499092 11045770 12028412 12833829 13240534 13664877
14774A3664877J09395J24423m90658l97982p49003r75434j009728n37169j75272
$$ 13664877 13774272 13898695 13408037 13010055 12261052 11285618 10275890 9738721 9563449
14765I563449m04125m3199k51749K40214q494K6453L15405J20103L93028P1676
$$ 9563449 9159324 9116125 8864376 9104590 9096096 9122549 9437954 9558057 9951085 10022761
14755A0022761K12745K0709K96510J81233K21398N47929J85915N8159Q8459L06585
$$ 10022761 10235506 10256215 10552725 10733958 10955356 11503285 11689200 11747359 11835818 12142403
14745A2142403J12246p6857J26742M98277J71300N77800P33788J276132J244874
$$ 12142403 12254649 12177792 12304534 12802811 12974111 13551911 14285699 15561831 16806705
14736A6806705J937679K511662L410574N216404P682291J2212351J8792062K8510915
$$ 16806705 18744384 21256046 24666620 29883024 37565315 49777666 68569728 97080643
14728I7080643L5398835L7417123L6538560L0438999K0395362R551542j323342
$$ 97080643 132479478 169896601 206435161 236874160 257269522 266821064 265497722
14721B65497722j1912301k2378444l0928846l4951090l4209306l1321945k5235527
$$ 265497722 253585421 231206977 200278131 165327041 131117735 99795790 74560263
14714G4560263j8380694j3118714q595549o496411m164914l332692k499951j740558
$$ 74560263 56179569 43060855 34465306 27968895 23803981 20471289 17971338 16230780
14706A6230780j257548j236846p17898j088621r19423q69194l24238q42630l77855
$$ 16230780 14973232 13736386 13018488 11929867 11010444 10141250 9817012 8974382 8596527
14697H596527k85237l30511k43773M00437j35394J47913l17829j2738O9225J26711
$$ 8596527 8311290 7980779 7737006 8137443 8002049 8149962 7832133 7819395 7888620 8015331
14687H015331J35648j13580q0349j44781J91512J14020P0457K15634J08934M42791
$$ 8015331 8150979 8037399 7957050 7812269 8003781 8117801 8188258 8403892 8512826 8955617
14677H955617P75716R27994J038202M88501N25391K59784N9642n78284o47445
$$ 8955617 9731333 10659327 11697529 12186030 12711421 12971205 13030847 12452563 11805118
14668A1805118o28357q09784j185482k72719j27072K9780k79528n0329k76022
$$ 11805118 11176761 10366977 9181495 8908776 8781704 8811484 8531956 8481627 8205605
14659H205605Q0122k01645k38331o63257j97683p84268J11409k42843j21767N0140
$$ 8205605 8285727 8084082 7845751 7182494 6984811 6200543 6311952 6069109 5947342 5997482
14649E997482P8172J81369P99253O9159M26964Q5131K79982K43443o1232K82220
$$ 5997482 6075654 6257023 7056276 7125435 7552399 7637530 7917512 8160955 8099723 8381943
14639H381943J35619L00953L02217N81847J008689N30020M46146L35k1270k93946
$$ 8381943 8517562 8818515 9120732 9702579 10711268 11241288 11687434 11687769 11666499 11372553
14629A1372553q61976j140519q03199j335070q89397p09762p00312k87381j05828
$$ 11372553 10510577 9370058 8566859 7231789 6342392 5632630 4932318 4644937 4539109
14620D539109l40568k1402M4254J35383l06098K8539J24436l10902M49838l66380
$$ 4539109 4198541 4177139 4221393 4356776 4050678 4079217 4203653 3892751 4342589 3976209
14610C976209m5669J68999j64771M0204j78730Q4896J79254K1933m2492N60349
$$ 3976209 3930540 4099539 3934768 3974972 3796242 3881138 4060392 4082325 4039833 4600182
14600D600182L72360N97265J048379R27475Q33990L79576K67954l29791J3367
$$ 4600182 4972542 5569807 6618186 7545661 8379651 8759227 9027181 8697390 8710757
14591H710757m80828j125599o54762p91701o35362o81493j76875k75028r9070
$$ 8710757 8229929 7104330 6449568 5657867 5022505 4341012 4164137 3889109 3790039
14582C790039k4221p149P4568K4663J33716j60792J56200k4746R6090L30809Q9149
$$ 3790039 3765818 3758669 3833237 3857900 3991616 3830824 3987024 3962278 4058368 4389177 4478326
14571D478326J69133M5116L80092L72842O45140Q83338N90952P62436M60606J341847
$$ 4478326 4647459 4692575 5072667 5445509 6090649 6973987 7564939 8327375 8787981 10129828
14561A0129828J604524L442764O262281R244110Q731946O306883L992618J974391
$$ 10129828 11734352 15177116 21439397 30683507 39415453 45722336 49714954 51689345
14553E1689345Q82946j208592k753005o045857o901617p477099n811813k979253
$$ 51689345 52572291 51363699 48610694 42564837 35663220 28186121 22374308 19395055
14545A9395055K66165L588794P459695R414355P711982N345964K958802J538429
$$ 19395055 19661220 23250014 30709709 40124064 47836046 53182010 56140812 57679241
14537E7679241l32377k567070n491939p188002q398859p828563n207156l311632
$$ 57679241 57346864 54779794 49287855 42099853 33700994 25872431 20665275 17353643
14529A7353643j925857j025169o59008k57845j88534l06340k70913J66795P78556
$$ 17353643 15427786 14402617 13743609 13485764 13297230 12990890 12719977 12886772 13665328
14520A3665328K590535M677685O893143O081480L998822K873192J368366M28002
$$ 13665328 16255863 20933548 27826691 33908171 37906993 40780185 42148551 42576553
14512D2576553q88775k406725l753308m393111m767542k811861j044137R72996
$$ 42576553 41687778 39281053 35527745 31134634 26367092 23555231 22511094 23484090
14504B3484090L202616N769209N935068L914097J916686J413590L97466j094983
$$ 23484090 26686706 32455915 38390983 42305080 44221766 45635356 46032822 44937839
14496D4937839k809275m257634m977287n400269m855882l496243k549760k087955
$$ 44937839 42128564 37870930 32893643 27493374 22637492 19141249 16591489 14503534
14488A4503534j878539j477380j239974j428720j122008j372333m40549p80481
$$ 14503534 12624995 11147615 9907641 8478921 7356913 5984580 5544031 4763550
14480D763550m06118j98090l7234l80620R5562J78361j97229J9687K30065N66822
$$ 4763550 4357432 4159342 4122108 3741488 3837050 4015411 3818182 3837869 4067934 4634756
14470D634756P57877Q81390o8306N47726J85542M2075q4381j46790l01252J08560
$$ 4634756 5392633 6274023 6205717 6753443 6938985 6981060 6896679 6749889 6448637 6557197
14460F557197j99999N54201O03265L93177L55668M34524K33999k36835j47040
$$ 6557197 6357198 6911399 7514664 7907841 8263509 8698033 8932032 8695197 8548157
14451H548157p25996m22302o97107n04017l44428N3159J60603N0025K43517J27685
$$ 8548157 7822161 7399859 6702752 6198735 5854307 5907466 6068069 6118094 6361611 6489296
14441F489296L61633L26979R9055M6151J86904M85746L30208J03217L98356M35054
$$ 6489296 6850929 7177908 7276963 7323114 7510018 7995764 8325972 8429189 8827545 9262599
14431I262599P53276J973465K363544M608517O338287O644836N985941M828442
$$ 9262599 10015875 11989340 14352884 18961401 25299688 31944524 37930465 42758907
14423D2758907L217095J547863J85352j631977l103110m871301n857907n434349
$$ 42758907 45976002 47523865 47709217 46077240 42974130 38102829 32244922 26810573
14415B6810573n010772l546863k975807k225475j743283j055275j258012p66283
$$ 26810573 21799801 18252938 15277131 13051656 11308373 10253098 8995086 8228803
14407H228803k41187l38480r3337J25739l74165J56148j17928j5343N91774K20588
$$ 8228803 7987616 7649136 7555799 7681538 7307373 7463521 7345593 7330250 7922024 8142612
14397H142612M04302J296537J254617K489863L602675N765166Q861058J0833293
$$ 8142612 8546914 9843451 11098068 13587931 17190606 22955772 31816830 42650123
14389D2650123J1354359R332169P536486M684582J709787j067106m210167p294745
$$ 42650123 54004482 63336651 70873137 75557719 77267506 76200400 71990233 64695488
14381F4695488q853066j0148244r366243p641831o591157m409470l245968k255767
$$ 64695488 55842422 45694178 36327935 28686104 22094947 17685477 14439509 12183742
14373A2183742j461118j094196n14909p89259j74527j26887l05064j02087j65704
$$ 12183742 10722624 9628428 9113519 8324260 8149733 8022846 7717782 7615695 7449991
14364G449991k02772n021j50196N49191k4531Q11000P89436J622585J924634K720813
$$ 7449991 7247219 7242198 7092002 7641193 7616662 8427662 9217098 10839683 12764317 15485130
14354A5485130L909387M290096M642854M018506K955395J788979N56788q29921
$$ 15485130 19394517 23684613 28327467 32345973 35301368 37090347 37647135 36817214
14346C6817214j990629k715190l690902l960792l622959k606258j358030j129492
$$ 36817214 34826585 32111395 28420493 24459701 20836742 18230484 16872454 15742962
14338A5742962L04323J225898L105510M686773M373995M324184N049589O360865
$$ 15742962 16047285 17273183 20378693 25065466 29439461 33763645 38813234 45174099
14330D5174099Q148705J0194048J1430920J1264050R730937O659351M335646J672833
$$ 45174099 53322804 63516852 74947772 86211822 95942759 102602110 106937756 108610589
14322A08610589j000617n055061q039189j1238895j2620611j2354578j0928088
$$ 108610589 107609972 102554911 94515722 83276827 70656216 58301638 47373550
14315D7373550r124281o927046n611591m163563l413932k695780k246725j409247
$$ 47373550 38249269 31322223 25710632 21547069 18133137 15437357 13190632 11781385
14307A1781385j353570j171974q03954o97284q12566m63654m07046p07294j64179
$$ 11781385 10427815 9255841 8451887 7754603 6942037 6478383 6071337 5364043 5199864
14298E199864l16667l52679Q8040m01346p9995j41589j20531j55682j31984o6927
$$ 5199864 4883197 4530518 4618558 4217212 4137217 3995628 3875097 3719415 3587431 3520504
14288C520504k67844L8127j92661L9558q7711O9846l06898P5298K1271J65452
$$ 3520504 3252660 3290787 3098126 3137684 3049973 3119819 2812921 2888219 2909490 3074942
14278C074942k59104K09081L9993J38292p3013K26000m4333k7551j19331j95691
$$ 3074942 2815838 3024919 3064912 3203204 3130191 3356191 3311858 3284307 3164976 2969285
14268B969285k9567k03711m9800j02283o8011k2484k2935j15338o7537K43318
$$ 2969285 2939718 2736007 2686207 2583924 2515913 2493429 2470494 2355156 2287619 2530937
14258B530937l97577J73104R3617j05699o587J70054k84033J6991k34902K89543
$$ 2530937 2133360 2306464 2400081 2294382 2287795 2457849 2173816 2190807 1955905 2245448
14248B245448j76934K6133J16142m06083M3819K26416J59708l45339J90768Q089
$$ 2245448 2068514 2094647 2210789 1804706 1848525 2074941 2234649 1889310 2080078 2088167
14238B088167j47121M7793Q181L2020J40721j08847k08315l4632O9685j20678
$$ 2088167 1941046 1988839 1997020 2029040 2169761 2060914 1852599 1817967 1887652 1766974
14228A766974m460k94682J43873L26533k83323K61026j31337N7545k5749K00865
$$ 1766974 1762514 1467832 1611705 1938238 1654915 1915941 1784604 1842149 1816400 2017265
14218B017265J5419m6885L33773r9153k88914K93657o4236J36140r5191M02393
$$ 2017265 2032684 1985799 2319572 2220419 1931505 2225162 2160926 2297066 2201875 2604268
14208B604268K09840O43178M59208J97927L5510K10149K8452k89109l82590m39289
$$ 2604268 2814108 3457286 3916494 4114421 4149931 4360080 4388532 4099423 3716833 3277544
14198C277544l04456p88920j87916J3156j05984L0564l071n9352P3724K86652
$$ 3277544 2973088 2184168 1996252 2009408 1903424 1933988 1930917 1871565 1945289 2231941
14188B231941l931L336j35707k18113J28331K8081l56235K13863j23407J83450
$$ 2231941 2228010 2231346 2095639 1877526 2005857 2033938 1677703 1891566 1768159 1951609
14178A951609o8357K22936k3390J05645K92131l42370K46552l31231m4306P9356
$$ 1951609 1883252 2106188 2082798 2188443 2480574 2138204 2384756 2053525 2009219 2088575
14168B088575q3105Q5713k50778O7635k1043j8658j12894P5705o1707N9204J52903
$$ 2088575 2005470 2091183 1840405 1908040 1886997 1868339 1755445 1831150 1769443 1828647 1981550
14157A981550k41677M14659M7066j38510J53743l5250j85292M1156J08608R983
$$ 1981550 1739873 2154532 2201598 2063088 2216831 2181581 1996289 2037445 2146053 2156036
14147B156036j0080J47674j55593M62397O2230K36716L23191Q86058Q10394J223306
$$ 2156036 2145956 2293630 2138037 2600434 2662664 2899380 3222571 4108629 4919023 6142329
14137F142329Q92605R73890K71508L57615K3986k94706o33513n98985j028940
$$ 6142329 7034934 8008824 8280332 8637947 8661933 8367227 7733714 7134729 6105789
14128F105789p30616r02839q04798l51008m62464J55523l07544M96340K70251
$$ 6105789 5375173 4472334 3667536 3316528 2854064 3009587 2702043 3198383 3468634
14119C468634M44372q2702K99971O2953J49332N5017l03924j03680p49556N490
$$ 3468634 3913006 3830304 4130275 4193228 4342560 4397577 4093653 3989973 3240417 3245907
14109C245907l69119O3971k00254k38977J05651K7674k09147K25610N5877J20416
$$ 3245907 2876788 2940759 2740505 2501528 2607179 2634853 2425706 2651316 2707193 2827609
14099B827609M7497L28932O23501O44435J76618m3371J84588p0533P4123k51123
$$ 2827609 2875106 3204038 3827539 4471974 4648592 4605221 4789809 4719276 4793399 4542276
14089D542276N2238k89536k56247l8777J58036N35455M51403P22698J90215N72184
$$ 4542276 4594514 4304978 4048731 4009954 4167990 4703445 5154848 5877546 6067761 6639945
14079F639945J24999J32878j26280l85619k72844k21896m26996j36045n4344p2418
$$ 6639945 6764944 6897822 6771542 6385923 6113079 5891183 5464187 5328142 5273798 5201380
14069E201380M02885J04992M99195M38303M08742P43033R86537R04552J161754
$$ 5201380 5604265 5709257 6208452 6646755 7055497 7798530 8785067 9689619 10851373
14060A0851373J597873K293453K460785L119162M136088N193654P092647R884096
$$ 10851373 12449246 14742699 17203484 20322646 24458734 29652388 36745035 46629131
14052D6629131J2256563J3909504J3566076J1047664P587793M778387P30924k155139
$$ 46629131 58885694 72795198 86361274 97408938 104996731 109775118 110506042 108350903
14044A08350903n931764j0006439j2418952j3286924j1955658j0281674q384418
$$ 108350903 102419139 92412700 79993748 66706824 54751166 44469492 36085074
14037C6085074o666453m948034m237436l373983k268958k052001j901260j159064
$$ 36085074 29418621 24470587 20233151 16859168 14590210 12538209 10636949 9477885
14029I477885r30373p30356m87062q09400l84548m86970j24347l04027k84233
$$ 9477885 8547512 7817156 7330094 6520694 6136146 5649176 5524829 5220802 4936569
14020D936569o6848m24039n5115l41115k31903j55432K1523m43900Q3605j67883
$$ 4936569 4869721 4445682 4390567 4049452 3817549 3662117 3683640 3239740 3323345 3155462
14010C155462r2055J18103o1593l02869n9421k10906L68351l80487j7957m5100
$$ 3155462 3063407 3181510 3119917 2817048 2757627 2546721 2915072 2534585 2516628 2471528
14000B471528m1289p3020L0108j01799N2460j28290K72670j5291O7817k369M11886
$$ 2471528 2430239 2357219 2387327 2285528 2337988 2209698 2482368 2467077 2534894 2532525 2944411
13989B944411L24729L06035K28288O86836L61433O70504J047622L21055N32689
$$ 2944411 3269140 3575175 3803463 4490299 4851732 5522236 6569858 6890913 7423602
13980G423602K87109j99J36232n34317m74650n46781n59664o75615n25516m18582
$$ 7423602 7710711 7710512 7846744 7312427 6837777 6290996 5731332 5055717 4530201 4111619
13970D111619m12332j05823j43912k75585L2276j38995q2276k13624j88750j09935
$$ 4111619 3699287 3593464 3449552 3173967 3206243 3067248 2984972 2771348 2582598 2472663
13960B472663N7418k67179p4632k98250K54571k27736J03333P4291m7572J11593
$$ 2472663 2530081 2262902 2188270 1890020 2144591 1916855 2020188 2094479 2046907 2158500
13950B158500L8901N87137J2697j64105J92137M71305Q018J16801K91337O50078
$$ 2158500 2197401 2784538 2797235 2633130 2825267 3296572 3304590 3421391 3712728 4362806
13940D362806J351626K191395K771128L150571L024832L175381K931939J386301
$$ 4362806 5714432 7905827 10676955 13827526 16852358 20027739 22959678 24345979
13932B4345979M96155q37834j313648k650248l256515k995758k968058k458462
$$ 24345979 24842134 24004300 22690652 20040404 16783889 13788131 10820073 8361611
13924H361611k040769j361548j106296p98234l70939j95476L1796m15621q2014
$$ 8361611 6320842 4959294 3852998 3054764 2683825 2488349 2520145 2104524 2022510
13915B022510j86066j87126J33812p3174l0896K8754k1929k1513l11306L39757
$$ 2022510 1836444 1649318 1783130 1709956 1679060 1707814 1685885 1664372 1353066 1692823
13905A692823J688k86335M0595j1382J8037P5017J15963j18705j40454O8029J33764
$$ 1692823 1694511 1408176 1448771 1437389 1455426 1530443 1646406 1527701 1387247 1455276 1589040
13894A589040j50683L2026k0992J26994M9079j62899L15552p9226p612k97255
$$ 1589040 1438357 1470383 1449391 1576385 1625464 1462565 1778117 1698891 1691279 1394024
13884A394024K35533k32586L15862j22349j28726K22967j95405L1376k92086R1355
$$ 1394024 1629557 1396971 1712833 1590484 1461758 1684725 1489320 1520696 1228610 1319965
13874A319965K28134k85668J21156J30226J89144j96510l4510K48854j20644l6271
$$ 1319965 1548099 1262431 1383587 1513813 1702957 1506447 1471937 1720791 1600147 1563876
13864A563876k7794P6465k19472L03771J04091J0385l28659L58721l38281M43174
$$ 1563876 1536082 1612547 1393075 1696846 1800937 1811322 1482663 1841384 1503103 1946277
13854A946277m01675L2389r0907j02422K41056j14716J65675N5684k55483K02110
$$ 1946277 1544602 1576991 1486084 1383662 1624718 1510002 1675677 1731361 1475878 1677988
13844A677988j24469L75924j93325j55189Q2826k09628J68367j95515L0858q438
$$ 1677988 1553519 1929443 1736118 1580929 1663755 1454127 1622494 1426979 1457837 1449399
13834A449399m3709J31063j41502J27456k9824m11707L96577J28486Q7542k49898
$$ 1449399 1405690 1536753 1395251 1522707 1492883 1081176 1477753 1606239 1693781 1443883
13824A443883J73372j46605J9125P1352j55923K1703k53859Q1867K28427j54724
$$ 1443883 1617255 1470650 1489775 1561127 1405204 1426907 1173048 1254915 1483342 1328618
13814A328618j36188m8341L46293l15969K6825K13469r4532j04400J48941j22617
$$ 1328618 1192430 1144089 1490382 1174413 1201238 1414707 1320175 1215775 1364716 1242099
13804A242099M24850k49228j2782n4628j9245o8833J46442L7878j50462J7806
$$ 1242099 1666949 1417721 1404939 1350311 1331066 1262233 1408675 1446553 1296091 1313897
13794A313897L15585j40485J46310l30279J62685o6920k69631J59847K6750M7514
$$ 1313897 1629482 1488997 1635307 1305028 1467713 1400793 1131162 1291009 1317759 1365273
13784A365273k5795L2386q4998j86865J73396j57373J6649o1613K97769n8057
$$ 1365273 1339478 1371864 1286866 1100001 1273397 1116024 1132673 1071060 1368829 1310772
13774A310772l8490L66525m31550o3936M12194l945j27758J22323P2511N584R5180
$$ 1310772 1272282 1638807 1207257 1143321 1555515 1551570 1423812 1546135 1618646 1624230 1719410
13763A719410j26888K75290n0897N3529j14177N1320L8199j61683j76725J03928
$$ 1719410 1592522 1867812 1816915 1870444 1756267 1807587 1845786 1684103 1507378 1611306
13753A611306O612j9129k15380R6103l4297k91987K57056J7870j76413L92000
$$ 1611306 1617918 1598789 1383409 1479512 1445215 1153228 1410284 1428154 1251741 1643741
13743A643741l70116L26256k30214l863J86077N658o163O2007j78261J48064k08634
$$ 1643741 1273625 1599881 1369667 1365804 1551881 1557539 1551376 1613383 1435122 1583186 1374552
13732A374552K08986J8251J7076O0374k23177O6742q1095J41956K3877J17989
$$ 1374552 1583538 1601789 1618865 1679239 1456062 1522804 1441709 1583665 1607542 1725531
13722A725531r9899J30163J82010l21554J57675q6124M4199K5089O4190o6610
$$ 1725531 1625632 1755795 1937805 1616251 1773926 1687802 1732001 1757090 1821280 1754670
13712A754670J74378j48712j18673K02656P4056R085R2230N5609j71307J74394
$$ 1754670 1929048 1780336 1661663 1864319 1938375 1947460 2039690 2095299 1923992 2098386
13702B098386j18720l13163K95233k47078L16051K72533J0517q7005M1274M65070
$$ 2098386 1979666 1666503 1961736 1714658 2030709 2303242 2313759 2226754 2268028 2733098
13692B733098J5128l6265J93329k4265l2731j60132L534K7827o76393P7j76247
$$ 2733098 2748226 2711961 2905290 2881025 2848294 2688162 2691696 2719523 2043130 2043207 1866960
13681A866960q7602J66447K370j11844Q7395J7993k06019P6275O7759K28068r9789
$$ 1866960 1779358 1945805 1948175 1836331 1923726 1941719 1735700 1811975 1879734 2107802 2008013
13670B008013l49546J38346K56296J53513K92141N18350k58826K16603J24111
$$ 2008013 1658467 1796813 2053109 2206622 2498763 3017113 2758287 2974890 3099001
13661C099001L5100J95117K5461j19957k67470q0053l26740M5675m24782J90463
$$ 3099001 3134101 3329218 3354679 3234722 2967252 2887199 2560459 2606134 2181352 2371815
13651B371815k83301J37318k59936k06977K08108l4705q0559k7102L325L0728
$$ 2371815 2088514 2225832 1965896 1758919 1967027 1932322 1851763 1824661 1827986 1858714
13641A858714j50775J90325j637L0932J60800P7120K55256j9795J14828L17139
$$ 1858714 1707939 1898264 1896627 1927559 2088359 2165479 2420735 2400940 2515768 2832907
13631B832907j8472K0277O2958p0676r245m16080l61178n9802m0993o2407Q4653
$$ 2832907 2814435 2834712 2897670 2826994 2817749 2401669 2040491 1980689 1939696 1877289 1961942
13620A961942k61240M4227l03446J13762J05572j7001M5150K00380k25452o4058
$$ 1961942 1700702 1744929 1441483 1555245 1660817 1643816 1688966 1889346 1663894 1599836
13610A599836J20216K33620n8102K43398j16577K30550k73174N2261K5992j18337
$$ 1599836 1720052 1953672 1895570 2138968 2022391 2252941 1979767 2032028 2058020 1939683
13600A939683j63967J19229k5505j97063l4748J94873j7307J65161j64406K63912
$$ 1939683 1775716 1894945 1869440 1672377 1637629 1832502 1815195 1980356 1815950 2079862
13590B079862L0863M9148k16587j08685J52818r4855k71326M9341p5824l00261
$$ 2079862 2110725 2159873 1943286 1834601 1987419 1892564 1621238 1670579 1594755 1294494
13580A294494M05050j74733J08912k74803K36113j71984J03542j99210R8094L39410
$$ 1294494 1699544 1524811 1633723 1358920 1595033 1423049 1526591 1327381 1425475 1764885
13570A764885k6758r0240m5925p8191j63773J29436J90048j94744j2280r4576
$$ 1764885 1738127 1647887 1601962 1523771 1359998 1489434 1679482 1484738 1472458 1377882
13560A377882o6211R1017j97898L95178j05873n3087L16079m03592J01381M1962
$$ 1377882 1311671 1402688 1204790 1599968 1494095 1441008 1757087 1353495 1454876 1496838
13550A496838j81259O1633K19648k22932j0470L12459Q8194J47634K16667N5541
$$ 1496838 1315579 1377212 1596860 1373928 1363458 1675917 1764111 1911745 2128412 2183953
13540B183953J26717j59781K26379q5933j10935j16147l13576k09p2731k3812
$$ 2183953 2310670 2150889 2377268 2291335 2180400 2064253 1750677 1750468 1677737 1653925
13530A653925P0711j59262L99191k95372L57330J63175j40066J66374J07243r7938
$$ 1653925 1724636 1565374 1964565 1669193 2026523 2189698 2049632 2216006 2323249 2225311
13520B225311K07517l36834j37756k33444j32953J32730l02884L7644J441k9644
$$ 2225311 2432828 2095994 1958238 1724794 1591841 1724571 1421687 1459331 1460772 1431128
13510A431128L4588k79363K26228q9269q0838N2031J4414P591k63717L96521k90270
$$ 1431128 1465716 1186353 1412581 1323312 1242474 1294505 1308919 1316510 1052793 1449314 1159044
13499A159044r0137K02665K30307l56473J54373R7985r3787k5045J49576m7268
$$ 1159044 1068907 1271572 1501879 1145406 1299779 1397764 1303977 1278932 1428508 1381240
13489A381240j9166P8391m1303j58583P4810m0635j9520Q7034n7359J6729J02333
$$ 1381240 1362074 1440465 1399162 1240579 1315389 1274754 1255234 1342268 1284909 1301638 1403971
13478A403971Q6291j86328l3525n5785o2482M6345N6671L6847l623j19779K51925
$$ 1403971 1490262 1303934 1270409 1214624 1152142 1198487 1255158 1292005 1288382 1168603 1420528
13467A420528j24962o6660J24717O0836l04857J95759M3239o9992Q6502J21355
$$ 1420528 1295566 1228906 1353623 1414459 1109602 1305361 1348600 1278608 1365110 1486465
13457A486465p0434O4725p8523J75337J87136J28710K02979o9040J46975J65353
$$ 1486465 1416031 1480756 1402233 1577570 1764706 1893416 2096395 2027355 2174330 2339683
13447B339683j09829N2347k32012j65230p8563k17395r5987j752m0127j33605
$$ 2339683 2229854 2282201 2050189 1884959 1806396 1589001 1493014 1491262 1451135 1317530
13437A317530k6792K21011j68037j86997K20099n4477K43988k40906J04261K1450
$$ 1317530 1290738 1511749 1343712 1156715 1376814 1322337 1566325 1325419 1429680 1451130
13427A451130k87199K65714J22853L20655j81557J23124L34999o4473K00067l9007
$$ 1451130 1163931 1429645 1552498 1873153 1691596 1814720 2149719 2085246 2285313 2246306
13417B246306J66511j44036Q1246m09935J115j49772k57414R1411l67028K66505
$$ 2246306 2412817 2268781 2350027 1940092 1941207 1791435 1534021 1625432 1258404 1524909
13407A524909Q9988j50790p8430j22092K51618J1472k96139L81927j12309j25829
$$ 1524909 1614897 1464107 1385677 1263585 1515203 1526675 1230536 1612463 1500154 1374325
13397A374325J00790n8347J53123j7975k0549m9958O6672K98279o6184O2794N8017
$$ 1374325 1475115 1416768 1569891 1551916 1531367 1481409 1548081 1846360 1780176 1842970 1900987
13386A900987K7044J98517L6737K1242K92553j43270J66447j36476M1564k69636
$$ 1900987 1928031 2126548 2163285 2184527 2477080 2333810 2500257 2363781 2405345 2135709
13376B135709q2949j8325k57969j19252J66906o4654L28644l39179J87497j79361
$$ 2135709 2052760 2034435 1776466 1657214 1824120 1759466 2088110 1748931 1936428 1757067
13366A757067R5835J29209r8362J73565J8113l43494K33918j15928K078j50428
$$ 1757067 1852902 1982111 1883749 2057314 2075427 1731933 1965851 1849923 1852001 1701573
13356A701573L10847L6880j38734J26979j35507K03975J30649l7314L2789j40589
$$ 1701573 2012420 2049300 1910566 2037545 1902038 2106013 2236662 2199348 2232137 2091548
13346B091548M3096m9375j61347k35683J45592m8159J00219j26855k5731O5810
$$ 2091548 2134644 2085269 1923922 1688239 1833831 1785672 1885891 1759036 1733305 1799115
13336A799115n1277k01820J44026J30496N5907o5170j02591J27755n9925J28574
$$ 1799115 1747838 1546018 1690044 1820540 1876447 1811277 1708686 1836441 1776516 1905090
13326A905090j12257M0811o7076J46598J66295n4151j14908o5816J03194L25410
$$ 1905090 1792833 1833644 1766568 1913166 2079461 2025310 1910402 1844586 1947780 2273190
13316B273190k0240Q6609J06640O5703K33612j80352J41330J30420j00021l3403
$$ 2273190 2252950 2339559 2446199 2511902 2745514 2565162 2706492 2836912 2736891 2703488
13306B703488J37591m7627k31307j1251o203J20171p3130M7554K83362J74864
$$ 2703488 2841079 2793452 2562145 2550894 2544691 2664862 2591732 2639286 2922648 3097512
13296C097512j61378j44574L16471Q5951r1845P2589l28835L15258l94520m5483
$$ 3097512 2936134 2791560 3108031 3193982 3102137 3174726 2845891 3161149 2766629 2721146
13286B721146R3675N0650k33521M90579k41656K03548k32689R4684R026J07439
$$ 2721146 2814821 2865471 2631950 3122529 2880873 3084421 2851732 2946416 2955442 3062881
13276C062881L7081K06872o9158Q970Q266p6496J79268l828j3427Q5485K84696
$$ 3062881 3099962 3306834 3237676 3246646 3254912 3178416 3357684 3353856 3340429 3425914 3710610
13265C710610j14414n7373L69660L2888o2333O9831K55838M1344L16178r8382
$$ 3710610 3596196 3538823 3908483 3941371 3879038 3948869 4204707 4246051 4562229 4463847
13255D463847R1956P9597L3310L02256J3727J19714J5795K18488J63444J41118
$$ 4463847 4555803 4635400 4668710 4970966 4984693 5104407 5120202 5338690 5502134 5643252
13245E643252P7591K70424k79827N9098j23828K45347O8766r783o7173K20329
$$ 5643252 5720843 5991267 5711440 5770538 5646710 5892057 5960823 5951040 5883867 6104196
13235F104196K35677P8943J39997L2988P7813L93815K8229l2330M33356J86585
$$ 6104196 6339873 6418816 6558813 6591801 6669614 7063429 7091658 7059328 7492684 7679269
13225G679269r0222L81947J80080J58334R28J59446o7884j03631K342j92236l9620
$$ 7679269 7589047 7970994 8151074 8309408 8310336 8469782 8401898 8298267 8300609 8108373 8068753
13214H068753J85956k67673J4868k48310j72915J92291j22900P4470l83798K47914
$$ 8068753 8254709 7987036 8001904 7753594 7580679 7772970 7650070 7724540 7340742 7588656
13204G588656j94010k69011N19195k52613q1494J32143j42680j35027J4111N4364
$$ 7588656 7394646 7125635 7644830 7392217 7310723 7442866 7300186 7165159 7179270 7233634
13194G233634M9294k65317k8654l06359K66754k57900M0890k95234Q4290k75287
$$ 7233634 7282928 7017611 6988957 6682598 6949352 6691452 6732342 6437108 6521398 6246111
13184F246111k08631K45138m49713P5283j98896j33175R4254j12078j55402o9060
$$ 6246111 6037480 6282618 5832905 5908188 5709292 5576117 5670371 5558293 5402891 5333831
13174E333831j94974k6310p2601R0205K0733k19666J34396m4814J55521j39872
$$ 5333831 5138857 5112547 5039946 5130151 5150884 4931218 5065614 5020800 5176321 5036449
13164E036449J16020J92482J76947K55314K40052M65256K53584J24424L83208
$$ 5036449 5152469 5344951 5521898 5777212 6017264 6482520 6736104 6860528 7243736
13155G243736J12932K43445k14007P8983m9893j1667l25322K9227k46816J5140
$$ 7243736 7356668 7600113 7386106 7465089 7415196 7403529 7078207 7107434 6860618 6875758
13145F875758j02217K24847N2960j68592k28236J82836l85486k85125j42073m55531
$$ 6875758 6773541 6998388 7051348 6882756 6654520 6837356 6451870 6166745 6024672 5569141
13135E569141l65125q3615n40255j45946m1148o7966j13090j59055J74808K207
$$ 5569141 5204016 5120401 4580146 4434200 4393052 4325086 4211996 4052941 4227749 4229956
13125D229956j5800J24572j88945K0511k48273j52927l5871J8283k64525r8317
$$ 4229956 4214156 4338728 4149783 4170294 3922021 3769094 3733223 3751506 3486981 3388664
13115C388664q2030k74170M06097j11647o0472l4410p1012J51928M187j1468o2398
$$ 3388664 3306634 3032464 3438561 3326914 3266442 3232032 3161020 3312948 3317135 3305667 3243269
13104C243269j52945L30747r2206K03754J68210L70276P9571M02678L63202N46001
$$ 3243269 3090324 3421071 3328865 3532619 3700829 4071105 4150676 4553354 4916556 5462557
13094E462557M85533N61335l3041K65437L31712p9412j7815m14182J60481N6906
$$ 5462557 5948090 6509425 6476384 6741821 7073533 6994121 6976306 6562124 6722605 6779511
13084F779511m47115J12587j26195L56619j52709o4107l00745k80429m16535l43477
$$ 6779511 6332396 6444983 6318788 6675407 6522698 6458591 6157846 5877417 5460882 5117405
13074E117405l21724n32268j91066l28097j35018k39139o4158k71774p6474n9413
$$ 5117405 4795681 4263413 4072347 3744250 3609232 3370093 3305935 3034161 2957687 2898274
13064B898274k4359K1046q6729J94348N5293o1538K5144L35164k12617p813p2687
$$ 2898274 2873915 2894961 2808232 3002580 3057873 2996335 3021479 3356643 3144026 3136213 3063526
13053C063526j57559J65929K5981j86387K64354r3937j32695J66733m28552L13463
$$ 3063526 2905967 3071896 3097877 2911490 3175844 3081907 2949212 3115945 2687393 3000856
13043C000856j81451N7905J42294j21732J55795R7844k35039J74793k01137M771
$$ 3000856 2819405 2877310 3019604 2897872 3053667 3151511 2916472 3091265 2890128 2894899
13033B894899L94821j49003Q8692n8846K01152L4390J00139k45567J92510O1529
$$ 2894899 3289720 3140717 3229409 3170563 3371715 3406105 3506244 3260677 3453187 3514716
13023C514716J32592J57706m15883J92673J95762l9513K14600K07872r9898j16677
$$ 3514716 3647308 3805014 3389131 3581804 3777566 3738053 3952653 4160525 4060627 3943950
13013C943950K84652K45798j57880K37569J20603n102R9960J8103j24781N7792
$$ 3943950 4228602 4474400 4316520 4554089 4674692 4669590 4769550 4787653 4662872 4720664
13003D720664J02273N28492p3308j15045K80108k63747L11540J32708j9081M14908
$$ 4720664 4822937 5351429 5278121 5163076 5443184 5179437 5490977 5623685 5604604 6019512
12993F019512j75617K62421l4114l3350J56673J76971K9532l46690K28313k58318
$$ 6019512 5843895 6106316 6072202 6038852 6195525 6372496 6402028 6055338 6283651 6025333
12983F025333N9790K70571j48251J70075k7040k2115k44453O3730Q1422j72061
$$ 6025333 6085123 6355694 6207443 6377518 6350478 6328363 6083910 6147640 6229062 6057001
12973F057001k03044j21377Q0631R2722l21730L5744j29247j56482K61095k10547
$$ 6057001 5853957 5732580 5813211 5905933 5584203 5619947 5490700 5334218 5595313 5384766
12963E384766k49259J14509J54003o6600n1365J57586m38412J95522j61431M3170
$$ 5384766 5135507 5250016 5404019 5337419 5286054 5443640 5005228 5200750 5039319 5082489
12953E082489K53079j9757o7979J12538L7952J6706l47822P8278K37468j2891
$$ 5082489 5335568 5315811 5247832 5360370 5398322 5415028 5067206 5145484 5382952 5370061
12943E370061k52489J44696J0500J28848l06843J45797P227R7773n2054M07536
$$ 5370061 5117572 5262268 5272768 5401616 5094773 5240570 5247797 5345570 5293516 5701052
12933E701052l7540l56680J43338M62804l49995J95384J87448j24414l59965J15882
$$ 5701052 5663512 5306832 5450170 5912974 5562979 5758363 5945811 5821397 5461432 5577314
12923E577314k65919R0693j80104K21481n8560q5879j9185J03899l68979J53381
$$ 5577314 5311395 5402088 5221984 5443465 5384905 5299026 5279841 5383740 5014761 5168142
12913E168142q5460k2516l83992j64196J00438k52936j67229J62903k43628p8351
$$ 5168142 5082682 5060166 4676174 4511978 4612416 4359480 4192251 4355154 4111526 4033175
12903D033175j33422L05982M8555k62208j02107j95839N4768O4748j97048k55144
$$ 4033175 3899753 4205735 4254290 3992082 3889975 3694136 3748904 3813652 3616604 3361460
12893C361460K8250k7859k7489m8746o3722j5656J64788k53816j14245K66717
$$ 3361460 3389710 3361851 3334362 3285616 3221894 3206238 3371026 3117210 3002965 3269682
12883C269682J26806k47142M0798r5624j61094Q7451J59363l87202P1630K20166
$$ 3269682 3396488 3149346 3190144 3094520 2933426 3020877 3180240 2793038 2864668 3084834
12873C084834j27081j15037L3363J35328l25278K37451j27232j10552k21962L34380
$$ 3084834 2957753 2842716 2876079 3011407 2686129 2923580 2796348 2685796 2463834 2798214
12863B798214j93401J12580n2172R1324k5292P2345r9319j83593j72551L34081
$$ 2798214 2604813 2717393 2665221 2756545 2731253 2803598 2704279 2520686 2348135 2682216
12853B682216N0158j53604J56011o3390j82187K37294j88487J45240l8878j97933
$$ 2682216 2732374 2578770 2734781 2671391 2489204 2726498 2538011 2683251 2644373 2446440
12843B446440K63299L2861j67974j21564J71102K7516J17234j31624j8407K3357
$$ 2446440 2709739 2742600 2574626 2453062 2624164 2651680 2768914 2637290 2618883 2642240
12833B642240j20442Q4533q1722P9107n9632Q7579L8732r0258j27321N6505k6021
$$ 2642240 2521798 2606331 2524609 2603716 2544084 2631663 2670395 2580137 2452816 2509321 2483300
12822B483300J45027l4956J0328J00535j23619K46527o06264L17090M6329Q2419
$$ 2483300 2628327 2593371 2603699 2704234 2580615 2827142 2220878 2537968 2584297 2666716
12812B666716j94324P8287q8562K18744N3568j29184K65886n09353N62225j58674
$$ 2666716 2472392 2550679 2462117 2680861 2734429 2605245 2871131 2361778 2924003 2765329
12802B765329n0933l5261r1554o0308J19518m6817J22534J65303k35994N4872
$$ 2765329 2714396 2679135 2587581 2527273 2646791 2599974 2722508 2887811 2651817 2706689
12792B706689k34550N1805J54237J78376j06757j37870J4653K97876k99605N3747
$$ 2706689 2472139 2523944 2678181 2856557 2749800 2611930 2626583 2924459 2624854 2678601
12782B678601J9196L2240q5240N4575P2107k20594P9710J70978k49018J29370
$$ 2678601 2697797 2730037 2644797 2699372 2771479 2550885 2630595 2801573 2552555 2681925
12772B681925j27721L12074k62496J56171O0933n6017O8783j05642J50155k4617
$$ 2681925 2554204 2866278 2603782 2759953 2820886 2764869 2833652 2728010 2878165 2853548
12762B853548J58524j69529K23490l43628j85770N4612K11947J1947k253n1751
$$ 2853548 3012072 2842543 3066033 2722405 2536635 2591247 2803194 2815141 2812888 2761137
12752B761137n5246K55112n5883k59840K41337K00981k74301R0962j8267l9238
$$ 2761137 2705891 2961003 2905120 2645280 2886617 3087598 2813297 2904259 2885992 2846754
12742B846754o0113j1462R3932Q6753J6102N6163j43567M0557J10023l04306J32136
$$ 2846754 2786641 2775179 2869111 2955864 2971966 3028129 2884562 2925119 3035142 2730836 2862972
12731B862972k80267L2645K44370j39252K94093m6284j16602j07559K14680p5285
$$ 2862972 2582705 2615350 2859720 2720468 3014561 2968277 2851675 2744116 2958796 2883511
12721B883511J4042M723J16098P5893r2854n0629l2005q0769J42730K96723l85049
$$ 2883511 2897553 2902276 3018374 3094267 3001413 2950784 2918779 2838010 2980740 3277463 2892414
12710B892414K85102J3346r8073Q8681l2902J43135J42415J61251o4769J24021
$$ 2892414 3177516 3190862 3092789 3181470 3148568 3291703 3434118 3595369 3530600 3654621
12700C654621J44410P5893j7812K69805k15214K83463K25007J05754M81895K51353
$$ 3654621 3799031 3874924 3857112 4126917 3911703 4195166 4420173 4525927 5007822 5259175
12690E259175M51420O13097Q73232M27646M17736J79477k43001j01779j56409
$$ 5259175 5710595 6323692 7196924 7624570 8042306 8221783 7978782 7877003 7720594
12681G720594p88072l48760m65259q76737k48355l47935q7482k85199K2333l3385
$$ 7720594 6932522 6583762 6118503 5241766 4993411 4645476 4557994 4272795 4295128 4261743
12671D261743N4224O6152l3566K26910p8301J61194k0351K50084q1961j66534
$$ 4261743 4315967 4382119 4348553 4575463 4497162 4658356 4638005 4888089 4806128 4639594
12661D639594o8116J42992j80657J0789N2565k4394L61122q6257J98481N48801
$$ 4639594 4571478 4714470 4533813 4544602 4597167 4572773 4933895 4847638 5046119 5594920
12651E594920J63081K19442L42365j9470N45897n7280l40246J13029j53276L4976
$$ 5594920 5758001 5977443 6319808 6300338 6846235 6788955 6448709 6561738 6408462 6443438
12641F443438j10832M0039l02248J7368l1355L88639m26354L80810R9211j65966
$$ 6443438 6332606 6372645 6070397 6087765 6056410 6445049 6018695 6399505 6498716 6332750
12631F332750K55120K54674r4644M13850r0807L05386m88417J74544l69691K8410
$$ 6332750 6587870 6842544 6747900 7161750 7070943 7376329 6887912 7062456 6692765 6721175
12621F721175l96876k99944k39838k10734k28555j76570j90825r7918K43989p0405
$$ 6721175 6324299 6024355 5784517 5573783 5345228 5168658 4977833 4879915 5123904 5053499
12611E053499K38015O70349J02261M91774N45387L22158M24411K42891q5207j05347
$$ 5053499 5291514 5961863 6064124 6555898 7101285 7423443 7847854 8090745 8005538 7900191
12601G900191j14306k31017q51680j12028l60706o96893L8194n23044J26113p9091
$$ 7900191 7785885 7554868 6703188 6591160 6230454 5533561 5571755 5048711 5174824 5095733
12591E095733K14845K08398M18710k22778J93774M59532j52132K44773k73560
$$ 5095733 5310578 5518976 5937686 5714908 5908682 6368214 6216082 6460855 6187295
12582F187295J20549M0505j4109j21545O1889K24400L5463K16747j82364j08096
$$ 6187295 6307844 6348349 6334240 6212695 6274584 6498984 6534447 6751194 6568830 6460734
12572F460734N2648k34501l82098l02633l81506k05320l18907O4725r9013j10461
$$ 6460734 6513382 6278881 5896783 5594150 5212644 5007324 4688417 4753142 4654129 4543668
12562D543668O0740l3600j7385K2105O9991J20170j82747K1281n1039J76824j36978
$$ 4543668 4604408 4570808 4553423 4575528 4645519 4765689 4582942 4604223 4553184 4730008 4593030
12551D593030L2106J30122j45294p0015J07573J55923q8276J03777k3752q7782
$$ 4593030 4625136 4755258 4609964 4539949 4647522 4803445 4715169 4818946 4795194 4707412
12541D707412J41519K90825L46643m9067p373K41398k01524K23917j87400m05439
$$ 4707412 4848931 5139756 5486399 5437332 5429959 5671357 5469833 5693750 5506350 5100911
12531E100911j81912o7099k20835o6368p1849o4459L1663J79913j55099L8094
$$ 5100911 4918999 4851900 4631065 4564697 4492848 4428389 4460052 4639965 4484866 4522960
12521D522960M6953R0078J51349J3050j2182J855M8648Q3759K20181M37711N77774
$$ 4522960 4569913 4659991 4811340 4824390 4812208 4814063 4862711 4946470 5166651 5604362 6182136
12510F182136K59986K30114L36270L11346j27643l7366n86427j58318l68609l28178
$$ 6182136 6442122 6672236 7008506 7319852 7192209 7154843 6568416 6410098 6041489 5713311
12500E713311k67899k66700r9631J14421j55189j52616j29554j19454L33400J2511
$$ 5713311 5445412 5178712 5079081 5193502 5038313 4885697 4756143 4636689 4970089 4982600
12490D982600j03194J83894p3805R3455j97601K72449o2541N20027L585K85160
$$ 4982600 4879406 5063300 4989495 5082950 4885349 5157798 5095257 5615284 5618869 5904029
12480E904029J64415K41388k15736R8732J31335M6798m83414r5123m11324j33677
$$ 5904029 6068444 6309832 6094096 6192828 6324163 6370961 5887547 5792424 5381100 5247423
12470E247423O7080j36802j20249J60753J13663L3489k32530m7842K60606J05017
$$ 5247423 5314503 5177701 5057452 5218205 5331868 5365357 5132827 5084985 5345591 5450608
12460E450608M8354M0451R8058l5074J0077L80614j25667R6997R5601J90841K25787
$$ 5450608 5498962 5539413 5637471 5602397 5612474 5993088 5867421 5964418 6060019 6250860 6476647
12449F476647o9407J74476J83490J64971L53599M507L08625K67323K76781J85953
$$ 6476647 6407240 6581716 6765206 6930177 7283776 7288283 7596908 7864231 8141012 8326965
12439H326965M4685P3832Q8901k0637J03454K31597k52657K8977K46788R9355
$$ 8326965 8371650 8445482 8534383 8513746 8617200 8848797 8596140 8625117 8871905 8971260
12429H971260p8858M64426k09842K60852J70734j08278M02056j0297J60710K6749
$$ 8971260 8892402 9356828 9146986 9407838 9578572 9470294 9872350 9862053 10022763 10049512
12419A0049512L82127J06023M04531N10308J94074L04686L18447M56685L11701
$$ 10049512 10431639 10537662 10942193 11452501 11646575 11951261 12269708 12726393 13038094
12410A3038094K13391R2076J02139p1325N1073l73429n4364l07095k9147l33832
$$ 13038094 13251485 13343561 13445700 13374375 13425448 13052019 12997655 12690560 12661413 12327581
12400A2327581K7764j97240M1448k46444p618J01016k18906L30971K04680L08187
$$ 12327581 12355345 12158105 12199553 11953109 11945491 12046507 11827601 12158572 12363252 12671439
12390A2671439N5743L15563K56169L53114N35211M40076K02251K82484L15540
$$ 12671439 12727182 13042745 13298914 13652028 14187239 14627315 14829566 15112050 15427590
12381A5427590J00632M2429M44088L00562j22687j75935J94013j54740K18005
$$ 15427590 15528222 15570651 16014739 16315301 16192614 16016679 16210692 16055952 16273957
12372A6273957j29879j63439j04639M1977N2427J14620k60558j32621K66047l51248
$$ 16273957 16144078 15980639 15876000 15917977 15970404 16085024 15824466 15691845 15957892 15606644
12362A5606644J64552j83579q2549j53455r0526o7541j19616k69233R9834m0309
$$ 15606644 15771196 15587617 15505068 15351613 15261087 15193546 15073930 14804697 14904531 14864222
12352A4864222k00616j27151l24492j39045k67238j25882j37526k53990j18780
$$ 14864222 14663606 14536455 14211963 14072918 13805680 13679798 13542272 13288282 13169502
12343A3169502J5263J47082K67190J03527K40346L50677J56797K46030M29457
$$ 13169502 13184765 13331847 13599037 13702564 13942910 14293587 14450384 14696414 15125871
12334A5125871M39869M92527K67226K22191M26170L00803r4879N08119K22582
$$ 15125871 15565740 16058267 16325493 16547684 16973854 17274657 17179778 17687897 17910479
12325A7910479K10200J29860L19814J67906j04535J60944K6500j00825K5899j03538
$$ 17910479 18120679 18250539 18570353 18738259 18633724 18794668 18821168 18720343 18746242 18642704
12315A8642704j24492K84152k2809l8703K00070O2858J10692J87978K55389N56367
$$ 18642704 18518212 18802364 18779555 18740852 18940922 19003780 19114472 19302450 19557839 20114206
12305B0114206K29203O23565M1003K43165P7058L157p0059m30023l55952n08258
$$ 20114206 20343409 20966974 21007977 21251142 21328200 21331357 21261298 20831275 20475323 19967065
12295A9967065l76916o63228j83975m47158O8199k94463l10362k55568k79648
$$ 19967065 19590149 18926921 18742946 18295788 18363987 18069524 17759162 17503594 17223946
12286A7223946n78726K2771m45820l57771q29810n91334m11417m15713j99532
$$ 17223946 16645220 16667991 16222171 15864400 15034590 14443256 14031839 13616126 13416594
12277A3416594k20662m72688l33577k79460J29646j88348k47566J16448q9970
$$ 13416594 13195932 12723244 12389667 12110207 12239853 12051505 11803939 11920387 11830417
12268A1830417j68129O2104k00075j10771m7027M08567k95142r9745k40294L32682
$$ 11830417 11662288 11724392 11524317 11413546 11366519 11775086 11479944 11380199 11139905 11472587
12258A1472587J07266j60500L30673K79471J31397M02541P33350N96708O49974
$$ 11472587 11579853 11419353 11750026 12029497 12160894 12563435 13296785 13893493 14543467
12249A4543467N92898J046031P45742J171235R02020J073659R46840P87894P70649
$$ 14543467 15136365 16182396 16928138 18099373 19001393 20075052 21021892 21809786 22580435
12240B2580435N99208J50227p6503q1258k4615k81515k10972j73567J56750k76277
$$ 22580435 23179643 23329870 23253367 23172109 23147494 22865979 22655007 22481440 22638190 22361913
12230B2361913k67171k87950m10889n47264o79636q64709p65698j234450q60584
$$ 22361913 22094742 21806792 21395903 20848639 20169003 19304294 18538596 17304146 16443562
12221A6443562j079487q82528o02752r55934m35237n37899k9371o16725k44111
$$ 16443562 15364075 14481547 13878795 12922861 12487624 11949725 11920354 11303629 11059518
12212A1059518k00607l75418k07389k34939k51673k44686l55513q6764o7881K28460
$$ 11059518 10858911 10483493 10276104 10041165 9789492 9544806 9189293 9102529 9034648 9263108
12202I263108J8084k07748K14334J0902k27544J8796L56307j27304j30590J50469
$$ 9263108 9281192 9073444 9287778 9298680 9071136 9089932 9446239 9318935 9188345 9338814
12192I338814J72887J39825J37375J69260K12154L00017Q7264K29214J30267J77244
$$ 9338814 9511701 9651526 9788901 9958161 10170315 10470332 10557596 10786810 10917077 11094321
12182A1094321K50313J53405j30687J11280K2809k85214J70482K8152l53410M489
$$ 11094321 11344634 11498039 11367352 11478632 11501441 11216227 11386709 11414861 11061451 11065940
12172A1065940j69271M00571k38079P5406J59231J89712R1585J4401K30931R3152
$$ 11065940 10896669 11297240 11059161 11134567 11293798 11483510 11575095 11589496 11820427 11913579
12162A1913579N48332N11773L01884O43888K07322K17179O5336K31677m25590
$$ 11913579 12461911 12973684 13275568 13919456 14126778 14343957 14409293 14640970 14215380
12153A4215380l26110k3019j41845m6183K97535J14815L03307L32948P88043L43664
$$ 14215380 13889270 13866251 13724406 13678223 13975758 14090573 14393880 14726828 15514871 15858535
12143A5858535M62792M16750R2252O46688M43469L42031N83168N93676P88730
$$ 15858535 16321327 16738077 16830329 17477017 17920486 18262517 18845685 19439361 20228091
12134B0228091O75011J200557J274571J290134J715774J816499J710561J765095
$$ 20228091 20903102 22103659 23378230 24668364 26384138 28200637 29911198 31676293
12126C1676293J934327J477250J703019R53935O75169N26352N17557j85008j26701
$$ 31676293 33610620 35087870 36790889 37744824 38419993 38946345 39463902 39278894 39152193
12117C9152193k43498n82351m41310p81060r52032n57618n32691o17117o21790
$$ 39152193 38908695 38326344 37885034 37103974 36151942 35594324 35061633 34444516 33822726
12108C3822726k78308p22070n17861p7999l59243O5086J61936K02266K29521M9572
$$ 33822726 33544418 32822348 32304487 32226488 31867245 31932331 32094267 32296533 32526054 32575626
12098C2575626J9089K07376m36872n03558o53029n87477r87156n62168l48122
$$ 32575626 32594715 32802091 32365219 31861661 31208632 30621155 29633999 29071831 28723709
12089B8723709J40129N22821M06036Q03200P59614N47447Q02026Q24098L75970
$$ 28723709 28863838 29386659 29792695 30595895 31355509 31902956 32704982 33529080 33905050
12080C3905050J07534n7618M6463q3307l95383L44173O7389j91104o2098m93332
$$ 33905050 34012584 33954966 34001429 33918122 33522739 33866912 33934301 33743197 33681099 33187767
12070C3187767l69342m12496q75668o28044r83943j129810r01974j211034r76812
$$ 33187767 32818425 32405929 31530261 30902217 29918274 28788464 27886490 26675456 25698644
12061B5698644n39660p68068k23750l97642l67962o58936j24785l90920k71551
$$ 25698644 25158984 24390916 24167166 23769524 23401562 22742626 22617841 22226921 21955370
12052B1955370l72683o50225n24395m97433k38261l91398m13635j35837k46389
$$ 21955370 21582687 20932462 20408067 19910634 19672373 19280975 18867340 18731503 18485114
12043A8485114l74451k82753l68228l63418l07995n47629p2968o55026m31901
$$ 18485114 18110663 17827910 17459682 17096264 16788269 16240640 16167672 15512646 15080745
12034A5080745P7785R326j59791L49847K59432M96412K88817O25041J04440K48781
$$ 15080745 15158530 15167856 15008065 15357912 15617344 16113756 16402573 17027614 17132054 17380835
12024A7380835j62299p6442n76751o60017q51891k69666m21595n24097k58217
$$ 17380835 17218536 17142094 16565343 15905326 15053435 14783769 14362174 13838077 13579860
12015A3579860k36321l17220k36699m41629m15431k53105l32909k18695l08588
$$ 13579860 13343539 13026319 12789620 12347991 11932560 11679455 11346546 11127851 10819263
12006A0819263j71682J7830K38844J10830K54064J49008M29192n9093j37378l64326
$$ 10819263 10647581 10665411 10904255 11015085 11269149 11418157 11847349 11788256 11650878 11286552
11996A1286552J35139m98628m49868k80411p7111m64848l26631M14908l48569
$$ 11286552 11421691 10923063 10473195 10192784 10115673 9650825 9324194 9739102 9390533
11987I390533Q7573j73181L8495n29680L645m14079k51494k78797k4234j49591
$$ 9390533 9478106 9304925 9343420 8813740 8817385 8403306 8151812 7873015 7848781 7699190
11977G699190j34338o7439k7339k24846K33555l88071j46400k8864m38465j25995
$$ 7699190 7564852 7497413 7470074 7245228 7478783 7090712 6944312 6915448 6476983 6350988
11967F350988q6190k66437j29604j69634j76100J35013j49549l4031J96603j32595
$$ 6350988 6264798 5998361 5868757 5699123 5523023 5658036 5508487 5474456 5671059 5538464
11957E538464K39163K78329K69216n6582j30710J61123j94044J82625N0441l42112
$$ 5538464 5777627 6055956 6325172 6268590 6137880 6299003 6104959 6287584 6338025 5995913
11947E995913J02970L01906L1108K44698j01194L38723K51016K24404j7246K93901
$$ 5995913 6098883 6400789 6431897 6676595 6575401 6914124 7165140 7389544 7372298 7666199
11937G666199J69347j36551J61847j21564K84451q1443l7999L9107P9832k32281
$$ 7666199 7835546 7698995 7860842 7739278 8023729 7942286 7904287 7943394 8023226 7790945
11927G790945J7024k52607k98658K39346l63509k35000k36347k6607l27508K8183
$$ 7790945 7807969 7555362 7256704 7496050 7132541 6897541 6661194 6634587 6307079 6335262
11917F335262j08457p1336l01831K42031k16280j16356J23085O78628J263335
$$ 6335262 6226805 6155469 5853638 6095669 5879389 5763033 5886118 6564746 7828081
11908G828081L064405K867634J003864Q73652L92713k18592m7535q23772j924066
$$ 7828081 10892486 13760120 14763984 15637636 16030349 15811757 15764222 14940450 13016384
11899A3016384j823005k665362j658591p52874n47405J4865k82064j19613L1708
$$ 13016384 11193379 8528017 6869426 6116552 5569147 5584012 5301948 5182335 5214043
11890E214043j40511K32495K27392N49602O08636N03127Q33488M64335O83264
$$ 5214043 5073532 5306027 5533419 6083021 6691657 7194784 8028272 8492607 9175871
11881I175871K04728L79324P6471j74011k51956l06665j34285j063684k91522
$$ 9175871 9380599 9759923 9836394 9662383 9410427 9103762 8969477 7905793 7614271
11872G614271m60997n11937n14888k55200l81252k80334l18370j18847l10516
$$ 7614271 7153274 6641337 6126449 5871249 5489997 5209663 4891293 4772446 4461930
11863D461930o4080J38607M0865j05954l04774k3511J39636K46936j84680K09151
$$ 4461930 4397850 4536457 4577322 4471368 4166594 4143083 4282719 4529655 4344975 4554126
11853D554126k5105L4895Q7582J12049n5866N29411J95182k43656N77373K59063
$$ 4554126 4529021 4563916 4651498 4763547 4707681 5237092 5432274 5188618 5765991 6025054
11843F025054N26381K99830P15816N51681Q2051q5941J03060k91934k56888k19694
$$ 6025054 6551435 6851265 7567081 8118762 8200813 8114872 8217932 7925998 7669110 7449416
11833G449416L6955n03321j66944J14047j12381L8533N4261j17854j42512m02306
$$ 7449416 7486371 6983050 6816106 6930153 6817772 6856305 6910566 6792712 6650200 6247894
11823F247894m90608j69638r14168j39293k53354j24938k72695J45307j79600
$$ 6247894 5757286 5587648 4673480 4534187 4280833 4155895 3883200 4028507 3848907
11814C848907j2838j53872Q3021j83367l39153J55749j15964K56351k27191k474
$$ 3848907 3836069 3682197 3765218 3581851 3242698 3398447 3282483 3538834 3311643 3309169
11804C309169L4097j67150J90435l82821K37924R1884k58111M32153k86623J5545
$$ 3309169 3343266 3176116 3366551 2983730 3221654 3313538 3055427 3487580 3200957 3216502
11794C216502K69500j11845L65004J45369L4075P76675O57532N8998L96159K2992
$$ 3216502 3486002 3374157 3739161 3884530 3918605 4695280 5352812 5411810 5807969 5830961
11784E830961O422l180k10612l11067k00748n41027m75154l93029r5770k37011
$$ 5830961 5837383 5834203 5623591 5312524 5111776 4570749 4095595 3702566 3606796 3369785
11774C369785k48681j33266K33183j44132j61841L7616p4147J40031o0719p7247
$$ 3369785 3121104 2987838 3221021 3076889 2915048 2952664 2878517 3018548 2957829 2880582
11764B880582p0508J48233l72660L16505n9620j59173j18173k6009j06909L33889
$$ 2880582 2810074 2958307 2585647 2902152 2842532 2683359 2565186 2539177 2432268 2766157
11754B766157j34496M4172K575J20612j87934J83696j73796J04866o0807k6256
$$ 2766157 2631661 2675833 2678408 2799020 2611086 2794782 2620986 2725852 2665045 2638789
11744B638789J30936o3085j87855K52648O1402q3224l09451K22453Q9116j73098
$$ 2638789 2769725 2706640 2518785 2771433 2832835 2749611 2440160 2662613 2751729 2578631
11734B578631j8759k26445K59006j42749J44805k05658J80305J42470l9592k70131
$$ 2578631 2559872 2333427 2592433 2449684 2594489 2388831 2569136 2711606 2672014 2401883
11724B401883Q9988n0554k2696K4768P0606j54997l2610o8659J98503q2082k01928
$$ 2401883 2491871 2441317 2418621 2443389 2513995 2358998 2326388 2257729 2456232 2374150 2172222
11713B172222J80558K68474o0184L5805l8744k5104l9428R3814j13327j84948
$$ 2172222 2352780 2621254 2561070 2596875 2558131 2533027 2493599 2587413 2474086 2289138
11703B289138K82322j99590J52178k5917Q3825n8826L19462k24955j09704J90279
$$ 2289138 2571460 2371870 2524048 2498131 2581956 2523130 2842592 2617637 2507933 2698212
11693B698212j86963R0602K71740l12573K00335j07178K01061r9887K29322o6427
$$ 2698212 2511249 2601851 2873591 2561018 2761353 2654175 2855236 2755349 2984671 2918244
11683B918244r8829J35550j40601r9829K12955J16826L3398m8768R1921J58160
$$ 2918244 2819415 2954965 2814364 2714535 2927490 3044316 3077714 3028946 3120867 3279027
11673C279027k56655K14397l40307K27556K8776J04308k47042k3805J04195J18049
$$ 3279027 3022372 3236769 2896462 3124018 3152794 3257102 3010060 2986255 3090450 3208499
11663C208499l58028K26741j78273J33904J52100l83407K08300K5754l2761j63577
$$ 3208499 2850471 3077212 2898939 3032843 3184943 2801536 3009836 3035590 3002829 2839252
11653B839252K15072r0057j40303L25306m5637l05863J88857n2242J17417l13029
$$ 2839252 3054324 2964267 2823964 3149270 3103633 2797770 2986627 2934385 3051802 2738773
11643B738773J51948L9829k19505J45110j06245Q469k2552p943o6885L84533k22420
$$ 2738773 2890721 2930550 2711045 2856155 2749910 2758379 2735827 2727884 2660999 3045532 2823112
11632B823112j20744o7960N9001K79175j13306k43317M61717m21742J53463j276
$$ 2823112 2702368 2634408 2693409 2972584 2859278 2615961 3077678 2655936 2809399 2808123
11622B808123m073o9956r7247K06180j43k31856Q2226R2374J04950j98263j73513
$$ 2808123 2804050 2734094 2636847 2843027 2842884 2611028 2693254 2785628 2890578 2692315 2518802
11611B518802J67735J00351n207k99508K44419m0105K6923P2612L350J95394q6948
$$ 2518802 2686537 2786888 2781681 2482173 2726592 2686487 2713410 2786022 2789372 2984766 2897818
11600B897818J88889J41226j34669l11010L22027k34146K42043N2523k84208J34292
$$ 2897818 3086707 3227933 3093264 2782254 3104281 2870135 3112178 3164701 2880493 3014785
11590C014785J78095o2232m0551k62011L49778k94070J08062j8957l2087J83233
$$ 3014785 3192880 3130648 3090097 2828086 3177864 2883794 2991856 2972899 2940812 3124045
11580C124045R9913j91740L3367K15005j60457J44957p2147L8913m6154J99401
$$ 3124045 3223958 3032218 3065585 3280590 3120133 3265090 3192943 3231856 3185702 3385103
11570C385103K4141k26070M9371O0470l8218j57638J8111k08875J02358J10018
$$ 3385103 3409244 3183174 3232545 3293015 3254797 3097159 3115270 2906395 3008753 3118771
11560C118771j40156j01336p5104K01343J75155k55034K19751M6597j68629J34996
$$ 3118771 2978615 2877279 2802175 3003518 3178673 2923639 3143390 3189987 3021358 3156354
11550C156354j36193q78o1895P0276r2522j56497J24531j8758L3070o8631N3972
$$ 3156354 3020161 3019283 2957388 3027664 2935142 2778645 2903176 2884418 2917488 2848857 2902829
11539B902829k02389R6985M33337j34906j65417j8648K03535r4494L0611m6839
$$ 2902829 2700440 2797425 3230762 3095856 2930439 2911791 3115326 3020832 3051443 3004604
11529C004604K1251J97637l49814K40014j11773j81485J46084J8991o2466J13603
$$ 3004604 3025855 3223492 2873678 3113692 3001919 2820434 2966518 2985509 2923043 3036646
11519C036646j20091J0859J86629l0572j68949J62436o5793N4206J45076k14506
$$ 3036646 2916555 2927414 3114043 3083471 2914522 3076958 3011165 3065371 3210447 2995941
11509B995941R6923q8628K46630j81485r5532K02387K17620l18964K29292j24101
$$ 2995941 3092864 3004236 3250866 3069381 2973849 3176236 3393856 3074892 3304184 3180083
11499C180083k22418j7822L09515J14354j37428m903k36517J55647M8665J27444
$$ 3180083 2957665 2939843 3249358 3363712 3226284 3221381 2984864 3140511 3189176 3316620
11489C316620J50973j83317l1978P250k7007K8278j81678L28492k10771R6556
$$ 3316620 3467593 3284276 3252298 3259548 3232541 3260819 3079141 3407633 3196862 3293418
11479C293418K02462J7539L5651k91386J07030K57345k5125j02389l8926r4621
$$ 3293418 3495880 3513419 3549070 3257684 3364714 3622059 3596934 3494545 3455619 3360998
11469C360998j11579J38890K04923k23743k81224J94890j59747J16582o979L64226
$$ 3360998 3249419 3388309 3593232 3369489 3088265 3283155 3123408 3239990 3233011 3597237
11459C597237m50644p9199K62054j81347o3289J75117p3514J3554J00944j17745
$$ 3597237 3146593 3067394 3329448 3148101 3084812 3259929 3186415 3199969 3300913 3183168
11449C183168K8929J2703j85259K24701p4664o6701K85105j39087Q8068j48409
$$ 3183168 3212097 3224800 3039541 3264242 3189578 3122877 3407982 3268895 3356963 3208554
11439C208554L2790J60049R0048m7579L3968J53609n3884J93279q0443J7453j52323
$$ 3208554 3241344 3401393 3491441 3443862 3477830 3631439 3577555 3770834 3690391 3707844 3555521
11428C555521K94789N3999k6963j07860M72881r6382j63691J4258L0259J37172
$$ 3555521 3850310 3904309 3877346 3769486 4242367 4145985 3982294 3996552 4026811 4163983
11418D163983Q5443j5808J1704J09532k62072J80018J44949j17520N4632J06211
$$ 4163983 4249426 4233618 4245322 4354854 4092782 4272800 4417749 4300229 4354861 4461072
11408D461072m8293J9312k7239L72696k0022r257o9308J10474K04694Q8192L8909
$$ 4461072 4412779 4432091 4404852 4777548 4757526 4748269 4678961 4789435 4994129 5082321 5121230
11397E121230k5715J28002J4665K38294K89013l35554K18183j19910L36167j26157
$$ 5121230 5095515 5223517 5238182 5476476 5765489 5429935 5648118 5528208 5864375 5738218
11387E738218J61852K33571M4161J66008K3237k2438K9982J57675k155J79266
$$ 5738218 5900070 6133641 6177802 6343810 6367047 6344609 6374591 6532266 6530111 6709377
11377F709377p738J11796J82000n9553j31546L37003K6646j81825K13127J20678
$$ 6709377 6701639 6813435 6995435 6935882 6804336 7141339 7167985 6986160 7199287 7319965
11367G319965j79717J73726o2706K96114j82543R5990j20023K22360k19904J99240
$$ 7319965 7140248 7313974 7251268 7547382 7364839 7460829 7340806 7563166 7343262 7542502
11357G542502m2705K83K48176j84047J07450l5647m2914K93246k73993J09448
$$ 7542502 7499797 7500080 7748256 7564209 7671659 7636012 7593098 7886344 7612351 7721799
11347G721799r1881j02632L3628P4600l29574J92797l5661Q6992k85035P3616
$$ 7721799 7629918 7527286 7560914 7635514 7305940 7498737 7463076 7550068 7265033 7338649
11337G338649l7317l27327J71320K14369m06331J63186j17059k88256l1757J63541
$$ 7338649 7301332 6974005 7145325 7359694 6953363 7116549 6999490 6711234 6679477 6843018
11327F843018J2403k52811j48871J64005k49155j99482R2197j70984j4693j94612
$$ 6843018 6855421 6602610 6453739 6617744 6368589 6169107 6261304 6090320 6075627 5881015
11317E881015R1976k36627O8859l20879K70210j37988k13178j74398o7415j02000
$$ 5881015 5972991 5736364 5805223 5484344 5754554 5616566 5403388 5228990 5161575 5059575
11307E059575P1499k40284k4219k52684J10265j04801k50877J8116j9873j43325
$$ 5059575 5131074 4890790 4866571 4613887 4724152 4619351 4368474 4386590 4366717 4223392
11297D223392L7820p8049j47336J10575k06269j12157R4691j57353j08290o0931
$$ 4223392 4261212 4183163 4035827 4146402 3940133 3827976 3922667 3765314 3657024 3596093
11287C596093j2782o3992R8050j04049M7832K0938l68232k23299N922J90894q4393
$$ 3596093 3583311 3519319 3617369 3513320 3561152 3582090 3213858 2990559 2996481 3187375 3102982
11276C102982n4870j21451N6684j14760R2362r7285L4507K05312j68868j05279
$$ 3102982 3048112 2926661 2983345 2868585 2960947 2863662 2898169 3103481 2934613 2829334
11266B829334k0542j09789M486J48542k44n7619j60247J94244j38519J38320j92097
$$ 2829334 2808792 2699003 2703489 2852031 2851787 2794168 2633921 2828165 2689646 2827966 2635869
11255B635869q9186j1703K74813l03861L8625j27695K28529q3258J02030j36883
$$ 2635869 2546683 2534980 2809793 2505932 2544557 2416862 2645391 2562133 2664163 2527280
11245B527280j6082l3543N8876O3122j23149J65792Q9702l59247K40466Q8790
$$ 2527280 2511198 2477655 2536531 2599653 2476504 2642296 2731998 2372751 2613217 2702007
11235B702007l87790L77418J08536j64083K04039p2506n1399j44981K45465O4009
$$ 2702007 2314217 2691635 2800171 2636088 2840127 2767621 2716222 2571241 2816706 2880715
11225B880715K81699O97933J182264J162126L21943P53931M27673k01952o0358
$$ 2880715 3162414 3860347 5042611 6204737 6526680 7280611 7708284 7506332 7445974
11216G445974l79738o79949o22932j027518p34809n05437j90678l48698j88123
$$ 7445974 7066236 6386287 5763355 4735837 4001028 3495591 3304913 2956215 2768092
11207B768092J68222l68592L43299k79216j23507J74732J53880n4269J50186L3397
$$ 2768092 2936314 2567722 2911021 2631805 2508298 2683030 2836910 2782641 2932827 2966224
11197B966224J50172L81274M12380J232672J253545K63416N18903J59848L28457
$$ 2966224 3116396 3497670 3910050 5142722 6396267 6659683 7178586 7338434 7666891
11188G666891l05133n97745k28223j062382q86527m83910n06870l57092j76897
$$ 7666891 7361758 6764013 6535790 5473408 4586881 4102971 3596101 3239009 3062112
11179C062112j61359k04452k1323Q3162k7642J62550j66523K11493N2798l25503
$$ 3062112 2900753 2696301 2674978 2758140 2730498 2893048 2726525 2938018 2990816 2665313
11169B665313R1730R7023n6000P2060m0730K40469j99664j38119J66152j56121
$$ 2665313 2757043 2854066 2798066 2870126 2829396 3069865 2870201 2732082 2898234 2742113
11159B742113J64965q3733K9688K72620k03192n6567J55493k17069P7220K22981
$$ 2742113 2907078 2823345 2853033 3125653 2922461 2865894 3021387 2804318 2881538 3104519
11149C104519n6662j10615L0043L19428l32137J01473j27771J58102K5478K1137
$$ 3104519 3047857 2937242 2967285 3286713 2954576 3056049 2928278 3086380 3111858 3132995
11139C132995l3885j48158J97678O6796J88112j92056J13727j30128j5222N9446
$$ 3132995 3099110 2950952 3148630 3215426 3403538 3211482 3325209 3195081 3179859 3239305
11129C239305K57140o0151M6580n0857j69827J15738L1557m465R7954r5580O1047
$$ 3239305 3496445 3436294 3482874 3432017 3262190 3377928 3409485 3405020 3502974 3407394 3468441
11118C468441J48820q6784J66420j55534r3371M0590K22070j00708k2324p4906
$$ 3468441 3617261 3530477 3696897 3541363 3447992 3488582 3710652 3609944 3587620 3512714
11108C512714M18600o79378L46894k08945M5901K12274o0566M3123M68k8328l32121
$$ 3512714 3931314 3251936 3598830 3389885 3435786 3648060 3587494 3630617 3631085 3602757 3270636
11097C270636N6433J70802K42768m58497K89224j47849Q4110j79983O026J15158
$$ 3270636 3327069 3497871 3740639 3282142 3571366 3423517 3507627 3327644 3333670 3448828
11087C448828k4479j67428J73316m3089r4313J52802J03093j32565j2078J21112
$$ 3448828 3424349 3256921 3430237 3387148 3292835 3445637 3548730 3416165 3404087 3525199
11077C525199l22064L90133r5566R9941l45078K19333j51623L61715j3629j58308
$$ 3525199 3203135 3593268 3497702 3597643 3252565 3471898 3320275 3681990 3668361 3510053
11067C510053K50369j76266n1827J77174J14144j7043J76195j58465K91491j50996
$$ 3510053 3760422 3584156 3532329 3709503 3823647 3806604 3982799 3824334 4115825 3964829
11057C964829J55340O5985j3007O7668j52814k0424M895J38009J97279l65084
$$ 3964829 4120169 4186154 4173147 4240815 4088001 4067577 4072472 4210481 4407760 4042676
11047D042676L11129r0342j208J34796O6518q0252K3424K6127p8985K75855q410
$$ 4042676 4353805 4263463 4262255 4397051 4463569 4383317 4406741 4432868 4353883 4629738 4621328
11036D621328K1713J99574J81125K8277J44831K40912R67j3466J83628K39153
$$ 4621328 4643041 4842615 5023740 5052017 5196848 5437760 5438727 5425261 5608889 5848042
11026E848042r2368L63242m6822M301M48586P810J11898r8664Q9643J15103o1826
$$ 5848042 5755674 6118916 6072094 6076395 6524981 6532791 6644689 6546025 6635668 6750771 6688945
11015F688945j3317M19955k9295j05032K01431N2336P7346J77599L18780M4468
$$ 6688945 6675628 7095583 7066288 6961256 7162687 7215023 7292369 7469968 7788748 7833216
11005G833216R8435J78115q371M88900r7249N33910j18445L27093k1641J44449
$$ 7833216 7931651 8109766 8101395 8590295 8493046 9026956 8908511 9235604 9213963 9358412
10995I358412K90543j59227J77960K91501r4787j47679M52904J60057o1958R1699
$$ 9358412 9648955 9489728 9667688 9959189 9864402 9716723 10169627 10329684 10267726 10359425
10985A0359425J53688J347J80300K07972M93403J37973K95029L89631J97237J49608
$$ 10359425 10513113 10514460 10694760 10902732 11396135 11534108 11829137 12218768 12416005 12565613
10975A2565613J18719K71705k9495J39820K6966K06575K32870L26057J59800M19403
$$ 12565613 12684332 12956037 12926542 13066362 13093328 13299903 13532773 13858830 14018630 14438033
10965A4438033J72696M27811J11899J37057L71005N04435J27598K32365K75867
$$ 14438033 14610729 15038540 15150439 15287496 15658501 16162936 16290534 16522899 16798766
10956A6798766O57470J68540N79063M98325K64871K45540L71688M04366K16872
$$ 16798766 17456236 17624776 18203839 18702164 18967035 19212575 19584263 19988629 20205501
10947B0205501N66386N9128K15657J94139L58106N41010M51594L17080K58030
$$ 20205501 20771887 20831015 21046672 21240811 21598917 22139927 22591521 22908601 23166631
10938B3166631P69318L46459L98875L93779N93578N42484M31642O52011M70277
$$ 23166631 23935949 24282408 24681283 25075062 25668640 26211124 26642766 27294777 27765054
10929B7765054M27070L35977N49120M06323P09505O16950M64353O27408L99555
$$ 27765054 28192124 28528101 29077221 29483544 30193049 30809999 31274352 31901760 32301315
10920C2301315M98213K78694L11498k584K1478p5110l5261j90543K43988j83106
$$ 32301315 32799528 33078222 33389720 33387136 33408614 33333504 33298243 33107700 33351688 33168582
10910C3168582j9766o4781j19634J65690K31649r6938J32456O1092k07249L23337
$$ 33168582 33148816 33084035 32964401 33130091 33361740 33264802 33397258 33458350 33251101 33574438
10900C3574438K51985j812L81335L8848M80578O83626J14645N52240M56220P26880
$$ 33574438 33826423 33824611 34205946 34244794 34725372 35408998 35523643 36075883 36532103 37258983
10890C7258983M82910J033730N55250J029802J675644J094137J559280J486525
$$ 37258983 37741893 38775623 39330873 40360675 42036319 43130456 44689736 46176261
10882D6176261K017242K111378K567189K434044K958824K927638K790530L391400
$$ 46176261 48193503 50304881 52872070 55306114 58264938 61192576 63983106 67374506
10874F7374506K777806K760881K144755J835357J331394P30810J88737k58775
$$ 67374506 70152312 72913193 75057948 76893305 78224699 78955509 79144246 78885471
10866G8885471j025221j400953j758125k056133k543899k606494k753614k883534
$$ 78885471 77860250 76459297 74701172 72645039 70101140 67494646 64741032 61857498
10858F1857498l112498k637398l094430k533455l007801k444811k621669k289511
$$ 61857498 58745000 56107602 53013172 50479717 47471916 45027105 42405436 40115925
10850D0115925k358356k116461j781171k215167j754229j661231j552330j449257
$$ 40115925 37757569 35641108 33859937 31644770 29890541 28229310 26676980 25227723
10842B5227723j307429j530381j065856j326104j130710q52289j080379m58656
$$ 25227723 23920294 22389913 21324057 19997953 18867243 18014954 16934575 16475919
10834A6475919r63546q34055n57996m69316j004720p2416o77317o20568l38114
$$ 16475919 15512373 14678318 14120322 13651006 12646286 12573870 11896553 11275985 10937871
10825A0937871l65403k87499n41423m14922j73824l54427n46716m6216k15356
$$ 10937871 10572468 10284969 9743546 9328624 9154800 8800373 8253657 8207441 7992085
10816G992085k55600p0629j86703K789l12454m5319j47506J8394j41554j81887
$$ 7992085 7736485 7665856 7479153 7481942 7169488 7124169 6976663 6995057 6853503 6671616
10806F671616r9226q0486l07573J6208o18405j4859m9618k33692k08809l11339
$$ 6671616 6572390 6491904 6184331 6200539 5582134 5567275 5517657 5283965 5075156 4763817
10796D763817O3043r8141j26553o8129P8289r2632j360j02563k19629J38136k86921
$$ 4763817 4826860 4728719 4602166 4534037 4612326 4519694 4518334 4415771 4196142 4334278 4047357
10785D047357M6966L0060j77517P4349J44892j08707j96363n380j73480m38627
$$ 4047357 4094323 4124383 3946866 4021215 4166107 4057400 3861037 3855657 3682177 3243550
10775C243550L23785j31488k2580n3578N5909L5503j09601j62542L0545q5339
$$ 3243550 3567335 3435847 3413267 3359689 3415598 3451101 3341500 3178958 3209503 3124164
10765C124164p5718n505O237J1648k53926J10246m1673p4291J12863O6603l4738
$$ 3124164 3048446 3042941 3049178 3060826 2806900 2917146 2875473 2801182 2914045 2980648 2945910
10754B945910O1766N6156J90457j53986j38778K90679j62590l17864K29451K1652
$$ 2945910 3007676 3063832 3254289 3100303 2961525 3252204 3089614 2771750 3001201 3022853
10744C022853l86236l3349J71017k67324R4892l1532j2400J31844p2478o2007
$$ 3022853 2636617 2603268 2774285 2506961 2601853 2570321 2557921 2689765 2617287 2555280
10734B555280j2847p16j53636J62980n8570K34258j10071J19622q923P8509l8713
$$ 2555280 2542433 2541717 2388081 2551061 2492491 2726749 2616678 2736300 2727377 2805886 2767173
10723B767173K6285l03610M04196k08606j65373O9140M0328r1490k30450K92916
$$ 2767173 2793458 2489848 2894044 2685438 2520065 2589205 2629533 2538043 2307593 2600509
10713B600509J22762j67497m9007P0418j24718P2929J05080N5890j51959n2486
$$ 2600509 2723271 2555774 2506767 2577185 2452467 2525396 2630476 2686366 2534407 2481921
10703B481921L096o5856J33014M5458j48091J22660p0822l0290j12970J04713
$$ 2481921 2485017 2419161 2552175 2597633 2449542 2572202 2501380 2471090 2358120 2462833
10693B462833J04505l8131j01876M6182j79761o392L64087j69825m6228J16625
$$ 2462833 2567338 2529207 2427331 2473513 2293752 2287360 2651447 2481622 2435394 2552019
10683B552019j03498k18802K21567j94335k07446L57147J9959K5446l0097J22828
$$ 2552019 2448521 2229719 2451286 2256951 2049505 2406652 2426611 2452057 2421960 2544788
10673B544788K4801J60613j60905k28935l800J7166l6193j8275q7138j52827k9503
$$ 2544788 2569589 2730202 2569297 2340362 2336562 2353728 2317535 2299260 2212122 2059295 2029792
10662B029792J47547J15479j36031p4636o5800J96720k26498K1654L51319J3830
$$ 2029792 2177339 2292818 2156787 2082151 2016351 2213071 1986573 2008227 2359546 2373376
10652B373376j88003J73664K12479K8253k73874j38044J32935j93390m9475M7142
$$ 2373376 2185373 2359037 2571516 2599769 2325895 2187851 2320786 2127396 2077921 2125063
10642B125063J32745m17598J3065N6623p5197K412N446J10737k48528K09598j50150
$$ 2125063 2257808 1840210 1853275 1909898 1834701 1837113 1842559 1953296 1704768 1914366 1764216
10631A764216O9794O1274j76542r2321L08680l31l28968M2308k9378q4928J5295
$$ 1764216 1834010 1895284 1718742 1626421 1935101 1934770 1605802 1648110 1618732 1533804 1549099
10620A549099J22468O7271j76428K31407j28989L8256j52758K80624j92994J55131
$$ 1549099 1671567 1738838 1562410 1793817 1664828 1703084 1550326 1830950 1637956 1793087
10610A793087j98727O3755j9547J96003r7874n0746P9194M8086k48534J78158
$$ 1793087 1594360 1658115 1638568 1834571 1736697 1685951 1765145 1813231 1564697 1742855
10600A742855j87785K49298J7428j3707r1180o123R9267j60775P374j0147P3609
$$ 1742855 1555070 1804368 1821796 1808089 1716909 1710786 1810053 1649278 1656652 1646505 1720114
10589A720114J18254j54641O606j45208J17660J10440k32796R2038M4867k38679
$$ 1720114 1838368 1683727 1690333 1545125 1662785 1773225 1540429 1632467 1677334 1438655
10579A438655J22717J88824k7637Q6727o8628O0283j34890n9227J34470k97878
$$ 1438655 1561372 1750196 1722559 1809286 1740658 1800941 1666051 1606824 1741294 1443416
10569A443416J24754r092k7497K57948q44033M41093J17374L8120J92751k26655
$$ 1443416 1568170 1559078 1531581 1789529 945496 1386589 1503963 1542083 1734834 1508179
10559A508179j03045K49886k23351k1635j7770k301p5262q846j14046K3054K08258
$$ 1508179 1405134 1655020 1431669 1410034 1392264 1389963 1314701 1305855 1191809 1214863 1423121
10548A423121p2419j02253q6107J63907m4153O8626R7080j02320P8677J10220
$$ 1423121 1350702 1248449 1162342 1326249 1282096 1350722 1447802 1345482 1424159 1534379
10538A534379J742l1589j39617L8738j43764N8226k23883M34408J8243k07148
$$ 1534379 1536121 1504532 1364915 1403653 1259889 1318115 1094232 1528640 1546883 1339735
10528A339735P1972J68610j27230J82170k64881J15354J80807k44112J92454N10751
$$ 1339735 1411707 1580317 1453087 1635257 1370376 1485730 1666537 1422425 1614879 2125630
10518B125630n304L62310J80891k78396j31773K65242O570k59312j95071j88722
$$ 2125630 2120326 2482636 2663527 2385131 2253358 2518600 2525170 2265858 2070787 1882065
10508A882065j52319k311k9505j06744J53131J979l20436K26894M215M0105J01320
$$ 1882065 1729746 1727435 1697930 1591186 1744317 1746296 1425860 1652754 1656969 1697074 1798394
10497A798394p8076k5702J92315j78976J49651M9955L52829J86207N8932o3471
$$ 1798394 1720318 1694616 1886931 1707955 1857606 1907561 2260390 2446597 2505529 2442058
10487B442058J79444M1312k10748J77417k01062M7849n02875J98222k26473o2141
$$ 2442058 2621502 2662814 2452066 2629483 2428421 2476270 1973395 2171617 1945144 1883003
10477A883003o8498o9259Q1479j29363K67565M6817k7036O6180j32553P0718J25174
$$ 1883003 1814505 1745246 1826725 1697362 1964927 2011744 1984708 2050888 1918335 1989053 2114227
10466B114227K02492L5508J17107P4916j26662Q934r994R0607j36663p3713m031
$$ 2114227 2316719 2352227 2469334 2544250 2417588 2426522 2416528 2507135 2370472 2296759 2292728
10455B292728k54773J05031K3569l7532K42042j05120j39005K45428R8636n0418
$$ 2292728 2037955 2142986 2166555 2129023 2371065 2265945 2126940 2372368 2471004 2420586
10445B420586J54315m0538J5635J91082k77815J21993K08146L62057K49800K27914
$$ 2420586 2574901 2534363 2549998 2741080 2463265 2585258 2793404 3155461 3405261 3633175
10435C633175k76937K93763n0279N534j30465m86853j02393j11667k67686l77070
$$ 3633175 3356238 3650001 3599722 3605256 3474791 2987938 2885545 2773878 2506192 2129122
10425B129122o4266L194j28017l4055L98362j02239l23748L32917l76082L17921
$$ 2129122 2064856 2068050 1940033 1905978 2304340 2202101 1878353 2211270 1835188 2153109
10415B153109P1026j96305J01402j0359L99745L97022L14113q7965K88085j62790
$$ 2153109 2224135 2027830 2129232 2118873 2518618 2915640 3229753 3141788 3429873 3267083
10405C267083N96657O9713J63157p9115k0792k34683J36553l4139J69144K61213
$$ 3267083 3863740 3933453 4096610 4017495 3996703 3762020 3898573 3864434 4033578 4294791
10395D294791k56335R7128M16506o2686L85903k23089K72502R9206k3075l743
$$ 4294791 4038456 4135584 4552090 4489404 4875307 4652218 4924720 5023926 5000851 4997108
10385D997108J29276P1641k31545j18827L16761J97661j77010N49832m00264J43754
$$ 4997108 5126384 5198025 4966480 4847653 5164414 5362075 5185065 5734897 5334633 5478387
10375E478387j71873J69045p4149o9862J48306K61956L3818m521K27423R845k22068
$$ 5478387 5306514 5475559 5401410 5331548 5479854 5741810 5775628 5771107 5998530 6008375 5786307
10364E786307K82130m2677J9602m14774r609k69585o8686j65321J96284O892m4340
$$ 5786307 6068437 6025760 6045362 5630588 5620979 5351394 5282708 5117387 5313671 5320563 5276223
10353E276223k2618Q7624l82851l4420P7752l48085J50741l26447j89875q2944
$$ 5276223 5253605 5341229 4958378 4923958 5001710 4653625 4804366 4477919 4288044 4205100
10343D205100k23167M4289j19063N6665J15752J90625N1891r0105K12544O4619
$$ 4205100 3981933 4026222 3907159 3963824 4079576 4270201 4322092 4231987 4444531 4509150
10333D509150j71982J99361m1715k18400O3446L9404k89742M2739j79013O4565
$$ 4509150 4337168 4536529 4494814 4276414 4339860 4379264 4089522 4132261 3953248 4017813
10323D017813J40325j74938m3863j4270J43650k5850l1317P7086k7279J18631
$$ 4017813 4158138 3983200 3939337 3925067 4068717 4042867 4011550 4088636 4061357 4179988
10313D179988j18234Q169L54778j40523K86547J65076K56195R4923j48014J31524
$$ 4179988 4061754 4069923 4424701 4284178 4570725 4735801 4991996 5086919 4938905 5070429
10303E070429O5005P7306n9597k02863r0351J57292l17659K1745K4081J95675
$$ 5070429 5135434 5212740 5153143 4950280 4859929 5017221 4699562 4721307 4745388 4941063
$$ [...]
##END NTUPLES=NMR SPECTRUM
##END=
