##TITLE=Coffee green (M1-ROVE60 + 1.5mL buffer 50/50,  450uL extracto + 50uL (D2O+TMS))
without heating, vortex and centrifuged, temperature 0oC.
##JCAMPDX= 6.0         $$ Bruker NMR JCAMP-DX V2.0
##DATA TYPE= NMR SPECTRUM
##DATA CLASS= NTUPLES
##ORIGIN= Bruker BioSpin GmbH
##OWNER= Administrator
$$ 1.72 TOPSPIN		Version 2.1
$$ 2012-05-22 16:14:16.278 -0700  Administrator@X
$$ Compression mode = diff/dup
##.OBSERVE FREQUENCY= 400.13188196
##.OBSERVE NUCLEUS= ^1H
##.ACQUISITION MODE= SIMULTANEOUS (DQD)
##.ACQUISITION SCHEME= undefined
##.AVERAGES= 64
##.DIGITISER RES= 22
##SPECTROMETER/DATA SYSTEM= spect
##.PULSE SEQUENCE= noesygppr1d
##.SOLVENT NAME= H2O+D2O
##.SHIFT REFERENCE= INTERNAL, H2O+D2O, 1, 14.97964
##AUDIT TRAIL= $$ (NUMBER, WHEN, WHO, WHERE, PROCESS, VERSION, WHAT)
$$ ##TITLE= Audit trail, TOPSPIN		Version 2.1
$$ ##JCAMPDX= 5.01
$$ ##ORIGIN= Bruker BioSpin GmbH
$$ ##OWNER= Administrator
$$ $$ C:\Bruker\TOPSPIN/data/jwist/nmr/11-coffee-green-quantification-2/211/pdata/1/auditp.txt
$$ ##AUDIT TRAIL=  $$ (NUMBER, WHEN, WHO, WHERE, PROCESS, VERSION, WHAT)
(   1,<2011-11-18 12:53:13.872 -0500>,<Administrator>,<TOPSPIN>,<go>,<TOPSPIN 2.1>,
      <created by zg
	started at 2011-11-18 12:44:19.185 -0500,
	POWCHK enabled, PULCHK disabled,
       configuration hash MD5:
       DA 63 81 1B EF 4C B5 72 B4 DF EA D9 B4 DB 4C 08
       data hash MD5: 64K
       7A 21 50 3F 62 9F A4 20 A1 3E 2A FE EA D6 0C DE>)
(   2,<2011-11-18 15:24:06.544 -0500>,<Administrator>,<TOPSPIN>,<proc1d>,<TOPSPIN 2.1>,
      <Start of raw data processing
       efp LB = 0 FT_mod = 6 PKNL = 1 PHC0 = 0 PHC1 = 0 SI = 32K 
       data hash MD5: 32K
       A6 C3 6C 34 68 AC 89 DF 3F D5 4A C1 B1 2B 5A E3>)
(   3,<2011-11-18 15:24:06.904 -0500>,<Administrator>,<TOPSPIN>,<proc1d>,<TOPSPIN 2.1>,
      <pk PHC0 = 21.8573 PHC1 = 0 
       data hash MD5: 32K
       D0 D2 B6 49 5A 15 E5 3A 32 98 A0 D8 6F 11 A2 10>)
$$ ##END=
$$ 
$$ $$ hash MD5
$$ $$ C4 C6 AD C1 3E 1F 1B 79 E3 E1 DB F2 61 C1 16 02
##$RELAX= 
##$RELAX= 
##$RELAX= 
##$RELAX= 
##$RELAX= 
$$ Bruker specific parameters
$$ --------------------------
##$DU= <Z:>
##$EXPNO= 211
##$NAME= <11-coffee-green-quantification-2>
##$PROCNO= 1
##$TYPE= <nmr>
##$USER= <jwist>
##$ACQT0= -8.16105157023081
##$AMP= (0..31)
100 100 100 100 100 100 100 100 100 100 100 100 100 100 100 100 100 100
100 100 100 100 100 100 100 100 100 100 100 100 100 100
##$ANAVPT= -1
##$AQSEQ= 0
##$AQ_mod= 3
##$AUNM= <au_prof>
##$AUTOPOS= <>
##$BF1= 400.13
##$BF2= 400.13
##$BF3= 400.13
##$BF4= 400.13
##$BF5= 400.13
##$BF6= 400.13
##$BF7= 400.13
##$BF8= 400.13
##$BYTORDA= 0
##$CFDGTYP= 0
##$CFRGTYP= 9
##$CHEMSTR= <none>
##$CNST= (0..63)
1 1 145 1 1 1 1 1 1 1 1 1 1 1 1 1 1 1 1 1 1 1 1 1 1 1 1 1 1 1 1 1 1 1 1
1 1 1 1 1 1 1 1 1 1 1 1 1 1 1 1 1 1 1 1 1 1 1 1 1 1 1 1 1
##$CPDPRG= <>
##$CPDPRG1= <>
##$CPDPRG2= <>
##$CPDPRG3= <>
##$CPDPRG4= <mlev>
##$CPDPRG5= <mlev>
##$CPDPRG6= <mlev>
##$CPDPRG7= <mlev>
##$CPDPRG8= <mlev>
##$CPDPRGB= <>
##$CPDPRGT= <>
##$D= (0..63)
$$ [...]
##$TP= (0..7)
150 150 150 150 150 150 150 150
##$TP07= 0
##$TPNAME0= <>
##$TPNAME1= <>
##$TPNAME2= <>
##$TPNAME3= <>
##$TPNAME4= <>
##$TPNAME5= <>
##$TPNAME6= <>
##$TPNAME7= <>
##$TPOAL= (0..7)
0.5 0.5 0.5 0.5 0.5 0.5 0.5 0.5
##$TPOFFS= (0..7)
0 0 0 0 0 0 0 0
##$TUNHIN= 0
##$TUNHOUT= 0
##$TUNXOUT= 0
##$USERA1= <user>
##$USERA2= <user>
##$USERA3= <user>
##$USERA4= <user>
##$USERA5= <user>
##$V9= 5
##$VALIST= <valist>
##$VCLIST= <CCCCCCCCCCCCCCC>
##$VD= 0
##$VDLIST= <DDDDDDDDDDDDDDD>
##$VPLIST= <PPPPPPPPPPPPPPP>
##$VTLIST= <TTTTTTTTTTTTTTT>
##$WBST= 2048
##$WBSW= 25
##$XGAIN= (0..3)
0 0 0 0
##$XL= 0
##$YL= 0
##$YMAX_a= 5192143
##$YMIN_a= -1964333
##$ZGOPTNS= <>
##$ZL1= 120
##$ZL2= 120
##$ZL3= 120
##$ZL4= 120
##$ABSF1= 0
##$ABSF2= 0
##$ABSG= 0
##$ABSL= 0
##$ALPHA= 0
##$AQORDER= 0
##$ASSFAC= 0
##$ASSFACI= 0
##$ASSFACX= 0
##$ASSWID= 0
##$AUNMP= <proc_prof1d>
##$AXLEFT= 0
##$AXNAME= <>
##$AXNUC= <1H>
##$AXRIGHT= 0
##$AXTYPE= 0
##$AXUNIT= <>
##$AZFE= 0.1
##$AZFW= 0.1
##$BCFW= 0
##$BC_mod= 0
##$BYTORDP= 0
##$COROFFS= 0
##$CY= 15
##$DATMOD= 1
##$DC= 0
##$DFILT= <>
##$DTYPP= 0
##$F1P= 0
##$F2P= 0
##$FCOR= 0.5
##$FTSIZE= 32768
##$FT_mod= 6
##$GAMMA= 0
##$GB= 0
##$INTBC= 1
##$INTSCL= 1
##$ISEN= 128
##$LB= 0
##$LEV0= 0
##$LPBIN= 0
##$MAXI= 10000
##$MC2= 0
##$MEAN= 0
##$ME_mod= 0
##$MI= 0
##$NCOEF= 0
##$NC_proc= -6
##$NLEV= 6
##$NOISF1= 0
##$NOISF2= 0
##$NSP= 0
##$NTH_PI= 0
##$NZP= 0
##$OFFSET= 14.97964
##$PC= 1
##$PHC0= 21.8573
##$PHC1= 0
##$PH_mod= 1
##$PKNL= yes
##$PPARMOD= 0
##$PPDIAG= 0
##$PPIPTYP= 0
##$PPMPNUM= 2147483647
##$PPRESOL= 1
##$PSCAL= 4
##$PSIGN= 0
##$PYNMP= <proc.py>
##$REVERSE= no
##$SF= 400.13
##$SI= 32768
##$SIGF1= 0
##$SIGF2= 0
##$SINO= 400
##$SIOLD= 32768
##$SPECTYP= <>
##$SREGLST= <1H.CDCl3>
##$SSB= 0
##$STSI= 32768
##$STSR= 0
##$SW_p= 8223.68421052631
##$SYMM= 0
##$S_DEV= 0
##$TDeff= 65536
##$TDoff= 0
##$TI= <>
##$TILT= no
##$TM1= 0
##$TM2= 0
##$TOPLEV= 0
##$USERP1= <user>
##$USERP2= <user>
##$USERP3= <user>
##$USERP4= <user>
##$USERP5= <user>
##$WDW= 1
##$XDIM= 32768
##$YMAX_p= 331176138
##$YMIN_p= -24878066
##$CURPLOT= <Network HP LaserJet P1505>
##$CURPRIN= <$Network HP LaserJet P1505>
##$DFORMAT= <normdp>
##$LAYOUT= <+/1D_H.xwp>
##$LFORMAT= <normlp>
##$PFORMAT= <normpl>
##$SURQMSG= 1
$$ End of Bruker specific parameters
$$ ---------------------------------
##NTUPLES= NMR SPECTRUM
##VAR_NAME=  FREQUENCY,     SPECTRUM/REAL,   SPECTRUM/IMAG
##SYMBOL=    X,             R,               I
##VAR_TYPE=  INDEPENDENT,   DEPENDENT,       DEPENDENT
##VAR_FORM=  AFFN,          ASDF,            ASDF
##VAR_DIM=   32768,         32768,           32768
##UNITS=     HZ,            ARBITRARY UNITS, ARBITRARY UNITS
##FACTOR=    0.250966925370066, 1,           1
##FIRST=     8223.43324360094, 15885,        -211766
##LAST=      0,             -45253,          -87122
##MIN=       0,             -24878066,       0
##MAX=       8223.43324360094, 331176138,    0
$$ Real data points
##PAGE= N=1
##DATA TABLE= (X++(R..R)), XYDATA
$$ [...]
19666A977262K79843k40418K64661k47786K67463l55092J81637k72603M21692
$$ 1977262 2257105 2016687 2281348 2033562 2301025 1945933 2127570 1854967 2276659
19657B276659k07387J33801k6901k6258N1440M8453M814J67888j66448k49586
$$ 2276659 2069272 2203073 2176172 2149914 2201354 2249807 2254621 2422509 2256061 2006475
19647B006475K5364m9185J80720j30778J26946j46148P0918j9689J3493J84920
$$ 2006475 2031839 1982654 2163374 2032596 2159542 2013394 2084312 2064623 2078116 2263036
19637B263036r9822j24153j09046K94016K540k95297K75521p3861r0638J06694
$$ 2263036 2163214 2039061 1930015 2224031 2226571 1931274 2206795 2132934 2042296 2148990
19627B148990l00595L69726j19617k77728J97367l10075K62389J39051j98976
$$ 2148990 1848395 2218121 2098504 1820776 2018143 1708068 1970457 2109508 1910532
19618A910532l5749j1588J34803k2846K04293j05029O4670j91642j44059J23782
$$ 1910532 1874783 1863195 1997998 1975152 2179445 2074416 2139086 1947444 1803385 1927167
19608A927167J72553m06392J96730M4742j19428K97563l51520J63496k76268L78040
$$ 1927167 2099720 1693328 1890058 1934800 1815372 2112935 1761415 1924911 1648643 2026683
19598B026683l08059J48216J6258k60676n4272K34020R1178K98048l57074j3409
$$ 2026683 1718624 1866840 1883098 1622422 1568150 1802170 1893348 2191396 1834322 1820913
19588A820913L1770L3197J01383R892n8503j26485L3078J36740l7314k70301K46479
$$ 1820913 1852683 1885880 1987263 1997155 1938652 1812167 1845245 1981985 1944671 1674370 1920849
19577A920849L4370K03430j49731j29563Q4086k37425m7869J04267j42699K63226
$$ 1920849 1955219 2158649 2008918 1879355 1963441 1726016 1678147 1782414 1639715 1902941
19567A902941j37362k1211J55975q3841N5196K5656M3175q4688j2205k6539L24254
$$ 1902941 1765579 1744368 1900343 1816502 1871698 1897354 1940529 1855841 1843636 1817097 2141351
19556B141351m05883p8189P5565j66172J84937j85570L5661J6042K07083j33379
$$ 2141351 1735468 1657279 1732844 1566672 1751609 1566039 1601700 1617742 1824825 1691446
19546A691446j77130j94815L65253p8702m882K40653j71558L7540j39323J45499
$$ 1691446 1514316 1319501 1684754 1606052 1601170 1841823 1670265 1707805 1568482 1713981
19536A713981j37266j27290K72872o6857M762k93048L0419P7954P6003j46495
$$ 1713981 1576715 1449425 1722297 1655440 1660202 1367154 1397573 1475527 1551530 1405035
19526A405035K09165j62416L64944j98934J9990J05674q464j32746R8400P5046
$$ 1405035 1614200 1451784 1816728 1617794 1637784 1743458 1734994 1602248 1700648 1775694
19516A775694N9416j10378q457J23918k2680m24042K44633j01168J04042J20128
$$ 1775694 1835110 1724732 1716275 1840193 1817513 1393471 1638104 1536936 1640978 1761106
19506A761106j1555n225L3540k53615K7690J34228j27848j60624m0652R7323J74340
$$ 1761106 1749551 1744326 1777866 1524251 1551941 1686169 1558321 1397697 1357045 1454368 1628708
19495A628708j99122N1946j51012K00752J5292k0479P4197j67996j05216J68260
$$ 1628708 1429586 1481532 1330520 1531272 1546564 1526085 1600282 1432286 1327070 1495330
19485A495330m3008L0178j34410K14944j30263j7371N0239j35265r0963L94156
$$ 1495330 1452322 1482500 1348090 1563034 1432771 1415400 1465639 1330374 1239411 1633567
19475A633567k26097j22794Q8092j47411J29798j54414P3896l1131j09426M1545
$$ 1633567 1407470 1284676 1372768 1225357 1355155 1200741 1274637 1243506 1134080 1175625
19465A175625j6987L14680m32312K32809Q6873m26116K49126J4261m2795J2621
$$ 1175625 1158638 1473318 1041006 1273815 1360688 934572 1183698 1197959 1155164 1167785
19455A167785j54299K38578P7920k14351l3321k1138j6634J58324J93401j4894
$$ 1167785 1013486 1252064 1329984 1115633 1082312 1061174 1044540 1202864 1396265 1381371
19445A381371l09651r2779j28377J64107R8374k9431m2354J84795M6782l13357
$$ 1381371 1071720 978941 850564 1014671 1113045 1083614 1041260 1226055 1272837 959480
19435I59480M8461k6217J47570J05527k44762J37064k18674J6016K16397l36301
$$ 959480 1007941 981724 1129294 1234821 990059 1127123 908449 924465 1140862 804561
19425H04561K95835j17890L01293l90218P4724J10461k2265j24583J17492r4302
$$ 804561 1100396 982506 1283799 893581 968305 1078766 1056501 931918 1049410 955108
19415I55108J47092j12503n3446L6869M5302P0220k10176K03426k42934K34797
$$ 955108 1102200 989697 936251 973120 1018422 1088642 878466 1081892 838958 1073755
19405A073755k69518K37109j36757K62296l10996O1858J76276m7861k81637J45177
$$ 1073755 804237 1041346 904589 1166885 855889 917747 1094023 1046162 764525 909702
19395I09702k0587J24689o2137J2016j07033L19324k40962q5775L3351k21927
$$ 909702 889115 1013804 951667 963683 856650 1175974 935012 849237 882588 660661
19385F60661K51361O6425n0286K03890n8001j63690N4893Q0630j33158J57063
$$ 660661 912022 978447 928161 1132051 1074050 910360 965253 1045883 912725 1069788
19375A069788j98217N0346J87076k83254Q5391n0049L9824L3909j3771l5566K8848
$$ 1069788 871571 921917 1108993 825739 911130 861081 900905 934814 921043 885477 914325
19364I14325j08933J78031j70282J14262J61050j22282j67890O1408K65395j27262
$$ 914325 805392 983423 813141 927403 1088453 966171 798281 859689 1125084 997822
19354I97822j04016K82182k50895Q744k10624J6273J38954j18020K63843q6203
$$ 997822 893806 1175988 925093 933837 723213 739486 878440 760420 1024263 938060
19344I38060k06840K30569r3816J45203q9471m0468j4488P3998o8740J65959k05496
$$ 938060 731220 961789 867973 1013176 923705 883237 868749 942747 874007 1039966 834470
19333H34470j06461j1969J73806K5293k24030K42145j55126J03613J10864k19550
$$ 834470 728009 716040 889846 915139 691109 933254 778128 881741 992605 773055
19323G73055J59082p6072M6238j38604K05169o6372J57883j66794J05234k89051
$$ 773055 932137 856065 902303 763699 968868 902496 1060379 893585 998819 709768
19313G09768J30344J1012J73722q0014L9778L4785j05302J05277J16302P583j51243
$$ 709768 840112 851124 1024846 944832 984610 1019395 914093 1019370 1135672 1143255 992012
19302I92012j21682J45097K916j16851l2148J40098Q8034j01435Q688q655l9642
$$ 992012 870330 1015427 1018343 901492 869344 1009442 1097476 996041 1004729 996074 956432
19291I56432r2218K06810j79582P8411k9981J26009K4240m26337M4243O514K61750
$$ 956432 864214 1071024 891442 969853 939872 1065881 1090121 663784 708027 714541 976291
19280I76291j43619J39372O6696j67027o9590r5508L67568J7257l71518L42598
$$ 976291 832672 972044 1038740 871713 802123 706615 1074183 1091440 719922 1062520
19270A062520l14539O3966J42000l39130L09272k07199q0044R4438J33583j95633
$$ 1062520 747981 811947 953947 614817 924089 716890 636846 731284 864867 669234
19260F69234M8991l3442l9712O194J82396K121K96542k92507j56427J24390k92607
$$ 669234 718225 684783 645071 651265 833661 835782 1132324 839817 683390 807780 515173
19249E15173L69570n0237N6261q5874N2236J09644L71957P0317M6080R7612k08186
$$ 515173 884743 834506 890767 804893 857129 966773 1338730 1409047 1455127 1552739 1344553
19238A344553K65731o8950K17168J12790l81946l50402j87132l8823o8446L5044
$$ 1344553 1610284 1541334 1758502 1871292 1489346 1138944 951812 912989 844543 879587
19228H79587l0493q8004J29681J40676j60839j09308K11490j5890l19797K6786
$$ 879587 849094 761090 890771 1031447 870608 761300 972790 956900 637103 663889
19218F63889J90940k72600K08809P3487K8994k92240J87634K08151j88875p423
$$ 663889 854829 582229 791038 864525 893519 601279 788913 997064 808189 800766
19208H00766J4056j35474K20918j60318l1327o4255J36496J78373k09176k48550
$$ 800766 814822 679348 900266 739948 708621 644366 780862 959235 750059 501509
19198E01509L28789K3058k26775N9352J40631j08169j1839L4349R0342K9683j76739
$$ 501509 830298 853356 626581 685933 826564 718395 706556 740905 831247 860930 684191
19187F84191p1609L3604J67894k08913K54544n6655j26891Q5470P4402j92894
$$ 684191 612582 646186 814080 605167 859711 803056 676165 761635 836037 643143
19177F43143J32649J4639j7884q3616p5793K70852N0528k26301P8931l45982M64345
$$ 643143 775792 790431 772547 688931 613138 883990 934518 708217 787148 441166 905511
19166I05511j74632m6848J96423P9471q3754J42422j29217K0735N528J01348j91142
$$ 905511 730879 684031 880454 959925 876171 1018593 889376 910111 915639 1016987 825845
19155H25845J59237o719J76778L14446k46149M54722m02992K61853o4337K4479
$$ 825845 985082 978363 1155141 1469587 1223438 1678160 1275168 1537021 1472684 1497163
19145A497163j29712J27565n10440L95266j35553j37827J37333K84658J8008k12725
$$ 1497163 1367451 1495016 984576 1379842 1244289 1106462 1243795 1528453 1546461 1333736
19135A333736R143J60174j1325k50639Q904J38046k28938j31775Q2196k24259
$$ 1333736 1342879 1503053 1491728 1241089 1249993 1388039 1159101 1027326 1109522 885263
19125H85263K81413o4985Q6811r8018K7462P2201o1358k27992o5979M55441j38326
$$ 885263 1166676 1101691 1188502 1090484 1117946 1190147 1128789 900797 834818 1290259 1151933
19114A151933j35663K22746m8952j86038P9716K0368L6997O664K35768l14078
$$ 1151933 1016270 1239016 1190064 1004026 1083742 1104110 1141107 1147771 1383539 1069461
19104A069461J50336q6039J42159J56873j55351r0023j6404J71437j30484M4646
$$ 1069461 1219797 1133758 1275917 1432790 1277439 1187416 1171012 1342449 1211965 1256611
19094A256611R2503K99300j94916J76595m0101J60346K70984K66635K99538L41634
$$ 1256611 1349114 1648414 1453498 1630093 1589992 1750338 2021322 2287957 2587495 2929129
19084B929129J92693N35611Q18607J17690N26886J56255l7904K28248L738k4135
$$ 2929129 3121822 3657433 4476040 4593730 5120616 5276871 5238967 5467215 5470953 5446818
19074E446818m99240o28944l58467q11724k45312l25691l55784O3694o7666l16623
$$ 5446818 4947578 4318634 3960167 3148443 2903131 2577440 2221656 2285350 2217684 1901061
19064A901061L29210o5273K24865L25693M87773M88320L07885K32938K06854K48596
$$ 1901061 2230271 2164998 2389863 2715556 3203329 3691649 3999534 4232472 4439326 4687922
19054D687922J48297P9191l32590k12287n61144l76766o52872k34275M7835o6814
$$ 4687922 4836219 4915410 4582820 4370533 3809389 3432623 2779751 2545476 2593311 2526497
19044B526497J10413K50405N82818L29949L56579Q21303L88752r5890N43855L4453
$$ 2526497 2636910 2887315 3470133 3800082 4156661 4977964 5366716 5270826 5814681 5849134
19034E849134j60330j4237m94288n15366o12859l77497m77926m63767p0139m42582
$$ 5849134 5688804 5674567 5180279 4664913 4052054 3674557 3196631 2732864 2662725 2220143
19024B220143K27520j48292L04340K81210M40956M97825N06405L23440L47071
$$ 2220143 2447663 2299371 2603711 2884921 3325877 3823702 4330107 4653547 5000618
19015E000618J76263L3427K62058k80068k74000l49477q30269o60414k25921k54643
$$ 5000618 5176881 5210308 5472366 5192298 4918298 4568821 3738552 3078138 2852217 2597574
19005B597574l10801n6287l41525L61423j76332J2439L92250J05443O04633M03394
$$ 2597574 2286773 2230486 1888961 2250384 2074052 2086491 2478741 2584184 3188817 3592211
18995C592211L68535O02841J63718M85038Q6486N6134M7216k25001l17733n47699
$$ 3592211 3960746 4563587 4727305 5212343 5298829 5354963 5402179 5177178 4859445 4311746
18985D311746j08262m75796j81055K00120M79124N6535M98436P87998P52414R71138
$$ 4311746 4203484 3727688 3546633 3746753 4225877 4282412 4780848 5568846 6321260 7292398
18975G292398J063857Q82730J455106J482786J562138J850804J752441J881198
$$ 7292398 8356255 9238985 10694091 12176877 13739015 15589819 17342260 19223458
18967A9223458J413170J170660N41453O10928r411n23472r61938j461001k222211
$$ 19223458 20636628 21807288 22348741 22959669 22950258 22426786 21464848 20003847 17781636
18958A7781636k636194k423244k051195j800086j677832p86173j125377n45850
$$ 17781636 15145442 12722198 10671003 8870917 7193085 6406912 5281535 4735685
18950D735685o02088l91933l81699l35373q2740l67761j97118o1987m6896j94203
$$ 4735685 4133597 3741664 3359965 3024592 2941852 2574091 2376973 2314986 2268090 2073887
18940B073887M5924j9002k13804N3672p961j34841k5157J95865o5103l8151J49646
$$ 2073887 2119811 2100809 1887005 1940677 1932716 1797875 1772718 1968583 1903480 1865329 2014975
18929B014975M3830k75747K74387M2089Q6290o2413j43191J42281N521K39619
$$ 2014975 2058805 1783058 2057445 2099534 2185824 2123411 1980220 2122501 2128022 2367641
18919B367641J47826j95688M38001L00194K16683J64009O46528N47090M12913
$$ 2367641 2515467 2319779 2757780 3057974 3274657 3438666 4085194 4632284 5045197
18910E045197O90484J077764J309754J793990J729832J995791J961603J883187
$$ 5045197 5735681 6813445 8123199 9917189 11647021 13642812 15604415 17487602
18902A7487602J174537J066337P67521K7999m79284j048166j990774j907447k414113
$$ 17487602 18662139 19728476 20495997 20523996 20044712 18996546 17005772 15098325 12684212
18893A2684212k346732j840979j445490j340426o19396r00540m15154o46164l26719
$$ 12684212 10337480 8496501 7051011 5710585 5091189 4190649 3775495 3129331 2802612
18884B802612j48339j94616k72818j17492k54502j98420L2297j88507j27020J21070
$$ 2802612 2654273 2459657 2186839 2069347 1814845 1616425 1648722 1460215 1333195 1454265
18874A454265k4116j86928N6991l95k36318L4327J80289j08258k10125J77733
$$ 1454265 1430149 1243221 1300212 1299817 1063499 1097826 1278115 1169857 959732 1137465
18864A137465j51579l87089K58411J49382j92772N4569k1107J49384q2001k7484
$$ 1137465 985886 598797 857208 1006590 813818 868387 847280 996664 914663 887179
18854H87179O6463j08848J74730k90608J98805J24038k03595M525P9507K08792
$$ 887179 953642 844794 1019524 728916 927721 1051759 848164 852689 932196 1140988
18844A140988l59937j35457J75512l00038J77317K02151q6889J4005N6957j54270
$$ 1140988 781051 645594 821106 521068 698385 900536 813647 827652 884609 730339
18834G30339M2247k27878L01968j11407j28521l989K04839L9273j93383J42957
$$ 730339 772586 544708 846676 735269 606748 602759 807598 846871 653488 796445
18824G96445o9072J30132k25926P4763J04374m0969k56421J84441J13997k83307
$$ 796445 727373 857505 631579 706342 810716 769747 513326 697767 811764 528457
18814E28457J42744J92899O0973j94122K1078r46n9051M7193m1991J02752K3161
$$ 528457 671201 864100 925073 730951 752029 751083 692032 739225 697234 799986 823147
18803H23147o26J3109J5651p8474j33628L99852k50007J15405N4776p6453K9956
$$ 823147 822521 835630 851281 772807 639179 1039031 789024 904429 959205 882752 912708
18792I12708j71387J23638J646N0038k05605K83939K12568m51770L63258k12488
$$ 912708 741321 864959 866605 916643 711038 994977 1207545 755775 1119033 906545
18782I06545J71044E24831M30751l11212L75345j21292k33346J36247j79149J87875
$$ 906545 1077589 524831 955582 644370 1019715 898423 665077 801324 622175 810050
18772H10050m8571K47511k30300K9797K7843Q023j23739P7827J15846k41296K50509
$$ 810050 761479 1008990 778690 808487 836330 844353 720614 798441 914287 672991 923500
18761I23500q8896O5903C90658J65426P6560J08201r604J50242l8749k91001R3036
$$ 923500 834604 900507 390658 556084 632644 740845 731241 881483 842734 551733 644769
18750F44769Q6313j23831J38779K6789k58144K69859j98704j20491M78660l17900
$$ 644769 731082 607251 746030 772819 514675 784534 585830 465339 943999 626099
18740F26099O0335k0558q6867J73376j13115o4480J49370m4868j6294l4563J17361
$$ 626099 686434 665876 579009 752385 639270 574790 724160 679292 662998 628435 745796
18729G45796j42066K87968l5317p2105R1244k04789J51097j98138R6326N3285
$$ 745796 603730 891698 856381 784276 875520 670731 821828 623690 720016 773301
18719G73301l7225r0141j18O7105J44398k0405p5220J04019J03479l23101L30646
$$ 773301 736076 645935 645817 712922 857320 836915 761695 865714 969193 646092 976738
18708I76738j93300n2892J46223j68546J35555m6116n0966R4349M0263l55095
$$ 976738 783438 730546 876769 708223 843778 797662 746696 841045 881308 526213
18698E26213L2815J97650J7831j30153K25085D21237K95211R5054k24304J02859
$$ 526213 559028 756678 774509 644356 869441 421237 716448 811502 587198 690057
18688F90057k31064J80840O7760J60968k28598O8077O7123j93121K15404R067
$$ 690057 458993 639833 707593 868561 639963 708040 775163 582042 797446 806513
18678H06513j55522Q1968l36414L48040k38019P7466r902M6029J83453l19836
$$ 806513 650991 732959 396545 744585 506566 584032 574130 620159 803612 483776
18668D83776K44594j73269K4259J0339j53912L46832r1871R1722k33863K11214
$$ 483776 728370 555101 579360 589699 435787 782619 690748 782470 548607 759821
18658G59821j72663n7372K4511N8107Q5548o7633R2469j00172J28408n9363J07944
$$ 759821 587158 529786 554297 612404 697952 630319 722788 622616 751024 691661 799605
18647G99605l43528J19382J20984k21640J78315j50528J69006K48207k96044J07620
$$ 799605 456077 575459 696443 474803 653118 502590 671596 919803 623759 731379
18637G31379j32735K00356n11k00794k201j30748K00482n8348M0903k50885L5543
$$ 731379 598644 799000 798489 597695 595494 464746 665228 606880 647783 396898 432441
18626D32441J95306l2828J15511j53229N094K0967q1242J26726k0893k3305L9588
$$ 432441 627747 594919 710430 557201 562295 583262 502020 628746 607853 584548 624136
18615F24136N3005k7278j30586K7674q6105J42442J04513j46955j11176J71914
$$ 624136 677141 649863 519277 546951 460846 603288 707801 560846 449670 621584
18605F21584j60115J15592L4810J32013k47600Q5084P8597O7186K1497j76056
$$ 621584 461469 577061 611871 743884 496284 581368 659965 727151 748648 572592
18595E72592R7347P6754P6968p8410j27548J07881P6810j55642L5303j71001J58456
$$ 572592 669939 746693 823661 745251 617703 725584 802394 646752 682055 511054 669510
18584F69510K1007q3939J03522j9155O0064J15702j06869j01927N3488J4901m2056
$$ 669510 690517 606578 710100 690945 751009 866711 759842 657915 711403 726304 684248
18573F84248n280J62501j20672k03790J35181N7474P037j32602J47027k22884
$$ 684248 678968 841469 720797 517007 652188 709662 716699 584097 731124 508240
18563E08240J37833J16408o3588j61363P5326J40247j29388j76484L51952k14478
$$ 508240 646073 762481 698893 537530 612856 753103 623715 447231 799183 584705
18553E84705N8172Q712O4707r3932o2991j43034P0469k2917L20599k63134j59662
$$ 584705 642877 651589 716296 622364 559373 416339 486808 463891 784490 521356 361694
18542C61694J08428r2410Q9403o6248J46300l2311K18115K1165l56376J52947
$$ 361694 470122 377712 467115 400867 547167 514856 732971 754136 397760 550707
18532E50707L37562l78489o5408m4770M4154M9378l4710M9324L4370K02124J31806
$$ 550707 888269 509780 444372 399602 443756 493134 458424 507748 542118 744242 876048
18521H76048l9309l29633M8084j59827M36972l45977K61287k10760r0233R7627
$$ 876048 836739 507106 555190 395363 832335 486358 747645 536885 446652 544279
18511E44279J54322l26357L66780r642k43228Q0703J02731J12952k85313M3455
$$ 544279 698601 372244 739024 729382 486154 566857 669588 782540 497227 540682
18501E40682O5140p3828r8689J51368n5328R9472n2531M3370n4844n6782j13559
$$ 540682 605822 531994 433305 584673 529345 628817 576286 619656 564812 508030 394471
18490C94471n4396m4234K07923J55424j59900J99312j76088M5432o2187J15926
$$ 394471 340075 295841 503764 659188 499288 698600 522512 567944 505757 621683
18480F21683m3804o1959J62368p4771o2011J78579j38581O425j15470P5618B70679
$$ 621683 577879 515920 678288 603517 541506 720085 581504 587929 472459 548077 270679
18468D05354j79211N29708k82482M6702K23734k05265M7933N4604r5492K07042
$$ 405354 226143 755851 473369 520071 743805 538540 586473 641077 545585 752627
18458G52627J5806j35963Q0710P4498j99633j88917J73555n1856N8215J75234
$$ 752627 768433 632470 713180 787678 588045 399128 572683 520827 579042 754276
18448G54276j13716J22270j54862J65779j45231K23142J67596m37454K69119k28829
$$ 754276 640560 762830 607968 773747 628516 851658 1019254 581800 850919 622090
18438F22090O315k38587N52818j86358k08679L44024j95299j32326K03446j85042
$$ 622090 628405 389818 942636 756278 547599 891623 696324 563998 767444 582402
18428E82402K2778Q9141o505j12939n0712J91693K5609J83815l95162J50729J32816
$$ 582402 605180 694321 687816 574877 524165 715858 741467 925282 530120 680849 813665
18417H13665j20219Q192j42599j54353K16082j81851L22543j2756m5583j24178
$$ 813665 693446 701638 559039 404686 620768 438917 761460 748704 703121 578943
18407E78943o3797J55300m7896R401j66022J52607j21396J57115N6931L133j59050
$$ 578943 515146 670446 622550 631951 465929 618536 497140 654255 711186 714319 555269
18396E55269P2946k48404J47684J96966L6579j34054m348j03604l488O3058q2069
$$ 555269 628215 379811 527495 724461 761040 626986 622638 519034 515546 578604 496535
18385D96535R0995B60643N18221j62483J13330l06095K37934j42411m4090J65181
$$ 496535 587530 260643 778864 616381 729711 423616 661550 519139 475049 640230
18375F40230k41461j22302N4590M7797A56673K52215K2821K09845j43385j7407
$$ 640230 398769 276467 331057 378854 156673 408888 431709 641554 498169 480762
18365D80762R8219k40253K73030K8484j44206J61431j59941j4648j53194K71147
$$ 480762 578981 338728 611758 640242 496036 657467 497526 482878 329684 600831
18355F00831K44256k93806j61314J26359j9394n7306L2811K0121j49188J55066
$$ 600831 845087 551281 389967 516326 496932 439626 472437 492558 343370 498436
18345D98436j0473J27600p80r5790Q5445j01057P420J93160m5768j61201K9546
$$ 498436 487963 615563 614783 518993 604438 503381 510801 703961 658193 496992 526538
18334E26538J94029J04281j13972r2779o6665J42330p3572N8719Q463j22299J6708
$$ 526538 720567 824848 710876 618097 551432 693762 620190 678909 687372 565073 581781
18323E81781Q3878j76044j9623J38380l617j61315K02384k57621K22158k58j38310
$$ 581781 665659 489615 469992 608372 604755 443440 645824 388203 610361 610103 471793
18312D71793P9657K01060j49418l0644j12958J81605r305J44367j09361p3222
$$ 471793 551450 752510 603092 572448 459490 641095 631790 776157 666796 593574
18302E93574J2540J23513l25763K52190k3263k110O72j2856R2434j26177q4209
$$ 593574 606114 729627 403864 656054 632791 630681 631353 618497 710931 584754 500545
18291E00545j16561Q3753L0262K4022J4531j40471l6852N2125J92826k07221q6228
$$ 500545 383984 467737 497999 522021 536552 396081 359229 411354 604180 396959 310731
18280C10731j9033n58J04117K78948j38515J09781K1687q9619r5229Q978Q9576
$$ 310731 291698 291140 395257 674205 535690 645471 667158 577539 482310 491288 580864
18269E80864p484m1803J95737l40374J96568J36548j64025L1429k57226M8187
$$ 580864 573380 531577 727314 386940 583508 720056 556031 587460 330234 378421
18259C78421J93613j2014O3977j19111L9186J52101m7556j01154J36443j70807
$$ 378421 572034 560020 623997 504886 544072 696173 648617 547463 683906 513099
18249E13099R2833K1626O0870O892k54109J02901j28348n7062J91842J65464n8302
$$ 513099 605932 627558 688428 695320 441211 544112 415764 358702 550544 716008 657706
18238F57706k09072M8142L3180k6881M4863J93235l21125R6197j6350q1897K61248
$$ 657706 448634 496776 529956 503075 547938 741173 420048 516245 499895 417998 679246
18227F79246q6315j37073K3161N5167B02239K67887q4262k377K02827k61429K31543
$$ 679246 592931 455858 479019 534186 202239 470126 385864 383487 586314 324885 556428
18216E56428m8649m5142K40945k34347K36719q452j91123K41108l15245K21547
$$ 556428 507779 462637 703582 469235 705954 697502 506379 747487 432242 653789
18206F53789j30615J10870Q0325j83241R0670J12571J5949o4987o1365P809Q1377
$$ 653789 523174 634044 714369 531128 621798 734369 750318 685331 623966 631775 713152
18195G13152j08321j7324J6984R9853j81119q2757J89943J05259l20639J81325
$$ 713152 604831 587507 604491 704344 523225 440468 630411 735670 415031 596356
18185E96356Q4073P819j84863l2973J47246l9182O7412q4414j64179K13424o1330
$$ 596356 680429 688248 503385 470412 617658 578476 645888 561474 397295 610719 549389
18174E49389M8473p3435k54464O57418D54701K80714l58055J63883j01415M4530
$$ 549389 597862 524427 269963 927381 454701 735415 377360 541243 439828 484358
18164D84358Q0492J3555K9822l9553j16505M06662l57073J48247o1418p0939j27283
$$ 484358 564850 578405 608227 568674 452169 858831 501758 650005 588587 517648 390365
18153C90365J68731K2928j365N3603k11705L6002l8125K78325j56734j41827J88925
$$ 390365 559096 582024 580659 634262 422557 458559 420434 698759 542025 400198 589123
18142E89123J68944j60956j31426q5444J13003o2967M2978B27452L19259n3138
$$ 589123 758067 597111 465685 380241 493244 430277 473255 227452 546711 493573
18132D93573J54245j38979K27560j47862l6751j8808O7786o9859m1447m9339J15717
$$ 493573 647818 508839 736399 588537 551786 532978 600764 530905 489458 440119 555836
18121E55836r533J66340k29922n4374O1786K48813j69523P9665j68960l6704L29458
$$ 555836 546303 712643 482721 428347 490133 738946 569423 649088 480128 443424 772882
18110G72882l02777K80038k19122L0159j22244L29153j63332j2680q7282J37794
$$ 772882 470105 750143 531021 561180 438936 768089 604757 592077 504795 642589
18100F42589l5033j26630J58277m0614r4002K8062J81410k32932J62920k09737
$$ 642589 607556 480926 639203 598589 504587 532649 714059 481127 644047 434310
18090D34310N5814k7262N7169J07787k9493l3992n5525q5214J63061k49428J25225
$$ 434310 490124 462862 520031 627818 598325 564333 508808 423594 586655 337227 462452
18079D62452M6013R0975l0565j37689l432K44379j72863k15683J97590J03753
$$ 462452 508465 599440 568875 431186 427754 672133 499270 283587 481177 584930
18069E84930J04167j35483K7853n4776M5093j11081N7178R1615k63764K20419
$$ 584930 689097 553614 581467 526691 571784 460703 517881 609496 345732 566151
18059E66151l8539N6949k54675J48195L42297l39258r6035K29120j97592L04295
$$ 566151 527612 584561 329886 478081 820378 481120 385085 614205 416613 720908
18049G20908k44780J762J28764p1435j8906k05792K55167B54040K60502Q293R7584
$$ 720908 476128 477890 606654 535219 516313 310521 565688 254040 514542 522835 620419
18038F20419k22092l3572K37795k74551K48074k1149R8619B93279J06491J47520
$$ 620419 398327 364755 602550 327999 576073 554924 653543 293279 399770 547290
18028E47290k5926l267m6084n7087Q977m3797K86365j05549j7520p0684m9007
$$ 547290 521364 518097 472013 414926 423903 380106 666471 560922 543402 472718 423711
18017D23711j7916j77125K96233j02357K26909j47712K8024l9387J39904j42903
$$ 423711 405795 228670 524903 422546 649455 501743 529767 490380 630284 487381
18007D87381k00211K28065N0650J36328k87412J16880J24059j41711J5202J5210
$$ 487381 287170 515235 565885 702213 414801 531681 655740 514029 529231 544441
17997E44441j71625J84552j39295m1906J53289M7703Q734n8882J27444r2863l4487
$$ 544441 372816 557368 418073 376167 529456 577159 585893 527011 654455 561592 527105
17986E27105o6185J84290k09286J4653O7945J84151k20067j01033K83457L552
$$ 527105 460920 645210 435924 450577 518522 702673 482606 381573 665030 668582
17976F68582k0949j18372K69783j85394k44521J84636j58958K29588B99045K25279
$$ 668582 647633 529261 799044 613650 369129 553765 394807 624395 299045 524324
17966E24324m5139K31233k97565J73648j20519k27269J86191j71979J57025J35452
$$ 524324 479185 710418 412853 586501 465982 238713 424904 252925 409950 545402
17956E45402j61418K49286k46946L2707Q6366L675m5879K91357k12243L2782K18175
$$ 545402 383984 633270 386324 419031 505397 509072 463193 754550 542307 575089 793264
17945G93264j73633n8060j02581l6804J71494Q3235q7727j11711J22550k68329
$$ 793264 619631 561571 458990 422186 593680 676915 589188 477477 600027 331698
17935C31698L89846j26357J93526j47081J3701j72980J05623R5689J73982k65679
$$ 331698 721544 595187 788713 641632 655333 482353 587976 683665 857647 591968
17925E91968j9890J4637r0967Q6789L28247j5301m23205q4584L13367k50890J97616
$$ 591968 572078 586715 495748 582537 910784 895483 472278 387694 701061 450171 647787
17914F47787J72695L8822k00560N8639M8250J36396j2380N2929j90616k6616p3889
$$ 647787 820482 859304 658744 717383 765633 902029 889649 942578 751962 725346 651457
17903F51457K24938j18620N9705j92872O2469K25643k03091l4701m9451J58832
$$ 651457 876395 757775 817480 624608 687077 912720 709629 674928 625477 784309
17893G84309J4179k24127K25930J04933k22019K0858K65214q8812O8828j93728
$$ 784309 798488 574361 800291 905224 683205 704063 969277 880465 949293 755565
17883G55565N2237J16692J04189k46597K69675p756j35536j97291K13995J77972
$$ 755565 807802 924494 1028683 782086 1051761 1044005 908469 711178 925173 1103145
17873A103145k72502R9560j54714K4479j41214J93948j26521J26442K22167j86973
$$ 1103145 830643 930203 775489 799968 658754 852702 726181 852623 1074790 887817
17863H87817l01234J69790o1981L05797l51975K35291k84258k7751K59380j60765
$$ 887817 586583 756373 694392 1000189 648214 883505 599247 571496 830876 670111
17853F70111P3155K45890l40090J49232j14123j20684K58629o6631p1020l5618
$$ 670111 743266 989156 649066 798298 684175 563491 822120 755489 684469 648851
17843F48851J43370j92467K15483j92845J93675o6421m7736Q261J9314J07412
$$ 648851 792221 599754 815237 622392 816067 749646 701910 710171 729485 836897
17833H36897k58612N8785L8493j75267K45613m2069J34845p7344k53787M62341
$$ 836897 578285 637070 675563 500296 745909 703840 838685 761341 507554 969895
17823I69895j20492r1334R1967j37147J74524J17363k73236K35693l3676q5128
$$ 969895 849403 758069 850036 712889 887413 1004776 731540 967233 933557 848429
17813H48429P7304k34077N77578k64845K6823k1797j45702K0406j68941J27661
$$ 848429 925733 691656 1269234 1004389 1031212 1009415 863713 884119 715178 842839
17803H42839J9912J01941P6197O0666k22963J44574j56900J86904m4660j8755
$$ 842839 862751 964692 1040889 1101555 878592 1023166 866266 1053170 1008510 989755
17793I89755j76846j83820L30744N7563D74325J65281J04416C45558K74002P1453
$$ 989755 812909 629089 959833 1017396 474325 639606 744022 345558 619560 691013
17783F91013L8195j20425N06617k69692j92253j23046J79189j20399J84988j51867
$$ 691013 729208 608783 1115400 845708 653455 530409 709598 589199 774187 622320
17773F22320K249j56616K62094Q328L4321P4794L9802k66902j46897L54357J07901
$$ 622320 624569 467953 730047 738375 772696 847490 887292 620390 473493 827850 935751
17762I35751l19279J6217L7568L4055j69052K84281k09389M7743p9364P7388J74136
$$ 935751 616472 632689 670257 704312 535260 819541 610152 657895 578531 655919 830055
17751H30055j27327J32318j26990k6408n4741N5341Q036p678Q5440k18745J32372
$$ 830055 702728 835046 708056 681648 626907 682248 690284 682606 768046 549301 681673
17740F81673J65034j19279j07105J35743K18478k97405J65338k79743l8781J83893
$$ 681673 846707 727428 620323 756066 974544 677139 842477 562734 523953 707846
17730G07846j5481K8431r9462m6341Q8737p7345M5213K57887k59364N5414p8355
$$ 707846 692365 720796 621334 574993 663730 586385 631598 889485 630121 685535 607180
17719F07180N0034m2045N9604n4938o5042J30953k53763L03216L2811J11769k54416
$$ 607180 657214 615169 674773 619835 554793 685746 431983 735199 768010 879779 625363
17708F25363J52394l20049m4615K48092N1027m0824j71665J38491J32851q5719
$$ 625363 777757 457708 413093 661185 712212 671388 499723 638214 771065 685346
17698F85346q1878O4117j74055K72964o4739J67134L689k29556k0935J2080j09592
$$ 685346 603468 667585 493530 766494 701755 868889 872578 643022 622087 634167 524575
17687E24575J32803r7878L05219O7210j72771j88826K73426P8621j60129L3688
$$ 524575 657378 559500 864719 931929 759158 570332 843758 922379 762250 795938
17677G95938C40002L39735k7629o866k41376J57068M7242L14235m00287J97528
$$ 795938 340002 679737 652108 645242 403866 560934 608176 922411 522124 719652
17667G19652K15026l28946K7778N732J26833J59609j20415j3049j48644J16319
$$ 719652 934678 605732 633510 639242 766075 925684 805269 792220 643576 759895
17657G59895j70055J44157n0302o2659O6715K0150J7940R6973m2081K780r8862
$$ 759895 589840 733997 683695 621036 687751 707901 725841 822814 780733 783513 684651
17646F84651K6048Q9984K51348j43016o7518p8097J43335j84524K9752J1418L75475
$$ 684651 710699 800683 1052031 909015 841497 763400 906735 722211 751963 763381 1138856
17635A138856j44486j24373O8945O9272J13212j25107j26059K05004m2491j12736
$$ 1138856 994370 869997 938942 1008214 1121426 996319 870260 1075264 1032773 920037
17625I20037M2933R8512j07146o7380J91634k3181j1594J8758J73274j41285M2752
$$ 920037 962970 1061482 954336 886956 1078590 1055409 1043815 1062573 1235847 1094562 1137314
17614A137314J38422j63780J69626l29331L56411l23511K97466l03780L31393
$$ 1137314 1275736 1111956 1281582 952251 1308662 985151 1282617 978837 1310230
17605A310230m8419J17974k15513K08196n0893r6771K57113p9763q3572j73923
$$ 1310230 1261811 1379785 1164272 1372468 1321575 1224804 1481917 1402154 1318582 1144659
17595A144659K18731j96813m267L20179l67023K17529k8652q4167J31828O161
$$ 1144659 1363390 1166577 1162310 1482489 1115466 1332995 1304343 1220176 1352004 1358165
17585A358165j04497r0661P1775K5494R115j08770K85670k05751K49486j98295
$$ 1358165 1253668 1163007 1234782 1260276 1269391 1160621 1446291 1240540 1490026 1291731
17575A291731M4614j21207j10037M8875L50003l45114N7163k70345L75150l27425
$$ 1291731 1336345 1215138 1105101 1153976 1503979 1158865 1216028 945683 1320833 993408
17565I93408M16242m241j04095J36647k0928k15184M7530l65403O8944J41479
$$ 993408 1409650 1405409 1301314 1437961 1417033 1201849 1249379 883976 952920 1094399
17555A094399M231O4530k9129M342m8407Q6114k10925L64001j04291L6235j7169
$$ 1094399 1098630 1163160 1134031 1138373 1089966 1176080 965155 1329156 1224865 1261100 1243931
17544A243931R4234k04937J07505J97018l30321J41772M3433m3236l6188O5182
$$ 1243931 1338165 1133228 1240733 1437751 1107430 1249202 1292635 1249399 1213211 1278393
17534A278393J88304j98445K89984l89205J53588l1911K10225Q2318k67890j20961
$$ 1278393 1466697 1268252 1558236 1169031 1322619 1290708 1500933 1583251 1315361 1194400
17524A194400n8053J17976P2899k69312J07780J96636p9770J38848J49750N9071
$$ 1194400 1136347 1254323 1327222 1057910 1165690 1362326 1282556 1421404 1571154 1630225
17514A630225j9530J23911J36016J10457m9491K16205k30938N3806L02154r3533
$$ 1630225 1610695 1734606 1870622 1981079 1931588 2147793 1916855 1970661 2272815 2179282
17504B179282J21901J99756k09127l6064j11778L34553j6040J87483J67684J14818
$$ 2179282 2301183 2500939 2291812 2255748 2143970 2478523 2462483 2649966 2817650 2932468
17494B932468M01332J31375L74531O83600M42569Q68760J348993K307649L910353
$$ 2932468 3333800 3465175 3839706 4523306 4965875 5834635 7183628 9491277 13401630
17485A3401630O887760R136314R740248Q787831P136897N072887M142860K807642
$$ 13401630 20289390 29425704 39165952 47953783 55090680 60163567 64306427 67114069
17477F7114069J083681p79201l967875p608291j0306427r642861o119433k16310
$$ 67114069 68197750 67418549 63450674 55842383 45535956 35893095 29773662 29557352
17469B9557352M529868P694869P905805O567869N346241L800018K461392P35284
$$ 29557352 34087220 41782089 49687894 56255763 61602004 65402022 67863414 68598698
17461F8598698p60962l513073p296999j0941029j2211366j0973120p611155m806618
$$ 68598698 67837736 64324663 57027664 46086635 33875269 22902149 15290994 10484376
17453A0484376k754782j382562j108970n33054n08620j11027k20740L31908n61687
$$ 10484376 7729594 6347032 5238062 4705008 4196388 4085361 3864621 4196529 3634842
17444C634842K37082p9839K92965J06241k02023j29511j11311J8006l16697o6710
$$ 3634842 3871924 3792085 4085050 4191291 3989268 3859757 3748446 3766452 3449755 3383045
17434C383045j13569N3559k22379J18344K35458J7858n7882L74564k05097j5115
$$ 3383045 3269476 3323035 3100656 3219000 3454458 3472316 3414434 3788998 3583901 3568786
17424C568786k63650K36287l38592l26733r2347m40847J02593j5690k47556M35595
$$ 3568786 3305136 3541423 3202831 2876098 2783751 2342904 2445497 2429807 2182251 2617846
17414B617846k46105N4437J28175j4980j53106J89710k9968k54137j38545L47503
$$ 2617846 2371741 2426178 2554353 2539373 2386267 2575977 2546009 2291872 2153327 2500830
17404B500830L45249k24506L10926p6349L46853n4408J20483K54525j9395N33263
$$ 2500830 2846079 2621573 2932499 2856150 3203003 3148595 3269078 3523603 3504208 4037471
17394D037471q2392K33387K58767J48498R01630O2372M25523K89452M79462P3256
$$ 4037471 3955079 4188466 4447233 4595731 5497361 5559733 5985256 6274708 6754170 6827426
17384F827426O37981k97906L07656l04061m3396j72042n92936m8107l29034L9535
$$ 6827426 7465407 7167501 7475157 7171096 7127700 6955658 6362722 6314615 5985581 6025116
17374F025116l0042J16823L97908J24822L35900N43937K14082L89513K81359K26060
$$ 6025116 5995074 6111897 6509805 6634627 6970527 7514464 7728546 8118059 8399418 8625478
17364H625478J11685J22837j35553k44184o2589l37563J87463n1965k79041L7072
$$ 8625478 8737163 8860000 8724447 8480263 8417674 8080111 8267574 8215609 7936568 7973640
17354G973640J59574M04219L18349L29795M23355P01046O10379P55351L99631
$$ 7973640 8133214 8537433 8855782 9185577 9608932 10309978 10920357 11675708 12075339
17345A2075339R58585K41370M66164J8131K76870p9695l73635j61788k67862k13617
$$ 12075339 13033924 13275294 13741458 13759589 14036459 13956764 13583129 13421341 13153479 12939862
17335A2939862o11462n7848l73869M4000Q459K61089J25220O89515M65309M64362
$$ 12939862 12328400 12270552 11896683 11940683 11949142 12210231 12335451 13024966 13490275 13954637
17325A3954637M60472L17112J01265J77125j93555J1214N9653o88953j88160n68070
$$ 13954637 14415109 14732221 14833486 15010611 14817056 14828270 14887923 14198970 14010810 13442740
17315A3442740k32405p53425m30744k30479l10199j50989l70713L05436o9444
$$ 13442740 13210335 12456910 12026166 11795687 11485488 11334499 10963786 11269222 11199778
17306A1199778L34295L18665N66648J49929j31093O22443K20106j57574J46928
$$ 11199778 11534073 11852738 12419386 12569315 12438222 13060665 13280771 13123197 13270125
17297A3270125l3419m11576j66153n77673j61654l38665m94234K8114k03308P7265
$$ 13270125 13236706 12825130 12658977 12081304 11919650 11580985 11086751 11114865 10911557 10988822
17287A0988822k39903k4354k11917j22987J35663l78340l04026l43316n35920
$$ 10988822 10748919 10724565 10512648 10389661 10525324 10146984 9842958 9499642 8963722
17278H963722m08802m30867q66851k79348l88029r72627j94677l63223j76381
$$ 8963722 8554920 8124053 7257202 6977854 6589825 5617198 5422521 5059298 4882917
17269D882917j01455k81154K06223l03807p8238k29822o5715j6038j43822j75245
$$ 4882917 4781462 4500308 4706531 4402724 4324486 4094664 4028949 4012911 3869089 3693844
17259C693844q2306j1438n8079m8491o8078p3866j25002j06039P3682l46Q7990
$$ 3693844 3611538 3600100 3542021 3493530 3425452 3351586 3226584 3120545 3194227 3193881 3281871
17248C281871j03466j37720m4655j32206J84583r6690j85635J88074J07189l59340
$$ 3281871 3178405 3040685 2996030 2863824 3048407 2951717 2766082 2954156 3061345 2702005
17238B702005J77324k69014L5636K44593k62574p0901K66455k35331j4816o3605
$$ 2702005 2879329 2610315 2645951 2890544 2627970 2557069 2823524 2588193 2573377 2509772
17228B509772p030R3714K7636N3801J03490J27193M3189r4058J90170j99787J25176
$$ 2509772 2502742 2596456 2624092 2677893 2781383 2908576 2951765 2857707 3047877 2848090 2973266
17217B973266K30648k49833q3190L72394n36322N06306k17119q9161M8945J03278
$$ 2973266 3203914 2954081 2870891 3243285 2706963 3213269 2996150 2906989 2955934 3059212
17207C059212J5518L32411j97574Q961O9637l7166q5121R088Q5468k93338J32646
$$ 3059212 3074730 3407141 3209567 3218528 3288165 3250999 3165878 3174966 3260434 2967096 3099742
17196C099742k87844k2429l57631p753l38215o90J38938j3114R8001m4055j90280
$$ 3099742 2811898 2789469 2431838 2424085 2085870 2085180 2224118 2211004 2309005 2264950 2074670
17185B074670j2253J63195r4846k14536L82081j00267k89494k38401K65486N2754
$$ 2074670 2062417 2225612 2130766 1916230 2298311 2198044 1908550 1670149 1935635 1988389
17175A988389k05931K11354p3300j6185K6344O2024J21344j83335m7566l3931
$$ 1988389 1782458 1993812 1920512 1904327 1930671 1992695 2114039 1930704 1883138 1849207
17165A849207K61891k74256L69695q3289r3679J43082r1768K58519K7512n1202
$$ 1849207 2111098 1836842 2206537 2123248 2029569 2172651 2080883 2339402 2366914 2315712
17155B315712j11876L24852k83570K23036k93020J76743p5831m8190j40494J26269
$$ 2315712 2203836 2528688 2245118 2468154 2175134 2351877 2276046 2227856 2087362 2213631
17145B213631j20178J20338n4565R620j2415K10482o7141j33859J31417K61275
$$ 2213631 2093453 2213791 2159226 2168846 2156431 2366913 2299772 2165913 2297330 2558605
17135B558605j18502l98828L08231j14410n5834k62936L49188k30982k148j6238
$$ 2558605 2440103 2041275 2349506 2235096 2179262 1916326 2265514 2034532 2032384 2016146
17125B016146J18437p8075L901Q1070K2264j18576J37880m6857R2157k21754l1137
$$ 2016146 2134583 2056508 2060409 2141479 2163743 2045167 2183047 2136190 2228347 2006593 1975456
17114A975456O7353j09746J24552j33479L3817K4407k83149r6142L28625j12976
$$ 1975456 2042809 1933063 2057615 1924136 1957953 1982360 1699211 1603069 1931694 1818718
17104A818718J09571j11547N6130J23625k06997k23614M03751m08102R3816j81931
$$ 1818718 1928289 1816742 1872872 1996497 1789500 1565886 1969637 1561535 1655351 1473420
17094A473420J5380K218l1125O5227j35222J40562n8889k52881M49293k59730
$$ 1473420 1488800 1491018 1459893 1525120 1389898 1530460 1471571 1218690 1667983 1408253
17084A408253k49923O3452j08493L82514l79248K21688K8098K70175k69362o24
$$ 1408253 1158330 1221782 1113289 1495803 1116555 1338243 1366341 1636516 1367154 1366530
17074A366530L4922j79762R3116P5978K9822j90522R5530j04865p4039J23530
$$ 1366530 1401452 1221690 1314806 1390784 1420606 1230084 1325614 1220749 1146710 1270240
17064A270240r4891J14503J85529m26650M4358J03477J06908N4238j29836o2348
$$ 1270240 1175349 1289852 1475381 1048731 1093089 1196566 1303474 1357712 1227876 1165528
17054A165528M32699q2094k7956K90389l68122J75550Q6494J00811k08048K1214
$$ 1165528 1598227 1516133 1488177 1778566 1410444 1585994 1672488 1773299 1565251 1586465
17044A586465J24575J4171Q674m431K70793P8959J71490k63876o4949l1696J45770
$$ 1586465 1711040 1725211 1733885 1729454 2000247 2079206 2250696 1986820 1921871 1890175 2035945
17033B035945k13453L52563l40151j32089J32466n2156j37578l17281J12854j26094
$$ 2035945 1822492 2175055 1834904 1702815 1835281 1783125 1645547 1328266 1441120 1315026
17023A315026P2422J17073j55525J1618L128n7047J04716j63849k01812K35692
$$ 1315026 1387448 1504521 1348996 1360614 1363742 1306695 1411411 1247562 1045750 1281442
17013A281442j31321M6132J40425L8779k31404j4090j52418M01744j72702k74902
$$ 1281442 1150121 1196253 1336678 1375457 1144053 1129963 977545 1379289 1206587 931685
17003I31685L58867j43084Q5772j1471k00452L28522k27222J76298M4342J4417
$$ 931685 1290552 1147468 1233240 1221769 1021317 1349839 1122617 1298915 1343257 1357674
16993A357674j33851Q5012K50621l84606K89099m39375L31756j16590j57304K74812
$$ 1357674 1223823 1308835 1559456 1174850 1463949 1024574 1356330 1239740 1082436 1357248
16983A357248q0310l4051O5464R4332J99393k17755J84755L8179o45868N62867
$$ 1357248 1276938 1242887 1308351 1402683 1602076 1384321 1569076 1607255 961387 1524254
16973A524254o9555L00497K0909j07264j31402K48970K07452J03293J13688M7925
$$ 1524254 1454699 1755196 1776105 1668841 1537439 1786409 1993861 2097154 2210842 2258767
16963B258767J27462J65125J54429j0809j45998J47442L6879J48584j33738K81342
$$ 2258767 2386229 2551354 2705783 2694974 2548976 2696418 2733297 2881881 2748143 3029485
16953C029485j47104L7849o9550k43257p2387o1111Q3420k20093r9859K4868j98448
$$ 3029485 2882381 2920230 2850680 2607423 2535036 2473925 2557345 2337252 2237393 2262261 2063813
16942B063813j73244j29141j97745L3799j24670j40970J55421k17089J77907N0840
$$ 2063813 1890569 1761428 1563683 1597482 1472812 1331842 1487263 1270174 1448081 1498921
16932A498921k61835N3366j86428K00108J0875L9187j97782J60064J19906m78179
$$ 1498921 1237086 1290452 1104024 1304132 1315007 1354194 1156412 1316476 1436382 958203
16922I58203L01582O6943k52011L1821K64681l14343N0961P9774j2172k33055
$$ 958203 1259785 1326728 1074717 1106538 1371219 1056876 1107837 1187611 1175439 942384
16912I42384J15804n4556J28945n007j22362k5667n4426Q5855j25350L4812K77412
$$ 942384 1058188 1003632 1132577 1127570 1005208 979541 925115 1010970 885620 920432 1197844
16901A197844m38805J18991J13104L5562J0352K5456l53369K95177j54845K11874
$$ 1197844 759039 878030 991134 1026696 1037048 1062504 709135 1004312 849467 1061341
16891A061341l04501J18176J40463m4568m7199J64788O5469j24362m1936l5269
$$ 1061341 756840 875016 1015479 970911 923712 1088500 1153969 1029607 987671 952402
16881I52402j35750K90624j96629Q1373k18691J65872K1777j10114J9658K62652
$$ 952402 816652 1107276 910647 992020 773329 939201 960978 850864 870522 1133174
16871A133174k50491K56826k24480J06337J42163q3451R0495j86620P8036k6122
$$ 1133174 882683 1139509 915029 1021366 1163529 1080078 1170573 983953 1061989 1035867
16861A035867J1714J0769J73928k5657k10913L20963l63975L0393J81766l1065
$$ 1035867 1047581 1058350 1232278 1206621 995708 1316671 952696 983089 1164855 1133790
16851A133790K5670j37887j52445J61339p5046J54197p3201j12380L191j96040
$$ 1133790 1159460 1021573 869128 1030467 955421 1109618 1036417 924037 927228 731188
16841G31188J86036J63736j62396k6166J23986Q6064K429j94123O6687n4046O9630
$$ 731188 917224 1080960 918564 892398 1016384 1102448 1104877 910754 977441 923395 993025
16830I93025J56274j97318Q8257l0388l6668J40591n7534J22712k46118M69534
$$ 993025 1149299 951981 1040238 1009850 973182 1113773 1056239 1178951 932833 1402367
16820A402367j32370p0027n130J54783K63428M6754r139k14226Q1216j7748J2416
$$ 1402367 1269997 1199970 1194840 1349623 1613051 1659805 1650666 1436440 1517656 1499908 1512324
16809A512324P2930j95052J17574R647j15709K16169l35996L59267k64207j33811
$$ 1512324 1585254 1390202 1507776 1517423 1401714 1617883 1281887 1641154 1376947 1243136
16799A243136L96481n54553L59772j62801J13864k40989J04617K767l55199J36771
$$ 1243136 1639617 1085064 1444836 1282035 1395899 1154910 1259527 1262294 907095 1043866
16789A043866q4443k89569J72347J78011k13143J95986m19905M34139j62767K24913
$$ 1043866 959423 669854 842201 1020212 807069 1003055 583150 1017289 854522 1079435
16779A079435k32744j43222K17302j32072R9016R5530l8342j1040P1571M1127
$$ 1079435 846691 703469 920771 788699 887715 983245 944903 933863 1005434 1046561
16769A046561R8415p8047q1251K8135j10393j33942J66383l4825O5029j34224
$$ 1046561 1144976 1066929 985678 1013813 903420 769478 935861 901036 966065 831841
16759H31841J11786j09372M00203k55871J12172m3462j56269K82733j61823j46360
$$ 831841 943627 834255 1234458 978587 1090759 1047297 891028 1173761 1011938 865578
16749H65578K39098k13528N3599K94450k32388J02499N2377j58358N7418j253
$$ 865578 1104676 891148 944747 1239197 1006809 1109308 1161685 1003327 1060745 1059492
16739A059492n0205K66168k84899J28813J98625m61302M33018k41429q2432Q732
$$ 1059492 1009287 1275455 990556 1119369 1317994 856692 1289710 1048281 965849 974581
16729I74581n3860M1657N249J38397j49239L25902j38358K29505k95122K69516
$$ 974581 920721 962378 967627 1106024 956785 1282687 1144329 1373834 1078712 1348228
16719A348228l27960K8643K17349k26619K75939r9510j64689J19752J29196M246
$$ 1348228 1020268 1048911 1266260 1039641 1315580 1216070 1051381 1171133 1300329 1304575
16709A304575j2321j67724K54800J14818M32732R8926p4897j02549J77170q0882
$$ 1304575 1292254 1124530 1379330 1494148 1926880 2025806 1950909 1848360 2025530 1944648
16699A944648K06833k49740J20563l21315J908J67148l6669k645J28820J62020
$$ 1944648 2151481 1901741 2022304 1700989 1702897 1870045 1833376 1830731 1959551 2121571
16689B121571m3231p632k11296K6145K09780j34539P3963k79733j43041j20329
$$ 2121571 2078340 2070708 1859412 1885557 2095337 1960798 2034761 1755028 1611987 1491658
16679A491658q5974j2166m5792J98335k35913p0005K01241L2621Q2633R4617K73064
$$ 1491658 1405684 1393518 1347726 1546061 1310148 1240143 1441384 1474005 1556638 1651255 1924319
16668A924319j15823J51799J84654P5220J2457j20381J75372k02397j4819j43763
$$ 1924319 1808496 1960295 2144949 2220169 2232626 2112245 2287617 2085220 2070401 1926638
16658A926638j5000J89202K7099O9717q9843m8639p2910p474J09077m0621k06799
$$ 1926638 1911638 2100840 2127939 2197656 2107813 2059174 1986264 1978790 2087867 2047246 1840447
16647A840447k98146Q0237j95869j42310j71648j3539K5294n7641j35476K7055
$$ 1840447 1542301 1622538 1426669 1284359 1112711 1099172 1124466 1066825 931349 958404
16637I58404n9406q3500P7212N1911j01027Q7538J33072j44986J23542p8110N4191
$$ 958404 898998 815498 892710 944621 843594 931132 1064204 919218 1042760 964650 1018841
16626A018841p7651m2555N8961k8290K24898J26240j39081K9197j39608J39931
$$ 1018841 941190 898635 957596 929306 1154204 1280444 1141363 1170560 1030952 1170883
16616A170883n294L13238l13319l21357J17372O1126l8407r6435K28450r5762
$$ 1170883 1165589 1478827 1165508 844151 961523 1022649 984242 887807 1116257 1020495
16606A020495r2388K56104j22031q385k04674K22566l25104M46309k5476j01965
$$ 1020495 928107 1184211 1062180 1053795 849121 1071687 746583 1192892 1167416 1065451
16596A065451o8858L50247n0750P80k25186L08036r4951j12415M4962o3240n0660
$$ 1065451 996593 1346840 1296090 1296870 1071684 1379720 1284769 1172354 1217316 1154076 1103416
16585A103416K62283j99833J19080r4306n4764Q3324j06564J2523l9007k61368
$$ 1103416 1365699 1165866 1284946 1190640 1135876 1219200 1112636 1125159 1086152 824784
16575H24784J28320n374K29376j62498n5832j19502j0439r9655K99572j9315j03690
$$ 824784 953104 947730 1177106 1014608 958776 839274 828835 729180 1028752 1009437 905747
16564I05747m7745N2653M7597N891k37673J84545l8752J87673p7762o0680K99449
$$ 905747 858002 910655 958252 964143 726470 911015 872263 1059936 982174 921494 1220943
16553A220943P1591k73102Q5010P2802J76800q5146j92372l3238J50459J82965
$$ 1220943 1292534 1019432 1104442 1177244 1354044 1268898 1076526 1043288 1193747 1376712
16543A376712j67801q2038J98739l93101N16291l02053Q9355p0543K6994o6494
$$ 1376712 1208911 1126873 1325612 932511 1448802 1146749 1236104 1165561 1192555 1126061
16533A126061j01700J11709j44502k16827L10939p8878j45407j62843K37153j7722
$$ 1126061 1024361 1136070 991568 774741 1085680 1006802 861395 698552 935705 917983
16523I17983L61175k324l24362N19478l1212Q5689j65496n6478J54117J67384
$$ 917983 1279158 1276834 952472 1471950 1440738 1526427 1360931 1304453 1458570 1625954
16513A625954j71783J44591j46497l5059K19818j49331K9035J38752o6653j44365
$$ 1625954 1454171 1598762 1452265 1417206 1637024 1487693 1516728 1655480 1588827 1444462
16503A444462J34141p6622M2755j34004P5437j22038L45993j16633P1211K69481
$$ 1444462 1578603 1501981 1544736 1410732 1486169 1364131 1710124 1593491 1664702 1934183
16493A934183m20249J38648j69570Q1287p722j31678J21758j68616j62767M20225
$$ 1934183 1513934 1652582 1483012 1564299 1556577 1424899 1546657 1378041 1215274 1635499
16483A635499m72892K91859J3180J45992l81243O2935L04235J87712j69593p7618
$$ 1635499 1162607 1454466 1467646 1613638 1232395 1295330 1599565 1787277 1617684 1540066
16473A540066R7618n4015L2455P3333o6192K29355J0252j49520O2078K65125j36285
$$ 1540066 1637684 1583669 1616124 1689457 1623265 1852620 1862872 1713352 1775430 2040555 1904270
16462A904270K32896M3307J26079j62076L0738M7857J62636k39887o4966L25421
$$ 1904270 2137166 2180473 2306552 2144476 2175214 2223071 2385707 2145820 2080854 2406275
16452B406275l642O7382J86021M3478J31411K42172J15781J65572L45620q6083
$$ 2406275 2402633 2470015 2656036 2699514 2830925 3073097 3188878 3354450 3700070 3613987
16442C613987L44699J91454m864j39362L54429R0716K27596K92953L13310O80513
$$ 3613987 3958686 4150140 4145276 4005914 4360343 4451059 4678655 4971608 5284918 5965431
16432E965431K81595M95122Q11569Q20872Q52054J033269J406458J372807J188798
$$ 5965431 6247026 6742148 7553717 8374589 9226643 10259912 11666370 13039177 14227975
16423A4227975J254864J409068J728341J737954J829081K134704K247400K531945
$$ 14227975 15482839 16891907 18620248 20358202 22187283 24321987 26569387 29101332
16415B9101332K627418L027550L159843L707023L913676M871652M491409L735183
$$ 29101332 31728750 34756300 37916143 41623166 45536842 50408494 54899903 58635086
16407E8635086K533807J954434J274012Q28509M54031L11919q3730j248296k253365
$$ 58635086 61168893 63123327 64397339 65225848 65679879 65991798 65908068 64659772 62406407
16398F2406407l215412l363871k721643j685192Q22409N900175J2145205J6097016
$$ 62406407 59190995 55827124 53105481 51420289 52242698 58142873 70288078 86385094
16390H6385094J3942807M178227m738724r356828j0388436j0520382r264083q720672
$$ 86385094 100327901 104506128 99767404 90410576 80022140 69501758 60237675 51517003
16382E1517003o584885n779327n353535o770324j1618310a937007j6259754o681305
$$ 51517003 44932118 39152791 33799256 27028932 15410622 -1937007 -18196761 -24878066
16374b4878066M071379R686387b303649C215354K417918L52468n33423j209398
$$ -24878066 -20806687 -11120300 -2303649 3215354 5633272 5985740 5452317 4242919
16366D242919q73605q83556r29996n54642D93725O9306k81349l8242F8979K20349
$$ 4242919 3369314 2485758 1555762 1001120 493725 563031 281682 243440 68979 289328
16356B89328I6595J16942P6702f6353b199l07872j10908j36223j32391K75226
$$ 289328 96595 213537 290239 -66353 -2199 -310071 -420979 -557202 -689593 -414367
16346d14367k64298O0864b81877j77287b14046j5593c458G6681Q9000J67578J60083
$$ -414367 -678665 -617801 -281877 -459164 -214046 -229639 -3458 76681 165681 333259 493342
16335D93342j51429K08904k02813L0962A03504J70143p9673p7960b12325J1754
$$ 493342 341913 550817 348004 378966 103504 273647 193974 116014 -212325 -200571
16325b00571j67804k03569J87330p7652a81215M406h3359j01442L0042A94911
$$ -200571 -368375 -571944 -384614 -462266 -181215 -176809 -83359 -184801 -154759 194911
16314E8329k4341L02444r2800A12223c4982Q743l15979j49386K42645l27905O1517
$$ 58329 33988 336432 243632 112223 -34982 -26239 -342218 -491604 -248959 -576864 -515347
16303e15347r6417J63179p1619j63945J79242J48523J42941J02893j72398d4060
$$ -515347 -611764 -448585 -520204 -684149 -504907 -356384 -213443 -110550 -282948 -44060
16292a26554o6238k8147Q6824P412j96193j4476i5478k28984J9471m8019q9462
$$ -126554 -192792 -220939 -134115 -126703 -322896 -337372 -95478 -324462 -304991 -353010 -442472
16281d42472a67862j97650p5585a80525i438k3516k78534C4757J1162J62892L23323
$$ -442472 -167862 -365512 -441097 -180525 -9438 -32954 -311488 34757 45919 208811 532134
16270E32134j06966K42330n5242m0356N8988k7023q9114n3637J16094k74507A49534
$$ 532134 425168 667498 612256 571900 630888 603865 514751 461114 577208 302701 149534
16258A27097L20052j86451K62767B61213j5711J21752j28299K29592K1768j86265
$$ 127097 447149 260698 523465 261213 245502 367254 238955 468547 490315 304050
16248C04050K84532r8329j58656P2261P3902K03153k50137M68880m3305J54706
$$ 304050 588582 490253 331597 403858 477760 680913 430776 899656 856351 1011057
16238A011057o334p0377J35979J54467P9600n56528J11534j35475j62318q653
$$ 1011057 1004723 934346 1070325 1224792 1304392 747864 859398 723923 561605 552952
16228E52952j16940j4654o2883J69047n0048j23062m980J11177K87458k20907
$$ 552952 436012 421358 358475 527522 477474 354412 349432 460609 748067 527160
16218E27160k00067L78236B74319J58456K48119k02666r4729K03369B39845K70743
$$ 527160 327093 705329 274319 432775 680894 478228 383499 586868 239845 510588
16208E10588J42182k24030K87190l54999K69346K4221n7860Q4895l6600J45018
$$ 510588 652770 428740 715930 360931 630277 654498 596638 681533 644933 789951
16198G89951m2949j75075l1396m2559J06912p4056J86778k0840k17972J45197
$$ 789951 747002 571927 540531 497972 604884 530828 717606 696766 478794 623991
16188F23991Q9505k39635J34143J20770n7246Q2127N9639j40699k69813M75712
$$ 623991 713496 473861 608004 728774 671528 753655 813294 672595 402782 878494
16178H78494l93198L26554C78671K14547Q6825J8024K20313l20390q9645J65202
$$ 878494 485296 811850 378671 593218 680043 698067 918380 597990 508345 673547
16168F73547p8411m2021J09894l21770L6513J72098j20520M3203L9401j55164
$$ 673547 595136 553115 663009 341239 377752 549850 429330 472533 511934 356770
16158C56770K02645l1436L8303J51096k61836r7454K87452Q4776j02319R8548
$$ 356770 559415 527979 566282 717378 455542 358088 645540 730316 627997 726545
16148G26545j80032O3406K2912N2102K40394j37537K64637J31587k18953K3080
$$ 726545 546513 609919 632831 684933 925327 787790 1052427 1184014 965061 988141
16138I88141J8710j42683j21647J91387n1949j1712m1388j00386j95228K30331
$$ 988141 1006851 864168 742521 933908 881959 870247 828859 728473 533245 763576
16128G63576j33317J42635j8529L6705K4263J37464k19291K14318q0549J87949
$$ 763576 630259 772894 754365 791070 815333 952797 733506 947824 867275 1055224
16118A055224j57386J24l6039j21923k0471k6430l5356K04200l89151K93878K7514
$$ 1055224 897838 897962 861923 740000 719529 693099 657743 861943 472792 766670 794184
16107G94184j1147K7776n1523k36864L18746J55514k10181l9394j6881J76282
$$ 794184 783037 810813 759290 522426 841172 996686 786505 747111 730230 906512
16097I06512o2495n001J00406j24345K48245n5167l59653K93220L07721r0739
$$ 906512 844017 839016 939422 815077 1063322 1008155 648502 941722 1249443 1158704
16087A158704j94892k34360M09329q7272k82678K85483m05303L18642o2583J29186
$$ 1158704 963812 729452 1138781 1051509 768831 1054314 649011 967653 905070 1034256
16077A034256j32853J64381R1486q7713R1157m6280k65031M18179r2328L1830
$$ 1034256 901403 1065784 1157270 1069557 1160714 1114434 849403 1267582 1175254 1207084
16067A207084m2180p4622Q1572J63410J33585j55292M1975j97364M56353l2741
$$ 1207084 1164904 1090282 1171854 1335264 1468849 1313557 1355532 1158168 1614521 1581780
16057A581780m14292J25234Q9725N0969P651K62324m09709Q5070K27145l2618
$$ 1581780 1167488 1292722 1382447 1433416 1441067 1703391 1293682 1378752 1605897 1573279
16047A573279l2607k90226K69735O1520P29p6065J41479N2480k09176l9375Q7922
$$ 1573279 1540672 1250446 1520181 1581701 1582430 1506365 1647844 1700324 1491148 1451773 1539695
16036A539695P9198N7504r5026j02579L06060J6511k85982L27600j16957J6508
$$ 1539695 1618893 1676397 1581371 1478792 1784852 1801363 1515381 1842981 1726024 1742532
16026A742532R2690r3275M5646O2141N8104P4416N1364j92698K04586j18801N760
$$ 1742532 1835222 1741947 1787593 1849734 1907838 1982254 2033618 1840920 2045506 1926705 1932465
16015A932465K22918j31788O0653p5790K15439o3671j35621J17485J0885L1879
$$ 1932465 2155383 2023595 2084248 2008458 2223897 2160226 2024605 2142090 2152975 2184854
16005B184854n3849P9343p2763j9099l3035l0356j04114J34377j35312K97321
$$ 2184854 2131005 2210348 2137585 2118486 2085451 2055095 1950981 2085358 1950046 2247367
15995B247367l49772J80298J06973j78332N4244k4360q3460k302K14213P4947
$$ 2247367 1897595 2077893 2184866 2006534 2060778 2036418 1952958 1950656 2164869 2239816
15985B239816j95373Q2318J7365J25799J6736O4983K0275j14842K72532j78968
$$ 2239816 2044443 2126761 2144126 2269925 2286661 2351644 2371919 2257077 2529609 2350641
15975B350641j05593k7601r4191L34991k70508M0816q1264K23562m53600J28152
$$ 2350641 2245048 2217447 2123256 2458247 2187739 2228555 2147291 2370853 1917253 2045405
15965B045405J55392R591j64806j1534j41461J24248m863o5508J97831m6458o5121
$$ 2045405 2200797 2210388 2045582 2034048 1892587 2016835 2011972 1946464 2144295 2097837 2032716
15954B032716n8247N0830M1632L1544n3083r4976K15626j78497J68100Q5496O7232
$$ 2032716 1974469 2025299 2066931 2098475 2045392 1950416 2166042 1987545 2155645 2241141 2308373
15943B308373j66990K49532l16033K55517j05799K20579j80189J27405L8518K7011
$$ 2308373 2141383 2390915 2074882 2330399 2224600 2445179 2264990 2392395 2430913 2457924
15933B457924J05977j08114J15503J26035j25262Q0980L3785O2760L3865J30344
$$ 2457924 2563901 2455787 2571290 2697325 2572063 2653043 2686828 2749588 2783453 2913797
15923B913797K41480L2518J86290o2020J44072J82881J04133N59532p679L87581
$$ 2913797 3155277 3187795 3374085 3312065 3456137 3639018 3743151 4302683 4295004 4682585
15913D682585L95987N01012P08142J103940J384616K128161K907947L937633N520523
$$ 4682585 5078572 5579584 6287726 7391666 8776282 10904443 13812390 17750023 23270546
15904B3270546O405379O817936O942352N874153N041295L241945K454181J99508
$$ 23270546 29675925 36493861 43436213 49310366 54351661 57593606 60047787 60247295
15896F0247295j911452l772018n827695p629623q105539p479404o071012m694602
$$ 60247295 58335843 54563825 48736130 41106507 33000968 25521564 19450552 14755950
15888A4755950l512203k263906j488277j236115o72303o88249n76599l15335o23260
$$ 14755950 11243747 8979841 7491564 6255449 5583146 4894897 4318298 4002963 3379703
15879C379703J32781m64936K8171l02887P521R9078j64745j43917m3177o2478
$$ 3379703 3512484 3047548 3075719 2772832 2780353 2879431 2714686 2570769 2527592 2465114
15869B465114J87736m8009R4459k44248O3508j08767k3008j19052p3561l7602
$$ 2465114 2652850 2604841 2699300 2455052 2518560 2409793 2386785 2267733 2194172 2156570
15859B156570J891m0058K23654j85255J24335r6393j51501K175J5983q9383N0904
$$ 2156570 2158461 2118403 2342057 2156802 2281137 2184744 2033243 2035418 2051401 1962018 2012922
15848B012922K21299k7922o9248l2746j07236J41015J48874q4473j13997K38870
$$ 2012922 2234221 2206299 2137051 2104305 1997069 2138084 2286958 2202485 2088488 2327358
15838B327358k6696M6413M5584Q1285R1961j05743k2819K64035k43013J03109
$$ 2327358 2300662 2347075 2392659 2473944 2565905 2460162 2437343 2701378 2458365 2561474
15828B561474K6659l40987l3279j16382J90234k97223J21293p801j35541K82064
$$ 2561474 2588133 2247146 2213867 2097485 2287719 1990496 2111789 2103988 1968447 2250511
15818B250511r1928r9031J43583O787P8651M3828J48106j25658J65645k05417
$$ 2250511 2158583 2059552 2203135 2209922 2288573 2332401 2480507 2354849 2520494 2315077
15808B315077J6590L06743l0625k28068r7171J58953J76338K01160k34842K13428
$$ 2315077 2331667 2638410 2607785 2379717 2282546 2441499 2617837 2818997 2584155 2797583
15798B797583J88157J18678l9469K3670r7789N05495K28226M5970j3723o0010
$$ 2797583 2985740 3104418 3064949 3088619 2990830 3496325 3724551 3770521 3756798 3696788
15788C696788R3217m1178K41412j91207J59800L81041m3300K43356N5475L11361
$$ 3696788 3790005 3748827 3990239 3799032 3958832 4339873 4296573 4539929 4595404 4906765
15778D906765Q9268K59639j56101K09837k32670L6947j19147J56570k27690q0802
$$ 4906765 4996033 5255672 5099571 5309408 5076738 5113685 4994538 5151108 4923418 4842616
15768D842616K43090m1884J53972o4315L31151l24933L84937J03568o1247j67105
$$ 4842616 5085706 5043822 5197794 5133479 5464630 5139697 5524634 5628202 5566955 5399850
15758E399850k3554M1863j30441k40735p6477J22273K760J03713m66438M65859
$$ 5399850 5376296 5418159 5287718 5046983 4970506 5092779 5095539 5199252 4732814 5198673
15748E198673q6430K82471O0623j7896N36014K56835K97743R9922K55816L12799
$$ 5198673 5112243 5394714 5455337 5437441 5973455 6230290 6528033 6627955 6883771 7196570
15738G196570p6091K470J59838J35252J05654M752J07517j73302K88537j93781
$$ 7196570 7120479 7122949 7282787 7418039 7523693 7528445 7635962 7462660 7751197 7557416
15728G557416L04086j90536K27492k46890q7644m4986p7870l37695j11674k05172
$$ 7557416 7861502 7670966 7898458 7651568 7563924 7518938 7441068 7103373 6991699 6786527
15718F786527j2464k70937L028J27519J93891j56753k6855k27450J16527k13426
$$ 6786527 6774063 6503126 6506154 6633673 6827564 6670811 6643956 6416506 6533033 6319607
15708F319607m23214L51177p8624L44401O9164M75812J63928J59864K81878L73356
$$ 6319607 5896393 6247570 6168946 6513347 6582511 7058323 7222251 7382115 7663993 8037349
15698H037349k01437N0676J46212J59622j59383M7944k38431j84491L6222j02941
$$ 8037349 7835912 7886588 8032800 8192422 8033039 8080983 7842552 7658061 7694283 7591342
15688G591342l1968n1873m5862q5707o6184j57828j73600k05842J13218k59884
$$ 7591342 7559374 7507501 7461639 7375932 7309748 7151920 6978320 6772478 6885696 6625812
15678F625812J19053j62241l06011j32652p572k90372J30203k15645N3855r1872
$$ 6625812 6744865 6582624 6276613 6143961 6136389 5846017 5976220 5760575 5814430 5722558
15668E722558R7247K19248K27720k92L31399L30085K69947M40300N96579K19271
$$ 5722558 5819805 6039053 6266773 6266481 6597880 6927965 7197912 7638212 8234791 8454062
15658H454062N07718N69566N36354N47934O87498P47502L61473Q63072N34822
$$ 8454062 8961780 9531346 10067700 10615634 11303132 12050634 12412107 13275179 13810001
15649A3810001L82364Q27290O78860K71223Q96165K42825Q20531Q26221N95205
$$ 13810001 14192365 15019655 15698515 15969738 16865903 17108728 17929259 18755480 19350685
15640A9350685J081496P59227P88664R93962M63643L71579K80038K0305j17795
$$ 19350685 20432181 21191408 21980072 22974034 23437677 23809256 24089294 24109599 23991804
15631B3991804k50553J03484m47737o3890m44100L5768M6186n36258J76893m29426
$$ 23991804 23741251 23844735 23396998 23333108 22889008 22924776 22970962 22434704 22611597 22182171
15621B2182171n90416m49100r47117j001182j042421j035799r74107j037005p44817
$$ 22182171 21591755 21142655 20195538 19194356 18151935 17116136 16142029 15105024 14360207
15612A4360207m63367n33105l97948j30301l65383n28617k26607n45946j0018
$$ 14360207 13896840 13363735 12965787 12835486 12470103 11941486 11714879 11168933 11158915
15603A1158915k24774n40411m44949j72167k61907L25885k12674N95468j20871
$$ 11158915 10934141 10393730 9948781 9776614 9514707 9840592 9627918 10223386 10102515
15594A0102515P22604P88539K031972M458856R914513J1907879R075555O747760
$$ 10102515 10825119 11613658 13645630 18104486 28018999 39926878 49002433 55750193
15586E5750193N223674L688207K696869J908015R7457j887549o373031j2872621
$$ 55750193 60973867 64662074 67358943 69266958 69364415 67476866 61103835 48231214
15578D8231214j5346418j1585191n886182l301883j633109j077749o06349l17892
$$ 48231214 32884796 21299605 15413423 12111540 10478431 9400682 8794333 8476441
15570H476441L7066k86969j88963K01815k0926J40439K11889J22927J81068M67712
$$ 8476441 8513507 8226538 8037575 8239390 8218464 8358903 8570792 8693719 8874787 9342499
15560I342499L33790Q36107J322619L103807P699901J4283134J5355255J0894116
$$ 9342499 9676289 10512396 11835015 14938822 22638723 36921857 52277112 63171228
15552F3171228Q213778N887092M419714L317418J814836j71620l795066j0832671
$$ 63171228 71385006 77272098 81691812 85009230 86824066 86652446 82857380 72024709
15544G2024709j8904583j9225673j2548721o781392l991698j599903j238401r87173
$$ 72024709 53120126 33894453 21345732 14564340 10572642 8972739 7734338 6747165
15536F747165m93859n5460k89301p7430p5345k47221O6383j306j87684j29481
$$ 6747165 6253306 6197846 5908545 5831115 5755770 5508549 5574932 5573626 5385942 5256461
15526E256461j32438l6841o1152j95583j89452j22758q7477O7495j14922J68135
$$ 5256461 5124023 5087182 5026030 4830447 4640995 4518237 4430760 4498255 4383333 4551468
15516D551468r1834Q6067P329o520K61588K0277N4691L4030K48271m3303J01148
$$ 4551468 4459634 4545701 4553030 4546510 4808098 4828375 4883066 4917096 5165367 5122064 5223212
15505E223212K51427q0324m07406K41384m52662R8166k3663l7106p0645M5513
$$ 5223212 5474639 5394315 4986909 5228293 4775631 4873797 4850134 4813028 4742383 4787896
15495D787896j2267o6173L05683j83336Q2271J61973P7274J85609k0196O8338
$$ 4787896 4775629 4709456 5015139 4831803 4914074 5076047 5153321 5338930 5318734 5387072
15485E387072K87333J13113L9521L31532J1979J48308j33559K75889O3158K0833
$$ 5387072 5674405 5787518 5827039 6158571 6170550 6318858 6185299 6461188 6524346 6545179
15475F545179J14269J71689R5941K77471P27079M45155P64475L92391P55796j6951
$$ 6545179 6659448 6831137 6927078 7204549 7931628 8376783 9141258 9533649 10289445 10272494
15465A0272494K72147J98037J34177k42425m87822k01658k28835j39721j827M46898
$$ 10272494 10544641 10742678 10876855 10634430 10146608 9944950 9716115 9576394 9574567 10021465
15455A0021465K41746O52989J65810L94464L01649K88208O5635o3900n63827m23162
$$ 10021465 10263211 10916200 11082010 11476474 11778123 12066331 12131966 12068066 11504239 11081077
15445A1081077n10587l28742l57830o4710K8074j5040J20411P9098J55644P8867
$$ 11081077 10570490 10241748 9883918 9819208 9847282 9832242 9952653 10031751 10187395 10266262
15435A0266262J66579k96786l60373j87469j62624m64400n26649k637k83764j50290
$$ 10266262 10432841 10136055 9775682 9588213 9425589 8961189 8434540 8431903 8148139 7997849
15425G997849l75523j872l62054j07986j72624k69088Q7759k22617k13475l16232
$$ 7997849 7622326 7620454 7258400 7150414 6977790 6708702 6796461 6573844 6360369 6044137
15415F044137J49787k73310K03053k03340O6589q5098j6231j74339L38926P2430
$$ 6044137 6193924 5920614 6123667 5920327 5986916 5901818 5885587 5711248 6050174 6122604
15405F122604j66700J18915n306J60911P3348j01542L75360L7133K10490o9867
$$ 6122604 5955904 6074819 6069513 6230424 6303772 6202230 6577590 6614723 6825213 6755346
15395F755346J08233j10570L41049l84391l55717L2577J42846l42180J799P407
$$ 6755346 6863579 6753009 7094058 6709667 6353950 6386527 6529373 6187193 6188992 6196399
15385F196399M4379Q557j53876N2687M1715J59602j54187k0855j99477J03164
$$ 6196399 6240778 6249335 6095459 6148146 6189861 6349463 6195276 6174421 5974944 6078108
15375F078108K526L2855j58959K54090n4015P9178l81337M91456j14502J03908
$$ 6078108 6080634 6113489 5954530 6208620 6154605 6233783 5852446 6343902 6229400 6333308
15365F333308q2180L86453O8444m6791K27094l166J06012K9072K58212J75889
$$ 6333308 6251128 6637581 6706025 6659234 6886328 6883162 6989174 7018246 7276458 7452347
15355G452347L07219K0508K41139M93423P96814P00691K010669M031538O054885
$$ 7452347 7759566 7780074 8021213 8514636 9311450 10012141 12022810 16054348 22109233
15346B2109233O625569M826360L924241K912754J994356J774940Q88154p5133
$$ 22109233 28734802 33561162 37485403 40398157 42392513 44167453 45055607 44980474
15338D4980474j875237m468755p444350o880653m857749k396565j259603p24077
$$ 44980474 43105237 38636482 31192132 24311479 19453730 17057165 15797562 15073485
15330A5073485m73605l39422j43702l58492p34974J03824m75500n3668j72884
$$ 15073485 14599880 14260458 14116756 13758264 13023290 13127114 12651614 12597946 12425062
15321A2425062K14746M92907L31201J135090R60944K812676M952189Q436433J0736026
$$ 12425062 12639808 13132715 13463916 14599006 15559950 18372626 23324815 31761248 42497274
15312D2497274J0631563Q600539O532343M612547L373888K229870J38806k207734
$$ 42497274 53128837 61729376 68261719 72874266 76248154 78478024 78616830 76409096
15304G6409096o810748j1834623j4169937j2155123q688966n087531k784082j209465
$$ 76409096 69598348 57763725 43593788 31438665 22749699 17662168 14878086 13668621
15296A3668621j060034l65844j46696j76295J18470J14245p6325M46768k00137
$$ 13668621 12608587 12242743 12096047 11919752 12038222 12152467 12076142 12522910 12322773
15287A2322773K48845K48497J14781J61610j2008Q09538J771997M100728O046920
$$ 12322773 12571618 12820115 12934896 13096506 13084498 13894036 15666033 19766761 25813681
15278B5813681N557759M123946L059464K118980J574141J275962K29543o50805
$$ 25813681 31371440 35495386 38554850 40673830 42247971 43523933 43753476 43102671
15270D3102671k652860n620255p279396p095408m545364k623619j371020o62674
$$ 43102671 40449811 34829556 27550160 20454752 15909388 13285769 11914749 11252075
15262A1252075n59560n71720n56423l18910k60407L31220k46671J23157p1304
$$ 11252075 10692515 10120795 9564372 9245462 8985055 9316275 9069604 9192761 9121457
15253I121457L80846K63570J15407N14596K6385N4408l58071J85003j10514k94136
$$ 9121457 9502303 9765873 9881280 10395876 10422261 10476669 10118598 10303601 10193087 9898951
15243I898951m8237l29191j09977r5129J59987K19415M46778N26853L05408N03209
$$ 9898951 9850714 9521523 9411546 9316417 9476404 9695819 10142597 10669450 10974858 11478067
15233A1478067M88373N26483L08870r4658J29219k32748n13879j65960n92424
$$ 11478067 11966440 12492923 12801793 12707135 12836354 12603606 12089727 11923767 11331343
15224A1331343m18757n13181j69449l35832j9348K71764M33750j82050K41852
$$ 11331343 10912586 10399405 10229956 9894124 9874776 10146540 10580290 10398240 10640092
15215A0640092K35664J08359M27731p7268Q2661n2828l58469n78785j69137q47594
$$ 10640092 10875756 10984115 11411846 11334578 11417239 11364411 11005942 10427157 10258020 9410426
15205I410426m79504q83306m14027m69620k90251j87101j69921L36k60051k45720
$$ 9410426 8930922 8047616 7633589 7163969 6873718 6686617 6516696 6517032 6256981 6011261
15195F011261L23160O967j14995L00802r3007M89804O3204L87204O6223L7219
$$ 6011261 6334421 6341388 6226393 6527195 6434188 6923992 6987196 7374400 7440623 7477842
15185G477842m3018L971l8062K15272n4860L40082J63192J44393K7317M60900
$$ 7477842 7434824 7438795 7400733 7616005 7561145 7901227 8064419 8208812 8236129 8697029
15175H697029k07261K47466O9142j22577L11773m70077J01240j86328J95047k74421
$$ 8697029 8489768 8737234 8806376 8683799 8995572 8525495 8626735 8440407 8635454 8361033
15165H361033l8942J71137j22229M7119O3070k14526M61507j51632J18802L50334
$$ 8361033 8322091 8493228 8370999 8418118 8481188 8266662 8728169 8576537 8695339 9045673
15155I045673j72756O6890r030l11J43974m12489k34832J94964r4830J07082k11373
$$ 9045673 8872917 8939807 8930777 8930466 9074440 8661951 8427119 8622083 8527253 8634335 8422962
15144H422962R285M3591j38059L98228j37114q577J60159M5731J21666o741J38187
$$ 8422962 8432247 8475838 8337779 8736007 8598893 8590316 8750475 8796206 8917872 8911131 9049318
15133I049318l45205L02614j82545j58663R2053j02004K85239l03775k41569K27944
$$ 9049318 8704113 9006727 8824182 8665519 8757572 8655568 8940807 8637032 8395463 8623407
15123H623407k4397j83970p4629j24221j53281p28J42173j99463J52764p6587
$$ 8623407 8599010 8415040 8340411 8216190 8062909 8062181 8204354 8004891 8157655 8081068
15113H081068l41886O8930q2485K87544m1365J05477j43371J56107K25288K19145
$$ 8081068 7739182 7808112 7725627 8013171 7971806 8077283 7933912 8090019 8315307 8534452
15103H534452L632K90422J0328J81005M77742K97663L5877L92519N44014K41615
$$ 8534452 8538084 8828506 8838834 9019839 9497581 9795244 9831121 10223640 10767654 11009269
15093A1009269J047936P90611J555603K294216K503916K075128J728382J250814
$$ 11009269 12057205 12847816 14403419 16697635 19201551 21276679 23005061 24255875
15085B4255875J339835N21348L54637K49841m51973j474656j942970j619515l94222
$$ 24255875 25595710 26117058 26471695 26721536 26269563 24794907 22851937 21232422 20838200
15076B0838200R73074K103621J917892J920144J280514J120885J001604M43675
$$ 20838200 21811274 23914895 25832787 27752931 29033445 30154330 31155934 31599609
15068C1599609N62324q3345p59293R7222J350631J682675J523828K200829J762803
$$ 31599609 32161933 32078588 31319295 31416517 32767148 34449823 35973651 38174480 39937283
15059C9937283K398275K414132L083830K246563J412646q64920l059315j997582
$$ 39937283 42335558 44749690 47833520 50080083 51492729 50627809 47568494 45570912
15051D5570912J54867K438716K961851K525838J004744J40318k3372P66241J262054
$$ 45570912 45725779 48164495 51126346 53652184 54656928 54797246 54773874 55540115 56802169
15042E6802169O75504J17160j746529l304837l738219l109433k413582j958469
$$ 56802169 57477673 57594833 55848304 52543467 48805248 45695815 43282233 41323764
15034D1323764j957539k280166j888921m66072J292725J168025J005498J389358
$$ 41323764 39366225 37086059 35197138 34731066 36023791 37191816 38197314 39586672
15026C9586672J326629J497074J350914J566787R77829P05012r20860r31626J298715
$$ 39586672 40913301 42410375 43761289 45328076 46305905 47010917 46090057 45158431 46457146
15017D6457146M084819N406826N799775N897524N621090N740845N218230M255108
$$ 46457146 50541965 55948791 61748566 67646090 73267180 79008025 84226255 88481363
15009H8481363L482227K004313J187716q18860q91148L1860J155385K778328M335631
$$ 88481363 91963590 93967903 95155619 94336759 93445611 93477471 94632856 97411184 101746815
15000A01746815N769686O784519O754785N746865M478297L564716P02694j158803
$$ 101746815 107516501 114301020 121055805 126802670 131280967 134845683 135548377 134389574
14992A34389574m196050o094424q048557q361231q489134p769908p016955o119428
$$ 134389574 130193524 124099100 116050543 107689312 99200178 91430270 84413315 78293887
14984G8293887m619723m178104l057979k479964k553878l020806l719415m684117
$$ 78293887 73674164 69496060 66438081 63958117 61404239 58383433 54664018 49979901
14976D9979901m607081m001836l053026k849607k666440k036976j297765q42893
$$ 49979901 45372820 41370984 38317958 35468351 32801911 30764935 29467170 28624277
14968B8624277r5767L06959J73994K70442N9467N72583M28426J131956J429390
$$ 28624277 28528510 28835469 29009463 29279905 29339372 29911955 30340381 31472337 32901727
14959C2901727K587738M029570M922396P649614J0814600J4811948J8608667K1103312
$$ 32901727 35489465 39519035 44441431 52091045 62905645 77717593 96326260 117429572
14951A17429572K5139448K8604289K9457900K9607690L0357234L0104965K3485949
$$ 117429572 142569020 171173309 200631209 230238899 260596133 290701098 314187047
14944C14187047J4067835K921256m221891q331102j2861396j6818003k0626151
$$ 314187047 328254882 331176138 326954247 318623145 305761749 288943746 268317595
14937B68317595k2706303k6967837k8064594k3239263j4766608q685476o828692
$$ 268317595 245611292 218643455 190578861 167339598 152572990 143887514 137058822
14930A37058822p482275r657909j1181714j0126849q083526n286849k948217k823604
$$ 137058822 129576547 119918638 108736924 98610075 90526549 85239700 82291483 79467879
14922G9467879l527732l525020l854491l340334l007758k980021l224876m341813
$$ 79467879 75940147 72415127 68560636 65220302 62212544 59232523 56007647 51665834
14914E1665834p239834q353248p789193n582205l686323j979953j430204l91290
$$ 51665834 44426000 36072752 28283559 22701354 19015031 17035078 15604874 15213584
14906A5213584q9007j59155L00524N21494R54711R72356Q92661J780033K152715
$$ 15213584 15124577 14965422 15265946 15787440 16742151 17714507 18607168 20387201 22539916
14897B2539916L673513M665560M243654L875703K398669J913634J306074M25348
$$ 22539916 26213429 30878989 35122643 38998346 41397015 43310649 44616723 45042071
14889D5042071K79075m39661k477327m341337o017975n530090l627945k203257
$$ 45042071 45321146 44881485 42404158 38062821 32044846 26514756 22886811 20683554
14881B0683554j167639p20417o87868o09014O31597Q53954N26014R52482K64864
$$ 20683554 19515915 18795498 18107630 17498616 18130213 18984167 19510181 20462663 20727527
14872B0727527J40971M91823L69148K11102N92115K73950j28513m31095p6523
$$ 20727527 20868498 21360321 21729469 21940571 22532686 22806636 22678123 22247028 22170505
14863B2170505M20873J955365L898127N778858P083972P567183Q307673Q776004
$$ 22170505 22591378 24546743 28444870 34223728 41307700 48874883 57182556 65958560
14855F5958560P702921N676745M029399K197751n2193l417362o489767q469581
$$ 65958560 73661481 79338226 83367625 85565376 85513183 82095821 75606054 67136473
14847F7136473r278197r607286r740138q230950n289136l000777j938174r37123
$$ 67136473 57858276 48250990 38510852 30279902 24990766 21989989 20051815 19114692
14839A9114692j000713o40160m05030q11085j61836k77250m00265O8780l07504
$$ 19114692 18113979 17473819 17068789 16257704 16095868 15818618 15418353 15487133 15179629
14830A5179629j97752L66632L66081M02424N91614O49287R82077J586432L091257
$$ 15179629 14981877 15348509 15714590 16117014 16708628 17357915 18339992 19926424 23017681
14821B3017681N138830O452059O999386N857818M163012L032485J966489R68745
$$ 23017681 28156511 34608570 41607956 47465774 51628786 54661271 56627760 57596505
14813E7596505q21j389684l538949p204043r117158q931513o716889l783538k460153
$$ 57596505 57595684 56206000 52667051 45463008 36345850 27414337 20697448 16913910 14453757
14804A4453757j020370j014719j21174o75486J41439q6315J14748j3529j87880
$$ 14453757 13433387 12418668 12297494 11622008 11763447 11677132 11791880 11778351 11590471
14795A1590471l53255m9340m18001n2585J29531j30801j27294m88290r7013K0191
$$ 11590471 11237216 11187876 10769875 10717290 10846821 10716020 10588726 10100436 10003423 10023614
14785A0023614R0537O0911K76627J84742M27029Q69628N13826P88234K03922N38065
$$ 10023614 10114151 10175062 10451689 10636431 11063460 11933088 12446914 13235148 13439070 13977135
14775A3977135L76829N0629J34479j05818l08731j042104q56575r81718q54493
$$ 13977135 14353964 14404593 14539072 14433254 14124523 13082419 12225844 11244126 10389633
14766A0389633r0968l07444n2935k52609K06214p1766Q1951K75903J82514r1719
$$ 10389633 10298665 9991221 9938286 9685677 9891891 9820125 9902076 10177979 10360493 10268774
14756A0268774L68476L46663Q6198L84500L53351N95600J46425L15540J44315
$$ 10268774 10637250 10983913 11070111 11454611 11807962 12403562 12549987 12865527 13009842
14747A3009842L9342K44047J60719M39286O3351J37200K20118J39185R23395J278543
$$ 13009842 13049184 13293231 13453950 13893236 13956587 14093787 14313905 14453090 15376485 16655028
14737A6655028J745482J757466K958913M200553O243788J0027557J6233559K3391061
$$ 16655028 18400510 20157976 23116889 27317442 33561230 43588787 59822346 83213407
14729H3213407K7246323K9026010K9189988K4592773J8808292J3607225Q479035
$$ 83213407 110459730 139485740 168675728 193268501 212076793 225684018 234163053
14722B34163053J754562o405636j7406017k7783060l3122241l4105069l1640568
$$ 234163053 235917615 229511979 212105962 184322902 151200661 117095592 85455024
14715H5455024k4439985j6446881j0224523o311576m396002l033895k171420j720338
$$ 85455024 61015039 44568158 34343635 28032059 23636057 20602162 18430742 16710404
14707A6710404j193806q09643o08790n98088q17538j104305j311364m48185r28707
$$ 16710404 15516598 14706955 14098165 13500077 12682539 11578234 10266870 9818685 8889978
14698H889978M81716n40196R186M64j51326l4181L1731J9566j10513M45046N1177
$$ 8889978 9371694 8831498 8840684 8841148 8689822 8655641 8687372 8706938 8596425 9041471 9092648
14687I092648J17942l77221k34671r8124P3008J15018K98939K42859N89805N72762
$$ 9092648 9210590 8833369 8598698 8500574 8573582 8688600 8987539 9230398 9820203 10392965
14677A0392965R73911O79102O12744N16324J96374k42254m2107j3650k05074q90092
$$ 10392965 11366876 12045978 12658722 13175046 13371420 13129166 13087059 13073409 12868335 11978243
14667A1978243o17112l93493o83662k31680n43159r19J45912j50743K84361j59514
$$ 11978243 11361131 10967638 10283976 10052296 9509137 9508218 9654130 9503387 9787748 9628234
14657I628234k01804o53588r23634q21102k53269j88064Q075K75898O53916J40863
$$ 9628234 9426430 8772842 7849208 7028106 6774837 6586773 6594848 6870746 7524662 7665525
14647G665525N52752K64038M41591K73232K07778J30315L84541P01198K05429
$$ 7665525 8218277 8482315 8923906 9197138 9404916 9535231 9919772 10620970 10826399
14638A0826399K11447K45895O63126O19813K04411J88014Q3577q0709p17193m30293
$$ 10826399 11037846 11283741 11946867 12566680 12771091 12959105 13042682 12961973 12244780 11814487
14628A1814487j436560j235062j104540j251127j333718n98074k40027k74474
$$ 11814487 10377927 9142865 8038325 6787198 5453480 4855406 4615379 4340905
14620D340905J791n1645r2990K68412p4535P9167k70205k8205J76857j88205j46194
$$ 4340905 4342696 4291051 4198061 4466473 4391938 4471105 4200900 4172695 4349552 4161347 4015153
14609D015153J12313k57281o2507j25453K33047j17925L31715J28573P36919J132563
$$ 4015153 4127466 3870185 3807678 3682225 3915272 3797347 4129062 4257635 4994554 6127117
14599F127117Q52158J004351Q57311N14564O00909J37365N8804j37901k25505
$$ 6127117 6979275 7983626 8840937 9355501 9956410 10093775 10152579 10014678 9789173
14590I789173r19080q09885j342633j176625p05503m65080l38761J67527Q132
$$ 9789173 8870093 8060208 6717575 5540950 4835447 4370367 4031606 4199133 4207265
14581D207265O5770m0342l47128K33984K18657k07923J80447K48473K0694L59331
$$ 4207265 4273035 4232693 3885565 4119549 4338206 4130283 4310730 4559203 4579897 4939228
14571D939228m3752L28927M65807O99724J301874N37949M80511J091526P36843
$$ 4939228 4895476 5224403 5690210 6389934 7691808 8229757 8710268 9801794 10538637
14562A0538637J583299L038552N488320P551583N942877L929922K550207K403901
$$ 10538637 12121936 15160488 20648808 28200391 34143268 38073190 40623397 43027298
14554D3027298K002469J497077L05535j499580l232553p107268q251934o328923
$$ 43027298 45029767 46526844 46832379 45332799 42100246 34992978 26741044 20412121
14546B0412121j666765J995740N690963P135137N710716M342148L309927K628819
$$ 20412121 18745356 20741096 26432059 33567196 39277912 43620060 46929987 49558806
14538D9558806J638870N15241k22901l034671n861712q776806q653808o145731
$$ 49558806 51197676 51712917 51490016 48455345 42593633 33816827 25163019 19017288
14530A9017288l828976j745542p73185l07712j08404L99130o9400K55555N25521
$$ 19017288 15188312 13442770 12669585 12361873 12253469 12652599 12583199 12838754 13364275
14521A3364275K144395M207880M693291L799727L287109K740592J818528J850892
$$ 13364275 15508670 19716550 24409841 28209568 31496677 34237269 36055797 37906689
14513C7906689J417799O61280l74931k731446n541531n161554l387682r5901K243681
$$ 37906689 39324488 39985768 39610837 36879391 31337860 26176306 22788624 22692723 24936404
14504B4936404M942946L797165K903681J932225J670898P51774O81843l21890
$$ 24936404 29879350 33676515 36580196 38512421 40183319 40935093 41616936 41295046
14496D1295046q81931j965718m780347o615022n363218l790261k237887k159636
$$ 41295046 40413115 38447397 33667050 27052028 21688810 17898549 15660662 13501026
14488A3501026j701550j188398p68313j107839j568232j099475r34503n55408
$$ 13501026 11799476 10611078 9842765 8734926 7166694 6067219 5132716 4577308
14480D577308k99546m76723M5775O8038J31061j68100J67330N32883K69856O98093
$$ 4577308 4277762 3801039 3846814 3914852 4045913 3877813 4045143 4578026 4847882 5545975
14470E545975N28719L78697M48672O8102L76924J18332J78266P4839j69489m2122
$$ 5545975 6074694 6453391 6902063 6970165 7347089 7465421 7643687 7718526 7549037 7506915
14460G506915n5380M01819N88004K38078L62756J70792L11173J04434k72698l21427
$$ 7506915 7451535 7853354 8441358 8679436 9042192 9212984 9524157 9628591 9355893 9034466
14450I034466n47270r29918j039938l02417k31590R957K22235J95M41309K34448
$$ 9034466 8487196 7557278 6517340 6214923 5983333 5993290 6215525 6215720 6657029 6891477
14440F891477N13880J78845M0895M60377m5568L79230K83194L09368R20477J257127
$$ 6891477 7405357 7584202 7625097 8085474 8039906 8419136 8702330 9011698 9932175 11189302
14430A1189302K635815L584194M842344N253119M443753L739740K840189K119529
$$ 11189302 13825117 17409311 22251655 27504774 31948527 35688267 38528456 40647985
14422D0647985K294522N89718o60207k015169m577590n734407o035946n015528
$$ 40647985 42942507 43532225 42872018 40856849 36279259 30544852 24508906 19493378
14414A9493378l301244k355524j596737j573311r83719q55755q68837o85971M26194
$$ 19493378 16192134 13836610 12239873 10666562 9682843 8827088 7958251 7272280 7698474
14405G698474n64382j6608O7500j1758R1427M67008J21415O28010O15441J150877
$$ 7698474 7134092 7117484 7184984 7173226 7264653 7731661 7853076 8481086 9096527 10247404
14395A0247404K093364K925004M987454P093388Q449309Q628795P337044O229307
$$ 10247404 12340768 15265772 20253226 27346614 35795923 44424718 51761762 57991069
14387E7991069M837011L537634J708082M21065k586105n449029q294509j0564081
$$ 57991069 62828080 66365714 68073796 68494861 65908756 60459727 52165218 41601137
14379D1601137r392875q082563n501436l797246k796860j706709j166899l40189
$$ 41601137 32208262 24125699 18624263 14827017 12030157 10323448 9156549 8816360
14371H816360p43811n90689L5574l59453o756P7843k28513N5214q0755j52518
$$ 8816360 8072549 7481860 7517434 7157981 7151225 7229068 7000555 7055769 6975014 6822496
14361F822496M37218M13250M39384J130600J713248K249341K981295L563244L770878
$$ 6822496 7259714 7672964 8112348 9242948 10956196 13205537 16186832 19750076 23520954
14352B3520954L106132K540407J598783J030608N64086n40387j145775k490517
$$ 23520954 26627086 29167493 30766276 31796884 32360970 31820583 30674808 28184291
14344B8184291l377462m371067l974866l010318k086686j122131J95975K023019
$$ 28184291 24806829 20435762 16460896 13450578 11363892 10241761 10437736 12460755
14336A2460755K632728J706499J281414J144833R77241J054080P06971O81837
$$ 12460755 15093483 16799982 18081396 19226229 20203470 21257550 21964521 22646358
14328B2646358M3409n17131k520308k281890m06278P73372K187845K686254M299097
$$ 22646358 22689767 22172636 19652328 17370438 16964160 17737532 19925377 22611631 26910728
14319B6910728N134384P657399R928931J1752924J3914531J3265998J1627291
$$ 26910728 32045112 39702511 49631442 61384366 75298897 88564895 100192186
14312A00192186R751463O897120M495907J804191j264785n253365j0274446j4576701
$$ 100192186 109943649 116840769 121336676 123140867 121876082 116622717 106348271 91771570
14304I1771570j6644656j5741001j2846345r810623o961149n570987m067502k860331
$$ 91771570 75126914 59385913 46539568 36728945 29767796 24196809 20129307 17268976
14296A7268976k776122j597660j750284j057262q89084j139527m68488o32148
$$ 17268976 14492854 12895194 11144910 10087648 9198564 8059037 7590549 6958401
14288F958401o61123L9729p83913r1200k86859k18544l48437K3205k69474M508
$$ 6958401 6297278 6337007 5553094 5461894 5175035 4956491 4608054 4631259 4361785 4366293
14278D366293J38908j32926k78689K62804m06474n6085p9627J31903j75492Q0994
$$ 4366293 4505201 4372275 4093586 4356390 3949916 3893831 3814204 3946107 3770615 3851609
14268C851609l77619j90632q6408P5749k29815J54964l39678q0436P5490k2004
$$ 3851609 3473990 3283358 3196950 3272699 3042884 3197848 2858170 2777734 2853224 2831220
14258B831220n1960N7914k60702j24335L33883J2861P7951j18147n0855j24088
$$ 2831220 2779260 2837174 2576472 2452137 2786020 2798881 2876832 2758685 2707830 2583742
14248B583742R3677k43840k6785J31843j31577n1141k36227O5663p6876K28148
$$ 2583742 2677419 2433579 2406794 2538637 2407060 2355919 2119692 2185355 2108479 2336627
14238B336627j93418J75285k13514J26091j98378K61928o1312l9538n7803J1744
$$ 2336627 2143209 2318494 2104980 2231071 2032693 2294621 2233309 2193771 2135968 2147712
14228B147712k15658J525J74690j02924K80490k02939j33566K54270M3877j74385
$$ 2147712 1932054 1933579 2108269 2005345 2285835 2082896 1949330 2203600 2247477 2073092
14218B073092J65190L4447r6367J81628p1896L81669m28171L07329j82480N37178
$$ 2073092 2238282 2272729 2176362 2357990 2286094 2667763 2239592 2546921 2364441 2901619
14208B901619Q67988N953L12068p1721J66600R3404P5774j93587K66882n05313
$$ 2901619 3769607 3775560 4087628 4015907 4182507 4275911 4351685 4158098 4424980 3919667
14198C919667r47654o07068k43747l05726M2018Q916J70765q912M5984L31489
$$ 3919667 2972013 2364945 2121198 1815472 1857490 1866406 2037171 2028259 2074243 2405732
14188B405732m67618J37673O9787J08391j88654j74690K20772o8501j94111K48688
$$ 2405732 1938114 2075787 2145574 2253965 2065311 1890621 2111393 2042892 1848781 2097469
14178B097469O5483J9121j42264J11585N2645m6053J9303m5743j29426m3549J79850
$$ 2097469 2162952 2182073 2039809 2151394 2204039 2157986 2177289 2131546 2002120 1958571 2138421
14167B138421j55266m3941K32066k77116j01790J33775r1024q7112J17859R8965
$$ 2138421 1983155 1939214 2171280 1894164 1792374 1926149 1835125 1748013 1865872 1964837
14157A964837L26233j43445J1930P0232L5486j06176O9639M8348k82139K99391
$$ 1964837 2291070 2147625 2159555 2229787 2265273 2159097 2228736 2277084 1994945 2294336
14147B294336O2924l5490j42961L95890J14597L49074J054902J024881J155907
$$ 2294336 2357260 2321770 2178809 2574699 2689296 3038370 4093272 5118153 6274060
14138F274060O81695O46297O55541L23163L86138K98532j16403o56546q19519
$$ 6274060 6955755 7602052 8257593 8580756 8966894 9265426 9149023 8492477 7672958
14129G672958j315696j169773p84305m85725m75991m30736K49336j8728M24710
$$ 7672958 6357262 5187489 4403184 3917459 3441468 3010732 3260068 3241340 3666050
14120C666050J0423J90255K04372Q1826K19288K44969j52244j87607k90302k03649
$$ 3666050 3676473 3866728 4071100 4152926 4372214 4617183 4464939 4277332 3987030 3783381
14110C783381n05266l03542j64542l65181K39947l654m120j22157J44099J09280
$$ 3783381 3278115 2974573 2810031 2444850 2684797 2681143 2677023 2554866 2698965 2808245
14100B808245K74818K44102O41999J88276J53332L88940N3109L31568J31701p5598
$$ 2808245 3083063 3327165 3969164 4157440 4310772 4699712 4752821 5084389 5216090 5140492
14090E140492j84155j89990m30413j92978l3815M93534N12446K90973P00167n7342
$$ 5140492 4956337 4766347 4335934 4142956 4109141 4602675 5115121 5406094 6106261 6048919
14080F048919K60475K20572J581K32401m42326l21265p32980p56314j66577m86953
$$ 6048919 6309394 6529966 6531547 6763948 6321622 6000357 5267377 4511063 4344486 3857533
14070C857533j32013J43967j08823M72585j54356J08213L76342K66644K63445
$$ 3857533 3725520 3869487 3760664 4233249 4078893 4187106 4563448 4830092 5093537
14061E093537R93353K05346M71119P67711K59630P20348M14203O66237O50026
$$ 5093537 6086890 6292236 6763355 7531066 7790696 8511044 8925247 9591484 10241510
14052A0241510N15296Q51496N54203J310523J645435K483965K882384L886436
$$ 10241510 10756806 11608302 12162505 13473028 15118463 17602428 20484812 24371248
14044B4371248N225098O568903Q875214J2101180J3833797J4793204J2718062
$$ 24371248 29596346 36165249 45040463 57141643 70975440 85768644 98486706
14037I8486706J1342305Q034763N752337L481711J12888l110487p884895j3206238
$$ 98486706 109829011 117863774 123616111 127097822 127210710 124100223 116215328 103009090
14029A03009090j7074321j7334216j4966563j1588391q383008o246013m876476
$$ 103009090 85934769 68600553 53633990 42045599 33662591 27416578 22540102
14022B2540102l259642k677656k393606j574055j629791j015852r51393j069978
$$ 22540102 19280460 16602804 14209198 12635143 11005352 9989500 9038107 7968129
14014G968129n78483r95284l45377l83110j84883m00129m38053k70388J74263
$$ 7968129 7389646 6394362 6048985 5665875 5480992 5080863 4642810 4372422 4546685
14005D546685k53515m84362m5757l19366M2694j19741m9126O3566k44118o709
$$ 4546685 4293170 3808808 3763051 3443685 3486379 3366638 3317512 3381078 3136960 3130251
13995C130251J356j64159M7952j5460K72052K97748L75558J44808K71837M86410
$$ 3130251 3131607 2967448 3015400 2999940 3271992 3569740 3945298 4090106 4361943 4848353
13985D848353N25056M50254M60232M03948J42641j02623K73017J83892l00585
$$ 4848353 5373409 5823663 6283895 6687843 6830484 6727861 7000878 7184770 6884185
13976F884185p2124n37428p44614n98825l01505n04338j51759m08355j41391k55245
$$ 6884185 6812061 6274633 5530019 4931194 4629689 4125351 3973592 3565237 3423846 3168601
13966C168601q6291o0954j20154J63890J3371n20027r6907j67690P3301j35023
$$ 3168601 3082310 3021356 2901202 3065092 3078463 2558436 2461529 2293839 2367140 2232117
13956B232117n1424R7154L7157J4527K02925j69058K22093M45606j6443J42419
$$ 2232117 2180693 2277847 2315004 2329531 2532456 2363398 2585491 3031097 3014654 3157073
13946C157073M9120K87960K57066M27421N29877J057598J588381K368320L137227
$$ 3157073 3206193 3494153 3751219 4178640 4708517 5766115 7354496 9722816 12860043
13937A2860043L096558L414340L178062K714627J916817J046693M18865o42565
$$ 12860043 15956601 19370941 22549003 25263630 27180447 28227140 28646005 28003440
13929B8003440j956067l122074l717932m058373l900857l405931k335184j311009
$$ 28003440 26047373 22925299 19207367 15148994 11248137 7842206 5507022 4196013
13921D196013j042271m98676p9514k51271j66770P7428m22791k0827K46919k68685
$$ 4196013 3153742 2655066 2575552 2324281 2157511 2234939 1812148 1791321 2038240 1769555
13911A769555J81717J0595j04596Q9573k65380J41027p84k34754J97823j45571
$$ 1769555 1951272 1961867 1857271 1946844 1681464 1822491 1821707 1586953 1784776 1639205
13901A639205P6584k06303M8684J71531p7491P7286J34339q9301k33586k9001
$$ 1639205 1715789 1509486 1558170 1729701 1652210 1729496 1863835 1774534 1540948 1511947
13891A511947M08595j12012j79095R2008J82578j44446Q6022p5232m8802o7834
$$ 1511947 1920542 1808530 1629435 1721443 1904021 1759575 1845597 1770365 1721563 1653729
13881A653729L85323m11036j0801p6075j33906R22J50056k4790l0144Q3666p460
$$ 1653729 2039052 1628016 1617215 1541140 1407234 1408156 1558212 1533422 1503278 1586944 1579484
13870A579484l2426j17041K83589q3754J31877j75610J18899R4694J70399k54075
$$ 1579484 1547058 1430017 1713606 1629852 1761729 1586119 1705018 1799712 1970111 1716036
13860A716036J57001k00884J92966j06795j22034J7773R9391K8477N1736R7257
$$ 1716036 1873037 1672153 1865119 1758324 1636290 1654063 1753454 1781931 1833667 1930924
13850A930924j42692j01736M6455N6264k3103J32875k8138M3479k29838J9765
$$ 1930924 1788232 1686496 1732951 1789215 1766112 1898987 1870849 1914328 1684490 1704255
13840A704255J80609k53899k24064K48037Q2698j37807j24428Q1608K8763j61270
$$ 1704255 1884864 1630965 1406901 1654938 1737636 1599829 1475401 1557009 1585772 1424502
13830A424502R2925n028K45235l03257J82364K0263l3087J0813j67308j54149
$$ 1424502 1517427 1512399 1757634 1454377 1636741 1657004 1623917 1634730 1467422 1313273
13820A313273K84616l03802O4138n7983J96015k69831M85746j35621j84456j78861
$$ 1313273 1597889 1294087 1358225 1300242 1496257 1226426 1712172 1576551 1392095 1213234
13810A213234J12064J16803q4953J44616j97142J78729o3363j70659L33890o6369
$$ 1213234 1325298 1442101 1357148 1501764 1304622 1483351 1419988 1249329 1583219 1516850
13800A516850J82170q2561j68164P7669K51010q7473j48121K7691J91224j28471
$$ 1516850 1699020 1616459 1448295 1525964 1776974 1689501 1541380 1569071 1760295 1631824
13790A631824K36221l84587j02553K7384J49698l75008M1013p4209K93727j23104
$$ 1631824 1868045 1483458 1380905 1408289 1557987 1182979 1223992 1149783 1443510 1320406
13780A320406K50500j60843k05601J53263j76208J91526N4518Q0043l47918K85972
$$ 1320406 1570906 1410063 1204462 1357725 1181517 1373043 1427561 1507604 1159686 1445658
13770A445658J73835p7497k10564K08961j67337M8328N4978R4950N3606j29258
$$ 1445658 1619493 1541996 1331432 1540393 1373056 1421384 1476362 1571312 1624918 1495660
13760A495660J04284j79651k6162K37117j9350k74149K11445J52410K87233N8101
$$ 1495660 1599944 1420293 1394131 1631248 1611898 1337749 1549194 1701604 1988837 2046938
13750B046938r4785P2612q4726L19870m65095L00451j74339J6373j56836J10724
$$ 2046938 1952153 2024765 1940039 2259909 1794814 2095265 1920926 1937299 1780463 1891187
13740A891187k4880j07637j81290J19063n2536l4615q3047K10279k04815p350
$$ 1891187 1866307 1758670 1577380 1696443 1643907 1609292 1526245 1736524 1531709 1524359
13730A524359J33679k8672Q4985J65932k22844L7404m925j19808J60081R1571
$$ 1524359 1658038 1629366 1714351 1880283 1657439 1694843 1689918 1570110 1730191 1821762
13720A821762j71072J44346J92782m11082K09792j39118L13804n80082L41732
$$ 1821762 1650690 1795036 1987818 1576736 1786528 1647410 1961214 1381132 1722864
13711A722864K27768k59615k7805L86149k81174r771l7594K76970k41541N7908
$$ 1722864 1950632 1691017 1663212 2049361 1768187 1758416 1720822 1997792 1756251 1814159
13701A814159J83168r2740J69121j51858K54569J60215J61172J62771j70138L62367
$$ 1814159 1997327 1904587 2073708 1921850 2176419 2336634 2497806 2660577 2490439 2852806
13691B852806N1907J13679p0621Q0669m08399Q0988l86029l35518J296q7168Q0496
$$ 2852806 2904713 3018392 2947771 3028440 2620041 2701029 2315000 1979482 1980778 1893610 1974106
13680A974106J08543k74223J47188J01962j89054J13339k6292P5156j80154K23219
$$ 1974106 2082649 1808426 1955614 2057576 1868522 1981861 1955569 2030725 1850571 2073790
13670B073790K23993Q1404J60326K48670J13267J17874K86763K44000l7846J54908
$$ 2073790 2297783 2379187 2539513 2788183 2901450 3019324 3306087 3550087 3512241 3667149
13660C667149O0814l69522J30488k61745j19344n4822n36645j65885J35848j59237
$$ 3667149 3727963 3358441 3488929 3227184 3107840 3053018 2516373 2350488 2486336 2327099
13650B327099k76392k04749J36492l7557J60446j64089J04539l5221Q6849O3268
$$ 2327099 2050707 1845958 1982450 1944893 2105339 1941250 2045789 2010568 2097417 2160685
13640B160685k54991q8285L74056K75155Q020L56492J5143L46622k02176K11681
$$ 2160685 1905694 1817409 2191465 2466620 2474640 2831132 2846275 3192897 2990721 3202402
13630C202402n1008j1278j05677j64605L5837n84871k60307k9770j68861j46900
$$ 3202402 3151394 3140116 3034439 2869834 2905671 2320800 2060493 2030723 1861862 1714962
13620A714962M3459m7085M5603q6074n7958k911P275K72893j0096k0513J57964
$$ 1714962 1758421 1711336 1756939 1670865 1612907 1609996 1617271 1890164 1880068 1859555 2017519
13609B017519o5649L71042k75856J25926j30954L6715O3325o3711j25349k28947
$$ 2017519 1951870 2322912 2047056 2172982 2042028 2078743 2142068 2078357 1953008 1724061
13599A724061J63209n3064P1526k5204J09667o8860M2103n7447J12258R140j67018
$$ 1724061 1887270 1834206 1905732 1880528 1990195 1921335 1963438 1905991 2018249 2027389 1860371
13588A860371q7496J11116K38978k59976j60286Q994j70015P3863J50767l29919
$$ 1860371 1772875 1883991 2122969 1862993 1702707 1711701 1541686 1615549 1766316 1436397
13578A436397J17988q711J23175j14632J97355j48794m1821j80507J95036J47468
$$ 1436397 1554385 1545674 1668849 1554217 1751572 1602778 1560957 1380450 1575486 1722954
13568A722954l07707J27147K3508K6424K511J26863l43969R0375J98291o5840
$$ 1722954 1415247 1542394 1565902 1592326 1594837 1721700 1377731 1468106 1666397 1600557
13558A600557J01558p0668j93793Q4181L9513j62723j62076K69598j47285R9760
$$ 1600557 1702115 1631447 1437654 1521835 1561348 1398625 1236549 1506147 1358862 1458622
13548A458622k6711L39016j7155L25132J09716k14961K26058J59267J12399O4308
$$ 1458622 1431911 1770927 1753772 2078904 2188620 1973659 2199717 2358984 2471383 2535691
13538B535691o1956k8848j20908j99810J92167m69945j02119K2257j09574N5058
$$ 2535691 2473735 2444887 2323979 2124169 2316336 1846391 1744272 1766529 1656955 1712013
13528A712013P6067K18907J76273K23450N739l69103K87983l5275R8104j01807
$$ 1712013 1788080 2006987 2183260 2406710 2412449 2043346 2331329 2296054 2394158 2292351
13518B292351l1905m27703J63959m26229j61921J53857q3821J58897n37072K59482
$$ 2292351 2260446 1832743 1996702 1570473 1408552 1562409 1478588 1637485 1100413 1359895
13508A359895J3326j46382K31093k11195N542K93019l46251J8862j18201k9592
$$ 1359895 1373221 1226839 1457932 1246737 1252279 1545298 1199047 1217909 1099708 1070116
13498A070116M32414K3040k43902K64522k49278p3680K10598j38560J91785l05234
$$ 1070116 1502530 1525570 1281668 1546190 1296912 1223232 1433830 1295270 1487055 1181821
13488A181821J8347J9516K31273N4478n9041k87801L38639k07963L10353k45340
$$ 1181821 1200168 1219684 1450957 1505435 1446394 1158593 1497232 1289269 1599622 1354282
13478A354282J76996q9066j52997j20787O3936r6771J09081J59045l2585j59055
$$ 1354282 1531278 1442212 1289215 1168428 1232364 1135593 1244674 1403719 1371134 1212079
13468A212079J75945l8285j32447K48296m7997k00705J4637N5359l8880N7919
$$ 1212079 1388024 1349739 1217292 1465588 1417591 1216886 1231523 1286882 1248002 1305921
13458A305921M6635J42567m0067J24599K06652K81193p6249p871K76885R250j69788
$$ 1305921 1352556 1495123 1455056 1579655 1786307 2067500 1991251 1983380 2260265 2269515 2099727
13447B099727K86153j36136o8335m9310j61540k50445k2222j09031j42658J01141
$$ 2099727 2385880 2249744 2181409 2132099 1970559 1720114 1697892 1588861 1446203 1547344
13437A547344j68310K17707j47744K320k35035J11729J57606k2315j15149J57150
$$ 1547344 1379034 1596741 1448997 1451317 1216282 1328011 1485617 1463302 1348153 1505303
13427A505303k68791J31738K29094o443M97446R2656j14229L59156j94234R7625
$$ 1505303 1236512 1368250 1597344 1590901 2088347 2181003 2066774 2425930 2231696 2329321
13417B329321L75512l58323j43401j3863j76734k61680k21931J0955J05803j41108
$$ 2329321 2704833 2346510 2203109 2189246 2012512 1750832 1528901 1539856 1645659 1504551
13407A504551k39806K04178p1521R3463L9753j51204k8428J59750j83509J5952
$$ 1504551 1264745 1468923 1397402 1490865 1530618 1379414 1350986 1510736 1327227 1343179
13397A343179M9394L2640m1697J87576L353K57093k01228k1001J22152J95720
$$ 1343179 1392573 1425213 1383516 1571092 1574445 1831538 1630310 1609309 1731461 1927181
13387A927181O182O0101J55044J35435J4546M7284J9370j74183J16486Q3833j33792
$$ 1927181 1933363 1993464 2148508 2283943 2298489 2345773 2365143 2190960 2307446 2391279 2257487
13376B257487j00486j60605j28220j22307k45662J91619K19292K57089Q6954k40078
$$ 2257487 2157001 1996396 1868176 1745869 1500207 1691826 1911118 2168207 2255161 2015083
13366B015083l43499M74226o1032k08685M1248n9720k7091L50535l32940j34000
$$ 2015083 1671584 2145810 2084778 1876093 1917341 1857621 1830530 2181065 1848125 1714125
13356A714125M96352k46254J11265P6964N483j4782J22310Q6991J13531k36168
$$ 1714125 2210477 1964223 2075488 2152452 2157935 2143153 2265463 2352454 2465985 2229817
13346B229817j45709j54655J27988l2700J85606k87883Q7258r3446j02003J74883
$$ 2229817 2084108 1929453 2057441 2024741 2210347 1922464 2009722 1916276 1814273 1989156
13336A989156j59336K97358o2371j18406r8681L3487p780k83191M30437n4402
$$ 1989156 1829820 2127178 2064807 1946401 1847720 1881207 1873427 1590236 2020673 1966271
13326A966271j4117m4577k0988J36727j52415K26400M4878K57018j28878J13545
$$ 1966271 1952154 1907577 1886589 2023316 1870901 2097301 2142179 2399197 2270319 2383864
13316B383864j72206J86706J74K45079L66516k25348M9314k01754J47297K94982
$$ 2383864 2211658 2398364 2398538 2643617 3010133 2784785 2834099 2632345 2779642 3074624
13306C074624k80692k26122Q8893J5314L8191J78327J8382j06288n9120K07259
$$ 3074624 2793932 2567810 2656703 2672017 2710208 2888535 2906917 2800629 2741509 2948768
13296B948768J25944n7725J11732K10384j39563j56083L3445L9859k88745j55557
$$ 2948768 3074712 3016987 3128719 3339103 3199540 3043457 3076902 3116761 2828016 2672459
13286B672459J12310J68282m1372q6685J73824J24972q6601j36025K07210q9638
$$ 2672459 2784769 2953051 2911679 2824994 2998818 3123790 3037189 2901164 3108374 3018736
13276C018736J53357l4021K35166l20481M04556R6352j74638J27225Q468k2183
$$ 3018736 3172093 3138072 3373238 3052757 3457313 3553665 3379027 3506252 3514720 3492537
13266C492537P937J72343j40321K44539J40136K46947q9546j55328L95369m7658
$$ 3492537 3500474 3672817 3532496 3777035 3917171 4164118 4074572 3919244 4314613 4266955
13256D266955L00236J22964K84194J9287L76123j00861J06083J97836j88633J22235
$$ 4266955 4567191 4690155 4974349 4993636 5369759 5268898 5374981 5572817 5384184 5506419
13246E506419K45255Q450R0118M03290k95496J65107M6853j37429J8321O2085
$$ 5506419 5751674 5760124 5850242 6253532 5958036 6123143 6169996 6032567 6050888 6112973
13236F112973R1483J68996P8169L67820J31221K51969J95894L53402o2385J3336
$$ 6112973 6204456 6373452 6451621 6819441 6950662 7202631 7398525 7751927 7689542 7702878
13226G702878K04801J48823J80544J1306O8554K56203j0363k27474K9450l37122
$$ 7702878 7907679 8056502 8237046 8248352 8316906 8573109 8562746 8335272 8364722 8027600
13216H027600O7992j25049j39210M5794o4431k13570j57473J52873m96362L33897
$$ 8027600 8095592 7970543 7831333 7877127 7812696 7599126 7441653 7594526 7098164 7432061
13206G432061q2017N6461J38842j12126J91597k36725k3353M0531J73901k33234
$$ 7432061 7350044 7406505 7545347 7433221 7624818 7388093 7364740 7405271 7579172 7345938
13196G345938k32071j6556J22504l48170k20354M1458K919j16244k08728n8063
$$ 7345938 7113867 7097311 7219815 6871645 6651291 6692749 6695668 6579424 6370696 6312633
13186F312633k03386o0660l1086n7798Q6640J80696m41988J3882j07231K207k17119
$$ 6312633 6109247 6048587 6017501 5959703 6046343 6227039 5785051 5798933 5691702 5693909 5476790
13175E476790M0814l93915l494n2905J69111j33401J65072j27302J68325k5294
$$ 5476790 5517604 5123689 5120195 5067290 5236401 5103000 5268072 5140770 5309095 5283801
13165E283801L41339J0311p9102K98741L31843K05607R2539L11023L91455l9811
$$ 5283801 5625140 5635451 5556349 5855090 6186933 6392540 6485079 6796102 7187557 7147746
13155G147746M02891j5339j15320l3293m4328k71974j95331O3343O9918j58590
$$ 7147746 7550637 7535298 7419978 7386685 7342357 7070383 6875052 6938395 7008313 6849723
13145F849723j57132K40108K1509k44860m645m7462O533m53732l90028j35874
$$ 6849723 6692591 6932699 6954208 6709348 6704703 6657241 6663774 6210042 5820014 5684140
13135E684140l75198k81915k03137n22213O079k44281l7148K55429j11970J66599
$$ 5684140 5308942 5027027 4823890 4301677 4307756 4063475 4026327 4281756 4169786 4336385
13125D336385k16496J08635j5745O7694l12272O52j60960k03397j70164Q8087
$$ 4336385 4119889 4228524 4212779 4280473 3968201 3968853 3807893 3604496 3434332 3522419
13115C522419k98391J57403k6717l0670j56240J40072j59522J70497m7625J40962
$$ 3522419 3224028 3381431 3354714 3324044 3167804 3307876 3148354 3318851 3271226 3412188
13105C412188j76898j2669J82443j6766N54322j02442M5344M18693N08332M38607
$$ 3412188 3235290 3222621 3405064 3388298 3942620 3840178 3885522 4304215 4812547 5251154
13095E251154L78067K91535L37779K64322J95122K10986o3643J66635j35141k68339
$$ 5251154 5629221 5920756 6258535 6522857 6717979 6928965 6865322 7031957 6896816 6628477
13085F628477k27245J57892j32632M3587n6409k43538Q6608k29604n68986K9102
$$ 6628477 6401232 6559124 6426492 6470079 6413670 6170132 6256740 6027136 5458150 5487252
13075E487252m91541l97077k07144m91327j04153k19646m37706K1141j78832m5341
$$ 5487252 4995711 4598634 4391490 3900163 3796010 3576364 3138658 3159799 2980967 2935626
13065B935626J19869p0916K1899l31087J54568J07113J87094K7615o528M4022
$$ 2935626 3055495 2984579 3006478 2675391 2829959 2937072 3124166 3151781 3145253 3189275
13055C189275j158O5593k89574J31923J35980p3305j38439o3858M9600k15429
$$ 3189275 3188117 3253710 2964136 3096059 3232039 3158734 3020295 2956437 3006037 2790608
13045B790608R7168P3118o1553J04043r6990Q3738k3818J56990l66491L79361
$$ 2790608 2887776 2960894 2899341 3003384 2906394 2990132 2966314 3123304 2756813 3136174
13035C136174r0660M7209J90441l6815J24808R7207P1327M5476K09109r6838j66645
$$ 3136174 3045514 3092723 3283164 3246349 3371157 3468364 3539691 3585167 3794276 3697438 3530793
13024C530793j66355J99064J65689j070K3445m3285K45896J83194j27163j50740
$$ 3530793 3364438 3563502 3729191 3728121 3751566 3708281 3954177 4137371 4010208 3859468
13014C859468K40212J60246o6066J82867J54115K49275O6930J42786j67486K88046
$$ 3859468 4099680 4259926 4193860 4376727 4530842 4780117 4847047 4989833 4822347 5110393
13004E110393k65794N06844j5958M116J9682J03000J1741J02314R9507K37760
$$ 5110393 4844599 5351443 5335485 5339601 5359283 5462283 5474024 5576338 5675845 5913605
12994E913605j94599N38172K271J41940j37466Q8477R6706K28481j49391Q555
$$ 5913605 5719006 6257178 6259449 6401389 6263923 6352400 6449106 6677587 6528196 6536751
12984F536751m8506K63255m17659K49017q3265K2344l23577K27820k2193k43161
$$ 6536751 6488245 6751500 6333841 6582858 6499593 6521937 6198360 6426180 6403987 6160826
12974F160826L41071l42253L0083j97016p3238k69703K79244p3234l10566P534
$$ 6160826 6501897 6159644 6189727 5992711 5919473 5649770 5929014 5855780 5545214 5552748
12964E552748K25547k22470j3293J60159l11677j45953J65197J3174k22141P1277
$$ 5552748 5778295 5555825 5542532 5702691 5391014 5245061 5410258 5423432 5201291 5272568
12954E272568k7288K5736J04361J3109o4903J11926R9698j52607p4493O1383P7832
$$ 5272568 5245280 5271016 5375377 5388486 5323583 5435509 5535207 5382600 5308107 5369490 5447322
12943E447322q1156j13730M7946j5626K14125j09453j77403N43431k10708j69112
$$ 5447322 5366166 5252436 5300382 5284756 5498881 5389428 5212025 5755456 5544748 5375636
12933E375636M87608l31524J91273P5063J67414j54045K6686j21678M2358p4135
$$ 5375636 5863244 5531720 5722993 5798056 5965470 5811425 5838111 5716433 5758791 5684656
12923E684656k09891J27003l0779J22178j32321N2209j74137o4376j04007m8750
$$ 5684656 5474765 5601768 5570989 5693167 5560846 5613055 5438918 5374542 5270535 5221785
12913E221785j30383j91281M3962k85376P7784l59002N0084J40587m10325m0957
$$ 5221785 5091402 4900121 4944083 4658707 4736491 4377489 4427573 4568160 4157835 4116878
12903D116878Q9508k21526j04614M9535J4798k12633j35969J52449L5438k09363
$$ 4116878 4206386 3984860 3880246 3929781 3944579 3731946 3595977 3748426 3783864 3574501
12893C574501q524q0505O249j8653j69094J78J3101N1643n2842r2703k8601L1762
$$ 3574501 3565977 3485472 3491721 3473068 3303974 3304152 3317253 3368896 3316054 3223351 3194750 3226512
12881C226512j89819K23588M9123j3523k05797K71988j49364k33689J06116l02910
$$ 3226512 3036693 3260281 3309404 3295881 3090084 3362072 3212708 2979019 3085135 2782225
12871B782225J36087j84104K3744K32230j43455j15897Q8928q2570J48179j24906
$$ 2782225 2918312 2734208 2757952 2990182 2846727 2730830 2819758 2737188 2885367 2760461
12861B760461Q0465K8551j72391j03194Q2791J2724J38706l2320n2091J1484j57576
$$ 2760461 2840926 2869477 2697086 2593892 2676683 2689407 2828113 2795793 2743702 2755186 2597610
12850B597610k4933R0697R9327j36910L648K23495o6066k06795n674J34498J36869
$$ 2597610 2572677 2663374 2762701 2625791 2629439 2852934 2786868 2580073 2574399 2708897 2845766
12839B845766N3771m03722J63491k5318j21686K19702j56443K63846j23452j7498
$$ 2845766 2899537 2495815 2659306 2633988 2512302 2732004 2575561 2839407 2715955 2698457
12829B698457o5675K03568l0678l63295j6951J83436n9985L60859l00030L27025
$$ 2698457 2632782 2836350 2805672 2442377 2425426 2608862 2548877 2909736 2609706 2936731
12819B936731l09547J54273j46536j25966L59805k03154o6819K05620m1866k98011
$$ 2936731 2627184 2781457 2634921 2508955 2868760 2665606 2598787 2804407 2762541 2464530
12809B464530L27698J01252n40353M47720p5785M9725k6932j81789Q6221r2964
$$ 2464530 2792228 2893480 2353127 2800847 2725062 2774787 2747855 2566066 2652287 2559323
12799B559323Q6324J24363J39942m3207n1321j14677J16993M0494K7567Q2473
$$ 2559323 2645647 2770010 2909952 2866745 2815424 2700747 2817740 2858234 2885801 2968274
12789B968274J05543l87137K41493m4735o202P9304m3824l39187L54391o1191
$$ 2968274 3073817 2686680 2928173 2883438 2877236 2956540 2912716 2573529 2927920 2866729
12779B866729K7737j77570M7505r4629J37873o485m8758p9499P9326K01711l10897
$$ 2866729 2894466 2716896 2764401 2669772 2807645 2801160 2752402 2672903 2752229 2953940 2643043
12768B643043K59439l9786J00832j57793J23234Q4309k96758J28676J1436K13100
$$ 2643043 2902482 2862696 2963528 2805735 2928969 3013278 2716520 2845196 2856632 3069732
12758C069732K36j97032J20142P9212j85811P982k17046L85257K3584k55044J34761
$$ 3069732 3069968 2872936 2993078 3072290 2886479 2894461 2677415 3062672 3086256 2831212 2965973
12747B965973q4992q9928J03193M4542l1279K08360j06955O0458J68379j62253
$$ 2965973 2880981 2791053 2894246 2938788 2907509 3115869 3008914 3069372 3237751 3075498
12737C075498J0095K17288k15277j91605n3334K98969k06051J37048J70675j11510
$$ 3075498 3085593 3302881 3087604 2895999 2842665 3141634 2935583 3072631 3243306 3131796
12727C131796k39319J90032k46916J41361M022l2577J07801M3931o9056J82848
$$ 3131796 2892477 3082509 2835593 2976954 2980976 2948399 3056200 3100131 3031075 3213923
12717C213923j46791j7790L1860J09378K4012J62327l54810K85348p1337o5964
$$ 3213923 3067132 3049342 3081202 3190580 3214592 3376919 3022109 3307457 3236120 3170156
12707C170156K89656o332K57231K9855q2039m8248K00211Q2950J14425k2598P3184
$$ 3170156 3459812 3453480 3710711 3740566 3658527 3610279 3810490 3893440 4007865 3985267 4058451
12696D058451N7318L21293J06234K83915L51674M60014P45812O82065M29901N10656
$$ 4058451 4115769 4437062 4543296 4827211 5178885 5638899 6384711 7066776 7496677 8007333
12686H007333J23618L02111k10436j53023p9868l85719o33853p49609p27563n39719
$$ 8007333 8130951 8433062 8222626 8069603 7989735 7604016 6970163 6220554 5492991 4953272
12676D953272k43039j18240R9j29888p5051K9553k1686N8635L58170o9228K35679
$$ 4953272 4710233 4591993 4592092 4462204 4387153 4416706 4395020 4453655 4811825 4742597 4978276
12665D978276J77966m09087J80193J97781k01358k65822l1290K71566P4727k63312
$$ 4978276 5156242 4747155 4927348 5125129 4923771 4657949 4626659 4898225 4972952 4709640
12655D709640L20039N6728J59246K44668J67545L91764L84901j30110K8165M06648
$$ 4709640 5029679 5086407 5245653 5490321 5657866 6049630 6434531 6304421 6332586 6739234
12645F739234J24357J39276l63902k19940m670j42899n9581j17689K75172K59398
$$ 6739234 6863591 7002867 6638965 6419025 6414355 6271456 6211875 6094186 6369358 6628756
12635F628756j59929J35569k46789K60088j26143J64979L78727L07002j79124
$$ 6628756 6468827 6604396 6357607 6617695 6491552 6656531 7035258 7342260 7163136
12626G163136N8578l25121N6470J59991j94629k06413j86787l84173m19928j88026
$$ 7163136 7221714 6896593 6953063 7113054 6918425 6712012 6525225 6141052 5721124 5533098
12616E533098k21243j19302r7721J69189J3341O91460L21859J49722M93216J75847
$$ 5533098 5311855 5192553 5094832 5264021 5277362 5968822 6290681 6440403 6933619 7109466
12606G109466N30883M28209j22370K96600m52908j33868m87618k40659m80907
$$ 7109466 7640349 8068558 7946188 8242788 7789880 7656012 7168394 6927735 6446828
12597F446828j63477p09190k83038O276r1164J55421O9826K94316J59784R4137
$$ 6446828 6283351 5574161 5291123 5297399 5206235 5361656 5431482 5725798 5885582 5979719
12587E979719R8944J68655J19255o3369J82278R8033l8143P8272L94761j73571
$$ 5979719 6078663 6247318 6366573 6303204 6485482 6583515 6545372 6623644 7018405 6844834
12577F844834p0918M2487j60564K82636k08886k75137j09531j49402l78579n14574
$$ 6844834 6773916 6816403 6655839 6938475 6729589 6454452 6344921 6195519 5816940 5302366
12567E302366k23258l90597K5903J37388k18101O0680J40548j1873r8169J03140
$$ 5302366 5079108 4688511 4714414 4851802 4633701 4694381 4834929 4823056 4724887 4828027
12557D828027o5013q738J95727j73161j99660n4061K35944L5921J52725J48454
$$ 4828027 4763014 4754276 4950003 4776842 4577182 4523121 4759065 4794986 4947711 5096165
12547E096165j91033J98253j09376O3425K10541J85703J60051K33851k35154K78321
$$ 5096165 4905132 5103385 4994009 5057434 5267975 5453678 5613729 5847580 5612426 5890747
12537E890747J95102j13155P2569j23269O0346m19782j86618k54681k27923j33453
$$ 5890747 6085849 5972694 6045263 5921994 5982340 5562558 5375940 5121259 4893336 4759883
12527D759883J27027Q5605k25450K07025r0519J78297k82723K05402J74761R3911
$$ 4759883 4886910 4972515 4747065 4954090 4863571 5041868 4759145 4964547 5139308 5233219
12517E233219j89994J60927L63724J17725N31766P34095j31303N79130J66875
$$ 5233219 5043225 5204152 5567876 5685601 6217367 6951462 6820159 7399289 7566164
12508G566164J27913Q103O9309p810k8289m01676p50420m38900n08626l47136
$$ 7566164 7694077 7702180 7771489 7763679 7735390 7333714 6583294 6144394 5635768 5288632
12498E288632r8903q1065K77146m65374L70816j24398j58666J86199j58541J28526
$$ 5288632 5189729 5108664 5385810 4920436 5291252 5166854 5008188 5194387 5035846 5164372
12488E164372k10138L48522J12928N8533L23699J75489J64321K20202L10525Q2669
$$ 5164372 4954234 5302756 5415684 5474217 5797916 5973405 6137726 6357928 6668453 6751122
12478F751122L9574N4288J39494k65308j23794k43014n70954N9062l36129J69532
$$ 6751122 6790696 6844984 6984478 6719170 6595376 6352362 5781408 5840470 5504341 5673873
12468E673873j7467k77944O8202o3997K00786R2905M9433j63394O6551K74338
$$ 5673873 5656406 5378462 5446664 5382667 5583453 5676358 5725791 5562397 5628948 5903286
12458E903286l1041J01473L16654J43394r6735L62690j1887K67374m8975K62408
$$ 5903286 5872245 5973718 6290372 6433766 6337031 6699721 6687834 6955208 6906233 7168641
12448G168641J11580J72214L20371K47805j31243O01363p1970K31426J15590k881
$$ 7168641 7280221 7452435 7772806 8020611 7889368 8490731 8418761 8650187 8765777 8762896
12438H762896M1490J21167M4098n4165J28271J2600N5574K73143o4932J66278
$$ 8762896 8804386 8925553 8969651 8915486 9043757 9056357 9111931 9385074 9320142 9486420
12428I486420L12568J91885l5597J00528N35578N6339J81164K66788K91833J58508
$$ 9486420 9798988 9990873 9955276 10055804 10591382 10647721 10828885 11095673 11387506 11546014
12418A1546014K37115O39636J90945J52713N00167K49091K73041K39196O3214
$$ 11546014 11783129 12422765 12613710 12766423 13266590 13515681 13788722 14027918 14091132
12409A4091132k95703J32506M0835m00218k64534k20563k68304Q372k18034o4546
$$ 14091132 13795429 13927935 13968770 13568552 13304018 13083455 12815151 12823523 12605489 12540943
12399A2540943l0463k11564J76755J34508j32027K55010J4096K71694M46532K80982
$$ 12540943 12510480 12298916 12475671 12610179 12478152 12733162 12747258 13018952 13465484 13746466
12389A3746466L34069K91169P09150j38362O38135M41249J52967N87994N0763
$$ 13746466 14080535 14371704 15080854 14942492 15580627 16021876 16174843 16762837 16813600
12380A6813600M0750l0306L7152K35627p0200k3820q0030k54876J33702Q0176
$$ 16813600 16854350 16824044 16861196 17096823 17026623 17002803 16922773 16667897 16801599 16881775
12370A6881775j30442j2447Q5902k23720K2803l6240J0068k51876L12910j58008
$$ 16881775 16751333 16738886 16824788 16601068 16623871 16587631 16597699 16345823 16658733 16500725
12360A6500725k14052n1753K4763k86697M4193j74752m7293q6185k4537j53095
$$ 16500725 16286673 16234920 16259683 15972986 16017179 15842427 15795134 15708949 15684412 15531317
12350A5531317N6380m16486j01578l25397p2595n4161O7966m0542J81784l4662
$$ 15531317 15587697 15171211 15069633 14744236 14671641 14617480 14685446 14644904 14826688 14792026
12340A4792026j05145Q25687K89431L84407J09960N12574K59772N10032M64366
$$ 14792026 14686881 15512568 15801999 16186406 16296366 16808940 17068712 17578744 18043110
12331A8043110M06679J74193K85469L38266J33504M18400J53739L35118j2561
$$ 18043110 18449789 18623982 18909451 19247717 19381221 19799621 19953360 20288478 20275917
12322B0275917m3905K23480k84683M45358j27331m511k2026l0731J50686K9830
$$ 20275917 20232012 20455492 20170809 20616167 20488836 20484325 20462299 20431568 20582254 20612084
12312B0612084j6065N1902J74024M14074J66180M59238M18145L91779J64868K91183
$$ 20612084 20596019 20647921 20821945 21236019 21402199 21861437 22279582 22671361 22836229 23127412
12302B3127412l4312L4442J11007k51847l20904o02035o70652M3456p76053m43209
$$ 23127412 23093100 23127542 23238549 22986702 22665798 22063763 21393111 21436567 20660514 20217305
12292B0217305m92389j79219l85979k96229p861k55916m87422k68503n68493q06563
$$ 20217305 19724916 19545697 19159718 18863489 18855628 18599712 18112290 17843787 17275294 16468731
12282A6468731n84728l29841p90618k23133l13124n07274j71855j36268k75560
$$ 16468731 15884003 15554162 14763544 14540411 14227287 13720013 13548158 13411890 13136330
12273A3136330k09623O1968k00947j56165j3979R0103j92630L1091n7185k71095
$$ 13136330 12926707 12988675 12787728 12631563 12617584 12707687 12515057 12546148 12488963 12217868
12263A2217868R7555O770k8634J2093J56337j44664K16844K37463M92845M29678
$$ 12217868 12315423 12322193 12293559 12305652 12461989 12317325 12534169 12771632 13264477 13694155
12253A3694155P20622M90697P97644N38471R15171J205925J103168J273373R39607
$$ 13694155 14414777 14905474 15703118 16241589 17156760 18362685 19465853 20739226 21678833
12244B1678833Q41152J083030M73461O71892L33592K66762M38468m22941O1932
$$ 21678833 22519985 23603015 24076476 24748368 25081960 25348722 25787190 25364249 25426181
12235B5426181l88343l34052k87556m86062q2300p16165k96997l88143o53331
$$ 25426181 25037838 24703786 24416230 23930168 23847868 23131703 22834706 22446563 21793232
12226B1793232p76622p03797j229273j015015j218616p74614j193668p71452n92247
$$ 21793232 21016610 20312813 19083540 18068525 16849909 16075295 14881627 14110175 13517928
12217A3517928o11725k61425o08709m08066j05773m54546p9422j76051k75894
$$ 13517928 12906203 12644778 12036069 11628003 11522230 11067684 10988262 10812211 10536317
12208A0536317l31967k44179k59650j98203j60734K03248j31642M4079J71425
$$ 10536317 10204350 9960171 9700521 9502318 9341584 9544832 9413190 9457269 9628694
12199I628694N8798j22478Q1045K16208j74937L40013r3078o161M30440J29335
$$ 9628694 9687492 9565014 9646059 9862267 9687330 10027343 9934265 9928104 10358544 10487879
12189A0487879M16533k1516L77272p3800K93165J76623J73555J69070J36468j37073
$$ 10487879 10904412 10882896 11260168 11186368 11479533 11656156 11829711 11998781 12135249 11998176
12179A1998176J07935k93093Q8473M3405r5951j094k9500k48151O9083r8253n9468
$$ 11998176 12106111 11813018 11901491 11944896 11848945 11847851 11818351 11570200 11639283 11541030 11481562
12168A1481562J19072J18057J392M14575L56728J22363O73957M09851R0844M26970
$$ 11481562 11600634 11718691 11720083 12134658 12491386 12613749 13287706 13697557 13788401 14215371
12158A4215371K38357O1850L51688j88189O322J3797k43364j63810J536J7382
$$ 14215371 14453728 14515578 14867266 14679077 14685399 14699196 14455832 14292022 14293558 14310940
12148A4310940L39482N43946N71588O88109N96244N71168L83079O58229M37733
$$ 14310940 14650422 15194368 15765956 16454065 17050309 17621477 18004556 18662785 19100518
12139A9100518O69083L44165Q13267J130273O98436Q51186J114911J539105J342487
$$ 19100518 19769601 20113766 20927033 22057306 22755742 23606928 24721839 26260944 27603431
12130B7603431K061147J774351J997741J966613J783806J368706J609092J028763
$$ 27603431 29664578 31438929 33436670 35403283 37187089 38555795 40164887 41193650
12122D1193650R04676K93024N08044k39072n86374n44058q16648n62623j137767
$$ 41193650 42098326 42391350 42899394 42660322 42073948 41529890 40713242 40150619 39012852
12113C9012852q52564p31187m26314o70746n09203r35853m99737p09393k85125
$$ 39012852 38160288 37429101 37002787 36332041 35822838 34886985 34387248 33677855 33392730
12104C3392730j80036J93742K19490j11064l2969K4576j20546j95960j95276m10392
$$ 33392730 33212694 33406436 33625926 33514862 33481893 33506469 33385923 33189963 32994687 32584295
12094C2584295l47479p13184k57061p56773j11325K08002J91097N46995O99607
$$ 32584295 32236816 31523632 31266571 30509798 30398473 30606475 30797572 31344567 32044174
12085C2044174P08051Q26267Q60044J058515L89116J59333J89862m03231p9570
$$ 32044174 32752225 33578492 34438536 35497051 35886167 36045500 36235362 35832131 35752561
12076C5752561O3215j6764k5090l27510k48701l42878n15649m05618j156404q39160
$$ 35752561 35815776 35799012 35773922 35446412 35197711 34854833 34339184 33933566 32777162 31938002
12066C1938002p62415j019523j113001j016881q61209r31542q03075j67180n01274
$$ 31938002 31175587 30156064 29043063 28026182 27164973 26233431 25430356 25263176 24761902
12057B4761902m85374k99178m80465l02596l17750m76866q46331k09552m76167
$$ 24761902 24276528 23977350 23496885 23194289 22876539 22399673 21553342 21343790 20867623
12048B0867623m19554n29135K9704m95613m21848m84175n0381k11002n98698k90838
$$ 20867623 20448069 19918934 19948638 19453025 19031177 18547002 18496621 18285619 17686921 17396083
12038A7396083n75522k62372k70302k97300k74180J79992K7769L94513L53501
$$ 17396083 16820561 16558189 16287887 15990587 15716407 15896399 15924168 16318681 16672182
12029A6672182K94467L93209M40722j52513K65380j58864O1881p60375n68725
$$ 16672182 16966649 17359858 17800580 17648067 17913447 17754583 17816464 17056089 16487364
12020A6487364o64431o40695m86138n31066q89361j00465m89286r7997n27858
$$ 16487364 15822933 15182238 14696100 14165034 13275673 13175208 12685922 12587925 12060067
12011A2060067j08188n6009m99674j40152k89937k42024N6596k54877N64659J15536
$$ 12060067 11951879 11895870 11396196 11256044 10966107 10724083 10780679 10525802 11090461 11205997
12001A1205997J40933K87471j29165P7990j96587k73565j65359l79502j48103
$$ 11205997 11346930 11634401 11505236 11583226 11386639 11113074 10947715 10568213 10420110
11992A0420110k40953k64709k34234j10609j3971j98497o4835J61289l38786k03672
$$ 10420110 10179157 9914448 9680214 9569605 9555634 9357137 9292302 9453591 9114805 8911133
11982H911133k40570k07493k16377j68125k02484k06504n4321m3459o9121N579
$$ 8911133 8670563 8463070 8246693 8078568 7876084 7669580 7615259 7571800 7502679 7508258
11972G508258k60389k26881M5299k25483k71559l99319j10207k61726j67540j10437
$$ 7508258 7247869 7020988 7066287 6840804 6569245 6169926 6059719 5797993 5630453 5520016
11962E520016J11765K44576r9195O4479J16581K75173Q5176k24032K36933Q7305
$$ 5520016 5631781 5876357 5777162 5841641 5958222 6233395 6318571 6094539 6331472 6418777
11952F418777m4949k06784L25166Q2409j66516k10649Q3790K96093J27322K82524
$$ 6418777 6373828 6167044 6492210 6574619 6408103 6197454 6281244 6577337 6704659 6987183
11942F987183K9769M63644R5236K18338p1052J94957J26525K07248O8291J731
$$ 6987183 7016952 7480596 7575832 7794170 7723118 7918075 8044600 8251848 8320139 8321870
11932H321870K624q3735J17350l16981q962R6774r6081k65528K8803l14143k43899
$$ 8321870 8324494 8240759 8358109 8041128 8032166 8128940 8032859 7767331 7796134 7481991 7238092
11921G238092l72070Q1960j15679m13835P8777l74529J9837k59447K5617J44555
$$ 7238092 6866022 6947982 6832303 6418468 6497245 6122716 6142553 5883106 5908723 6053278
11911F053278O98815K288108L099776J669070J382720O85407Q44782L58370N37516
$$ 6053278 6752093 9040201 12139977 13809047 15191767 15877174 16721956 17080326 17617842
11902A7617842Q2103n98653p34839l923377l487733k538996n45363n56879k41230
$$ 17617842 17699945 17101292 16366453 12443076 8955343 6416347 5870984 5314105 5072875
11893E072875J94547n7997m3581J37301L51490J28593P35822M41907O98319M51240
$$ 5072875 5267422 5209425 5165844 5303145 5654635 5783228 6519050 6960957 7659276 8110516
11883H110516N05627M25734P37430K85263j50182J64503K0363m98538o59538m73513
$$ 8110516 8616143 9041877 9779307 10064570 9914388 10078891 10099254 9600716 8941178 8467665
11873H467665q26369l57386j64182o91055m67578k51439n21831j68993N9564l46697
$$ 8467665 7641296 7283910 7119728 6428673 5961095 5709656 5187825 5018832 5078396 4731699
11863D731699J37339p26775Q8421J50017q3808J21036J9392j24839J34003J47742
$$ 4731699 4869038 4142263 4230684 4380701 4296893 4417929 4437321 4312482 4446485 4594227
11853D594227J79366N9181P8398P9777K24990K43719K23819L53341K42177L92927
$$ 4594227 4773593 4832774 4911172 4990949 5215939 5459658 5683477 6036818 6278995 6671922
11843F671922M84176L32712M63150j22143R2611j32312P9311K62934j50369m75130
$$ 6671922 7156098 7488810 7951960 7829817 7922428 7790116 7869427 8132361 7981992 7506862
11833G506862j5195k77576l17835j45520k19968R8146R4702l53112j04839J5374
$$ 7506862 7491667 7214091 6896256 6750736 6530768 6628914 6723616 6370504 6265665 6281039
11823F281039n05792n05243m03300k29068m40369k18002q5698j1237n693j11257
$$ 6281039 5775247 5270004 4866704 4637636 4197267 3979265 3893567 3882330 3876637 3765380
11813C765380l84633K43404q9997q7554Q633N9142K864j25247j78289R9229j5110
$$ 3765380 3380747 3624151 3534154 3446600 3455233 3514375 3517239 3391992 3213703 3312932 3297822
11802C297822j55535m5221J93508J07056k87086J22383J46651N6934J88665O8049
$$ 3297822 3142287 3097066 3290574 3397630 3110544 3232927 3379578 3436512 3625177 3693226
11792C693226J12235J25913L75350M18466L06656L16731R9361K22224j09993m9810
$$ 3693226 3805461 3931374 4306724 4725190 5031846 5348577 5447938 5670162 5560169 5510359
11782E510359Q6235k79955k87657m49772n59841k90362l79674r8605K7439K265
$$ 5510359 5596594 5316639 5028982 4579210 4019369 3729007 3349333 3250728 3278167 3280432
11772C280432o5108k45282j6304k79879J08335J48300J39203k12455R2571j85852
$$ 3280432 3215324 2970042 2953738 2673859 2782194 2930494 3069697 2857242 2949813 2763961
11762B763961j3591r5862L22343k37806j79374K51475J958j42514J45742j28150
$$ 2763961 2750370 2654508 2976851 2739045 2559671 2811146 2813104 2670590 2816332 2688182
11752B688182r3476j10582L0030K39438o6858L929n9077J03626k42084K89102
$$ 2688182 2594706 2484124 2514154 2753592 2686734 2690663 2631586 2735212 2493128 2782230
11742B782230k37169J95712M269l31168O6929J84384k42159O9518p829O8983l9618
$$ 2782230 2545061 2740773 2745042 2413874 2480803 2665187 2423028 2492546 2484717 2553700 2514082
11731B514082o0436J5701P5508m2640J47637k90429Q837M169J98073q8290j17820
$$ 2514082 2453646 2469347 2544855 2502215 2649852 2359423 2368260 2372429 2570502 2482212 2364392
11720B364392J06458j80132L79757k11169k19213J31543K09318r3870j05858P8969
$$ 2364392 2470850 2290718 2670475 2459306 2240093 2371636 2580954 2487084 2381226 2460195
11710B460195R1634l38037M27616j95369J50728L7559j11045j2337j59626K63176
$$ 2460195 2551829 2213792 2641408 2446039 2596767 2634326 2523281 2510944 2351318 2614494
11700B614494R6481r6550j36832P1553P8861N1665J32455k21052O0510L7477k8980
$$ 2614494 2710975 2614425 2477593 2549146 2628007 2679672 2812127 2591075 2651585 2689062 2660082
11689B660082J3370k08638J21475J3983M0633J17079N1717o1222J97616j13474
$$ 2660082 2673452 2464814 2586289 2600272 2640905 2757984 2809701 2748479 2946095 2832621
11679B832621j06240O5636K47737k3540J7182j20472J02306j59907J96286l3549
$$ 2832621 2726381 2792017 3039754 3016214 3033396 2912924 3015230 2855323 3051609 3018060
11669C018060o1726J34539j95124K80092k22951J54771k57757J94796j06262j12021
$$ 3018060 2956334 3090873 2895749 3175841 2952890 3107661 2849904 3044700 2938438 2826417
11659B826417j431J97697J01154n3572M5421l5208o1243q5054J64620k89301J09018
$$ 2826417 2824986 3022683 3123837 3070265 3115686 3080478 3019235 2934181 3098801 2809500 2918518
11648B918518J3254k75801K88780L1082m7429o0113k50115K09894n2979l4116
$$ 2918518 2931772 2655971 2944751 2975833 2928404 2868291 2618176 2828070 2775091 2740975
11638B740975O914L6834J32422P4376j41905O1245j49738l4319j7692J00512J04774
$$ 2740975 2747889 2784723 2917145 2991521 2849616 2910861 2761123 2726804 2709112 2809624 2914398
11627B914398j28775J48722j14576j63618R2692O2973j35646O4736r2519P1416
$$ 2914398 2785623 2934345 2819769 2656151 2748843 2811816 2676170 2740906 2648387 2719803
11617B719803j24763o9055L51775r1659k81478J23986j63702L10680K465p6491
$$ 2719803 2595040 2525985 2877760 2786101 2504623 2628609 2464907 2775587 2778052 2701561
11607B701561k04165K57777M8084M0190k9969P4560J38672P7047j11646J13016
$$ 2701561 2497396 2755173 2803257 2843447 2813478 2888038 3026710 3103757 2992111 3105127
11597C105127j10652q165j60840K37717k04097N6162k80972M01220j09045k40390
$$ 3105127 2994475 2986310 2825470 3063187 2859090 2915252 2634280 3035500 2926455 2686065
11587B686065J76153l1495J44544J06505j18923M7043j91412L05449k1478J50706
$$ 2686065 2862218 2830723 2975267 3081772 2962849 3009892 2818480 3123929 3102451 3253157
11577C253157r8716l2931K08957L1263j20100K8301j55153J4149J84432k05334
$$ 3253157 3154441 3121510 3330467 3361730 3241630 3269931 3114778 3128927 3313359 3108025
11567C108025R2128k50503J26218j11809j975Q0248k7121r3889K08946r6823O1343
$$ 3108025 3200153 2949650 3075868 2964059 2962084 3042332 3015211 2921322 3130268 3033445 3094788
11556C094788j80158M5859K33551m9399p6014j3845k69034K46575J12362r8622
$$ 3094788 2914630 2960489 3194040 3144641 3068627 3054782 2785748 3032323 3144685 3046063
11546C046063k67390J56994j20891m581J63080j15326K3923j27506J86678Q743
$$ 3046063 2778673 2935667 2814776 2810195 2973275 2857949 2881872 2754366 2941044 2949787
11536B949787k6803j88333K02835L2003p1949j01302J89938k76953L27580m8115
$$ 2949787 2922984 2734651 2937486 2969489 2897540 2796238 2986176 2709223 3036803 2988688
11526B988688n3635J13556k83731K76751J15315l23946J89233j38924M6994l0248
$$ 2988688 2935053 3048609 2764878 3041629 3156944 2832998 3022231 2883307 2930301 2900053
11516B900053R3701j47216K61748m15384M11699K2503Q50J6655k6312m3895j2931
$$ 2900053 2993754 2846538 3108286 2692902 3104601 3127104 3127954 3144609 3118297 3074402 3061471
11505C061471j70885K79790r5302J18993m5669j663q4990J05842j7090r7625j2808
$$ 3061471 2890586 3170376 3075074 3194067 3148398 3146735 3061745 3167587 3150497 3052872 3040064
11494C040064P717L3274j97088l7773L02932k5199J58349J36561k54114K500M9229
$$ 3040064 3047781 3081055 2883967 2846194 3149126 3123927 3282276 3418837 3164723 3167223 3216452
11483C216452Q6429j81393p5653L53646k88173O8545K47909p0731k1108P1763
$$ 3216452 3302881 3121488 3045835 3399481 3111308 3179853 3427762 3357031 3335923 3407686
11473C407686l7869m5754j0213q5920J9276J037K8851k25669L16185q4380J35453
$$ 3407686 3369817 3324063 3313850 3227930 3247206 3248243 3277094 3051425 3367610 3283230 3418683
11462C418683j41477K6121k05940j53699K15957L2476p1049N7359m4960r0399
$$ 3418683 3277206 3303327 3097387 2943688 3159645 3192121 3121072 3178431 3133471 3043072
11452C043072L10473l51175M2009L1981J99159m60938L00466r9118M47851l28937
$$ 3043072 3353545 3002370 3044379 3076360 3275519 2814581 3115047 3015929 3463780 3134843
11442C134843J46031j64153N7607J02177m8503M6741n5296J60418R7401j37191
$$ 3134843 3280874 3116721 3174328 3276505 3228002 3274743 3219447 3379865 3477266 3340075
11432C340075L64345n1741k28723J47749K18698j07506Q1309l423q7105K75331
$$ 3340075 3704420 3652679 3423956 3571705 3790403 3682897 3764206 3760783 3673678 3949009
11422C949009K7115r7230L40822l11968K24936L75735l73981K31005n8290j99151
$$ 3949009 3976124 3878894 4219716 3907748 4132684 4508419 4134438 4365443 4307153 4108002
11412D108002K85858j643K8138J00453j86000L59637J6617J96769k20087P5580
$$ 4108002 4393860 4392217 4420355 4520808 4334808 4694445 4711062 4907831 4687744 4763324
11402D763324r1554K76986L0098J76542k45864L97222j29826J88601J12498J21515
$$ 4763324 4671770 4948756 4978854 5155396 4909532 5306754 5176928 5365529 5478027 5599542
11392E599542Q6601j1180k2520L49272K2006j9780K98812j69391K31710l17353
$$ 5599542 5686143 5674963 5652443 6001715 6023721 6003941 6302753 6133362 6365072 6047719
11382F047719M90974J8022j28076K50349P197J72216o7278K63291p7204o2309
$$ 6047719 6538693 6556715 6428639 6678988 6686185 6858401 6791123 7054414 6977210 6914901
11372F914901J37815N8102J88727j68565K3893K7086K07103l1504K35624k41639
$$ 6914901 7052716 7110818 7299545 7130980 7154873 7181959 7389062 7357558 7593182 7351543
11362G351543j48042J69479J26131k24983M28645r4826j03755Q544m6587J75922
$$ 7351543 7203501 7372980 7499111 7274128 7702773 7607947 7504192 7512736 7466149 7642071
11352G642071L0833j34644J43762r1808j23164J24726m5085l55351K55379J70973
$$ 7642071 7672904 7538260 7682022 7590214 7467050 7591776 7546691 7191340 7446719 7617692
11342G617692l46840n5641J49450j46628P5802j71471n0475l718o6714r4226Q3723
$$ 7617692 7270852 7215211 7364661 7218033 7293835 7122364 7071889 7068171 7001457 6907231 6990954
11331F990954k61962Q9105k59030j55186L09340l57220O1331q1661k18349J48528
$$ 6990954 6728992 6818097 6559067 6403881 6713221 6356001 6417332 6335671 6117322 6265850
11321F265850l11760l8681j21725J5650j62657k6436j47903n6264n5644j34837
$$ 6265850 5954090 5915409 5793684 5809334 5646677 5620241 5472338 5416074 5360430 5225593
11311E225593j90897l2670r5290N3456k13918q6474r7287k57377J75863j6037
$$ 5225593 5034696 5002026 4906736 4960192 4746274 4659800 4562513 4305136 4480999 4464962
11301D464962n744j60840r3010k50417K0218k3804j4469K11365k53934j91577
$$ 4464962 4459218 4298378 4205368 3954951 3975169 3951365 3936896 4148261 3894327 3702750
11291C702750O4670M0316j99608p3168N5978l48607j0883J56322k22776R2026
$$ 3702750 3767420 3807736 3608128 3534960 3590938 3242331 3231448 3387770 3164994 3257020
11281C257020Q7279n2336k50471J01175j74269P0119l9201K7964P6972j77166
$$ 3257020 3344299 3291963 3041492 3142667 2968398 3038517 2999316 3027280 3104252 2927086
11271B927086m9789L08954l29421J13344j74579K19137m8863k12851J49476j26600
$$ 2927086 2877297 3186251 2856830 2970174 2795595 3014732 2965869 2753018 2902494 2775894
11261B775894O1352j84184Q7732m9286J13909j41731Q5573j1652o7251J1070j27115
$$ 2775894 2837246 2653062 2740794 2691508 2805417 2663686 2749259 2737607 2670356 2681426 2554311
11250B554311Q2226n0519J87239j36717Q5265j56694K00377Q0717k23578P6264
$$ 2554311 2636537 2586018 2773257 2636540 2721805 2565111 2765488 2846205 2622627 2698891
11240B698891k13073L05317j65245Q0447j92137J59345l15021K45242m8527m5985
$$ 2698891 2485818 2791135 2625890 2706337 2514200 2673545 2358524 2603766 2555239 2509254
11230B509254Q0543P3143K31882L21116J53961P67362Q88698O78995M71064M34554
$$ 2509254 2589797 2662940 2894822 3215938 3369899 4137261 5025959 5704954 6176018 6610572
11220F610572K90897M42275J25114j68917j37442m89510q40014j169676p32973
$$ 6610572 6901469 7343744 7468858 7299941 7162499 6672989 5832975 4663299 3930326
11211C930326p16139j14436k26624N3713q3515k44497L09964k79600k3107K04588
$$ 3930326 3214187 3099751 2873127 2926840 2843325 2598828 2908792 2629192 2606085 2810673
11201B810673J81635k4470r5155K48511L09072P23230J165791N10166M67815Q8132
$$ 2810673 2992308 2967838 2872683 3121194 3430266 4153496 5319287 5829453 6297268 6385400
11191F385400Q11611Q0574j11857K2002j96968m44354j106279q16528q25743k56077
$$ 6385400 7197011 7277585 7165728 7187730 6990762 6546408 5440129 4623601 3797858 3541781
11181C541781n33962k48998K09833l68893J56834j96050J17703J2792r3529J0299
$$ 3541781 3007819 2758821 2968654 2599761 2756595 2560545 2678248 2691040 2597511 2607810
11171B607810L22844J6911r0075n9905M8898J02633k33779K29391j58178K00561
$$ 2607810 2930654 2947565 2857490 2797585 2846483 2949116 2715337 2944728 2786550 2987111
11161B987111q3596J13260p6181p0353J51280j70469o8608J52489r9350l527K77371
$$ 2987111 2903515 3016775 2940594 2870241 3021521 2851052 2782444 2934933 2835583 2832056 3109427
11150C109427j63327k5197m3678J76010J00434q8257j11402K54206j58786K01429
$$ 3109427 2946100 2920903 2877225 3053235 3153669 3065412 2954010 3208216 3049430 3250859
11140C250859n1080K7547Q9820K05747l01698J61237k80698K78179k19886M32927
$$ 3250859 3199779 3227326 3317146 3522893 3221195 3382432 3101734 3379913 3160027 3592954
11130C592954k86977j57339J89458r9486J11917P3850k08689N00581m87698J87963
$$ 3592954 3305977 3148638 3338096 3238610 3350527 3424377 3215688 3716269 3228571 3416534
11120C416534O6395m3041K98450m55163R9117J61869m0609J96982k99651J0763
$$ 3416534 3482929 3439888 3738338 3283175 3382292 3544161 3503552 3700534 3400883 3411646
11110C411646K26005k072L7398q648k11976j05562K61804N1404q782k37787Q610
$$ 3411646 3637651 3635579 3672977 3664329 3452353 3346791 3608595 3659999 3651217 3413430 3422040
11099C422040K82203k24721K22794k07994R3496J09766p453k38993k081j9470
$$ 3422040 3704243 3479522 3702316 3494322 3587818 3697584 3690131 3451138 3449057 3429587
11089C429587n119j41189l741Q719K15019q5061J01203l704J2506n1022j30172
$$ 3429587 3424468 3283279 3279538 3288257 3503276 3418215 3519418 3515714 3528220 3477198 3347026
11078C347026j67468K45332J8914p7857L00753J3698k66314R3212K66736j43975
$$ 3347026 3179558 3424890 3443804 3365947 3666700 3680398 3414084 3507296 3774032 3630057
11068C630057j11282m0519m295L36326l430J39989J09908j85816K87471K9137
$$ 3630057 3518775 3478256 3473961 3810287 3806857 3946846 4056754 3870938 4158409 4187546
11058D187546J0243l66456N21079j35628K1498j15829R3978n064K9215L4890J96438
$$ 4187546 4197789 3831333 4352412 4216784 4238282 4122453 4216431 4211367 4240582 4275472 4471910
11047D471910k78755L24828J45448j83425R7345m6262J37182K58J92152p1617
$$ 4471910 4193155 4517983 4663431 4480006 4577351 4531089 4668271 4668529 4860681 4789064
11037D789064J61478K36658j1201k2572L00912R6901j88480M75994k246J21315
$$ 4789064 4950542 5187200 5175999 5153427 5454339 5551240 5362760 5838754 5836508 5957823
11027E957823J48965K19752k36831K19771K05171Q2974l5294Q1131K9918L53487
$$ 5957823 6106788 6326540 6089709 6309480 6514651 6597625 6562331 6643462 6673380 7026867
11017G026867j74788M988O2007L06798J32715l5273P3256K30153R5679J73559
$$ 7026867 6852079 6857067 6919074 7225872 7358587 7323314 7396570 7626723 7722402 7895961
11007G895961L0592N06368J44640k1386L95890Q8874M37906l81799K45294L50292
$$ 7895961 7926553 8432921 8577561 8556175 8952065 9040939 9478845 9097046 9342340 9692632
10997I692632k7476j42235J62446L54962r8855J59338J93446j2140j57233K66481
$$ 9692632 9665156 9522921 9685367 10040329 9941474 10100812 10294258 10282118 10124885 10391366
10987A0391366J01658k0788J93810J73938L40539O07186J29425M32683J02123
$$ 10391366 10493024 10472236 10666046 10839984 11180523 11787709 11917134 12349817 12451940
10978A2451940M07589K20758K57194K26167K12442J93728k22761q1865R6497K02324
$$ 12451940 12859529 13080287 13337481 13563648 13776090 13969818 13747057 13665192 13761689 13964013
10968A3964013K95560J34874M58692L16743K69243M64782M05188j22964P15248
$$ 13964013 14259573 14394447 14853139 15169882 15439125 15903907 16309095 16186131 16901379
10959A6901379K39233L37001M64884N91987N72085N81584L87529K42756M02764
$$ 16901379 17140612 17477613 17942497 18534484 19106569 19688153 20075682 20318438 20721202
10950B0721202N56686K94284M81718j27818L96024Q0124L05292K73799M48753
$$ 20721202 21277888 21572172 22053890 21926072 22322096 22402220 22707512 22981311 23430064
10941B3430064L08143L99672N48170P06987M57171L51580Q14307K92447N75198
$$ 23430064 23738207 24137879 24686049 25393036 25850207 26201787 27016094 27308541 27883739
10932B7883739M64448L85590M54213O17538N85076K41260N19499Q35941P2937
$$ 27883739 28348187 28733777 29187990 29805528 30390604 30631864 31151363 31987304 32060241
10923C2060241P13576R5335J60173O65991n3103L37396R3468j25095k04488o0598
$$ 32060241 32773817 32869152 33029325 33695316 33642213 33979609 34073077 33947982 33743494 33682896
10913C3682896j92871j48701m4246o0400m0992K36033q3339k32823L22715J97612
$$ 33682896 33490025 33341324 33297078 33236678 33195686 33431719 33348380 33115557 33438272 33635884
10903C3635884j23695L63499L14236N122N29637K79114K82983N86155N28149M37086
$$ 33635884 33512189 33875688 34189924 34195046 34724683 35003797 35286780 35872935 36401084 36838170
10893C6838170Q13103P98168O14728J217606J245509J109719J508307J447272
$$ 36838170 37651273 38449441 39064169 40281775 41527284 42637003 44145310 45592582
10885D5592582K033238K197050K261981K703233K801779L313131K879179L074012
$$ 45592582 47625820 49822870 52084851 54788084 57589863 60902994 63782173 66856185
10877F6856185K928360L048470K574862J890890J903484O36527R25851o06346
$$ 66856185 69784545 72833015 75407877 77298767 79202251 79838778 80764629 80158283
10869H0158283n92019j254428j809679k209549k449324k944800k881641k968601
$$ 80158283 79566264 78311836 76502157 74292608 71843284 68898484 66016843 63048242
10861F3048242k947160l028358k947645k862498k896905k876653k515020k425812
$$ 63048242 60101082 57072724 54125079 51262581 48365676 45489023 42974003 40548191
10853D0548191k246265k147767k121315k006621j813624j731345j743240j699445
$$ 40548191 38301926 36154159 34032844 32026223 30212599 28481254 26738014 25038569
10845B5038569j265367j034484j563806r69634q53406j108446j096813q69610
$$ 25038569 23773202 22738718 21174912 20205278 19351872 18243426 17146613 16277003
10837A6277003p11233n07681r53874m30954o13755m05845r01498k57910m56965
$$ 16277003 15565770 15058089 14104215 13673261 13059506 12653661 11752163 11494253 11037288
10828A1037288o62582k18712j36318p87371r7739n46378k3317k77794k13988m70275
$$ 11037288 10374706 10155994 10019676 9232305 9134566 8588188 8564871 8287077 8073089 7602814
10818G602814J54150k73550l26326M2237k32934j23319j37836k40325q3377M6300
$$ 7602814 7756964 7483414 7157088 7199325 6966391 6843072 6705236 6464911 6381534 6427834
10808F427834k25991p1341K7242k99574j14157k4113q9826q0698j73868l19690
$$ 6427834 6201843 6130502 6157744 5858170 5744013 5719900 5630074 5549376 5375508 5055818
10798E055818k52162j0379j61789l1103r5108K63077l91774R860R6292k77967
$$ 5055818 4803656 4793277 4631488 4600385 4505277 4768354 4376580 4386440 4482732 4204765
10788D204765j9100k74825Q6683k627p9324J09682j75936Q7714j10834k36635
$$ 4204765 4185665 3910840 3997523 3994896 3915572 4025254 3849318 3937032 3826198 3589563
10778C589563J85392j94879j39719o8852J53287j84215o5281l4432J43489j92466
$$ 3589563 3774955 3580076 3440357 3371505 3524792 3340577 3275296 3240864 3384353 3191887
10768C191887l2546J56650j65029j87836R1354k65060Q7497L13382l55931k8901
$$ 3191887 3159341 3315991 3150962 2963126 3054480 2789420 2876917 3190299 2834368 2805467
10758B805467J81862J82775k07732o8021O2417r7414R0120j7823J62640q6456
$$ 2805467 2987329 3170104 2962372 2894351 2956768 2859354 2949474 2931651 3094291 3007835
10748C007835R7065l40204K80477j56853P4826k80543k08290J61636l29378J61502
$$ 3007835 3104900 2764696 3045173 2888320 2963146 2682603 2474313 2635949 2306571 2468073
10738B468073j80406K70725n2683m8716J51556j13255m5522K13565J27582j47447
$$ 2468073 2287667 2558392 2505709 2456993 2608549 2495294 2449772 2663337 2790919 2643472
10728B643472N1909j65041K60682P144l9949k0629j85597J25589M7704j20356
$$ 2643472 2695381 2530340 2791022 2798166 2758217 2737588 2551991 2677580 2725284 2604928
10718B604928j06659P0685k01206J48631r3301j47334K97465k54934K50421M6271
$$ 2604928 2498269 2568954 2367748 2516379 2423078 2275744 2573209 2318275 2568696 2614967
10708B614967k67987J11479n2973J31861K7340j63516j16685K21064L8080j97034
$$ 2614967 2346980 2458459 2405486 2537347 2564687 2401171 2284486 2505550 2543630 2346596
10698B346596J33718l4778R8749J00264j05827k76912K69052j09063k09693K03898
$$ 2346596 2480314 2445536 2544285 2644549 2538722 2261810 2530862 2421799 2212106 2416004
10688B416004M9046r3891j16545j15661Q3476j33715J45110O2238J7555J58666
$$ 2416004 2465050 2371159 2254614 2138953 2222429 2088714 2233824 2296062 2313617 2472283
10678B472283o2544K21983K13671p9303q3642j63800L28924L4069j55217L3733
$$ 2472283 2409739 2631722 2845393 2766090 2682448 2518648 2847572 2881641 2726424 2760157
10668B760157k76045j44087p9030k3314M9658m7563l0350P6293m57793L00651
$$ 2760157 2484112 2340025 2260995 2237681 2287339 2239776 2209426 2285719 1827926 2128577
10658B128577o4061l8472K28653K86487o1227J10509q49J06135r0542J57197p6704
$$ 2128577 2064516 2026044 2254697 2541184 2479957 2590466 2589617 2695752 2605210 2762407 2685703
10647B685703j17812P6614q2204l65738R0j39625j20415l08980K99710r612J345
$$ 2685703 2567891 2644505 2562301 2196563 2196653 2057028 1936613 1627633 1927343 1917731 1919076
10636A919076j31402l9885j56940m4772L95695l0989k8443k11852K88808l11055
$$ 1919076 1787674 1747789 1590849 1546077 1941772 1910783 1882340 1670488 1959296 1648241
10626A648241R6214j15675o983j20305K53221K0740O9780k4309n4327q7271K61789
$$ 1648241 1744455 1628780 1621797 1501492 1754713 1775453 1845233 1820924 1766597 1679326 1941115
10615A941115n5839j20089j49340J50726J02903k12356k9353n4241L43537l31527
$$ 1941115 1885276 1765187 1615847 1766573 1869476 1657120 1627767 1573526 1917063 1585536
10605A585536K81146j21745l6212J25163m8617p8128j12634R8974k03724K90040
$$ 1585536 1866682 1744937 1708725 1833888 1785271 1707143 1594509 1693483 1489759 1779799
10595A779799j9051O0517m7105j05327O2200K64825M4718l67847p6226J78459
$$ 1779799 1760748 1821265 1774160 1668833 1731033 1995858 2040576 1672729 1596503 1774962
10585A774962m01896L18403J76289j44886k10718J75800l05276L02497k7669N19208
$$ 1774962 1373066 1691469 1867758 1722872 1512154 1687954 1382678 1685175 1657506 2176714
10575B176714m82020L89725l44602J69411k0877l32529L8303l5104J6776J8931
$$ 2176714 1694694 2084419 1739817 1909228 1888351 1555822 1594125 1559021 1575797 1594728
10565A594728p645J76957k65394j46774K87699l22388N7141J19529j9761J3808
$$ 1594728 1587083 1764040 1498646 1351872 1639571 1317183 1374324 1493853 1474092 1487900
10555A487900p5234J80458j67456J2573j72070L18923j11189j45265J24606J62872
$$ 1487900 1412666 1593124 1425668 1438241 1266171 1585094 1473905 1328640 1453246 1616118
10545A616118k76859J01823j25840q3821J31686N5334p4684k79826L10749j8697
$$ 1616118 1339259 1441082 1315242 1231421 1363107 1418441 1343757 1063931 1374680 1355983
10535A355983J11830J11509j27461J1512j08011J43306j99638P775K75193Q8066
$$ 1355983 1467813 1579322 1451861 1463373 1355362 1498668 1299030 1306805 1581998 1670064
10525A670064l27900L67595p6413K05936r4927O8121L54268J91487j9245l3355
$$ 1670064 1342164 1709759 1633346 1839282 1744355 1812476 2166744 2358231 2338986 2305631
10515B305631q2861K73831q9145p2821K07048k41394m37402k34413O3574N1056
$$ 2305631 2222770 2496601 2407456 2334635 2541683 2300289 1862887 1628474 1692048 1743104
10505A743104l44870K83892j02517r672K65204q7412q4612J25961k822p0419K58552
$$ 1743104 1398234 1682126 1579609 1569937 1835141 1747729 1663117 1789078 1786256 1715837 1974389
10494A974389N5508j10451K66254K15718m2839L13357J2912j72278J28261m4821
$$ 1974389 2029897 1919446 2185700 2401418 2358579 2671936 2684848 2512570 2640831 2596010
10484B596010J27046k16142k35932j36590k58182M8592p1452j8271K64358k1626
$$ 2596010 2723056 2506914 2270982 2134392 1876210 1924802 1853350 1835079 2099437 2077811
10474B077811l40924L44574k27212J24025M9885Q9733j4160J98016R2704j79929
$$ 2077811 1736887 2081461 1854249 1978274 2028159 2117892 2103732 2301748 2394452 2214523
10464B214523K33548J55275m6979P6053J52986k40118K06498k82903j27046l56859
$$ 2214523 2448071 2603346 2556367 2632420 2785406 2545288 2751786 2468883 2341837 1984978
10454A984978K86546p0881j76950K72089j89398K24997j95403J03227K97580n899
$$ 1984978 2271524 2200643 2023693 2295782 2106384 2331381 2135978 2239205 2536785 2530886
10444B530886j92304K39065n7912J1178K49001N11745J50575M5613J43770J95801
$$ 2530886 2338582 2577647 2519735 2530913 2779914 3291659 3442234 3487847 3631617 3827418
10434C827418m7423N2034k18872m237k90986m40025l31519j35653p9122n1690
$$ 3827418 3779995 3832029 3613157 3608920 3317934 2877909 2546390 2410737 2331615 2279925
10424B279925j70163J04207j00224K2185J21006l089p245o6115p6570J30208J6364
$$ 2279925 2109762 2213969 2113745 2135930 2256936 2253847 2246602 2180487 2103917 2234125 2250489
10413B250489M5151K03784J41881J29077L87981m3616K03293L7103K87743K99084
$$ 2250489 2295640 2499424 2641305 2770382 3158363 3114747 3318040 3355143 3642886 3941970
10403C941970k16608j33838J33202n10486K13358K43887R1674L47558l63121J02341
$$ 3941970 3725362 3591524 3724726 3214240 3427598 3671485 3763159 4110717 3747596 3849937
10393C849937O7483L56971J17375l908K14163k11277J91928k10987l1156K12975
$$ 3849937 3917420 4274391 4391766 4387858 4602021 4390744 4582672 4371685 4340529 4553504
10383D553504R622Q6008J13123K23339j44278J95670J57318j62297N8672J03546
$$ 4553504 4563126 4649134 4762257 4985596 4841318 5036988 5194306 5032009 5090681 5194227
10373E194227J2709N4486J46136J04818M3593j9042m5531N7980n9079J42401j51588
$$ 5194227 5206936 5261422 5407558 5512376 5555969 5536927 5491396 5549376 5490297 5632698 5481110
10362E481110n3769P1181k71020q3639r9737k39595J44546l32166K69361P4745
$$ 5481110 5427341 5498522 5227502 5143863 5044126 4804531 4949077 4616911 4886272 4961017
10352D961017J40630l12078Q3177j49511J25396l44294J31032R4778k45662k00105
$$ 4961017 5101647 4789569 4872746 4723235 4848631 4504337 4635369 4730147 4484485 4284380
10342D284380n1616m8974L184j9063k45548N46714j68030K09288m72L3851Q9052
$$ 4284380 4232764 4183790 4186974 4167911 3922363 4469077 4301047 4510335 4509863 4543714 4632766
10331D632766M163l4245o994j09055j32108P9630j66410j62557M06076k94812
$$ 4632766 4636929 4602684 4595690 4486635 4354527 4434157 4267747 4105190 4511266 4216454
10321D216454R997P9976j21375J00981K7152j32775J88595R9572j39934M247J83886
$$ 4216454 4226451 4306427 4185052 4286033 4313185 4180410 4369005 4468577 4328643 4332890 4516776
$$ [...]
##END NTUPLES=NMR SPECTRUM
##END=
