##TITLE=Coffee green (M1-ROVE80 + 1.5mL buffer 50/50,  450uL extracto + 50uL (D2O+TMS))
without heating, vortex and centrifuged, temperature 0oC.
##JCAMPDX= 6.0         $$ Bruker NMR JCAMP-DX V2.0
##DATA TYPE= NMR SPECTRUM
##DATA CLASS= NTUPLES
##ORIGIN= Bruker BioSpin GmbH
##OWNER= Administrator
$$ 1.72 TOPSPIN		Version 2.1
$$ 2012-05-22 16:15:07.184 -0700  Administrator@X
$$ Compression mode = diff/dup
##.OBSERVE FREQUENCY= 400.13188198
##.OBSERVE NUCLEUS= ^1H
##.ACQUISITION MODE= SIMULTANEOUS (DQD)
##.ACQUISITION SCHEME= undefined
##.AVERAGES= 64
##.DIGITISER RES= 22
##SPECTROMETER/DATA SYSTEM= spect
##.PULSE SEQUENCE= noesygppr1d
##.SOLVENT NAME= H2O+D2O
##.SHIFT REFERENCE= INTERNAL, H2O+D2O, 1, 14.97969
##AUDIT TRAIL= $$ (NUMBER, WHEN, WHO, WHERE, PROCESS, VERSION, WHAT)
$$ ##TITLE= Audit trail, TOPSPIN		Version 2.1
$$ ##JCAMPDX= 5.01
$$ ##ORIGIN= Bruker BioSpin GmbH
$$ ##OWNER= Administrator
$$ $$ C:/Bruker/TOPSPIN/data/jwist/nmr/11-coffee-green-quantification-2/261/pdata/1/auditp.txt
$$ ##AUDIT TRAIL=  $$ (NUMBER, WHEN, WHO, WHERE, PROCESS, VERSION, WHAT)
(   1,<2011-11-18 14:15:59.747 -0500>,<Administrator>,<TOPSPIN>,<go>,<TOPSPIN 2.1>,
      <created by zg
	started at 2011-11-18 14:07:05.075 -0500,
	POWCHK enabled, PULCHK disabled,
       configuration hash MD5:
       DA 63 81 1B EF 4C B5 72 B4 DF EA D9 B4 DB 4C 08
       data hash MD5: 64K
       D6 4E F0 BD 8E FE 72 42 D3 75 7C A3 08 31 5B 54>)
(   2,<2011-11-18 15:25:38.575 -0500>,<Administrator>,<TOPSPIN>,<proc1d>,<TOPSPIN 2.1>,
      <Start of raw data processing
       efp LB = 0 FT_mod = 6 PKNL = 1 PHC0 = 0 PHC1 = 0 SI = 32K 
       data hash MD5: 32K
       8B 06 E4 E2 DD E4 DE CA F2 E3 37 57 52 F0 5D 27>)
(   3,<2011-11-18 15:25:38.950 -0500>,<Administrator>,<TOPSPIN>,<proc1d>,<TOPSPIN 2.1>,
      <pk PHC0 = 25.40039 PHC1 = 0 
       data hash MD5: 32K
       CA A4 B0 79 A8 B2 80 14 C0 21 8E 60 96 6E F1 4A>)
$$ ##END=
$$ 
$$ $$ hash MD5
$$ $$ 30 A1 DC C0 38 E9 09 F5 82 3B C1 B6 95 76 05 C3
##$RELAX= 
##$RELAX= 
##$RELAX= 
##$RELAX= 
##$RELAX= 
$$ Bruker specific parameters
$$ --------------------------
##$DU= <Z:>
##$EXPNO= 261
##$NAME= <11-coffee-green-quantification-2>
##$PROCNO= 1
##$TYPE= <nmr>
##$USER= <jwist>
##$ACQT0= -8.20729578910422
##$AMP= (0..31)
100 100 100 100 100 100 100 100 100 100 100 100 100 100 100 100 100 100
100 100 100 100 100 100 100 100 100 100 100 100 100 100
##$ANAVPT= -1
##$AQSEQ= 0
##$AQ_mod= 3
##$AUNM= <au_prof>
##$AUTOPOS= <>
##$BF1= 400.13
##$BF2= 400.13
##$BF3= 400.13
##$BF4= 400.13
##$BF5= 400.13
##$BF6= 400.13
##$BF7= 400.13
##$BF8= 400.13
##$BYTORDA= 0
##$CFDGTYP= 0
##$CFRGTYP= 9
##$CHEMSTR= <none>
##$CNST= (0..63)
1 1 145 1 1 1 1 1 1 1 1 1 1 1 1 1 1 1 1 1 1 1 1 1 1 1 1 1 1 1 1 1 1 1 1
1 1 1 1 1 1 1 1 1 1 1 1 1 1 1 1 1 1 1 1 1 1 1 1 1 1 1 1 1
##$CPDPRG= <>
##$CPDPRG1= <>
##$CPDPRG2= <>
##$CPDPRG3= <>
##$CPDPRG4= <mlev>
##$CPDPRG5= <mlev>
##$CPDPRG6= <mlev>
##$CPDPRG7= <mlev>
##$CPDPRG8= <mlev>
##$CPDPRGB= <>
##$CPDPRGT= <>
##$D= (0..63)
$$ [...]
##$TP= (0..7)
150 150 150 150 150 150 150 150
##$TP07= 0
##$TPNAME0= <>
##$TPNAME1= <>
##$TPNAME2= <>
##$TPNAME3= <>
##$TPNAME4= <>
##$TPNAME5= <>
##$TPNAME6= <>
##$TPNAME7= <>
##$TPOAL= (0..7)
0.5 0.5 0.5 0.5 0.5 0.5 0.5 0.5
##$TPOFFS= (0..7)
0 0 0 0 0 0 0 0
##$TUNHIN= 0
##$TUNHOUT= 0
##$TUNXOUT= 0
##$USERA1= <user>
##$USERA2= <user>
##$USERA3= <user>
##$USERA4= <user>
##$USERA5= <user>
##$V9= 5
##$VALIST= <valist>
##$VCLIST= <CCCCCCCCCCCCCCC>
##$VD= 0
##$VDLIST= <DDDDDDDDDDDDDDD>
##$VPLIST= <PPPPPPPPPPPPPPP>
##$VTLIST= <TTTTTTTTTTTTTTT>
##$WBST= 2048
##$WBSW= 25
##$XGAIN= (0..3)
0 0 0 0
##$XL= 0
##$YL= 0
##$YMAX_a= 5426814
##$YMIN_a= -1627268
##$ZGOPTNS= <>
##$ZL1= 120
##$ZL2= 120
##$ZL3= 120
##$ZL4= 120
##$ABSF1= 0
##$ABSF2= 0
##$ABSG= 0
##$ABSL= 0
##$ALPHA= 0
##$AQORDER= 0
##$ASSFAC= 0
##$ASSFACI= 0
##$ASSFACX= 0
##$ASSWID= 0
##$AUNMP= <proc_prof1d>
##$AXLEFT= 0
##$AXNAME= <>
##$AXNUC= <1H>
##$AXRIGHT= 0
##$AXTYPE= 0
##$AXUNIT= <>
##$AZFE= 0.1
##$AZFW= 0.1
##$BCFW= 0
##$BC_mod= 0
##$BYTORDP= 0
##$COROFFS= 0
##$CY= 15
##$DATMOD= 1
##$DC= 0
##$DFILT= <>
##$DTYPP= 0
##$F1P= 0
##$F2P= 0
##$FCOR= 0.5
##$FTSIZE= 32768
##$FT_mod= 6
##$GAMMA= 0
##$GB= 0
##$INTBC= 1
##$INTSCL= 1
##$ISEN= 128
##$LB= 0
##$LEV0= 0
##$LPBIN= 0
##$MAXI= 10000
##$MC2= 0
##$MEAN= 0
##$ME_mod= 0
##$MI= 0
##$NCOEF= 0
##$NC_proc= -7
##$NLEV= 6
##$NOISF1= 0
##$NOISF2= 0
##$NSP= 0
##$NTH_PI= 0
##$NZP= 0
##$OFFSET= 14.97969
##$PC= 1
##$PHC0= 25.40039
##$PHC1= 0
##$PH_mod= 1
##$PKNL= yes
##$PPARMOD= 0
##$PPDIAG= 0
##$PPIPTYP= 0
##$PPMPNUM= 2147483647
##$PPRESOL= 1
##$PSCAL= 4
##$PSIGN= 0
##$PYNMP= <proc.py>
##$REVERSE= no
##$SF= 400.13
##$SI= 32768
##$SIGF1= 0
##$SIGF2= 0
##$SINO= 400
##$SIOLD= 32768
##$SPECTYP= <>
##$SREGLST= <1H.CDCl3>
##$SSB= 0
##$STSI= 32768
##$STSR= 0
##$SW_p= 8223.68421052631
##$SYMM= 0
##$S_DEV= 0
##$TDeff= 65536
##$TDoff= 0
##$TI= <>
##$TILT= no
##$TM1= 0
##$TM2= 0
##$TOPLEV= 0
##$USERP1= <user>
##$USERP2= <user>
##$USERP3= <user>
##$USERP4= <user>
##$USERP5= <user>
##$WDW= 1
##$XDIM= 32768
##$YMAX_p= 545007555
##$YMIN_p= -263480123
##$CURPLOT= <Network HP LaserJet P1505>
##$CURPRIN= <$Network HP LaserJet P1505>
##$DFORMAT= <normdp>
##$LAYOUT= <+/1D_H.xwp>
##$LFORMAT= <normlp>
##$PFORMAT= <normpl>
##$SURQMSG= 1
$$ End of Bruker specific parameters
$$ ---------------------------------
##NTUPLES= NMR SPECTRUM
##VAR_NAME=  FREQUENCY,     SPECTRUM/REAL,   SPECTRUM/IMAG
##SYMBOL=    X,             R,               I
##VAR_TYPE=  INDEPENDENT,   DEPENDENT,       DEPENDENT
##VAR_FORM=  AFFN,          ASDF,            ASDF
##VAR_DIM=   32768,         32768,           32768
##UNITS=     HZ,            ARBITRARY UNITS, ARBITRARY UNITS
##FACTOR=    0.250966925370066, 1,           1
##FIRST=     8223.43324360094, -53,          -338301
##LAST=      0,             175950,          -84756
##MIN=       0,             -263480123,      0
##MAX=       8223.43324360094, 545007555,    0
$$ Real data points
##PAGE= N=1
##DATA TABLE= (X++(R..R)), XYDATA
$$ [...]
19417B483425l69812K09798o09941O21427M9707l8286j68692l19047J00255K9003
$$ 2483425 2113613 2323411 1713470 2334897 2384604 2346318 2177626 1858579 1958834 1987837
19407A987837K48728K90199o83155P86972o33685n2329J33327j40052L79658k2120
$$ 1987837 2236565 2526764 1843609 2630581 1996896 1944567 2077894 1937842 2317500 2295380
19397B295380n66540L20161J0345r1321n43788L9180P23965j50785J08348j41451
$$ 2295380 1728840 2049001 2059346 1968025 1424237 1463417 2187382 2036597 2144945 2003494
19387B003494r8758P941O56159n55432K57072n05844J74419K9350P7086k89784
$$ 2003494 1904736 1912677 2568836 2013404 2270476 1764632 1939051 1968401 2045487 1755703
19377A755703n9594N81332J4383m67100K14430J80536m59263K926L62275j22746
$$ 1755703 1696109 2277441 2291824 1824724 2039154 2219690 1760427 1763353 2125628 2002882
19367B002882p9075N995q9092P8647K44662l97699M55356n31424N85876p3631
$$ 2002882 1923807 1929802 1840710 1919357 2164019 1766320 2221676 1690252 2276128 2202497
19357B202497j52293P1648n06808M05385K03034j3700p8893k16k89747l69903
$$ 2202497 2050204 2121852 1615044 2020429 2223463 2209763 2130870 2130654 1840907 1471004
19347A471004P42196p62498L88106R4654K55965j91205j46054K19208m04937J97903
$$ 1471004 2213200 1450702 1838808 1933462 2189427 1998222 1852168 2071376 1666439 1864342
19337A864342N44426m39260K09504k2877k21054K34395j44059m7847l25342L4768
$$ 1864342 2408768 1969508 2179012 2156135 1935081 2169476 2025417 1977570 1652228 1686996
19327A686996K46566j92246M9647M90092m03172J44504l21603j80443M19051Q209
$$ 1686996 1933562 1741316 1790963 2281055 1877883 2022387 1700784 1520341 1939392 1947601
19317A947601p9947m74028K37852O33642k76485n94316N99960P0346K04569n93187
$$ 1947601 1867654 1393626 1631478 2265120 1988635 1394319 1994279 2064625 2269194 1676007
19307A676007M65146j90567q6140r9453J32310K38985k57785o5899K33260k0579
$$ 1676007 2141153 1950586 1864446 1764993 1897303 2136288 1878503 1812604 2045864 2025285
19297B025285L36950l28209j42493k63559P29225k18905Q0836k55815J99997j15520
$$ 2025285 2362235 2034026 1891533 1627974 2357199 2138294 2219130 1963315 2163312 2047792
19287B047792l8748J0972R3526m53074J82727k71106M37507m40043N25699r0851
$$ 2047792 2009044 2020016 2113542 1660468 1843195 1572089 2009596 1569553 2095252 2004401
19277B004401j57836L66746k23582j64793J23856j26622L89398j16285O944l20588
$$ 2004401 1846565 2213311 1989729 1824936 1948792 1822170 2211568 2095283 2102227 1781639
19267A781639L3395J33419N790J87945k98665k16449K69123J57407n81627K13920
$$ 1781639 1815034 1948453 1954243 2142188 1843523 1627074 1896197 2053604 1471977 1685897
19257A685897L16533n5337L27024j011704Q18711J93899l42179j41553J87203
$$ 1685897 2002430 1947093 2274117 1262413 2081124 2275023 1932844 1791291 1978494
19248A978494k76959k73162P60363k11831K20465M85897N5455M04110K81515k7040
$$ 1978494 1701535 1428373 2188736 1976905 2197370 2683267 2738722 3142832 3424347 3397307
19238C397307J33160k89678k82272Q6949n83610l86832L49738j60990O0504n65451
$$ 3397307 3530467 3240789 2958517 3045466 2461856 2075024 2424762 2263772 2324276 1758825
19228A758825j69814M60542j49319j86633J71058j33546k93887J43182M47152
$$ 1758825 1589011 2049553 1900234 1713601 1884659 1751113 1457226 1600408 2047560
19219B047560N800j43460k09895m0065O6097J60566L76636l88933J31335m06632
$$ 2047560 2053360 1909900 1700005 1659940 1726037 1886603 2263239 1874306 2005641 1599009
19209A599009J88967R2778m19480L74146m46522Q5686o5341K24764K53664o01163
$$ 1599009 1787976 1880754 1461274 1835420 1388898 1474584 1409243 1634007 1887671 1286508
19199A286508K92376j04382J37420M37584m84162R6239j52693L97398n6807o9037
$$ 1286508 1578884 1474502 1611922 2049506 1565344 1661583 1508890 1906288 1849481 1780444
19189A780444l39321j96901J60485K15243L12188o78806o0772O81329k80846R5010
$$ 1780444 1441123 1244222 1404707 1619950 1932138 1253332 1192560 1873889 1593043 1688053
19179A688053k03165l23031O25682l69151m5800O07514n02919L43386k66273L0080
$$ 1688053 1484888 1161857 1787539 1418388 1372588 1980102 1477183 1820569 1554296 1584376
19169A584376k12159L94760K12213k45752K97761l30027k88813j68463P11546
$$ 1584376 1372217 1766977 1979190 1733438 2031199 1701172 1412359 1243896 1955442
19160A955442k59228K55542Q6187J23306l96430L12383l92947q7519j84100N04976
$$ 1955442 1696214 1951756 2037943 2161249 1764819 2077202 1684255 1596736 1412636 1917612
19150A917612K16097j2412j14908J14214J46085q54863O80702j27584P43776M70895
$$ 1917612 2133709 2121297 2006389 2120603 2266688 1411825 2092527 1964943 2708719 3179614
19140C179614m52175K39997N54641n13415J67717n03161P3812L952M4999K98606
$$ 3179614 2727439 2967436 3522077 3008662 3176379 2673218 2747030 2750982 2795981 3094587
19130C094587R1313K32530j52822j38078M2328j69451n5968k2676j18092j79224
$$ 3094587 3185900 3418430 3265608 3127530 3169858 3000407 2944439 2921763 2803671 2624447
19120B624447J66231k67040K96137k49990k45697m25831K82127N4147K02937k54221
$$ 2624447 2790678 2523638 2819775 2569785 2324088 1898257 2180384 2234531 2437468 2183247
19110B183247J54814L72628m29727M4820j14262L09059L66521J88926n91631M11372
$$ 2183247 2338061 2710689 2280962 2325782 2211520 2520579 2887100 3076026 2484395 2895767
19100B895767j73840R0225l60344M59475J33836l67732L18571J02648N7788k24524
$$ 2895767 2721927 2812152 2451808 2911283 3045119 2677387 2995958 3098606 3156394 2931870
19090B931870l03096M16570j93904J63471o095m7843k09187j2159J023372o7480
$$ 2931870 2628774 3045344 2851440 3014911 3008816 2960973 2751786 2739627 3762999 3695519
19080C695519J09268o9576R77399L64869O24216O20471J135897J047020Q72773
$$ 3695519 3804787 3735211 4712610 5077479 5701695 6322166 7458063 8505083 9377856
19071I377856N74358J004037L56520k41959Q5822k5785j256756k71541j294327
$$ 9377856 9952214 10956251 11312771 11070812 11156634 11130849 9874093 9602552 8308225
19062H308225p72774l48064p46383j91664p98113l22732k7768L07689m1348P58105
$$ 8308225 7535451 7187387 6441004 6249340 5451227 5128495 5100727 5408416 5367068 6125173
19052F125173J040298N88176N32347M70684M91045P29511j67655n50235r61092
$$ 6125173 7165471 7753647 8285994 8756678 9247723 9977234 9809579 9259344 8298252
19043H298252l49630o69434l14302m74713n17500l78619l60044K73687m43085
$$ 8298252 7948622 7279188 6964886 6490173 5972673 5594054 5234010 5507697 5064612
19034E064612J80667N76686P7774J051358M48411J428604J232920P29048O59890
$$ 5064612 5245279 5821965 5899739 6951097 7399508 8828112 10061032 10790080 11449970
19025A1449970N48012O84579n13558n72834j39206q25706p79809j353440n34246
$$ 11449970 11997982 12682561 12169003 11596169 11456963 10631257 9851448 8498008 7963762
19016G963762n41984l26893k60153J5352L73690K92374L42890P93821P42223L47131
$$ 7963762 7421778 7094885 6834732 6850084 7223774 7516148 7859038 8652859 9395082 9742213
19006I742213J030516O6043n345o42888p70246l99221j121643j134089k15003
$$ 9742213 10772729 10838772 10833427 10190539 9420293 9021072 7899429 6765340 6550337
18997F550337q59635K41548m61606k78732l08843K74988J55905P72855Q63217
$$ 6550337 5690702 5932250 5470644 5191912 4883069 5158057 5313962 6086817 6950034
18988F950034R04159M34559R02984M73614Q14918J11693k72982k11517o74794
$$ 6950034 7854193 8288752 9191736 9665350 10480268 10591961 10318979 10107462 9432668
18979I432668k89973j011160l57594j45824j40985j645j05239L72101R24617j82768
$$ 9432668 9142695 8131535 7773941 7628117 7487132 7485487 7380248 7752349 8676966 8494198
18969H494198R21377J053663Q45833J828223K095261J977657K567364K863007
$$ 8494198 9415575 10469238 11315071 13143294 15238555 17216212 19783576 22646583
18961B2646583K714550L733015L115417L969267J757493L769618J732349J451601
$$ 22646583 25361133 29094148 32209565 36178832 37936325 41705943 43438292 44889893
18953D4889893Q04987j489506j524223k746764l126093l518752l770641l180072
$$ 44889893 45694880 44205374 42681151 39934387 36808294 33289542 29518901 26338829
18945B6338829l560295k455579l092601j578637j896698j613583j364995j744921
$$ 26338829 22778534 20322955 17230354 15651717 13755019 12141436 10776441 9031520
18937I031520m17193p44896p98486o10221o61591J58517r26168k19145J55542
$$ 9031520 8614327 7869431 7070945 6460724 5799133 5957650 5031482 4812337 4967879
18928D967879k26286k49854P7629n11237K31558m46999M29268l72683M11708L408
$$ 4967879 4741593 4491739 4569368 4058131 4289689 3842690 4271958 3899275 4310983 4314391
18918D314391r8481n0817L1382N33847J56894J22693m40690O0606L45399J39905
$$ 4314391 4215910 4165093 4196475 4730322 4887216 5009909 4569219 4629825 4975224 5115129
18908E115129K85862J41749J044510J4944Q36668L98682Q30339J422852N12555
$$ 5115129 5400991 5542740 6587250 6602194 7438862 7837544 8667883 10090735 10603290
18899A0603290K121997J961805K688942K856661L220391L721429L422531L170830
$$ 10603290 12725287 14687092 17376034 20232695 23453086 27174515 30597046 33767876
18891C3767876K527648J868880N29516p06822k030944k309332k829772k657467
$$ 33767876 36295524 38164404 38693920 37987098 35956154 33646822 30817050 28159583
18883B8159583l612804k624547k975410k866333j430144j995174j370244j646999
$$ 28159583 24546779 21922232 18946822 16080489 14650345 12655171 11284927 9637928
18875I637928j190943q09328q63753o29251m38979p46392l69107j92038m58975
$$ 9637928 8446985 7637657 6773904 6144653 5705674 4959282 4590175 4398137 3939162
18866C939162j32244o85033L48537J33716p10385n5066l27715J3846r6823J30138
$$ 3939162 3806918 3121885 3470422 3604138 2893753 2838687 2510972 2524818 2427995 2558133
18856B558133l61522N46303l48965q9862l45050M3681K62486j55580J47431l1643
$$ 2558133 2196611 2742914 2393949 2304087 1959037 2002718 2265204 2109624 2257055 2225412
18846B225412j94386L38242l4981j69695r9244l18865J33099j93956N09848k33818
$$ 2225412 2031026 2369268 2334287 2164592 2065348 1746483 1879582 1685626 2195474 1961656
18836A961656j93050L27164j10308Q3974P1402o8916k44068j38111O1651j57463
$$ 1961656 1768606 2095770 1985462 2069436 2140838 2071922 1827854 1689743 1751394 1593931
18826A593931O88877k62448j59722l64281L50045l97586L77612J55786o8217k50019
$$ 1593931 2282808 2020360 1860638 1496357 1846402 1448816 1826428 1982214 1913997 1663978
18816A663978m9647L96059k80202M81879n61479M41563k47267k24275L66769J95631
$$ 1663978 1614331 2010390 1730188 2212067 1650588 2092151 1844884 1620609 1987378 2183009
18806B183009n17572K35851L69515n09601k88131M09394p52314O68307o3698J18336
$$ 2183009 1665437 1901288 2270803 1761202 1473071 1882465 1130151 1798458 1734760 1853096
18796A853096O5477k29264K84607K53208l91743k26906R4063M37493m58066J33499
$$ 1853096 1918573 1689309 1973916 2227124 1835381 1608475 1702538 2140031 1681965 1815464
18786A815464J83432r4555n0796k62450K90939L81446m10862j15127K47039J39327
$$ 1815464 1998896 1904341 1853545 1591095 1882034 2263480 1852618 1737491 1984530 2123857
18776B123857m76413L88448n07075N75283l91909J69227J66844l51185L22697
$$ 2123857 1647444 2035892 1528817 2104100 1712191 1881418 2048262 1697077 2019774
18767B019774P4855j896l22063p1181J97071j31022L85807l50112P3134k10093
$$ 2019774 2094629 2092733 1770670 1699489 1896560 1765538 2151345 1801233 1874367 1664274
18757A664274n2643m8933J31346m75005O09281k08223m66414P99851q02326O14583
$$ 1664274 1611631 1562698 1694044 1219039 1828320 1620097 1153683 1953534 1151208 1765791
18747A765791m81386P09324n84012L04158o41065R75002n93213J80531n9093l25938
$$ 1765791 1284405 1993729 1409717 1713875 1072810 2047812 1454599 1635130 1576037 1250099
18737A250099O89353p11175M28047K37090p78719N72126P6495n39768N58955p09770
$$ 1250099 1939452 1228277 1656324 1893414 1114695 1686821 1763316 1223548 1782503 1072733
18727A072733R90362J00383n65677r0403k8996m75655l3946M48167K26946l70228
$$ 1072733 2063095 2163478 1597801 1507398 1478402 1002747 968801 1416968 1643914 1273686
18717A273686L45898K25318n07956O35954K8317q06116N51626L7942L52478k84826
$$ 1273686 1619584 1844902 1336946 1972900 2001217 1195101 1746727 1784669 2137147 1852321
18707A852321k74399K7608J42029j4658M51407m65736Q5538r9194Q8729m87059
$$ 1852321 1577922 1605530 1747559 1732901 2184308 1718572 1804110 1704916 1793645 1306586
18697A306586M55381L71876o94545K89050n82201N46572K19383k63291J50347
$$ 1306586 1761967 2133843 1439298 1728348 1146147 1692719 1912102 1648811 1799158
18688A799158n88734K61205j5547K02064j68222L0125k48192N43367q06634N20839
$$ 1799158 1210424 1471629 1456082 1658146 1489924 1520049 1271857 1815224 1008590 1529429
18678A529429J10492j14840k2651l04176L41401l05342j88971P10816k19564K3840
$$ 1529429 1639921 1525081 1502430 1198254 1539655 1234313 1045342 1756158 1536594 1560434
18668A560434l8135l46218J68168n2001J90538G04551P96902J58162k99806k3471
$$ 1560434 1522299 1176081 1344249 1292248 1482786 704551 1501453 1659615 1359809 1336338
18658A336338j2259k38893N05036l28302J60300K82065o21596L80418K66172l17580
$$ 1336338 1324079 1085186 1590222 1261920 1422220 1704285 1082689 1463107 1729279 1411699
18648A411699J15922l74168K12100k02469L65423j96447K70394o0623R7545j52172
$$ 1411699 1527621 1153453 1365553 1163084 1528507 1332060 1602454 1541831 1639376 1487204
18638A487204j76563M5629M97427q3132j08422k33002K99853o3437R9832m27361
$$ 1487204 1310641 1356270 1853697 1770565 1662143 1429141 1728994 1665557 1765389 1338028
18628A338028j22697L35399l88102O06569j03892m18307L05170j18043k01193
$$ 1338028 1215331 1550730 1162628 1769197 1665305 1246998 1552168 1434125 1232932
18619A232932M96220l56291k31342J25922K21868P2795F84367Q03404l84920K85212
$$ 1232932 1729152 1372861 1141519 1267441 1489309 1562104 684367 1487771 1102851 1388063
18609A388063K5125O9359j28478J45490j17952K42090l41114K86927j35926N7928
$$ 1388063 1413188 1482547 1354069 1499559 1381607 1623697 1282583 1569510 1433584 1491512
18599A491512m0557k77218J12627M21361J87076n80617j2129n6050J53708j27693
$$ 1491512 1450955 1173737 1286364 1707725 1894801 1314184 1302055 1246005 1399713 1272020
18589A272020N41542o06196J23715K54854m1755l19311J58846Q2086l55613K58572
$$ 1272020 1813562 1207366 1331081 1585935 1544180 1224869 1383715 1465801 1110188 1368760
18579A368760N2358N35449n02257J70040m2485K30113n61505J67268k792M80888
$$ 1368760 1421118 1956567 1454310 1624350 1581865 1811978 1250473 1417741 1414949 1895837
18569A895837l49877j7295K86404q15607J65062L33717j04857K0727j35394l382
$$ 1895837 1545960 1528665 1815069 999462 1164524 1498241 1393384 1414111 1278717 1275335
18559A275335L23223M4842J56700o15660k22434O51767n10948L31079J36510j86559
$$ 1275335 1598558 1643400 1800100 1184440 962006 1613773 1102825 1433904 1570414 1383855
18549A383855J80888k08091j80597J57483P4684m87130J96997k9854O29571l26886
$$ 1383855 1564743 1356652 1176055 1333538 1408222 921092 1118089 1088235 1717806 1390920
18539A390920p8022Q300k78136M03967j47391J46808J51994l97363J29470K63099
$$ 1390920 1312898 1321198 1043062 1447029 1299638 1446446 1598440 1201077 1330547 1593646
18529A593646p09832Q58903m29968l89598K39955J53382n16394M09066m3049l2149
$$ 1593646 883814 1742717 1312749 923151 1163106 1316488 800094 1209160 1166111 1133962
18519A133962L22262m34198L38381n1806K97408k87015L0828k90844l9105K58552
$$ 1133962 1456224 1022026 1360407 1308601 1606009 1318994 1349822 1058978 1019873 1278425
18509A278425J01287n1556k61014K29946l46647J79400K58977j06734J3840m9430
$$ 1278425 1379712 1328156 1067142 1297088 950441 1129841 1388818 1282084 1295924 1246494
18499A246494k63722K70581R101n76368M23688M87815k39985K11898m31765j64366
$$ 1246494 982772 1253353 1262454 686086 1109774 1597589 1357604 1569502 1137737 973371
18489I73371N50703m95337J95073O0983N5999p9790k767o1717j64065L89074q5039
$$ 973371 1524074 1028737 1223810 1284793 1340792 1261002 1258235 1196518 1032453 1421527 1336488
18478A336488k64453L34385j67860j38403M19557j7802M4758k26756J19873k68944
$$ 1336488 1072035 1406420 1238560 1100157 1519714 1501912 1546670 1319914 1439787 1170843
18468A170843R1640M65179n30375N02104m68008j63131J194K79471K14059Q001
$$ 1170843 1262483 1727662 1197287 1699391 1231383 1068252 1069446 1348917 1562976 1570977
18458A570977m21847l32026Q06677m25280J75798l88653L75723N4912K99480j92727
$$ 1570977 1149130 817104 1623781 1198501 1374299 985646 1361369 1416281 1715761 1523034
18448A523034j69795k6047M7364l96523p3316N00146L0691m65056j71255N44417
$$ 1523034 1353239 1327192 1374556 978033 904717 1404863 1435554 970498 799243 1343660
18438A343660N66331m87134m4898j46031M68270j40079k00960L42233N4521K07427
$$ 1343660 1909991 1422857 1377959 1231928 1700198 1560119 1359159 1701392 1755913 1963340
18428A963340q34184M20392K8823P7626l6644l862J9028n27030L33068J1701k08641
$$ 1963340 1129156 1549548 1578371 1655997 1619353 1615491 1634519 1107489 1440557 1452258 1243617
18417A243617L28579k56101m7026j90943n3793J55122q0786K63946j89287K77672
$$ 1243617 1572196 1316095 1269069 1078126 1024333 1179455 1098669 1362615 1173328 1451000
18407A451000o766J68845l28760R8306K58476J1426J5410k19980L54531K48405
$$ 1451000 1444234 1613079 1284319 1382625 1641101 1652527 1667937 1447957 1802488 2050893
18397B050893m04032O811m66503M75532m20688j56492k30374O83257o36520L56206
$$ 2050893 1646861 1653672 1187169 1662701 1242013 1085521 855147 1538404 901884 1258090
18387A258090J57987k88795L00975k24292L85845m84174J58674k15882M0601J07290
$$ 1258090 1416077 1127282 1428257 1203965 1589810 1105636 1264310 1048428 1089029 1196319
18377A196319r257p2471k91995O12603J3100k50226p5425k74396P78549p85265
$$ 1196319 1187062 1114591 822596 1435199 1448299 1198073 1122648 848252 1626801 841536
18367H41536L39296J76063Q771N9204n9851k24512K13673k14901j84915K07930
$$ 841536 1180832 1356895 1365666 1424870 1365019 1140507 1354180 1139279 954364 1162294
18357A162294m3937L25771k43329m47703L15060k48383L58481k16792P3126J42951
$$ 1162294 1118357 1444128 1200799 753096 1068156 819773 1178254 961462 1034588 1177539
18347A177539L4803R2462n61551Q69163l33432k25627J37887K38861L8956m93045
$$ 1177539 1212342 1304804 743253 1612416 1278984 1053357 1191244 1430105 1469061 976016
18337I76016k2660k06464L51259L95594l35082k81553O68674n78022K51028J45707
$$ 976016 953356 746892 1098151 1493745 1158663 877110 1545784 967762 1218790 1364497
18327A364497q2496q196k22357O29167n12659J52152m96743N94723k01242P2644
$$ 1364497 1282001 1273805 1051448 1680615 1167956 1320108 823365 1418088 1216846 1289490
18317A289490k00538R4697N78817o02260j50473q0957J47230l05943L90453j65072
$$ 1289490 1088952 1183649 1762466 1160206 1009733 928776 1076006 770063 1160516 995444
18307I95444M13989p368k45056M13796j21331m47718N1200K03398j17099M23477
$$ 995444 1409433 1402065 1157009 1570805 1449474 1001756 1052956 1256354 1139255 1562732
18297A562732k95431J92559J32452k3295j55159Q4328k23010o374L94176m94295
$$ 1562732 1267301 1459860 1592312 1569017 1413858 1498186 1275176 1268802 1662978 1168683
18287A168683N51832o06874K87362j55069Q7704j98796J30483M42468n17410L21093
$$ 1168683 1720515 1113641 1401003 1245934 1333638 1134842 1265325 1707793 1190383 1511476
18277A511476j45511l88526L01150j2967p8459j68394k45744j26173M52018M47008
$$ 1511476 1365965 977439 1278589 1265622 1187163 1018769 773025 646852 1098870 1545878
18267A545878l39191l6187K0024q2489J14662j05483J26588J43118k02669r3966
$$ 1545878 1206687 1170500 1190524 1108035 1222697 1117214 1243802 1386920 1184251 1090285
18257A090285N05036m75580L09963J4298k32240J17784p5778r2953K42336J86803
$$ 1090285 1595321 1119741 1429704 1444002 1211762 1329546 1253768 1160815 1403151 1589954
18247A589954k1835o24095n5590R73116m78538l63178K73319j81816K46174k41307
$$ 1589954 1568119 944024 888434 1861550 1383012 1019834 1293153 1111337 1357511 1116204
18237A116204L14697k05511K7396k99235K14964L98296n36866M82693m23613M6342
$$ 1116204 1430901 1225390 1252786 953551 1168515 1566811 1029945 1512638 1089025 1135367
18227A135367q3803M27986l83691L17120m22138J91057k08282P8181N6183K3780
$$ 1135367 1051564 1479550 1095859 1412979 990841 1181898 973616 1051797 1107980 1131760
18217A131760O54342k79596o07347J89785K6350N7095M8872J79058l1467k31m89524
$$ 1131760 1786102 1506506 899159 1088944 1115294 1172389 1221261 1400319 1368852 1368621 879097
18206H79097o7286L58145J70266J39354j08844j66236J51008q0683K59189j77424
$$ 879097 811811 1169956 1340222 1479576 1370732 1204496 1355504 1274821 1534010 1356586
18196A356586l51212N84448J70530n46356k03595K14665L77079l34772R6853q3120
$$ 1356586 1005374 1589822 1760352 1213996 1010401 1225066 1602145 1267373 1364226 1281106
18186A281106l13420L99522l40715L77684o5130l64846J32303L88226n46928M24783
$$ 1281106 967686 1367208 1026493 1404177 1339047 974201 1106504 1494730 947802 1372585
18176A372585l7673q4681j03414M42305q3586l50093k10523m2072M33933l42857
$$ 1372585 1334912 1250231 1146817 1589122 1505536 1155443 944920 902848 1336781 993924
18166I93924K03414J52509k80450K69345k7617E50908K0419N42968R2529L87402
$$ 993924 1197338 1349847 1069397 1338742 1311125 550908 571327 1114295 1206824 1594226
18156A594226l65319k42351J64280l43812M36366P6044k03160m06747J35273M74845
$$ 1594226 1228907 986556 1150836 807024 1243390 1319434 1116274 709527 844800 1319645
18146A319645n00228M89132p8846j01966r8785k3608L94177j58478m17059K08307
$$ 1319645 819417 1308549 1229703 1127737 1028952 1005344 1399521 1241043 823984 1032291
18136A032291K01245j42739L2018N11869j99020J96365m24154j90903l71795R59389
$$ 1032291 1233536 1090797 1122815 1634684 1435664 1632029 1207875 1016972 645177 1604566
18126A604566k95797n27293J71188L33370J19626o59757M68431J05098l38752
$$ 1604566 1308769 781476 952664 1286034 1405660 745903 1214334 1319432 980680
18117I80680L27860m38472K08413L59761q5090o4693k79322p6661p6344Q65956
$$ 980680 1308540 870068 1078481 1438242 1353152 1288459 1009137 932476 856132 1722088
18107A722088n24053J92333K91450k59751K19375m83012O52495o68411L41446
$$ 1722088 1198035 1390368 1681818 1422067 1641442 1158430 1810925 1142514 1483960
18098A483960j78996J06711J96943l26760l93144J35031L60579o59569P55583
$$ 1483960 1304964 1411675 1608618 1281858 888714 1023745 1384324 724755 1480338
18089A480338Q855m35241l9455q7459O58568m63006R0628J61072k78095j76158
$$ 1480338 1489193 1053952 1014497 927038 1585606 1122600 1213228 1374300 1096205 920047
18079I20047M1378K45996m6560N4851k07916M76553l88033M32321o67781L38719
$$ 920047 961425 1207421 1160861 1215712 1007796 1484349 1096316 1528637 860856 1199575
18069A199575P9304D15506J040787n54410Q3552J06083q5317J18330k79122M67458
$$ 1199575 1278879 415506 1456293 901883 985435 1091518 1006201 1124531 845409 1312867
18059A312867k80002k96356L28717L60558o56207O73845k34312N1391Q8101l95464
$$ 1312867 1032865 736509 1065226 1425784 769577 1443422 1209110 1260501 1348602 953138
18049I53138L16884j13725m85322J64509N05437Q4871J18052K04800D55696J115177
$$ 953138 1270022 1156297 670975 835484 1340921 1425792 1543844 1748644 455696 1570873
18039A570873k57074J60889n80194K46196k8579K89995l1333o17302L20018L63522
$$ 1570873 1313799 1474688 894494 1140690 1112111 1402106 1370773 753471 1073489 1437011
18029A437011l87290J21906L61917n91451O24431m41517J85070k74595J10142
$$ 1437011 1049721 1171627 1533544 942093 1566524 1125007 1310077 1035482 1145624
18020A145624R651M27770l82560p0177K15028j20248L23861r6580m32532L30056
$$ 1145624 1155275 1583045 1200485 1130308 1345336 1225088 1548949 1452369 1019837 1349893
18010A349893K2653D85105P48134n4792k17586j80727O90736o34206N03038k52228
$$ 1349893 1372546 485105 1233239 1178447 960861 780134 1470870 836664 1339702 1087474
18000A087474K71284N0713F65539L34237K18689j15042K53568n30491N3211K53521
$$ 1087474 1358758 1409471 665539 999776 1218465 1103423 1356991 826500 879711 1133232
17990A133232j85892O44567m70322K21990k46249l0444K40606J59678m75036L3219
$$ 1133232 947340 1591907 1121585 1343575 1097326 1066882 1307488 1467166 992130 1025349
17980A025349K04954J19518L16632o85800L56828k35331K35698l07202M80482
$$ 1025349 1230303 1349821 1666453 980653 1337481 1102150 1337848 1030646 1511128
17971A511128j56549M0974m68959K0941J180014j039478K55854J34943G11523
$$ 1511128 1354579 1395553 926594 947535 2127549 1088071 1343925 1478868 711523
17961A417458k22659Q9011J47103r618L21793l00829j06702l71702M73650l80473
$$ 1417458 1194799 1283810 1430913 1421295 1743088 1442259 1335557 963855 1437505 1057032
17951A057032M28352j12530m22342M36773m7131j65757N38192j74532m03342M39840
$$ 1057032 1485384 1372854 950512 1387285 1340154 1174397 1712589 1538057 1134715 1574555
17941A574555O1033l06508J67895k13683L55636k39207J08294l40331R80682o95335
$$ 1574555 1635588 1329080 1496975 1283292 1638928 1399721 1508015 1167684 2148366 1453031
17931A453031K43854l40641K16648j93664J3275J78460m22334j54285O96798p62831
$$ 1453031 1696885 1356244 1572892 1379228 1392503 1570963 1148629 994344 1691142 928311
17921I28311P43428k21244J62172J60828k24333j63139k03844M22093K52147m03964
$$ 928311 1671739 1450495 1612667 1773495 1549162 1386023 1182179 1604272 1856419 1452455
17911A452455k02413Q50375k33637k46424K82540q8131j37664m9543J11521m16263
$$ 1452455 1250042 2100417 1866780 1620356 1902896 1814765 1677101 1627558 1739079 1322816
17901A322816N85880m87500L85242n38733O28670O1973j63608N89688o74545K12
$$ 1322816 1908696 1421196 1806438 1267705 1896375 1958348 1794740 2384428 1709883 1710095
17891A710095N30919o30006K63936l3469O7785K0995l242k7255J33515J55908
$$ 1710095 2241014 1611008 1874944 1841475 1909260 1930255 1927013 1899758 2033273 2189181
17881B189181l61390L8182J5103O8147n48223Q5904M09590n5561J86l59680K62866
$$ 2189181 1827791 1865973 1881076 1949223 1401000 1486904 1896494 1840933 1841119 1481439 1744305
17870A744305L94379m4421l67515L77710l28669k10113k40054P36796n06848K56176
$$ 1744305 2138684 2094263 1726748 2104458 1775789 1565676 1325622 2062418 1555570 1811746
17860A811746K8315K82103m30128K56027k52642k55757P83204l31402k39653K3425
$$ 1811746 1840061 2122164 1692036 1948063 1695421 1439664 2222868 1891466 1651813 1675238
17850A675238L75587n48340J53222J75514N0624j57207l86956Q82049m31147L00303
$$ 1675238 2050825 1502485 1655707 1831221 1881845 1724638 1337682 2219731 1788584 2088887
17840B088887r85367M31110J75360J86322k77507r2846j33374L66674J84102k85836
$$ 2088887 1103520 1534630 1709990 1896312 1618805 1525959 1392585 1759259 1943361 1657525
17830A657525R3077l81362L60441l34602N35275n11818r1274O15308m06251J20348
$$ 1657525 1750602 1369240 1729681 1395079 1930354 1418536 1327262 1942570 1536319 1656667
17820A656667R2246r4875J86356j32780J47387K07554K16197k6181J1596m44836
$$ 1656667 1748913 1654038 1840394 1707614 1855001 2062555 2278752 2252571 2264167 1819331
17810A819331K63765k78889k24062L41825k32064q2952J97194j21022J56765J46579
$$ 1819331 2083096 1804207 1580145 1921970 1689906 1606954 1804148 1683126 1839891 1986470
17800A986470J76215k71893M19562k8409k90251L95344k63912l43085j00950K85326
$$ 1986470 2162685 1890792 2310354 2281945 1991694 2387038 2123126 1780041 1679091 1964417
17790A964417l55242k07582j62962K07436J43423J3272J05173m68480K37755M31177
$$ 1964417 1609175 1401593 1238631 1446067 1589490 1602762 1707935 1239455 1477210 1908387
17780A908387r8524o46823L64151J98062m3835J45550l2196m57084k4727j14243
$$ 1908387 1809863 1163040 1527191 1725253 1681418 1826968 1794772 1337688 1312961 1198718
17770A198718O03269k29074L59620m52474n9549j17605L63470l05519J12465L74258
$$ 1198718 1801987 1572913 1932533 1480059 1420510 1302905 1666375 1360856 1473321 1847579
17760A847579l64702p9681M22679l02789k91848N33901J69388l68368j70198J6463
$$ 1847579 1482877 1403196 1825875 1523086 1231238 1765139 1934527 1566159 1395961 1412424
17750A412424j55023J65574R3878L04723j97787k19486L60798q6354k72771J31698
$$ 1412424 1257401 1422975 1516853 1821576 1623789 1404303 1765101 1678747 1405976 1537674
17740A537674j75030k0088j01702N58312k49212m4851K13252j88613J93901k05042
$$ 1537674 1362644 1342556 1240854 1799166 1549954 1505103 1718355 1529742 1723643 1518601
17730A518601O5201k0051K66511j31061j20515J70410j34520m72208L09016N9514
$$ 1518601 1583802 1563751 1830262 1699201 1578686 1749096 1614576 1142368 1451384 1510898
17720A510898L6603m891m2276L32487j65507K39014p36581P45778O3704n49902
$$ 1510898 1547501 1542610 1500334 1832821 1667314 1906328 1169747 1915525 1979229 1429327
17710A429327j88543M47662J04944k61466J48441M26198m40773n44320K70049
$$ 1429327 1240784 1688446 1793390 1531924 1680365 2106563 1665790 1121470 1391519
17701A391519M09686l94871J77707L5903M5070k97709K09562k24338j99165K03784
$$ 1391519 1801205 1406334 1584041 1619944 1665014 1367305 1576867 1352529 1153364 1357148
17691A357148L47643n17870K09041L3034L46449j16948k27445J36991k2474n0279
$$ 1357148 1704791 1186921 1395962 1428996 1775445 1658497 1431052 1568043 1545569 1495290
17681A495290j79251K0369J96148L8165l20673K19303K86868k59642j95439J13905
$$ 1495290 1316039 1336408 1532556 1570721 1250048 1469351 1756219 1496577 1301138 1415043
17671A415043q0327L02006j74963K72397J59391k0166o1749o39350M84897M84161
$$ 1415043 1334716 1636722 1461759 1734156 1893547 1873381 1811632 1172282 1657179 2141340
17661B141340n10140M91227N2066n20225k14007J18052j91284O5949l79105R04831
$$ 2141340 1631200 2122427 2174493 1654268 1440261 1558313 1367029 1432978 1053873 1958704
17651A958704l77300L02877m96803N71236k7856m69415K29849J94645O954Q1461
$$ 1958704 1581404 1884281 1387478 1958714 1930858 1461443 1691292 1885937 1892891 1974352
17641A974352m04584L87531k1205K09314k02355K04669p0298j01662L34731k67334
$$ 1974352 1569768 1957299 1936094 2145408 1943053 2147722 2077424 1975762 2310493 2043159
17631B043159J18604J02447j21133L02945l28519K77385o35809J56356K96840
$$ 2043159 2161763 2264210 2143077 2446022 2117503 2394888 1759079 1915435 2212275
17622B212275k2595J065771p62072J65207l16448J8447J66537R16k27112j01697
$$ 2212275 2189680 3255451 2493379 2658586 2342138 2360585 2527122 2528038 2300926 2199229
17612B199229N41594j9595p29r553p4370K27783K67962m65147j68793N37316j25945
$$ 2199229 2740823 2721228 2720499 2710946 2636576 2864359 3132321 2667174 2498381 3035697 2909752
17601B909752J06021L20787P5776o69934Q4036O8522J15671K85422k11827l4033
$$ 2909752 3015773 3336560 3412336 2742402 2826438 2894960 3010631 3296053 3084226 3050193
17591C050193K01366m06801m03048N08655n29914N05080j74180j16878n6984L6705
$$ 3050193 3251559 2844758 2441710 2950365 2420451 2925531 2751351 2634473 2577489 2614194
17581B614194M01314k75133O7366j62169M4238j21916K66290r20701M68598N01430
$$ 2614194 3015508 2740375 2807741 2645572 2689810 2567894 2834184 1913483 2382081 2883511
17571B883511j59364r0258N0172J38650l63928M06612k95983P9024k60677o8690
$$ 2883511 2724147 2633889 2684061 2822711 2458783 2865395 2569412 2648436 2387759 2319069
17561B319069J03019K2445J68786K7183j56394o372j66330J43462L00848n25574
$$ 2319069 2422088 2444533 2613319 2640502 2484108 2477736 2311406 2454868 2755716 2230142
17551B230142M18706l2199q4142k10731j73890L00053K46638m25990J12212K30970
$$ 2230142 2648848 2616649 2532507 2321776 2147886 2447939 2694577 2268587 2380799 2611769
17541B611769l5830L08195k76706j97262k67770Q62538M236o32004M27690J89976
$$ 2611769 2575939 2884134 2607428 2410166 2142396 3004934 3009170 2377166 2804856 2994832
17531B994832j29633k08514j56370k31828M55979J29700p22562P52531k36930
$$ 2994832 2865199 2656685 2500315 2268487 2724466 2854166 2131604 2884135 2647205
17522B647205L17380k61289M09069l05428M17327k82226M46575n14888O07405
$$ 2647205 2964585 2703296 3112365 2806937 3224264 2942038 3388613 2873725 3481130
17513C481130J30648j24004J7058L72973J69687l36941J64669M40831r0644j19291
$$ 3481130 3611778 3487774 3504832 3877805 4047492 3710551 3875220 4316051 4225407 4106116
17503D106116j2665N02633O6905P9534l83559P62446M98704J80032K96337L67008
$$ 4106116 4093451 4596084 4662989 4742523 4358964 5121410 5620114 5800146 6096483 6463491
17493F463491N29106J068109Q97178J188039J412327K689437M235591O988037
$$ 6463491 6992597 8060706 8957884 10145923 11558250 14247687 18483278 25471315
17485B5471315R835914J3986097J5112234J6048388J3999146J1146243O150251
$$ 25471315 35307229 49293326 64405560 80453948 94453094 105599337 111749588
17478A11749588R11354l663052q046845j0685066j1270884q926000n852550k911504
$$ 111749588 112660942 108997890 100951045 90265979 78995095 70069095 64216545 61305041
17470F1305041J477150N151962J0404435J1508609J2067997R396935O143818P51560
$$ 61305041 62782191 67934153 78338588 89847197 101915194 111312129 117455947 118207507
17462A18207507l818877q556615j2071885j3721943j2473682j1064005r047001
$$ 118207507 114388630 105832015 93760130 80038187 67564505 56500500 47453499
17455D7453499q982702p023197o225442m523388l504047k384420j721060r47965
$$ 47453499 38470797 31447600 25222158 20698770 17194723 14810303 13089243 12141278
17447A2141278j300925n94388k31793p06223Q7062r6029l3386k32131p02907L58894
$$ 12141278 10840353 10245965 10014172 9307949 9395011 9298982 9265596 9033465 8330558 8689452
17437H689452p81821j14907n14612J36052m07497J15806L76556l34305L06081
$$ 8689452 7907631 7792724 7278112 7414164 7006667 7122473 7499029 7164724 7470805
17428G470805L57034m0280j58936j75125o06060J26047n04866l01096J4140j19316
$$ 7470805 7827839 7787559 7628623 7453498 6847438 6973485 6468619 6167523 6181663 6062347
17418F062347l98047o5011k9411j76270l44251K73536O8882m29869L4469k46222
$$ 6062347 5664300 5599289 5569878 5393608 5049357 5322893 5391775 4961906 4996375 4750153
17408D750153K52654N57259j16140J5134N59305N04991n4107o5955J97170j78833
$$ 4750153 5002807 5560066 5443926 5459060 6018365 6523356 6469249 6403294 6600464 6421631
17398F421631M61577k7324Q56339J78552J52227R2391P15554R68096P54201Q76045
$$ 6421631 6883208 6855884 7712223 7890775 8043002 8135393 8850947 9819043 10573244 11449289
17388A1449289K98553P48099R25970M55574J151503j269211Q56745q05007J39754
$$ 11449289 11747842 12495941 13421911 13877485 15028988 13759777 14616522 13811515 13951269
17379A3951269n41758J05128j93828j84028m75112M21647M92587R8812l6635P64623
$$ 13951269 13409511 13514639 13320811 13136783 12661671 13083318 13575905 13674717 13638082 14402705
17369A4402705J107023K03211R20842K43539O07869j57623M50164o971M2773k63406
$$ 14402705 15509728 15712939 16633781 16877320 17485189 17327566 17777730 17770759 17813532 17550126
17359A7550126q6178l08324J49848k41122N91045Q2062j74753K86486J200185
$$ 17550126 17463948 17155624 17305472 17064350 17655395 17737457 17562704 17849190 19049375
17350A9049375J229263R21747J046051J232870J133892J070415J123457O40692
$$ 19049375 20278638 21200385 22246436 23479306 24613198 25683613 26807070 27447762
17342B7447762M14994l14474M20618j68332l80961o74089k42680l29824j071519
$$ 27447762 27862756 27548282 27968900 27800568 27419607 26745518 26502838 26173014 25101495
17333B5101495J65211j2582M18465O98157L39845J41306J809726O01273R91492
$$ 25101495 25266706 25254124 25672589 26370746 26710591 26851897 28661623 29262896 30254388
17324C0254388M25393M60972N5821q23619Q02809r98233l74600o12368p76278
$$ 30254388 30679781 31140753 31196574 30372955 31175764 30177531 29802931 29190563 28414285
17315B8414285j008308r95128r84825j000128n27082J04698p20341J78469O1456
$$ 28414285 27405977 26410849 25426024 24425896 23898814 24003512 23283171 23461640 23523096
17306B3523096L61910R31593K55808M80729O40496J024301l03374K60569k68516
$$ 23523096 23885006 24816599 25072407 25553136 26193632 27217933 26914559 27175128 26906612
17297B6906612k18513j77601j105807m96135o17492l82328j350707J26701r00641
$$ 26906612 26688099 26510498 25404691 24908556 24291064 23908736 22558029 22684730 21784089
17288B1784089N1341j47227j06900q50384M11212r52162J57651q19274r26439
$$ 21784089 21835430 21688203 21581303 20730919 21142131 20189969 20347620 19528346 18601907
17279A8601907q09958l58186r84391j148376j173987k69703p29258j130822o07682
$$ 18601907 17791949 17433763 16449372 15300996 14127009 13857306 13128048 11997226 11389544
17270A1389544n98186n2929r5480j50212q35822p37033L11293p26310l17273p114
$$ 11389544 10791358 10738429 10642949 10492737 9656915 8919882 9231175 8504865 8187592 8180478
17260H180478n54824l25985K64763l22421J46796k72740M9891k21923J95727r4557
$$ 8180478 7625654 7299669 7564432 7242011 7388807 7116067 7165958 6944035 7139762 7045205
17250G045205m81525L75899k18495k21345J49087n9660j96230k39063l14310r1589
$$ 7045205 6563680 6939579 6721084 6499739 6648826 6589166 6392936 6153873 5839563 5747974
17240E747974L36972n41209J53618K49865m15212j82333M16803n40141j53427
$$ 5747974 6084946 5543737 5697355 5947220 5532008 5349675 5766478 5226337 5072910
17231E072910Q33919j25103J89052j30786L425k22681P8985N20217j06208j00732
$$ 5072910 5906829 5781726 5970778 5839992 5843417 5620736 5699721 6219938 6113730 6012998
17221F012998j25776k22904K79775L8017J51249j63348M41079l72720L93956m40317
$$ 6012998 5887222 5664318 5944093 5982110 6133359 5970011 6411090 6038370 6432326 5992009
17211E992009K44354j71809J21623j16730M65554M51059k93998J87552K04492
$$ 5992009 6236363 6064554 6186177 6069447 6535001 6986060 6692062 6879614 7084106
17202G084106m58983P30345o50658o0041K17504n73718J26072j063906k87083
$$ 7084106 6625123 7355468 6704810 6644769 6862273 6288555 6414627 5350721 5063638
17193E063638L38650m86254J00190L83132K01158m13027Q3128L54384o44306L53190
$$ 5063638 5402288 4916034 5016224 5399356 5600514 5187487 5270615 5624999 4980693 5333883
17183E333883r51305L28849l26824K81199n47027K4347j99223K6844Q4548N29499
$$ 5333883 4382578 4711427 4384603 4665802 4118775 4143122 3943899 3970743 4055291 4584790
17173D584790n49674L3585J53695L77770l69037k29946L35048n39427M32391p8649
$$ 4584790 4035116 4068701 4222396 4600166 4231129 4001183 4336231 3796804 4229195 4150546
17163D150546O2162j30756L64449j66462j50468r9615Q04743o87264P16021k68395
$$ 4150546 4212708 4081952 4446401 4279939 4129471 4029856 4834599 4147335 4863356 4594961
17153D594961j49238J32787J16722k50747J84572j24180J28643M0030k04779m0181
$$ 4594961 4445723 4578510 4695232 4444485 4629057 4504877 4633520 4673550 4468771 4428590
17143D428590N0001M77488j21018K86662o19980P42383p15525M36290m6464q8026
$$ 4428590 4478591 4956079 4835061 5121723 4501743 5244126 4528601 4964891 4918427 4830401
17133D830401J27362m59192l4386J83216n2691j38385O33802m00535J35063K91869
$$ 4830401 4957763 4498571 4464185 4647401 4594710 4456325 5090127 4689592 4824655 5116524
17123E116524p20592k53753M15937m6547p431N09834k50478q0202o65194O50329
$$ 5116524 4395932 4142179 4558116 4511569 4504138 5013972 4763494 4683292 4018098 4668427
17113D668427n02607K54261m26983l67880M17952k08384q9724k44696L03445l29420
$$ 4668427 4165820 4420081 3993098 3625218 4043170 3834786 3745062 3500366 3803811 3474391
17103C474391M46740R7331n43161K58159K24235o73724K99456O4014m50249K38541
$$ 3474391 3921131 4018462 3475301 3733460 3957695 3283971 3583427 3647441 3197192 3435733
17093C435733j7771k21408k25588N67414l34850n30908J14122M59817j43547j1887
$$ 3435733 3417962 3196554 2970966 3538380 3203530 2672622 2786744 3246561 3103014 3091127
17083C091127k98588j5304J69908m63696O52307m52356l7566O58114r71313K70127
$$ 3091127 2792539 2777235 2947143 2483447 3135754 2683398 2645832 3303946 2332633 2602760
17073B602760L9303Q0722j5457J05398N3009J03066M5167J00164m43230k77579
$$ 2602760 2642063 2722785 2707328 2812726 2865735 2968801 3013968 3114132 2670902 2393323
17063B393323p0191Q25828j95597m49853M14810o1010J44050l99436M92993m98887
$$ 2393323 2323132 3148960 2953363 2503510 2918320 2857310 3001360 2601924 3094917 2596030
17053B596030P61251o65233J14601K20970j46549J83742J42575m45314M34076
$$ 2596030 3357281 2692048 2806649 3027619 2881070 3064812 3207387 2762073 3196149
17044C196149j7332j94652M10283j74831K35036l01501O24497M27522n62888j23982
$$ 3196149 3178817 2984165 3394448 3219617 3454653 3153152 3777649 4205171 3642283 3518301
17034C518301J03099k26693M52738m31860J06501l05642k14045j4446J56663j13234
$$ 3518301 3621400 3394707 3847445 3415585 3522086 3216444 3002399 2987953 3144616 3031382
17024C031382M52476l99033L75181l26729r1430m59166K97345n45464J85690J15674
$$ 3031382 3483858 3084825 3460006 3133277 3041847 2582681 2880026 2334562 2520252 2635926
17014B635926P1566J18817K5412l33249Q1651J63735k53320L83391k57124J03561
$$ 2635926 2707492 2826309 2851721 2518472 2600123 2763858 2510538 2893929 2636805 2740366
17004B740366P22486m38965m18574K58303o58510O73371j2860K76457m73848M80024
$$ 2740366 3462852 3023887 2605313 2863616 2205106 2878477 2865617 3142074 2668226 3148250
16994C148250m28131j23863r1170R8896J41606l6281M7613N79702k96135n99545
$$ 3148250 2720119 2596256 2505086 2603982 2745588 2709307 2756920 3336622 3040487 2440942
16984B440942N25780k16005P0910K85546n96056J28275K83033L15497j00238j22008
$$ 2440942 2966722 2750717 2821627 3107173 2511117 2639392 2922425 3237922 3137684 3015676
16974C015676j83011O42714j79624R2532M16414M42386l19746K56365O5497N44036
$$ 3015676 2832665 3475379 3295755 3388287 3804701 4247087 3927341 4183706 4249203 4793239
16964D793239J53313N3904p9290K24278L10325R8637k36875L52343L26962k0497
$$ 4793239 4946552 5000456 4921166 5145444 5455769 5554406 5317531 5669874 5996836 5976339
16954E976339k45347J49257l94194K58988k94592K65522q75601K54257L16803
$$ 5976339 5730992 5880249 5486055 5745043 5450451 5715973 4840372 5094629 5411432
16945E411432j57393l23619q32661L39333k6154J7081j66524o50372P869M5432
$$ 5411432 5254039 4930420 4097759 4437092 4410938 4428019 4261495 3611123 3618992 3664424
16935C664424q12955N22717k44166J05450q6940n1906n60011N97962N5788m66517
$$ 3664424 2851469 3374186 3130020 3235470 3148530 3096624 2536613 3134575 3190363 2723846
16925B723846Q5994K36842J86276k31133j61388K55958n84726N14143j2067n78428
$$ 2723846 2809840 3046682 3232958 3001825 2840437 3096395 2511669 3025812 3013745 2435317
16915B435317M89888n8670j89553j25877j4884J699j03771l4610L58534P3696
$$ 2435317 2925205 2866535 2676982 2551105 2536221 2537920 2434149 2399539 2758073 2831769
16905B831769o56926Q04154k77303j28571k81515M32085m73559J65100J55932
$$ 2831769 2174843 2978997 2701694 2573123 2291608 2723693 2250134 2415234 2571166
16896B571166l78713j73382M77834J0581L7951l39192k89728O0777O24436r2360
$$ 2571166 2192453 2019071 2496905 2507486 2545437 2206245 1916517 1977294 2601730 2509370
16886B509370J4802l92482k0748J45862j66705j11010J5342O38935o02880M19436
$$ 2509370 2524172 2131690 2110942 2256804 2090099 1979089 1994431 2633366 2030486 2449922
16876B449922j98596m1432Q61182r76496M22406k85552J78225l3323J11326j45902
$$ 2449922 2251326 2209894 3071076 2094580 2516986 2231434 2409659 2376336 2487662 2341760
16866B341760K67151j699Q9309p02746P58533p03479N23706J7040J76255j24726
$$ 2341760 2608911 2607212 2696521 1993775 2752308 2048829 2572535 2589575 2765830 2641104
16856B641104K44072k85182K77824m1962j30578L51659l36564l39879J63283Q2173
$$ 2641104 2885176 2599994 2877818 2835856 2705278 3056937 2720373 2380494 2543777 2625950
16846B625950l603q3685L67034n58688K46162l61008K30067Q9482m03166M91681
$$ 2625950 2622347 2538662 2905696 2347008 2593170 2232162 2462229 2551711 2148545 2640226
16836B640226k92316L03073j89161L04577n58156K89150N19334j52124l7019L607
$$ 2640226 2347910 2650983 2461822 2766399 2208243 2497393 3016727 2864603 2827584 2831191
16826B831191l69856L05579k09880J19205J2260O43600l77020O4586k2783N76954
$$ 2831191 2461335 2766914 2557034 2676239 2688499 3332099 2955079 3019665 2996882 3573836
16816C573836l82738k13646N59846p8452m40310N92492j0222k78096j23128N60492
$$ 3573836 3191098 2977452 3537298 3458846 3018536 3611028 3600806 3322710 3199582 3760074
16806C760074o47102N51481l11482J53757p7550k28205K91642k63391J51263o45330
$$ 3760074 3112972 3664453 3352971 3506728 3429178 3200973 3492615 3229224 3380487 2735157
16796B735157O51194o08778J48138J96297m44707K63794k94923r9990r8500M0085
$$ 2735157 3386351 2777573 2925711 3122008 2677301 2941095 2646172 2546182 2447682 2487767
16786B487767P7045l09608N73049m16450r0198l3379J09237K10916N443j34724
$$ 2487767 2564812 2255204 2828253 2411803 2321605 2288226 2397463 2608379 2613822 2479098
16776B479098J3778j36170M37706l90633J66562j36877k15565O61630q420o13396
$$ 2479098 2492876 2356706 2794412 2403779 2570341 2433464 2217899 2879529 2871109 2257713
16766B257713J50899j12196L00829p5440O83473o58455k65399l73270L34337K81742
$$ 2257713 2408612 2296416 2597245 2521805 3205278 2546823 2281424 1908154 2242491 2524233
16756B524233j70697l5960j00833J27183J52847k63632K80484K22274m68728M01680
$$ 2524233 2353536 2317576 2216743 2343926 2496773 2233141 2513625 2735899 2267171 2668851
16746B668851K86039k26366o200k38501J4273K80968K10660m1542K52672m93911
$$ 2668851 2954890 2728524 2722324 2483823 2498096 2779064 2989724 2948182 3200854 2706943
16736B706943j0594n8863J96564j27023L93383q2214j27158L56439j32623m2301
$$ 2706943 2696349 2637486 2834050 2707027 3100410 3018196 2891038 3247477 3114854 3072553
16726C072553l23089J066658o46744K51109k25694N3416k7552J45088K82389j22261
$$ 3072553 2749464 3816122 3169378 3420487 3194793 3248209 3220657 3365745 3648134 3525873
16716C525873N31944j022598K85799L45287j18184K68929R0484l49982l2790Q30713
$$ 3525873 4057817 3035219 3321018 3666305 3548121 3817050 3907534 3557552 3524762 4355475
16706D355475J10976j92120L6723K35133j68228M97793j47280J79877k35532L88556
$$ 4355475 4466451 4274331 4311054 4546187 4377959 4875752 4728472 4908349 4672817 5061373
16696E061373k36294k17533M47886l19095J99936L91049k82890l13197J87448
$$ 5061373 4825079 4607546 5055432 4736337 4936273 5327322 5044432 4731235 4918683
16687D918683J77973n0637o4877j10668j51583l69326m63034K08722K09209k09145
$$ 4918683 5096656 5046019 4981142 4870474 4718891 4349565 3886531 4095253 4304462 4095317
16677D095317j70759J10134J53669j10968o54L73662m40326N00618N2768J94906
$$ 4095317 3924558 4034692 4188361 4077393 4076739 4450401 4010075 4510693 4563461 4758367
16667D758367J74255j81683M03012M06725j59869n288j48492l55086j48305J91800
$$ 4758367 4932622 4750939 5153951 5560676 5400807 5395519 5247027 4891941 4743636 4935436
16657D935436K15803K65968K56107l38864Q3815k15118K83937p8859m85222J00468
$$ 4935436 5151239 5417207 5673314 5334450 5418265 5203147 5487084 5408225 4923003 5023471
16647E023471k20528K94964j105687J71322m74293J76202l68752J96104n62955
$$ 5023471 4802943 5097907 3992220 4163542 3689249 3865451 3496699 3692803 3129848
16638C129848j9727J17502N26472p09422J11812j84275L79171l59223M7877k18950
$$ 3129848 3110121 3227623 3754095 3044673 3156485 2972210 3351381 2992158 3040035 2821085
16628B821085j66901Q20474k19290j49399L00664j98809p0570L60044k86016O8647
$$ 2821085 2654184 3474658 3255368 3105969 3406633 3207824 3137254 3497298 3211282 3279929
16618C279929J72164m9146K8539j16500N12772m48757L89331m06160l420P3713
$$ 3279929 3452093 3402947 3431486 3314986 3827758 3379001 3768332 3362172 3358752 3432465
16608C432465m6345l99375M54965q2174M1427P42837q88031O26484J0041o1631
$$ 3432465 3386120 2986745 3441710 3359536 3400963 4143800 3255769 3882253 3892294 3830663
16598C830663l02847M33081o1803Q57398o74369k20086N72932l53230j52583k37343
$$ 3830663 3527816 3960897 3899094 4756492 4082123 3862037 4434969 4081739 3929156 3691813
16588C691813L55795j17533m9170j10206J84848q0283l58318K37851J23000k18795
$$ 3691813 4047608 3930075 3880905 3770699 3955547 3875264 3516946 3754797 3877797 3659002
16578C659002O33696k83790l69953M92351k8245l33726J73029L49267l2853q9938
$$ 3659002 4292698 4008908 3638955 4131306 4103061 3769335 3942364 4291631 4258778 4168840
16568D168840k35462J03089J38904O81335p35523K07318L5395k85332n3384P03198
$$ 4168840 3933378 4036467 4175371 4856706 4121183 4328501 4363896 4078564 4025180 4728378
16558D728378o22365J32936K42736j18620P2978K61236k19465k84802L68430L3209
$$ 4728378 4106013 4238949 4481685 4363065 4436043 4697279 4477814 4193012 4561442 4594651
16548D594651J35613l0837n1163J46550j16810M25767m84138M62487l831N6438
$$ 4594651 4730264 4699427 4648264 4794814 4678004 5103771 4619633 5082120 5078289 5134727
16538E134727K94872n21172K08982J21528J20406k2524j37854K11987K31334l03603
$$ 5134727 5429599 4908427 5117409 5238937 5359343 5336819 5198965 5410952 5642286 5338683
16528E338683L66504l34882K57911J23225L39351l97833M21072m89277K20265
$$ 5338683 5705187 5370305 5628216 5751441 6090792 5692959 6114031 5624754 5845019
16519E845019J12046N13843k61869O4936J87918m51107J94899j12185j78843O0441
$$ 5845019 5957065 6470908 6209039 6273975 6461893 6010786 6205685 6093500 5914657 5975098
16509E975098K45874m60937n535N61809r44344M36120j00148N1666K05265o9440
$$ 5975098 6220972 5760035 5754500 6316309 5371965 5808085 5707937 5759603 5964868 5895428
16499E895428L02500K32600K47504k33688L97732J51015k86350J172271J15810
$$ 5895428 6197928 6430528 6678032 6444344 6842076 6993091 6706741 7879012 7994822
16490G994822k1314l13502O29718J1716m3505O10629l98821N24093K22691J24778
$$ 7994822 7973508 7660006 8289724 8301440 8257935 8868564 8469743 8993836 9216527 9341305
16480I341305O40383K21156M65703K19049M32793Q14096R97828N97816N45321
$$ 9341305 9981688 10202844 10668547 10887596 11320389 12134485 13132313 13730129 14275450
16471A4275450J294365J76377J548358L66126P07616J316367O05132J279145J284069
$$ 14275450 15569815 15746192 17294550 17660676 18368292 19684659 20289791 21568936 22853005
16462B2853005J035828J939584J608688K136226K597969K784358L058993L609002
$$ 22853005 23888833 25828417 27437105 29573331 32171300 34955658 38014651 41623653
16454D1623653L536929N143753L966294N717025N212175O766308Q147629P785638
$$ 41623653 45160582 50304335 54270629 59987654 65199829 71966137 80113766 87899404
16446H7899404R459593J0994893J3086062J4762864J6703921J7979365J6914051
$$ 87899404 97358997 108353890 121439952 136202816 152906737 170886102 187800153
16439A87800153J5086648J5512012J4556109J5256912J5384926J5932773J6789883
$$ 187800153 202886801 218398813 232954922 248211834 263596760 279529533 296319416
16432B96319416J7372706J7072132J5138443J2187587J0513612R002082P956866
$$ 296319416 313692122 330764254 345902697 358090284 368603896 377605978 385562844
16425C85562844P208005O454273M617324L044740J485297l19581k501795l034688
$$ 385562844 392770849 399225122 403842446 406887186 408372483 408052902 405551107 402516419
16417D02516419m513145o432719p281715r574312j0474430j2687425j3613463
$$ 402516419 398003274 391570555 384288840 374714528 364240098 351552673 337939210
16410C37939210j4798806j8163556j9195430k0728984j9533284j9483070j9236452
$$ 337939210 323140404 304976848 285781418 265052434 245519150 226036080 206799628
16403B06799628k0393822k0730240k0529957k1789755k1769621k1785709k2093822
$$ 206799628 186405806 165675566 145145609 123355854 101586233 79800524 57706702
16396E7706702k1501390A5307499d091746j4553090l954289i073480B3313617
$$ 57706702 36205312 15307499 -4091746 -18644836 -22599125 -9073480 23313617
16388F7291125M5281943L9423374L3430347K3608687J1892666P49698j3834639
$$ 67291125 112573068 151996442 185426789 209035476 220928142 221677840 207843201
16381B07843201k7568060m0763821n0831409B9800486c8154262p3647059o9546523
$$ 207843201 180275141 139511320 88679911 29800486 -38154262 -111801321 -181347844
16374a81347844n4071211k8061068J90198K5715116M6333850N9234827O4747857
$$ -181347844 -235419055 -263480123 -263289925 -237574809 -191240959 -132006132 -67258275
16367f7258275a532722F1472182N5195698M6675700L8294739K9276112K0111041
$$ -67258275 -1532722 61472182 116667880 163343580 201638319 230914431 251025472
16360B51025472J0063974K145651o456920j3244736j9091821j9247076j8566510
$$ 251025472 261089446 263235097 256778177 243533441 224441620 205194544 186628034
16353A86628034j8012212j6935937j6535280j6485182j5333991j4404824j2413576
$$ 186628034 168615822 151679885 135144605 118659423 103325432 88920608 76507032
16346G6507032j0605900j0000405q176392p542551o568351o019726m727967l861456
$$ 76507032 65901132 55900727 47724335 40181784 33613433 27593707 22865740 19004284
16338A9004284l736721l209631k284085j273640j265015j108238j024043n0440
$$ 19004284 15267563 12057932 9773847 8500207 7235192 6126954 5102911 5052471
16330E052471q80989n37925o36921N05268n05243n43569o72322O5390J10199l72761
$$ 5052471 4171482 3633557 2996636 3501904 2996661 2453092 1780770 1846160 1956359 1583598
16320A583598K4240l52979l23336J28486C98420j77531N27870j55414c76240i5568
$$ 1583598 1607838 1254859 931523 1060009 398420 220889 748759 593345 -376240 -95568
16309b50301C35324f67235J79825J6603N1871e301A73044a85942o4449C92189
$$ -250301 335324 -667235 -487410 -470807 -418936 -5301 173044 -185942 -250391 392189
16298b2342A95970J95456g9330c6292B3457h2547F3272b12905E84419h1520B61846
$$ -22342 195970 391426 -79330 -36292 23457 -82547 63272 -212905 584419 -81520 261846
16286E27000J31143n7435k29393J69255B5049N39300b15599A74480c6635n91279
$$ 527000 658143 600708 371315 540570 25049 564349 -215599 174480 -36635 -627914
16276f27914a50579l19655O8448d5590l69612d7748j46210F4446J21688B0209
$$ -627914 -150579 -470234 -401786 -45590 -415202 -47748 -193958 64446 186134 20209
16265B87721j39595G0664L01248b11754l07210a76270j27592L7730a12743a984
$$ 287721 148126 70664 371912 -211754 -518964 -176270 -303862 -266132 -112743 -1984
16254D08811a59110M2078n87546B9166K3994b79295l5353j02012J28644N8515
$$ 408811 -159110 -117032 -704578 29166 53160 -279295 -314648 -416660 -288016 -229501
16244b29501a03889c1563A49731a29D28152q1464O70713N5423k05208k10299L31939
$$ -229501 -103889 -31563 149731 -129 428152 346688 1017401 1072824 867616 657317 989256
16233I89256m65828n4371J86533k0358a62670j22990E1909a56507C4875J47382
$$ 989256 523428 469057 655590 635232 -162670 -285660 51909 -156507 34875 182257
16223A82257c29157i2350p26532b59496l0767E4694J02759J03628K558e17393
$$ 182257 -329157 -92350 -818882 -259496 -290263 54694 157453 261081 263639 -517393
16212a61051G6758e36793K64753a21857j32137J23175j23042J07974p06503K31658
$$ -161051 76758 -536793 -272040 -121857 -253994 -130819 -253861 -145887 -852390 -620732
16202f20732Q3580J31254l29756J27768J22263a10845n04446K66352a25997l9439
$$ -620732 -537152 -405898 -735654 -607886 -485623 -110845 -615291 -348939 -125997 -165436
16192a65436c7532l78813C71302A25014L8592J61209j34267M08936p6462j10763
$$ -165436 -37532 -416345 371302 125014 163606 324815 190548 599484 523022 412259
16182D12259N98691C66827d0684C52501j19935K8096J98713J56100L5369J72166
$$ 412259 1010950 366827 -40684 352501 232566 260662 459375 615475 650844 823010
16172H23010l37589L47858m4460K76146m18388M92950m57855N95974m55933j98567
$$ 823010 485421 833279 788819 1064965 646577 1139527 681672 1277646 821713 623146
16162F23146L11562l70642M32473M85598G31607J64809N447K45596j77357O6259
$$ 623146 934708 564066 996539 1482137 731607 896416 901863 1147459 970102 1036361
16152A036361k74744K58911J84183n1156n29485L63566C56396M41228J95021k97708
$$ 1036361 761617 1020528 1204711 1153555 624070 987636 356396 797624 992645 694937
16142F94937L16762K7253Q6889l91779P8119L98271E61286L25379l01930N48653
$$ 694937 1011699 1038952 1125841 734062 812181 1210452 561286 886665 584735 1133388
16132A133388J2049k82623j65761K63258j55804D1924J041669m31877L53683l93754
$$ 1133388 1145437 862814 697053 960311 804507 41924 1083593 651716 1005399 611645
16122F11645J96046l79871K99603L46347r8453j49765j93290N44784n40843J99683
$$ 611645 807691 427820 727423 1073770 975317 825552 632262 1177046 636203 835886
16112H35886R7562J99518m14379N08875k66391C84948N08644K79237j49703L80168
$$ 835886 933448 1132966 718587 1227462 961071 384948 893592 1172829 1023126 1403294
16102A403294k11942E59653M3288o2303N87413J2949O5447J09100o7367n51822
$$ 1403294 1191352 559653 602941 540638 1128051 1141000 1206447 1315547 1248180 696358
16092F96358O00207K28334G57714P42735n9749j19236K52215F28402J028119k21018
$$ 696358 1296565 1524899 757714 1500449 1440700 1321464 1573679 628402 1656521 1435503
16082A435503n6229m38884L60589J92347m4935k04532K87796j90941J42623Q5204
$$ 1435503 1379274 940390 1300979 1493326 1448391 1243859 1531655 1340714 1483337 1568541
16072A568541R8067l98340O05812q79349L59115L47515M133j91096L53260j96687
$$ 1568541 1666608 1268268 1874080 994731 1353846 1701361 1705494 1514398 1867658 1670971
16062A670971Q4847m09391L23907K68383L543J28176m9275R1981k91856L54688
$$ 1670971 1755818 1346427 1670334 1938717 1942260 2070436 2021161 2113142 1821286 2175974
16052B175974l33008O28164n43523L25864j62522J33K56959j2670R2998m44699
$$ 2175974 1842966 2471130 1927607 2253471 2090949 2091082 2348041 2335371 2428369 1983670
16042A983670M94826j88920k91122O37621m42637M5002M44967k05173N4745J67135
$$ 1983670 2478496 2289576 1998454 2636075 2193438 2238440 2683407 2478234 2532979 2700114
16032B700114K03672l37682J08507j13345M62513m02869N14747k13979L28888
$$ 2700114 2903786 2566104 2674611 2561266 3023779 2620910 3135657 2921678 3250566
16023C250566n39174M75612l4464r3185K75138O3659j87291P33814k36017J54129
$$ 3250566 2711392 3187004 3152540 3059355 3334493 3398152 3210861 3944675 3708658 3862787
16013C862787m49765N62507k75792j87216p7728j63677Q00188m75984J98302k95282
$$ 3862787 3413022 3975529 3699737 3512521 3434793 3271116 4071304 3595320 3793622 3498340
16003C498340J102326p95720K21559l86203J98729R045N55879m62354m26699q3333
$$ 3498340 4600666 3804946 4026505 3640302 3839031 3848076 4403955 3941601 3514902 3431569
15993C431569K01800L3823K97950l24434J83914l35037O839m1240K25368L1828
$$ 3431569 3633369 3667192 3965142 3640708 3824622 3489585 3496424 3455184 3680552 3712380
15983C712380M2016K40258O5605M2709l9619m53128M19384J97682o9963n27913
$$ 3712380 3754396 3994654 4060259 4102968 4063349 3610221 4029605 4227287 4157324 3629411
15973C629411M2018L85941k18291q87491J255048k93632m0895l26276J49059l8394
$$ 3629411 3671429 4057370 3839079 2951588 4206636 3913004 3872109 3545833 3694892 3656498
15963C656498j0906J8807K19481l94179M65428n09109J45509P35132n87818N1579
$$ 3656498 3645592 3664399 3883880 3489701 3955129 3446020 3591529 4326661 3738843 3790422
15953C790422m34157K53428N6365m23994O06236j25967L28863n60573K31115M91258
$$ 3790422 3356265 3609693 3666058 3242064 3848300 3722333 4051196 3490623 3721738 4212996
15943D212996j11377k17669l66939J009742p04007Q7802j97470M66469J4343m16229
$$ 4212996 4101619 3883950 3517011 4526753 3822746 3910548 3713078 4179547 4193890 3777661
15933C777661O08568m53139N48716k4696J98025l78102Q55504m24791K30521m5507
$$ 3777661 4386229 3933090 4481806 4457110 4655135 4277033 5132537 4707746 4938267 4892760
15923D892760N33330L16120M48507j51582M13255k1316O80108N1585R67596J79415
$$ 4892760 5426090 5742210 6190717 6039135 6452390 6431074 7111182 7162767 8130363 8309778
15913H309778P78995M65248J695963Q98463J654853K501784L109097N627904P137859
$$ 8309778 9088773 9554021 11249984 12148447 13803300 16305084 19414181 25042085 32179944
15904C2179944Q867392J1029299J2781808J3029851J2328884R876106O748388
$$ 32179944 41047336 52076635 64858443 77888294 90217178 100093284 106841672
15897A06841672L321104r05420n488775q219770j0179566j0357352j0258491r574465
$$ 106841672 110162776 109257356 103768581 95548811 85369245 75011893 64753402 55178937
15889E5178937q715562p065473p197173m587465m557805l485532l164100j912195
$$ 55178937 46463375 39397902 32200729 27613264 23055459 19569927 16405827 14493632
15881A4493632j890074j468536j266428j662049m07786n72187o44314m52746J36491
$$ 14493632 12603558 11135022 9868594 8206545 7798759 7226572 6582258 6129512 6266003
15872F266003o06006N1846k33627n24375o244o4571L379m9576k04625n99665j96687
$$ 6266003 5659997 5711843 5478216 4953841 4947597 4883026 4886405 4836829 4632204 4032539 3835852
15861C835852K91293m23969P92N90282k51316n15318N11468L02075o09816k58111
$$ 3835852 4127145 3703176 3703968 4294250 4042934 3527616 4039084 4341159 3731343 3473232
15851C473232O38320k80618m82152J66453O24659l33915K7687K04175M29144o39258
$$ 3473232 4111552 3830934 3348782 3515235 4139894 3805979 3833666 4037841 4466985 3827727
15841C827727j90473M04134M3038j7208J70255K70021K98700n54930k11174K63080
$$ 3827727 3637254 4041388 4084426 4067218 4237473 4507494 4806194 4251264 4040090 4303170
15831D303170O9477J24738o64991M09265l24262M51944k02084k79376O09373o20611
$$ 4303170 4372647 4497385 3832394 4241659 3917397 4369341 4167257 3887881 4497254 3876643
15821C876643j27232j06699M26338J02861p03697K36771L54589J20373J81407
$$ 3876643 3749411 3642712 4069050 4171911 3468214 3704985 4059574 4179947 4361354
15812D361354k48122N2956j6477J02112P0753R9546Q8400J53435k21160O15893
$$ 4361354 4113232 4166188 4149711 4251823 4322576 4422122 4510522 4663957 4442797 5058690
15802E058690L3923K48616K56069m00027J20359K47014M11770J89841j6961O62094
$$ 5058690 5092613 5341229 5597298 5197271 5317630 5564644 5976414 6166255 6149294 6811388
15792F811388k4235N66056l02509o90607P56825J00181K2332N11149M92324j98131
$$ 6811388 6787153 7353209 7050700 6360093 7116918 7217099 7239431 7750580 8242904 8044773
15782H044773P29009k15247M18238P1144J124481m47432N03375m22464J84349
$$ 8044773 8773782 8558535 8976773 9047917 10172398 9724966 10228341 9805877 9990226
15773I990226k88804j40073k05802M57170n23779Q55627j5755M2487J81896M44996
$$ 9990226 9701422 9561349 9355547 9812717 9288938 10144565 10128810 10171297 10353193 10798189
15763A0798189k64092p3199K4118K13488n633r3714k87805k16463r1727j3767
$$ 10798189 10534097 10460898 10485016 10698504 10692871 10599157 10311352 10094889 10003162 9989395
15753I989395k21749J84613j32206K01492K9742J54926O9990J68610P0826M92440
$$ 9989395 9767646 9952259 9820053 10021545 10051287 10206213 10276203 10444813 10515639 11008079
15743A1008079R8666M32735P98598P1755Q89013O65167k69641l54123J77167r3887
$$ 11008079 11106745 11539480 12338078 12409833 13298846 13964013 13694372 13340249 13517416 13423529
15733A3423529M75524k04987P61216l30062L58118Q25072j58754m73692K60787
$$ 13423529 13899053 13694066 14455282 14125220 14483338 15308410 15149656 14675964 14936751
15724A4936751m87919q8217q20347j4158m13160P4890M36042l38105K1431n2337
$$ 14936751 14448832 14360615 13540268 13526110 13112950 13187840 13623882 13285777 13307208 13254871
15714A3254871k31702k88582p90571n9141N5711k30519k88995M07668M99682j50611
$$ 13254871 13023169 12734587 11944016 11884875 11940586 11710067 11421072 11828740 12328422 12177811
15704A2177811R47711J93122n9120J094333l10970K74802N12402j68276L42388
$$ 12177811 13125522 13318644 13259524 14353857 14042887 14317689 14830091 14661815 15004203
15695A5004203n13481N05657k68700k16726P5909k90713p2586L32811l97857p28853
$$ 15004203 14490722 14996379 14727679 14510953 14586862 14296149 14223563 14556374 14158517 13429664
15685A3429664J3724l01212Q270J93223o0324l96467l5932j043510N52236m94314
$$ 13429664 13443388 13142176 13150446 13343669 13283345 12886878 12850946 11807436 12359672 11865358
15675A1865358l20469r6811k85807k08463M40440l83245j59278L45148O46524
$$ 11865358 11544889 11448078 11162271 10953808 11394248 11011003 10851725 11196873 11843397
15666A1843397k4188Q13988N83442N63011J61715J149427J379056P25745O43968
$$ 11843397 11819209 12633197 13216639 13779650 13941365 15090792 16469848 17195593 17839561
15657A7839561J612393N40239J058314J523194J182445J337672J008915J475908
$$ 17839561 19451954 19992193 21050507 22573701 23756146 25093818 26102733 27578641
15649B7578641J415719Q80398J268742P46823J397280P83261J449283K169638
$$ 27578641 28994360 29874758 31143500 31890323 33287603 34070864 35520147 37689785
15641C7689785J726355J557173J789377J515428J415485Q53045L67261N62400
$$ 37689785 39416140 40973313 42762690 44278118 45693603 46546648 46913909 47476309
15633D7476309K57962j365478K15640k37131n81482M38312k12147j50055J82409
$$ 47476309 47734271 46368793 46584433 46347302 45765820 46204132 45991985 45841930 46024339
15624D6024339o84996j82452j296692r26800j880033j537884k249791j428805
$$ 46024339 45339343 45156891 43860199 42933399 41053366 39515482 37265691 35836886
15616C5836886k313722j468982q96223j332648r80512j097454j235802n45163
$$ 35836886 33523164 32054182 31157959 29825311 28844799 27747345 26511543 25966380
15608B5966380j432068p01250n67992j076981m66440n67130m73612m52893m58429
$$ 25966380 24534312 23833062 23265070 22188089 21721649 21154519 20680907 20228014 19769585
15599A9769585P2677j67935n03520N48062O50935J543885K001178N369159Q454296
$$ 19769585 19842262 19674327 19170807 19718869 20369804 21913689 23914867 29284026 37738322
15590C7738322J2210628J6656378J5300866J6006149J2724468O365509R38650
$$ 37738322 49948950 66605328 81906194 97912343 110636811 117002320 117940970
15583A17940970l828341q991865j4699052j5565110j0340440p708410p684378
$$ 117940970 114112629 105120764 90421712 74856602 64516162 56807752 49123374
15576D9123374q893784o790977n263318k755758k806772j344097j753515l07838
$$ 49123374 40229590 33438613 28175295 25419537 22612765 21268668 19515153 19207315
15568A9207315p11782r72640J64060j114297Q10352Q9787j70914M76141J563555
$$ 19207315 18495533 17522893 17686953 16572656 17383008 17472795 17301881 17778022 19341577
15559A9341577J880376L661477P432066J2763073J7700253K2210575K1251995
$$ 19341577 21221953 24883430 32315496 45078569 62778822 84989397 106241392
15552A06241392J9012344J4815537O112528j19118o939363j3349864k1050401
$$ 106241392 125253736 140069273 146181801 146062683 139123320 125773456 104723055
15545A04723055j8334211j2703256j0126064j0457669j1278953q359714n950538
$$ 104723055 86388844 73685588 63559524 53101855 41822902 33463188 27512650
15538B7512650m024311k351877k993696j897128j303078o39775j234102J42304
$$ 27512650 23488339 21136462 18142766 16245638 14942560 14302785 13068683 13210987
15530A3210987j248600n97441n02976p97115K23126m72254l38198l73137L66686
$$ 13210987 11962387 11364946 10861970 10064855 10287981 9815727 9477529 9104392 9471078
15521I471078m61507J01448j00152M6063j55503l03279P83681o1644K50701m38868
$$ 9471078 9009571 9111019 9010867 9056930 8901427 8598148 9381829 9320185 9570886 9132018
15511I132018J85938L40061Q8147K84827P7115q3705j89546K45827j94354o77025
$$ 9132018 9317956 9658017 9746164 10030991 10108106 10024401 9834855 10080682 9886328 9209303
15501I209303O53423m38427j41927K72057m09091K12645L6452M17133l65646M2931
$$ 9209303 9862726 9424299 9282372 9554429 9145338 9357983 9394435 9811568 9445922 9488853
15491I488853N07378k00505O92074l59430K17992L36851J15935k1815P95429o1650
$$ 9488853 9996231 9795726 10487800 10128370 10346362 10683213 10799148 10777333 11572762 11511112
15481A1511112K19758p6248Q28101k96991Q4415L32836j63342O38371L77329Q20119
$$ 11511112 11730870 11654622 12482723 12185732 12270147 12602983 12439641 13078012 13455341 14275460
15471A4275460M09780J834430M65494J168064J062950O56122J7357m113l68757
$$ 14275460 14685240 16519670 16985164 18153228 19216178 19872300 19889657 19885544 19516787
15462A9516787n00391m88584k89815k94557M78473K86163N00044J205560L31247
$$ 19516787 19016396 18527812 18237997 17943440 18421913 18708076 19208120 20413680 20744927
15453B0744927J026737k9308J094576k28840p15318J67096q66971n07209m18090
$$ 20744927 21771664 21742356 22836932 22608092 21892774 22059870 21192899 20685690 20267600
15444B0267600m18093Q8172j40826l69709P56987n69834Q27855m31808N50183
$$ 20267600 19849507 19937679 19796853 19427144 20184131 19614297 20442152 20010344 20560527
15435B0560527k36986m35187m38571p86020j61151l66748j047530Q0655n08579
$$ 20560527 20323541 19888354 19449783 18663763 18502612 18135864 17088334 17168989 16660410
15426A6660410p43262k86244k44639m34110m01067j27733k64668j050126Q9479
$$ 16660410 15917148 15630904 15386265 14952155 14551088 14423355 14158687 13108561 13198040
15417A3198040k609n09433K68726o51407R8732J46698n21317n9278L0313K4666
$$ 13198040 13195431 12685998 12954724 12303317 12402049 12548747 12027430 11968152 11998465 12023131
15407A2023131j32059N38426j68782j82886J10648L13536O43419j33796M18038
$$ 12023131 11891072 12429498 12260716 12077830 12188478 12502014 13145433 13011637 13429675
15398A3429675K74897k8648J59367J32300m36126k64926K9355m70352K60416p13193
$$ 13429675 13704572 13675924 13835291 13967591 13531465 13266539 13295894 12825542 13085958 12372765
15388A2372765k48789J79557N51501m51928m4664N24065l98942L04240q10742
$$ 12372765 12123976 12303533 12855034 12403106 12358442 12882507 12483565 12787805 11977063
15379A1977063K00728k48663M0350M94707n88718J46317j6960J52925m5462K7023
$$ 11977063 12177791 11929128 11969478 12464185 11875467 12021784 12004824 12157749 12112287 12139310
15369A2139310Q9404N05519p6184j9101O05259n41931O67895j17563J002284q85054
$$ 12139310 12228714 12734233 12658049 12638948 13244207 12702276 13370171 13252608 14254892 13369838
15359A3369838N82399J20947P66807l64388P60509K87212J030071R22011J425975
$$ 13369838 13952237 14073184 14839991 14475603 15236112 15523324 16553395 17475406 18901381
15350A8901381K255022L708462O878812Q619685R676349R627822Q266047N778334
$$ 18901381 21156403 24864865 31743677 40363362 50039711 59667533 67933580 73711914
15342G3711914L205981J16887k625239o159352p463107o637260m157958l661037
$$ 73711914 76917895 77034782 74409543 68250191 60787084 54149824 49991866 46330829
15334D6330829l600256l373247l440287j640073j655758j965078j334002j257032
$$ 46330829 42730573 39357326 35917039 34276966 32621208 30656130 29322128 28065096
15326B8065096j139837n36696M3488o9081K89818p8069M86178O59602J876201
$$ 28065096 26925259 26388563 26432051 26362970 26652788 26574719 27060897 27720499 29596700
15317B9596700K831007N056168R324506J2745968J5774028J7812257J6342623
$$ 29596700 32427707 37483875 46808381 59554349 75328377 93140634 109483257
15310A09483257J3065040Q093218K838654l479260q161213j3717397j4283982
$$ 109483257 122548297 130641515 133480169 130000909 121839696 108122299 93838317
15303I3838317j2855307j0873151r567426r242122p414062n773200m604031k693411
$$ 93838317 80983010 70109859 60542433 51300311 43886249 38113049 33509018 30815607
15295C0815607k199630j701510m57350m98768p58892k47225J72859m09465l62902
$$ 30815607 28615977 26914467 26457117 25958349 25199457 24952232 25125091 24715626 24352724
15286B4352724M3291N6678Q90509L83406K376480L724683O019856P651803Q575971
$$ 24352724 24396015 24452693 25343202 25726608 28103088 31827771 37847627 45499430 54075401
15277E4075401Q485757P508407M056731J223982j108512m300003o006731p695453
$$ 54075401 62561158 70069565 74126296 75350278 74241766 69941763 63935032 56239579
15269E6239579o687761m935920m919816l919670m549108l082589l055011j752882
$$ 56239579 49551818 44615898 39696082 35776412 31227304 28144715 25089704 23336822
15261B3336822j269667j244118o39793r89352l43515n6402Q9899K47285l08390
$$ 23336822 22067155 20823037 20183244 19193892 18850377 18793975 18883874 19131159 18822769
15252A8822769P53406n4428K80338k05556p1734M09054j29063l95985n27015k35204
$$ 18822769 19576175 19521747 19802085 19596529 19524795 19933849 19804786 19408801 18881786 18646582
15242A8646582K69373l99798J41041M80827O80706J265233J047689Q01385J083651
$$ 18646582 18915955 18516157 18657198 19138025 19818731 21083964 22131653 22933038 24016689
15233B4016689R77855R0519N52808j56978q50041m6603m20826j060077o96351
$$ 24016689 24994544 25085063 25637871 25480893 24630852 24584249 24163423 23103346 22406995
15224B2406995n39269K6931n95277j43626r41258K14550K20114J20813K01263
$$ 22406995 21867726 21894657 21299380 21155754 20214496 20429046 20649160 20769973 20971236
15215B0971236J089424L94962l66871k15714o70392o24603J5228j242523p94880
$$ 20971236 22060660 22455622 22088751 21873037 21202645 20578042 20593270 19350747 18555867
15206A8555867j496678l20260n15211j278563p99987q39027J05735r73531L8821
$$ 18555867 17059189 16738929 16223718 14945155 14145168 13306141 13411876 12438345 12477166
15197A2477166l17542K21002L644j03287Q53086o19881L42412R28233J52182l29823
$$ 12477166 12159624 12380626 12384270 12280983 13134069 12514188 12856600 13784833 13937015 13607192
15187A3607192N4969L43088Q2227Q1597J98105k20777N55881L09702O53678K01440
$$ 13607192 13662161 14005249 14087476 14169073 14367178 14146401 14702282 15011984 15665662 15867102
15177A5867102N76288J60114k30771p9501N45369m11415J1827K4066K43783j4647
$$ 15867102 16443390 16603504 16372733 16293232 16838601 16427186 16439013 16463079 16706862 16692215
15167A6692215l81436L17582k22711k3508l18560J20629K7300M97520k9476l20137
$$ 16692215 16310779 16628361 16405650 16382142 16063582 16184211 16211511 16709031 16679555 16359418
15157A6359418M48917k53098K61342K75603j1126j9312q59641N29814q13847K69972
$$ 16359418 16808335 16555237 16816579 17092182 17081056 17061744 16202103 16731917 15918070 16188042
15147A6188042m81232M0836L19634J2591r548j49595M5663K18319N40365p6797
$$ 16188042 15706810 15747646 16067280 16079871 16070323 15920728 15966391 16184710 16725075 16648278
15137A6648278N54807k60050j84469K48831l7351k590m07733J64316J78477j59284
$$ 16648278 17203085 16943035 16758566 17007397 16970046 16967456 16559723 16724039 16902516 16743232
15127A6743232J06177l1358j38224r3309j80039n7690k46120m47468J0912k89283
$$ 16743232 16849409 16818051 16679827 16586518 16406479 16348789 16102669 15655201 15666113 15376830
15117A5376830M35296n83304K63993o33758O86067k83487j64960j85043K30104
$$ 15376830 15812126 15228822 15492815 14859057 15545124 15261637 15096677 14911634 15141738
15108A5141738Q7527J94282r3917j66695N85681j24647K65463P37870N62620M68348
$$ 15141738 15229265 15423547 15329630 15162935 15748616 15623969 15889432 16627302 17189922 17658270
15098A7658270L07640M73572O61241J198943N64527J781637J955412L297176L496376
$$ 17658270 17965910 18439482 19100723 20299666 20864193 22645830 24601242 27898418 31394794
15089C1394794L365280L910350L819278K789843J632722J65227q30789j107905
$$ 31394794 34760074 38670424 42489702 45279545 46912267 47077494 46246705 45138800
15081D5138800k312333j696358j301269L1936N91079J608810L387373L318232
$$ 45138800 42826467 41130109 39828840 39860776 40451855 42060665 45448038 48766270
15073D8766270L116203L304038J496927P92276j49818j537641j631952q51912
$$ 48766270 51882473 55186511 56683438 57475714 57325896 55788255 54156303 53304391
15065E3304391J307752L800887M434208M213343N382635M156021L174511J992147
$$ 53304391 54612143 58413030 62847238 67060581 72443216 76599237 79773748 81765895
15057H1765895K606340m8822j031722P88705J048474K133843J115155K881420
$$ 81765895 84372235 84323413 83291691 84080396 85128870 87262713 88377868 91259288
15049I1259288K858633J651070L264685K178675J194136O80030p8966j615311
$$ 91259288 94117921 95768991 99033676 101212351 102406487 103086517 103007551 101392240
15041A01392240k602980k600426j614526l166679l822095m270578n288184n065890
$$ 101392240 98789260 96188834 94574308 91407629 87585534 83314956 78026772 72960882
15033G2960882m144264j556733m81944R42981J673503J520865J987712J205006
$$ 72960882 68816618 67259885 66777941 67720922 69394425 70915290 72903002 74108008
15025G4108008L79148j077896q19707j709096j051691P36670L563730M726073
$$ 74108008 74487156 73409260 72589553 70880457 69828766 70565436 74129166 78855239
15017G8855239O452695P720024P761164P964265O997079N785555N224288L808986
$$ 78855239 85307934 93027958 100789122 108753387 115750466 121536021 126760309 130569295
15009A30569295K556258L204003K859402L959729M341887L458948K776631K863732
$$ 130569295 133125553 136329556 139188958 143148687 147490574 150949522 153726153 156589885
15001A56589885K761068L735032K413292L468624M205622N366368O782321P449989
$$ 156589885 159350953 163085985 165499277 168967901 173173523 178539891 185322212 192772201
14993A92772201Q550267R299096J0318391J0243448R939414J0271905P908647
$$ 192772201 201322468 210621564 220939955 231183403 241122817 251394722 259303369
14986B59303369M308241J795040j690644p215553r155933j3506276j5831219j7521769
$$ 259303369 263611610 265406650 263716006 256500453 247344520 233838244 218007025 200485256
14978B00485256j7361182j6700892j5216777j5408336j2770721j0673308j0051461
$$ 200485256 183124074 166423182 151206405 135798069 123027348 112354040 102302579
14971A02302579p287357o033967n538414m264101l199914k908590j268743j560168
$$ 102302579 95015222 88981255 83442841 79178740 75978826 73070236 71801493 70241325
14963G0241325n43509J87765O71242J831994L655350N860646R724152J3466103
$$ 70241325 69697816 69885581 70556823 72388817 76044167 81904813 91628965 105095068
14955A05095068J8590626K4856925L0242945L6486985M1776280M5333331M7794610
$$ 105095068 123685694 148542619 178785564 215272549 257048829 302382160 350176770
14948C50176770M8324705M6333330M1172723L1354646J9269376Q376005o134719
$$ 350176770 398501475 444834805 486007528 517362174 536631550 545007555 538872836
14941E38872836j8895073k4501315k8573972l3180053l4150455k9490099k4440028
$$ 538872836 519977763 495476448 466902476 433722423 399571968 370081869 345641841
14934C45641841k1523279k2519706k1786811k1795474j9954345j7108407j6200080
$$ 345641841 324118562 301598856 279812045 258016571 238062226 220953819 204753739
14927B04753739j4955670j3749709j1571651r117371n812457n175652m858088
$$ 204753739 189798069 176048360 164476709 155359338 149546881 144371229 139513141
14920A39513141n180058p130238q112557r778710j1586707j2527879j0567667
$$ 139513141 134333083 127202845 119090288 109311578 97724871 85196992 74629325
14913G4629325q158017p964665o665642n297297n244618l289669k354180j489459
$$ 74629325 66471308 58506643 51841001 46543704 41299086 38009417 35655237 34165778
14905C4165778l77054m06699Q23237O86188J014303J835321K841235L943140N103028
$$ 34165778 33788724 33382025 34205262 34891450 35905753 37741074 40582309 44525449 49628477
14896D9628477O731670P034547O987844N823146L713723J824631j283744k397008
$$ 49628477 56360147 63394694 70382538 76205684 79919407 81744038 80460294 78063286
14888G8063286n228875n262836n865259m809914m175478l740949l382395l216291
$$ 78063286 72834411 67571575 61706316 56896402 52720924 48979975 45597580 42381289
14880D2381289j923045j205209k32877l43973N85449K18446J520462M3343O49325
$$ 42381289 40458244 39253035 39020158 38676185 39261634 39480080 41000542 41043885 41693210
14871D1693210P07649Q0291L91640j35667M81271k16445R83303R57481K392846
$$ 41693210 42400859 42481150 42872790 42737123 43218394 43001949 43985252 44942733 47335579
14862D7335579L788927N389369R292167J1588923J3629398J5102366J4000616
$$ 47335579 51124506 56513875 65806042 77394965 91024363 106126729 120127345
14855A20127345J2209699Q690133M088649j469188o109914r379319j0206430j2527726
$$ 120127345 132337044 141027177 145115826 143646638 137536724 128157405 117950975 105423249
14847A05423249j2686930j1345113j0257814p618458o443878o320715m272161
$$ 105423249 92736319 81391206 71133392 63514934 57071056 50750341 46478180
14840D6478180l209178k642666k422397j591862j522675j153248r04439j248341
$$ 46478180 43269002 40626336 38203939 36612077 35089402 33936154 33031715 31783374
14832C1783374p69994m34625L0731K87098J57060R40628Q18958R28470K481674
$$ 31783374 31013380 30578755 30609486 30896584 31053644 31994272 32813230 33741700 36223374
14823C6223374L516282M890728P784204J0094232J1143794J0711412P854928O740639
$$ 36223374 39739656 44630384 52414588 62508820 73652614 84364026 92218954 98959593
14815I8959593J595617j428945n836895p840359r723589r822191q509200o293615
$$ 98959593 100555210 99126265 93289370 85449011 75725422 65903231 57394031 51100416
14807E1100416o429475n236937m678713l578632k127501j247503j245007j133422
$$ 51100416 44670941 39434004 34755291 31176659 29049158 27801655 26556648 25423226
14799B5423226l52822k05397q24946m04309m7485n21192n40630P2498p27541l72332
$$ 25423226 25070404 24865007 24040061 23635752 23588267 23067075 22526445 22598943 21871402 21499070
14789B1499070m81764J58354k88449j00006O7986L28793O41254k06330O40068
$$ 21499070 21017306 21175660 20887211 20787205 20855191 21183984 21825238 21618908 22258976
14780B2258976J220476J295035J490939O58792R87464L23937K6758j21281r58831
$$ 22258976 23479452 24774487 26265426 26924218 27911682 28235619 28262377 28141096 27182265
14771B7182265j361665j188246q06687j140033q85104r21259m15155N7847o84647
$$ 27182265 25820600 24632354 23825667 22685634 21800530 20879271 20464116 20521963 19837316
14762A9837316J56324J65838l19889N3720P08626q4263N33963J50985L82559J172664
$$ 19837316 19993640 20159478 19839589 19893309 20601935 20517672 21051635 21202620 21585179 22757843
14752B2757843Q10999J053046O71181O99320R50847M60231M7924j30683m43343
$$ 22757843 23568842 24621888 25293069 25992389 26943236 27403467 27451391 27320708 26877365
14743B6877365N71060L52261N57078J172527K131312J990555K750710M911786
$$ 26877365 27448425 27800686 28357764 29530291 31661603 33652158 36402868 41314654
14735D1314654N325288P918437J2416887J8063642K7049871L5831504M4073551
$$ 41314654 46639942 54558379 66975266 85038908 112088779 147920283 191993834
14728A91993834M8483927M9262456M3309006L2142142J9233954K401419j4737246
$$ 191993834 240477761 289740217 333049223 365191365 384425319 386826738 372089492
14721C72089492k7468756l4992079l9572848l9094406l6025011l1980035k8131342
$$ 372089492 344620736 309628657 270055809 230961403 194936392 162956357 134825015
14714A34825015k3269858j9105039j5004122j1058556q226020p280346n642779
$$ 134825015 111555157 92450118 77445996 66387440 58161420 50881074 45238295
14707D5238295m456489l861314l454439l263846l020847j450525j999444j245726
$$ 45238295 40781806 36920492 33466053 30202207 27181360 25730835 23731391 22485665
14699B2485665r30504j153319r88117k90103M06244m48479M97477M11574m46983
$$ 22485665 21555161 20401842 19413725 19123622 19529866 19081387 19578864 19990438 19543455
14690A9543455o2013J85990r02789m35975m6484l23202J25783P11179J2868K99184
$$ 19543455 19481442 19667432 18764643 18328668 18282184 17958982 18084765 18795944 18808812 19107996
14680A9107996M60455Q47649J328834Q53249J891779J090000J005833P05974l53318
$$ 19107996 19568451 20416100 21744934 22598183 24489962 25579962 26585795 27291769 26938451
14671B6938451o03966j101287j695143p89343j160666M01131O2498k48123P16471
$$ 26938451 26334485 25233198 23538055 22748712 21588046 21989177 22051675 21803552 22520023
14662B2520023J17979j78369q42995k06248j936714j138067j114187n06965o13285
$$ 22520023 22638002 22459633 21616638 21410390 19473676 18335609 17221422 16714457 16101172
14653A6101172q64617j230990K59938M38097R67212J003818R03754R84180J244818
$$ 16101172 15236555 14005565 14265503 14703600 15670812 16674630 17578384 18562564 19807382
14644A9807382P51916J34928O94578L08537k78829J270509Q51304J427607J260471
$$ 19807382 20559298 20694226 21388804 21697341 21418512 22689021 23540325 24967932 26228403
14635B6228403J155229N56803K92822q99521q01915j817292k577902j737287k528074
$$ 26228403 27383632 27940435 28233257 27333736 26531821 24714529 22136627 20399340 17871266
14626A7871266j745390j431933k104364q09362n96602r25298j60098k41338j00053
$$ 17871266 16125876 14693943 12589579 11780217 11183615 10258317 10098219 9856881 9756828
14617I756828k00483l34853J24772o98065O18108m33056m03228L40152q29724
$$ 9756828 9556345 9221492 9346264 8648199 9266307 8833251 8430023 8770175 7940451
14608G940451k0831j78476J57088K59538k47831L27279J379960J484944J734645
$$ 7940451 7919620 7741144 7898232 8157770 7909939 8237218 9617178 11102122 12836767
14599A2836767K010396J688435J703497J097140Q55940l4193r38530j151987j654923
$$ 12836767 14847163 16535598 18239095 19336235 20192175 20157982 19219452 18067465 16412542
14590A6412542j894700p09769j261411r16716k77226r76733P4339k15212k62137
$$ 16412542 14517842 13808073 12546662 11629946 11352720 10375987 10450326 10235114 9972977
14581I972977l56153J80047J27532q02917N23547K2702L9818l3415R55989J67289
$$ 9972977 9616824 9796871 9924403 9121486 9645033 9667735 9707553 9674138 10630127 10797416
14571A0797416M8336Q04433J095696J628628J797866J406221J961978J883765
$$ 10797416 10845752 11650185 12745881 14374509 16172375 17578596 19540574 21424339
14563B1424339K141326L541505N281367P129254R899186Q622067R997692Q236509
$$ 21424339 23565665 27107170 32388537 39517791 49416977 58039044 68036736 76273245
14555G6273245M246978J124749j968821m870725p891042q569597o670968m543484
$$ 76273245 80520223 81644972 79676151 74805426 66914384 58344787 51673819 47130335
14547D7130335l101471n06882K349212O521753R390860J0299138R473677O990654
$$ 47130335 44028864 43521982 45871194 52392947 61783807 72082945 81556622 88547276
14539H8547276L586001N08019m433404o978954r960033r548812p564893o262921
$$ 88547276 92133277 92641296 88207892 81228938 71268905 61720093 54155200 47892279
14531D7892279n163514n066249l762511l045161j502081j463360j309113j097630
$$ 47892279 42728765 37662516 33900005 30854844 29352763 27889403 26580290 25482660
14523B5482660J32468J101138L938690N630415P143264P841012P448023N244741
$$ 25482660 25615128 26716266 30654956 36285371 43428635 51269647 58717670 63962411
14515F3962411L464167J536963r74167k901979m961684m722073k962154j565900
$$ 63962411 67426578 68963541 67989374 65087395 60125711 55403638 52441484 50875584
14507E0875584q24766k25572K204100M136961N700514M933528M699140K754589
$$ 50875584 50050818 49825246 52029346 56166307 61866821 66800349 71499489 74254078
14499G4254078J238412j654421l686102m856261o953471n477852m311282m390064
$$ 74254078 75492490 73838069 70151967 65295706 58342235 52864383 48553101 44163037
14491D4163037m579607m790263l797991l085926l233318l714118k852799k475456
$$ 44163037 39583430 34793167 30995176 27909250 24675932 20961814 18109015 15633559
14483A5633559j346073j976225j168119j024517n59474j023101L67853k60020
$$ 15633559 14287486 12311261 11143142 10118625 9559151 8536050 8903903 8643883
14475H643883j59785Q5056Q51066N02856O95102J725502P55722J272112M15696
$$ 8643883 8484098 8569154 9420220 9923076 10618178 12343680 13099402 14371514 14787210
14466A4787210K31899k28570n17327k34340m70813N48744J124559J555614J028987
$$ 14787210 15019109 14790539 14273212 14038872 13568059 14116803 15241362 16796976 17825963
14457A7825963J184686Q01739N41652k64328m82020q57365j905328o53237j719606
$$ 17825963 19010649 19812388 20354040 20089712 19607692 18750327 16844999 16191762 14472156
14448A4472156j60630o85497m06099m84595k6422M66473j82262Q99409K20679
$$ 14472156 14311526 13626029 13219930 12735335 12708913 13175386 12993124 13892533 14113212
14439A4113212M44J26155N82418M61889J198952Q49087R93082J935130K086871
$$ 14113212 14113656 14239811 14822229 15284118 16483070 17332157 18325239 20260369 22347240
14430B2347240M276196N753732O978987Q560025Q725571P460131N039459L237387
$$ 22347240 26623436 32377168 39356155 47916180 56641751 64101882 69141341 72378728
14422G2378728P35544k650192l935013n395083o255245m769184n154986m861816
$$ 72378728 73114272 70464080 66529067 61133984 54878739 50109555 44954569 40092753
14414D0092753n261251m280495l407993l028256k081002k363276j805127j062500
$$ 40092753 34831502 30551007 27143014 24114758 22033756 19670480 17865353 16802853
14406A6802853q75753o78965n58314k19679J85006n38928N47473M65540J282695
$$ 16802853 15927100 15248135 14689821 14470142 14655148 14116220 14663693 15129233 16411928
14397A6411928R59277K643645L555475N526657Q178994J0993723J3592423J3904084
$$ 16411928 17371205 20014850 23570325 29096982 37275976 48269699 61862122 75766206
14389G5766206J3970290J1238944Q603782L811169j414505m537719r180092j0910717
$$ 75766206 89736496 100975440 109579222 113390391 111975886 107438167 98258075 87347358
14381H7347358j0499713j0398578r534830q790231p206066o462440n225113l531227
$$ 87347358 76847645 66449067 56914237 48124006 40917940 34455500 29230387 25699160
14373B5699160k574764k060868j899530j141166j235182j99382j031065o60488
$$ 25699160 23124396 21063528 19163998 18022832 16787650 16588268 15557203 14896715
14365A4896715n98415k16889n21411J653M06987N92093J933876J525789L049428
$$ 14896715 14298300 14081411 13560000 13561653 13968640 14560733 16494609 18020398 21069826
14356B1069826L095721M851237N527667O027511N190860M310448K875661J191158
$$ 21069826 24165547 29016784 34544451 40571962 45762822 50073270 52948931 54140089
14348E4140089r94246k745757l814075m502367n048219l819246l474657l625690
$$ 54140089 53145843 50400086 46586011 42083644 37035425 33216179 29741522 26115832
14340B6115832k656282j261057Q68625J906642M109471L739885L396394K894675
$$ 26115832 23459550 22198493 23067118 24973760 29083231 32823116 36219510 39114185
14332C9114185J004071Q58151j290021k304974m622768l696435j878878j874603
$$ 39114185 40118256 40976407 39686386 37381412 32758644 29062209 27183331 25308728
14324B5308728j361638j622431j816619M22903J53922J076394J088334J588389
$$ 25308728 23947090 22324659 20508040 20930943 21084865 22161259 23249593 24837982
14316B4837982J574576L195240L827720M630847N899685P568270J0004654J2782745
$$ 24837982 26412558 29607798 33435518 38066365 43966050 51534320 61538974 74321719
14308G4321719J6605697K1253349K5990365K9305066K9581177K5849210K1420513
$$ 74321719 90927416 112180765 138171130 167476196 197057373 222906583 244327096
14301B44327096J3073756N570438m141302j2450882j9542223k4046461k5564165
$$ 244327096 257400852 262971290 258829988 246379106 226836883 202790422 177226257
14294A77226257k4660760k3047335k0610025j7359858j4947108j1256263r839115
$$ 177226257 152565497 129518162 108908137 91548279 76601171 65344908 55505793
14287E5505793p960802o727778n352616m072789m151716k847411k565133k256823
$$ 55505793 47544991 40817213 35464597 31391808 27240092 24392681 21827548 19570725
14279A9570725j874541r66114j431288j061432o78283o59802j90634j540032o89554
$$ 19570725 17696184 16730070 15298782 14237350 13559067 12899265 12708631 11168599 10479045
14270A0479045j40657n16898m62164q66287j16335o88377k03455o5865k58828
$$ 10479045 10338388 9821490 9359326 8493039 8376704 7688327 7484872 7419007 7160179
14261G160179m27463J90709k21508j43110M8284j07904l0510k07447J09843l08088
$$ 7160179 6732716 6923425 6701917 6558807 6607091 6499187 6468677 6261230 6371073 6062985
14251F062985K87213p64330L6082O5689Q4882n34553q1128l83644L71374l16259
$$ 6062985 6350198 5585868 5621950 5687639 5772521 5237968 5156840 4773196 5144570 4828311
14241D828311K74857p64905N80089K13752n09209K84058L18651r39892P41147
$$ 4828311 5103168 4338263 4918352 5132104 4622895 4906953 5225604 4285712 5026859
14232E026859r64940K45292k7903O0479l6016j15439J03776Q2665L36548k97761
$$ 5026859 4061919 4307211 4279308 4339787 4303771 4188332 4292108 4374773 4711321 4413560
14222D413560N8491J29305k80974K86115j81059N31145n03399K47020O1029L43268
$$ 4413560 4472051 4601356 4320382 4606497 4425438 4956583 4453184 4700204 4761233 5104501
14212E104501m03536q5056M87888N15539K90453J134708Q55669l03252L04414
$$ 5104501 4700965 4615909 5103797 5619336 5909789 7044497 7900166 7596914 7901328
14203G901328K57099N1735p05394j226136n46501j52666k74773l55423m65820
$$ 7901328 8158427 8210162 7504768 6278632 5732131 5579465 5304692 4949269 4483449
14194D483449l48207L09055j27915K38428O4468o08762M61161Q1468l17402J36554
$$ 4483449 4135242 4444297 4316382 4554810 4619278 4010516 4471677 4553145 4235743 4372297
14184D372297J81295o67288J19212K29280q9143l8886K8452J81382m39468L27273
$$ 4372297 4553592 3886304 4005516 4234796 4145653 4106767 4135219 4316601 3877133 4204406
14174D204406l53951M53763l21132J32208J47842j95734K65506k46776j41745
$$ 4204406 3850455 4304218 3983086 4115294 4263136 4067402 4332908 4086132 3944387
14165C944387J55832o2729L513K30414L42987o16985k3359P65398k00272k03082
$$ 3944387 4100219 4037490 4041003 4271417 4614404 3997419 3974060 4739458 4539186 4336104
14155D336104k3996R7210j77073L47935m05622K31219o6149L77115M0423M64180
$$ 4336104 4312108 4409318 4232245 4580180 4174558 4405777 4339628 4716743 4757166 5221346
14145E221346k6498J49202L46655P62572J827315J790072J578405K448313J131622
$$ 5221346 5194848 5344050 5690705 6453277 8280592 10070664 11649069 14097382 15229004
14136A5229004J647316N69282M74017q19595j151536j529241j186973j296919
$$ 15229004 16876320 17445602 17919619 17100024 15948488 14419247 13232274 11935355
14128A1935355j149814j216289j229598r44237j27434M14806J83048J22913O06837
$$ 11935355 10785541 9569252 8339654 7395417 7267983 7682789 7865837 7988750 8595587
14119H595587j26016P27169K8573m08569J93018l50634j024952k76405l83274
$$ 8595587 8469571 9196740 9225313 8816744 9009762 8659128 7634176 7357771 6974497
14110F974497j45939j52004n56840m3967k20125q9825m04275J058330l45530O9172
$$ 6974497 6828558 6676554 6119714 6075747 5855622 5765797 5361522 6419852 6074322 6143494
14100F143494O4332N55357J366891P32931J44659P82930J26546N49826o17509
$$ 6143494 6207826 6763183 8130074 8863005 9007664 9790594 9917140 10466966 9849457
14091I849457J05341m66444m96982L07770l80222L49457O37370O51855J065990
$$ 9849457 9954798 9488354 8991372 9299142 8918920 9268377 9905747 10557602 11623592
14082A1623592P12925L13106K81685J05397K4632j168566j089150q62897q1148
$$ 11623592 12336517 12649623 12931308 13036705 13061337 11892771 10803621 9940724 9859576
14073I859576j346857j60871l68521p15513j4466L18287j16033q33699J010713
$$ 9859576 8512719 8351848 7983327 7267814 7253348 7571635 7455602 6621903 7632616
14064G632616r7048N88405O79029R92028N86048O95724Q58821N93666J76637R05410
$$ 7632616 7535568 8123973 8803002 9795030 10381078 11076802 11935623 12529289 12705926 13611336
14054A3611336Q5536J25732j80309L30152P47549K74905J447554J606498Q23336
$$ 13611336 13696872 13822604 13642295 13972447 14719996 14994901 16442455 18048953 18872289
14045A8872289K033239J625905K279463K213345K615677K677418K824256L972640
$$ 18872289 20905528 22531433 24810896 27024241 29639918 32317336 35141592 39114232
14037C9114232N049188O545127Q370160J1922668J5805420K1476937K7350494
$$ 39114232 44163420 50708547 59078707 71001375 86806795 108283732 135634226
14030A35634226L0903692L0771121K9217284K2875234J6252118O020723k280676
$$ 135634226 166537918 197309039 226526323 249401557 265653675 271674398 269393722
14023B69393722j2800437j9135324k5803832k6721559k6072387k3455473k1953118
$$ 269393722 256593285 237457961 211654129 184932570 158860183 135404710 113451592
14016A13451592j8201349j5529170j2221059j0639989p807122o950965n586533
$$ 113451592 95250243 79721073 67500014 56860025 49052903 42101938 36515405
14009C6515405m895242l391131k922503l710535k488107j718018j118994j761325
$$ 36515405 31620163 28229032 25306529 21595994 19107887 17389869 16270875 14509550
14001A4509550r16584j484804p58671r26417M5984j160235j43213j16037l69206
$$ 14509550 13592966 12108162 11349491 10423074 10469058 9308823 9165610 9049573 8680367
13992H680367P1117K50582j26311P24824m17487J073993N38204J00959R01618
$$ 8680367 8751484 9002066 8875755 9600579 9183092 10257085 10795289 10896248 11797866
13983A1797866k61284Q78023m81495L84370K42074j99982J2837r62770l49170
$$ 11797866 11536582 12414605 11933110 12317480 12559554 12359572 12372409 11409639 11060469
13974A1060469m66729n43750q69201p03755Q9910j117873J59255l82779m67181
$$ 11060469 10593740 10049990 9180789 8477034 8566944 7449071 7608326 7225547 6758366
13965F758366o06223k48060m0675o00055N0731m16360N83598o23625k89441J38853
$$ 6758366 6152143 5904083 5863408 5263353 5314084 4897724 5481322 4857697 4568256 4707109
13955D707109r110J41593O53128m34611M49973O88343p6450K77906N85886Q38597
$$ 4707109 4697999 4839592 5492720 5058109 5508082 6196425 6119975 6397881 6983767 7822364
13945G822364J87322K56894M94060J202713J853769L532138L884750N521397O939617
$$ 7822364 8009686 8266580 8760640 9963353 11817122 15349260 19234010 24755407 31695024
13936C1695024P943252P392793O753257M389469K701650n46163l021650m170360
$$ 31695024 39638276 47031069 53784326 58173795 60875445 60329282 57307632 53137272
13928E3137272o560610n530315o668689o141671m623356l578278l809425k790827
$$ 53137272 46576662 41046347 34377658 28235987 23612631 20034353 16224928 13434101
13920A3434101k291272j818945p56262j419851q71777p98825k99408L46595j009373
$$ 13434101 11142829 9323884 8567622 7147771 6275994 5477169 5177761 5524356 4514983
13911D514983j03145J29155l72386j97284K9265q3103m21701L52744K627n85632
$$ 4514983 4411838 4540993 4168607 3971323 4000588 3917485 3495784 3848528 3851155 3265523
13901C265523K84732J22509l0621M59254o23125o8501L68258j02746n11214M29004
$$ 3265523 3550255 3672764 3642143 4101397 3478272 3409771 3778029 3675283 3164069 3593073
13891C593073j09164J73953j43794M48362m84819O23594m64154n13678O56683
$$ 3593073 3483909 3657862 3514068 3962430 3477611 4101205 3637051 3123373 3780056
13882C780056k13504l28046O3097j78896j31445O35223M76681j034711L10892
$$ 3780056 3566552 3238506 3301603 3122707 2991262 3626485 4103166 3068455 3379347
13873C379347l88474M66466n6986L24893n12831M57195n1928K85507k80672j43795
$$ 3379347 2990873 3457339 3400353 3725246 3212415 3669610 3617682 3903189 3622517 3478722
13863C478722L03773j14386q6137k12989N62635M25819m01188O0944j68535m05633
$$ 3478722 3782495 3668109 3581972 3368983 3931618 4357437 3956249 4017193 3848658 3443025
13853C443025j02213N83867m62490L39709n43051Q13632k94937j58633M94264
$$ 3443025 3340812 3924679 3462189 3801898 3258847 4072479 3777542 3618909 4113173
13844D113173k00036L03836k66327J16844p02348J41442K03400p7404j25043m8726
$$ 4113173 3913137 4216973 3950646 4067490 3365142 3506584 3709984 3632580 3507537 3458811
13834C458811j67546m37872K45440N58213j08994k34647j22075K54245J39571
$$ 3458811 3291265 2853393 3098833 3657046 3548052 3313405 3191330 3445575 3585146
13825C585146k42792J94038j30608j18905Q1890m23623M60602N082m97887K24485
$$ 3585146 3342354 3536392 3405784 3286879 3368769 2945146 3405748 3410830 2912943 3137428
13815C137428l53012J69165J86274J86177k42281j4104J16499k30052j84421K91608
$$ 3137428 2784416 2953581 3139855 3326032 3083751 3069647 3186146 2956094 2771673 3063281
13805C063281j3736O76823l29420J00078n50911L64646l64983J56011J90318P01376
$$ 3063281 3049545 3726368 3396948 3497026 2946115 3310761 2945778 3101789 3292107 3993483
13795C993483r61470Q0381k11101O07193k88064j65546P2241j8369j37181R1531
$$ 3993483 3032013 3112394 2901293 3508486 3220422 3054876 3127117 3108748 2971567 3063098
13785C063098j36573n74775K51944l7948L40178m820J95844j92939K6104J1632
$$ 3063098 2926525 2351750 2603694 2565746 2905924 2901104 3096948 2904009 2930113 2941745
13775B941745j97077J52354k98403L07827J31568k5585L70323o4011k40928J05451
$$ 2941745 2744668 2897022 2598619 2906446 3038014 3012429 3382752 3318741 3077813 3183264
13765C183264l96725N08721j47246P368k50434K712J98134J28171m54512K51586
$$ 3183264 2786539 3295260 3148014 3155382 2904948 2907660 3105794 3233965 2779453 3031039
13755C031039r654j3020J7039J32452m21706M96104l54121L12682j5310L00316
$$ 3031039 3021385 3008365 3025404 3157856 2736150 3232254 2878133 3190815 3175505 3475821
13745C475821j70522K84395m38203O960R68718n23377K64346P05811k17775m9047
$$ 3475821 3305299 3589694 3151491 3158451 4127169 3603792 3868138 4573949 4356174 4307127
13735D307127k91665k2806j28635n68998N00910j49706m8105l34540J51596o90694
$$ 4307127 4015462 3992656 3864021 3295023 3795933 3646227 3598122 3263582 3415178 2724484
13725B724484K52003L12483J95307k31651k00880L2479q4981n60978J71340J99581
$$ 2724484 2976487 3288970 3484277 3252626 3051746 3084225 2999244 2438266 2609606 2809187
13715B809187K46787K0993k82456L42451L98559l49255L56808P1504j53431k92921
$$ 2809187 3055974 3076967 2794511 3136962 3535521 3186266 3543074 3614578 3461147 3168226
13705C168226m9187J63557o7152M35956J17672k49283J31487K57121K85517L60344
$$ 3168226 3119039 3282596 3215444 3651400 3769072 3519789 3651276 3908397 4193914 4554258
13695D554258N78486m79829J267265M40461j17053k81819P0475l75245k23831
$$ 4554258 5132744 4652915 5920180 6360641 6243588 5961769 6032244 5656999 5433168
13686E433168n30495J04626p51111K31447p39598O7574J18780k67806J17880L88959
$$ 5433168 4902673 5007299 4256188 4487635 3748037 3815611 3934391 3666585 3784465 4173424
13676D173424l11305N7681o1662L33429j50069N92505k8915K70122N40426O27558
$$ 4173424 3862119 3919800 3858138 4191567 4041498 4634003 4605088 4875210 5415636 6043194
13666F043194J38987L35928M53562Q09595K20358j35120m22955J18310l23980
$$ 6043194 6182181 6518109 6971671 7781266 8001624 7866504 7443549 7561859 7237879
13657G237879n34272m42324l04269k06935j26907p72969k19739J9596p68796J81454
$$ 7237879 6703607 6261283 5957014 5750079 5623172 4850203 4630464 4650060 3881264 4062718
13647D062718J57185k6920m5367J90701j28869n2932k15862L2837J98472L45342
$$ 4062718 4219903 4192983 4147616 4338317 4209448 4156516 3940654 3973491 4171963 4517305
13637D517305M66202K23853Q95057j88425L0591J029203q5736o99482P25883j024721
$$ 4517305 4983507 5207360 6102417 5913992 5944583 6973786 6888050 6188568 6914451 5889730
13627E889730p5860r64343j96601l48887l23269k7549m24116P1461M5675k81556
$$ 5889730 5813870 4849527 4652926 4304039 3980770 3953221 3529105 3600566 3646241 3364685
13617C364685J42240j39420K22879j88340M60709m53359L12417L39185j29517
$$ 3364685 3506925 3367505 3590384 3402044 3862753 3409394 3721811 4060996 3931479
13608C931479p869N5235M59025n43521j89959j52465N70262m17353l24825L96094
$$ 3931479 3923610 3978845 4437870 3894349 3704390 3551925 4122187 3704834 3380009 3776103
13598C776103K2300j80219K6288Q2688Q5400J19708M90186l45390l63684J14045
$$ 3776103 3798403 3618184 3644472 3727160 3812560 3932268 4422454 4077064 3713380 3827425
13588C827425O9497k82293l01338J21318n9223O53802o26180k47912M34440m16866
$$ 3827425 3896922 3614629 3313291 3434609 3375386 4029188 3403008 3155096 3589536 3172670
13578C172670j17485k29533N34239p13564M8392M32590J07186j45117m22082Q31062
$$ 3172670 3055185 2825652 3359891 2646327 2694719 3127309 3234495 3089378 2667296 3498358
13568C498358m61857p0900K7484O2707m60978K60715O03818m53446K04901L4705
$$ 3498358 3036501 2965601 2993085 3055792 2594814 2855529 3459347 3005901 3210802 3245507
13558C245507l90418J8900R6857L98576m53085j89684j36918N40926P8106k21438
$$ 3245507 2855089 2873989 2970846 3369422 2916337 2726653 2589735 3130661 3208767 2987329
13548B987329P5213K69426K21151N10320j40731Q27917k16374L24839j76589N36594
$$ 2987329 3062542 3331968 3553119 4063439 3922708 4750625 4534251 4859090 4682501 5219095
13538E219095m82365k99695K55381n27835p7365j06149j02113J17844n73364j94161
$$ 5219095 4736730 4437035 4692416 4164581 4087216 3981067 3878954 3996798 3423434 3229273
13528C229273N92385L1668L96272J31449N27429m50281R5885L1100K43175k12655
$$ 3229273 3821658 3853326 4249598 4381047 4908476 4458195 4554080 4585180 4828355 4615700
13518D615700l66528p94278j57976K98411l03864l30514m20837K41918K19373
$$ 4615700 4249172 3454894 3296918 3595329 3291465 2960951 2540114 2782032 3001405
13509C001405k79956P8405J27270m11906N6356L3689L00732k95131L52460o14329
$$ 3001405 2721449 2799854 2927124 2515218 2571574 2605263 2905995 2610864 2963324 2348995
13499B348995M28973k85742k73390K70196L99037l55308j73810L91494j38625
$$ 2348995 2777968 2492226 2218836 2489032 2888069 2532761 2358951 2750445 2611820
13490B611820j31242K18429R1858k90231J21312j14200J64614k70980K26702M4417
$$ 2611820 2480578 2699007 2790865 2500634 2621946 2507746 2672360 2401380 2628082 2672499
13480B672499K57010r64783O33616R7938J30704K96249n89707K51932k59825L12961
$$ 2672499 2929509 1964726 2598342 2696280 2826984 3123233 2533526 2785458 2525633 2838594
13470B838594j49799l12337J0526J81254J14679l84180L50633j56298K09511q0561
$$ 2838594 2688795 2376458 2386984 2568238 2682917 2298737 2649370 2493072 2702583 2622022
13460B622022N34704n54023Q9030M04727j74011Q25651k56433M81853J01857M02057
$$ 2622022 3156726 2602703 2691733 3096460 2922449 3748100 3491667 3973520 4075377 4477434
13450D477434L11894k57377K05695L9746o58197j57571K28P3938m47044o62431
$$ 4477434 4789328 4531951 4737646 4777392 4119195 3961624 3961852 4035790 3588746 2926315
13440B926315M88994k49151l88910L59110o72060J82793m43950O20514J53264
$$ 2926315 3415309 3166158 2777248 3136358 2464298 2647091 2203141 2823655 2976919
13431B976919m7791r6477k51300J46428J71034K97357k22226N33193M78758N92995
$$ 2976919 2929128 2832651 2581351 2727779 2898813 3196170 2973944 3507137 3985895 4578890
13421D578890n32801K21849O32572j38276j36206o97400O0281q2385k68488j38185
$$ 4578890 4046089 4267938 4900510 4762234 4626028 3928628 3988909 3906524 3638036 3499851
13411C499851K04036n10603m59323M33843L0592q4131j62690O2849L8356k39523
$$ 3499851 3703887 3193284 2733961 3167804 3198396 3114265 2951575 3014424 3052780 2813257
13401B813257J69978J10342k48874j87494Q9888L57509l48030j03995O09167Q4748
$$ 2813257 2983235 3093577 2844703 2657209 2747097 3104606 2756576 2652581 3261748 3346496
13391C346496r7001N18976j55296l3067M78797L5735K37298J71130M30609L511
$$ 3346496 3249495 3768471 3613175 3580108 4058905 4094640 4331938 4503068 4933677 4937188
13381D937188K39608q2650n71962J99251p43877p0096L71587l7152l28449j00872
$$ 4937188 5176796 5094146 4522184 4721435 3977558 3907462 4279049 4241897 3913448 3812576
13371C812576k5026k28146J81041K59534J16788M1378r7932j91803R1294j43207
$$ 3812576 3787550 3559404 3740445 3999979 4116767 4158145 4060213 3868410 3959704 3816497
13361C816497k96252Q606O76735j059244L10640M61228L04344O32919p41103j947
$$ 3816497 3520245 3528851 4205586 3146342 3456982 3918210 4222554 4855473 4114370 4112423
13351D112423m2424L96470o00033M43096l14231L6085l76179K78878J25816l01654
$$ 4112423 4069999 4466469 3866436 4309532 3995301 4031386 3655207 3934085 4059901 3758247
13341C758247j66481l91793L09803O5627L80860o09583M61970k57545L57148k04842
$$ 3758247 3591766 3199973 3509776 3575403 3956263 3346680 3808650 3551105 3908253 3703411
13331C703411k66939K58732J62408n34396L47138j25873J15816o8966O19215m41198
$$ 3703411 3436472 3695204 3857612 3323216 3670354 3544481 3660297 3591331 4210546 3769348
13321C769348L16700J93306q6787l47443k2267O80842K39593q7546P37187J57840
$$ 3769348 4086048 4279354 4192567 3845124 3822857 4503699 4743292 4655746 5392933 5550773
13311E550773m59100M63623k27622J9666J23483m03854m2718J12321r0481O49128
$$ 5550773 5091673 5555296 5327674 5347340 5470823 5066969 5024251 5136572 5046091 5695219
13301E695219j12223j00733Q9093J99996o4621K41625K14196n50219J04318L33153
$$ 5695219 5582996 5482263 5571356 5771352 5706731 5948356 6162552 5612333 5716651 6049804
13291F049804o31876K87369j63878p3725k49965L39178k32553N67953k46200p4016
$$ 6049804 5417928 5705297 5541419 5467694 5217729 5556907 5324354 5892307 5646107 5572091
13281E572091K66991K0233r2994K03776j41900J05697L83788j91757J79482K07265
$$ 5572091 5839082 5859315 5766321 5970097 5828197 5933894 6317682 6125925 6305407 6512672
13271F512672j81355J18011K53449k41366M35846L50825J5166M67717q2353M20552
$$ 6512672 6331317 6449328 6702777 6461411 6897257 7248082 7263248 7730965 7648612 8069164
13261H069164j42871L1090M69103M34983K00443k73382M67966L61903j65203N33816
$$ 8069164 7926293 7957383 8426486 8861469 9061912 8788530 9256496 9618399 9453196 9987012
13251I987012M32259L41680n07912R03215r2438R1871k19174M58125j74877r2044
$$ 9987012 10419271 10760951 10253039 11156254 11063816 11155687 10936513 11394638 11219761 11127717
13241A1127717q0237N18504J26057K90319L3205K61069P68727J26882L27666Q60179
$$ 11127717 11047480 11565984 11692041 11982360 12015565 12276634 13045361 13172243 13499909 14360088
13231A4360088l75702J078340J39390k39638P93615M75723j43134l38391M17472
$$ 14360088 13984386 15062726 15202116 14962478 15756093 16231816 16088682 15750291 16167763
13222A6167763j65599n81410J74542L6728k19606q766m19388m40852j2766J61362
$$ 16167763 16002164 15420754 15595296 15632024 15412418 15403652 14984264 14543412 14530646 14692008
13212A4692008l78493P47067p74824K45941o16721O85074m29574J55666M6904
$$ 14692008 14313515 15060582 14285758 14531699 13914978 14600052 14170478 14326144 14373048
13203A4373048o414l683k79530L16715j5314n25749j72275n20775L04297m38524
$$ 14373048 14366634 14362951 14083421 14400136 14384822 13859073 13686798 13166023 13470320 13031796
13193A3031796J02567l21266L7718n30759L47753o56507J90999n39839l05494
$$ 13031796 13134363 12813097 12850815 12320056 12667809 12011302 12202301 11662462 11356968
13184A1356968L28162k60124k40300L95516q04803K25467o1030n3950p4793m84506
$$ 11356968 11685130 11425006 11184706 11580222 10775419 11000886 10939856 10885906 10811113 10326607
13174A0326607K65799L8727o4110l63889M11134N0204k42265r9604m0944J09089
$$ 10326607 10592406 10631133 10567023 10203134 10614268 10664472 10422207 10322603 10281659 10390748
13164A0390748j3707J307639J23118J16222L92640L60165K15145P72861j37618
$$ 10390748 10377041 11684680 11807798 11924020 12316660 12676825 12891970 13664831 13527213
13155A3527213K31876M67011M66072o56018k1703j40447l28771k16442L87519
$$ 13527213 13759089 14226100 14692172 14036154 14014451 13874004 13545233 13328791 13716310
13146A3716310l37260K45201j28152o18308K20111R2556q94577K87248p31146
$$ 13716310 13379050 13624251 13496099 12877791 13097902 13190458 12295881 12583129 11851983
13137A1851983j093241j91455k11130m26749m56925k49099p14622L14235K6859
$$ 11851983 10758742 10567287 10356157 9929408 9472483 9223384 8508762 8822997 8849856
13128H849856k64848L72599m42809K19830J24822o09688m92599m6700J04705j32529
$$ 8849856 8585008 8957607 8514798 8734628 8859450 8249762 7757163 7710463 7815168 7682639
13118G682639n03678j75634k82893J42564o13817R63306n54717m065K05020j98689
$$ 7682639 7178961 7003327 6720434 6862998 6249181 7212487 6657770 6653705 6858725 6660036
13108F660036k93816J63291q923k37191K83122R6804l06069Q06673L94757O9730
$$ 6660036 6366220 6529511 6520588 6283397 6566519 6663323 6357254 7163927 7558684 7628414
13098G628414N11211N91048R56683J98786P81944O91793N25287J15136M24837
$$ 7628414 8139625 8730673 9687356 9886142 10668086 11359879 11885166 12000302 12425139
13089A2425139J99332m16461m96593J02535J45565k14952L32214q9671K92453
$$ 12425139 12624471 12208010 11711417 11813952 11959517 11744565 12076779 11987108 12279561
13080A2279561q0005m69792p58613l97981n93232o66466k44692q10068n54398
$$ 12279561 12199556 11729764 10971151 10573170 9979938 9313472 9068780 8258712 7704314
13071G704314m37376n17558o92872M45358k08053p38788l97202Q79895o32474
$$ 7704314 7266938 6749380 6056508 6501866 6293813 5555025 5157823 6037718 5405244
13062E405244K79025j40992J73177J27713j67514M70697m1994j78872M8152j48402
$$ 5405244 5684269 5543277 5716454 5844167 5676653 6147350 6105356 5926484 5974636 5826234
13052E826234J31000k89172P7192j52847j50015m09494K69422M9666K36778k47350
$$ 5826234 5957234 5668062 5745254 5592407 5442392 5032898 5302320 5351986 5588764 5341414
13042E341414k11023M72412j50941L19034N4639j90244K77976L72207q4332O4093
$$ 5341414 5130391 5602803 5451862 5770896 5825535 5635291 5913267 6285474 6201142 6265235
13032F265235J44660m53361O10408m80924N03337o6317L21411m11415M73209j40840
$$ 6265235 6409895 5956534 6566942 6086018 6589355 6523038 6844449 6433034 6906243 6765403
13022F765403Q3225L90457l44408j0235O76066J40442J00310j96836L61578O23411
$$ 6765403 6848628 7239085 6894677 6884442 7560508 7700950 7801260 7604424 7966002 8589413
13012H589413l44233M0990p8230K45694O43594j55934N8803J041632j01676q527
$$ 8589413 8245180 8286170 8207940 8453634 9097228 8941294 9000097 10041729 9940053 9931526
13002I931526m9468Q3119M48304J10431J72928K96506J52231J93310N57315Q8696
$$ 9931526 9882058 9965177 10413481 10523912 10696840 10993346 11145577 11338887 11896202 11984898
12992A1984898m4135M93799k60084K54484J04615J59151P8928m56992M84863J78202
$$ 11984898 11940763 12434562 12174478 12428962 12533577 12692728 12771656 12314664 12799527 12977729
12982A2977729K3246Q9540l53504L35187l45213R2720k06471m85867j64162n0886
$$ 12977729 13000975 13090515 12737011 13072198 12726985 12819705 12613234 12127367 11963205 11912319
12972A1912319j10436q9364q4362O9526n14215K56402l61245J89739l65920p3400
$$ 11912319 11801883 11712519 11628157 11697683 11183468 11439870 11078625 11268364 10902444 10829044
12962A0829044K07516n9926k59329j45303P198j46514O18428l76882o35573J98647
$$ 10829044 11036560 10976634 10717305 10572002 10579200 10432686 11051114 10674232 10038659 10237306
12952A0237306J17338M1664j97496K18361j74276m09798L75629M69490l48479
$$ 10237306 10354644 10396308 10198812 10417173 10242897 9833099 10208728 10678218 10329739
12943A0329739J86874n03434M36307j59642K24583n27420k7099O29311n6265J28055
$$ 10329739 10516613 10013179 10449486 10289844 10514427 9987007 9959908 10589219 10532954 10661009
12933A0661009K57709K70407m75621J128717o38090K29025j25219j80074k49591
$$ 10661009 10918718 11189125 10713504 11842221 11204131 11433156 11307937 11127863 10878272
12924A0878272k43022P04802m56136k3819K29862j48352m74698N21668k35869
$$ 10878272 10635250 11340052 10883916 10860097 11089959 10941607 10466909 10988577 10752708
12915A0752708q4675p0213q32885m50657K92599m76760Q2530q07010j13576K52339
$$ 10752708 10668033 10597820 9764935 9314278 9606877 9130117 9212647 8405637 8292061 8544400
12905H544400m8885j05651j64891q2134j54308o61646M56321m57867m80810Q4410
$$ 8544400 8495515 8389864 8224973 8142839 7988531 7326885 7783206 7325339 6844529 6928939
12895F928939L5323N06006o98874K34481m10375K98696n90708J59280j49761M96076
$$ 6928939 6964262 7470268 6771394 7005875 6595500 6894196 6303488 6462768 6313007 6809083
12885F809083q17525M50715m92148N96615j35330k38550k27982L79703o85032
$$ 6809083 5991558 6442273 5950125 6546740 6411410 6172860 5944878 6324581 5639549
12876E639549N50932k99724J38377K6812n05433M93268p18497J36736J04591l17552
$$ 5639549 6190481 5890757 6029134 6055946 5550513 6043781 5325284 5462020 5566611 5249059
12866E249059k93061P73859l36575K05017n67624M1362J94709L3535M45513p66588
$$ 5249059 4955998 5729857 5393282 5598299 5030675 5072037 5266746 5300281 5745794 4979206
12856D979206L15554K28901k4272o48661M90872k09456n02810P56183k61370N02230
$$ 4979206 5294760 5523661 5499389 4850728 5341600 5132144 4629334 5385517 5124147 5626377
12846E626377l37722P8023l97111j58938Q14973r02511Q50185k31462r3328l67799
$$ 5626377 5288655 5366678 4969567 4810629 5625602 4723091 5573276 5341814 5248486 4880687
12836D880687L97178J48739m56954J32586k104L04247k97909j85806M16591J84389
$$ 4880687 5277865 5426604 4969650 5102236 5100132 5404379 5106470 4920664 5337255 5521644
12826E521644n88440j26944K83821o293K17339l39778L60688J7687J5261k68628
$$ 5521644 4933204 4806260 5090081 5083788 5301127 4961349 5322037 5339724 5354985 5086357
12816E086357N4276N2745J48423o47825K92158L30440j89209K63320m83054K752
$$ 5086357 5140633 5193378 5341801 4693976 4986134 5316574 5127365 5390685 4907631 4910383
12806D910383L03475J57910j09551K57612m94869L38262L56441o51145J43186
$$ 4910383 5213858 5371768 5262217 5519829 5024960 5363222 5719663 5068518 5211704
12797E211704K15613k26750J20914J58723J34915j39816r87j02362k77778J36128
$$ 5211704 5427317 5200567 5321481 5480204 5615119 5475303 5474316 5371954 5094176 5230304
12787E230304R8108P1487J87460L07388k54621k55131J32303k31472K36658n4010
$$ 5230304 5328412 5399899 5587359 5894747 5640126 5384995 5517298 5285826 5522484 5468474
12777E468474j49946L84739o45820L31544q2772N93984m81553m7654N09448l18786
$$ 5468474 5318528 5703267 5057447 5388991 5306219 5900203 5418650 5370996 5880444 5561658
12767E561658k45196r5461J92308N59202l33023M34928j98339J63742k84237L95260
$$ 5561658 5316462 5221001 5413309 5972511 5639488 6074416 5876077 6039819 5755582 6150842
12757F150842j31279J69454k77987L08070l65251l2443k80577p7072J66155M09091
$$ 6150842 6019563 6189017 5911030 6219100 5853849 5821406 5540829 5463757 5629912 6039003
12747F039003l4223j01405k40021K65393k93595K91006O609L43292k28573j89236
$$ 6039003 6004780 5903375 5663354 5928747 5635152 5926158 5932767 6276059 6047486 5858250
12737E858250M16667l16119l11275N36235k93599J20210J72874k52956J91799
$$ 5858250 6274917 5958798 5647523 6183758 5890159 6010369 6183243 5930287 6122086
12728F122086n7754L95696k70848l37851m03451N5648N89878m14331K35752L93008
$$ 6122086 6064332 6460028 6189180 5851329 5447878 5503526 6093404 5679073 5914825 6307833
12718F307833n34152j62349O10413k37814J52049m24952N65739K07060k605k33318
$$ 6307833 5773681 5611332 6221745 5983931 6135980 5711028 6276767 6483827 6481222 6247904
12708F247904J31096r5795M75244K1111K06052K41614P109O2331P03857o76402
$$ 6247904 6379000 6283205 6758449 6779560 6985612 7227226 7234335 7296666 8000523 7324121
12698G324121k65012J343264n13496N37265K91805q5970R73282J286141R69487
$$ 7324121 7059109 8402373 7888877 8426142 8717947 8631977 9605259 10891400 11860887
12689A1860887J060132J443515J274889L04868R5243K16476q49145r54314r18205
$$ 11860887 12921019 14364534 15639423 15944291 16039534 16256010 15406865 14452551 13534346
12680A3534346r28811m86638o81184o00989o81575n95492M46480k64683m13176
$$ 13534346 12605535 12118897 11437713 10836724 10155149 9559657 10006137 9741454 9328278
12671I328278K83250l81844k74016J74176J74592Q0836J94684M47212o02370k02542
$$ 9328278 9611528 9229684 8955668 9129844 9304436 9385272 9579956 10027168 9424798 9222256
12661I222256j97705p8111M29915r70132K09155J062434l77902N16713o9675L19067
$$ 9222256 9024551 8946440 9376355 8406223 8615378 9677812 9299910 9816623 9746948 10066015
12651A0066015N14965L32019M23734M68548L21902M27885j20350L21848l6042
$$ 10066015 10580980 10912999 11336733 11805281 12127183 12555068 12434718 12756566 12720524
12642A2720524j65890j31629K28379l65650l0350j44893k2139J08961J61545k32175
$$ 12720524 12554634 12423005 12651384 12285734 12255384 12110491 12088352 12197313 12358858 12126683
12632A2126683K79122O76068q11882O28066J80179N30662J14100J79903o97734
$$ 12126683 12405805 13081873 12269991 12898057 13078236 13608898 13722998 13902901 13205167
12623A3205167K24872l53781k95381j51264r62052j41184m14421O9889m79690
$$ 13205167 13430039 13076258 12780877 12629613 11667561 11526377 11111956 11181845 10702155
12614A0702155l46831N61773M87843K88283P17553O84095L38680Q67418K83946
$$ 10702155 10355324 10917097 11404940 11693223 12410776 13094871 13433551 14300969 14584915
12605A4584915N43646l55629j99925k78040n70136l36258j211066k04590o83435
$$ 14584915 15128561 14772932 14573007 14294967 13724831 13388573 12177507 11972917 11289482
12596A1289482o4046j88423q52641L39072J57282n65921R45518k57506N99776
$$ 11289482 11225436 11037013 10184372 10523444 10680726 10114805 11060323 10802817 11402593
12587A1402593L53776J42573J95863L57524n43424N20578k1257M08268J55282
$$ 11402593 11756369 11898942 12094805 12452329 11908905 12429483 12408226 12816494 12971776
12578A2971776O00255j62570M2050L13815n11688n46346l12400o49047j48543
$$ 12971776 13572031 13409461 13451511 13765326 13253638 12707292 12394892 11745845 11597302
12569A1597302j178879l05471j05359k45244O8603p2748Q9940k00141K1112r2734
$$ 11597302 10418423 10112952 10007593 9762349 9830952 9758204 9848144 9648003 9669115 9576381
12559I576381R1038K71564Q9131o06888j82020R0851O45145p85728L99813k54131
$$ 9576381 9667419 9938983 10028114 9421226 9239206 9330057 9975202 9189474 9589287 9335156
12549I335156N1476l8106K05523M59900n1316m365N61583M05326M48819L31196
$$ 9335156 9386632 9348526 9554049 10013949 9962633 9958268 10519851 10925177 11373996 11705192
12539A1705192N7578P01258P3019j41593J53670o31074l30321o58659k10816k75472
$$ 11705192 11762770 12464028 12537047 12395454 12549124 11918050 11587729 10929070 10718254 10442782
12529A0442782r7191m54302J36595o66964P73551m39431L83942k11395r8325Q7439
$$ 10442782 10345591 9891289 10027884 9360920 10134471 9695040 10078982 9867587 9769262 9856701
12519I856701L94026k28026p481O36327L16853N59377P32699Q48201J769913M67378
$$ 9856701 10250727 10022701 10015220 10651547 10968400 11527777 12260476 13108677 14878590 15345968
12509A5345968N23148L16471o7013j00333o27589j027544p71518m17967q0836
$$ 15345968 15869116 16185587 16118574 16018241 15390652 14363108 13591590 13173623 13092787
12500A3092787j178227j60778m85351j25355m13274l33556J04371j58651j53293
$$ 13092787 11914560 11753782 11268431 11143076 10729802 10396246 10500617 10341966 10188673
12491A0188673J31723k44422M58437l5931N48366o3478Q0827O69343O46325K77606
$$ 10188673 10320396 10075974 10534411 10498480 11046846 10983368 11064195 11733538 12379863 12657469
12481A2657469O27624M86520m4899L50278O6564o92352m60205l81540k85019m25467
$$ 12657469 13285093 13771613 13726714 14076992 14143556 13451204 12990999 12609459 12324440 11898973
12471A1898973p6230J54509p05819Q453K7568j01771O80844n55518M06257j12666
$$ 11898973 11822743 11977252 11271433 11279886 11307454 11205683 11886527 11331009 11737266 11624600
12461A1624600L05918m4667J43179M87752L92332K1768j55054M66537N12096R8096
$$ 11624600 11930518 11885851 12029030 12516782 12909114 12930882 12775828 13242365 13754461 13852557
12451A3852557O73682M73118L71475M10506O39007K2258K53631M41167R8010K47927
$$ 13852557 14526239 14999357 15370832 15781338 16420345 16442603 16696234 17137401 17235411 17483338
12441A7483338r4155k913L36206o8867Q9912j76898O20123m68269L59452P67255
$$ 17483338 17389183 17386270 17722476 17653609 17743521 17566623 18186746 17718477 18077929 18845184
12431A8845184m0163p948N78974M67875R54858r9960O38301K83240R35581L53614
$$ 18845184 18805021 18797073 19376047 19843922 20798780 20698820 21337121 21620361 22555942 22909556
12421B2909556O74689M27987O25392K01527J361945N67796p294L50054M70263
$$ 22909556 23584245 24012232 24637624 24839151 26201096 26768892 26761598 27111652 27581915
12412B7581915J30238p3436l64493L05713o66512l56184m02831o9305o43549l38222
$$ 27581915 27712153 27638717 27274224 27579937 26913425 26557241 26154410 26085105 25441556 25103334
12402B5103334o51456k46128K28068j11515L47143N20573m93281N72701J070495
$$ 25103334 24451878 24205750 24433818 24322303 24669446 25190019 24696738 25269439 26339934
12393B6339934L6135R75245M08872M04072J121548N45211M79017N26276R86128
$$ 26339934 26376069 27351314 27760186 28164258 29285806 29831017 30310034 30836310 31822438
12384C1822438K06527J65952P73297K97849Q1027k73366M11087p5097J55710O44732
$$ 31822438 32028965 32194917 32968214 33266063 33347090 33073724 33484811 33409714 33565424 34210156
12374C4210156p14745K07458j38285k90572P8627L60093n27628Q49772l66451
$$ 34210156 33495411 33702869 33564584 33274012 33352639 33712732 33185104 34034876 33668425
12365C3668425K23005q2515n02881l96905N03588j26901l70304k29034k31119
$$ 33668425 33891430 33808915 33306034 32909129 33412717 33285816 32915512 32686478 32455359
12356C2455359L60494n00167L11102o68324K25251o32220K83194k47781p07557
$$ 32455359 32815853 32315686 32626788 31958464 32183715 31551495 31834689 31586908 30879351
12347C0879351K31033o91369l76342K10838L73146O9997l30305R40260N17163
$$ 30879351 31110384 30419015 30042673 30253511 30626657 30696654 30366349 31306609 31823772
12338C1823772M01687O42505N59779R26236O46516Q11026N28869J290510L20493
$$ 31823772 32225459 32867964 33427743 34353979 35000495 35811521 36340390 37630900 37951393
12329C7951393L19482P71385J012188O61077m23495K80856N24947N2427q9871
$$ 37951393 38270875 39042260 40054448 40715525 40292030 40572886 41097833 41150260 41060389
12320D1060389M32939L49082K68200j208098P93762L10538m86532Q2122L46334
$$ 41060389 41493328 41842410 42110610 40902512 41696274 42006812 41520280 41602402 41948736
12311D1948736O84986Q4748O86296J61602J384075L25756N18274O97833J43877
$$ 41948736 42633722 42718470 43404766 43566368 44950443 45276199 45794473 46492306 46636183
12302D6636183L84066k31512Q5413p36953j363617p37827l60862q76407j062456
$$ 46636183 47020249 46788737 46874150 46137197 44773580 44035753 43674891 42798484 41736028
12293D1736028n52689o09744l56296p45954p17113m35685q79633r65022n34014
$$ 41736028 41183339 40573595 40217299 39471345 38754232 38318547 37438914 36473892 35939878
12284C5939878r81074j443187p05923j116214r70887q13022m27668r92607n60908
$$ 35939878 34958804 33515617 32809694 31693480 30722593 29909571 29481903 28489296 27928388
12275B7928388m12066m9627o54958l88001n19081L56357K57973r42672J4599j67714
$$ 27928388 27516322 27466695 26811737 26423736 25904655 26261012 26518985 25576313 25590912 25423198
12265B5423198M76894r4359q36245M62612q6334L9858p3484O81700l72592J247526
$$ 25423198 25900092 25805733 24969488 25432100 25345766 25385624 25312140 25993840 25621248 26868774
12255B6868774M84611J183732J462300J106282J153733J978903K077446J735677
$$ 26868774 27353385 28537117 29999417 31105699 32259432 34238335 36315781 38051458
12247C8051458K138496J590094K388527K019766J091742J243636J323476J92669
$$ 38051458 40189954 41780048 44168575 46188341 47280083 48523719 49847195 50039864
12239E0039864R0457N52613p38669j19875q3083p13567K77216p64573q39911l62727
$$ 50039864 50130321 50682934 49944265 49824390 49741307 49027740 49304956 48540383 47700472 47337745
12229D7337745r89744j652082j222394j556222k212139j649537k483960j884900
$$ 47337745 46348001 44695919 43473525 41917303 39705164 38055627 35571667 33686767
12221C3686767j458527j693448j426110j436196r25242q67822o83239q10775p57016
$$ 33686767 32228240 30534792 29108682 27672486 26747244 25879422 25196183 24385408 23628392
12212B3628392p86563o34260p39359l25934l91105q50272k8417k48109j46117
$$ 23628392 22841829 22207569 21468210 21142276 20751171 19900899 19872482 19624373 19478256
12203A9478256J12401k69991m47680N73102l53063K14762L32849l70538R4322
$$ 19478256 19590657 19320666 18872986 19446088 19093025 19307787 19640636 19270098 19364420
12194A9364420M73102O2631O57960J11612Q40462N04241j24505M43473M94921
$$ 19364420 19837522 19900153 20558113 20669725 21510187 22014428 21889923 22333396 22828317
12185B2828317m5729M67908J85690k45435O2528P87845R3806j17157k31805J17571
$$ 22828317 22782588 23250496 23436186 23190751 23253279 24041124 24134930 24017773 23785968 23903539
12175B3903539r16474o2191J70195O3886j21739k5120O03379p8796K6934N19767
$$ 23903539 22987065 22924874 23095069 23158955 23037216 23012096 23615475 23536679 23563613 24083380
12165B4083380m49118J214425M90265P97124K82359O38005P79045M40402L38808
$$ 24083380 23634262 24848687 25338952 26136076 26418435 27056440 27835485 28275887 28614695
12156B8614695j00298j19576M7124O4519m20393L19510O31210p0347J597091Q83919
$$ 28614695 28514397 28394821 28441945 28506464 28086071 28405581 29036791 28966444 30563535 31447454
12146C1447454O28039J561215J222635P95541J131807J558416J034858J053899
$$ 31447454 32075493 33636708 34859343 35654884 36786691 38345107 39379965 40433864
12138D0433864J781727R52211K291036J575025J156292L233242K068106L788621
$$ 40433864 42215591 43167802 45458838 47033863 48190155 51423397 53491503 57280124
12130E7280124K774539M044174L771194L181394L176198L093029K435542J852575
$$ 57280124 60054663 64098837 67870031 71051425 74227623 77320652 79756194 81608769
12122H1608769J522505N60356k25111J39465r87316l61690j046279j579205j012046
$$ 81608769 83131274 83691630 83466519 83605984 82618668 82256978 81210699 79631494 78619448
12113G8619448j409231j184924j912720j270625j187783j162298j417969r97885
$$ 78619448 77210217 76025293 74112573 72841948 71654165 70491867 69073898 68076013
12105F8076013r01112m90568q13371K29072J33039o21075M65833P4186l93584
$$ 68076013 67174901 66684333 65870962 66100034 66233073 65611998 66077831 66152017 65758433
12096F5758433l71672j051556q50270j271683p01170m27486P41526P27267N90251
$$ 65758433 65386761 64335205 63484935 62213252 61512082 61084596 61826122 62553389 63143640
12087F3143640J029120J711332J241051J675049N78979P44366L66884O31656k06134
$$ 63143640 64172760 65884092 67125143 68800192 69379171 70123537 70490421 71122077 70915943
12078G0915943P08932p56601M07779j84651l32371p5505k85009j134044j008421
$$ 70915943 71624875 70868274 71276053 71091402 70759031 70683526 70398517 69264473 68256052
12069F8256052q28509j481170j863485k096970j554341k168800j679962j446939
$$ 68256052 67427543 65946373 64082888 61985918 60431577 58262777 56582815 55135876
12061E5135876r85339j399118p38570q38689j491874o89211r55020j340242q37479
$$ 55135876 54150537 52751419 52012849 51174160 49682286 48993075 48038055 46697813 45860334
12052D5860334j161136q56483q12836p41349j065469m00443o17860r40829n58002
$$ 45860334 44699198 43842715 43029879 42288530 41223061 40822618 40204758 39263929 38705927
12043C8705927o83487m92785j524078k42641p82591j334147J86527j231709n6529
$$ 38705927 38022440 37529655 36005577 35762936 34980345 33646198 33832725 32601016 32544487
12034C2544487m06762K61320J53654K37669J141444Q41096J17121O81298q6278
$$ 32544487 32137725 32399045 32552699 32790368 33931812 34772908 34890029 35571327 35485049
12025C5485049L554q32399r77217r73502j214288j670469j99679j003404j059984
$$ 35485049 35488603 34656204 33678987 32705485 31491197 29820728 29621049 28617645 27557661
12016B7557661m89418n86760m10755p77279r84138q98019l47108q67191n34206
$$ 27557661 27068243 26481483 26070728 25293449 24309311 23411292 23064184 22196993 21662787
12007B1662787o38224P10848q7276m60467l50920P25457M13479J5911l09536L51233
$$ 21662787 21024563 21735411 21648135 21187668 20836748 21562205 21975684 21991595 21682059 22033292
11997B2033292j012390j44881l48614o02421j24047m18929M0772N8360R9922q72586
$$ 22033292 21020902 20876021 20527407 19924986 19800939 19382010 19422782 19481142 19581064 18708478
11987A8708478R6166M033q07936L97004p24047n23978k56530m01111k77633k97288
$$ 18708478 18804644 18808677 18000741 18397745 17673698 17149720 16893190 16492079 16214446 15917158
11977A5917158p7189l68458J66863p10716m27306m78215j9729p26811J97077n36389
$$ 15917158 15839969 15471511 15638374 14927658 14500352 14022137 14002408 13275597 13472674 12936285
11967A2936285m39993k8857n76857r0793l17388k80358K17850L81479L5973Q1028
$$ 12936285 12496292 12467435 11890578 11799785 11482397 11202039 11419889 11801368 11837341 11918369
11957A1918369K23391K93907k8263k41686P69140m80103K95029m83507K3859k40788
$$ 11918369 12141760 12435667 12407404 12165718 12934858 12454755 12749784 12266277 12290136 12049348
11947A2049348N15827K13840R822J637105n03960j83674J150022K6051M25274
$$ 12049348 12565175 12779015 12788837 14425942 13921982 13738308 14888330 14914381 15339655
11938A5339655O54826j96956M27127M8524L46393k59158j20633l2525j84901p0950
$$ 15339655 15994481 15797525 16224652 16273176 16619569 16360411 16239778 16207253 16022352 15951402
11928A5951402L71137o92744m38709Q5951j94742l16976q22297j71791o0323n96813
$$ 15951402 16322539 15629795 15191086 15277037 15082295 14765319 13943022 13771231 13710908 13114095
11918A3114095q3510j2929l90993k61131K14624M23745Q67866J539313M514692
$$ 13114095 13030585 13017656 12626663 12365532 12580156 13003901 13871767 15411080 19925772
11909A9925772M659900M264423M254590L755246P94677J32228j216490k659179
$$ 19925772 24585672 28850095 33104685 36859931 37654608 37786836 36570346 33911167
11901C3911167n773385l968547k292264j717773k055561k377216k104374j438653
$$ 33911167 28137782 24169235 21876971 20159198 18103637 15726421 13622047 12183394
11893A2183394K13153j006299R6562K08526j88490P44915O95109R98746J072966
$$ 12183394 12396547 11390248 11486810 11695336 11506846 12251761 12946870 13945616 15018582
11884A5018582J021060R30827Q81378O36311O37658q74230N19463o74840o32558
$$ 15018582 16039642 16970469 17851847 18488158 19125816 18251586 18771049 18096209 17463651
11875A7463651k83770j191166k34529j559139o37405j366088j8651p59256k53489
$$ 17463651 17179881 15988715 15754186 14195047 13557642 12191554 12172903 11413647 11160158
11866A1160158r51362l83398P095l58674j17682l85018j47246R6770n66439J0791
$$ 11160158 10208796 9825398 9832493 9473819 9356137 8971119 8823873 8920643 8354204 8364995
11856H364995P9532M30687N84894K7258Q3848L04785K74777L05888R23898L42125
$$ 8364995 8444527 8875214 9460108 9487366 9571214 9875999 10150776 10456664 11380562 11722687
11846A1722687K64997M48409P53146J75076K65847J156670J09503J20142J36972
$$ 11722687 11987684 12436093 13189239 13364315 13630162 14786832 14896335 15016477 15153449
11837A5153449m15898l07860p39793l71767m13777L67507l4310k9498j81974j90408
$$ 15153449 14737551 14429691 13689898 13318131 12904354 13271861 13237551 13208053 13026079 12835671
11827A2835671K1290o59586n28598j021245n01220q0383q07785j62929m53554
$$ 12835671 12856961 12197375 11668777 10647532 10146312 10065929 9258144 9095215 8641661
11818H641661j47885l40526o6097m10225J5163n65479j7837P0381n29352j92230
$$ 8641661 8493776 8153250 8087153 7676928 7692091 7126612 7108775 7179156 6649804 6457574
11808F457574M95338m32565j51413r1291L83383m96185K17447o3471l59409R4232
$$ 6457574 6952912 6520347 6368934 6277643 6661026 6164841 6382288 6318817 5959408 6053640
11798F053640k24506L93373j07670M99582L45399j39516P16798J00129K904R33813
$$ 6053640 5829134 6222507 6114837 6614419 6959818 6820302 7537100 7637229 7640133 8573946
11788H573946Q34417M73333J57833L79058q18724L08734q41725p0225q13490q39637
$$ 8573946 9408363 9881696 10039529 10418587 9599863 9908597 9066872 8996647 8183157 7343520
11778G343520K56144j31325n28895k57716l85935K56714k97826o55541R9044K21735
$$ 7343520 7599664 7468339 6939444 6681728 6295793 6552507 6254681 5599140 5698184 5919919
11768E919919k28353k28872M04543l63320k08098R2553k46497K23369Q5066j73178
$$ 5919919 5691566 5462694 5867237 5503917 5295819 5388372 5141875 5365244 5450310 5277132
11758E277132L0401l35006k23089Q7888J76323j67990O77563o32016L46460k82872
$$ 5277132 5307533 4972527 4749438 4837326 5013649 4845659 5523222 4891206 5237666 4954794
11748D954794L35280k47175l16087L94655j61280j25000K46235M02556m96805
$$ 4954794 5290074 5042899 4726812 5121467 4960187 4835187 5081422 5483978 4987173
11739D987173j50002M63079n40469l74391K72101m06800Q19495q99587M15413
$$ 4987173 4837171 5300250 4759781 4385390 4657491 4250691 5070186 4170599 4586012
11730D586012M344L39382o52826M46354p1895L75786l61308N63757m07921j99688
$$ 4586012 4590356 4929738 4276912 4723266 4651371 5027157 4665849 5229606 4821685 4621997
11720D621997r5675L78115k21040M11883l64111k68899L04267p6138P2360k7625
$$ 4621997 4526322 4904437 4683397 5095280 4731169 4462270 4766537 4690399 4762759 4735134
11710D735134j60163L29853k54483J65847q3255O0651k00419P6555J06266L02950
$$ 4735134 4574971 4904824 4650341 4816188 4732933 4793584 4593165 4669720 4775986 5078936
11700E078936R1703K22980k77346r6091k39835K65680L77352o72501J56006L04139
$$ 5078936 5170639 5393619 5116273 5020182 4780347 5046027 5423379 4750878 4906884 5211023
11690E211023k6906l79821q313J65126q0709J76985J85509j56392p9048L99851
$$ 5211023 5184117 4804296 4795983 4961109 4880400 5057385 5242894 5086502 5007454 5407305
11680E407305m19483M28535p48176N47202j14169L76960K12783n27484L10175
$$ 5407305 4987822 5416357 4668181 5215383 5101214 5478174 5690957 5163473 5473648
11671E473648R4181l19287J1764p764M59033j12106k46738J0810K75602m93066
$$ 5473648 5567829 5248542 5260306 5252542 5711575 5599469 5352731 5363541 5639143 5146077
11661E146077M15574l45874J25814K65802m08312j40517r1045Q3451Q97220j025496
$$ 5146077 5561651 5215777 5341591 5607393 5199081 5058564 4967519 5050970 5948190 4922694
11651D922694M71436k82720K16977O18583p66572L37495K90310R0830n71495M4478
$$ 4922694 5394130 5111410 5328387 5946970 5180398 5517893 5808203 5899033 5327538 5372016
11641E372016p7684n37228N28316j42842Q2967O01924o39645M39081P0568j43852
$$ 5372016 5294332 4757104 5285420 5142578 5225545 5827469 5187824 5626905 5697473 5553621
11631E553621k40291R3113J20663q42838Q39561l80332N39792l95939K64591p13058
$$ 5553621 5313330 5406443 5527106 4684268 5523829 5143497 5683289 5287350 5551941 4838883
11621D838883j18440M98963L8841j33286K47726k19441J80368j29042K67450l66459
$$ 4838883 4720443 5219406 5258247 5124961 5372687 5153246 5333614 5204572 5472022 5105563
11611E105563J10448K36765l35420P8348M33335m42699M48310l54495L12621n70404
$$ 5105563 5216011 5452776 5117356 5195704 5629039 5186340 5634650 5280155 5592776 5022372
11601E022372O42815l05755N41118o3867k60236M5779J42037j15047k27955J24871
$$ 5022372 5665187 5359432 5900550 5836683 5576447 5622226 5764263 5649216 5421261 5546132
11591E546132L08711j87271j82032k2643R815J03445Q3161l23595k9269j4533
$$ 5546132 5854843 5667572 5485540 5462897 5472712 5576157 5659318 5335723 5306454 5291921
11581E291921N30369r2966J25538l26981L31484O2679j36751N86424l9169n18723
$$ 5291921 5822290 5729324 5854862 5527881 5859365 5922044 5785293 6371717 6332548 5813825
11571E813825n40993M71537L37663j48170N5832J71531k07265R3303k91590K06822
$$ 5813825 5272832 5744369 6082032 5933862 5989694 6161225 5953960 6047263 5755673 5962495
11561E962495j3375N448k02649o8221j43675N13974l22615k7930K8667N09348
$$ 5962495 5949120 5954568 5751919 5683698 5540023 6053997 5731382 5703452 5732119 6241467
11551F241467n81081J53471P5010O755l59873K49356n07636J21066L39035l25905
$$ 6241467 5660386 5813857 5888867 5895622 5535749 5785105 5277469 5398535 5737570 5411665
11541E411665L2804K93767j68267j52329L92235j94608j67414M7505K44498l45311
$$ 5411665 5444469 5738236 5569969 5417640 5809875 5615267 5447853 5495358 5739856 5394545
11531E394545k36377J46123K95356k78189m5926L9662O6849N59247n39187L42448
$$ 5394545 5158168 5304291 5599647 5321458 5275532 5315194 5382043 5941290 5402103 5744551
11521E744551o39667K45170N7754N02478l46205j9885j18658o034L39421M0969
$$ 5744551 5104884 5350054 5407808 5910286 5564081 5544196 5425538 5419504 5758925 5799894
11511E799894q2763K79473l89790j39710K5013l4544N18662L2775m76953j64313
$$ 5799894 5717131 5996604 5606814 5467104 5492117 5457573 5976235 6009010 5532057 5367744
11501E367744O18035k97650J66716m20684K30103j88613R8423R4063m9770R1189
$$ 5367744 5985779 5688129 5854845 5434161 5664264 5475651 5574074 5668137 5618367 5709556
11491E709556o7665L40558M8782l49305R7164O7814j98444m09340R42877j29586
$$ 5709556 5641891 5982449 6031231 5681926 5779090 5846904 5648460 5239120 6181997 6052411
11481F052411K2915n1333K07506n16118N84443m94340J52786K37449K90480P447
$$ 6052411 6075326 6023993 6231499 5715381 6299824 5805484 5958270 6195719 6486199 6493646
11471F493646m45407R9186k53620J33945m05077L48870j16872K30718J24334m60232
$$ 6493646 6048239 6147425 5893805 6027750 5622673 5971543 5854671 6085389 6209723 5749491
11461E749491J37219k32112M47574q4011n68525O250L46776k20754j82106J25381
$$ 5749491 5886710 5654598 6102172 6018161 5449636 5455886 5802662 5581908 5399802 5525183
11451E525183K67759J46909M8201q3635M33681q23401K72825K93182k41436M77468
$$ 5525183 5792942 5939851 5988052 5904417 6338098 5514697 5787522 6080704 5839268 6316736
11441F316736l13802n20988M43164L31192m36017K96648j68883J59921L7014K51213
$$ 6316736 6002934 5481946 5925110 6256302 5820285 6116933 5948050 6107971 6144985 6396198
11431F396198n4956k069K66714l9155K86701K28817n65780N33770o46140M75749
$$ 6396198 6341242 6339173 6605887 6566732 6853433 7082250 6516470 7050240 6404100 6879849
11421F879849Q37188l73999l42091L12673N33948l2513m956J77831l6280k11711
$$ 6879849 7717037 7343038 7000947 7313620 7847568 7815055 7810099 7987930 7951650 7739939
11411G739939K41155P52960o15967N14841L81360m4533J54423M71278k32119r536
$$ 7739939 7981094 8734054 8118087 8632928 9014288 8969755 9124178 9595456 9363337 9353801
11401I353801K23335M38164Q0693p3624j96619J67428P86443J80516J07205o1179
$$ 9353801 9577136 10015300 10095993 10022369 9825750 9993178 10779621 10960137 11067342 11006163
11391A1006163L99626n34451Q06034j13603L85156K00022m2065k86389M33789
$$ 11006163 11405789 10871338 11677372 11563769 11948925 12148947 12106882 11820493 12254282
11382A2254282J68798K96136r4679J38308M72761k80007L35790M6321o2485L65602
$$ 12254282 12423080 12719216 12624537 12762845 13235606 12955599 13291389 13337710 13275225 13640827
11372A3640827m14097R49707J41385m95258j28110O32004j71610R796L94780r4251
$$ 13640827 13226730 14176437 14317822 13822564 13694454 14326458 14154848 14164644 14559424 14465173
11362A4465173l4897J94777l56574R36265j19263k13967R1522J25247K00741n50702
$$ 14465173 14430276 14625053 14268479 15204744 15085481 14871514 14963036 15088283 15289024 14738322
11352A4738322j08394L42705M36869j387819N06070J73408j57995K76875m04423
$$ 14738322 14629928 14972633 15409502 14021683 14527753 14701161 14543166 14820041 14415618
11343A4415618k95362J49517k4382k08934k5835j21086K13976m38908l51379r2819
$$ 14415618 14120256 14269773 14245391 14036457 14010622 13889536 14103512 13664604 13313225 13220406
11333A3220406O6301L66541j014106M3921M9735l19975K66028l63125m45093N30580
$$ 13220406 13286707 13653248 12639142 12683063 12732798 12412823 12678851 12315726 11870633 12401213
11323A2401213l85744L35731o60431j55833n85210K3647p639j50621m5540o13887
$$ 12401213 12015469 12351200 11690769 11534936 10949726 10973373 10965734 10815113 10769573 10155686
11313A0155686Q5368j55993J30165m33269r6697l34496m75739K36890l55933k5159
$$ 10155686 10241054 10085061 10215226 9781957 9685260 9350764 8875025 9111915 8755982 8730823
11303H730823l02615l9444j16124m42007Q8250R2208n67733P5149L0274o35748
$$ 8730823 8428208 8388764 8272640 7830633 7918883 8011091 7443358 7518507 7548781 6913033
11293F913033L84776J56268p7865l37283j24546k53226O35119o99109k94655o6040
$$ 6913033 7297809 7454077 7376212 7038929 6914383 6661157 7296276 6597167 6302512 6236472
11283F236472q2203Q0253J07047q49078Q64332q9392K7716k47164k31926j69646
$$ 6236472 6154269 6234522 6341569 5492491 6356823 6267431 6295147 6047983 5816057 5646411
11273E646411K95068K51753j66376k33384P4866k70231j82805r951J01493J04401
$$ 5646411 5941479 6193232 6026856 5793472 5868338 5598107 5415302 5405351 5506844 5611245
11263E611245o7621p9015j67514P7673j84224K25170k6780k17838j09804R5161
$$ 5611245 5543624 5464609 5297095 5374768 5190544 5415714 5388934 5171096 5061292 5156453
11253E156453J62541j82648o3656j4859J54636J36816n92532R8508J63202J23943
$$ 5156453 5318994 5136346 5072690 5057831 5212467 5349283 4756751 4855259 5018461 5142404
11243E142404p1023O01530n88706L41423j00380p26245L55024J56744L928L2001
$$ 5142404 5071381 5672911 5084205 5425628 5325248 4599003 4954027 5110771 5114699 5146700
11233E146700J87711M28589m89772M6681O21440J08901L83495J62151J397872
$$ 5146700 5334411 5763000 5273228 5319909 5941349 6050250 6433745 6595896 7993768
11224G993768J196529J730184J180927J298129M14588K83474k32192q42046o90219
$$ 7993768 9190297 10920481 12101408 13399537 13814125 14097599 13865407 13023361 12333142
11215A2333142k314914n62173p40475j21180r96135n04478p02361j75397l26050
$$ 12333142 10018228 9456055 8715580 8594400 7598265 7093787 6391426 6216029 5889979
11206E889979J36086k64134j81028J64687l35194M35677N65812r5417O1880N89650
$$ 5889979 6026065 5761931 5580903 5745590 5410396 5846073 6411885 6316468 6378348 6967998
11196F967998J493504J590845J067402J059135J737549k5908k50951m90781n36451
$$ 6967998 8461502 10052347 11119749 12178884 13916433 13890525 13639574 13148793 12612342
11187A2612342j076341j199116p30964n88160p13672r74689j90127r45988K95229
$$ 12612342 11536001 10336885 9605921 9017761 8304089 7329400 7139273 6193285 6488514
11178F488514q18480k10794J01883K36755j21462l88490J98611k08299L54659
$$ 6488514 5670034 5459240 5561123 5797878 5676416 5287926 5486537 5278238 5632897
11169E632897K47128m75849j27709k46571M33911K73370j49695r8671k84300O31562
$$ 5632897 5880025 5404176 5276467 5029896 5463807 5737177 5587482 5488811 5204511 5836073
11159E836073k45749Q3284o4840k55552N28579n1838j62001j01279O24748q61536
$$ 5836073 5590324 5673608 5608768 5353216 5881795 5829957 5667956 5566677 6191425 5329889
11149E329889J62909L52666l14934K07729m76381R61883k75839n80389Q56602
$$ 5329889 5492798 5845464 5530530 5738259 5261878 6223761 5947922 5367533 6224135
11140F224135m11226K64500j941j16967J48038P8880J04111m2044k39239k435
$$ 6224135 5812909 6077409 6075468 5958501 6106539 6185419 6289530 6247486 6008247 6005812
11130F005812J21567k40903K84159J6213k7405K06067K56639j3568j48827L08207
$$ 6005812 6127379 5886476 6170635 6186848 6159443 6365510 6622149 6608581 6459754 6767961
11120F767961J2091j36519l38725L79907m61657K81630n9661M06608n5673M67200
$$ 6767961 6780052 6643533 6304808 6684715 6223058 6504688 6445027 6851635 6795962 7263162
11110G263162n37836Q2661j9593q5420k26714p8762n4046L00083o1071M11044
$$ 7263162 6725326 6807987 6788394 6702974 6476260 6397498 6343452 6643535 6582464 6993508
11100F993508O226l54039M9909l50505P91322m93626J96503k03714j28837M9840
$$ 6993508 6999734 6645695 6695604 6345099 7136421 6642795 6839298 6635584 6506747 6556587
11090F556587j50008R4588Q4333j81455N38825m28253L69552r51219P61251l74861
$$ 6556587 6406579 6501167 6585500 6404045 6942870 6514617 6884169 5932950 6694201 6319340
11080F319340K23153Q7521j69423L06292J67710o4373k11921r2160P35414n13423
$$ 6319340 6542493 6630014 6460591 6766883 6934593 6870220 6658299 6566139 7301553 6788130
11070F788130K80755m46298J10183L76342K64737O8346k67467J17847M5416K32421
$$ 6788130 7068885 6622587 6732770 7109112 7373849 7442195 7174728 7292575 7337991 7570412
11060G570412N67035j46970K51658J12885k49250L29751J7493n89568Q48952K59169
$$ 7570412 8137447 7990477 8242135 8355020 8105770 8435521 8453014 7863446 8712398 8971567
11050H971567M0637j9382l68141J94389K3151k81879O1035K22749Q21813J9615
$$ 8971567 9012204 8992822 8624681 8819070 8842221 8560342 8621377 8844126 9665939 9685554
11040I685554k5823K91533j63181N58119q5788O49628j27428k0425L21471N85434
$$ 9685554 9659731 9951264 9788083 10346202 10260414 10910042 10782614 10762189 11083660 11669094
11030A1669094N48784k81940P35803k91795m45173R31583M67933q86742N68970
$$ 11669094 12217878 11935938 12671741 12379946 11934773 12866356 13334289 12447547 13016517
11021A3016517O2631O41858M6866P3315l6243L52810J11135M77990k34975O73071
$$ 13016517 13079148 13721006 13767872 13841187 13804944 14157754 14268889 14746879 14511904 15184975
11011A5184975K08159L54578M14409M23738j77341J035667R4307J27816O66361
$$ 15184975 15393134 15747712 16162121 16585859 16408518 17444185 17538492 17666308 18332669
11002A8332669j64459M07458K16156L2558O71940n15523R92327l74630P97584
$$ 18332669 18168210 18575668 18791824 18824382 19496322 18980799 19973126 19598496 20396080
10993B0396080k35043M96200p61849N73422L52228M50396M5393M57042l6739J021571
$$ 20396080 20161037 20657237 19895388 20468810 20821038 21271434 21316827 21773869 21737130 22758701
10983B2758701N49438J154725J54155O69259L76819L32930O00428k73018P90770
$$ 22758701 23308139 24462864 24617019 25286278 25663097 25996027 26596455 26323437 27114207
10974B7114207N01580R6254K60161l03287M75617Q29035L29355K99699O62625
$$ 27114207 27615787 27712041 27972202 27668915 28144532 28973567 29302922 29602621 30265246
10965C0265246J264088L48223N01298J114718J20414J207038R29088O03410J310470
$$ 30265246 31529334 31877557 32378855 33493573 33613987 34821025 35750113 36353523 37663993
10956C7663993P44714N40204J277483J202883J144345J78075R58453N59798L74458
$$ 37663993 38408707 38948911 40226394 41429277 42573622 42751697 43710150 44269948 44644406
10947D4644406M26719M43709L76056J209365R29560O28511J144069J042413J004387
$$ 44644406 45071125 45514834 45890890 47100255 48029815 48658326 49802395 50844808 51849195
10938E1849195R80612R53925J245673J469690J003650R05998J517244M35756R60895
$$ 51849195 52829807 53783732 55029405 56499095 57502745 58408743 59925987 60361743 61322638
10929F1322638J079656Q81185P62646M66710J067646L45338N55471R06437R0034
$$ 61322638 62402294 63283479 64046125 64512835 65580481 65925819 66481290 67387727 67477761
10920F7477761K7731N65840j1193k71897q4301L231j56715n25927K58245K29514
$$ 67477761 67505492 68071332 68060139 67788242 67703941 67707172 67550457 67024530 67282775 67512289
10910F7512289m44351N50177k88904K58686M63236L81681N5040N70157M02311
$$ 67512289 67067938 67618115 67329211 67587897 68051133 68432814 68487854 69058011 69460322
10901F9460322J155489m6267R64422R16088J063700J685325J011255K171472J294664
$$ 69460322 70615811 70569544 71533966 72450054 73513754 75199079 76210334 78381806 79676470
10892G9676470K534302K323152K963243L063630L284354M089480M501314N732717
$$ 79676470 82210772 84533924 87497167 90560797 93845151 97934631 102435945 108168662
10884A08168662N512348O394460O072089O539211N361306O999980M579799M879630
$$ 108168662 113681010 120075470 126147559 132686770 138048076 145048056 149627855 154507485
10876A54507485L160916K362840O98488l7227j170427l055090k806213m455518
$$ 154507485 157668401 160031241 160729729 160692502 159522075 156466985 153660772 149205254
10868A49205254m269351n010465n266755n676598n954148n184113n648219n379291
$$ 149205254 144935903 139925438 134658683 128982085 123027937 117843824 112195605 106816314
10860A06816314n490322n861833n389559m659254m369207m704764m094764m257863
$$ 106816314 101325992 95464159 90074600 85415346 81046139 76341375 72246611 67988748
10852F7988748l807583l481975l292048k602131l365378k721414l066221j823660
$$ 67988748 64181165 60699190 57407142 54805011 51439633 48718219 45651998 43828338
10844D3828338k475926k678938j603223j537823j541901j653739j991736q91050
$$ 43828338 41352412 38673474 37070251 35532428 33990527 32336788 30345052 29454002
10836B9454002j168967j762539q96450p76781p54879j285802r61037o25140j428213
$$ 29454002 28285035 26522496 25626046 24849265 24094386 22808584 21847547 21222407 19794194
10827A9794194m75688n24516p59377k20602m96547j037667J1603j016274j88949
$$ 19794194 19318506 18793990 18034613 17814011 17317464 16279797 16291400 15275126 15086177
10818A5086177P717q82178j40539n20758M426l85107l37169l12560o24276L15328
$$ 15086177 15093894 14211716 14071177 13550419 13554845 13169738 12832569 12520009 11895733 12211061
10808A2211061m28280k39526k56647n76569J80021J26500n34212P3264l91580
$$ 12211061 11782781 11543255 11286608 10710039 10890060 11016560 10482348 10555612 10164032
10799A0164032N4183l06528o48344P9629k68789k78428K76302o43548q5693J02886
$$ 10164032 10218215 9911687 9263343 9342972 9074183 8795755 9072057 8428509 8342816 8445702
10789H445702l0956p7081j11200j79717l77981O58674p74303N7112R2438l55509
$$ 8445702 8414746 8337665 8226465 8046748 7668767 8327441 7553138 7610250 7702688 7347179
10779G347179k83584l0353n3361J10601n49614N50752j20157n20559o7861k72599
$$ 7347179 7063595 7033242 6979881 7090482 6540868 7091620 6971463 6450904 6383043 6110444
10769F110444L3488L6055j60083L28514m03898N4516L05823o59635J09711L82741
$$ 6110444 6143932 6179987 6019904 6348418 5944520 5999036 6304859 5645224 5754935 6137676
10759F137676l01450m10648L42842M00171k11633Q1029k36872L23892K53475l62653
$$ 6137676 5836226 5425578 5768420 6168591 5956958 6037987 5801115 6125007 6378482 6015829
10749F015829r013J40696k76828J60633m4963o14790K54013l21849K61637m25203
$$ 6015829 6006816 6147512 5870684 6031317 5986354 5371564 5625577 5303728 5565365 5140162
10739E140162j54645L9806j32087j8278M04912n97452k94793R04096n65035M31666
$$ 5140162 4985517 5025323 4893236 4874958 5279870 4682418 4387625 5291721 4726686 5158352
10729E158352Q0018O8448j9146K0200K03805l46266L08493l76674M97361k65860
$$ 5158352 5238370 5306818 5287672 5307872 5511677 5165411 5473904 5097230 5594591 5328731
10719E328731n83275K57528O2267l18217J32469k35628M0935Q4390J74601k91930
$$ 5328731 4745456 5002984 5065251 4747034 4879503 4643875 4684810 4769200 4943801 4651871
10709D651871L72648j19695n58264J46050J59142J29657K04320n35820J09818
$$ 4651871 5024519 4904824 4346560 4492610 4651752 4781409 4985729 4449909 4559727
10700D559727K04612M6592q2269j90601j49141M58047k8766j75454k60466L75713
$$ 4559727 4764339 4810931 4728662 4538061 4388920 4846967 4818201 4642747 4382281 4757994
10690D757994Q112l11479L64339n8896J6298J13417n65388R78050q64572R9018
$$ 4757994 4766106 4454627 4818966 4760070 4776368 4889785 4324397 5302447 4437875 4536893
10680D536893J69339k0963K65749k33717O33049L23496K86592k66013j13977J99306
$$ 4536893 4706232 4685269 4951018 4717301 5350350 5673846 5960438 5694425 5580448 5779754
10670E779754k54567N7301l88654M83466l32977n66100J26813m24720j34668N00678
$$ 5779754 5525187 5582488 5193834 5677300 5344323 4778223 4905036 4480316 4345648 4846326
10660D846326l38571N7488p5065k09020K70039J10125Q49762m5453j7009m48872
$$ 4846326 4507755 4565243 4490178 4281158 4551197 4661322 5511084 5465631 5448622 4999750
10650D999750N20056k4401K29948m17909l62235K01868l42821j91971n78765r2399
$$ 4999750 5519806 5495405 5725353 5307444 4945209 5147077 4804256 4612285 4033520 3941121
10640C941121k70799j78552j87266M84341r9241O8332l09532N7238k5349m02791
$$ 3941121 3670322 3491770 3304504 3788845 3689604 3757936 3448404 3505642 3480293 3077502
10630C077502K19618R9747M3049J86213l39261P01887p24986K44773m21684L43360
$$ 3077502 3297120 3396867 3439916 3626129 3286868 3988755 3263769 3508542 3086858 3430218
10620C430218K30486K29859r86332O49626l68392M1859k4690M80138m82739J57702
$$ 3430218 3660704 3890563 2904231 3553857 3185465 3227324 3202634 3682772 3200033 3357735
10610C357735j78202K23821k01136K71363j58795L60223n17750M12809M3796m89367
$$ 3357735 3179533 3403354 3202218 3473581 3314786 3675009 3157259 3570068 3613864 3124497
10600C124497l60648O09876L96852k65836j09286k89415J76697J88946M18818
$$ 3124497 2763849 3373725 3770577 3504741 3395455 3106040 3282737 3471683 3890501
10591C890501p28694N49636m438m68590L37834j43526n55992M76334K22230n17453
$$ 3890501 3161807 3711443 3707005 3238415 3576249 3432723 2876731 3353065 3575295 3057842
10581C057842Q1116N8043L81591p1185n24111O58064m12113L54962j92753m074
$$ 3057842 3138958 3197001 3578592 3507407 2983296 3641360 3229247 3584209 3391456 3387382
10571C387382k84821K29407k24532r2689O65620o07496J59560k32672l84420L16376
$$ 3387382 3102561 3331968 3107436 3014747 3680367 3072871 3232431 2999759 2615339 2931715
10561B931715L2861J44141k36707K7660J20937j36194K26701j0259l74398R744
$$ 2931715 2964576 3108717 2872010 2899670 3020607 2884413 3111114 3100855 2726457 2736201
10551B736201L60916j62006j37347m70535K37449J12951p1700j15003M06318M55284
$$ 2736201 3097117 2935111 2797764 2327229 2564678 2677629 2605929 2490926 2897244 3352528
10541C352528l48253j55345J00291m14474O34482m42060m80291M48337Q2081k37502
$$ 3352528 3004275 2848930 2949221 2534747 3169229 2727169 2246878 2695215 2777296 2539794
10531B539794O44528l3134J63612j95902O2157j80533L6234J3757O0003k55729
$$ 2539794 3184322 3151188 3314800 3118898 3181055 3000522 3036756 3050513 3110516 2854787
$$ [...]
##END NTUPLES=NMR SPECTRUM
##END=
