##TITLE=Coffee green (M1-ROVE90 + 1.5mL buffer 50/50,  450uL extracto + 50uL (D2O+TMS))
without heating, vortex and centrifuged, temperature 0oC.
##JCAMPDX= 6.0         $$ Bruker NMR JCAMP-DX V2.0
##DATA TYPE= NMR SPECTRUM
##DATA CLASS= NTUPLES
##ORIGIN= Bruker BioSpin GmbH
##OWNER= Administrator
$$ 1.72 TOPSPIN		Version 2.1
$$ 2012-05-22 16:16:48.872 -0700  Administrator@X
$$ Compression mode = diff/dup
##.OBSERVE FREQUENCY= 400.13188196
##.OBSERVE NUCLEUS= ^1H
##.ACQUISITION MODE= SIMULTANEOUS (DQD)
##.ACQUISITION SCHEME= undefined
##.AVERAGES= 64
##.DIGITISER RES= 22
##SPECTROMETER/DATA SYSTEM= spect
##.PULSE SEQUENCE= noesygppr1d
##.SOLVENT NAME= H2O+D2O
##.SHIFT REFERENCE= INTERNAL, H2O+D2O, 1, 14.97964
##AUDIT TRAIL= $$ (NUMBER, WHEN, WHO, WHERE, PROCESS, VERSION, WHAT)
$$ ##TITLE= Audit trail, TOPSPIN		Version 2.1
$$ ##JCAMPDX= 5.01
$$ ##ORIGIN= Bruker BioSpin GmbH
$$ ##OWNER= Administrator
$$ $$ C:\Bruker\TOPSPIN/data/jwist/nmr/11-coffee-green-quantification-2/321/pdata/1/auditp.txt
$$ ##AUDIT TRAIL=  $$ (NUMBER, WHEN, WHO, WHERE, PROCESS, VERSION, WHAT)
(   1,<2011-11-18 15:58:44.607 -0500>,<Administrator>,<TOPSPIN>,<go>,<TOPSPIN 2.1>,
      <created by zg
	started at 2011-11-18 15:49:50.091 -0500,
	POWCHK enabled, PULCHK disabled,
       configuration hash MD5:
       DA 63 81 1B EF 4C B5 72 B4 DF EA D9 B4 DB 4C 08
       data hash MD5: 64K
       42 C6 18 04 46 3E 15 ED 4D F2 9A 2B 15 4D E2 EB>)
(   2,<2011-11-18 15:59:26.857 -0500>,<Administrator>,<TOPSPIN>,<proc1d>,<TOPSPIN 2.1>,
      <Start of raw data processing
       efp LB = 0 FT_mod = 6 PKNL = 1 PHC0 = 0 PHC1 = 0 SI = 32K 
       data hash MD5: 32K
       28 97 7A BF 8B 46 1E 2E DA 2F D4 9D 2C 07 21 9D>)
(   3,<2011-11-18 15:59:27.247 -0500>,<Administrator>,<TOPSPIN>,<proc1d>,<TOPSPIN 2.1>,
      <pk PHC0 = 23.52173 PHC1 = 0 
       data hash MD5: 32K
       E1 4B 39 C5 6C D9 70 51 40 80 55 21 41 C2 3E 26>)
$$ ##END=
$$ 
$$ $$ hash MD5
$$ $$ 48 FF 77 A2 68 81 91 55 F9 0E A7 0B 40 CB F0 D8
##$RELAX= 
##$RELAX= 
##$RELAX= 
##$RELAX= 
##$RELAX= 
##$RELAX= 
##$RELAX= 
$$ Bruker specific parameters
$$ --------------------------
##$DU= <Z:>
##$EXPNO= 321
##$NAME= <11-coffee-green-quantification-2>
##$PROCNO= 1
##$TYPE= <nmr>
##$USER= <jwist>
##$ACQT0= -8.17640701383314
##$AMP= (0..31)
100 100 100 100 100 100 100 100 100 100 100 100 100 100 100 100 100 100
100 100 100 100 100 100 100 100 100 100 100 100 100 100
##$ANAVPT= -1
##$AQSEQ= 0
##$AQ_mod= 3
##$AUNM= <au_prof>
##$AUTOPOS= <>
##$BF1= 400.13
##$BF2= 400.13
##$BF3= 400.13
##$BF4= 400.13
##$BF5= 400.13
##$BF6= 400.13
##$BF7= 400.13
##$BF8= 400.13
##$BYTORDA= 0
##$CFDGTYP= 0
##$CFRGTYP= 9
##$CHEMSTR= <none>
##$CNST= (0..63)
1 1 145 1 1 1 1 1 1 1 1 1 1 1 1 1 1 1 1 1 1 1 1 1 1 1 1 1 1 1 1 1 1 1 1
1 1 1 1 1 1 1 1 1 1 1 1 1 1 1 1 1 1 1 1 1 1 1 1 1 1 1 1 1
##$CPDPRG= <>
##$CPDPRG1= <>
##$CPDPRG2= <>
##$CPDPRG3= <>
##$CPDPRG4= <mlev>
##$CPDPRG5= <mlev>
##$CPDPRG6= <mlev>
##$CPDPRG7= <mlev>
##$CPDPRG8= <mlev>
##$CPDPRGB= <>
$$ [...]
150 150 150 150 150 150 150 150
##$TP07= 0
##$TPNAME0= <>
##$TPNAME1= <>
##$TPNAME2= <>
##$TPNAME3= <>
##$TPNAME4= <>
##$TPNAME5= <>
##$TPNAME6= <>
##$TPNAME7= <>
##$TPOAL= (0..7)
0.5 0.5 0.5 0.5 0.5 0.5 0.5 0.5
##$TPOFFS= (0..7)
0 0 0 0 0 0 0 0
##$TUNHIN= 0
##$TUNHOUT= 0
##$TUNXOUT= 0
##$USERA1= <user>
##$USERA2= <user>
##$USERA3= <user>
##$USERA4= <user>
##$USERA5= <user>
##$V9= 5
##$VALIST= <valist>
##$VCLIST= <CCCCCCCCCCCCCCC>
##$VD= 0
##$VDLIST= <DDDDDDDDDDDDDDD>
##$VPLIST= <PPPPPPPPPPPPPPP>
##$VTLIST= <TTTTTTTTTTTTTTT>
##$WBST= 2048
##$WBSW= 25
##$XGAIN= (0..3)
0 0 0 0
##$XL= 0
##$YL= 0
##$YMAX_a= 4947998
##$YMIN_a= -1800234
##$ZGOPTNS= <>
##$ZL1= 120
##$ZL2= 120
##$ZL3= 120
##$ZL4= 120
##$ABSF1= 0
##$ABSF2= 0
##$ABSG= 0
##$ABSL= 0
##$ALPHA= 0
##$AQORDER= 0
##$ASSFAC= 0
##$ASSFACI= 0
##$ASSFACX= 0
##$ASSWID= 0
##$AUNMP= <proc_prof1d>
##$AXLEFT= 0
##$AXNAME= <>
##$AXNUC= <1H>
##$AXRIGHT= 0
##$AXTYPE= 0
##$AXUNIT= <>
##$AZFE= 0.1
##$AZFW= 0.1
##$BCFW= 0
##$BC_mod= 0
##$BYTORDP= 0
##$COROFFS= 0
##$CY= 15
##$DATMOD= 1
##$DC= 0
##$DFILT= <>
##$DTYPP= 0
##$F1P= 3.9087463189609
##$F2P= 3.80315764200204
##$FCOR= 0.5
##$FTSIZE= 32768
##$FT_mod= 6
##$GAMMA= 0
##$GB= 0
##$INTBC= 1
##$INTSCL= 1
##$ISEN= 128
##$LB= 0
##$LEV0= 0
##$LPBIN= 0
##$MAXI= 10000
##$MC2= 0
##$MEAN= 0
##$ME_mod= 0
##$MI= 0
##$NCOEF= 0
##$NC_proc= -6
##$NLEV= 6
##$NOISF1= 0
##$NOISF2= 0
##$NSP= 0
##$NTH_PI= 0
##$NZP= 0
##$OFFSET= 14.97964
##$PC= 1
##$PHC0= 23.52173
##$PHC1= 0
##$PH_mod= 1
##$PKNL= yes
##$PPARMOD= 0
##$PPDIAG= 0
##$PPIPTYP= 0
##$PPMPNUM= 2147483647
##$PPRESOL= 1
##$PSCAL= 0
##$PSIGN= 0
##$PYNMP= <proc.py>
##$REVERSE= no
##$SF= 400.13
##$SI= 32768
##$SIGF1= 0
##$SIGF2= 0
##$SINO= 400
##$SIOLD= 32768
##$SPECTYP= <>
##$SREGLST= <1H.CDCl3>
##$SSB= 0
##$STSI= 32768
##$STSR= 0
##$SW_p= 8223.68421052631
##$SYMM= 0
##$S_DEV= 0
##$TDeff= 65536
##$TDoff= 0
##$TI= <>
##$TILT= no
##$TM1= 0
##$TM2= 0
##$TOPLEV= 0
##$USERP1= <user>
##$USERP2= <user>
##$USERP3= <user>
##$USERP4= <user>
##$USERP5= <user>
##$WDW= 1
##$XDIM= 32768
##$YMAX_p= 283348405
##$YMIN_p= -28326779
##$CURPLOT= <Network HP LaserJet P1505>
##$CURPRIN= <$Network HP LaserJet P1505>
##$DFORMAT= <normdp>
##$LAYOUT= <+/1D_H.xwp>
##$LFORMAT= <normlp>
##$PFORMAT= <normpl>
##$SURQMSG= 1
$$ End of Bruker specific parameters
$$ ---------------------------------
##NTUPLES= NMR SPECTRUM
##VAR_NAME=  FREQUENCY,     SPECTRUM/REAL,   SPECTRUM/IMAG
##SYMBOL=    X,             R,               I
##VAR_TYPE=  INDEPENDENT,   DEPENDENT,       DEPENDENT
##VAR_FORM=  AFFN,          ASDF,            ASDF
##VAR_DIM=   32768,         32768,           32768
##UNITS=     HZ,            ARBITRARY UNITS, ARBITRARY UNITS
##FACTOR=    0.250966925370066, 1,           1
##FIRST=     8223.43324360094, 75271,        -239110
##LAST=      0,             -33542,          -237028
##MIN=       0,             -28326779,       0
##MAX=       8223.43324360094, 283348405,    0
$$ Real data points
##PAGE= N=1
##DATA TABLE= (X++(R..R)), XYDATA
$$ [...]
19678B703055k22083L10138j9668P9925m43379P2036J11821k15494K01685K2621
$$ 2703055 2480972 2791110 2771442 2851367 2407988 2480024 2591845 2376351 2578036 2600657
19668B600657J11281j35532K19470l92682j47448K09401P6984p5795P2414l01533
$$ 2600657 2711938 2576406 2795876 2403194 2255746 2465147 2542131 2466336 2538750 2237217
19658B237217K17858j1403j21634L2277q3437J97779M6783p7236J59109j82051
$$ 2237217 2455075 2443672 2322038 2354315 2270878 2468657 2515440 2438204 2597313 2415262
19648B415262Q3272O5750l53519K79859q8269l1081J45612l4221j2206k25306
$$ 2415262 2498534 2564284 2210765 2490624 2402355 2371274 2516886 2482665 2470459 2245153
19638B245153M6270K26495k07658P582l5647M68444m98767m2659K61612k76816
$$ 2245153 2291423 2517918 2310260 2317842 2282195 2750639 2251872 2209213 2470825 2194009
19628B194009J20547J41625m5146k12395o4064K74959l26901K43598J47645j38272
$$ 2194009 2314556 2456181 2411035 2198640 2134576 2409535 2082634 2326232 2473877 2335605
19618B335605j59319o3627J84255j48927K9811k69337J18894J51086k52112R6035
$$ 2335605 2176286 2112659 2296914 2147987 2177798 1908461 2027355 2178441 1926329 2022364
19608B022364J22279q8629j90325N0258J14731k43679J20464k8119m7364J02813
$$ 2022364 2144643 2056014 1865689 1915947 2030678 1786999 1907463 1879344 1831980 1934793
19598A934793k8039N1472n1393J1375k2469K1858L08556j66465J8700j02012O2667
$$ 1934793 1906754 1958226 1906833 1918208 1895739 1917597 2226153 2059688 2078388 1976376 2039043
19587B039043K1827J31538j75476j2272J33397k15704J34090m0262J50331j22200
$$ 2039043 2060870 2192408 2016932 2004660 2138057 1922353 2056443 2016181 2166512 2044312
19577B044312P5231q7045K1999O9106r1169J41227k72087L65965j61142M285j30008
$$ 2044312 2119543 2032498 2054497 2123603 2032434 2173661 1901574 2267539 2106397 2110682 1980674
19566A980674Q9891K65128j46018K59187m40946K58098j06255j04305r682K32792
$$ 1980674 2070565 2335693 2189675 2448862 2007916 2266014 2159759 2055454 2045772 2278564
19556B278564j15144O6118k11312n5823K21481j0798j62539J36743P515n1528
$$ 2278564 2163420 2229538 2018226 1962403 2183884 2173086 2010547 2147290 2154805 2103277
19546B103277J30489j35003P8717j73856j57637J43912k2483j22478J15482n9700
$$ 2103277 2233766 2098763 2177480 2003624 1845987 1989899 1967416 1844938 1960420 1900720
19536A900720J2472l4850j48867K70566j10912j29220j7401K53104l33834J64790
$$ 1900720 1913192 1878342 1729475 2000041 1889129 1759909 1742508 1995612 1661778 1826568
19526A826568J64332k57866K82648j57890P0158l82410L30435L4304k71672K44707
$$ 1826568 1990900 1733034 2015682 1857792 1927950 1545540 1875975 1910279 1638607 1883314
19516A883314k44334Q0783R3228q2124k8868J74194k67686K68952j45593J76648
$$ 1883314 1638980 1719763 1812991 1730867 1701999 1876193 1608507 1877459 1731866 1908514
19506A908514O7270k09917j54510L39877k31310M2092q7628J48249l132J11498
$$ 1908514 1975784 1765867 1611357 1951234 1719924 1762016 1674388 1822637 1819505 1931003
19496A931003j89957j36777L77682k38051j61833J64530n5562J06362l9374Q7251
$$ 1931003 1741046 1604269 1981951 1743900 1582067 1746597 1691035 1797397 1758023 1845274
19486A845274k9680k47289K03330n9353K0419p1872j08113K03860k79526j80420
$$ 1845274 1815594 1568305 1771635 1712282 1732701 1660829 1552716 1756576 1477050 1296630
19476A296630L20607n4751N7742k0743J31728j23218j53269J84556k6916o2083
$$ 1296630 1617237 1562486 1620228 1599485 1731213 1607995 1454726 1639282 1612366 1550283
19466A550283r7146p850O2844j00980j11867M248j71570M93967k0422k61869N5106
$$ 1550283 1453137 1445287 1508131 1407151 1295284 1299532 1127962 1621929 1601507 1339638 1394744
19455A394744k0677j80785R0983K3770n5133l6620P4944l3359l19239K05142J5736
$$ 1394744 1374067 1193282 1284265 1308035 1252902 1216282 1291226 1257867 938628 1143770 1159506
19444A159506m6093J31484J37986q8486J20519R735k3793p3632j65872J25992
$$ 1159506 1113413 1244897 1382883 1294397 1414916 1424651 1400858 1327226 1161354 1287346
19434A287346j09439m3459J24610P3845j72505n2122j7324p5323K08029L6962
$$ 1287346 1177907 1134448 1259058 1332903 1160398 1108276 1090952 1015629 1223658 1260620
19424A260620L4099q3003j64494R0612j7087J16398K9049q1591m1689K9493R112
$$ 1260620 1294719 1211716 1047222 1137834 1120747 1237145 1266194 1184603 1142914 1172407 1181519
19413A181519k5093j3422M524l5593K1184j78959J26123j43328L5378o5003J28787
$$ 1181519 1156426 1143004 1147528 1111935 1133119 954160 1080283 936955 972333 907330 1036117
19402A036117J77079j82854j29747K02671k63751J18584J21958j3039K9737j60847
$$ 1036117 1213196 1030342 900595 1103266 839515 958099 1080057 1067018 1096755 935908
19392I35908L8914p5141N4184p1257K53488k7927j11316Q6022j84511J44483J50890
$$ 935908 974822 899681 953865 882608 1136096 1108169 996853 1082875 898364 1042847 1193737
19381A193737k00761k02590k4343L06811k4797k14555K30356k18035L35548l8520
$$ 1193737 992976 790386 766043 1072854 1048057 833502 1063858 845823 1181371 1142851
19371A142851o2476o7316r0494J11824J54686j25589j34805M8499Q3099j2308
$$ 1142851 1080375 1013059 922565 1034389 1189075 1063486 928681 977180 1060279 1047971
19361A047971j13857r4535J62111m3297r9310J29702k32836K09647l5780O0721
$$ 1047971 934114 839579 1001690 958393 859083 988785 755949 965596 929816 990537
19351I90537j55607Q4898J90272k87003P8632q4844J04407p8382J3908L08484
$$ 990537 834930 919828 1110100 823097 901729 816885 921292 842910 856818 1165302
19341A165302l17723L05199m39653K14250n866R2773J2951M621M092m4588j02263
$$ 1165302 847579 1152778 713125 927375 921509 1014282 1027233 1031854 1035946 991358 889095
19330H89095l5334K85278k23211J24339J8326Q0459j25165L6999j94356N2998
$$ 889095 853761 1139039 915828 1040167 1058493 1138952 1013787 1050786 856430 909428
19320I09428K785J09817j74808J03901m9528M2632p152j48886L05022j90278L6182
$$ 909428 912213 1022030 847222 951123 901595 944227 937075 788189 1093211 902933 939115
19309I39115o1682J66591j05273Q0591k38223M52442k11232j35247K68572q7419
$$ 939115 877433 1044024 938751 1019342 781119 1233561 1022329 887082 1155654 1068235
19299A068235k80636K05563l6712j834p3448R4616l4972J38559j19320Q618j8059
$$ 1068235 787599 993162 956450 954616 881168 975784 940812 1079371 960051 968669 950610
19288I50610q329K3545J23017l33675K41334k58947M39263k58431J90725j39927
$$ 950610 942281 965826 1088843 755168 996502 737555 1176818 918387 1109112 969185
19278I69185M0205j55896J16385k34262J98455K430K33079o9445N2134K4167j41523
$$ 969185 1009390 853494 969879 735617 934072 936502 1169581 1100136 1152270 1176437 1034914
19267A034914K2388l1808j3208j88427O3565k5143M5173Q8611N5145m18144K62594
$$ 1034914 1057302 1025494 1012286 823859 887424 862281 907454 996065 1051210 633066 895660
19256H95660J34167m41892J95544J22971O9184k09467O9840R3974k2676l8943
$$ 895660 1029827 587935 783479 906450 975634 766167 836007 929981 907305 868362
19246H68362j55017O0727L35216O9239N62063m6528L6234J54410K33200m54567
$$ 868362 713345 774072 1109288 1178527 1740590 1694062 1730296 1884706 2117906 1663339
19236A663339K00373l24232l2326n40596k5189k2929j75420l1099J23575J14646
$$ 1663339 1863712 1539480 1507154 966558 941369 918440 743020 711921 835496 950142
19226I50142j00669r5605K2691P948Q7919j21318j85986R9656q8763L04049j16341
$$ 950142 849473 753868 776559 784507 872426 751108 565122 664778 576015 880064 763723
19215G63723r0394N1286R8401p3848q487K71246r5763J4088p113k45029K30105
$$ 763723 673329 724615 823016 749168 740681 1011927 916164 930252 923139 678110 908215
19204I08215n8681K13043k25229k3353L9958K1742j14847o9413M3017K07763k65014
$$ 908215 849534 1062577 837348 813995 853953 875695 760848 691435 734452 942215 677201
19193F77201L01956j31162n6463O3196P5697l4023j34429J39194R6151j93489
$$ 677201 979157 847995 791532 854728 930425 896402 761973 901167 997318 803829
19183H03829j33595J44176j36520J44865j2283o7080R204O5233L3157j90128J11997
$$ 803829 670234 814410 677890 822755 810472 743392 752596 817829 850986 660858 772855
19172G72855n7186J81499j27052p4069K6636R1781j68963J95357N9159j63215
$$ 772855 715669 897168 770116 696047 722683 814464 645501 840858 900017 736802
19162G36802J13322q8222O7217m939j31386J10548P0795l4361R3280p3543L7536
$$ 736802 850124 761902 829119 824180 692794 803342 874137 839776 933056 859513 897049
19151H97049J55472o6865j50504N1326j70919J61119Q2137m0022J50326j94209
$$ 897049 1052521 985656 835152 886478 715559 876678 958815 918793 1069119 874910
19141H74910J35423M3957J19232j92658L62815q681L72530l14082L14391l9095
$$ 874910 1010333 1054290 1173522 980864 1343679 1334998 1707528 1393446 1707837 1668742
19131A668742O7103j56699j7781M2187j49974n5275J76278j60337M9415Q9780
$$ 1668742 1735845 1579146 1561365 1603552 1453578 1398303 1574581 1414244 1463659 1553439
19121A553439J14218k34945j83917K0122O9141k6062P2576k97286l38206L66900
$$ 1553439 1667657 1432712 1248795 1268917 1338058 1311996 1384572 1087286 749080 1115980
19111A115980N4934k52159K68443k04673L18737j44255r7840P8367j65182J48476
$$ 1115980 1170914 918755 1187198 982525 1301262 1157007 1059167 1137534 972352 1120828
19101A120828J29852j47949j01355K66435K82098n9476k36329q3521J3456k2285
$$ 1120828 1250680 1102731 1001376 1267811 1549909 1490433 1254104 1170583 1184039 1161754
19091A161754K23462k69991J91390n1895q8718R8171l1078K56788k50370J26534
$$ 1161754 1385216 1115225 1306615 1254720 1166002 1264173 1233095 1489883 1239513 1366047
19081A366047j4331P7669M6479j71854J0927K85179L84925k64098L94122J5879
$$ 1366047 1351716 1429385 1475864 1304010 1314937 1600116 1985041 1720943 2115065 2130944
19071B130944L42648K14478N32303Q24298O12586P78405M00443L61469L41214
$$ 2130944 2473592 2688070 3220373 4044671 4657257 5435662 5836105 6197574 6538788
19062F538788j95416k1774l75487o61866p37751o03551o79820n18494k36065Q6942
$$ 6538788 6343372 6321598 5946111 5284245 4546494 3942943 3263123 2744629 2508564 2595506
19052B595506m49773k48707N00829M50315L28019O38958K98152N98312M68875
$$ 2595506 2145733 1897026 2397855 2848170 3176189 3815147 4113299 4711611 5180486
19043E180486K95696r805j02633k03812o75998l66408p23907m93443l82518j53167
$$ 5180486 5476182 5466377 5363744 5159932 4483934 4117526 3393619 2900176 2517658 2364491
19033B364491r6008K2997j24009J82861k82083L53199J20656R7382M82946K40980
$$ 2364491 2268483 2291480 2167471 2350332 2068249 2421448 2542104 2639486 3122432 3363412
19023C363412P60621O35421O73359P62747O05572L27419M0481p2507p0049q45049
$$ 3363412 4124033 4759454 5432813 6195560 6801132 7128551 7169032 7096525 7026476 6181427
19013F181427o37409p52805o04955o71702l56812K7896k231K55035M84999J48956
$$ 6181427 5544018 4791213 4186258 3514556 3157744 3185640 3183409 3438444 3923443 4072399
19003D072399M65109P24916K57399L74838J6894j79281n2485o70983o08882p15456
$$ 4072399 4537508 5262424 5519823 5894661 5911555 5732274 5679789 5008806 4399924 3684468
18993C684468m70624n18688j16674j63480n6140K9383J18918J45271K62504O09329
$$ 3684468 3213844 2695156 2578482 2415002 2358862 2388245 2507163 2652434 2914938 3524267
18983C524267O93678J71921O40622L93101J74924J62974J56028o94455j54031
$$ 3524267 4217945 4389866 5030488 5423589 5598513 5761487 5917515 5223060 5069029
18974E069029p94890m14736n56722k78387N7907L04425k19651Q0183K5714K58944
$$ 5069029 4274139 3859403 3302681 3024294 3082201 3386626 3166975 3247158 3272872 3531816
18964C531816L78716K96844L77739Q39939N23206J379290J325748J456554J677724
$$ 3531816 3910532 4207376 4585115 5425054 5948260 7327550 8653298 10109852 11787576
18955A1787576J360603J785966K373013K035893K157361J468538J294067R51158
$$ 11787576 13148179 14934145 17307158 19343051 21500412 22968950 24263017 25214175
18947B5214175k94336k63654r47879k026953k008780k542890k798051k446764
$$ 25214175 24919839 24656185 23708306 21681353 19672573 17129683 14331632 11884868
18939A1884868j792668j980443p15219j207467r42066l28756r42095j18141l55544
$$ 11884868 10092200 8111757 7396538 6189071 5247005 4918249 3976154 3858013 3502469
18930C502469m29454k71157l13280J11407k49607J32183l0797k50590j14601J39000
$$ 3502469 3073015 2801858 2488578 2599985 2350378 2482561 2451764 2201174 2086573 2225573
18920B225573j44876p5969J69983k84316K22327j776J65152k48264L42043l65954
$$ 2225573 2080697 2004728 2174711 1890395 2112722 2110946 2276098 2027834 2369877 2003923
18910B003923J75805k57736K87370j55945M2170K41344K79981l59326M61869J72325
$$ 2003923 2179728 1921992 2209362 2053417 2095587 2336931 2616912 2257586 2719455 2891780
18900B891780J34453K13803L03912K94784M53699N05886O14458N45311J037846
$$ 2891780 3026233 3240036 3543948 3838732 4292431 4798317 5412775 5958086 6995932
18891F995932J377401J723962J793958K268705K185082K185834J544134J188823
$$ 6995932 8373333 10097295 11891253 14159958 16345040 18530874 20075008 21263831
18883B1263831M01503l15505q59426j692812k379472k315546k522509j750149
$$ 21263831 21665334 21349829 20490403 18797591 16418119 14102573 11580064 9829915
18875I829915j693293j576811r46556r47783n53037m86501l68987l32066l54922
$$ 9829915 8136622 6559811 5613255 4665472 4112435 3625934 3256947 2924881 2569959
18866B569959o1998j91033l31084k07810J69006k22083k48914p7019o535J44537
$$ 2569959 2507961 2316928 1985844 1778034 1947040 1724957 1476043 1399024 1392489 1537026
18856A537026j80518J22677o6040m53916J82281J50666l12520M7163M1751r3696
$$ 1537026 1356508 1479185 1413145 959229 1141510 1292176 979656 1026819 1068570 974874
18846I74874j62434K44830J08100o2400o5074K22592k8456l80876J91261k0359
$$ 974874 812440 1057270 1165370 1102970 1037896 1260488 1232032 851156 1042417 1022058
18836A022058m9205Q4616J53511k91344J85584j35975K8159n5884j22903j54229
$$ 1022058 972853 1057469 1210980 919636 1105220 969245 997404 941520 818617 664388
18826F64388J44946Q5068M8198k12413K989J60346l954J47174m18915R780M04012
$$ 664388 809334 894402 942600 730187 733176 893522 889568 1036742 617827 627607 1031619
18815A031619j65953j10987J60916J32702l12186n4340K76521k97161M54618k65967
$$ 1031619 865666 754679 915595 1048297 736111 681771 958292 661131 1115749 849782
18805H49782J6249j25540R2270J6181r0778j29487m3477J01675J52025J09361
$$ 849782 866031 740491 832761 848942 758164 628677 585200 686875 838900 948261
18795I48261j82783K4745J22253K9022q0044k6925R1461j93057J71162k80654
$$ 948261 765478 790223 912476 941498 861454 834529 925990 732933 904095 623441
18785F23441L35933J19332j60376J7149L8655l3852m3488Q2078J0556K7395n0149
$$ 623441 959374 1078706 918330 935479 974134 940282 896794 978872 989428 1016823 966674
18774I66674K721n2681q9302J34124M3562k1705j53388J12254o2900J1277l9252
$$ 966674 969395 916714 827412 961536 1005098 983393 830005 942259 879359 890636 851384
18763H51384J70298q6519l5840J4806j66471L58207k13204j83741L20939k80648
$$ 851384 1021682 935163 899323 914129 747658 1105865 892661 708920 1029859 749211
18753G49211K76131M8941k25776j6299k9216n4707J11110O7804p4379m00685J62347
$$ 749211 1025342 1074283 848507 832208 802992 748285 859395 927199 852820 452135 614482
18742F14482o8734J45132r6699L324K12115o1020P39J76953j54211j74814J68377
$$ 614482 545748 690880 594181 597505 809620 748600 749339 926292 772081 597267 765644
18731G65644j60271K07589k1105O291K0195k58118L61213J29799l59411K7188
$$ 765644 605373 812962 791857 798148 818343 560225 921438 1051237 691826 719014
18721G19014j4954K42769j60024m049M6507j74867m3904O9789J35062J2677N5559
$$ 719014 704060 946829 786805 782756 829263 654396 610492 680281 815343 828020 883579
18710H83579J16597k07372N1252n2096l1391P9128J78137k65206J16793L3296
$$ 883579 1000176 792804 844056 791960 760569 839697 1017834 752628 869421 902717
18700I02717m1001N9306j30443J87316j48805j78464J56209j21185K85884k8637
$$ 902717 861716 921022 790579 977895 829090 650626 806835 685650 971534 942897
18690I42897j09954j06877J46710k00396J80895k32246M542Q9977O7273P1309
$$ 942897 832943 726066 872776 672380 853275 621029 625571 715548 782821 854130
18680H54130l36888n5307J87692j71403j2106J75718j0565n2620J06511M3614
$$ 854130 517242 461935 649627 478224 466118 641836 631271 578651 685162 728776
18670G28776r0559l5739P7406K33033l22260K35837o1109j87131k9085o5448J80624
$$ 728776 638217 602478 679884 912917 590657 826494 765385 578254 549169 483721 664345
18659F64345j10167J2282J538K6254P4248j84653K95454r7741j24156K2230j36138
$$ 664345 554178 566460 567998 594252 668500 483847 779301 681560 557404 579634 443496
18648D43496J89544K66314k68005J03329r3455O8176j44264j1098K50437j54417
$$ 443496 633040 899354 631349 734678 641223 709399 565135 554037 804474 650057
18638F50057o551J33338q5424J9675K9700m0262L1738K6654k26202J9094J79521
$$ 650057 643506 776844 691420 711095 740795 700533 732271 758925 532723 551817 731338
18627G31338j11217N5890m1421J80733j60225l9784j4756p5166Q6897J15621j35638
$$ 731338 620121 676011 634590 815323 655098 615314 600558 525392 612289 727910 592272
18616E92272J23836r9490J93588N075j1516k03605K3638j46223j2908L03968j55996
$$ 592272 716108 616618 810206 815281 803765 600160 623798 477575 464667 768635 612639
18605F12639R0317j21540J07140Q217N4673j16486K17253k45051J43862j05356
$$ 612639 702956 581416 688556 696773 751446 634960 852213 607162 751024 645668
18595F45668j93168K96019L2929q9706K7452j67936Q4356K30990j90729J96596
$$ 645668 452500 748519 781448 691742 719194 551258 635614 866604 675875 872471
18585H72471k99845j56136M66083j69454K4204o0415P3923q3933P5565J2757L2165
$$ 872471 572626 416490 882573 713119 737323 676908 750831 666898 742463 755220 787385
18574G87385j43934O2466L0766r7273o804O1357J16181j15516k07863J61877l3715
$$ 787385 643451 705917 736683 639410 632606 693963 810144 694628 486765 648642 614927
18563F14927L46093l80757K56217k33384L70827k91157o0385J02393J65354l04568
$$ 614927 961020 580263 836480 603096 973923 682766 622381 724774 890128 585560
18553E85560K48965r9068l17079K66305J4519k8599q163M6559k94615K04084J09592
$$ 585560 834525 735457 418378 684683 699202 670603 662440 708999 414384 618468 728060
18542G28060R5513j65948K41667C93310J89838J57401l1313r2874J51651C75316
$$ 728060 823573 657625 899292 393310 583148 740549 709236 616362 768013 375316
18531E96869m6050N5427j38401J82911r0103J28532n2425k68784K18754n6390
$$ 596869 550819 606246 467845 650756 560653 689185 636760 367976 586730 530340
18521E30340l3770O3230J24183j39791J8130J54823j23410P1809j37267Q0982
$$ 530340 496570 559800 683983 544192 562322 717145 593735 665544 528277 609259
18511F09259l5446j74997J75580j10441J62533j02834J69236J19651j25587C17075
$$ 609259 573813 398816 574396 463955 626488 523654 692890 812541 686954 317075
18500E88773p0529m1403j81619K51975j56976K65532B74371M09325j91871J20014
$$ 588773 518244 476841 295222 547197 390221 655753 274371 683696 491825 611839
18490F11839o7885K17710L0772C64400J23146K07918M2215j10203M751L4460C09238
$$ 611839 543954 761664 792436 364400 487546 695464 737679 627476 632227 666687 309238
18478G21737k29747P0219r9880P2047m6891o6460j59613K1212K71781j46602J00148
$$ 721737 491990 562209 462329 534376 487485 421025 261412 282624 554405 407803 507951
18467E07951j74890M49854j15334p9008p5500J74320k40763q4200K22209P0764
$$ 507951 333061 782915 667581 588573 513073 687393 446630 362430 584639 655403
18457F55403k23873K29029k68800M8605m9632M47199m16420M7610n608j14486
$$ 655403 431530 660559 391759 440364 390732 837931 421511 469121 463513 349027
18447C49027J01544N29794m22758K04280j02908r0311j4638p150q8853J22316
$$ 349027 450571 980365 557607 761887 658979 568668 554030 546880 458027 580343
18437E80343j62612K95670l09360J13279j8301k28492M79059k0603p6895j37913
$$ 580343 417731 713401 404041 517320 499019 270527 749586 728983 652088 514175
18427E14175K55412j51561J23102q6255j86743L82160j68119l0494q3123j71574
$$ 514175 769587 618026 741128 654873 468130 850290 682171 651677 568554 396980
18417C96980L17474j69352K41594r4789j13576m2172M9725J81314j67834n907
$$ 396980 714454 545102 786696 691907 578331 536159 585884 767198 599364 593457
18407E93457M7968j32216M34623l92016J37778k39108J94078M8875j63989K00519
$$ 593457 641425 509209 943832 551816 689594 450486 644564 693439 529450 729969
18397G29969j03390R0933j18205P512K69333o2516l1678Q967j92258o7566l9669
$$ 729969 626579 717512 599307 606819 876152 813636 781958 790925 598667 531101 491432
18386D91432J98453j73651N5786J30786k98505l5686P9755j91307J22709l3052
$$ 491432 689885 516234 572020 702806 404301 368615 448370 257063 379772 346720
18376C46720J11096J91871j36539j07999K36150k20410K00652N4319k84884P6304
$$ 346720 457816 649687 513148 405149 641299 420889 621541 675860 390976 467280
18366D67280p3933K08978j1961R7071j84915J46010k7764j95183K43625J54500
$$ 467280 393347 602325 590364 687435 502520 648530 620766 425583 669208 823708
18356H23708B60162J56384K1715q006M13568k82085j34320J55097j26248J46189
$$ 823708 260162 416546 438261 430255 843823 561738 427418 582515 456267 602456
18346F02456j67327K26402J09737k08150j45296J60608Q1595J8811k06960J72238
$$ 602456 435129 661531 771268 563118 417822 578430 660025 678836 471876 644114
18336F44114k60741J43409n9348J76312j46445r8867N60812m7870k35883j98794
$$ 644114 383373 526782 467434 643746 497301 398434 959246 911376 675493 476699
18326D76699M096j40664M5435L34020j10382k18422J0600Q43r523K31547J42835
$$ 476699 480795 340131 385566 719586 609204 390782 401382 402225 392702 624249 767084
18315G67084l47045J39180r7207J88480j5719B97964K17417k30883K49890K1229
$$ 767084 420039 559219 462012 650492 634773 297964 515381 284498 534388 555617
18305E55617J54119j01147j09898J62612Q969j46896O9076j33408K16165m8473
$$ 555617 709736 608589 498691 661303 670272 523376 592452 459044 675209 626736
18295F26736k53237K55562J01580R782m8630K43349j39817k02003L34858k76897
$$ 626736 373499 629061 730641 740423 691793 935142 795325 593322 928180 651283
18285F51283K1876R9429j84608K6442N5958j67972J35977j06327k03134K01218
$$ 651283 673159 772588 587980 614422 670380 502408 638385 532058 328924 530142
18275E30142j47010J73376J5647j5104N4241k48020K4758J1302O8438J96476k12052
$$ 530142 383132 556508 572155 557051 611292 363272 388030 399332 467770 664246 452194
18264D52194J17512j19109J23114k2523J640j42882K23834j1864k15783m7320
$$ 452194 569706 450597 573711 551188 552828 409946 633780 621916 406133 358813
18254C58813J56195R9510P3156l1314p9907K43754j3255r1548j98681L41786j06126
$$ 358813 515008 614518 687674 656360 576453 820207 806952 715404 516723 858509 752383
18243G52383k58132O2975p2782o2840K18218n1971J32714l04191J42900K9156
$$ 752383 494251 557226 484444 421604 639822 587851 720565 416374 559274 588430
18233E88430J52366k51639l8896j12647L6867K04285L9996k1804k9227O8164N0670
$$ 588430 740796 489157 450261 337614 374481 578766 618762 596958 567731 635895 686565
18222F86565k47938r5589K0607J88589J49772k60590K24933n8566l3103l1229
$$ 686565 438627 343038 363645 552234 702006 441416 666349 607783 574680 543451
18212E43451j10819J00687q5331j4044K07502J8047j75638p2115J65018q4069
$$ 543451 432632 533319 447988 433944 641446 659493 483855 411740 576758 492689
18202D92689j25361L74869P407C61883K66691j42757Q3268J09496j50242J51057
$$ 492689 367328 742197 749604 361883 628574 485817 569085 678581 528339 679396
18192F79396J25566l09742j13202L11752k03921J63027j39461J00491k40830J89293
$$ 679396 804962 495220 382018 693770 489849 652876 513415 613906 373076 562369
18182E62369K4529N9986j2175J09036j18001o6668J92255C74675J35130L9693
$$ 562369 586898 646884 634709 743745 625744 559076 751331 374675 509805 549498
18172E49498J354Q152J73437C61571J99578k982j21968P6318J39360k49186q5433
$$ 549498 550852 559004 732441 361571 561149 558167 436199 512517 651877 402691 317258
18161C17258A45969L57898j49443J64320R2239l5310k14958J40262J52948j52050
$$ 317258 145969 503867 354424 518744 610983 575673 360715 500977 653925 501875
18151E01875J28244k29617N2753J44488q9311O3054J01012B74083j5587K37749
$$ 501875 630119 400502 453255 597743 508432 571486 672498 274083 258496 496245
18141D96245B07303K56093O6915R6178r4316O2348k46783J33334J51155r0607
$$ 496245 207303 463396 530311 626489 532173 594521 347738 481072 632227 541620
18131E41620J19665j98750m2227N1738Q3358R7396o5374j87877J63262k79956
$$ 541620 661285 462535 420308 472046 555404 652800 587426 399549 562811 282855
18121B82855K51983R674j80537P1017J74503k32939J28749p3261K23979k3761
$$ 282855 534838 544512 363975 434992 609495 376556 505305 432044 656023 632262
18111F32262j20111m0096L06073q9401j96840p9416O0785R889K66594j89925k30045
$$ 632262 512151 472055 778128 688727 491887 412471 473256 483145 749739 559814 329769
18100C29769K45720k07371J21346J83983k78757k9836L08864j86914L061L23400
$$ 329769 575489 368118 489464 673447 394690 364854 673718 486804 489865 813265
18090H13265l42352R0765m4583j04762P4760J27066p0672R9995p779j14725l0955
$$ 813265 470913 561678 517095 412333 487093 614159 543487 643482 635703 520978 490023
18079D90023j34718R6461A89864L11593P1869J08676k69904R7826r1665R2217
$$ 490023 355305 451766 189864 501457 573326 682002 412098 509924 418259 510476
18069E10476k06819K72561n6870n5814Q5917m3811L9142p6180j10983K07433j0078
$$ 510476 303657 576218 519348 463534 549451 505640 544782 468602 357619 565052 554974
18058E54974j56514j06245L95542p6695p5464J65323m1654r9510k01227J99804
$$ 554974 398460 292215 687757 611062 535598 700921 659267 559757 358530 558334
18048E58334K5589j82555O1878j65420M07361j10937j45026r3338J55397j65516
$$ 558334 583923 401368 463246 297826 705187 594250 449224 355886 511283 345767
18038C45767K6552n6738K80580M7222l5757j7077J9623n2951l549n5595j8653
$$ 345767 372319 315581 596161 643383 607626 590549 610172 557221 553672 498077 479424
18027D79424M947j31395J59291o6900j28964K06652j58800m445J30792A86247
$$ 479424 484371 352976 512267 445367 316403 523055 364255 359810 490602 186247
18016E00918j9244n4009J88006j02351r0730K22507k33239j1043l9240R9957N2970
$$ 500918 481674 427665 615671 513320 422590 645097 411858 400815 361575 461532 514502
18005E14502j54861K15867L0080B33946J65338Q958K73987k42490k5932L70753
$$ 514502 359641 575508 605588 233946 399284 408242 682229 439739 413807 784560
17995G84560l52008q6141L21818Q7893k57015p985l0445R6422o1109K632J19339
$$ 784560 432552 346411 668229 756122 499107 491122 460677 557099 495990 498622 617961
17984F17961j79475j19430L86512r2372n6714q635K65701k27020k8889L5028k9054
$$ 617961 438486 319056 705568 613196 556482 547847 813548 586528 557639 592667 563613
17973E63613Q0211p9446q5941J22005j3391j97337R7825R9899P3909j83625O0950
$$ 563613 643824 564378 478437 600442 587051 389714 487539 587438 661347 477722 538672
17962E38672K26168l9453C62018M51898l62659J45882K64427l12581J00110j52443
$$ 538672 764840 725387 362018 813916 451257 597139 861566 548985 649095 496652
17952D96652j34170K32013k3947N4120p1048J5879l4826J36470j35461K3952j42552
$$ 496652 362482 594495 570548 624668 553620 569499 534673 671143 535682 559634 417082
17941D17082L3445K29828j42480M78139l79804Q1125q5348j6377K8604k18111
$$ 417082 450527 680355 537875 1016014 636210 717335 631987 615610 644214 426103
17931D26103m7447M6500K03832Q7508j91123J66732k33415J96246R4816K9852
$$ 426103 378656 425156 628988 716496 525373 692105 458690 654936 749752 779604
17921G79604j14421o2960k8742K13667J78681k35406J16415j7829j32127r394
$$ 779604 665183 602223 573481 787148 965829 730423 846838 829009 696882 687488
17911F87488J88736k78398Q4667j03595N5142J03300L1063N4208l9560L35019
$$ 687488 876224 597826 682493 578898 634040 737340 768403 822611 783051 1118070
17901A118070k59449k27080K19674j6421K6050j39698p53J6877J95685O2883j04881
$$ 1118070 858621 631541 851215 834794 860844 721146 720393 737270 932955 995838 890957
17890H90957j5457j8658P0279p1862R5601Q0714j75405l8779J7141K4822N3438
$$ 890957 875500 856842 927121 855259 950860 1031574 856169 817390 834531 859353 912791
17879I12791k62640J70811j08101J53200j14066J90364j6670l730j80906M32827
$$ 912791 650151 820962 712861 866061 751995 942359 925689 921959 741053 1173880
17869A173880j57354j00341N5100j13778J69922j25410j09479K8618J17338j41832
$$ 1173880 1016526 916185 971285 857507 1027429 902019 792540 821158 938496 796664
17859G96664o1298m2107K89029l3520k74679L07855k44070J10478J07722j82332
$$ 796664 735366 693259 982288 948768 674089 981944 737874 848352 956074 773742
17849G73742N1079j33436k00138N00261k77078K3413J34613N949k80625K62174
$$ 773742 824821 691385 491247 991508 714430 737843 872456 878405 597780 859954
17839H59954m8179j32674M8549J23264k1360j75550L4368r7192J72535k36707
$$ 859954 811775 679101 727650 850914 829554 654004 688372 591180 763715 527008
17829E27008L52280p6767p7641J18279r1929j51288J11382l937q7358K32326j14034
$$ 527008 879288 802521 724880 843159 751230 599942 711324 707387 620029 852355 738321
17818G38321l3174L92309r6528p1779J01141J4384o0036k69170M34713k16230
$$ 738321 705147 1097456 1000928 929149 1030290 1044674 984638 715468 1150181 933951
17808I33951N9138r5927j52388n795K36465n3797j13054R3735j55292q216J61609
$$ 933951 993089 897162 744774 738979 975444 921647 808593 902328 747036 738820 900429
17797I00429K32012j35645o9886J36509l40396j66604L01276K4874K9059l35859
$$ 900429 1132441 996796 926910 1063419 723023 556419 857695 882569 911628 575769
17787E75769K81258j31366j84269K85824j43079j40071K7147l15J13353L5475
$$ 575769 857027 725661 541392 827216 684137 544066 571213 570898 684251 719726
17777G19726j18711j65473K90520j14269J52704K8307k34348n8735L44863o8874
$$ 719726 601015 435542 726062 611793 764497 792804 558456 499721 844584 775710
17767G75710J8379j10247J71911r3556j48621j15772J24407J44973J98m7275j14643
$$ 775710 794089 683842 855753 762197 613576 497804 622211 767184 767382 720107 605464
17756F05464R8185j81714K39286j97115K01571j73636o2315R7877o9347n044P3788
$$ 605464 703649 521935 761221 564106 765677 592041 529726 627603 558256 553212 627000
17745F27000Q7994j78473Q946K17022k16091J78917j89489J21538k3560J27896
$$ 627000 714994 536521 545467 762489 546398 725315 535826 657364 633804 761700
17735G61700k80067L64439j26254J28303k94107R2416j01956K50841q1495j1825
$$ 761700 481633 846072 719818 848121 554014 646430 544474 795315 713820 701995
17725G01995j07336O3698L1862R5773l11273K16991q8844l9204R6468J83410j72025
$$ 701995 594659 658357 690219 785992 474719 691710 602866 563662 660130 843540 671515
17714F71515j59663J81330j08192L33783D38504K67918M7241j98511K56951j97935
$$ 671515 511852 693182 584990 918773 438504 706422 753663 555152 812103 614168
17704F14168Q8416P1008j68891j12326O1269p3518K17234K9119m7121j50510M9763
$$ 614168 702584 773592 604701 492375 553644 480126 697360 726479 679358 528848 578611
17693E78611N8934Q683L3880j83796L45943j41108j9241p9376l5605K52988l12716
$$ 578611 637545 646228 680108 496312 842255 701147 681906 602530 566925 819913 507197
17682E07197J52767n8738L1409n0892q4704p2990K39535o1293K10460l68538J55698
$$ 507197 659964 601226 632635 581743 497039 424049 663584 602291 812751 444213 599911
17671E99911K14332k79193J77895K11082l77002J32650J30330L5201j81065L09243
$$ 599911 814243 535050 712945 924027 547025 679675 810005 845206 664141 973384
17661I73384k40903l3559j86098K05844J56571J26937k38472m0327P1995N6744
$$ 973384 732481 698922 512824 718668 875239 1002176 763704 723377 795372 852116
17651H52116m0386j39881L34830k0919l82322K28414R411n3403K50948k27909
$$ 852116 811730 671849 1006679 985760 603438 831852 841263 787860 1038808 810899
17641H10899K35408o3757o4596J04043P3524j10355p4977m4345J43478q4255K82374
$$ 810899 1046307 982550 917954 1021997 1095521 985166 910189 865844 1009322 925067 1207441
17630A207441j45378J22761k4050l11925J65292M4793j1808J41024K2431R5550
$$ 1207441 1062063 1184824 1160774 848849 1014141 1058934 1047126 1188150 1210581 1306131
17620A306131k10770P5536K24142j07867k30019P5995K68561j44667n2217o244
$$ 1306131 1095361 1170897 1395039 1287172 1057153 1133148 1401709 1257042 1204825 1198581
17610A198581k2454J98936j34680M1674n9095K67602j20036k2418m6528Q6555
$$ 1198581 1176127 1375063 1240383 1282057 1222962 1490564 1370528 1348110 1301582 1388137
17600A388137l47611J54508j8061K31800j05821L1796J02750l66152J88904J4549
$$ 1388137 1040526 1195034 1176973 1408773 1302952 1334748 1437498 1071346 1260250 1274799
17590A274799K23509m29099N9600K70361k59184L96191l97433K02535k9067o3413
$$ 1274799 1498308 1069209 1128809 1399170 1139986 1536177 1138744 1341279 1312212 1248799
17580A248799J12875j72311j30857K70365k13063K12627j84566M989J21796j86551
$$ 1248799 1361674 1189363 1058506 1328871 1115808 1328435 1143869 1148858 1270654 1084103
17570A084103M0329J47615j32079P9942j34236R819M07515n75103L40260k9883
$$ 1084103 1124432 1272047 1139968 1219910 1085674 1095493 1503008 927905 1268165 1238282
17560A238282k82519K63115R2159k12002J31997r4922K2454M500R3305m07426
$$ 1238282 955763 1218878 1311037 1099035 1231032 1136110 1158564 1163064 1256369 848943
17550H48943N3994K56670j17650J73554j32267O9306k2799o195j36062J30448
$$ 848943 902937 1159607 1041957 1215511 1083244 1152550 1129751 1123556 987494 1117942
17540A117942P3904O3160k69690N6071J09501M4247N3918m2477p2319J20878l05948
$$ 1117942 1191846 1255006 985316 1041387 1150888 1195135 1249053 1206576 1134257 1255135 949187
17529I49187J27621J15592o7868J49953K57967m11903P3625p8437Q7689n5450
$$ 949187 1076808 1192400 1124532 1274485 1532452 1120549 1194174 1115737 1203426 1147976
17519A147976N2792P3101L7905J36156k82693L36766Q8531O4046J18990m24214
$$ 1147976 1200768 1273869 1311774 1447930 1165237 1502003 1590534 1654580 1773570 1349356
17509A349356N69567j2598k79771J15220R6426o1623L26538j20378k69006K44592
$$ 1349356 1918923 1906325 1626554 1741774 1838200 1776577 2103115 1982737 1713731 1958323
17499A958323K9741q4552J26249M82670O6126K10952Q1589L91450L04568K66673
$$ 1958323 1988064 1903512 2029761 2512431 2578557 2789509 2871098 3262548 3567116 3833789
17489C833789O48702R57191J537625K226410M447826O383628R127379J0146058
$$ 3833789 4482491 5439682 6977307 9203717 13651543 20035171 29162550 39308608
17481C9308608Q602489O354037M018894J951486n97984l571277o597358q364131
$$ 39308608 47911097 54265134 58284028 60235514 59637530 56066253 49468895 41104764
17473D1104764r463092p297355m017279m98913L533849P133274R002294Q379540
$$ 41104764 31641672 24344317 20327038 19828125 23361974 30495248 39497542 47877082
17465D7877082O925869M408454J991330l90369l119943n844909q871265j0104455
$$ 47877082 54802951 59211405 61202735 60812366 57692423 51847514 42976249 32871794
17457C2871794r730401p363378m571366k684459k053009j207489m27600n44426
$$ 32871794 23141393 15778015 11206649 8522190 6469181 5261692 4834092 4289666
17449D289666l43398j91598n4755n4002O8962K43058L40986j0103K8872o020o2160
$$ 4289666 3946268 3754670 3699915 3645913 3714875 3957933 4298919 4288816 4317688 4311668 4249508
17438D249508l7342J8849m48190j76199j65412k11531L7674K33562J80191J0382
$$ 4249508 4212166 4231015 3782825 3606626 3441214 3229683 3267357 3500919 3681110 3691492
17428C691492M4955J67699k09096J86975q3201k33902l50883k22632k01166j04456
$$ 3691492 3736447 3904146 3695050 3882025 3798824 3564922 3214039 2991407 2790241 2685785
17418B685785j07157o8054k62356N7132J78977K714r8679j70539J06089K65416
$$ 2685785 2578628 2510574 2248218 2305350 2484327 2487041 2388362 2217823 2323912 2589328
17408B589328l05266N8403J64148J47822J714K67536J80222Q0470K05715J08319
$$ 2589328 2284062 2342465 2506613 2654435 2656149 2923685 3103907 3184377 3390092 3498411
17398C498411l3927L73754p9788J07613J35325L04722l9576L60385J72756M86763
$$ 3498411 3464484 3838238 3758450 3866063 4001388 4306110 4266534 4626919 4799675 5286438
17388E286438O97365N32430K91698M98793J87689J52249J69432l55942L7311l83018
$$ 5286438 5983803 6516233 6807931 7306724 7494413 7646662 7816094 7460152 7497463 7114445
17378G114445l76956o97o37905N2099o8946K22549R5412M36608K84000L60374
$$ 7114445 6737489 6736792 6098887 6150986 6082040 6304589 6400001 6836609 7120609 7480983
17368G480983L49263O59235j1793O02191L67512k42585O9364k80718J41506n41300
$$ 7480983 7830246 8489481 8477688 9079879 9447391 9204806 9274170 8993452 9134958 8593658
17358H593658K9278l28605L61476j98398L0709K82313K19722L09932K54004N03086
$$ 8593658 8622936 8294331 8655807 8457409 8488118 8770431 8990153 9300085 9554089 10057175
17348A0057175Q32823P17281O34576N24447N69365M87970L58605J25335K21879
$$ 10057175 10889998 11607279 12241855 12766302 13335667 13823637 14182242 14307577 14529456
17339A4529456j50906l07906r8904m38157o76090k82573j94562m2009J73504K53029
$$ 14529456 14378550 14070644 13971740 13533583 12857493 12574920 12380358 12338349 12511853 12764882
17329A2764882M17105O62456L21956O62594L89387M64711K98622K6937r1655J09939
$$ 12764882 13181987 13844443 14166399 14828993 15218380 15683091 15981713 16008650 15916995 16026934
17319A6026934k40708o70013m89415l44582n16503r10871l66532p45924r73l82098
$$ 16026934 15786226 15116213 14626798 14282216 13765713 12854842 12488310 11742386 11741413 11359315
17309A1359315m06068J61486j14778M5443M68364O27404J58692O64029K89797
$$ 11359315 10953247 11114733 10999955 11045398 11513762 12141166 12299858 12963887 13253684
17300A3253684L95342P6257Q3600M585k12361o16481l43998m60527p13992n67989
$$ 13253684 13649026 13725283 13808883 13813468 13601107 12984626 12640628 12180101 11466109 10898120
17290A0898120n35519k31382k94508l0096k33107m9253r1134N5278j3806o2601
$$ 10898120 10362601 10131219 9836711 9806615 9573508 9524255 9433121 9488399 9474593 9411992
17280I411992l28351k83582n14497m52129k80987p58500m06111n99662o6037n14591
$$ 9411992 9083641 8800059 8285562 7833433 7552446 6793946 6387835 5788173 5722136 5207545
17270E207545o6427l39928q3107m11509j21962j02964k59678R2487m26471K23352
$$ 5207545 5141118 4801190 4718083 4306574 4184612 4081648 3821970 3914457 3487986 3711338
17260C711338j88383j32204J37012k73751m3272K15052j56107L4945m1579J9600
$$ 3711338 3522955 3390751 3527763 3254012 3210740 3425792 3269685 3304630 3263051 3282651
17250C282651K832l59994J44906j27274p6619J50045j25442q3816k15098j45728
$$ 3282651 3285483 2925489 3070395 2943121 2866502 3016547 2891105 2807289 2592191 2446463
17240B446463J25517J28136j62171K6479K04801m05884K34872j71064J94596j53057
$$ 2446463 2571980 2700116 2537945 2564424 2769225 2363341 2598213 2427149 2621745 2468688
17230B468688K5311J93108m9241k1299P9976L4616M3872N9611J11885l06282J34844
$$ 2468688 2493999 2687107 2637866 2616567 2696543 2731159 2775031 2834642 2946527 2640245 2775089
17219B775089l0436j74670M31746l01927J16870O3181M3015K27939k75678p836
$$ 2775089 2744653 2569983 3001729 2699802 2816672 2879853 2922868 3150807 2875129 2867293
17209B867293K12434n9213J3992m0161K97412J36386J81319J70638k6946j06130
$$ 2867293 3079727 3020514 3034506 2994345 3291757 3428143 3609462 3780100 3753154 3647024
17199C647024j88924k29601P9057k4371p69876k9583k30728l8072J13062p2713
$$ 3647024 3458100 3228499 3307556 3283185 2513309 2483726 2252998 2214926 2327988 2255275
17189B255275R0067j6636J21696L5758J22956J28060k35265j67450l01630l5848
$$ 2255275 2345342 2328706 2450402 2486160 2609116 2737176 2501911 2334461 2032831 1996983
17179A996983p0953j34625j36028K67992J05238l32260J6375j1466J99668j26858
$$ 1996983 1926030 1791405 1655377 1923369 2028607 1696347 1712722 1701256 1900924 1774066
17169A774066J78761k46434L66049k42937J31110k24602K11453K24818j0400o410
$$ 1774066 1952827 1706393 2072442 1829505 1960615 1736013 1947466 2172284 2161884 2155474
17159B155474k04064K32740L2740j98234J25155l3119N9152L8196k71083J84462
$$ 2155474 1951410 2184150 2216890 2018656 2143811 2110692 2169844 2208040 1936957 2121419
17149B121419p4886Q4388j59003j50915K8335j8638K65517j15726J23234j11443
$$ 2121419 2046533 2130921 1971918 1821003 1849338 1830700 2096217 1980491 2103725 1992282
17139A992282M32851k61021J89337j26685J43519j94423m1586k13965J29731j00208
$$ 1992282 2425133 2164112 2353449 2226764 2370283 2175860 2134274 1920309 2050040 1949832
17129A949832j14387J8689J93691K5897j86624Q7332J17922J20620j51952L68374
$$ 1949832 1835445 1854134 2047825 2073722 1887098 1974430 2092352 2212972 2061020 2429394
17119B429394k70795L7783j79682q9941N9906m4515J6854n9852j36496j01676
$$ 2429394 2158599 2196382 2016700 1926759 1986665 1942150 1959004 1899152 1762656 1660980
17109A660980K2665j33482j66033K52364k6341p9341q4702O10Q9917r7092J21211
$$ 1660980 1683645 1550163 1384130 1636494 1610153 1530812 1446110 1446720 1536637 1439545 1560756
17098A560756j46734J85994j48546j00625o1288J35035j72656q5507J19529k09013
$$ 1560756 1414022 1600016 1451470 1350845 1289557 1424592 1251936 1166429 1285958 1076945
17088A076945K40607l89559L25229j3148j40329L47m820M518J35926O8729Q3755
$$ 1076945 1317552 927993 1253222 1240074 1099745 1100092 1095272 1099790 1235716 1304445 1388200
17077A388200k25360P658L0450l5005J28642k59997K73824p8301J0152M8232j03731
$$ 1388200 1162840 1170498 1200948 1165943 1294585 1034588 1308412 1230111 1240263 1288495 1184764
17066A184764K02402j5358l21095Q8566n2959K89693j43643k32189R3203m4374
$$ 1184764 1387166 1371808 1050713 1139279 1086320 1376013 1232370 1000181 1093384 1049010
17056A049010m9895K46134R7913l89199L02509j97741J64090j13533P6679j00721
$$ 1049010 999115 1245249 1343162 953963 1256472 1058731 1222821 1109288 1185967 1085246
17046A085246P8526J30996J08657j73972J1959J86041K797l4250k9906J09853
$$ 1085246 1163772 1294768 1403425 1229453 1241412 1427453 1430250 1396000 1366094 1475947
17036A475947j5160p4655O1995K73947l43855J91276k68712j39129J18584o6827
$$ 1475947 1460787 1386132 1448127 1722074 1378219 1569495 1300783 1161654 1280238 1213411
17026A213411J32596P15j61068J27725j81029m2110j00276L56002m9807J29492
$$ 1213411 1346007 1346722 1185654 1313379 1132350 1090240 989964 1345966 1296159 1425651
17016A425651m04205J46926m3476J71029k08062M8307k06755J51307J66649j63708
$$ 1425651 1021446 1168372 1124896 1295925 1087863 1136170 929415 1080722 1247371 1083663
17006A083663J72653k70681L54673N3786m10978K78019k05887J68298P451J2043
$$ 1083663 1256316 985635 1340308 1394094 983116 1261135 1055248 1223546 1230997 1243040
16996A243040M9577m2274k27302m1686J54755J21662k23414l1810N5110K58974
$$ 1243040 1292617 1250343 1023041 981355 1136110 1257772 1034358 1002548 1057658 1316632
16986A316632j97376J36266k29121P0365J01809j5935l2959J58473k01552J13483
$$ 1316632 1119256 1255522 1026401 1096766 1198575 1182640 1149681 1308154 1106602 1220085
16976A220085J54123m30679P17407j63947O639n841r777L19861K829J64197L3100
$$ 1220085 1374208 943529 1660936 1496989 1503628 1497787 1488010 1807871 1810700 1974897 2007997
16965B007997M5281J64851r9576K71943M029K47282j07790J09734J77287l29898
$$ 2007997 2053278 2218129 2118553 2390496 2394525 2641807 2534017 2643751 2821038 2491140
16955B491140J02898L02253J56563k28587L0419l35966P128n4059J10530k73420
$$ 2491140 2594038 2896291 3052854 2824267 2854686 2518720 2525848 2471789 2582319 2308899
16945B308899o8231N8383m65143r4380K05011k39264j51107j86574j74437K72643
$$ 2308899 2240668 2299051 1833908 1739528 1944539 1705275 1554168 1367594 1193157 1465800
16935A465800j55886J03473k93584o2750J03953J20735j80402J05039j23585L8086
$$ 1465800 1309914 1413387 1119803 1057053 1161006 1281741 1101339 1206378 1082793 1120879
16925A120879M06706k44620N3454k55060J35537j00425J206K1726J3365j19921
$$ 1120879 1527585 1282965 1336419 1081359 1216896 1116471 1117677 1139403 1152768 1032847
16915A032847M1494o4517J50163o9386L1921N0029k4499j37567p1001J32155j94912
$$ 1032847 1074341 1009824 1159987 1090601 1122522 1172551 1148052 1010485 939484 1071639 876727
16904H76727m825K5004j6477j08702J64399l09979K73687j02573O4229j63723
$$ 876727 871902 896906 880429 771727 936126 626147 899834 797261 861490 697767
16894F97767K72614J2612r1537q983l7464J40576j27716j480m3386K68369n1339
$$ 697767 970381 982993 891456 882473 845009 985585 857869 856389 813003 1081372 1030033
16883A030033j65137K3495m1477j17711M53634l57295j4397L79955l22019J81457
$$ 1030033 864896 888391 846914 729203 1182837 825542 811145 1191100 869081 1050538
16873A050538j82003r474J12376o7087L2106j20248J10747J81400k52966K16040
$$ 1050538 868535 859061 971437 904350 936456 816208 926955 1108355 855389 1071429
16863A071429P660m018M9857o5720j68923R6590J69211k15143J3594K11901m2276
$$ 1071429 1079089 1075071 1124928 1059208 890285 986875 1156086 940943 954537 1166438 1124162
16852A124162k18392o6147K35926j80826R8903j18339J92129n1831j07990J24172
$$ 1124162 905770 839623 1075549 894723 993626 875287 1067416 1015585 907595 1031767
16842A031767j16107P7503j32382j19008K65275R1692l53971J64586R7991j2378
$$ 1031767 915660 993163 860781 741773 1007048 1098740 744769 909355 1007346 994968
16832I94968j19703r3494R9241K62698k10016J61464l6292n7306J0625K84950
$$ 994968 875265 781771 881012 1143710 933694 1095158 1058866 1001560 1012185 1297135
16822A297135j64677J60250k94643L48141n9859j06961Q4453J03982j02529J94247
$$ 1297135 1132458 1292708 998065 1346206 1286347 1179386 1263839 1367821 1265292 1459539
16812A459539k06813R9337j48273n2873M3512r8772J29762N313K732k72639J58840
$$ 1459539 1252726 1352063 1203790 1150917 1194429 1095657 1225419 1230732 1233464 960825 1119665
16801A119665j94496M40807j32921k15465J36904j22600K82356l66107M5715L5906
$$ 1119665 925169 1365976 1233055 1017590 1154494 1031894 1314250 948143 993858 1029764
16791A029764l27126N2627K86593k49818L7679j27543J12707K71285l70410N6626
$$ 1029764 702638 755265 1041858 792040 829719 702176 814883 1086168 715758 772384
16781G72384J90155l49967K94253j52732J38913n0873J35448k11227L8773N1189
$$ 772384 962539 612572 906825 754093 893006 842133 977581 766354 805127 856316
16771H56316O3496N7410j4634j67689R1983J3339P3681j92107J70098N061P3493
$$ 856316 919812 977222 962588 794899 886882 900221 973902 781795 951893 956954 1030447
16760A030447j96432j5215N3444J84035j70486L21177l54150J16568L331l7273
$$ 1030447 834015 818800 872244 1056279 885793 1206970 852820 969388 972719 935446
16750I35446K2734J5119K7271k32886J82219L8991k41024J01515n145K1169J16339
$$ 935446 958180 973299 1000570 767684 949903 988894 747870 849385 844240 865409 981748
16739I81748L4593j50903P9577r514k5838K54770k21379P5521J16677j21981n7896
$$ 981748 1016341 865438 945015 935501 909663 1164433 943054 1018575 1135252 1013271 955375
16728I55375k73968K53801N7247J46353j05876k15430L12050K5093J9617k30218
$$ 955375 681407 935208 992455 1138808 1032932 817502 1129552 1154645 1174262 944044
16718I44044J28852R1371K57068j65227l07586K24283j83478K03289K24731l3580
$$ 944044 1072896 1164267 1421335 1256108 948522 1172805 989327 1192616 1417347 1383767
16708A383767K9430j36829J58845K96254m6872L8497K71160J36428j82592J83745
$$ 1383767 1413197 1276368 1435213 1731467 1684595 1723092 1994252 2130680 1948088 2131833
16698B131833k25507o9487J98295k36967O7051L3426j67200M5043J90375Q5902
$$ 2131833 1906326 1836839 2035134 1798167 1865218 1898644 1731444 1776487 1966862 2052764
16688B052764j70397L76596k56014p1204j05076r6271j45409K47079l05430j75255
$$ 2052764 1882367 2258963 2002949 1931745 1826669 1730398 1584989 1832068 1526638 1351383
16678A351383r1052L4454m1187N2722J59756l81975L67447K49614j54331J27049
$$ 1351383 1260331 1294785 1253598 1306320 1466076 1084101 1451548 1701162 1546831 1673880
16668A673880L14402k6839K3386K62619j81960J07151P7146j92033m5453r0419
$$ 1673880 1988282 1961443 1984829 2247448 2065488 2172639 2249785 2057752 2012299 1921880
16658A921880j11007J77967k56908L21915J04966O7130k70015n8909R7274o0989
$$ 1921880 1810873 1988840 1731932 2053847 2158813 2225943 1955928 1897019 1994293 1933304
16648A933304k59996j21966P1871m20000l17535N0712J4765j82980O5836Q0054
$$ 1933304 1673308 1551342 1623213 1203213 885678 936390 951155 768175 834011 914065
16638I14065k704j28527P3069j22331M1307o8786O4079j61585K5887J26178n9250
$$ 914065 911361 782834 855903 733572 774879 706093 770172 608587 634474 760652 701402
16627G01402M5999K6790j06557J21569Q5582J6856j46800J47520p5282q0482O1611
$$ 701402 747401 774191 667634 789203 874785 891641 744841 892361 817079 736597 798208
16616G98208P3958m5821J19836K2013q9035o708J54513r9073j25475k3416K17190
$$ 798208 872166 826345 946181 968194 879159 872451 1026964 927891 802416 779000 996190
16605I96190k2992j269j69493J04667k2497k05632K95475k12425L5291J95078
$$ 996190 973198 971929 802436 907103 884606 678974 974449 762024 797315 992393
16595I92393p768o817Q9601M3818j25645j09258K92179j33270O7129J74215K5436
$$ 992393 984625 977808 1067409 1111227 985582 876324 1168503 1035233 1102362 1276577 1302013
16584A302013m00282k47841L70784j78387N2143k90622L48007k74619l5370O270
$$ 1302013 901731 653890 1024674 846287 898430 607808 955815 681196 645826 652096
16574F52096J68426j27183q0025J64312j72047J69663k6500j24583J07059L6909
$$ 652096 820522 693339 613314 777626 605579 775242 748742 624159 731218 768127
16564G68127M7916p1493L7170j51377l5139J81835J2683L8184k52446L98218j98791
$$ 768127 816043 744550 781720 630343 595204 777039 789722 827906 575460 973678 774887
16553G74887O393K80716j32694j61970M8543K40832l28509L66046j27121q0802
$$ 774887 781280 1061996 929302 767332 815875 1056707 728198 1094244 967123 886321
16543H86321p7872R2029J16242k71779J03177O8827q9893j31988l3582K58372
$$ 886321 808449 900478 1016720 744941 848118 916945 827052 695064 661482 919854
16533I19854l57682K29121p6120m6122q824n2514j2235K1427n1554O0034J41152
$$ 919854 562172 791293 715173 669051 660227 607713 595478 616905 565351 625385 766537
16522G66537l24593L36999L2938l5852j52721L3655P224K41234k0923k63381J0765
$$ 766537 441944 778943 811881 776029 623308 656963 664187 905421 884498 621117 631882
16511F31882j0157j90384L10646j50219J30487K07939j46841j43145Q4389j28665
$$ 631882 621725 431341 741987 591768 722255 930194 783353 640208 724597 595932
16501E95932K43728k32671j01321J07357L11775m15325k7557K54951K78865k21925
$$ 595932 839660 606989 505668 613025 924800 509475 481918 736869 1015734 793809
16491G93809J71678j22845Q5576K034J06151j98918k8030k95358J69843J97552
$$ 793809 965487 842642 928218 930252 1036403 837485 809455 514097 683940 881492
16481H81492n4786p3932K06746k45835J32368k39117o1589o8432R4734j87876
$$ 881492 826706 752774 959520 713685 846053 606936 545347 476915 571649 383773
16471C83773J95203n3003o0254M5834J99804P2668p9205K27614J80835Q954J12561
$$ 383773 578976 525973 465719 511553 711357 784025 704820 932434 1113269 1122223 1234784
16460A234784J63653p6105K59826k18694L30753L4357o2732k81967K20843Q420
$$ 1234784 1398437 1322332 1582158 1363464 1694217 1728574 1665842 1383875 1604718 1613138
16450A613138q889L5917J04953L22558j93844L2675p3605M13615p3491J32465
$$ 1613138 1604249 1640166 1745119 2067677 1873833 1906508 1832903 2246518 2173027 2305492
16440B305492M3559K9776j79300L63569j22710N5725M95933Q4353M22490L46764
$$ 2305492 2349051 2378827 2199527 2563096 2440386 2496111 2992044 3076397 3498887 3845651
16430C845651N29402M48787O22891L17175K15255M91091N38861O70533M85879
$$ 3845651 4375053 4823840 5446731 5763906 5979161 6470252 7009113 7679646 8165525
16421H165525R72378J131786J077812J204679J289595J687887J770046J624403
$$ 8165525 9137903 10269689 11347501 12552180 13841775 15529662 17299708 18924111
16413A8924111K245437K017625K811522K886031K977373K851902L672937L276926
$$ 18924111 21169548 23187173 25998695 28884726 31862099 34714001 38386938 41663864
16405D1663864L721504L947885L849989M028818L607516L558001L377775K679372
$$ 41663864 45385368 49333253 53183242 57212060 60819576 64377577 67755352 70434724
16397G0434724K215797J513215M48481q84219j471813q56021K735882P635522
$$ 70434724 72650521 74163736 74612217 73727998 72256185 71400164 74136046 81771568
16389H1771568R870047P045887J155483l830397p255684j0934878j1556694r929305
$$ 81771568 91641615 98687502 99842985 96012588 88756904 77822026 66265332 56336027
16381E6336027r963311j3745500A3258074g866286j5713920m746573L583710O414870
$$ 56336027 46372716 32627216 13258074 -7866286 -23580206 -28326779 -24743069 -18328199
16373a8328199N864878M435642L520271K030415i26008c24675I9127L71481j36990
$$ -18328199 -12463321 -8027679 -4507408 -2476993 -926008 -324675 99127 470608 333618
16364C33618M33099K30736K96388J86845L65320l0360J83416j9363N8486M3974
$$ 333618 766717 997453 1293841 1480686 1846006 1815646 1999062 1979699 2038185 2082159
16354B082159l11574j2892j26679l55936J87161l60111m00484m6026C10518H3913
$$ 2082159 1770585 1757693 1631014 1275078 1462239 1102128 701644 655618 310518 83913
16343a64597r5313l07348P899l4610O4737R5480G5266K29580L64132K15514P1845
$$ -164597 -259910 -567258 -559359 -593969 -529232 -433752 75266 304846 668978 884492 956337
16332I56337k1085J94876R8138k85095J07901l13666Q402k97268j21724F7775
$$ 956337 935252 1130128 1228266 943171 1051072 737406 745808 448540 326816 67775
16321B23786K85523B47658L8359a33845A82116l1701i0757k21466P9960k37373
$$ 223786 509309 247658 286017 -133845 182116 150415 -90757 -312223 -232263 -469636
16311d69636O4789j99955K74295J38776j85166a74225K1713o8814L413C314J09920
$$ -469636 -404847 -604802 -330507 -191731 -376897 -174225 -152512 -221326 -217913 3314 113234
16300A13234J37262H7087O848D3339J85322I4605a03285j30385e5248q4114n5461
$$ 113234 250496 87087 93935 43339 228661 94605 -103285 -233670 -55248 -139362 -194823
16289a94823q2293J03577j60037J28989l1736R2568A54308e8068j60700B08474
$$ -194823 -277116 -173539 -333576 -204587 -236323 -143755 154308 -58068 -218768 208474
16278C2848A1550K50278J46052p5145L5905J25794J36367L30872j22256o9079
$$ 32848 11550 261828 407880 332735 368640 494434 630801 961673 839417 770338
16268G70338o8787K09742j08851j36363l0227B04644K61117N4772K3276j86317
$$ 770338 701551 911293 802442 666079 635852 204644 465761 520533 543809 357492
16258C57492N4276j03459K46863l3035B34342J83549m1484n8108J45723j5262
$$ 357492 411768 308309 555172 522137 234342 417891 376407 318299 464022 448760
16248D48760o8515P0341K33069j18095J1842J27899J62966K02266p0J29278J62674
$$ 448760 380245 450586 683655 565560 577402 705301 868267 1070533 1070463 1199741 1362415
16237A362415J76968j74139l05947K09544p3749k14157l00767K53200k07088j25835
$$ 1362415 1539383 1365244 1059297 1268841 1195092 980935 680168 933368 726280 600445
16227F00445J31327l26463K62071l1150m348J87343k09016r6889N09L32513k13667
$$ 600445 731772 405309 667380 636230 631882 819225 610209 513320 513829 846342 632675
16216F32675o3735J06809l3682k2280j2164o4708j9185M80955m44645J1900N38
$$ 632675 568940 675749 642067 619787 607623 542915 523730 1004685 560040 571940 572478
16205E72478M9854O0012O0332l64347R0987K38480j83768M0653k4234K08715B38976
$$ 572478 622332 682344 742676 378329 469316 707796 524028 564681 540447 749162 238976
16193E96947J58819j17108L1184N719m358k14931k367m3966K01776N8318Q5125
$$ 596947 755766 638658 669842 675561 671203 456272 453905 409939 611715 670033 755158
16182G55158n9728j51992K85311q7424j39502K71115j167k27642M8817J15450
$$ 755158 695430 543438 828749 741325 601823 872938 871771 644129 692946 808396
16172H08396l26512J74155K37616j55272p6391j05302K13170j05085L9696l0284
$$ 808396 481884 656039 893655 738383 661992 556690 769860 664775 704471 674187
16162F74187M444j4289k3712k1239J22851k16077j08643K02522P2597o8727j08459
$$ 674187 678631 664342 640630 619391 742242 526165 417522 620044 692641 623914 515455
16151E15455J02502l3155R0719R8166n6282j44521J76257K28054j31132P7821
$$ 515455 617957 584802 675521 773687 717405 572884 749141 977195 846063 923884
16141I23884J45436k40113K6079J00703l0699k60901q8287L03690j40566q0656
$$ 923884 1069320 829207 855286 955989 925290 664389 576102 879792 739226 658570
16131F58570L1895K87538k18194K44129j99087o5714J32155p9924Q6185j53517
$$ 658570 690465 978003 759809 1003938 804851 739137 871292 791368 877553 724036
16121G24036M2108J49975Q062j08883k38026J41933J81753j80660N4228J91165
$$ 724036 766144 916119 924181 815298 577272 719205 900958 720298 774526 965691
16111I65691k94903K10961j25184N8842n1500r631P4525k22433K12246J52184
$$ 965691 670788 881749 756565 815407 763907 754276 828801 606368 818614 970798
16101I70798M6194k46020R5562Q476J5942k94078L15481K65179j46990j9139j04326
$$ 970798 1016992 770972 866534 875010 890952 596874 912355 1177534 1030544 1011405 907079
16090I07079J84899k8227j63130J29020n9970J57933q2548n5314L74816k91358
$$ 907079 1091978 1063751 900621 1029641 969671 1127604 1045056 989742 1364558 1073200
16080A073200M773j46673J89251o5936n2188P4430J05154l6910J29988o9246n2819
$$ 1073200 1077973 931300 1120551 1054615 1002427 1076857 1182011 1145101 1275089 1205843 1153024
16069A153024J10844q3670P1495j07613j508R3882K08559j13689r3720L13692
$$ 1153024 1263868 1180198 1251693 1144080 1142572 1236454 1445013 1331324 1237604 1551296
16059A551296k38918N1713Q8702m843j85273J80339k2491K16012j78074j3236
$$ 1551296 1312378 1364091 1452793 1447950 1262677 1443016 1420525 1636537 1458463 1445227
16049A445227Q3211K0823j56362L89729l79799N0583J39581l5299J5901m9599
$$ 1445227 1528438 1549261 1392899 1782628 1402829 1453412 1592993 1557694 1573595 1523996
16039A523996j03675Q5258K93659n1950k83989J23254q2039J63646j15644K00852
$$ 1523996 1420321 1505579 1799238 1747288 1463299 1586553 1504514 1668160 1552516 1753368
16029A753368m8345M0714o661l9453K12589k04247K40133j01289M5406J6488k0612
$$ 1753368 1705023 1745737 1739076 1699623 1912212 1707965 1948098 1846809 1892215 1908703 1888091
16018A888091j37905K05590n4463Q9955j12962P3210J99597J26917j39610J00970
$$ 1888091 1750186 1955776 1901313 1991268 1878306 1951516 2151113 2278030 2138420 2239390
16008B239390j12657J13522j24327j55925L4266N2425o2179J88191r3975J22112
$$ 2239390 2126733 2240255 2115928 1960003 1994269 2046694 1984515 2172706 2078731 2200843
15998B200843q5455R9546J20435l69287J15787Q9874m9858l6616M1529O2399j09196
$$ 2200843 2115388 2214934 2335369 1966082 2081869 2171743 2121885 2085269 2126798 2189197 2080001
15987B080001P0811n7384p2315L40998j37143P4400j38031J56663j8608K00584
$$ 2080001 2150812 2093428 2021113 2362111 2224968 2299368 2161337 2318000 2299392 2499976
15977B499976j22421p2148P0548O5994j79977j22749j9100L53464k26774j84324
$$ 2499976 2377555 2305407 2375955 2441949 2261972 2139223 2120123 2473587 2246813 2062489
15967B062489O3125K6171l3750m213J05671j99111k06537J62089N7470O843P1175
$$ 2062489 2125614 2151785 2118035 2113822 2219493 2020382 1813845 1975934 2033404 2040247 2111422
15956B111422K74166m21177K89736j16941K5681m8817Q4684p6076M0017J60347
$$ 2111422 2385588 1964411 2254147 2137206 2162887 2114070 2198754 2122678 2162695 2323042
15946B323042J44475l39188K41577q7061r9037R405J25081n2128r6110M47191
$$ 2323042 2467517 2128329 2369906 2282845 2183808 2193213 2318294 2266166 2170056 2617247
15936B617247k36541m1937M47790l29768q2198K85268k39055L81325j17935J61072
$$ 2617247 2380706 2338769 2786559 2456791 2374593 2659861 2420806 2802131 2684196 2845268
15926B845268j22097J79882M9056o6892j0302K64081J07278n1504K66656K76365
$$ 2845268 2723171 2903053 2952109 2885217 2874915 3138996 3246274 3194770 3461426 3737791
15916C737791j23414N3757K39467M70399J69670L30760N07177P32186P65497J332329
$$ 3737791 3614377 3668134 3907601 4378000 4547670 4878430 5385607 6117793 6883290 8215619
15906H215619J662785K421776L389333M941466O489426P576280P846137P498919
$$ 8215619 9878404 12300180 15689513 20630979 27120405 34696685 42542822 50041741
15898E0041741O341924M047022K157426l33325l534583n968573p094006q380937
$$ 50041741 56383665 60430687 62588113 62254788 58720205 52751632 45657626 37276689
15890C7276689p838187o835986n417766l851086k772237k133658j377405j157877
$$ 37276689 29438502 22602516 17184750 13333664 10561427 8427769 7050364 5892487
15882E892487o40740o90377n97121j70961k58839R2343n42344k57937n8621J58739
$$ 5892487 5251747 4561370 3964249 3793288 3534449 3626792 3084448 2826511 2767890 2926629
15872B926629R7150k01657j10232k25567Q5011K64039O421l55308K4047k3670
$$ 2926629 3023779 2822122 2711890 2486323 2571334 2835373 2841794 2486486 2510533 2486863
15862B486863j95776J2950j02848j34095m2954J89895l8753O8467Q2520j99132
$$ 2486863 2291087 2304037 2201189 2067094 2024140 2214035 2175282 2243749 2326269 2127137
15852B127137J26322L0862j61153j14411j36277J93723K4305j63250J33005J59485
$$ 2127137 2253459 2284321 2123168 2008757 1872480 2066203 2090508 1927258 2060263 2219748
15842B219748l61582J43892K15930o5717R9267N5799j50042J90375K6128J9797
$$ 2219748 1858166 2002058 2217988 2152271 2251538 2307337 2157295 2347670 2373798 2393595
15832B393595Q5542n5907M3074l95568J94437j33985R1775k06686O5780K84074
$$ 2393595 2479137 2423230 2466304 2070736 2265173 2131188 2222963 2016277 2082057 2366131
15822B366131j05432r3731k02426K17665J71275k12633j24516O5823K11669j88188
$$ 2366131 2260699 2166968 1964542 2182207 2353482 2140849 2016333 2082156 2293825 2105637
15812B105637o2005K39858K96904k52922K11476r4153K0311J47182J39488l53448
$$ 2105637 2043632 2283490 2580394 2327472 2538948 2444795 2465106 2612288 2751776 2398328
15802B398328J47817K5273K6019J42008K27207J92320J64054J03517L39132n5127
$$ 2398328 2546145 2571418 2597437 2739445 2966652 3158972 3323026 3426543 3765675 3710548
15792C710548J42677K022J53817j39070k440k26547L30560M6268q0179N62638
$$ 3710548 3853225 3855247 4009064 3869994 3867554 3641007 3971567 4017835 3937656 4500294
15782D500294M4554K08245J5074K02657J52239L98360n7250L5412j07708j18394
$$ 4500294 4544848 4753093 4768167 4970824 5123063 5521423 5464173 5499585 5391877 5273483
15772E273483K7742m05708M14322k43786P0152j04095K40323J82164j56689K96711
$$ 5273483 5301225 4895517 5309839 5066053 5136205 5032110 5272433 5454597 5297908 5594619
15762E594619J77703j84364j5073Q0918j60935n5437K0140r5838m20828j40256
$$ 5594619 5772322 5587958 5572885 5653803 5492868 5437431 5457571 5361733 4940905 4800649
15752D800649L45970j65363j58655K66781P1207J43525k3514J98514L06053j19331
$$ 4800649 5146619 4981256 4822601 5089382 5160589 5304114 5280600 5479114 5785167 5665836
15742E665836O00172L98109K34604Q4845K43401l9350J31962p2425P88k70814
$$ 5665836 6266008 6664117 6898721 6983566 7226967 7187617 7319579 7247154 7247942 6977128
15732F977128K3665L23642j75301L31591L78661K7561q3028J80203l72850j08650
$$ 6977128 7000793 7324435 7149134 7480725 7859386 7886947 7803919 7984122 7611272 7502622
15722G502622l35150k57558k81215k62617m5415K85713L14586k16064J04935m61068
$$ 7502622 7167472 6909914 6628699 6366082 6320667 6606380 6920966 6704902 6809837 6348769
15712F348769J34512k54163k13579j00352l11999K18070J45227K76200J67331
$$ 6348769 6483281 6229118 6015539 5915187 5603188 5821258 5966485 6242685 6410016
15703F410016J79274M65814K79438L45147J23802l16344K72235O1507k32883l43041
$$ 6410016 6589290 7055104 7334542 7679689 7803491 7487147 7759382 7820889 7588006 7244965
15693G244965P6524l3309l0247K15073l19236j51089J3950j97799m7794j44337
$$ 7244965 7321489 7288180 7257933 7473006 7153770 7002681 7016631 6818832 6771038 6626701
15683F626701M6950j33078k86710R8433j99454P6874k761l55387r5183k87373
$$ 6626701 6673651 6540573 6253863 6352296 6152842 6229716 6226955 5871568 5776385 5489012
15673E489012M4423j1824O4560j36633J45872o5633K54287L19746R2136M12297
$$ 5489012 5533435 5521611 5586171 5449538 5595410 5529777 5784064 6103810 6195946 6608243
15663F608243L68949O53606M34223K70979N85277K72114O50724N28649N70453
$$ 6608243 6977192 7630798 8065021 8336000 8921277 9193391 9844115 10372764 10943217
15654A0943217Q43377O70079O38798Q06326N89143P48220N79609N90178L44053
$$ 10943217 11786594 12456673 13095471 13901797 14490940 15239160 15818769 16408947 16753000
15645A6753000M44436N07889P63092O73030Q87191J007661J060183O82054P91920
$$ 16753000 17197436 17705325 18468417 19141447 20028638 21036299 22096482 22778536 23570456
15636B3570456P81748M48468p5154j10065j02375o76085k93363m22351k74829
$$ 23570456 24352204 24800672 24725518 24615453 24513078 23836993 23543630 23121279 22846450
15627B2846450J01256J55479J66245j14313k17350o25979m52632j157904r95082
$$ 22846450 22947706 23103185 23269430 23155117 22937767 22311788 21859156 20701252 19706170
15618A9706170j127865j207732q18159r59383r68209k43085q06021l25993m57575
$$ 19706170 18578305 17370573 16552414 15593031 14624822 14381737 13575716 13249723 12792148
15609A2792148o44645k88564n18551k39843m57042k18372m89138k87259n3731
$$ 12792148 12147503 11858939 11340388 11100545 10643503 10425131 9935993 9648734 9595003
15600I595003j40437l96469k3348j4791K37334M29624K82446N77424J515264K614118
$$ 9595003 9454566 9058097 9034749 9019958 9257292 9686916 9969362 10546786 12062050 14676168
15590A4676168N861211J0461318J2050522Q824720N857677L390099J942425r3869
$$ 14676168 20537379 30998697 43049219 51873939 57731616 61121715 63064140 62970271
15582F2970271k833327o918138j1326966j2145793r361104n826091k766954j690231
$$ 62970271 60136944 53218806 41891840 29746047 20384943 14558852 11791898 10101667
15574A0101667j082889n60631m19011l13716k07668M0057N6372j71705L84755
$$ 10101667 9018778 8458147 8039136 7725420 7517752 7557809 7614181 7442476 7827231
15565G827231l10044K82357j87592J60015M75782J87956O37571J075503K337926
$$ 7827231 7517187 7799544 7611952 7771967 8247749 8435705 9073276 10148779 12486705
15556A2486705M228217R249959J5002484J5116870J0542384O684163L918336J702901
$$ 12486705 16714922 25964881 40967365 56084235 66626619 73310782 77229118 78932019
15548G8932019j258512m646485j0731440j5583087j5509744j1020242o093244
$$ 78932019 77673507 73027022 62295582 46712495 31202751 20182509 14089265
15541A4089265l139940k112283j063284j182885k65697m77469k27518j96430J00209
$$ 14089265 10949325 8837042 7773758 6590873 6325176 5847707 5620189 5423759 5523968
15532E523968J22161m2092j35428l55531J57441Q4982l18171k45482j2811q5359
$$ 5523968 5646129 5604037 5468609 5113078 5270519 5355501 5037330 4791848 4779037 4693678
15522D693678p4279J4155k58480K62832j6191j09828N5981o769L13880n4512l1973
$$ 4693678 4619399 4633554 4375074 4637906 4621715 4511887 4567868 4561099 4874979 4820467 4788494
15511D788494J66164J15403r3908J71000Q9203J59218k17964K33519j68977k16648
$$ 4788494 4954658 5070061 4976153 5147153 5236356 5395574 5177610 5411129 5242152 5025504
15501E025504j15849k1425J48482r6604k12579K34383R920j15365J25325K64693
$$ 5025504 4909655 4888230 5036712 4940108 4727529 4961912 4971832 4856467 4981792 5246485
15491E246485j50487J98582j8525m2857J20617J88238m6802M79339p1952N4690
$$ 5246485 5095998 5294580 5276055 5233198 5353815 5542053 5495251 5974590 5902638 5957328
15481E957328K07617M2176K52731k61761J74049k67839K91828o7700K72697K01142
$$ 5957328 6164945 6207121 6459852 6198091 6372140 6104301 6396129 6328429 6601126 6802268
15471F802268O74624P44959P50630M83120O26024L04775O6206j1449j60990j44655
$$ 6802268 7476892 8221851 8972481 9455601 10081625 10386400 10452606 10441157 10280167 10135512
15461A0135512m79390o19005j20158j82059J48452N64298L20605N38063P89814
$$ 10135512 9656122 9037117 8916959 8734900 8883352 9447650 9768255 10306318 11096132
15452A1096132L46915K94409j29879M00172m57585l05728l99746n48271o34366
$$ 11096132 11443047 11737456 11607577 12007749 11550164 11244436 10844690 10296419 9662053
15443I662053j39608Q6009o7036K68040J5421L71143J046J8723J3873m284l39760
$$ 9662053 9522445 9608454 9541418 9809458 9824879 10196022 10197068 10215791 10229664 10225380 9885620
15432I885620l26271k89220l41763m72936m6197q6104m58955j34047k69144j20638
$$ 9885620 9559349 9270129 8928366 8455430 8409233 8323129 7864174 7730127 7460983 7340345
15422G340345K3253k74052k2291k50230M0649j73505j0894r8764r0037j97621
$$ 7340345 7363598 7089546 7067255 6817025 6857674 6684169 6673275 6574511 6484474 6286853
15412F286853M2230m2456p3966L6150J01299R5610p969q9912q4251J83218k55137
$$ 6286853 6329083 6286627 6212661 6248811 6350110 6445720 6437751 6347839 6263588 6446806 6191669
15401F191669L68577K29009K44812J52490J56164L50563k75759P471q7494k30771
$$ 6191669 6560246 6789255 7034067 7186557 7342721 7693284 7417525 7424996 7337502 7106731
15391G106731q7108k62775l37449R0818j10880j81794K39139K1312j0089o1q9302
$$ 7106731 7019623 6756848 6419399 6510217 6399337 6217543 6456682 6477994 6467905 6467844 6378542
15380F378542J41961l3169k72837K05227k13450N1336m7355m9401j38560p689
$$ 6378542 6520503 6487334 6214497 6419724 6206274 6257610 6210255 6160854 6022294 6014605
15370F014605K4885L3664J15634K06207J41392J80446P3007j05679L72456k00959
$$ 6014605 6039490 6073154 6188788 6394995 6536387 6716833 6789840 6684161 7056617 6855658
15360F855658K61677P0481m6741j30871J74092L11273j319K50233M39882N53168
$$ 6855658 7117335 7187816 7141075 7010204 7184296 7495569 7494250 7744483 8184365 8737533
15350H737533Q49552J311995K824389N173655O395789O130468M617046K776379
$$ 8737533 9587085 10899080 13723469 18897124 25292913 31423381 36040427 38816806
15342C8816806J933404P09871n53483k333049m817531o215488n428130l771446
$$ 38816806 40750210 41460081 40906598 38573549 33756018 27540530 22112400 18340954
15334A8340954j735978q24351n10090k99367l07279l60588o79620n92030p58961
$$ 18340954 16604976 15780625 15270535 14971168 14663889 14303301 13623681 13031651 12272690
15325A2272690l2214O1629j13190L47783Q4172M04502M04901M63300J045298J339610
$$ 12272690 12240476 12302105 12188915 12536698 12620870 13025372 13430273 13893573 14938871 16278481
15315A6278481L224204O447627R456920J1393123J0015692P414249M896958K078315
$$ 16278481 19502685 25950312 35407232 46800355 56816047 64230296 69127254 71205569
15307G1205569O1600l647225p173217j0233049j1986743j0375873p099912m220949
$$ 71205569 71267169 67619944 60446727 50213678 38226935 27851062 20751150 16530201
15299A6530201k660088r74564j017968n22159l80280P4848J00710J51408K54148
$$ 16530201 13870113 12895549 11877581 11355422 10975142 11049990 11150700 11302108 11556256
15290A1556256J61832K07611L07826K1860J30471k75825J19687k6261N78549J194307
$$ 11556256 11718088 11925699 12233525 12255385 12385856 12110031 12229718 12203457 12782006 13976313
15280A3976313K589338M872939N700727N144078L729479K094587J202678P0024
$$ 13976313 16565651 21438590 27139317 32283395 36012874 38107461 39310139 39380163
15272C9380163j353645k934914m981880o247794n575613l441935j959215j239392
$$ 39380163 38026518 35091604 30109724 23861930 18286317 14844382 12885167 11645775
15264A1645775p18759m34592k46318p40457m01923l63195J64914o6639P9120K96472
$$ 11645775 10927016 10492424 10246106 9505649 9103726 8740531 8905445 8838806 8917926 9214398
15254I214398Q2987M09532j34586L92416K06311K45438j95742j40604k87479p8060
$$ 9214398 9297385 9706917 9572331 9964747 10171058 10416496 10220754 10080150 9792671 9714611
15244I714611K84555l07871j75708j98167k51429N80883J22832Q13294P72269
$$ 9714611 9999166 9691295 9515587 9317420 9065991 9646874 9769706 10583000 11355269
15235A1355269N83628Q24660N62542N73154j26026m1159k25695o87830m88972
$$ 11355269 11938897 12763557 13326099 13899253 13773227 13732068 13506373 12818543 12329571
15226A2329571l99929p51495l29878k59460k62439n3360J56810J75411J28845
$$ 12329571 11929642 11178147 10848269 10588809 10326370 10273010 10429820 10605231 10734076
15217A0734076j05816k5361J33099O15392K54094k2984J10114q14970k99820o29247
$$ 10734076 10628260 10602899 10735998 11351390 11605484 11582500 11692614 10877644 10577824 9948577
15207I948577m13536n65336q64903m89343n49132l72188l76176j09444L4360k02793
$$ 9948577 9535041 8969705 8104802 7615459 7066327 6694139 6317963 6208519 6242879 6040086
15197F040086J6588k1124q1128K28295k51141O87125K666M19410m4984N6737O5230
$$ 6040086 6056674 6035550 5954422 6182717 5931576 6618701 6621367 7040777 6995793 7052530 7117760
15186G117760K31385O71L0389p0289j25052K60134K80475M55968J44136K17937
$$ 7117760 7349145 7349816 7380205 7309916 7184864 7444998 7725473 8181441 8325577 8543514
15176H543514J49651N7041q7668J19869k6693j67544K02203m09008l9053J43312
$$ 8543514 8693165 8750206 8662538 8782407 8755714 8588170 8790373 8381365 8342312 8485624
15166H485624k46243K00035J4496l0740k94686J35118K97665j92572K68201J01991
$$ 8485624 8239381 8439416 8453912 8423172 8128486 8263604 8561269 8368697 8636898 8738889
15156H738889j04611r4132k2610j00221O2620o8656j02011j67263J19779m29765
$$ 8738889 8634278 8540146 8517536 8417315 8479935 8411279 8309268 8142005 8261784 7832019
15146G832019J8793J19523j64809J02564M42192l42971L47457J05505l7533J61612
$$ 7832019 7850812 7970335 7805526 7908090 8350282 8007311 8354768 8460273 8422740 8584352
15136H584352N5390k02657J89870k351k20599l2136J30851q3730K8674k75042
$$ 8584352 8639742 8437085 8626955 8624604 8404005 8371869 8502720 8418990 8447664 8172622
15126H172622K78218j6250j45250M4795m6414l23842J83162m25075n2729K03378
$$ 8172622 8450840 8434590 8289340 8334135 8287721 7963879 8147041 7721966 7669237 7872615
15116G872615k80320j60199P4951l8288J56843j08773K809P6506j11360K18753
$$ 7872615 7592295 7432096 7507047 7468759 7625602 7516829 7519638 7596144 7484784 7703537
15106G703537p8510Q5744O0832P6685K69240P2392J22098N52534L9195L18416
$$ 7703537 7625027 7710771 7771603 7848288 8117528 8189920 8312018 8864552 8903747 9222163
15096I222163M03450J47380N94988N28181R02689J249781J722130K545178K544722
$$ 9222163 9625613 9772993 10367981 10896162 11798851 13048632 14770762 17315940 19860662
15087A9860662J936877J594474Q36988K83944l60070p40276j299995j865444j831008
$$ 19860662 21797539 23392013 24229001 24512945 24152875 23412599 22112604 20247160 18416152
15078A8416152r86868k248J038660K060292K634943K304837J791962R72334O92568
$$ 18416152 17429284 17427036 18465696 20525988 23160931 25465768 27257730 28230064 28922632
15069B8922632K7291l98357r15857j625337j563638J192714K647761L661179K582377
$$ 28922632 28949923 28551566 27635709 26010372 24446734 25639448 28287209 31948388 34530765
15060C4530765K172837K093563J597707J585905J639063m97208j041426j451223
$$ 34530765 36703602 38797165 40394872 41980777 43619840 43122632 42081206 40629983
15052D0629983k98194J008328K215108K338082K392821J385126K06725J22577
$$ 40629983 40331789 41340117 43555225 45893307 48286128 49671254 49877979 50000556
15044E0000556J05119M30015L8991p02598j744671k432811k284678j994759j867763
$$ 50000556 50105675 50535690 50574681 49872083 48127412 45694601 43409923 41415164 39547401
15035C9547401k177719k465085k631419k254735j025290O05601K175463J505474
$$ 39547401 37369682 34904597 32273178 30018443 28993153 29598754 31774217 33279691
15027C3279691J112735O63410J53710L68438m88395q90391j853193j829070m58226
$$ 33279691 34392426 35055836 35209546 35577984 35089589 34199198 32346005 30516935 30058709
15018C0058709J384058L662817M643239N517439M885566L979420L757672K754370
$$ 30058709 31442767 35105584 39748823 45266262 50151828 54131248 57888920 60643290
15010F0643290J796452O62567m45706j625554j361229J42033J395900K619081
$$ 60643290 62439742 63102309 62656603 61031049 59669820 59811853 61207753 63826834
15002F3826834L992224L861249M327864L956647L631223K315482J107844p53201
$$ 63826834 67819058 71680307 76008171 79964818 83596041 85911523 87019367 86266166
14994H6266166j204117j630070j211717j178479O79663J963252M435795O616036
$$ 86266166 85062049 83431979 82220262 81041783 81721446 83684698 88120493 94736529
14986I4736529Q288979Q716742Q681320Q112868P168795M926384J291380k175913
$$ 94736529 103025508 111742250 120423570 128536438 135705233 140631617 141922997 139747084
14978A39747084n599853q091237r811620j0341308j0694084j0679402r601839
$$ 139747084 134147231 126055994 116244374 105903066 95208982 84529580 74927741
14971G4927741p993784o581153n502360m490650l489614k762103k343048j674838
$$ 74927741 66933957 60352804 54850444 50359794 46870180 44108077 41765029 40090191
14963D0090191j535471r52241m57734J12831J039521J916635L429223N393514
$$ 40090191 38554720 37602479 37144745 37257576 38297097 40213732 43642955 49036469
14955D9036469P759329J1640128J5351468J8866902K1000385K4262395K6026801
$$ 49036469 56795798 68435926 83787394 102654296 123654681 147917076 173943877
14948A73943877K6158103K4669011K3871953K0720227J1907388K077846o423817
$$ 173943877 200101980 224770991 248642944 269363171 281270559 283348405 276924588
14941B76924588j2936940j6966437j8454642j9478209k1735718k2231178j8952044
$$ 276924588 263987648 247021211 228566569 209088360 187352642 165121464 146169420
14934A46169420j2634054p642962n825010o102559p527773q660557q587559p803058
$$ 146169420 133535366 125892404 120067394 113964835 106437062 97776505 89188946 81385888
14926H1385888o404136n099325k990458j590867p70473j463505k622875k446750
$$ 81385888 74981752 69882427 66891969 65301102 64530629 63067124 60444249 57997499
14918E7997499k679179l319103m512190o414874p025137o513575n234620k852702
$$ 57997499 55318320 51999217 47487027 41072153 34047016 27533441 22298821 19446119
14910A9446119k295715j382861q85882k31517k39499L19012r7347N49451O96645
$$ 19446119 17150404 15767543 14881661 14650144 14410645 14729657 14632310 15181761 15878406
14901A5878406J018886J104234J189507J507919K668212M022600M624471M161909
$$ 15878406 16897292 18001526 19191033 20698952 23367164 27389764 32014235 36176144
14893C6176144L318791J706074Q85459J45829m53357k342834l998878m731643
$$ 36176144 39494935 41201009 42086468 42232297 41778940 39436106 35437228 30705585
14885C0705585m437860l267161j695867j118154j169662n68650j57705m28040
$$ 30705585 26267725 23000564 21304697 20186543 19016881 18448231 18290526 17862486
14877A7862486M8996M16040Q95047O50251N81266R2961M45653o0285O73775K8017
$$ 17862486 17911482 18327522 19222569 19872820 20454086 20547047 20992700 20932415 21606190 21634207
14867B1634207J34240k59788k50570J75532Q17524J437293K861859M071493O475412
$$ 21634207 21768447 21508659 21258089 21433621 22251145 23688438 26550297 30621790 37097202
14858C7097202P536707P780077P952804Q009703N358984K877402l58535l125197
$$ 37097202 44633909 52413986 60366790 68376493 73735477 76612879 76254344 73129147
14850G3129147n916637p924324q453494q379365q141366o287566m154565k815557
$$ 73129147 67212510 59288186 50834692 42455327 34313961 28026395 23871830 21056273
14842B1056273j686204p31512p47224k54137o78333l58836n95516l21048m13413
$$ 21056273 19370069 18638557 17891333 17637196 16958863 16600027 16004511 15683463 15270050
14833A5270050l91223m25998Q4094l67089L29703N08797J06777O37897L34729
$$ 15270050 14878827 14452829 14536923 14169834 14499537 15008334 15115111 15753008 16087737
14824A6087737O87631J105275K287343L531284N717166P012617O773458M965127
$$ 16087737 16775368 17880643 20167986 23699270 29416436 36429053 43202511 48167638
14816D8167638L014814J528805J93687k293777m361952o739268p753645p311692
$$ 48167638 51182452 52711257 52904944 50611167 46249215 39509947 31756302 24444610
14808B4444610n453871l279447k073780r30508p03574n47061k4504q130j29061
$$ 24444610 18990739 15711292 13637512 12707004 12003430 11456369 11431865 11423735 11294674
14799A1294674K64893J33894K90449l5663j11605R493k22113o7379j31370m38614
$$ 11294674 11559567 11693461 11983910 11948247 11836642 11846135 11624022 11556643 11425273 10986659
14789A0986659m38314k23797J13023L05934J1106J41706j55447L03155R0435M69474
$$ 10986659 10548345 10324548 10437571 10743505 10754611 10896317 10740870 11044025 11134460 11603934
14779A1603934Q51910R87000N26847N58895L25430K93981k07192n57511p93505
$$ 11603934 12455844 13442844 13969691 14528586 14854016 15147997 14940805 14383294 13589789
14770A3589789q76919p89588j219279l92213m08538k3883M5049k38799k12054
$$ 13589789 12712870 11923282 10704003 10311790 9903252 9879369 9924418 9685619 9473565
14761I473565K51904j30582K74141m9905J21544J41596K60369K41230N26375L76106
$$ 9473565 9725469 9594887 9869028 9819123 9940667 10082263 10342632 10583862 11110237 11486343
14751A1486343R93019M21452N72397M33256j33707K53300j14433j32713l91342
$$ 11486343 12479362 12900814 13473211 13906467 13772760 14026060 13911627 13778914 13387572
14742A3387572k57517o6640L97935O98093J435240P93098J971010K485483L288581
$$ 13387572 13130055 13063415 13461350 14159443 15594683 16387781 18358791 20844274 24132855
14733B4132855M342981O944946J1538372J7879084K4162895K7580440K8480705
$$ 24132855 28475836 35420782 46959154 64838238 89001133 116581573 145062278
14726A45062278K6378771K0303682J2571447L912772m959880j5054039k3494016
$$ 145062278 171441049 191744731 204316178 208228950 203269070 188215031 164721015
14719A64721015k8638195k9370958k7266851k1562096j5223686j0074742n850198
$$ 164721015 136082820 106711862 79445011 57882915 42659229 32584487 26734289
14712B6734289l737212k715996j638633j520006j339184p62494m31880r23626
$$ 26734289 22997077 20281081 18642448 17122442 15783258 15020764 14588884 13665258
14704A3665258q79095o17190j182221p92761m68698j98934k10045l01895O0036
$$ 13665258 12786163 12168973 10986752 10193991 9725293 9526359 9316314 9014419 9074455
14695I074455K41453M7003L58784K55476J11567n4663M71306j69544m71365m86049
$$ 9074455 9315908 9362911 9721695 9977171 10088738 10034075 10505381 10335837 9864472 9378423
14685I378423m39901k21635j1320M47364M60246M08069K64544N84929Q60279J035035
$$ 9378423 8938522 8716887 8705567 9152931 9613177 10021246 10285790 10870719 11730998 12766033
14675A2766033R94285N55026p8674M167l43148k82168r26691j118595j154771
$$ 12766033 13760318 14315344 14236670 14240837 13897689 13615521 12688830 11570235 10415464
14666A0415464m94008L36977R39444K37191r2070L82038R3269l29289l54422q69668
$$ 10415464 9921456 10258433 11197877 11435068 11342998 11725036 11818305 11489016 11134594 10264926
14656A0264926j362668j067887o17065n45268k4214K08404J83355L79965Q88900
$$ 10264926 8902258 7834371 7217306 6672038 6647824 6856228 7039583 7419548 8308448
14647H308448Q90562P57464O77568K98813L73963M82316J54486K92632l58057
$$ 8308448 9199010 9956474 10634042 10932855 11306818 11789134 11943620 12236252 11878195
14638A1878195L30011N55920Q61036Q05027O92577M41449n780q04105j170145
$$ 11878195 12208206 12764126 13625162 14430189 15122766 15564215 15558435 14754330 13584185
14629A3584185j278131j906513j664433j496080j025652r40200n79253k27564
$$ 13584185 12306054 10399541 8735108 7239028 6213376 5273176 4693923 4466359
14621D466359j15870j02582K05422r5255j58983K71867o2337q4314M7917j4011
$$ 4466359 4350489 4247907 4453329 4358074 4199091 4470958 4408621 4324307 4372224 4358213
14611D358213p7140l5937j09967m17814K83421q7440Q8172M3968R3762M15798
$$ 4358213 4281073 4245136 4135169 3717355 4000776 3913336 4001508 4045476 4139238 4555036
14601D555036M80807J391714J370794J464655J113378R37806n6867L20928k69560
$$ 4555036 5035843 6427557 7798351 9263006 10376384 11314190 11257323 11578251 11308691
14592A1308691j000426j199256j129391j416519j047181r68266m01354j2747j73616
$$ 11308691 10308265 9109009 7979618 6563099 5515918 4547652 4146298 4133551 3959935
14583C959935J43138J52367L8592m1741J98210q4601K84222K89044K16621L83311
$$ 3959935 4103073 4255440 4294032 4252291 4450501 4365900 4650122 4939166 5155787 5539098
14573E539098j15381N4018K51179o2632M95385O84501J151521J610244P87090
$$ 5539098 5423717 5477735 5728914 5666282 6161667 6846168 7997689 9607933 10395023
14564A0395023N95091R14673J439488J830332L526163N260997O067100N767675
$$ 10395023 10990114 11904787 13344275 15174607 18700770 23961767 30028867 35796542
14556C5796542L429404K004025J429661K95465j614806m100227o104339p374031
$$ 35796542 39225946 41229971 42659632 42955097 41340291 37240064 31135725 23761694
14548B3761694n829840l131633j036765J707999M261066P022093P648606O356004
$$ 23761694 17931854 14800221 13763456 15471455 19732521 26754614 34403220 40759224
14540D0759224M633514K547041J007054n84597k805978n369097p646537p950635
$$ 40759224 45392738 47939779 48946833 48362236 45556258 40187161 32540624 24589989
14532B4589989o113046l603900j743212j195200l11132n791j12354J7153k57954
$$ 24589989 18476943 14873043 13129831 11934631 11623499 11617708 11505354 11522507 11264553
14523A1264553m35060J12030R22706L009337M927958N547766M092839L387160
$$ 11264553 10829493 10941523 11864229 14873566 19801524 25349290 29442129 32829289
14515C2829289J903136J454059O47719j030233k337562m201765m143282l266346
$$ 32829289 34732425 36186484 36834203 35803970 33466408 29264643 25121361 21855015
14507B1855015j571728K98916J469514L103500M240982L683580K219563J460558
$$ 21855015 20283287 20582203 22051717 25155217 29396199 33079779 35299342 36759900
14499C6759900J047459L77158p30900k267032m021749m531386m198816l282803
$$ 36759900 37807359 38184517 37453617 35186585 31164836 26633450 22434634 19151831
14491A9151831k251910j833706j599116j626219j503714j157353j487942j309094
$$ 19151831 16899921 15066215 13467099 11840880 10337166 9179813 7691871 6382777
14483F382777j514787o58622k4257l55329j04982k50512O3601L57411K00654l20888
$$ 6382777 4867990 4209368 4185111 3829782 3724800 3474288 3537889 3895300 4095954 3775066
14473C775066N17662L58832P95706J124274O75792N76235J26302M11332j12446
$$ 3775066 4292728 4651560 5447266 6571540 7247332 7823567 7949869 8361201 8248755
14464H248755j91714l15250n50751j18685j74580Q47564J026992R59316O75298
$$ 8248755 8057041 7741791 7191040 7072355 6897775 7745339 8772331 9731647 10406945
14455A0406945Q37057j18501K28374q47110p86131j434962j135604q67493n87093
$$ 10406945 11244002 11125501 11353875 10506765 9720634 8285672 7150068 6282575 5695482
14446E695482N3526o0915R5941J66377L64264J62720J39157K68067J02153L31397
$$ 5695482 5749008 5688093 5784034 5950411 6314675 6477395 6616552 6884619 6986772 7318169
14436G318169M90330k6260J92907O45408O12434R25334J698465K600590L990478
$$ 7318169 7808499 7782239 7975146 8620554 9232988 10158322 11856787 14457377 18447855
14427A8447855N225859N047513M193948L016811K069082O39054j55283k138423
$$ 18447855 23673714 28721227 32915175 35931986 38001068 38640122 38484839 36346416
14419C6346416l776234m708888m914421l697979l251538j924949j689843j356522
$$ 36346416 32570182 27861294 22946873 19248894 15997356 14072407 12382564 11026042
14411A1026042j185038j060383q82593o55921k79553l25831j87746j6375j22223
$$ 11026042 9841004 8780621 7898028 7242107 6962554 6636723 6448977 6432602 6310379
14402F310379o6165K8248J04773J69464N24673M32274R66815J442688J917590
$$ 6310379 6244214 6272462 6377235 6546699 7071372 7503646 8470461 9913149 11830739
14393A1830739L873403N669021P358328Q665098Q135505O493309N270444K841936
$$ 11830739 15704142 21373163 28731491 37396589 45532094 52025403 57295847 60137783
14385F0137783L10517k012834m839538p529264q419994q347166o930722m943346
$$ 60137783 60448300 58435466 53595928 46066664 37646670 29299504 22368782 17425436
14377A7425436l698819k490309j831625j067798n93539m09182j08858n17752J5228
$$ 17425436 13726617 11236308 9404683 8336885 7743346 7334164 7225306 6707554 6722782
14368F722782q4674K0998k81441j39027M4101J71826j42822l0657L62298M62494
$$ 6722782 6638108 6659106 6377665 6238638 6282739 6454565 6311743 6281086 6643384 7105878
14358G105878P41279J187395J841915K223064L213646L512141L188979K697151
$$ 7105878 7847157 9034552 10876467 13099531 16313177 19825318 23014297 25711448
14350B5711448J693718N87746l52871q68685k217990l179866l374967l833706
$$ 25711448 27405166 27992912 27640041 26771356 24553366 21373500 17998533 14164827
14342A4164827k585491k056512j015157o80290o0266J531292K783230M161790
$$ 14164827 11579336 9522824 8507667 7827377 7767111 9298403 12081633 16243423
14334A6243423K574707J493537J167695O20206n132o70507k110438l533114l774619
$$ 16243423 18818130 20311667 21479362 22099568 22094436 21423929 19313491 15780377 12005758
14325A2005758k859756j260378p11067j45379r4398J17844Q8815L18350L88093
$$ 12005758 9146002 7885624 7174557 7029178 6934780 7052624 7141439 7459789 7847882
14316G847882L85394M34963R84113Q01328J247611J338740J462070J548124J725257
$$ 7847882 8233276 8668239 9652352 10453680 11701291 13040031 14502101 16050225 17775482
14307A7775482K566289L352730L507398N051764O956859R281041J1994644J5219628
$$ 17775482 20341771 23694501 27201899 32253663 39210522 48491563 60486207 75705835
14299G5705835J7441114J7722855J6290608J2023197Q456558L059163j918263
$$ 75705835 93146949 110869804 127160412 139183609 147640167 150699330 148781067
14292A48781067q000049j3477770j8011658j9620018j7973969j4738508j1768701
$$ 148781067 140781018 127303248 109291590 89671572 71697603 56959095 45190394
14285D5190394q664568o905048m885412l992420k691365k570019j532719j299969
$$ 45190394 36525826 29620778 24735366 20742946 18051581 15481562 13948843 12648874
14277A2648874j153022j047801r67335n81379n18745o86329k83013o76026n75433
$$ 12648874 11495852 10448051 9480716 8899337 8380592 7694263 7411250 6735224 6159791
14268F159791n20472l06545m83616j77048n6711k56530l61261j10889j35141j61938
$$ 6159791 5639319 5332774 4849158 4672110 4615399 4358869 3997608 3886719 3751578 3589640
14258C589640n2584J23534l08067R4204m7955j58j69217J40746K171l64947L07439
$$ 3589640 3537056 3660590 3352523 3446727 3398772 3398614 3229397 3370143 3372314 3007367 3314806
14247C314806l39121J48986j49426j23914k24379q7376J097N5425J10368j62390
$$ 3314806 2975685 3124671 2975245 2851331 2626952 2539576 2540673 2596098 2706466 2544076
14237B544076J32764j59036J62738k40209r1859j56862J48541k38678P333k00139
$$ 2544076 2676840 2517804 2680542 2440333 2348474 2191612 2340153 2101475 2108808 1908669
14227A908669l2194L71853q939J8516Q3553n1596n6049M47191k91102j9847j29758
$$ 1908669 1876475 2248328 2239389 2257905 2341458 2289862 2233813 2681004 2389902 2370055 2240297
14216B240297Q5044J10934J13059p3487q238k5157R012L14158M76397N36446J52527
$$ 2240297 2325341 2436275 2549334 2475847 2467609 2442452 2451464 2765622 3242019 3778465 3930992
14205C930992K29663k489J14198J95635n15169l02359n77932n71207l53416r8243
$$ 3930992 4160655 4158166 4272364 4467999 3952830 3650471 3072539 2501332 2147916 2049673
14195B049673N0320j25524Q7233O0179J27114k7918M3559O8861n2417M5220j02951
$$ 2049673 2099993 1974469 2061702 2121881 2248995 2221077 2264636 2333497 2281080 2326300 2223349
14184B223349n6966k19390Q7615p6675q4404J17946o0709q8012J27472J83842
$$ 2223349 2166383 1946993 2034608 1957933 1873529 1991475 1930766 1842754 1970226 2154068
14174B154068l36825L90676j64078r1874M042Q8611M3441j94686J50740L8281
$$ 2154068 1817243 2207919 2043841 1951967 1956009 2044620 2088061 1893375 2044115 2082396
14164B082396j33483m8679k95675K70064J49653n9375K42770K03432j96148j68279
$$ 2082396 1948913 1900234 1604559 1874623 2024276 1964901 2207671 2411103 2214955 2046676
14154B046676l873O5871m9987J108J13080j23506K45133j11109J67366K007L91978
$$ 2046676 2042803 2108674 2058687 2059795 2172875 2049369 2294502 2183393 2350759 2352766 2744744
14143B744744J10228M97943L21861J178608J405223J311898J121423N88241N64304
$$ 2744744 2854972 3352915 3674776 4853384 6258607 7570505 8691928 9280169 9844473
14134I844473M13524o594n88713j054210j454139j330538r56798j008983k49703
$$ 9844473 10257997 10251403 9662690 8608480 7154341 5823803 4867005 3858022 3608319
14125C608319m87324k84380m4566N21852K45548N95874L74252O0682L72291j1485
$$ 3608319 3120995 2836615 2792049 3313901 3559449 4155323 4529575 4590257 4962548 4951063
14115D951063k36804l1800k39124o55741m81065k99747k07963J47897m3293k15734
$$ 4951063 4714259 4682459 4443335 3787594 3306529 3006782 2798819 2946716 2903423 2687689
14105B687689J28646K2309L9970j86125M07741J83758J58325N61147M87129K31923
$$ 2687689 2816335 2838644 2878614 2692489 3100230 3283988 3442313 4003460 4490589 4722512
14095D722512L01668K34683L49289l47967o8421l10734m76796j41792k48697J00082
$$ 4722512 5024180 5258863 5608152 5260185 5191764 4881030 4404234 4262442 4013745 4113827
14085D113827M78375J032694M78334O36697K40675K31532m014j82732k95237q28278
$$ 4113827 4592202 5624896 6103230 6739927 6980602 7212134 7208120 7025388 6730151 5901873
14075E901873q12972p67312p32386k26014q3304R2867l24803K08801J04283m7650
$$ 5901873 5088901 4321589 3589203 3363189 3279885 3372752 3047949 3256750 3361033 3313383
14065C313383J01816M2777J90615K51025M03375O44398L67357N28342K30464J63904
$$ 3313383 3415199 3457976 3648591 3899616 4302991 4947389 5314746 5843088 6073552 6237456
14055F237456K25851J08635q1141j81837n13249N069K48199L29260P18074M78881
$$ 6237456 6463307 6571942 6490801 6308964 5795715 5800784 6048983 6378243 7096317 7575198
14045G575198O86182M38077R99492N61546Q14742O57270M51162L93324M70911
$$ 7575198 8261380 8699457 9698949 10260495 11075237 11732507 12183669 12576993 13047904
14036A3047904P40623R10688J479692J357324K356492L085564M144728N767218
$$ 13047904 13788527 14699215 16178907 17536231 19892723 22978287 27123015 32890233
14028C2890233P606157J0082821J3631667J6946195J9201797J9063157J6478214
$$ 32890233 40496390 50579211 64210878 81157073 100358870 119422027 135900241
14021A35900241J1736635P193313K135081l894121r807360j6201087k0326642
$$ 135900241 147636876 154830189 156965270 153071149 143263789 127062702 106736060
14014A06736060k0714469j8201881j4518292j0744941q295415o145823m575815
$$ 106736060 86021591 67819710 53301418 42556477 34261062 28115239 23539424
14007B3539424l594208k568191k548446j705943j829595p79798j171538r31654
$$ 23539424 19945216 17377025 14828579 13122636 11293041 10513243 9341705 8410051
13999H410051p38632m42256n19010m99852l28473m93061j86922K58883k50896
$$ 8410051 7671419 7229163 6710153 6210301 5881828 5388767 5201845 5460728 5209832
13990E209832k5967K39609K41441n6514K10716K62286J64548m4342K33359j04
$$ 5209832 5183865 5423474 5664915 5608401 5819117 6081403 6245951 6201609 6434968 6434864
13980F434864j93440j88830R1833J28748k74706n07330j77289n93023k84659k64566
$$ 6434864 6241424 6052594 6144427 6273175 5998469 5491139 5313850 4720827 4436168 4171602
13970D171602j46233j00636m07439k07997K5164k47474J24413j45292k93169N3573
$$ 4171602 4025369 3924733 3517294 3309297 3334461 3086987 3211400 3066108 2772939 2826512
13960B826512m55694K19769k28462K22487j16640L2147M621p4810k3041J23916
$$ 2826512 2370818 2590587 2362125 2584612 2467972 2500119 2504740 2429930 2406889 2530805
13950B530805M55594L75203p191J55662L46882J14058L50856O1585M61585K22715
$$ 2530805 2986399 3361602 3354411 3510073 3856955 3971013 4321869 4383454 4845039 5067754
13940E067754Q73939J834976L018128M143925M690592M754021M789000M033642
$$ 5067754 5941693 7776669 10794797 14938722 19629314 24383335 29172335 33205977
13932C3205977K895255J168478j141095k709164m058813m925183n102871m854265
$$ 33205977 36101232 37269710 36128615 33419451 29360638 24435455 19332584 14478319
13924A4478319m165394k970991j941683j014957q77090n28739k33862k92831j61453
$$ 14478319 10312925 7341934 5400251 4385294 3508204 2979465 2745603 2452772 2291319
13915B291319K8788j78705J6130q7863L4504j75108J11684j89267J58633j43016
$$ 2291319 2320107 2141402 2157532 2069669 2104173 1929065 2040749 1851482 2010115 1867099
13905A867099J65179n2403p5188q4626N5655N7938j75930J03896j13601N5099
$$ 1867099 2032278 1979875 1904687 1820061 1875716 1933654 1757724 1861620 1748019 1803118
13895A803118J80012j70891n8639K9927N7327K83668k22871J78878k26455Q8493
$$ 1803118 1983130 1812239 1753600 1783527 1840854 2124522 1901651 2080529 1854074 1942567
13885A942567O9506R1578j74921j20949P4430k14145q9778L08281l94058J30978
$$ 1942567 2012073 2103651 1928730 1807781 1882211 1668066 1578288 1886569 1492511 1623489
13875A623489K19802r4468O4024k76586m3451J48649N3139Q0105m373J25727J25845
$$ 1623489 1843291 1748823 1812847 1536261 1492810 1641459 1694598 1774703 1770330 1896057 2021902
13864B021902j12244r1716m7201o4057Q1763K4862N8398j4855O683J5888j19385
$$ 2021902 1909658 1817942 1770741 1706684 1788447 1813309 1871707 1856852 1863535 1879423 1760038
13853A760038L50531m1681k64588J20129q4264l0697q7681J60307K35601J27227
$$ 1760038 2110569 2068888 1804300 1924429 1840165 1809468 1721787 1882094 2117695 2244922
13843B244922l65259p0156L88399l32087K16007l34847J0112l1659l3638J0339
$$ 2244922 1879663 1809507 2197906 1865819 2081826 1746979 1757091 1725432 1691794 1702133
13833A702133j45838p324J73030r2379p3081N4470Q239j75499K70951m5077J55138
$$ 1702133 1556295 1548971 1722001 1629622 1556541 1611011 1619250 1443751 1714702 1669625 1824763
13822A824763m7430j33048j6889p9484J50610j29848j8575m254K11591l40400
$$ 1824763 1777333 1644285 1627396 1547912 1698522 1568674 1550099 1545845 1757436 1417036
13812A417036K41323k73559M56700l20081K47651k49613J04554j20353j45041
$$ 1417036 1658359 1384800 1841500 1521419 1769070 1519457 1624011 1503658 1358617
13803A358617J93700k45153K79511L89905m63990R8217p7220K68244n0804j551
$$ 1358617 1552317 1307164 1586675 1976580 1512590 1610807 1533587 1801831 1751027 1749476
13793A749476j35860K19500k39584k8558j05652J27420k59200J44767l95j25230
$$ 1749476 1613616 1833116 1593532 1564974 1459322 1586742 1327542 1472309 1471914 1346684
13783A346684K53619o7571R3935l17121J85984k2393K20623j3187k15368M204
$$ 1346684 1600303 1532732 1626667 1309546 1495530 1473137 1693760 1680573 1465205 1469409
13773A469409Q493R8309k7137n6510j01333L74174k25108J86187K5652l16308
$$ 1469409 1477902 1576211 1549074 1492564 1391231 1765405 1540297 1726484 1752136 1435828
13763A435828K00434p4064j37807J29671o088q9436l2248j29817K26629P3349
$$ 1435828 1636262 1562198 1424391 1554062 1547974 1458538 1426290 1296473 1523102 1596451
13753A596451j5172M8724k87272O1719m1884L0034J03612p1570K48135l58262
$$ 1596451 1581279 1630003 1342731 1404450 1362566 1392600 1496212 1424642 1672777 1314515
13743A314515J77983K18058j33718O1644j59272k5670K98662K45110N7844p2349
$$ 1314515 1492498 1710556 1576838 1638482 1479210 1453540 1752202 1997312 2055156 1982807
13733A982807K46092r7076K14584p0309q9836j64739J03374k92053n8967j17l7421
$$ 1982807 2228899 2131823 2346407 2276098 2186262 2021523 2124897 1832844 1773877 1773760 1736339
13722A736339j71495J54333j84135p6778K8372J82621q9714J99810j8729k26828
$$ 1736339 1564844 1719177 1535042 1458264 1486636 1669257 1579543 1779353 1760624 1533796
13712A533796P069P7952n8186R0949J30614k70890L18752j53470J14965k1068
$$ 1533796 1540865 1618817 1560631 1651580 1782194 1511304 1830056 1676586 1791551 1770483
13702A770483j74161K04136j93318K30487n5124L01294J19866M18480K24079L24751
$$ 1770483 1596322 1800458 1607140 1837627 1782503 2083797 2203663 2622143 2846222 3170973
13692C170973J21552j06765K72502j65885j73104l91366k59323l23909k46483
$$ 3170973 3292525 3185760 3458262 3292377 3119273 2727907 2468584 2144675 1898192
13683A898192j4923j87279J16122o9140J52240J05849l83691M25525O3094l8385
$$ 1898192 1883269 1695990 1812112 1742972 1895212 2001061 1617370 2042895 2105989 2067604
13673B067604J13162j29688L10408j66283K18589M91589K36172J69422N78684
$$ 2067604 2180766 2051078 2361486 2195203 2413792 2905381 3141553 3310975 3889659
13664C889659J20086K6138M00102j15143J24702j20002p8182n20046m61467n50719
$$ 3889659 4009745 4035883 4435985 4320842 4445544 4325542 4247360 3727314 3265847 2715128
13654B715128r1040r1080j40475l41564K44781k22085j38621j24838J26549M405
$$ 2715128 2624088 2533008 2392533 2050969 2295750 2073665 1935044 1810206 1936755 1941160
13644A941160r2593l918K16221l8387J64722l43395M24365m1929J60488M09365
$$ 1941160 1848567 1844649 2060870 2022483 2187205 1843810 2268175 2226246 2386734 2796099
13634B796099N63955O0258K45635P9009j47902J25924k65275m75662m60130m36629
$$ 2796099 3360054 3420312 3665947 3744956 3597054 3722978 3457703 2982041 2521911 2085282
13624B085282L9344m48876J82571j12996j09072J85210o7936l9368p7329J17973
$$ 2085282 2124626 1675750 1858321 1745325 1636253 1821463 1753527 1714159 1636830 1754803
13614A754803J6446P9783j21739K38981O2750J7282K52681m04754L69511j65198
$$ 1754803 1771249 1851032 1729293 1968274 2031024 2048306 2300987 1896233 2265744 2100546
13604B100546k58763K04239l25056J18422k73507M34738k25418j94779M18033
$$ 2100546 1841783 2046022 1720966 1839388 1565881 2000619 1775201 1580422 1998455
13595A998455k4824j96483K53233q5692J68636J5466j31530n6853J5396j527m9588
$$ 1998455 1973631 1777148 2030381 1944689 2113325 2128791 1997261 1940408 1955804 1954277 1904689
13584A904689j25311j35669K2090N0483n9678P253r230l7736j7140J7686k54624
$$ 1904689 1779378 1643709 1665799 1716282 1656604 1663857 1654627 1616891 1599751 1617437 1362813
13573A362813J18031K2187J04828p632M0365k42833N2073J20399q2696j78060
$$ 1362813 1480844 1503031 1607859 1600227 1640592 1397759 1449832 1570231 1487535 1309475
13563A309475J31805L8080J62875o2325k0651r1615L9992o8764J39225o2433r3722
$$ 1309475 1441280 1479360 1642235 1579910 1559259 1467644 1507636 1438872 1578097 1515664 1421942
13552A421942K32864m13930K93275J63185j47344j30350K91340l8005K35638M49300
$$ 1421942 1654806 1240876 1534151 1697336 1549992 1419642 1710982 1672977 1908615 2357915
13542B357915j22648K05349J43977j35881L30276j43056l91733j07868J41316
$$ 2357915 2235267 2440616 2584593 2448712 2778988 2635932 2244199 2136331 2277647
13533B277647l43538k36797l0729j08195J36990K00775K99880M2631J82068N5871
$$ 2277647 1934109 1697312 1666583 1558388 1695378 1896153 2196033 2238664 2420732 2476603
13523B476603L43849l27365J43814j25564l55421j25928l02252k12299J55551
$$ 2476603 2820452 2493087 2636901 2511337 2155916 2029988 1727736 1515437 1670988
13514A670988j92535K13957k93176j74343O2077K4987P7974o7039j09865O2719
$$ 1670988 1478453 1692410 1399234 1224891 1286968 1311955 1389929 1322890 1213025 1275744
13504A275744J81119m36643L97206j57502K44074k47717K9208N5422K060J24196
$$ 1275744 1456863 1020220 1417426 1259924 1503998 1256281 1285489 1340911 1342971 1467167
13494A467167j91283J04610P3572k17047N7649K11168k39399j57448K24628o9162
$$ 1467167 1275884 1380494 1454066 1237019 1294668 1505836 1266437 1108989 1333617 1264455
13484A264455J00116L7448j05565J03628j26359J80599j15508j4139k307L2597
$$ 1264455 1364571 1402019 1296454 1400082 1273723 1454322 1338814 1324675 1322368 1354965
13474A354965j63571K77001P314p1582k66255J81223J02340l0509o9364l5550
$$ 1354965 1191394 1468395 1475709 1404127 1137872 1319095 1421435 1390926 1321562 1286012
13464A286012j66671K21457r2670J17592n9193K28584k00662j21180M19154j24972
$$ 1286012 1119341 1340798 1248128 1365720 1306527 1535111 1334449 1213269 1632423 1507451
13454A507451L61971K42338J16052P6266J81395j60846J92612n9552l8749j06791
$$ 1507451 1869422 2111760 2227812 2304078 2485473 2324627 2517239 2457687 2418938 2312147
13444B312147l17976l38051j07958j19666J55456k25229K60004j68169j1654O2425
$$ 2312147 1994171 1656120 1548162 1428496 1583952 1358723 1618727 1450558 1438904 1501329
13434A501329j70058J62576j39787K05474k67577R4328J2169P9408K0438J39848
$$ 1501329 1331271 1493847 1354060 1559534 1291957 1386285 1398454 1477862 1498300 1638148
13424A638148J10945J4269N66259J53063M8900Q3216J0191q0161L5479m41404
$$ 1638148 1749093 1763362 2329621 2482684 2531584 2614800 2624991 2544830 2580309 2138905
13414B138905P5592m46604L9517j43080k09727J45726l2083j76492n6972J79620
$$ 2138905 2214497 1767893 1807410 1664330 1454603 1600329 1568246 1391754 1334782 1514402
13404A514402J9726l05996K24509J33432k8269j37656R4704j10006L6059K93197
$$ 1514402 1534128 1228132 1452641 1586073 1557804 1420148 1514852 1404846 1440905 1734102
13394A734102l62497K83714O5723o9330J10415j5034J27202R1094L35030L33735
$$ 1734102 1371605 1655319 1721042 1651712 1762127 1747093 1874295 1965389 2300419 2634154
13384B634154m96204M50005j31656q2538Q9903M2358k32959K9172j8620l56724
$$ 2634154 2137950 2587955 2456299 2373761 2463664 2506022 2273063 2302235 2283615 1926891
13374A926891J01869k40479k20896J58838K0879K50507l06683L06991j10016J50909
$$ 1926891 2028760 1788281 1567385 1726223 1747102 1997609 1690926 1997917 1887901 2038810
13364B038810n6876P3793n8863j77377J43624l74673J35057n821Q9138K99859
$$ 2038810 1981934 2055727 1996864 1819487 1963111 1588438 1723495 1717674 1806812 2106671
13354B106671M9606k11955L01613N1440k98878J43705p2713k51783k2790Q851
$$ 2106671 2156277 1944322 2245935 2297375 1998497 2142202 2069489 1817706 1794916 1803767
13344A803767k2628J02589o7794k48635K47973n7036K07799m00099L61642Q1065
$$ 1803767 1781139 1883728 1815934 1567299 1815272 1758236 1966035 1565936 1927578 2008643
13334B008643J0501l22179O6376O9319N3286j36680J55054j12769R1938M6255
$$ 2008643 2019144 1696965 1763341 1832660 1885946 1749266 1904320 1791551 1883489 1929744
13324A929744k51165L01333j24233J9824m7268K85894K42502j93194N5171P4871
$$ 1929744 1678579 1979912 1855679 1875503 1828235 2114129 2356631 2163437 2218608 2293479
13314B293479L37100J38181r5453L04322q7341o5427k8079j47977J66117l73692
$$ 2293479 2630579 2768760 2673307 2977629 2890288 2824861 2796782 2648805 2814922 2441230
13304B441230L35N9138O1073n4453J64105K56498p2018K38108j52273J28545K03321
$$ 2441230 2441565 2500703 2561776 2507323 2671428 2927926 2855908 3094016 2941743 3070288 3273609
13293C273609k30755L7744l6056k27885j75102n5277J09597R4876J5826P4329
$$ 3273609 3042854 3080598 3044542 2816657 2641555 2586278 2695875 2790751 2806577 2880906
13283B880906j90398m6143N9201J61743J69436L7734L3765k3350L62209l51531
$$ 2880906 2690508 2644365 2703566 2865309 3034745 3072479 3106244 3082894 3445103 3093572
13273C093572L351J45118j34154J51400Q1313n3495K14059q5493M47354n6717
$$ 3093572 3096923 3242041 3107887 3259287 3340600 3287105 3501164 3415671 3863025 3806308
13263C806308K12501j29883L95150k26089J59571L85554L0319J67660J69078p7486
$$ 3806308 4018809 3888926 4284076 4057987 4217558 4603112 4633431 4801091 4970169 4892683
13253D892683J67639R5614K9764J7728J18868K86928k62571K18927j82159K45666
$$ 4892683 5060322 5155936 5185700 5203428 5322296 5609224 5346653 5565580 5383421 5629087
13243E629087L1620k77269K03693O0686J19424J50776K75266J99996K11232L06499
$$ 5629087 5660707 5383438 5587131 5647817 5767241 5918017 6193283 6393279 6604511 6911010
13233F911010k7618R2837L34588M44965Q3653J52807j4438L58253k88705p4389
$$ 6911010 6883392 6976229 7310817 7755782 7839435 7992242 7977804 8336057 8047352 7972963
13223G972963j22485m8527j22411j82570j12440k2156j34226j94100K8602q5301
$$ 7972963 7850478 7801951 7679540 7496970 7384530 7362374 7228148 7034048 7062650 6977349
13213F977349N8516m2599l53129J64952K43044k8215R7961P7774j43113K14913
$$ 6977349 7035865 6993266 6640137 6805089 7048133 7019918 7117879 7195653 7052540 7267453
13203G267453k36817l883j69837J70356k46841k4673l44462M4902j10216k1631
$$ 7267453 7030636 7026753 6856916 7027272 6780431 6755758 6411296 6456198 6345982 6324351
13193F324351k95907J84605k71131j64871R9842j79401j39305R2813L03786m43745
$$ 6324351 6028444 6213049 5941918 5777047 5876889 5697488 5558183 5650996 5954782 5511037
13183E511037J91463k52534k20426R7129k9185J99862p9308k47285j55712J59846
$$ 5511037 5702500 5449966 5229540 5326669 5297484 5497346 5418038 5170753 5015041 5174887
13173E174887k8989K3481j16650J53552O957k8427R1920j4473j57325J80349L71456
$$ 5174887 5145898 5169379 5052729 5206281 5213238 5184811 5276731 5262258 5104933 5285282 5656738
13162E656738K50551M6960K11003J97876L32650L44917O1535K01861n8492o5052
$$ 5656738 5907289 5954249 6165252 6363128 6695778 7040695 7102230 7304091 7245599 7180547
13152G180547K27357m18764K27472o55628j5820n3673j70030L74201j42458j52424
$$ 7180547 7407904 6989140 7216612 6560984 6545164 6491491 6321461 6695662 6553204 6400780
13142F400780L25768k81063J11602l39556l19105m47385l54267k30352l36519
$$ 6400780 6726548 6445485 6557087 6217531 5898426 5451041 5096774 4866422 4529903
13133D529903R931l78283j4984j26838J15708K14187M7366l5540k16108O0362
$$ 4529903 4539834 4161551 4146567 4019729 4135437 4349624 4396990 4361450 4145342 4205704
13123D205704J299k0622k80709j21335k60446j60096J98869j65326m2836l81508
$$ 4205704 4207003 4186381 3905672 3784337 3523891 3363795 3562664 3397338 3354502 2972994
13113B972994K36503L4168j54194K33343l2525O2020k90891N2288J80605m654
$$ 2972994 3209497 3243665 3089471 3322814 3290289 3352309 3061418 3113706 3294311 3289657
13103C289657j07236O940J55582J32626J70883Q6892O35239L77054K92698O44988
$$ 3289657 3182421 3189361 3344943 3477569 3648452 3735344 4370583 4747637 5040335 5685323
13093E685323K73251J65751J49955K28414j74521k47507j06666j57961j28075
$$ 5685323 5958574 6124325 6274280 6502694 6328173 6080666 5974000 5816039 5687964
13084E687964R1318k40228M3685K38678m762j27634r4098k00668k05553n68183
$$ 5687964 5779282 5539054 5582739 5821417 5816655 5689021 5594923 5394255 5188702 4620519
13074D620519o74067j18255l66353m97461J07734j67987j18980j7906J46124j76326
$$ 4620519 3946452 3828197 3461844 2964383 3072117 2904130 2785150 2767244 2913368 2737042
13064B737042O965k5108o5598J76609m058o1117K50468k48271L18583n672j92334
$$ 2737042 2744007 2718899 2653301 2829910 2825852 2764735 3015203 2766932 3085515 3079843 2887509
13053B887509K35311q7655r2413m2274k67876K03217j79686j2250Q5078N8590
$$ 2887509 3122820 3035165 2942752 2900478 2632602 2835819 2656133 2643883 2728961 2787551
13043B787551k83366L61526L1702j99180L37739k61051M74P5171M1224N1584J61142
$$ 2787551 2504185 2865711 2897413 2698233 3035972 2774921 2775395 2850566 2891790 2943374 3104516
13032C104516n0485J16792P0656J18743j27117j0202J24253J18306j21941K17521
$$ 3104516 3054031 3170823 3241479 3360222 3233105 3222903 3347156 3465462 3343521 3561042
13022C561042n1395p4342K09660o4460K50834K3350j17576J56090p185L7562O2134
$$ 3561042 3509647 3435305 3644965 3580505 3831339 3854689 3737113 3893203 3886018 3923580 3985714
13011C985714P882J67827J36930O1698J4717K32591K54285o9075M1222R8090J32084
$$ 3985714 3993596 4161423 4298353 4360051 4374768 4607359 4861644 4792569 4833791 4931881 5063965
13000E063965M65051k62961P6411J50595J54409J14946j49922O66246K9879r526
$$ 5063965 5529016 5266055 5342466 5493061 5647470 5762416 5612494 6278740 6308619 6299093
12990F299093N4735L8901O5669n0658M2884j65418M037R6038l134j0250J26266
$$ 6299093 6353828 6392729 6458398 6407740 6450624 6285206 6289243 6385281 6382147 6371897 6498163
12979F498163m854o6173J13609j79643j63723l5752j53702j36837q218m32552
$$ 6498163 6493309 6427136 6540745 6361102 6197379 6161627 6007925 5871088 5862870 5430318
12969E430318J76951O3686N2488n9123l52518Q3284K32027j75658l82852L62719
$$ 5430318 5607269 5670955 5723443 5664320 5311802 5395086 5627113 5451455 5068603 5431322
12959E431322j13042P0615j83441j45179j11176K49588l52237L78899P7034k68406
$$ 5431322 5318280 5388895 5205454 5060275 4949099 5198687 4846450 5225349 5302383 5033977
12949E033977L2572j00114n8372J48476J77782j96583j09651n1057J90135m9009
$$ 5033977 5066549 4966435 4908063 5056539 5234321 5037738 4928087 4877030 5067165 5018156
12939E018156J9014J62933j28377J42317Q871P3019O0512L07137o0063l3577K03556
$$ 5018156 5037170 5200103 5071726 5214043 5222914 5295933 5356445 5663582 5603519 5569942 5773498
12928E773498j25431K05796k04171k04679n9885m9665K10942o5426L14444l97593
$$ 5773498 5648067 5853863 5649692 5445013 5385128 5335463 5546405 5480979 5795423 5397830
12918E397830L63816m84621J59241l9343j50454l75212j37851j42645P4974k80166
$$ 5397830 5761646 5277025 5436266 5396923 5246469 4871257 4733406 4590761 4665735 4385569
12908D385569Q3639J52926k83305k35445N3355j84001K66000n07956P4872n3630
$$ 4385569 4469208 4622134 4338829 4103384 4156739 3972738 4238738 3730782 3805654 3752024
12898C752024j6224j06291q5288R5275j69220j45958K4542j55582n2936K15112
$$ 3752024 3735800 3629509 3544221 3639496 3470276 3324318 3348860 3193278 3140342 3355454
12888C355454j75817k21150K74095L6799P4606l42901l9970J99046j45006N1235
$$ 3355454 3179637 2958487 3232582 3269381 3343987 3001086 2961116 3160162 3015156 3066391
12878C066391j77381N6853M8283J3341k17540M5237J24390l6322j75853o2048
$$ 3066391 2889010 2945863 2994146 3007487 2789947 2835184 2959574 2923252 2747399 2685351
12868B685351l9610K3421R1955k34131J07493O1768P6556k71569M92889k25698
$$ 2685351 2645741 2669162 2761117 2526986 2634479 2696247 2772803 2501234 2994123 2768425
12858B768425k93852P9130R26J27199r0404l711j67525J45283m2269j27494J05392
$$ 2768425 2474573 2553703 2554629 2681828 2591424 2587713 2420188 2565471 2523202 2395708 2501100
12847B501100L20110l06952J94314o3951M504l2554O7339q0678M1019j12435J90157
$$ 2501100 2821210 2514258 2708572 2644621 2649125 2616571 2683910 2603232 2644251 2531816 2721973
12836B721973j87987j57670L15656l50560K35887M5217k5179J59301k96057J01128
$$ 2721973 2533986 2376316 2691972 2341412 2577299 2622516 2597337 2756638 2460581 2561709
12826B561709k2415j01196k1674L05796k33041j40893M13161l1141O2606m7881
$$ 2561709 2539294 2438098 2416424 2722220 2489179 2348286 2761447 2730306 2792912 2745031
12816B745031j58341j04444Q5680J67895k44342J79030o262L25m3871m3889K3
$$ 2745031 2586690 2482246 2567926 2735821 2491479 2670509 2664247 2664572 2620701 2576812 2576835
12805B576835o5734J35952J9444J64380j78221n4742P0075J11458n2763J98856
$$ 2576835 2511101 2647053 2666497 2830877 2652656 2597914 2667989 2779447 2726684 2925540
12795B925540N7727k86022N3989O5298k48684K47032j49940n6028J70574l8347
$$ 2925540 2983267 2697245 2751234 2816532 2567848 2814880 2664940 2608912 2779486 2741139
12785B741139J3783r6331J49645k65538K43667J0651l18227L41425J43187p5408
$$ 2741139 2754922 2658591 2808236 2542698 2786365 2797016 2478789 2820214 2963401 2887993
12775B887993j51773p6257J43891Q6804k88761K95890j20729N03586n29711L71349
$$ 2887993 2736220 2659963 2803854 2890658 2601897 2897787 2777058 3280644 2750933 3122282
12765C122282k40519K26690j18357M8118J15295k9795j30155P1388j80429J03928
$$ 3122282 2881763 3108453 2990096 3038214 3153509 3123714 2993559 3064947 2884518 2988446
12755B988446O1201k45289J07064r7858O1133r6407M08884j22644J12353k53058
$$ 2988446 3049647 2804358 2911422 2813564 2874697 2778290 3187174 3064530 3176883 2923825
12745B923825J5155K2342J33056j51109K007J2828L8240m6948p1407O8549J12073
$$ 2923825 2938980 2961322 3094378 2943269 2945276 2958104 2996344 2949396 2877989 2946538 3058611
12734C058611l1642K11506k09044P2666l2446p0203J69004l78965K09062J43099
$$ 3058611 3026969 3238475 3029431 3102097 3069651 2999448 3168452 2789487 2998549 3141648
12724C141648k50438j05550J04905L31019j81122j54032K23713j63426M2674J49126
$$ 3141648 2891210 2785660 2890565 3221584 3040462 2886430 3110143 2946717 2989391 3138517
12714C138517j08372P6909K9943k52692L99830o0469m3222R5592K15749k33667
$$ 3138517 3030145 3107054 3136997 2884305 3284135 3223666 3180444 3276036 3491785 3258118
12704C258118L90341L4344n339M31680l31693l07Q4266q221N3921R644J85492
$$ 3258118 3648459 3682803 3677464 4109144 3777451 3777144 3861410 3853189 3907110 3916754 4102246
12693D102246J66245P5132O56534Q33810R96124Q10646P07788J90971J92868K81577
$$ 4102246 4268491 4343623 5000157 5833967 6830091 7640737 8348525 8539496 8732364 9013941
12683I013941l68857m93567q28820r36906p97336r12429k4690j72665j56474p165
$$ 9013941 8645084 8151517 7322697 6385791 5588455 4676026 4651336 4478671 4322197 4315032
12673D315032L8083l4716L90913l23072J62563J21788m2054K88391J43691m01858
$$ 4315032 4353115 4318399 4709312 4386240 4548803 4670591 4628537 4916928 5060619 4658761
12663D658761J95704k02015K5603J7841k88223p1770M6923r865L6771K02344l5847
$$ 4658761 4854465 4652450 4678053 4695894 4407671 4335901 4382824 4372959 4409730 4612074 4576227
12652D576227K24201N07212M82795M7725J45480J67113K61141o4708O7468J47274
$$ 4576227 4800428 5307640 5790435 5838160 5983640 6150753 6411894 6347186 6414654 6561928
12642F561928J04756j74513l37185j6613k00600J24290q3385m85J10196k19796
$$ 6561928 6666684 6492171 6154986 6138373 5937773 6062063 5978678 5978193 6088389 5868593
12632E868593K47401k20648J69133J41052M89166J12834p2157M20872J00926l58037
$$ 5868593 6115994 5895346 6064479 6205531 6694697 6807531 6735374 7156246 7257172 6899135
12622F899135j14211J87177n71221k26358p39616O4133m58456j32458J41210J10924
$$ 6899135 6784924 6972101 6400880 6174522 5434906 5499039 5040583 4908125 5049335 5160259
12612E160259K30214L07510J43602Q87401K21228M21165L40662J30967k7666o1371
$$ 5160259 5390473 5697983 5841585 6728986 6950214 7371379 7712041 7843008 7815342 7753971
12602G753971r9518k38544o93773l73114k95331m41008l44319m48597n1486k33719
$$ 7753971 7654453 7415909 6722136 6349022 6053691 5612683 5268364 4819767 4768281 4534562
12592D534562L23403K50969p0341N00062J24300L04402J93917O8333j08554j12930
$$ 4534562 4857965 5108934 5038593 5538655 5662955 5967357 6161274 6229607 6121053 6008123
12582F008123J64571K92949J03997K4097K03995r3005K89955j3425l86092K55439
$$ 6008123 6172694 6465643 6569640 6593737 6797732 6704727 6994682 6981257 6595165 6850604
12572F850604m79698k03343m34501n31136l22042p3479q7265o3695L22167k24490
$$ 6850604 6370906 6167563 5733062 5201926 4879884 4806405 4719140 4655445 4977612 4753122
12562D753122K66790J010n8086N8135q475j22079l9869j14176J00521j68612r9657
$$ 4753122 5019912 5020922 4962836 5020971 5012496 4890417 4850548 4736372 4836893 4668281 4568624
12551D568624J80342N9197K53834l48331J49460K38543j00811L3551K83057m9694
$$ 4568624 4748966 4808163 5061997 4713666 4863126 5101669 5000858 5034409 5317466 5267772
12541E267772O30640K24865J35403N0045K94077J12348j32123l06087k31494o33181
$$ 5267772 5898412 6123277 6258680 6308725 6602802 6715150 6583027 6276940 6045446 5412265
12531E412265k15685j60863k78776l24827L53802o410O9553r8919J25358O5353
$$ 5412265 5196580 5035717 4756941 4432114 4785916 4779506 4849059 4750140 4875498 4940851
12521D940851J4246J31947J0290k36323K91266K2318K16920J47254O28766P60965
$$ 4940851 4955097 5087044 5097334 4861011 5152277 5174595 5391515 5538769 6167535 6928500
12511F928500P17804N42167M56784L42466J11401k67990l24043n96961q20342
$$ 6928500 7646304 8188471 8645255 8987721 9099122 8831132 8507089 7910128 7089786
12502G089786n31327n44478l16472k79000p2364p6135p2057O2680J42205j81264
$$ 7089786 6558459 6013981 5697509 5418509 5346145 5270010 5197953 5260633 5402838 5221574
12492E221574j82119K6297O7109J70367N0690R9586r5170M12606J81223J72805
$$ 5221574 5039455 5065752 5132861 5303228 5353918 5453504 5358334 5770940 5952163 6124968
12482F124968N88481M60270J27029n0393M77213k07048l7695k32445o28760l04485
$$ 6124968 6713449 7173719 7300748 7250355 7727568 7520520 7482825 7250380 6621620 6317135
12472F317135l90155j25508r6259j37488M6225r5692L15429r9478J48311n4214
$$ 6317135 5926980 5801472 5705213 5567725 5613950 5518258 5833687 5734209 5882520 5828306
12462E828306K19663m7871O5932L44804j22447L07857L8711L13875K15296R8438
$$ 5828306 6047969 6000098 6066030 6410834 6288387 6596244 6634955 6948830 7164126 7262564
12452G262564L02318L41731J00826J50605K93557Q592M73983P8652j72689R7906
$$ 7262564 7564882 7906613 8007439 8158044 8451601 8460193 8934176 9012828 8840139 8938045
12442H938045Q0652O7676p6546j74855j07227J21569J10533L5041K4544J08914
$$ 8938045 9018697 9086373 9009827 8834972 8727745 8849314 8959847 8994888 9019432 9128346
12432I128346N8205K51537L5509N36416K04284K39633L06816K96080N23526L12185
$$ 9128346 9186551 9438088 9473597 10010013 10214297 10453930 10760746 11056826 11580352 11892537
12422A1892537L16313L07190K04508K60324J76555M01111K64755M0098K02132
$$ 11892537 12208850 12516040 12720548 12980872 13157427 13558538 13823293 13863391 14065523
12413A4065523N8466j58360j47736M6846l50955j41114l56597k21662j63427m75158
$$ 14065523 14123989 13965629 13817893 13864739 13513784 13372670 13016073 12794411 12630984 12155826
12403A2155826j39983j8667J1974j65945K98077M742P5583J91380K05153K50589
$$ 12155826 12015843 11997176 12009150 11843205 12141282 12146024 12221607 12412987 12618140 12868729
12393A2868729N06214K44430L63884N83756M22291L01663K26688K48724M51258
$$ 12868729 13374943 13619373 13983257 14567013 14989304 15290967 15517655 15766379 16217637
12384A6217637L44880K7631R927N0887j19632j9950M9435k6023K26665k94884
$$ 16217637 16562517 16590148 16600075 16650962 16531330 16511380 16560815 16534792 16761457 16466573
12374A6466573L24673J45881L3032k93618k06199J68588m4257K52152k90968L32392
$$ 16466573 16791246 16937127 16970159 16676541 16470342 16638930 16594673 16846825 16555857 16888249
12364A6888249J73568j66289J3948l71169O5954q9221p9352p2767j36010O3465
$$ 16888249 17061817 16895528 16909476 16538307 16604261 16515040 16435688 16362921 16226911 16290376
12354A6290376R2577M0447j72362l59775J11275k83588k27220k71974M282j18581
$$ 16290376 16382953 16423400 16251038 15891263 16002538 15718950 15491730 15219756 15224038 15105457
12344A5105457m0686P7634K19554k0073L40064L39546N56951J75379N12051L71126
$$ 15105457 15064771 15142405 15361959 15341886 15681950 16021496 16578447 16753826 17265877 17637003
12334A7637003J70599M98585M40239L99261L25250M26960L36229Q9532K22330
$$ 17637003 17807602 18306187 18746426 19145687 19470937 19897897 20234126 20323658 20545988
12325B0545988L91288m1498N3858K50327j00422O6666j9784J19922k86949J29374
$$ 20545988 20937276 20895778 20949636 21199963 21099541 21166207 21146423 21266345 20979396 21108770
12315B1108770m8028n7180J88229m5476L16951K95061n0243N98979L05303K95882
$$ 21108770 21060742 21003562 21191791 21146315 21463266 21758327 21708084 22307063 22612366 22908248
12305B2908248L80386J93559N50410J30299r7437m5914l90981l58143p07060n02165
$$ 22908248 23288634 23482193 24032603 24162902 24065465 24019551 23628570 23270427 22563367 22061202
12295B2061202n55238p48127n02441k19402L4828k86527l02774m61308r2658m46839
$$ 22061202 21505964 20757837 20255396 20035994 20070822 19784295 19481521 19020213 18927555 18480716
12285A8480716o58294n09859o55870o74996k59001p83129l35381k37100n04563
$$ 18480716 17822422 17312563 16656693 15981697 15722696 14939567 14604186 14367086 13862523
12276A3862523j86382n6400R419k73687j94807j01141J31037j63961m7362j6377
$$ 13862523 13676141 13619741 13629160 13355473 13160666 13059525 13190562 13026601 12979239 12962862
12266A2962862R6729l75834P8864k2422J93315m98831J04062K66978O7712L72959
$$ 12962862 13059591 12683757 12762621 12740199 12933514 12434683 12538745 12805723 12873435 13246394
12256A3246394L05630M42613N20155O37360P21508Q72651Q24221R32952J269094
$$ 13246394 13552024 13994637 14514792 15152152 15873660 16746311 17570532 18503484 19772578
12247A9772578J142282J156818J155561Q39264R51984P34567L77293L11582m9412
$$ 19772578 20914860 22071678 23227239 24066503 25018487 25753054 26130347 26441929 26392517
12238B6392517k40050j25020l91005m32218j61686k97796q4575o77220p540o23541
$$ 26392517 26152467 26027447 25636442 25204224 25042538 24744742 24660167 23982947 23975407 23351866
12228B3351866l42915r80102j114097j042634j158518j078326j268254q48061
$$ 23351866 23008951 22028849 20914752 19872118 18713600 17635274 16367020 15518959
12220A5518959r66749n84254q83961n41552k09202k56850o08602j2213l39061
$$ 15518959 14552210 13967956 13083995 12542443 12333241 12076391 11467789 11455576 11116515
12211A1116515k43538j70080k07477n97015j40659l5430l28696j6021J58916j43310
$$ 11116515 10872977 10702897 10495420 9898405 9757746 9722316 9393620 9377599 9536515 9393205
12201I393205K459K53376Q407j21222J68255J20678p5973m5163L27313L11813
$$ 9393205 9395664 9649040 9657447 9536225 9704480 9825158 9749185 9704022 10031335 10343148
12191A0343148J64888M51531K07243J4484K32335P8178K88255R707K02276J45723
$$ 10343148 10508036 10959567 11166810 11181294 11413629 11491807 11780062 11789769 11992045 12137768
12181A2137768j87343K82545j2279k31001q9953n7470l03334j20769Q171K0625
$$ 12137768 11950425 12232970 12220691 11989690 11899737 11842267 11538933 11418164 11426335 11446960
12171A1446960l2890J307J50386M6095J3935K11180j85019N45358J66550M25965
$$ 11446960 11414070 11415377 11565763 11611858 11625793 11836973 11651954 12197312 12363862 12789827
12161A2789827N76716L94639L57799L11788L33046n165P6118k54797l83493l24606
$$ 12789827 13366543 13761182 14118981 14430769 14763815 14758650 14834768 14579971 14196478 13871872
12151A3871872K19270J03790M10144K92038O03023P36811N01472Q70347P77686
$$ 13871872 14091142 14194932 14605076 14897114 15500137 16236948 16738420 17608767 18386453
12142A8386453Q07238O35787P29379L91877N25064O54282J087735P18098J094601
$$ 18386453 19193691 19829478 20558857 20950734 21475798 22130080 23217815 23935913 25030514
12133B5030514J109612J507274J645952J599998K233768J854024K170746J953077
$$ 25030514 26140126 27647400 29293352 30893350 33127118 34981142 37151888 39104965
12125C9104965J558003J173850Q57285R64201J21058l97362m602q92210m31974
$$ 39104965 40662968 41836818 42694103 43658304 43779362 43382000 43377398 42485188 42053214
12116D2053214o59982j155493o32544j264404o77782p34887q97034j048380l71445
$$ 42053214 41393232 40237739 39605195 38340791 37663009 36928122 36031088 34982708 34611263
12107C4611263q14435o10295n71198l93763P0215J976J66218k60655J55351J14149
$$ 34611263 33796828 33186533 32615335 32221572 32291787 32293763 32459981 32199326 32354677 32468826
12097C2468826J76284r4678m89533n72066m44856m94554n44727J86455K45180
$$ 32468826 32645110 32550432 32060899 31488833 31043977 30549423 30004696 30191151 30436331
12088C0436331Q22961O09082Q60959J072139P54849N02678O67099L86966k73498
$$ 30436331 31259292 31868374 32729333 33801472 34556321 35058999 35726098 36113064 35839566
12079C5839566N3057k59184q8690J28017j15047k01619J9928j82157m71125o85554
$$ 35839566 35892623 35633439 35544749 35672766 35557719 35356100 35376028 35193871 34722746 34037192
12069C4037192m81300p78844r22704j048602p46557j520432j012597p38079q44967
$$ 34037192 33555892 32777048 31854344 30805742 30059185 28538753 27526156 26788077 25943110
12060B5943110m40277k72041k52690m28685l47903p18701k93299o17487n96536
$$ 25943110 25502833 25230792 24978102 24549417 24201514 23482813 23189514 22572027 21975491
12051B1975491o62184m38217l57619k26243k90760n76473j2436j58492n59615
$$ 21975491 21313307 20875090 20517471 20291228 20000468 19423995 19411559 19253067 18693452
12042A8693452k29075l63684n01290o65943k64737m33369m90193l38394J8884
$$ 18693452 18464377 18100693 17599403 16933460 16668723 16235354 15745161 15406767 15425651
12033A5425651P7525L41239O98277L6091M57084K30094O17178K75265k70084l9521
$$ 15425651 15503176 15844415 16542692 16578783 17035867 17265961 17883139 18158404 17888320 17848799
12023A7848799p24710o46818p82717p83242o75039p50888l51182n11636r2623
$$ 17848799 17124089 16477271 15694554 14911312 14236273 13485385 13134203 12622567 12529944
12014A2529944j34766n38175o3190l69846m91119m74207O939k63937k10572J4234
$$ 12529944 12395178 11857003 11793813 11423967 10932848 10458641 10465580 10201643 9991071 10005305
12004A0005305J67585n9958M43172M7699K5676K13928q622k02661j81374n93369
$$ 10005305 10172890 10112932 10556104 10603803 10629479 10843407 10834785 10632124 10450750 9857381
11994I857381J89574p6147m32743j55305j36236J52992k58680J44594Q550J51388
$$ 9857381 10046955 9970808 9538065 9382760 9246524 9399516 9140836 9285430 9293980 9445368
11984I445368l83762l48820k96417k00738j45062n6106j30222k12774J9650j13901
$$ 9445368 9061606 8712786 8416369 8215631 8070569 8014463 7884241 7671467 7691117 7577216
11974G577216j03199j70882k67016k61990k54825j35210l572k30569j85011j55920
$$ 7577216 7474017 7303135 7036119 6774129 6519304 6384094 6380522 6149953 5964942 5809022
11964E809022q5430o5200j01402K6372J17821l3665J16834L94575j06161l6093
$$ 5809022 5723592 5658392 5556990 5583362 5701183 5667518 5784352 6178927 6072766 6036673
11954F036673K8934L97160l68099L08166k94448o3458J29682q9273J34561K37100
$$ 6036673 6065607 6462767 6094668 6402834 6108386 6044928 6174610 6085337 6219898 6456998
11944F456998J22283K79139J38998L90637K40577K22236R9174J64181R1734K89616
$$ 6456998 6579281 6858420 6997418 7388055 7628632 7850868 7950042 8114223 8205957 8495573
11934H495573L2982K65864l69306j86545j89600m1540j23026j81174j93460j92240
$$ 8495573 8528555 8794419 8425113 8238568 8048968 8007428 7884402 7703228 7509768 7317528
11924G317528O1211k94278j54860J22657l50620l93621n5419j60166m9629O6191
$$ 7317528 7378739 7084461 6929601 7052258 6701638 6308017 6252598 6092432 6042803 6108994
11914F108994k36454J02618K12033N67641J972532L634971M625536K269048J655107
$$ 6108994 5872540 5975158 6187191 6754832 8727364 12362335 16987871 19256919 20912026
11905B0912026N59055M81349l52983n42664k941832l805370m641169k566454j335475
$$ 20912026 21471081 21952430 21599447 21056783 18114951 14309581 9668412 7101958 5766483
11896E766483k94496j97129k63118K32342j50111J9889k24649L63686J16950O06950
$$ 5766483 5471987 5274858 5011740 5244082 5093971 5113860 4889211 5252897 5369847 5976797
11886E976797R07719M00260N19717J016566K39256M82856L34642K99978P760l33582
$$ 5976797 6884516 7284776 7804493 8821059 9060315 9543171 9877813 10177791 10185551 9851969
11876I851969o60296q79596j47487l78297o65817n20129n59512o21773k2277l61425
$$ 9851969 9191673 8312077 8164590 7786293 7120476 6600347 6040835 5419062 5396785 5035360
11866E035360r9519j77550k83978r0428j40333q5003L38168q5457j85006J03426
$$ 5035360 4935841 4758291 4474313 4383885 4243552 4158549 4496717 4411260 4226254 4329680
11856D329680j54922J09144K52016K83221P4110j82200J82704L38968L11100j7061
$$ 4329680 4174758 4283902 4535918 4819139 4893249 4711049 4893753 5232721 5543821 5526760
11846E526760M51719k5441O51101M37716M29587n7863K36864K09581l24120n3463
$$ 5526760 5978479 5953038 6604139 7041855 7471442 7413579 7650443 7860024 7535904 7482441
11836G482441l49837o0225l45159l00384k43736J32409l19632K84338p3088l5208
$$ 7482441 7132604 7072379 6727220 6426836 6183100 6315509 5995877 6280215 6207127 6171919
11826F171919j4326l03282m02272o37913n0979n90800j30928m01196M31239j67713
$$ 6171919 6157593 5854311 5452039 4814126 4763147 4172347 4041419 3640223 4071462 3903749
11816C903749K065l13617M8416k64132L60263n30209J80581j46897K32956k63426
$$ 3903749 3905814 3592197 3640613 3376481 3736744 3206535 3387116 3240219 3473175 3209749
11806C209749L0871j9885j63809r3575p3902j15793P3329K38868j88377J46247
$$ 3209749 3240620 3220735 3056926 2963351 2889449 2773656 2846985 3085853 2897476 3043723
11796C043723N5438O068m2679K00930J48142K05899M45865L76698J61132L52944
$$ 3043723 3099161 3105229 3062550 3263480 3411622 3617521 4063386 4440084 4601216 4954160
11786D954160J91889o8775O9998r0569j42875j92479l95557q35752J6767m24102
$$ 4954160 5146049 5077274 5147272 5056703 4913828 4721349 4325792 3490040 3506807 3082705
11776C082705R2784k8427k64471N0941j6542l04598P4812o0825k30685J83468
$$ 3082705 3175489 3147062 2882591 2933532 2916990 2612392 2687204 2626379 2395694 2579162
11766B579162Q0472j01845N9679m9896r2531J92074P5671j98076M517l59512K99815
$$ 2579162 2659634 2557789 2617468 2567572 2475041 2667115 2742786 2544710 2549227 2189715 2489530
11755B489530O4160j25634m5302m8406j20847K03676R8815j73341K1525K01181
$$ 2489530 2553690 2428056 2382754 2334348 2213501 2417177 2515992 2342651 2364176 2565357
11745B565357n9959M6559j40558j18113K57958l68991J92744p9168J34178j36418
$$ 2565357 2505398 2551957 2411399 2293286 2551244 2182253 2374997 2295829 2430007 2293589
11735B293589K15162k01074j20824J94385j40048m3270J936K75436j69228J28326
$$ 2293589 2508751 2307677 2186853 2381238 2241190 2197920 2199856 2475292 2306064 2434390
11725B434390o1370j50575L2431J556M5097K39806o1098m11984K30110m1732J24837
$$ 2434390 2373020 2222445 2254876 2256432 2301529 2541335 2480237 2068253 2298363 2256631 2381468
11714B381468j66905J30878J5976J1915j09005L4702K6432j35270J16142J38992
$$ 2381468 2214563 2345441 2361417 2373332 2264327 2299029 2325461 2190191 2306333 2445325
11704B445325L5543l1325K9086j75659Q8731L58230n05997K25243j81524L52092
$$ 2445325 2480868 2449543 2478629 2302970 2391701 2749931 2243934 2469177 2287653 2639745
11694B639745o015l25735L20724j07180j73803K1378J23168J2218j20313J92176
$$ 2639745 2633730 2307995 2628719 2521539 2347736 2369114 2492282 2504500 2384187 2576363
11684B576363k23819k1509J15588l1073l5474J46845j637K0626m5209r8391o942
$$ 2576363 2352544 2331035 2446623 2415550 2380076 2526921 2525284 2545910 2500701 2402310 2395368
11673B395368R3313M2189L0125K29452j3756k64161J84009j14191j9423p9769
$$ 2395368 2488681 2530870 2560995 2790447 2776691 2512530 2696539 2582348 2562925 2483156
11663B483156L16133m03574l8662j5208K15995R6655j70090K42764k47642K80550
$$ 2483156 2799289 2395715 2357053 2341845 2557840 2654495 2484405 2727169 2479527 2760077
11653B760077l59881K43704l2808j6405J3635q5212P9311N7657k4917r7434O7067
$$ 2760077 2400196 2643900 2611092 2594687 2608322 2523110 2602421 2660078 2635161 2537727 2604794
11642B604794j22423P7001N8613j86779k400L91266p6544J04007m29528J62191
$$ 2604794 2482371 2559372 2617985 2431206 2428806 2820072 2743528 2847535 2418007 2580198
11632B580198M15040n18463K66393q3781l23271K31874J5248J07793j55219n764
$$ 2580198 2995238 2476775 2743168 2659387 2336116 2567990 2583238 2691031 2535812 2530048
11622B530048m8918o1067J57242m2240L248N6360j983J68295j54105Q7610k56062
$$ 2530048 2481130 2420063 2577305 2535065 2538313 2594673 2592690 2760985 2606880 2694490 2438428
11611B438428J63423N1027p3738N610K45715j68995q4063K80163r497j12461J39358
$$ 2438428 2601851 2652878 2579140 2584750 2830465 2661470 2577407 2857570 2848073 2735612 2874970
11600B874970o4691k10188K83359p0765k1024j468o428M205j05435J77478j60742
$$ 2874970 2810279 2600091 2883450 2812685 2791661 2790193 2783765 2787970 2682535 2860013 2699271
11589B699271J86046r4280l03368L43554j74295j34478M11989j22768J12525k08111
$$ 2699271 2885317 2791037 2487669 2831223 2656928 2522450 2934439 2811671 2924196 2716085
11579B716085K07533o2930j1866r0754J1094P8767J18850J03734k04502R8111
$$ 2716085 2923618 2860688 2848822 2758068 2769162 2847929 2966779 3070513 2866011 2964122
11569B964122N7553l91981L18970k03789J40561p6877J18026J5777M7455k33908
$$ 2964122 3021675 2629694 2948664 2744875 2885436 2808559 2926585 2942362 2989817 2755909
11559B755909K06443k31726J21833k16982K4267L21303j52841N7110m551n8999
$$ 2755909 2962352 2730626 2852459 2635477 2659744 2981047 2828206 2885316 2880765 2821766
11549B821766o8792l43313N60265j56693j87079O3056j35471R1181M2119n9472
$$ 2821766 2752974 2409661 2969926 2813233 2626154 2689210 2553739 2644920 2687039 2627567
11539B627567j31024J69585j8344K22348j74761r5808r298K48959r4246k28612
$$ 2627567 2496543 2666128 2647784 2870132 2695371 2599563 2590265 2839224 2744978 2516366
11529B516366K59351k49478R5845J99740k77431K15983k56318Q0772Q7912k60542
$$ 2516366 2775717 2526239 2622084 2821824 2544393 2760376 2504058 2584830 2672742 2412200
11519B412200L38709j21208j9543L04046j94295J83663k24112J85494q3892m6442
$$ 2412200 2750909 2629701 2610158 2914204 2719909 2903572 2679460 2864954 2781062 2734620
11509B734620K1120k6915L7809j04066k26297J19052L5928K67721j27708N3872
$$ 2734620 2755740 2728825 2766634 2662568 2436271 2555323 2591251 2858972 2731264 2785136
11499B785136l02970L13106N4788J405k24708L42545q0008j24946k11407J12265
$$ 2785136 2482166 2795272 2850060 2851465 2626757 2969302 2889294 2764348 2552941 2665206
11489B665206K57593k73828J30485K10509j69508K6654L2195m3041j7717K29793
$$ 2665206 2922799 2648971 2779456 2989965 2820457 2847111 2879306 2836265 2818548 3048341
11479C048341j38082K08481j72120j9258j67419J87842L3555l7843m9665K14429
$$ 3048341 2910259 3118740 2946620 2927362 2759943 2947785 2981340 2943497 2893832 3108261
11469C108261l05673M4960k3838O7110P3770k24672j6163K21041j36913k61630
$$ 3108261 2802588 2847548 2823710 2890820 2964590 2739918 2723755 2944796 2807883 2546253
11459B546253L43800j93419k09210K73541j20697K07858l79042K92897K29412
$$ 2546253 2890053 2696634 2487424 2760965 2640268 2848126 2469084 2761981 2991393
11450B991393k68930Q7202K2310J83876j56368j3712K6830p9065N9522j2754k1095
$$ 2991393 2722463 2809665 2831975 3015851 2859483 2845771 2872601 2793536 2853058 2840304 2819209
11439B819209J23213J11844O3483M588k33569J22954l587O7030J30156J40054
$$ 2819209 2942422 3054266 3117749 3122337 2888768 3011722 3008135 3075165 3205321 3345375
11429C345375k46214K08673R1800l5917l29131M49883l7522J03618L0564r1401
$$ 3345375 3099161 3307834 3399634 3363717 3034586 3484469 3446947 3550565 3581129 3489728
11419C489728K27763J15074M8422o8819l531L48144m3724o0470J3147J26316L6296
$$ 3489728 3717491 3832565 3880987 3812168 3808637 4156781 4113057 4052587 4065734 4192050 4228346
11408D228346O8107n3526P2682J51684L31233j88812N1656J13732J37818J66979
$$ 4228346 4296453 4242927 4315609 4467293 4798526 4609714 4661370 4775102 4912920 5079899
11398E079899M9729j62741L40310n0326O6200q9091K95525j10362J00765K22123
$$ 5079899 5129628 4966887 5307197 5256871 5323071 5233980 5529505 5419143 5519908 5742031
11388E742031k43328N48228J96743l36362L70007j22203O7684K12954l9990k7978
$$ 5742031 5498703 6046931 6243674 5907312 6277319 6155116 6222800 6435754 6395764 6367786
11378F367786N9526L7021J67992j5722P8162J01754j13053P3281M14255k63552
$$ 6367786 6427312 6464333 6632325 6616603 6694765 6796519 6683466 6756747 7171002 6907450
11368F907450J00450K2535K52794j28581N2992k29607L77525j76237J39641j83604
$$ 6907450 7007900 7030435 7283229 7154648 7207640 6978033 7355558 7179321 7318962 7135358
11358G135358O9594j05387J41921K11744l63876L26517k65735K80675k55978K42612
$$ 7135358 7204952 7099565 7241486 7453230 7089354 7415871 7150136 7430811 7174833 7417445
11348G417445l40235N7030q1140q05j03097j14760J22231j72271L0131j63381
$$ 7417445 7077210 7134240 7053100 7052295 6949198 6834438 6956669 6784398 6814529 6651148
11338F651148k47851J04438j29659K07211k10983J76417j67830k71507p9838L5797
$$ 6651148 6403297 6507735 6378076 6585287 6374304 6550721 6382891 6111384 6031546 6067343
11328F067343n3736p4189J26613m7877k75621p9042p7421l6443R2385j81345k42713
$$ 6067343 6013607 5939418 6066031 6018154 5742533 5663491 5586070 5549627 5642012 5460667 5217954
11317E217954m5451l9248k14235r674o6541j65553o6516m7310q2325k23310K66808
$$ 5217954 5172503 5133255 4919020 4909346 4842805 4677252 4610736 4563426 4481101 4257791 4524599
11306D524599k44622j18861m2510l9168j28949M4876k09465L2839o2499L1290
$$ 4524599 4279977 4161116 4118606 4079438 3950489 3995365 3785900 3818739 3756240 3787530
11296C787530J2317n47536K13278K2347j7882l9241k41949J13534J22315m81248
$$ 3787530 3799847 3252311 3465589 3487936 3470054 3430813 3188864 3302398 3424713 2943465
11286B943465O4472M2016p2117J32231O006k60511j17719K46192k69564L60070
$$ 2943465 3007937 3049953 2977836 3110067 3116073 2855562 2737843 2984035 2714471 3074541
11276C074541j82756r6554J26537r962j27887J40762j5738l4768N1183r3593O137
$$ 3074541 2891785 2795231 2921768 2911806 2783919 2924681 2908943 2874175 2925358 2831765 2837902
11265B837902p7068k10176R3669J17504k27440j39613K17604j36233K45952k32064
$$ 2837902 2760834 2550658 2644327 2761831 2534391 2394778 2612382 2476149 2722101 2490037
11255B490037R5538k95795R2735K27461M2783q4374P2699l5194r3903K16238k06212
$$ 2490037 2585575 2289780 2382515 2609976 2652759 2568385 2641084 2605890 2511987 2728225 2522013
11244B522013K295J96110l14713K8743J37191j30326P0326Q2914K2573o3335p3907
$$ 2522013 2524308 2720418 2405705 2434448 2571639 2441313 2511639 2594553 2617126 2553791 2479884
11233B479884P6083K2050K11875k16037P5540L84833K8568R6156N10389J123794
$$ 2479884 2555967 2578017 2789892 2573855 2649395 3034228 3062796 3158952 3669341 4793135
11223D793135J129689Q05114L80311L73176K98544r0347m10173o27860q45581
$$ 4793135 5922824 6727938 7108249 7481425 7779969 7689622 7279449 6651589 5806008
11214E806008j237995p97571n49343p9800j89617k82205J00756k8891P506j53277
$$ 5806008 4568013 3770442 3221099 3141299 2951682 2669477 2770233 2741342 2748848 2595571
11204B595571K1901J30732k01159M2598K19832K35309k0695L22906N92591J048339
$$ 2595571 2617472 2748204 2547045 2589643 2809475 3044784 3024089 3346995 3939586 4987925
11194D987925J046657O96557M63113M94798K15571l37670m66883l65568j279781
$$ 4987925 6034582 6731139 7194252 7689050 7904621 7566951 7100068 6734500 5454719
11185E454719q54288q81493m80227p7897k86572L9512k46073N2063k1834k5023
$$ 5454719 4600431 3718938 3238711 3160814 2874242 2913754 2667681 2719744 2697910 2672887
11175B672887Q9378j17243j26999K45236m1703O0369K1780l8336l53096J83094
$$ 2672887 2762265 2645022 2518023 2763259 2721556 2781925 2803705 2765369 2412273 2595367
11165B595367L9780J37429j51626o1232M4369L90174k57700N7747j35075J61665
$$ 2595367 2635147 2772576 2620950 2559718 2604087 2994261 2736561 2794308 2659233 2820898
11155B820898O9229Q4855r9289P747j00773P3801k30506J34944J29559j78064
$$ 2820898 2890127 2974982 2875693 2883440 2782667 2856468 2625962 2760906 2890465 2712401
11145B712401J84114q9981j5895J25987J10430r6031J74692r368K05949k55410
$$ 2712401 2896515 2806534 2790639 2916626 3027056 2931025 3105717 3096349 3302298 3046888
11135C046888R0933K49175l70185J6505o5321Q8778r3395K55119J610J9216m1472
$$ 3046888 3137821 3386996 3016811 3033316 2967995 3056773 2963378 3218497 3220107 3239323 3197851
11124C197851j23359K12332j15331j23759j31802L27551m2073M7186M1258J50537
$$ 3197851 3074492 3286824 3171493 3047734 2915932 3243483 3201410 3248596 3289854 3440391
11114C440391k53238r1612K38746j66976K64372m4254j3136O2765k04938J88742
$$ 3440391 3187153 3095541 3334287 3167311 3431683 3387429 3374293 3437058 3232120 3420862
11104C420862j68999K16954k30223J53733k53161J62690N3315j54199J35107J5412
$$ 3420862 3251863 3468817 3238594 3392327 3139166 3301856 3355171 3200972 3336079 3351491
11094C351491j5891m3563J10012k76668J70945R7765k38039L44537j66248j22441
$$ 3351491 3335600 3292037 3402049 3125381 3296326 3394091 3156052 3500589 3334341 3211900
11084C211900R2867N4022J7364j66642R3981j02143J74683J47045j81717p8496
$$ 3211900 3304767 3358789 3376153 3209511 3303492 3201349 3376032 3523077 3341360 3262864
11074C262864J51005Q9002L5732q9198N7751K11743j26572J13317j02128J28064
$$ 3262864 3413869 3502871 3538603 3449405 3507156 3718899 3592327 3705644 3603516 3731580
11064C731580N6249J02797J12292n6298o4282J86673j5023Q5537j88103J41506
$$ 3731580 3787829 3890626 4002918 3946620 3882338 4069011 4053988 4139525 3951422 4092928
11054D092928J89141P3328N5927J03091j59624O2566m0992J97030k8236R8150
$$ 4092928 4282069 4355397 4411324 4514415 4354791 4417357 4376365 4573395 4545159 4643309
11044D643309j4973m0751Q6915L1805L50732M6285J34717J22526m0563Q1880M58733
$$ 4643309 4628336 4587585 4674500 4706305 5057037 5103322 5238039 5360565 5320002 5401882 5860615
11033E860615J31264l8060J31290k2374J41216R2392j03124M43015k0259Q0524
$$ 5860615 5991879 5953819 6085109 6062735 6203951 6296343 6193219 6636234 6615975 6696499
11023F696499m9220l01043N96545j7148Q8353j8809J23004P8693J4548K30133
$$ 6696499 6647279 6346236 6942781 6925633 7013986 6995177 7118181 7196874 7211422 7441555
11013G441555R8391K55463L03915N7441j3272K69839K92321N1277J94437L29704
$$ 7441555 7539946 7795409 8099324 8156765 8143493 8413332 8705653 8756930 8951367 9281071
11003I281071j136J15864P9652K26475M2706Q2207Q4842O2466j59618O5805J23508
$$ 9281071 9279935 9395799 9475451 9701926 9744632 9826839 9911681 9974147 9814529 9880334 10003842
10992A0003842J66644K68073j88831J14359J31356J89992K45724m1654L03392
$$ 10003842 10170486 10438559 10249728 10364087 10495443 10685435 10931159 10889505 11192897
10983A1192897N58172O01303L39175M67921K47372K77085R7883M17603J89885
$$ 11192897 11751069 12352372 12691547 13159468 13406840 13683925 13781808 14199411 14389296
10974A4389296j61855J14975k70235k34771O35155J54524K81747J86179K75017
$$ 14389296 14227441 14342416 14072181 13837410 14472565 14627089 14908836 15095015 15370032
10965A5370032L59961L81000N71094L87467L25923N92726M48115M07510L06881
$$ 15370032 15729993 16110993 16682087 17069554 17395477 17988203 18436318 18843828 19150709
10956A9150709P32456O56265N45925N90680M41114M68537K70622K27270M94232
$$ 19150709 19883165 20539430 21085355 21676035 22117149 22585686 22856308 23083578 23577810
10947B3577810j92464K98279O7422K43429M65780M03368N30283O22142O87829
$$ 23577810 23385346 23683625 23751047 23994476 24460256 24863624 25393907 26016049 26703878
10938B6703878N09986N98597O83414O37824N19386N35605O30692M26618L32361
$$ 26703878 27213864 27812461 28495875 29133699 29653085 30188690 30819382 31246000 31578361
10929C1578361L97414J92009O60965J19171K55226J31782L21493n5122J03504
$$ 31578361 31975775 32167784 32828749 32947920 33203146 33334928 33656421 33601299 33704803
10920C3704803r9403j70069o4646P7680m17886l0498M5154k42119j40343N2442
$$ 33704803 33605400 33435331 33370685 33448365 33030479 32999981 33045135 32803016 32662673 32715115
10910C2715115l5580p8981K93067J50593K13765j2085N08033J06844K59772L15671
$$ 32715115 32679535 32600554 32893621 33044214 33257979 33245894 33753927 33860771 34120543 34436214
10900C4436214P03335N19587O52175R62419M20628R77753J017889R37888J611647
$$ 34436214 35139549 35659136 36311311 37273730 37694358 38672111 39690000 40627888 42239535
10891D2239535J513188J620891K263930K203897K603361K959841L183396L806986
$$ 42239535 43752723 45373614 47637544 49841441 52444802 55404643 58588039 62395025
10883F2395025L748103L818257L822360L346464K938462K125920J635717M78749
$$ 62395025 66143128 69961385 73783745 77130209 80068671 82194591 83830308 84309057
10875H4309057m24431q86865k039353k441661l023361k993747l126560l882291
$$ 84309057 83884626 82997761 80958408 78516747 75493386 72499639 69373079 65490788
10867F5490788l271611l293282l191124l195483k924254k902675k519301k689937
$$ 65490788 62219177 58925895 55734771 52539288 49615034 46712359 44193058 41503121
10859D1503121k468294k242985k494718k049145j708819j665126j683808j452314
$$ 41503121 39034827 36791842 34297124 32247979 30539160 28874034 27190226 25737912
10851B5737912j554891j349060j425298j179834p86894r56727q47696q74043q80174
$$ 25737912 24183021 22833961 21408663 20228829 19441935 18485208 17637512 16763469 15883295
10842A5883295p79863o60251n74036p81264l96704l52866o23575n29933m29864
$$ 15883295 15103432 14443181 13869145 13087881 12691177 12338311 11714736 11184803 10754939
10833A0754939l76078l04661j68536n80505k72817m11067l91242R3837n68752
$$ 10754939 10378861 10074200 9905664 9325159 9052342 8641275 8250033 8343870 7775118
10824G775118J42889l31120p0326m20959j66607P7985m65367j24196R9732k44273
$$ 7775118 7918007 7586887 7516561 7095602 6928995 7006980 6541613 6417417 6517149 6272876
10814F272876l72973J87682J7939j60835j56793k15565n7920o8260j50344n6892
$$ 6272876 5899903 6087585 6105524 5944689 5787896 5572331 5514411 5446151 5295807 5238915
10804E238915j29219q0683j34883k15218K8139o211k18245J04002k41524J22406
$$ 5238915 5109696 5029013 4894130 4678912 4707051 4700840 4482595 4586597 4345073 4467479
10794D467479m32142J43550q056j52526l4459j60215M4322k7093j09499J13518
$$ 4467479 4035337 4178887 4170831 4018305 3983846 3823631 3867953 3840860 3731361 3844879
10784C844879k8949r1564J26036j85541Q8973j78581m40089K94652n729r9679
$$ 3844879 3815930 3724366 3850402 3664861 3753834 3575253 3135164 3429816 3424087 3324408
10774C324408j300j69125l2626K50721j08192k72349J92558l61350R297j31397
$$ 3324408 3323108 3153983 3121357 3372078 3263886 2991537 3184095 2822745 2832042 2700645
10764B700645J48722k6163q3061M003O2649k5490j5336K92860j98163o8384K27820
$$ 2700645 2849367 2823204 2740143 2744146 2806795 2781305 2765969 3058829 2860666 2792282 3020102
10753C020102k79304K35988l18290L90631j60367M076r7393Q7340Q028l86984
$$ 3020102 2740798 2976786 2658496 3049127 2888760 2892836 2795443 2882783 2890811 2503827
10743B503827J41506j38725J8793j45566j7457k0831K68992k48678J69823j45815
$$ 2503827 2645333 2506608 2525401 2379835 2362378 2341547 2610539 2361861 2531684 2385869
10733B385869Q4810p8930J38945J2411p4748R2788J34609j36848l59L53326l44917
$$ 2385869 2470679 2391749 2530694 2543105 2468357 2561145 2695754 2558906 2558547 2911873 2566956
10722B566956N7880r6020J475l68757j13059M50198j10851m0887J22868Q5031
$$ 2566956 2624836 2528816 2530291 2161534 2048475 2498673 2387822 2346935 2469803 2554834
10712B554834l09444j7442K32177k06471l2431r8757K93603l63636K74982o2519
$$ 2554834 2245390 2227948 2460125 2253654 2221223 2122466 2416069 2052433 2327415 2264896
10702B264896J0760K69143j59665N2052j80022k50180L16771l13014K18552K39588
$$ 2264896 2275656 2544799 2385134 2437186 2257164 2006984 2323755 2010741 2229293 2468881
10692B468881k90300K0582J02987N5148k91636m567J81204J89374j30835l62211
$$ 2468881 2178581 2199163 2302150 2357298 2065662 2061095 2242299 2431673 2300838 1938627
10682A938627R7356L34979j05063L55429n6765j83415M97285Q6164J43142r1259
$$ 1938627 2035983 2370962 2265899 2621328 2564563 2381148 2878433 2964597 3107739 3016480
10672C016480n151j77789p4822j01238L07398l40896l64396K9921j87380P9325
$$ 3016480 3011329 2833540 2758718 2657480 2964878 2623982 2259586 2289507 2102127 2181452
10662B181452m59206K40579k17264K07390L46740j36233P1071P0357L06718J34524
$$ 2181452 1722246 1962825 1745561 1952951 2299691 2163458 2234529 2304886 2611604 2746128
10652B746128j56608J20835J94087N9648o6543P6704m08852p8242j47818l23123
$$ 2746128 2589520 2710355 2904442 2964090 2897547 2974251 2565399 2487157 2339339 2016216
10642B016216r5472o3823n565j3533j49472J24508j77249o3098J2695J38203j64233
$$ 2016216 1920744 1856921 1851356 1837823 1688351 1812859 1635610 1572512 1585207 1723410 1559177
10631A559177J22434J37723j29264r2269J37238k26087l7443K0524K17071j74194
$$ 1559177 1681611 1819334 1690070 1597801 1735039 1508952 1471509 1492033 1709104 1534910
10621A534910J7715K00773Q8077k65940n3236K03459j10723k64347J32480Q4858
$$ 1534910 1552625 1753398 1841475 1575535 1522299 1725758 1615035 1350688 1483168 1568026
10611A568026K10526j22428q2576L788J47798j93794K8670J79850j57516O0672
$$ 1568026 1778552 1656124 1573548 1577336 1725134 1531340 1560010 1739860 1582344 1643016
10601A643016J19498k49867K03136o2750j7979m2289Q2136J69914l87742J38259
$$ 1643016 1762514 1512647 1715783 1653033 1635054 1592765 1674901 1844815 1457073 1595332
10591A595332J58195l49133N1193J39125q3557P0776k60604J29058J68161P0424
$$ 1595332 1753527 1404394 1455587 1594712 1511155 1581931 1321327 1450385 1618546 1688970
10581A688970J1424k87190K47538K5606N1117J67059j54396j61030K39381k03903
$$ 1688970 1700394 1413204 1660742 1686348 1737465 1904524 1750128 1589098 1828479 1624576
10571A624576J3275j75707N22756l39684r6942M1645l44980L99775Q8945j14054
$$ 1624576 1637851 1462144 1984900 1645216 1548274 1589919 1244939 1644714 1733659 1619605
10561A619605j70023j51835J66038J65393l07670K22847j60184p7181J95185j79368
$$ 1619605 1449582 1297747 1463785 1629178 1321508 1544355 1384171 1306990 1502175 1322807
10551A322807J84248O7472k78447J97029q1568k1517j66294K0051j09524J60453
$$ 1322807 1507055 1574527 1296080 1493109 1411541 1390024 1223730 1243781 1134257 1294710
10541A294710L8252K8009j87J93659j88677k4169J12925p6305j8855o2450P7831
$$ 1294710 1332962 1360971 1360784 1554443 1365766 1341597 1454522 1378217 1359362 1296912 1374743
10530A374743J0653J56118n5132l03013N15988m34964K51029O5092k4347N4857
$$ 1374743 1385396 1541514 1486382 1183369 1699357 1264393 1515422 1580514 1556167 1611024
10520A611024K09487L43970j47357L53751P6728j43924o6927L01010m05656J28281
$$ 1611024 1820511 2164481 2017124 2370875 2447603 2303679 2236752 2537762 2132106 2260387
10510B260387m52888M8495k05746q7734r3196K2357J32758j29476M7502J847J92262
$$ 2260387 1807499 1855994 1650248 1562514 1469318 1491675 1624433 1494957 1542459 1544306 1736568
10499A736568j22182M2000k4677J6696P0064N4781j15513K48228K53865L76420
$$ 1736568 1614386 1656386 1631709 1648405 1718469 1773250 1657737 1905965 2159830 2536250
10489B536250J81287o0970M6655o6606j47250K22509k08849l57211q1537j25308
$$ 2536250 2717537 2656567 2703222 2636616 2489366 2711875 2503026 2145815 2064278 1938970
10479A938970J1157o3348j15295J41621J84427j34281m6510Q8791p2997j20525
$$ 1938970 1950127 1886779 1771484 1913105 2097532 1963251 1916741 2005532 1932535 1812010
10469A812010Q4976P1624O1135K97902K64079j46749J69349k89935K60800O4351
$$ 1812010 1896986 1968610 2029745 2327647 2591726 2444977 2614326 2324391 2585191 2649542
10459B649542k30691m9481M4377m29375J43966Q3509l02885J59005K25481j57489
$$ 2649542 2418851 2369370 2413747 1984372 2128338 2211847 1908962 2067967 2293448 2135959
10449B135959k17633J23862l5322j25072K86429p8664j58714K52186J94712L19252
$$ 2135959 1918326 2042188 2006866 1881794 2168223 2089559 1930845 2183031 2377743 2696995
10439B696995l7900M62350L94010p9941o0506M36644o0657k16773j13627m57754
$$ 2696995 2659095 3121445 3515455 3435514 3375008 3811652 3750995 3534222 3420595 2962841
10429B962841j68436m97791l6282j25330L72995l10333p7372P1782p7939l20871
$$ 2962841 2794405 2296614 2260332 2135002 2507997 2197664 2120292 2192074 2114135 1793264
10419A793264K76457j10589J06335R3953j77245J85939j3779N8967L01911K27499
$$ 1793264 2069721 1959132 2065467 2159420 1982175 2168114 2154335 2213302 2515213 2742712
10409B742712K93285j79761J94512J82522m4946J49891N2275j43965j90645l35867
$$ 2742712 3035997 2856236 3050748 3233270 3188324 3338215 3390490 3246525 3055880 2720013
10399B720013l8954K12306J08043J08858M4207K64722j52395k5268J41847L18038
$$ 2720013 2681059 2893365 3001408 3110266 3154473 3419195 3266800 3241532 3383379 3701417
10389C701417k22660j54315J3447j65914M1358K211K06405j21565Q8585J81148
$$ 3701417 3478757 3324442 3337889 3171975 3213333 3215544 3421949 3300384 3388969 3570117
10379C570117J40217Q4933J01523k3436K37135j00672R1619K51095J13619J96156
$$ 3570117 3710334 3795267 3896790 3873354 4110489 4009817 4101436 4352531 4466150 4662306
10369D662306m6687J78678l18468M38938j81140L5209l84891J97992m2847l96105
$$ 4662306 4615619 4794297 4475829 4914767 4733627 4768836 4383945 4581937 4539090 4142985
10359D142985J09781j98417m35911K78230k25832L22746k0492J53851k49698J67288
$$ 4142985 4252766 4054349 3618438 3896668 3670836 3993582 3973090 4126941 3877243 4044531
10349D044531k9840r0622J13429k54603M22134l54829J09834j71068J6854J31257
$$ 4044531 4014691 3924069 4037498 3782895 4205029 3850200 3960034 3788966 3805820 3937077
10339C937077J4004L96447j97784K16215j94860K59717J01499k49816J38561j07188
$$ 3937077 3951081 4347528 4149744 4365959 4171099 4430816 4532315 4282499 4421060 4313872
10329D313872k28175q2394J54733J14269k68196L32408M7839k20033n4068R6095
$$ 4313872 4085697 4003303 4158036 4272305 4004109 4336517 4384356 4164323 4110255 4206350
10319D206350n9923O1409l42097N11287p7324j40564J314J35251K17740K81688
$$ 4206350 4146427 4207836 3865739 4377026 4299702 4159138 4160452 4295703 4513443 4795131
$$ [...]
##END NTUPLES=NMR SPECTRUM
##END=
