##TITLE=Coffee green (M2-ROVE10 + 1.5mL buffer 50/50,  450uL extracto + 50uL (D2O+TMS))
without heating, vortex and centrifuged, temperature 0oC.
##JCAMPDX= 6.0         $$ Bruker NMR JCAMP-DX V2.0
##DATA TYPE= NMR SPECTRUM
##DATA CLASS= NTUPLES
##ORIGIN= Bruker BioSpin GmbH
##OWNER= Administrator
$$ 1.72 TOPSPIN		Version 2.1
$$ 2012-05-22 16:11:05.403 -0700  Administrator@X
$$ Compression mode = diff/dup
##.OBSERVE FREQUENCY= 400.13188202
##.OBSERVE NUCLEUS= ^1H
##.ACQUISITION MODE= SIMULTANEOUS (DQD)
##.ACQUISITION SCHEME= undefined
##.AVERAGES= 64
##.DIGITISER RES= 22
##SPECTROMETER/DATA SYSTEM= spect
##.PULSE SEQUENCE= noesygppr1d
##.SOLVENT NAME= H2O+D2O
##.SHIFT REFERENCE= INTERNAL, H2O+D2O, 1, 14.97979
##AUDIT TRAIL= $$ (NUMBER, WHEN, WHO, WHERE, PROCESS, VERSION, WHAT)
$$ ##TITLE= Audit trail, TOPSPIN		Version 2.1
$$ ##JCAMPDX= 5.01
$$ ##ORIGIN= Bruker BioSpin GmbH
$$ ##OWNER= Administrator
$$ $$ c:\Bruker\TOPSPIN/data/jwist/nmr/11-coffee-green-quantification-2/31/pdata/1/auditp.txt
$$ ##AUDIT TRAIL=  $$ (NUMBER, WHEN, WHO, WHERE, PROCESS, VERSION, WHAT)
(   1,<2011-11-17 13:35:36.357 -0500>,<Administrator>,<TOPSPIN>,<go>,<TOPSPIN 2.1>,
      <created by zg
	started at 2011-11-17 13:26:42.029 -0500,
	POWCHK enabled, PULCHK disabled,
       configuration hash MD5:
       DA 63 81 1B EF 4C B5 72 B4 DF EA D9 B4 DB 4C 08
       data hash MD5: 64K
       0C 84 40 25 8F F9 7E 11 53 20 AA 20 E8 01 3D 9A>)
(   2,<2011-11-17 18:14:20.138 -0500>,<Administrator>,<TOPSPIN>,<proc1d>,<TOPSPIN 2.1>,
      <Start of raw data processing
       efp LB = 0 FT_mod = 6 PKNL = 1 PHC0 = 0 PHC1 = 0 SI = 32K 
       data hash MD5: 32K
       FB AC F5 1A BD 72 52 02 01 2C AB 77 78 D1 03 00>)
(   3,<2011-11-17 18:14:20.513 -0500>,<Administrator>,<TOPSPIN>,<proc1d>,<TOPSPIN 2.1>,
      <pk PHC0 = 22.11548 PHC1 = 0 
       data hash MD5: 32K
       19 2F 3E 7A B6 51 CD BE 76 9C CA 3F 02 D0 14 68>)
$$ ##END=
$$ 
$$ $$ hash MD5
$$ $$ 49 DC 00 31 F1 2A 40 78 9B 8C 20 76 82 FE 3D 5F
##$RELAX= 
##$RELAX= 
##$RELAX= 
##$RELAX= 
##$RELAX= 
##$RELAX= 
$$ Bruker specific parameters
$$ --------------------------
##$DU= <Z:>
##$EXPNO= 31
##$NAME= <11-coffee-green-quantification-2>
##$PROCNO= 1
##$TYPE= <nmr>
##$USER= <jwist>
##$ACQT0= -8.21000114481717
##$AMP= (0..31)
100 100 100 100 100 100 100 100 100 100 100 100 100 100 100 100 100 100
100 100 100 100 100 100 100 100 100 100 100 100 100 100
##$ANAVPT= -1
##$AQSEQ= 0
##$AQ_mod= 3
##$AUNM= <au_prof>
##$AUTOPOS= <>
##$BF1= 400.13
##$BF2= 400.13
##$BF3= 400.13
##$BF4= 400.13
##$BF5= 400.13
##$BF6= 400.13
##$BF7= 400.13
##$BF8= 400.13
##$BYTORDA= 0
##$CFDGTYP= 0
##$CFRGTYP= 9
##$CHEMSTR= <none>
##$CNST= (0..63)
1 1 145 1 1 1 1 1 1 1 1 1 1 1 1 1 1 1 1 1 1 1 1 1 1 1 1 1 1 1 1 1 1 1 1
1 1 1 1 1 1 1 1 1 1 1 1 1 1 1 1 1 1 1 1 1 1 1 1 1 1 1 1 1
##$CPDPRG= <>
##$CPDPRG1= <>
##$CPDPRG2= <>
##$CPDPRG3= <>
##$CPDPRG4= <mlev>
##$CPDPRG5= <mlev>
##$CPDPRG6= <mlev>
##$CPDPRG7= <mlev>
##$CPDPRG8= <mlev>
##$CPDPRGB= <>
##$CPDPRGT= <>
$$ [...]
150 150 150 150 150 150 150 150
##$TP07= 0
##$TPNAME0= <>
##$TPNAME1= <>
##$TPNAME2= <>
##$TPNAME3= <>
##$TPNAME4= <>
##$TPNAME5= <>
##$TPNAME6= <>
##$TPNAME7= <>
##$TPOAL= (0..7)
0.5 0.5 0.5 0.5 0.5 0.5 0.5 0.5
##$TPOFFS= (0..7)
0 0 0 0 0 0 0 0
##$TUNHIN= 0
##$TUNHOUT= 0
##$TUNXOUT= 0
##$USERA1= <user>
##$USERA2= <user>
##$USERA3= <user>
##$USERA4= <user>
##$USERA5= <user>
##$V9= 5
##$VALIST= <valist>
##$VCLIST= <CCCCCCCCCCCCCCC>
##$VD= 0
##$VDLIST= <DDDDDDDDDDDDDDD>
##$VPLIST= <PPPPPPPPPPPPPPP>
##$VTLIST= <TTTTTTTTTTTTTTT>
##$WBST= 2048
##$WBSW= 25
##$XGAIN= (0..3)
0 0 0 0
##$XL= 0
##$YL= 0
##$YMAX_a= 5031041
##$YMIN_a= -1970293
##$ZGOPTNS= <>
##$ZL1= 120
##$ZL2= 120
##$ZL3= 120
##$ZL4= 120
##$ABSF1= 0
##$ABSF2= 0
##$ABSG= 0
##$ABSL= 0
##$ALPHA= 0
##$AQORDER= 0
##$ASSFAC= 0
##$ASSFACI= 0
##$ASSFACX= 0
##$ASSWID= 0
##$AUNMP= <proc_prof1d>
##$AXLEFT= 0
##$AXNAME= <>
##$AXNUC= <1H>
##$AXRIGHT= 0
##$AXTYPE= 0
##$AXUNIT= <>
##$AZFE= 0.1
##$AZFW= 0.1
##$BCFW= 0
##$BC_mod= 0
##$BYTORDP= 0
##$COROFFS= 0
##$CY= 15
##$DATMOD= 1
##$DC= 0
##$DFILT= <>
##$DTYPP= 0
##$F1P= 14.9797897338867
##$F2P= -5.57274121986904
##$FCOR= 0.5
##$FTSIZE= 32768
##$FT_mod= 6
##$GAMMA= 0
##$GB= 0
##$INTBC= 1
##$INTSCL= 1
##$ISEN= 128
##$LB= 0
##$LEV0= 0
##$LPBIN= 0
##$MAXI= 10000
##$MC2= 0
##$MEAN= 0
##$ME_mod= 0
##$MI= 0
##$NCOEF= 0
##$NC_proc= -6
##$NLEV= 6
##$NOISF1= 0
##$NOISF2= 0
##$NSP= 0
##$NTH_PI= 0
##$NZP= 0
##$OFFSET= 14.97979
##$PC= 1
##$PHC0= 22.11548
##$PHC1= 0
##$PH_mod= 1
##$PKNL= yes
##$PPARMOD= 0
##$PPDIAG= 0
##$PPIPTYP= 0
##$PPMPNUM= 2147483647
##$PPRESOL= 1
##$PSCAL= 4
##$PSIGN= 0
##$PYNMP= <proc.py>
##$REVERSE= no
##$SF= 400.13
##$SI= 32768
##$SIGF1= 0
##$SIGF2= 0
##$SINO= 400
##$SIOLD= 32768
##$SPECTYP= <>
##$SREGLST= <1H.H2O+D2O>
##$SSB= 0
##$STSI= 32768
##$STSR= 0
##$SW_p= 8223.68421052629
##$SYMM= 0
##$S_DEV= 0
##$TDeff= 65536
##$TDoff= 0
##$TI= <>
##$TILT= no
##$TM1= 0
##$TM2= 0
##$TOPLEV= 0
##$USERP1= <user>
##$USERP2= <user>
##$USERP3= <user>
##$USERP4= <user>
##$USERP5= <user>
##$WDW= 1
##$XDIM= 32768
##$YMAX_p= 384565966
##$YMIN_p= -20995259
##$CURPLOT= <Network HP LaserJet P1505>
##$CURPRIN= <$Network HP LaserJet P1505>
##$DFORMAT= <normdp>
##$LAYOUT= <+/1D_H.xwp>
##$LFORMAT= <normlp>
##$PFORMAT= <normpl>
##$SURQMSG= 1
$$ End of Bruker specific parameters
$$ ---------------------------------
##NTUPLES= NMR SPECTRUM
##VAR_NAME=  FREQUENCY,     SPECTRUM/REAL,   SPECTRUM/IMAG
##SYMBOL=    X,             R,               I
##VAR_TYPE=  INDEPENDENT,   DEPENDENT,       DEPENDENT
##VAR_FORM=  AFFN,          ASDF,            ASDF
##VAR_DIM=   32768,         32768,           32768
##UNITS=     HZ,            ARBITRARY UNITS, ARBITRARY UNITS
##FACTOR=    0.250966925370065, 1,           1
##FIRST=     8223.43324360092, 153455,       -333717
##LAST=      0,             159673,          -172376
##MIN=       0,             -20995259,       0
##MAX=       8223.43324360092, 384565966,    0
$$ Real data points
##PAGE= N=1
##DATA TABLE= (X++(R..R)), XYDATA
$$ [...]
19676A664593r9318J14258J87968j81149j03445K79468J64308j80816J4244M7333
$$ 1664593 1565275 1679533 1867501 1686352 1582907 1862375 2026683 1845867 1860111 1907444
19666A907444j57135J03541l25371K76583k12064J70295k20722K08615m745P152
$$ 1907444 1750309 1853850 1528479 1805062 1592998 1763293 1542571 1751186 1746441 1753593
19656A753593k01169J0050J27296J71266r358p1619j57768O8464p1973m1511J06885
$$ 1753593 1552424 1562474 1689770 1861036 1851678 1780059 1622291 1690755 1618782 1577271 1684156
19645A684156L54038l55845J52067j49015K0122j38414J92636M1687j50773K71435
$$ 1684156 2038194 1682349 1834416 1685401 1705523 1567109 1759745 1801432 1650659 1922094
19635A922094k00711l1818J70525n3433o2357l29750M73243k78781K40666k83089
$$ 1922094 1721383 1689565 1860090 1806657 1744300 1414550 1887793 1609012 1849678 1566589
19625A566589j11949K06656L1570j20730J0352P6858r6720J53171R7350J4811
$$ 1566589 1454640 1661296 1692866 1572136 1582488 1659346 1562626 1715797 1813147 1827958
19615A827958j70441n6669o5057j72837J78526l9027j46368K52160k78826P3482
$$ 1827958 1657517 1600848 1535791 1362954 1541480 1502453 1356085 1608245 1329419 1402901
19605A402901L5947o1410J81083l3413o0864j03372M602O8637J21048r8944q7933
$$ 1402901 1438848 1377438 1558521 1525108 1464244 1360872 1365474 1434111 1555159 1456215 1368282
19594A368282J2813k31903N54353m58800N8723J17302k76214J81997K23532k70178
$$ 1368282 1381095 1149192 1703545 1244745 1303468 1420770 1144556 1326553 1550085 1279907
19584A279907K81875j2719r709j42484r3508n290p1559O707J95795l01204J6679
$$ 1279907 1561782 1549063 1539354 1396870 1303362 1298072 1226513 1233220 1429015 1127811 1144490
19573A144490J93041j09958o3989J81468k02248J20806j02565J05426l3685j6852
$$ 1144490 1337531 1227573 1163584 1345052 1142804 1263610 1161045 1266471 1232786 1215934
19563A215934Q5106J5870r1371j40015K75947j04775J12557j23252n3047j03733
$$ 1215934 1301040 1316910 1225539 1085524 1361471 1256696 1369253 1246001 1192954 1089221
19553A089221J30461J4906J01558P4427j56628K57279l15380J32674J309j41874
$$ 1089221 1219682 1234588 1336146 1410573 1253945 1511224 1195844 1328518 1329827 1187953
19543A187953M1454K48369j10034k1938j24739M9419j6991J76758k77420J01978
$$ 1187953 1229407 1477776 1367742 1345804 1221065 1270484 1253493 1430251 1152831 1254809
19533A254809o530P2583j21260o9807K41566k34138K25916O1987m6230l10205
$$ 1254809 1248279 1320862 1199602 1129795 1371361 1137223 1363139 1425126 1378896 1068691
19523A068691R9840J86196j63978j10661J60029l07359J56025K11536J06911j95784
$$ 1068691 1168531 1354727 1190749 1080088 1240117 932758 1088783 1300319 1407230 1211446
19513A211446k4686J04246r1112l1488P2824k51049P6051N11271k06624k97968
$$ 1211446 1186760 1291006 1199894 1168406 1241230 990181 1066232 1577503 1370879 1072911
19503A072911L1294J9816J61242Q6790k76536j3185M9677k87860J62184M28839
$$ 1072911 1104205 1124021 1285263 1372053 1095517 1082332 1132009 844149 1006333 1435172
19493A435172n28025K87624j8327j23171J17846l2496K7558Q9439l90530K48314
$$ 1435172 907147 1194771 1176444 1053273 1171119 1138623 1166181 1255620 865090 1113404
19483A113404j14378P9811J38230l55374J95172J00398r8465J68563j82902l4126
$$ 1113404 999026 1078837 1217067 861693 1056865 1157263 1058798 1227361 1044459 1010333
19473A010333j0863J135Q3206n3746j20103n7459j07280K53133r0469j19492N0069
$$ 1010333 999470 1000605 1083811 1030065 909962 852503 745223 998356 907887 788395 838464
19462H38464J02311Q1378j61562j45356P4727j50366J27473k929J27916j78642
$$ 838464 940775 1022153 860591 715235 789962 639596 767069 764140 892056 713414
19452G13414K07794j09222m8501R7099l4987j38554J50996j60844O684l3725J83435
$$ 713414 921208 811986 763485 860584 825597 687043 838039 677195 683879 650154 833589
19441H33589q2961k5097L3943j27800L19814K2003q2338k32481p6731J34826l8166
$$ 833589 750628 725531 759474 631674 951488 973491 891153 658672 581941 716767 678601
19430F78601J62012k23589L43104l35041M3484K25166j37437j32522J10404j1671
$$ 678601 840613 617024 960128 625087 668571 893737 756300 623778 734182 722511
19420G22511J05912j27624m2670J08728J66576J27577k81749o1246Q0584j48446
$$ 722511 828423 700799 658129 766857 933433 1061010 779261 718015 798599 650153
19410F50153K03363q271j14528p9494N9285K10951m24336L73447j2259J25462
$$ 650153 853516 845245 730717 651223 710508 921459 497123 870570 858311 983773
19400I83773k06367j15506R6004J01152k21282J22406J58551r2380J909P4808
$$ 983773 777406 661900 757904 859056 637774 760180 918731 826351 828260 903068
19390I03068q8546k06490K14439l3816j64674J29112J67986n8921l41599M37820
$$ 903068 814522 608032 822471 788655 623981 753093 921079 862158 520559 958379
19380I58379j10976l4074K983p5268J61098j32298P0431j19337R2614Q49J42285
$$ 958379 847403 813329 816312 741044 902142 769844 840275 720938 813552 814401 956686
19369I56686l86401l5304O6613L67704l60468J69033J02030r2369K2862r6570
$$ 956686 570285 534981 601594 969298 608830 777863 879893 787524 810386 713816
19359G13816J72664o0510L8718k27802j9944N9731N2018J22743l57116K34334
$$ 713816 886480 825970 864688 636886 616942 676673 728691 851434 494318 728652
19349G28652J53229M7610j71001J93696m48807K76781P2062j55161K11295q577
$$ 728652 881881 929491 758490 952186 503379 780160 852222 697061 908356 899779
19339H99779J52243o2826j40151J28911m2917j7645j03309L23224j76096O3495
$$ 899779 1052022 989196 849045 977956 935039 917394 814085 1137309 961213 1024708
19329A024708j45069K65285p9322L4475l66298K8575R4979K0246j50705K9737
$$ 1024708 879639 1144924 1065602 1100077 733779 762354 857333 877579 726874 756611
19319G56611j81498M0628M07341k38346q1611k7535N2954O9398q3361K74364k33455
$$ 756611 575113 615741 1023082 784736 703125 675590 728544 797942 714581 988945 755490
19308G55490o0278O262R0660j70330K52528k18015P5277k10537M54335j83024
$$ 755490 695212 701474 792134 621804 874332 656317 731594 521057 975392 792368
19298G92368L5860k40147J31180p6172L6590p8056j38614J16142J3781L6303j77161
$$ 792368 828228 588081 719261 643089 679679 601623 463009 579151 592932 629235 452074
19287D52074j0121L71852J08724l01037k37659L50169j90745J25336m1346m193
$$ 452074 441953 813805 922529 621492 383833 734002 543257 668593 627247 623054
19277F23054J29561m33K5969j58821N695m6752N0397P2289K7229q9034K80365
$$ 623054 752615 752182 778151 619330 625025 578273 628670 700959 728188 639154 919519
19266I19519k2279C79183M82806j16717n8581j34565K71964j54828m36N5814j19783
$$ 919519 897240 379183 861989 745272 686691 552126 824090 669262 668826 724640 604857
19255F04857J70567l8469J90038k02585J14744J35424k8683p4851k0599k64728
$$ 604857 775424 736955 926993 724408 839152 974576 945893 871042 850443 585715
19245E85715J22764L2593J3920J88880L95139j77991K02884j76916J49502l2611
$$ 585715 708479 741072 754992 943872 1339011 1161020 1363904 1186988 1336490 1303879
19235A303879j93687J56575l98149M8985j29309k52303K09651k13389J79699J95931
$$ 1303879 1110192 1266767 868618 917603 788294 535991 745642 532253 711952 907883
19225I07883q0120j21472j16354L9047m9994J85164l33574L64786K25k05673R7280
$$ 907883 827763 706291 589937 628984 578990 764154 430580 795366 795591 589918 687198
19214F87198m1777o909O1655q2026M0561R6946n1720q2089J05154j72766J89067
$$ 687198 645421 638512 700167 618141 658702 755648 703928 621839 726993 554227 743294
19203G43294j0810k82953R9243l0065K08328n8223k3973K124J43053q0855K0171
$$ 743294 732484 449531 548774 518709 727037 668814 644841 646965 790018 709163 729334
19192G29334O8126k14937Q8238j59377K50949j87893L04437j35354J03162j61425
$$ 729334 797460 582523 670761 511384 762333 574440 878877 743523 846685 685260
19182F85260R0241P7438K24915k73571J65166l3123J68592N012j70234K9824q0349
$$ 685260 775501 852939 1077854 804283 969449 936326 1104918 1109930 939696 969520 889171
19171H89171o126N1188j39752J61556P925j28017R7281p9646O1630l9269p09Q9720
$$ 889171 883045 934233 794481 956037 963962 835945 933226 853580 915210 875941 875232 964952
19159I64952O7506O9487j48119J73860p3804j00273o3434N5758J14745j59798
$$ 964952 1032458 1101945 953826 1127686 1053882 953609 890175 945933 1060678 900880
19149I00880N3054J1545n6282j51752J09920J05836L0004j25755J81438Q557J8725
$$ 900880 953934 965479 909197 757445 867365 973201 1003205 877450 1058888 1067445 1086170
19138A086170n9116n4641R5861k73106P2747o8544J43996M72J65242K99798l63080
$$ 1086170 1027054 972413 1068274 795168 867915 799371 943367 943839 1109081 1408879 1045799
19127A045799J64901o1791l95404K91774J12401m7828P7529j35481K54717M3365
$$ 1045799 1210700 1148909 753505 1045279 1157680 1109852 1187381 1051900 1306617 1349982
19117A349982J32152n7447J59917R845K27509n864R0302K49596J89533P77804
$$ 1349982 1482134 1424687 1584604 1594449 1821958 1816094 1906396 2155992 2345525 3123329
19107C123329K67068M33583J88217L81530L6055p654J65023l78002n86854m50831
$$ 3123329 3390397 3823980 4012197 4393727 4429782 4422128 4587151 4209149 3622295 3171464
19097C171464m77807m21363k47094j84262j15201J70047m28393m2440o3708J3815
$$ 3171464 2693657 2272294 2025200 1840938 1725737 1895784 1467391 1424951 1361243 1375058
19087A375058j38010K65325k8374K10692J70266J14704K16041N18283N62427L19774
$$ 1375058 1237048 1502373 1473999 1684691 1854957 1969661 2185702 2703985 3266412 3586186
19077C586186L68039J43769J28870P8098M01848q54j65995j97447K9245j32398
$$ 3586186 3954225 4097994 4226864 4304962 4706810 4705956 4539961 4342514 4371759 4239361
19067D239361m7990j2802J04647k18998l98978l55312l41297l18697j41064n80790
$$ 4239361 4191371 4178569 4283216 4064218 3665240 3309928 2968631 2649934 2508870 1928080
19057A928080R0208k65085K77437m37476J53125j45595L62104l57106J94018J24477
$$ 1928080 2018288 1753203 2030640 1593164 1746289 1600694 1962798 1605692 1799710 1924187
19047A924187K54750J06446N11864K16279N68671M24274J78573J32218K91856
$$ 1924187 2178937 2285383 2797247 3013526 3582197 4006471 4185044 4317262 4609118
19038D609118j12658k77716k6676q47426l09760n72808k65150k80464j70220R1107
$$ 4609118 4496460 4218744 4192068 3344642 3034882 2462074 2196924 1916460 1746240 1837347
19028A837347j45351j1256L8661L2938K96136q6444M650m6981K19599L95540K68563
$$ 1837347 1691996 1680740 1719401 1752339 2048475 1962031 1966681 1919700 2139299 2534839 2803402
19017B803402L50088L04902N36537L79405N14391N2500M70628j55705L84249K98431
$$ 2803402 3153490 3458392 3994929 4374334 4888725 4941225 5411853 5256148 5640397 5938828
19007E938828K30626K1455K33611M64215L25027R08545O60208R17050J333281
$$ 5938828 6169454 6190909 6424520 6888735 7213762 8122307 8782515 9699565 11032846
18998A1032846J254041J729030K113537J571096J960072J094517P27891K60717
$$ 11032846 12286887 14015917 16129454 17700550 19660622 20755139 21483030 21743747
18990B1743747k49369j322436j700727k306092k512441k496387k034140j590778
$$ 21743747 21494378 20171942 18471215 16165123 13652682 11156295 9122155 7531377
18982G531377j063602j027901o24599o93922l15539n71742l46997n9819m66227
$$ 7531377 6467775 5439874 4815275 4121353 3805814 3234072 2887075 2827256 2361029
18973B361029p4318j30158r7318r3953k07640J02025o0274L0474j7869k23630
$$ 2361029 2286711 2156553 2059235 1965282 1757642 1859667 1799393 1829867 1811998 1588368
18963A588368p6639J36608r9580P8097L1512j6705R4760k87562J85796m9489K17476
$$ 1588368 1511729 1648337 1548757 1626854 1658366 1641661 1736421 1448859 1634655 1585166 1802642
18952A802642J31809j96212J64533K24876r3037N47431m63432L85679K55066j5639
$$ 1802642 1934451 1738239 1902772 2127648 2034611 2582042 2118610 2504289 2759355 2743716
18942B743716L43188M18872L44326O37047N27475J127455J033089J642102J795855
$$ 2743716 3086904 3505776 3850102 4487149 5014624 6142079 7175168 8817270 10613125
18933A0613125J822871K028234J849412J891922R02596Q32630k16006o80323j302849
$$ 10613125 12435996 14464230 16313642 18205564 19108160 19940790 19724784 19044461 17741612
18924A7741612j816804k394222k397171j841774j945142j264686r23628p67040
$$ 17741612 15924808 13530586 11133415 9291641 7346499 6081813 5158185 4391145
18916D391145n83153o95500m21604m40032j99390k4919l56853j94757o1414j62104
$$ 4391145 3807992 3112492 2690888 2250856 2051466 2026547 1669694 1474937 1413523 1251419
18906A251419O1618Q8211j44063m1587j15131k24745J36462K38667l45150O5451
$$ 1251419 1313037 1401248 1257185 1215598 1100467 875722 1012184 1250851 905701 971152
18896I71152j3021k06838M49r7451L68928l35998L12712k76273L1051k07267J73472
$$ 971152 958131 751293 751742 654291 1023219 687221 999933 723660 754711 547444 720916
18885G20916j3143N2609K9787L1615o0600p0715K30063m50084J32632j05048L3463
$$ 720916 707773 760382 790169 821784 761184 690469 920532 470448 603080 498032 531495
18874E31495j71833L14162o1090j25305J65352l1142j05312J78734M359J17394
$$ 531495 359662 673824 612734 487429 652781 621639 516327 695061 699420 816814
18864H16814k05709K4831n0113K8666l0154r51k4095N2158l9830L16415k91849
$$ 816814 611105 635936 585823 614489 584335 583384 559289 611447 571617 888032 596183
18853E96183M444J39585j42391R5220j64022J56567M0326j19720j24989K70810
$$ 596183 600627 740212 597821 693041 529019 685586 725912 606192 481203 752013
18843G52013j10201n7583N7620j44933j5260N5899K18853j87363j81644m5718
$$ 752013 641812 584229 641849 496916 481656 537555 756408 569045 387401 341683
18833C41683K13364J4013j49044q280J40094J17421q027j29818l1651K4574L2830
$$ 341683 555047 569060 420016 411736 551830 669251 661224 531406 499755 524329 557159
18822E57159j7819M3442j80763K98657k09812m4301O8124J40048B61291K66660
$$ 557159 539340 582782 402019 700676 490864 446563 514687 654735 261291 527951
18812E27951J22154j26003j1771J47001k68599J91243L5638j48776J75148k421
$$ 527951 650105 524102 512331 659332 390733 581976 617614 468838 643986 641565
18802F41565L7482j09141j7793L21332l63896p759J26722P5963j31658M8184Q1992
$$ 641565 679047 569906 552113 873445 509549 501790 628512 704475 572817 621001 702993
18791G02993j92839K15315j07515P4252j05783j16275J29833J86942P314J08432
$$ 702993 510154 725469 617954 692206 586423 470148 599981 786923 794237 902669
18781I02669j87940L12068D10934M09738k09304r7364L33398j69386L0752o588
$$ 902669 714729 1026797 410934 820672 611368 514004 847402 678016 708768 702180
18771G02180R0668k22839J64965B57060L01601J41632o6591L2575m9898j12548
$$ 702180 792848 570009 734974 257060 558661 700293 633702 666277 616379 503831
18761E03831o3217M2271J09390j06460J73378R7728k40182j68266N7426K03987
$$ 503831 440614 482885 592275 485815 659193 756921 516739 348473 405899 609886
18751F09886j66850j15180K54159p3514p8925Q3270l9683L75260l15734K09766
$$ 609886 443036 327856 582015 508501 429576 512846 473163 848423 532689 742455
18741G42455k06574j47926J81825j3292j28682J53115J46425j59081J58019j68432
$$ 742455 535881 387955 569780 556488 427806 580921 727346 568265 726284 557852
18731E57852O890R8828k00818n4161J94623J14034j41831K01652k10948K26710
$$ 557852 564742 663570 462752 408591 603214 717248 575417 777069 566121 792831
18721G92831l10624P3586j51538N7618K16771r6338q3501R1845j40135K05638
$$ 792831 482207 555793 404255 461873 678644 582306 498805 590650 450515 656153
18711F56153k23347K22518M9814k15327M0121J3731O5223k71982L05754k06054
$$ 656153 432806 655324 705138 489811 529932 543663 608886 336904 642658 436604
18701D36604j25663L00961n9825J2358j04165J66933q669j21760J77707M6319
$$ 436604 310941 611902 552077 564435 460270 627203 618534 496774 674481 720800
18691G20800B77899L52091O319j09794Q7892N5433q1543M6234j74268J94964k16588
$$ 720800 277899 629990 636309 526515 614407 669840 588297 634531 460263 655227 438639
18680D38639Q4250j03283K89049P3571l14395q6136K01089L087m5411p5716n5855
$$ 438639 522889 419606 708655 782226 467831 381695 582784 585871 540460 464744 408889
18669D08889K38903j2129r0086O6630R1605j46204J04514k08174R0225k313l007
$$ 408889 647792 635663 545577 612207 703812 557608 662122 453948 544173 541860 538853
18658E38853m7178j80655L06383k32374P5029J37868m7689k6263q5211J16320
$$ 538853 491675 311020 617403 385029 460058 597926 550237 523974 438763 555083
18648E55083M1340l1860j11752n1034M1603J78514k44476P6001J56706k97213
$$ 555083 596423 564563 452811 401777 443380 621894 377418 453419 610125 312912
18638C12912O3321j08718L87824k33721K8006M2705L9715k32978L25148B63847
$$ 312912 376233 267515 655339 421618 449624 492329 532044 299066 624214 263847
18627C93473p3297L03389j11594J42273k38423K5872O2881o3647M5163j41746
$$ 393473 320176 623565 511971 654244 415821 441693 504574 440927 486090 344344
18617C44344J7397J83248k07860K63247m5756K66689l66636R2496j95651J63347
$$ 344344 361741 544989 337129 600376 554620 821309 454673 547169 351518 514865
18607E14865R3110j85393J42885J2246R3878q6007K9486j29934L12445k82546
$$ 514865 607975 422582 565467 577713 671591 585584 615070 485136 797581 515035
18597E15035N1978K44631l03302J21296J0097m3949j46010K71205K41280j93449
$$ 515035 567013 811644 508342 629638 639735 595786 449776 720981 962261 768812
18587G68812j19822j6447J07061j95372L40311j78466k75548L51736j86406L8263
$$ 768812 648990 632543 739604 544232 884543 706077 430529 782265 595859 634122
18577F34122J27481q792j60872O3495K00307k41286J51380k67645K31092r1257
$$ 634122 761603 752811 591939 655434 855741 614455 765835 498190 729282 638025
18567F38025j40117q8083L80658k69076Q3517j80192j9946J93264N245j55541
$$ 638025 497908 409825 790483 521407 604924 424732 404786 598050 603295 447754
18557D47754o312L1215J24734p5629P14Q6771p849k13872K31694j73801J84538
$$ 447754 441442 472657 597391 521762 522476 609247 601398 387526 619220 445419 629957
18546F29957k27176M624K71277p7820j49309k2222J06246M4543k8411r4826R6438
$$ 629957 402781 407405 678682 600862 451553 429331 535577 580120 551709 456883 553321
18535E53321j69259n5343J30025l4235J53538k009K3481j23022R9273j85786O3342
$$ 553321 384062 328719 458744 424509 578047 576038 599519 476497 575770 389984 453326
18524D53326M6155P4493k7883o6302J611L42472C76479J26105o5567L4903M9826
$$ 453326 499481 573974 546091 479789 481400 823872 376479 502584 437017 471920 521746
18513E21746K98131l42502P6329O8867k07514K32015j07428B54444J78019M599
$$ 521746 819877 477375 553704 622571 415057 647072 539644 254444 432463 437062
18503D37062K09841j12717O3611r563r9161K79033k24641j33818O7248m8835N1812
$$ 437062 646903 534186 597797 588234 489073 768106 543465 409647 476895 428060 479872
18492D79872O2482k25588J76374P28J22082k26448k6604L54364k69131J93774
$$ 479872 542354 316766 493140 493868 615950 389502 362898 717262 448131 641905
18482F41905j86819O3787j57425K10817r1733O4855j9401K30391j47648r8459
$$ 641905 455086 518873 361448 572265 480532 545387 525986 756377 608729 510270
18472E10270K4236J85497j47836l5353j44547K36856P1726j12383J92071k5654
$$ 510270 534506 720003 572167 536814 392267 629123 700849 588466 780537 754883
18462G54883j13731p5190M6825M0487N9594L9675J87318k30044j08630M09201
$$ 754883 641152 565962 612787 653274 712868 752543 939861 709817 601187 1010388
18452A010388j88584R747j66972n1187J15212j70395j1645O6950r6842Q3785K6443
$$ 1010388 821804 831551 664579 613392 728604 558209 546564 613514 516672 600457 626900
18441F26900k82505k7775J64088O5357J99622k23119j7969O1973N595j31729J62699
$$ 626900 344395 316620 480708 546065 745687 522568 504599 566572 572167 440438 603137
18430F03137J89670J93542m83963K60884j84400n0628J49436j39453L2367j03486
$$ 603137 792807 986349 502386 763270 578870 528242 677678 538225 570592 467106
18420D67106K24616j42209B63575L25818k21776J64678L8545j41418m2705l6720
$$ 467106 691722 549513 263575 589393 367617 532295 570840 429422 386717 349997
18410C49997R6147q744O7355P655j55525J71979l0350J37430k88011M2573j17419
$$ 349997 446144 437400 504755 512410 356885 528864 498514 635944 347933 390506 273087
18399B73087M3292J06075J14871j04958O3012j52682k4370J25330j00562J85475
$$ 273087 316379 422454 537325 432367 495379 342697 318327 443657 343095 528570
18389E28570j83737P8263k1715j64844K74103q8111n8803N9042K01930k78455
$$ 528570 344833 423096 401381 236537 510640 422529 363726 422768 624698 346243
18379C46243L98687l68142l2355J48516j18871M4409R0334j3591n439k5411L61990
$$ 346243 744930 376788 344433 492949 374078 418487 508821 495230 489791 464380 826370
18368H26370l79536k5683J03035J11640j09550k5461j5474p6818J57585J19710
$$ 826370 446834 421151 524186 635826 526276 500815 485341 408523 566108 685818
18358F85818j31763j13023L17494B26312M28195r4161j50430L54854o0536J02716
$$ 685818 554055 441032 758526 226312 654507 560346 409916 764770 704234 806950
18348H06950k74273K12830M037j69582l1724J22891l7592Q2386j07348k52134
$$ 806950 532677 745507 749544 579962 548238 671129 633537 715923 608575 356441
18338C56441J14253J25872j85008k0566L63539C24534J04178J11069M892n4635
$$ 356441 470694 596566 411558 390992 754531 324534 428712 539781 544673 490038
18328D90038j54119J71445J62698k5156l00767J16988K19532q2281p4159J50982
$$ 490038 335919 507364 670062 644906 344139 461127 680659 598378 524219 675201
18318F75201J28022k99455K31290j47235n9269J0708o0630J45247j31622L3242
$$ 675201 803223 503768 735058 587823 528554 539262 478632 623879 492257 525499
18308E25499J37822m0329k28979J15587M9340j50775j86780J34682J24219J07317
$$ 525499 663321 622992 394013 509600 558940 408165 221385 356067 480286 587603
18298E87603k68197R8282r3990K47443o8076m0726p5942o795j17544J16888j00203
$$ 587603 319406 417688 323698 571141 503065 462339 386397 379602 262058 378946 278743
18287B78743K41971j23885j04744J47119O7885k27007K81919j3244k34751K17231
$$ 278743 520714 396829 292085 439204 507089 280082 562001 548757 314006 531237
18277E31237n7643j12276j29856L38211n8660o0306O1150j18883J0329L11679
$$ 531237 473594 361318 231462 569673 511013 450707 511857 392974 403303 714982
18267G14982C27134J62323l9955N1151m1093J3426K44290k59376P3443K268r2923
$$ 714982 327134 489457 449502 500653 459560 472986 717276 457900 531343 533611 440688
18256D40688N9539L762p907j26113J83778O1597O2933j22366j39070J96177m1791
$$ 440688 500227 503989 496082 369969 553747 615344 678277 555911 416841 613018 571227
18245E71227n1395J65938l11671K26052l9439j58190j31074J29899J73163p4382
$$ 571227 519832 685770 374099 600151 560712 402522 271448 401347 574510 500128
18235E00128o3003P3616k4084N9013k3751j9002k20091L25436p7960J53267L3134
$$ 500128 437125 510741 486657 545670 521919 502917 282826 608262 530302 683569 716703
18224G16703l08087K83518l43841J01843N909L6685k0037o8480J40074k3591K8461
$$ 716703 408616 692134 348293 450136 456045 492730 472693 404213 544287 520696 549157
18213E49157B24470K91970j20164o0162J77278n7891K97362j05074j97266M254
$$ 549157 224470 516440 396276 336114 513392 455501 752863 647789 450523 454777
18203D54777J67214k76952L6757p340K67202j98479K04673n2311L2763o2365J9848
$$ 454777 621991 345039 381796 374456 641658 443179 647852 595541 628304 565939 585787
18192E85787Q8633o7142K0431j13966l8278Q0737J87504j29512k11330J59377
$$ 585787 674420 607278 627709 513743 475465 556202 743706 614194 402864 562241
18182E62241j49856J24680n4040J43461k39494m9633O8992K14430r4133n5257
$$ 562241 412385 537065 483025 626486 386992 337359 406351 620781 526648 471391
18172D71391m70M7586k16103K57439J34308J0034j89191N3057p2005l1638Q3588
$$ 471391 470921 518507 302404 559843 694151 704185 514994 568051 496046 464408 547996
18161E47996l7330J18779k97694J97920J16582j68537j85927K33012J26498q9392
$$ 547996 510666 629445 331751 529671 646253 477716 291789 524801 651299 561907
18151E61907J02633j41377m4275k7390j33291R0231J82208k31838M05589k85052
$$ 561907 664540 523163 478888 451498 318207 408438 590646 358808 764397 479345
18141D79345K85259k42742j60808L4870J18832j80899M63218k89380k28961K59914
$$ 479345 764604 521862 361054 395924 514756 333857 797075 507695 278734 538648
18131E38648J8022N1581O5737j69508J16026j85289J019J79998j5513r2601J32997
$$ 538648 556670 608251 673988 504480 620506 435217 436236 616234 600721 508120 641117
18120F41117j33820J42034q953K616j04852n8637R5411p5964j19736J03911R6296
$$ 641117 507297 649331 640378 642994 538142 479505 574916 498952 379216 483127 579423
18109E79423J0061B43532K48503M5303k40861K01446M0578q5573J31854j45098
$$ 579423 589484 243532 492035 537338 296477 497923 538501 452928 584782 439684
18099D39684j14043J93671J00821j15073k0326J94447k00996M7158J9380k61089
$$ 439684 325641 519312 620133 505060 484734 679181 478185 525343 544723 283634
18089B83634J87479R8451j46442j01094J54368L8337J16698j59571j33696Q18
$$ 283634 471113 569564 423122 322028 476396 514733 631431 471860 338164 338982
18079C38982M5883J87719o3310J811q1154p0554j11312K34084m8945P0614J0015
$$ 338982 384865 572584 509274 511085 429931 359377 248065 482149 433204 503818 513833
18068E13833K0359k14457J92048J30169j29362J10869j76826J13802B07326K03987
$$ 513833 534192 319735 511783 641952 512590 623459 446633 560435 207326 411313
18058D11313r7968A38790K20781j2829J00131J83747m7682K5430B45247K52368
$$ 411313 313345 138790 359571 346742 446873 630620 582938 608368 245247 497615
18048D97615r2427k9462J98876J3668j36137P6377j13794Q6586l6518J05156k24940
$$ 497615 405188 375726 574602 588270 452133 528510 414716 501302 464784 569940 345000
18037C45000J17627k9930J18321p108q0571j15830j21975L15527j82301J35810
$$ 345000 462627 432697 551018 543910 463339 347509 225534 541061 358760 494570
18027D94570O5655k22610n9111J06656m304j01643J01412J75757p8545j4180j23285
$$ 494570 560225 337615 278504 385160 380856 279213 380625 556382 477837 463657 340372
18016C40372O0517j978j14127J46514O6410k23082J90344j75635j02621L95448
$$ 340372 400889 398911 284784 431298 497708 274626 464970 289335 186714 582162
18006E82162j44103R1554j97230j06410K011M56866n9331j1948k7909k66677K60311
$$ 582162 438059 529613 332383 225973 227984 684850 625519 613571 585662 318985 579296
17995E79296m0340k14399r7944K34481o6984p0728K18747j0283p5434p0536K6605
$$ 579296 538956 324557 226613 461094 394110 323382 542129 531846 456412 385876 412481
17984D12481J04443k53012N7623K61951O2128o8394k06878L0286l9439J52169
$$ 412481 516924 263912 321535 583486 645614 577220 370342 400628 361189 513358
17974E13358j41499k5152q9000K32542L2125m0775Q3595L5934q4858J40586j56692
$$ 513358 371859 346707 257707 490249 522374 481599 565194 601128 516270 656856 500164
17963E00164M5411j60408J77781Q4456J80034B29365K37603k08668L94718k81441
$$ 500164 545575 385167 562948 647404 827438 229365 466968 258300 653018 371577
17953C71577l8231K43152k79939Q4890L1082P2275R1093j07104K2901R9564j55818
$$ 371577 333346 576498 296559 381449 412531 484806 575899 468795 491696 591260 435442
17942D35442p611K52886l27376R0743o0531K67411L3544r7736m9365J59903j26181
$$ 435442 427831 680717 353341 444084 383553 650964 684508 586772 537407 697310 571129
17931E71129r1019j51236K96560j28038N4477R9931L1461k96766L6991J31738
$$ 571129 480110 328874 625434 497396 551873 651804 683265 386499 423490 555228
17921E55228o1481J43929j47437j35315J41578j27956J17738L1958m8912L400
$$ 555228 493747 637676 490239 354924 496502 368546 486284 518242 469330 472730
17911D72730M2160L9625k47544J48591j9728O8095j62953L60914M708k49477P3948
$$ 472730 514890 554515 306971 455562 435834 503929 340976 701890 706598 457121 531069
17900E31069J23461q8490j22797Q7657M6719M2755M2738K3165r7381k1160J99082
$$ 531069 654530 566040 443243 530900 577619 620374 663112 686277 588896 567736 766818
17889G66818j84231k1016O6588L1782Q367Q1043r5498N6049C48782K78992k82022
$$ 766818 582587 561571 628159 659941 668308 749351 653853 709902 348782 627774 345752
17878C45752K28410K68241k24492K40174j41990p4920r4636Q9415J00123P0754
$$ 345752 574162 842403 617911 858085 716095 641175 546539 635954 736077 806831
17868H06831j64947l12782J91113R5135j6411O3915j68453L8548Q0759o3999J52733
$$ 806831 641884 329102 520215 615350 598939 662854 494401 532949 613708 549709 702442
17857G02442M455n2289m8964j46628K16593L0764j89863N3358J06061j88495J17706
$$ 702442 706897 654608 605644 459016 675609 706373 516510 569868 675929 487434 605140
17846F05140r8831J59690n1588o4847J44843l8543J2695j37601L47735l20792
$$ 605140 506309 665999 614411 549564 694407 655864 668559 530958 878693 557901
17836E57901Q3171k72502K75364q345J08324k25942K22915P8900j58018j91803
$$ 557901 641072 368570 643934 635589 743913 517971 740886 819786 661768 469965
17826D69965J09336l4496Q8104L3834Q2152k24243J89761j50874J63921j73935
$$ 469965 579301 544805 632909 666743 748895 524652 714413 563539 727460 553525
17816E53525K52335j33519M52690k10103M4234p4811K5560k63750L01933j99586
$$ 553525 805860 672341 1125031 914928 959162 884351 909911 646161 948094 748508
17806G48508J12885N4797j81311n1265K639J40284l3373M0327J03000K08181j24827
$$ 748508 861393 916190 734879 683614 686253 826537 793164 833491 936491 1144672 1019845
17795A019845j86269j40884P6550k9017J32899l67761L20690l33301J16387N9383
$$ 1019845 833576 692692 769242 740225 873124 505363 826053 492752 609139 668522
17785F68522J04038k5439j25120K5112o5405j16957L45776k35647n2851J16116
$$ 668522 772560 747121 622001 647113 581708 464751 810527 574880 522029 638145
17775F38145J297K61181m47385n330Q3429J82003k26838O9903n5649K21618j35579
$$ 638145 639442 900623 453238 447908 531337 713340 486502 556405 500756 722374 586795
17764E86795L6770j60323K55486j20709N3574k11014K26157K2325j61847P41J02131
$$ 586795 623565 463242 718728 598019 651593 440579 666736 689061 527214 527955 630086
17753F30086o0745J67637k93786J91952j39183n4566K32747k6441j87911J23633
$$ 630086 569341 736978 443192 635144 495961 441395 674142 647701 459790 583423
17743E83423N1421j3920r2298o5457j3158m641K00098k8898j01542N5065o154
$$ 583423 634844 620924 528626 463169 450011 445370 645468 616570 515028 570093 563939
17732E63939K68155j80138j56843j19040L02311l7106K4816k59757L89243l4093
$$ 563939 832094 651956 495113 376073 678384 641278 666094 406337 795580 761487
17722G61487l32067K03313j25894K35081k77293m0591K53082k27968K08370K319
$$ 761487 429420 632733 506839 741920 464627 424036 677118 449150 657520 659839
17712F59839k39853J93924j60594q7294K30933j97341q007L58096j85471Q2430
$$ 659839 419986 613910 453316 366022 596955 399614 391607 749703 564232 646662
17702F46662o4595n2041J02786Q8269j59765N7368J59608q4562k83998K87068
$$ 646662 582067 530026 632812 721081 561316 618684 778292 693730 409732 696800
17692F96800j654j42581P8259K5375M6272q101L93j19284J17463k21929M5221
$$ 696800 695146 552565 630824 656199 702471 694370 694763 575479 692942 471013 516234
17681E16234P4498n3929k6932K27796j95802K60331j64086j75295J32414M9911
$$ 516234 590732 536803 509871 737667 541865 802196 638110 462815 595229 645140
17671F45140j58542J6555L28157j09733l32255R2670K56105r7314K57235k97089
$$ 645140 486598 503153 831310 721577 389322 481992 738097 640783 898018 600929
17661F00929J04253j2057J62139k30579k42957L21163N2133j0198J45536o3426
$$ 600929 705182 693125 855264 624685 381728 702891 755024 744826 890362 826936
17651H26936j75140J79299r5448J39087k04612J61278J42183j68245K3193p2831
$$ 826936 651796 831095 735647 874734 670122 831400 973583 805338 828531 755700
17641G55700K17354j76494L27981q0348j15939j7597q8998K901J00884J8198L501
$$ 755700 973054 796560 1124541 1044193 928254 910657 821659 824560 925444 943642 947143
17630I47143j36888J34310j91478Q7363R3513J68267N9607p291l08328J27050
$$ 947143 810255 944565 753087 840450 933963 1102230 1161837 1154546 846218 973268
17620I73268J87903k35019K97177j07862q2801J75032L7041k87756J98359o133
$$ 973268 1161171 926152 1223329 1115467 1032666 1207698 1244739 956983 1155342 1149209
17610A149209M6615J99j05212N370J71069l9247J00742K4323k68265q0371J14092
$$ 1149209 1195824 1196023 1090811 1096181 1267250 1228003 1328745 1353068 1084803 1004432 1118524
17599A118524k3971J10481m2236M1478k5926j37827J61790q1778L04159l33008
$$ 1118524 1094553 1205034 1162798 1204276 1178350 1040523 1202313 1120535 1424694 1091686
17589A091686J32802R8380j40958k97537K11237J24031J245O7821j49138N8636
$$ 1091686 1224488 1322868 1181910 884373 1095610 1219641 1220886 1288707 1139569 1198205
17579A198205K59400j68475r1539J57310j11109K17751J70851j26079j17962j10994
$$ 1198205 1457605 1289130 1197591 1354901 1243792 1461543 1632394 1506315 1388353 1277359
17569A277359J18589j53758N6968r4946j61074P0074K7462p8247J50117j67651
$$ 1277359 1395948 1242190 1299158 1204212 1043138 1113212 1140674 1062427 1212544 1044893
17559A044893M8528j42110N939J54575j79j35672K05467j80664K64547k51134
$$ 1044893 1093421 951311 957250 1111825 1111646 975974 1181441 1000777 1265324 1014190
17549A014190J26051L44872k65925q0039J48732Q8204N2149j63195J55799R1333
$$ 1014190 1140241 1485113 1219188 1139149 1287881 1376085 1428234 1265039 1420838 1512171
17539A512171k61680L94149m59164J56491j31343R2712l8235j68583J44614J85080
$$ 1512171 1250491 1644640 1185476 1341967 1210624 1303336 1265101 1096518 1241132 1426212
17529A426212n0582r9384j5294k4775J69345k71986K54660N2257j91558j33089
$$ 1426212 1375630 1276246 1260952 1236177 1405522 1133536 1388196 1440453 1248895 1115806
17519A115806K24028k11138J53689J06643L30216J17376j31880l9307L42545J58548
$$ 1115806 1339834 1128696 1282385 1389028 1719244 1836620 1704740 1665433 2007978 2166526
17509B166526n781P3402R3887o6306J64434j64151J3341K13004l17269J64074
$$ 2166526 2160745 2234147 2328034 2261728 2426162 2262011 2275352 2488356 2171087 2335161
17499B335161J02073N2129L84203k81077N76396N74255R5111M59264L97803N42526
$$ 2335161 2437234 2489363 2873566 2592489 3168885 3743140 3838251 4297515 4695318 5237844
17489E237844R09385R48440J714763L258618N342621Q943348J1880397J3172243
$$ 5237844 6147229 7095669 8810432 12069050 17411671 26355019 38235416 51407659
17481E1407659J1518659R260050O222222L403344R83678k603654o909138j0846836
$$ 51407659 62926318 72186368 78408590 81811934 82795612 80191958 73282820 62435984
17473F2435984j2942139j1713023p402636k155244L873296Q538003J1142180J1635211
$$ 62435984 49493845 37780822 30378186 28222942 32096238 40634241 51776421 63411632
17465F3411632R220382O273541L720259O62034k286024n932633j0464733j3889057
$$ 63411632 72632014 78905555 82625814 83287848 81001824 75069191 64604458 50715401
17457E0715401j4466684j1920477q094381n115333k921247j786557j074929p42035
$$ 50715401 36248717 24328240 16233859 11118526 8197279 6410722 5335793 4593758
17449D593758n75807k88769m49690K82231r8236j44448q5336P07K72442k30953
$$ 4593758 4017951 3729182 3279492 3561723 3463487 3319039 3233703 3234410 3506852 3275899
17439C275899R9937k10602k05573j13812k20862j0031o0041J47908J00658K8665
$$ 3275899 3375836 3165234 2959661 2845849 2624987 2614956 2554915 2702823 2803481 2832146
17429B832146j31383L89587j86314j05947J12916Q8777o92210q8696O2992l74093
$$ 2832146 2700763 3090350 2904036 2798089 2911005 2999782 2307572 2218876 2281868 1907775
17419A907775J06517J1132l18429K40083O8759J878R2892k86206M13J27509j67546
$$ 1907775 2014292 2025424 1706995 1947078 2015837 2017715 2110607 1824401 1824814 1952323 1784777
17408A784777J63267J08865n7331j2701J55968m6504L26984J031J28027M6577
$$ 1784777 1948044 2056909 1999578 1986877 2142845 2096341 2423325 2424356 2552383 2598960
17398B598960J09346K37986P0279J28830L96378K45622L69630K08800M66597N37897
$$ 2598960 2708306 2946292 3016571 3145401 3541779 3787401 4157031 4365831 4832428 5370325
17388E370325M65735N11683j19497M88966j3617L8890l01581k93845k33865j05554
$$ 5370325 5836060 6347743 6228246 6717212 6703595 6742485 6440904 6147059 5913194 5807640
17378E807640r8674m37359q8683L11777J10184j55314L83844R2529L12595N06215
$$ 5807640 5708966 5271607 5182924 5494701 5604885 5449571 5833415 5925944 6238539 6744754
17368F744754M67842j6338L27427k3194K05041j47506k24862k71901j23237r3961
$$ 6744754 7212596 7196258 7523685 7500491 7705532 7558026 7333164 7061263 6938026 6844065
17358F844065k07124K22187l60737L53337K51046L46144M06714M56283M13947
$$ 6844065 6636941 6859128 6498391 6851728 7102774 7448918 7855632 8311915 8725862
17349H725862Q06408O25382M94524N09109L76997Q41552J72209R6076Q7731j88907
$$ 8725862 9532270 10157652 10652176 11161285 11538282 12379834 12552043 12648119 12735850 12546943
17339A2546943l28577n28101k83326m99696l94101K19011o45712L94550j03497
$$ 12546943 12218366 11690265 11406939 10907243 10513142 10732153 10086441 10480991 10377494
17330A0377494N02973L05750L66576J95076K837L25254J30918j12391R8995k42668
$$ 10377494 10880467 11186217 11552793 11747869 11750706 12075960 12206878 12094487 12193482 11950814
17320A1950814j63189m22811p5331m18070m96650J02504n10435k10732k16896
$$ 11950814 11787625 11364814 11289483 10871413 10374763 10477267 9966832 9756100 9539204
17311I539204L8270k85203L31872J44819R1906O79687O1428N09189K51439K5625
$$ 9539204 9577474 9292271 9624143 9768962 9860868 10540555 10601983 11111172 11362611 11388236
17301A1388236k1449J80453k06936l8384m39032k25485n62898j98857l69839o2966
$$ 11388236 11366787 11547240 11340304 11301920 10862888 10637403 10074505 9875648 9505809 9442843
17291I442843k6102N4063L5791K11498L37416L06777j30606P6296R9649l96511
$$ 9442843 9416741 9470804 9506595 9718093 10055509 10362286 10231680 10307976 10407625 10011114
17281A0011114k00965n29134n44454m37297r68099n38645m81022p66342l04621
$$ 10011114 9810149 9281015 8736561 8299264 7331165 6792520 6311498 5545156 5240535
17272E240535k59279n63003k49619N5116j21440j85235j71268j24259k80660P4171
$$ 5240535 4981256 4418253 4168634 4223750 4102310 3917075 3745807 3621548 3340888 3415059
17262C415059K50946l11491K0287k9885o2451m2342k2854k31304r8913m5830j9339
$$ 3415059 3666005 3354514 3374801 3344916 3282465 3240123 3217269 2985965 2887052 2841222 2821883
17251B821883j59377Q0915J197N5511j29406J29145l20891K40342k76420K25200
$$ 2821883 2662506 2743421 2744618 2800129 2670723 2799868 2478977 2719319 2442899 2668099
17241B668099q5338r0811J45649j80501j8142Q3353Q4062j83828N7395k08298
$$ 2668099 2582761 2491950 2637599 2457098 2438956 2522309 2606371 2422543 2479938 2271640
17231B271640J68883l09579J67509n4785M7814q7207J16557m2649j7379J29101
$$ 2271640 2440523 2130944 2298453 2243668 2291482 2204275 2320832 2278183 2260804 2389905
17221B389905K6522l5207L4591J14485k78589K19778k90931l2925L92352J3639
$$ 2389905 2416427 2381220 2415811 2530296 2251707 2471485 2180554 2147629 2539981 2553620
17211B553620j38883J78098k46369j05058L8459L71228k20936K79832o6822m2052
$$ 2553620 2414737 2592835 2346466 2241408 2279867 2651095 2430159 2709991 2643169 2601117
17201B601117j63690k15441J21557j2885j96188N1848k37886K2135p8265j20974
$$ 2601117 2437427 2221986 2343543 2330658 2134470 2186318 1948432 1970567 1892302 1771328
17191A771328M6510k5292j48163M9594M6973l46171O4101J36293j0640O4411J1795
$$ 1771328 1817838 1792546 1644383 1693977 1740950 1394779 1458880 1595173 1584533 1648944 1660739
17180A660739R1393j86965k09174M1432l242J48769k79063K81265O1115r0245
$$ 1660739 1752132 1565167 1355993 1397425 1394183 1542952 1263889 1545154 1606269 1516024
17170A516024J72398o9302J73091k5815j02200k05857K61704j20256J50526J2295
$$ 1516024 1688422 1619120 1792211 1766396 1664196 1458339 1720043 1599787 1750313 1762608
17160A762608n8400j70288L03749Q1907q0179R5075O6357j20561j61858j0400
$$ 1762608 1704208 1533920 1837669 1919576 1839397 1934472 2000829 1880268 1718410 1708010
17150A708010J90563j49478L53837k83299P1877j15257R288J00220j2336Q9158
$$ 1708010 1898573 1749095 2102932 1819633 1891510 1776253 1785541 1885761 1873425 1962583
17140A962583r6429J72906J01896j28185J49578j46194P1276l2050k45854K30245
$$ 1962583 1866154 2039060 2140956 2012771 2162349 2016155 2087431 2055381 1809527 2039772
17130B039772m07418L23672j37009J57107l6006K63490j80268O2288J82025k3122
$$ 2039772 1632354 1956026 1819017 1976124 1940118 2203608 2023340 2085628 2267653 2244531
17120B244531j10030K57820j56130L5561j64282P9655J9564J92842Q1743Q2430
$$ 2244531 2134501 2392321 2236191 2271752 2107470 2187125 2206689 2399531 2481274 2563704
17110B563704L19279J44316k58435K99109M50011j96834m7370k01550j26270j54489
$$ 2563704 2882983 3027299 2768864 3067973 3517984 3321150 3273780 3072230 2945960 2791471
17100B791471O3554m80364r8083m7555j81713r7718j89852N0134l18753j13395
$$ 2791471 2855025 2374661 2276578 2229023 2047310 1949592 1759740 1809874 1491121 1377726
17090A377726j24442n1917j57251K24560k50075q342J74197K9500N4410j60701
$$ 1377726 1253284 1201367 1044116 1268676 1018601 1010259 1184456 1213956 1268366 1107665
17080A107665N1141O8555Q5092m28115K49195J04074j85526J9769L29586k19741
$$ 1107665 1158806 1227361 1312453 884338 1133533 1237607 1052081 1071850 1401436 1181695
17070A181695j64783K28074P30o3608q5545o1307L05109k29516J14728j36832
$$ 1181695 1016912 1244986 1245716 1182108 1096563 1035256 1340365 1110849 1225577 1088745
17060A088745J47680K03104q454L0462J76907J53098M56735J44970R0913K92752
$$ 1088745 1236425 1439529 1431075 1461537 1638444 1791542 2248277 2393247 2484160 2776912
17050B776912K61000N5234J39564l7713J2079J78251j40293J43608j05867M1891
$$ 2776912 3037912 3093146 3232710 3194997 3207076 3385327 3245034 3388642 3282775 3324666
17040C324666J03256j714l3575o8877J58492l40821k46151j4498k51691k51078
$$ 3324666 3427922 3426208 3392633 3323756 3482248 3141427 2895276 2880778 2629087 2378009
17030B378009l11467O4810m23685J8730k03167P3895J16285M7770p7064l0214
$$ 2378009 2066542 2131352 1707667 1726397 1523230 1597125 1713410 1761180 1684116 1653902
17020A653902l86068Q3472k4698j77614j81491M9878m7034J0585M9057j0602o8316
$$ 1653902 1267834 1351306 1326608 1148994 967503 1017381 970347 980932 1029989 1019387 951071
17009I51071K97590k91967K59966j77661J21474o8109j49909O0070j24564K26305
$$ 951071 1248661 956694 1216660 1038999 1160473 1092364 942455 1002525 877961 1104266
16999A104266p8629R9124R2879q3642p5438N0673j47754n7681K32686Q6028q0768
$$ 1104266 1025637 1124761 1217640 1133998 1058560 1109233 961479 903798 1136484 1222512 1141744
16988A141744j09217R8788P3566k45618l4774K88308L6881k9698J7750J80796
$$ 1141744 1032527 1131315 1204881 959263 924489 1212797 1249678 1219980 1237730 1418526
16978A418526k72358K3405N0310P1388J05107Q102K24707j21059P4826j029J41517
$$ 1418526 1146168 1169573 1219883 1291271 1396378 1404480 1629187 1508128 1582954 1581925 1723442
16967A723442k08157L32755J44043P8680k8180j18057J71986J98555J87062L5915
$$ 1723442 1515285 1848040 1992083 2070763 2042583 1924526 2096512 2295067 2482129 2518044
16957B518044Q9125P0257q2958j52450J07265j01088J96509j53098l65523J46801
$$ 2518044 2607169 2677426 2594468 2442018 2549283 2448195 2644704 2491606 2126083 2272884
16947B272884Q5007k42229o2723q2542l08775p6782P6989j21390r6382j30047
$$ 2272884 2357891 2115662 2052939 1970397 1661622 1584840 1661829 1540439 1444057 1314010
16937A314010n4238p8896K63432k17914k6810j08391j16007J99173k36703J43914
$$ 1314010 1259772 1180876 1444308 1226394 1199584 1091193 975186 1174359 937656 1081570
16927A081570j3048M2388j30312J5899J13807j06778k53998L65538k85753K10313
$$ 1081570 1068522 1110910 980598 996497 1110304 1003526 749528 1115066 829313 1039626
16917A039626k82774J62836q1672J9981O2751r4792o9368j9887j4696n9137J20711
$$ 1039626 756852 919688 838016 857997 920748 825956 756588 736701 722005 662868 783579
16906G83579L5694L7219L2673n7734J8687j48294J70399J37503l00738L9191J67016
$$ 783579 819273 856492 889165 831431 850118 701824 872223 1009726 708988 748179 915195
16895I15195q1928k12722N2419K06449r7388p4256Q6995r773j04850Q3757k02297
$$ 915195 833267 620545 672964 879413 782025 707769 794764 784991 680141 763898 561601
16884E61601J2651J07923J1982J43580n397j19785j97665J62033j24920J4959
$$ 561601 574252 682175 694157 837737 832340 712555 514890 676923 552003 566962
16874E66962O4300K06667j60876K80924j51003j57864M9287J43540k60988J67239
$$ 566962 631262 837929 677053 957977 806974 649110 698397 841937 580949 748188
16864G48188k1321O5061j27412O837J3623N4010j56822M1163K85880k66342K15693
$$ 748188 726867 791928 664516 671353 684976 738986 582164 623327 909207 642865 858558
16853H58558K8625J69280l36988j71564K46295L5874K4727k9946j26542J85866
$$ 858558 887183 1056463 719475 547911 794206 830080 854807 824861 698319 884185
16843H84185j34931j95115J02765R9443j6839j53475J13522K45576k58618K22239
$$ 884185 749254 554139 656904 756347 739508 586033 699555 945131 686513 908752
16833I08752j1686n8024K2751J30634J75098l63969q0631N20845l40962J23377
$$ 908752 897066 839042 861793 992427 1167525 803556 722925 1243770 902808 1026185
16823A026185O8926J62334N3609J30509k12783Q2508P7975R6230L20243j56531
$$ 1026185 1095111 1257445 1311054 1441563 1228780 1311288 1389263 1485493 1805736 1649205
16813A649205r3407J24194J52215l56251L4062P5732J16663k6549k51817J68097
$$ 1649205 1555798 1679992 1832207 1475956 1510018 1585750 1702413 1675864 1424047 1592144
16803A592144j57422J6308L03990j16512J5326k08164k2572o7584q9990J55426
$$ 1592144 1434722 1451030 1755020 1638508 1653834 1445670 1423098 1355514 1265524 1420950
16793A420950k20438j01395K0068j49674j56270K7429O3942k91542L16178j55721
$$ 1420950 1200512 1099117 1119185 969511 813241 840670 904612 613070 929248 773527
16783G73527o1926J92532j66147k32172J23836J13236r2124J59326m7582k0514
$$ 773527 711601 904133 737986 505814 629650 742886 650762 810088 762506 741992
16773G41992L5278j60370O3404J5013M8588J47119k3725j74689K3679P0160p9646
$$ 741992 777270 616900 680304 695317 743905 891024 867299 692610 716289 786449 706803
16762G06803Q6203k58464J48326p4513O1693o7924q5334J28495K25080k99386
$$ 706803 793006 534542 682868 608355 670048 602124 516790 645285 870365 570979
16752E70979m949L11168j14637j55242Q3182p7900R6487j42564k2851K36864k10861
$$ 570979 566030 877198 762561 607319 690501 612601 709088 566524 543673 780537 569676
16741E69676J2873J0823Q4914p3751m2805J66570O37J73854l6249r5258j62153
$$ 569676 582549 593372 678286 604535 561730 728300 728937 902791 866542 771284 609131
16730F09131J9526P8266M9977j17813q8614Q015K38139K25065j25095k06473R7496
$$ 609131 628657 706923 756900 639087 550473 558488 796627 1021692 896597 690124 787620
16719G87620J93890j45919K37118j08449o355j57015L01943k02974O7526J29704
$$ 787620 981510 835591 1072709 964260 957905 800890 1102833 899859 967385 1097089
16709A097089m85056M42632n9578J88574r7011K80670R3206k0749Q9300Q7454
$$ 1097089 612033 1054665 995087 1183661 1086650 1367320 1460526 1439777 1529077 1616531
16699A616531P8772j20425L4218J06007k50014k42533N1475J92245l605K35935
$$ 1616531 1695303 1574878 1609096 1715103 1465089 1222556 1274031 1466276 1462671 1698606
16689A698606j89918K52729l74027K80427l89645L96469m10517p688m0384K38441
$$ 1698606 1508688 1761417 1387390 1667817 1278172 1674641 1264124 1256436 1216052 1454493
16679A454493k31112k35633j26081K30553k70839K58158k8933j23207K92461J04880
$$ 1454493 1223381 987748 861667 1092220 821381 1079539 1050606 927399 1219860 1324740
16669A324740l921k9669L06977j85123J39978k0317J17604j6460O3833k92340
$$ 1324740 1320819 1291150 1598127 1413004 1552982 1532665 1650269 1633809 1697642 1405302
16659A405302J62662n916L3094N7132J13982k12631M7147n5792j3000m0154k22163
$$ 1405302 1567964 1562048 1595142 1652274 1766256 1553625 1600772 1544980 1531980 1491826 1269663
16648A269663l8661J52105n67548J04600k22387j28058J01207J07355q1718r1168
$$ 1269663 1231002 1383107 815559 920159 697772 569714 670921 778276 696558 605390
16638F05390q3585P8855K86543l86045N9709J84120r0337Q3092r3975P1311r1093
$$ 605390 521805 600660 887203 501158 560867 744987 654650 737742 643767 715078 623985
16627F23985O0005j24128J63817j6430j65740m8038J28743k51876J54544J73704
$$ 623985 683990 559862 723679 707249 541509 493471 622214 370338 524882 698586
16617F98586j32099j9425l5905O7510K42136L2208k70252K06047j03513K0275
$$ 698586 566487 547062 511157 578667 820803 853011 582759 788806 685293 705568
16607G05568J46587j32341R1290j63159J02143K62695l00460J43568l3358p6491
$$ 705568 852155 719814 811104 647945 750088 1012783 712323 855891 822533 746042
16597G46042K56777l59147K53505J69744j51577J3089j16182n160k9343K02674
$$ 746042 1002819 643672 897177 1066921 915344 928433 812251 807091 777748 980422
16587I80422j98945J09112j95617K05675m02963L68495k48752K38402j56700k62758
$$ 980422 781477 890589 694972 900647 497684 866179 617427 855829 699129 436371
16577D36371M34743l83124J58976O4814k11521K21916B94361M02938k04240o8055
$$ 436371 871114 487990 646966 711780 500259 722175 294361 697299 493059 425004
16567D25004J08604r8211O3012A20839L25782O388J71629n3456j20390J76809
$$ 425004 533608 435397 498409 120839 446621 453009 624638 571182 450792 627601
16557F27601j42L291M1761j35959J47758m5315p490J90570k59164J27259o0301
$$ 627601 627459 630750 672511 536552 684310 638995 631505 822075 562911 690170 629869
16546F29869j49956O6833B47738N25K61552m0720B31579K26247j01221J6640L2670
$$ 629869 479913 546746 247738 248263 509815 469095 231579 457826 356605 373245 405915
16535D05915K06538k64109N8662Q8655k21400J26501j181j8214j56442M14711
$$ 405915 612453 348344 407006 495661 274261 400762 399581 381367 224925 639636
16525F39636j34590j77998k4238J9888P2837r0980K84786B2611J04236N0306J2454
$$ 639636 505046 327048 302810 322698 395535 304555 589341 22611 126847 177153 189607
16514A89607J32794A19506L20282A91635M33545j57113B27920K6707J40782O8600
$$ 189607 322401 119506 439788 191635 625180 468067 227920 254627 395409 464009
16504D64009o9596P2437o4658J40801M898J21841k26889L49013k30706J50696
$$ 464009 394413 466850 402192 542993 547891 669732 442843 791856 561150 711846
16494G11846o1133P206O8357L31719k76658j54756K24137o8727K2541J99949j62817
$$ 711846 650713 657919 726276 1057995 781337 626581 850718 781991 804532 1004481 841664
16483H41664l8861j48899o6388R1228L16l14839j74581L12619j41596m5855J89468
$$ 841664 802803 653904 587516 678744 679060 364221 189640 502259 360663 314808 504276
16472E04276j36956r7501l6955I0980L29149o6429Q1228K8472L4101K35986n996
$$ 504276 367320 269819 232864 90980 420129 353700 434928 463400 497501 733487 727491
16461G27491j90543L87508J10268j9408J57664M93502R0890J61178L53991o3527
$$ 727491 536948 924456 1034724 1015316 1172980 1666482 1757372 1918550 2272541 2209014
16451B209014M16075l08247K56250L782j40519N7844J28150J4794k95483L37611
$$ 2209014 2625089 2316842 2573092 2576874 2436355 2494199 2622349 2637143 2341660 2679271
16441B679271J89664o3466N42374J01838K13924O09517M58168K18985J33276K66051
$$ 2679271 2868935 2805469 3347843 3449681 3663605 4273122 4731290 4950275 5083551 5349602
16431E349602N94616K39323O76286R19816O05392J145006J135671J216221J393968
$$ 5349602 5944218 6183541 6859827 7779643 8385035 9530041 10665712 11881933 13275901
16422A3275901J631147J754852K168148K093350K033401K453343K856164K744270
$$ 13275901 14907048 16661900 18830048 20923398 22956799 25410142 28266306 31010576
16414C1010576K935280K616450L662184L380796M091668L653522L443913L108334
$$ 31010576 33945856 36562306 40224490 43605286 47696954 51350476 54794389 57902723
16406E7902723J828592P37599M46399n783k4063k25062k80649q69786j122742
$$ 57902723 59731315 60468914 60915313 60909530 60885467 60660405 60379756 59509970 58387228
16397E8387228j531913j759780j255097j202345l14748J627336N206484R473453
$$ 58387228 56855315 55095535 53840438 52638093 52323345 53950681 59157165 68630618
16389F8630618J3158996J3870034Q477936J114265m028603p691169r393139j1675185
$$ 68630618 81789614 95659648 104137584 105251849 101223246 93532077 84138938 72463753
16381G2463753j3308475j5691641j9338384B489155a4738157o257102L667504
$$ 72463753 59155278 43463637 24125253 2489155 -14738157 -20995259 -17327755
16374a7327755P802038a868135C461984K612482J252291r5299m78047r59519r74697
$$ -17327755 -9525717 -1868135 3461984 6074466 7326757 7231458 6753411 5793892 4819195
16365D819195j375011p33632p69867q74675k34287l22005k15299j13580e791A95665
$$ 4819195 3444184 2710552 1940685 1066010 831723 509718 294419 180839 -5791 195665
16354D30329J4497J17512L60677L06078M10576J42746M69168P6065O852J81743
$$ 430329 444826 562338 923015 1229093 1639669 1782415 2251583 2327648 2334500 2516243
16344B516243j38226j10031R4791o64775j55090k92837l24424k41215l19634H1975
$$ 2516243 2378017 2267986 2362777 1698002 1542912 1250075 925651 684436 364802 81975
16333A41351A3319a48307A28271h9842A30089J00113O3613P1464J89825k45912
$$ 141351 13319 -148307 128271 -89842 130089 230202 293815 365279 555104 309192
16323C09192J01932J1942L4786R771j55634A6498K14039L5468K52596A47047J24003
$$ 309192 411124 423066 457852 467623 311989 16498 230537 266005 518601 147047 271050
16312B71050O3428r5954J83262K43971j56864J3625R9067K43873j95098K13950
$$ 271050 334478 238524 421786 665757 508893 522518 621585 865458 670360 884310
16302H84310O0495j23880j2106J46825J10364k38303n4961j0725J29436J93627
$$ 884310 944805 820925 808819 955644 1066008 827705 772744 762019 891455 1085082
16292A085082m42390K7934p1916J29330j92163n2620D4940J58666R9243o201K04299
$$ 1085082 642692 670626 598710 728040 535877 483257 44940 203606 302849 296648 500947
16281E00947m6179M0328r2314R0279L03277N870j47478L18362J7019P5864J57544
$$ 500947 454768 495096 402782 493061 796338 802208 654730 973092 990111 1065975 1223519
16270A223519J01062M8204j11907J8025o2539K5932j69693j39117QM7506J23799
$$ 1223519 1324581 1372785 1260878 1278903 1216364 1242296 1072603 933486 933494 981000 1104799
16259A104799k13637P0516J56877k17597o3264J33850o1491J08705k41270J13608
$$ 1104799 891162 961678 1118555 900958 837694 971544 910053 1018758 777488 891096
16249H91096j09930N9192J08140K7864K50633r5981o982R1377q7666K08236k2545
$$ 891096 781166 840358 948498 976362 1226995 1131014 1124032 1215409 1127743 1335979 1313434
16238A313434m3235j16302J07536M0297j58202k88645m7322K16312l48444J10798
$$ 1313434 1270199 1153897 1261433 1301730 1143528 854883 807561 1023873 675429 786227
16228G86227j26455J71815j99332q9926J85770m9161J09291k36998j69538L27079
$$ 786227 659772 831587 632255 542329 728099 678938 788229 551231 381693 708772
16218G08772j28558J46199o027m2731q0031J42035L6456M1635k52504J61141J08917
$$ 708772 580214 726413 720386 677655 597624 739659 776115 817750 565246 726387 835304
16207H35304n1231n8055J33908j32926J20093k93086M79021k08127P8590N0502
$$ 835304 784073 726018 859926 727000 847093 554007 1033028 824901 903491 953993
16197I53993j86806N9473q8627m0146J59092P7544J46814j74984L3786k04585
$$ 953993 767187 826660 738033 697887 856979 934523 1081337 906353 940139 735554
16187G35554M41828m29025J91176J74526k14207l9117j01930j09190J37460q7182
$$ 735554 1177382 748357 939533 1114059 899852 860735 758805 649615 787075 699893
16177F99893q0910L34977j05810k56947J50405K6535J32303K4963N0312k18784
$$ 699893 618983 953960 848150 591203 741608 768143 900446 925409 975721 756937
16167G56937j67673L01520j59024M6726j16487P1681j07231K70296k10497n9959
$$ 756937 589264 890784 731760 778486 661999 733680 626449 896745 686248 626289
16157F26289J38299P8023k02948K01417m8305p0402j9350J67298K2726m3712J42794
$$ 626289 764588 842611 639663 841080 792775 722373 703023 870321 893047 849335 992129
16146I92129Q1285J43900m99099K84971k28998J87194k34050K05914l69053N60077
$$ 992129 1073414 1217314 718215 1003186 774188 961382 727332 933246 564193 1124270
16136A124270j91671j00436O7490j10557J70424j15690j3558k4338j6299Q3649
$$ 1124270 932599 832163 899653 789096 959520 843830 830272 805934 789635 873284
16126H73284K49733k01437q7639J93617j55109R3052K62208m88984O0201m9389
$$ 873284 1123017 921580 833941 1027558 872449 965501 1227709 738725 798926 749537
16116G49537J44677q3594K07312j93817m231L07986k60526j14254K00838j05701
$$ 749537 894214 810620 1017932 824115 819884 1127870 867344 753090 953928 848227
16106H48227N4725K03797k0376j98356K88257l21k89140J97621J00615j39438
$$ 848227 902952 1106749 1086373 888017 1176274 1175953 886813 1084434 1185049 1045611
16096A045611K47791k73677J83648j86013J29616j2654j38631J48232J68013l19254
$$ 1045611 1293402 1019725 1203373 1017360 1146976 1134322 995691 1143923 1311936 992682
16086I92682O6642j42391K93474j30890J86696p9036l4725j0124k1479J03269
$$ 992682 1059324 916933 1210407 1079517 1266213 1187177 1152452 1142328 1120849 1224118
16076A224118k43244N9440J66484j49061j06588M02345k56798q7331J39333R3838
$$ 1224118 980874 1040314 1206798 1057737 951149 1353494 1096696 1009365 1148698 1242536
16066A242536K9084o2886K21776k41308J53042k2806j60902K78410r7642j1592
$$ 1242536 1271620 1208734 1430510 1189202 1342244 1319438 1158536 1436946 1339304 1327712
16056A327712N6838k08844L46458R3257J25572j79643J91166j74331k49842J07765
$$ 1327712 1384550 1175706 1522164 1615421 1740993 1561350 1752516 1578185 1328343 1436108
16046A436108K40450j51529P3561J25563k41626j06843L01082p2222j89531L41225
$$ 1436108 1676558 1525029 1598590 1724153 1482527 1375684 1676766 1604544 1415013 1756238
16036A756238P7063k31784n7475p0123j24639L72973J5954r1081j8503K47845
$$ 1756238 1833301 1601517 1544042 1473919 1349280 1722253 1738207 1647126 1628623 1876468
16026A876468j12621J23100M2264o3669M154P756j40218N1426R5027J86164j45956
$$ 1876468 1763847 1886947 1929211 1865542 1869696 1877452 1737234 1788660 1883687 2069851 1923895
16015A923895L3517J35215j46514l9440K39469j26307l8443j4213J09786K1453
$$ 1923895 1957412 2092627 1946113 1906673 2146142 2019835 1981392 1967179 2076965 2098418
16005B098418j8860q4906n5763R6491m7850M409J26410j2270O6724n5425k69381
$$ 2098418 2079558 1994652 1938889 2035380 1987530 1991939 2118349 2106079 2172803 2117378 1847997
15994A847997K15871k32240K22827r7203L4618K4740R3981L361j6875r2602J39406
$$ 1847997 2063868 1831628 2054455 1957252 1991870 2016610 2110591 2113952 2097077 2004475 2143881
15983B143881J40563o5045k3375K15243k7188L8543p5339k28513L42499k37825
$$ 2143881 2284444 2219399 2196024 2411267 2384079 2422622 2347283 2118770 2461269 2223444
15973B223444L1607J759j66103L01693R0648m74810L19619j38924k7048L3925
$$ 2223444 2255051 2256810 2090707 2392400 2483048 2008238 2327857 2188933 2161885 2195810
15963B195810j38485K77378k13722m1206O7567j39490K87694l5741L6635O1596
$$ 2195810 2057325 2334703 2120981 2079775 2147342 2007852 2295546 2259805 2296440 2358036
15953B358036J6596j40046o2925K21882k25763N3171J28942R3421j20874k93355
$$ 2358036 2374632 2234586 2171661 2393543 2167780 2220951 2349893 2443314 2322440 2029085
15943B029085L73418j89369K14891l5378r3535R6762j6239K09162J05685j42106
$$ 2029085 2402503 2213134 2428025 2392647 2299112 2395874 2379635 2588797 2694482 2552376
15933B552376J19452o630O0069J9235L20402k65096J47658K12183J05268L9163
$$ 2552376 2671828 2665198 2725267 2744502 3064904 2799808 2947466 3159649 3264917 3304080
15923C304080k1224L92193Q2890K01387J85857N8103M98902M78974Q47525P47545
$$ 3304080 3282856 3675049 3757939 3959326 4145183 4203286 4702188 5181162 6028687 6776232
15913F776232R65061J376659K394498L372755N414222O305026Q658035R498064
$$ 6776232 7741293 9117952 11512450 14885205 20299427 26604453 35262488 44760552
15905D4760552Q990180P991877O313259M200041J177047j691139m824119p301613
$$ 44760552 53750732 61742609 68055868 72255909 73432956 71741817 66917698 59616085
15897E9616085r563482j0283900r510008p693020n882658m043375k807151k041847
$$ 59616085 50052603 39768703 30258695 22565675 16683017 12639642 9832491 7790644
15889G790644j139930q69784p10662n24593m53061l93843j51916m93527K02927
$$ 7790644 6650714 5780930 5070268 4545675 4092614 3698771 3546855 3053328 3256255
15880C256255o02572J22265j23995K4537j79553J11460l22872K92760j91299j1111
$$ 3256255 2653683 2775948 2651953 2676490 2496937 2608397 2285525 2578285 2386986 2375875
15870B375875J1752J57049j48943Q2857j31187K50860m8101j60362k14350J42482
$$ 2375875 2387627 2544676 2395733 2478590 2347403 2598263 2550162 2389800 2175450 2317932
15860B317932j09389M985M7067n711j31375M3138k9578O1726l2309q8334n335
$$ 2317932 2208543 2213528 2260595 2254884 2123509 2166647 2137069 2198795 2166486 2078152 2072817
15849B072817K54212O0819k26417k99463L95614m9485j40489l9518L50072j13789
$$ 2072817 2327029 2387848 2161431 1861968 2257582 2208097 2067608 2028090 2378162 2264373
15839B264373k11136O4629L23200r477j45545L36545k81448P5084N2301k54919
$$ 2264373 2053237 2117866 2441066 2431589 2286044 2622589 2341141 2416225 2468526 2213607
15829B213607M15963j19595n1527m42661J74263m5105N3339P595j81169R4412
$$ 2213607 2629570 2509975 2458448 2015787 2190050 2144945 2198284 2205879 2024710 2119122
15819B119122J16383j55207J9995j00450K07660j13813j6598J44795J3312J08030
$$ 2119122 2235505 2080298 2100293 1999843 2207503 2093690 2077092 2221887 2235199 2343229
15809B343229k99709M77462j34325j05540J00681j81989L7349R4808K25706k0191
$$ 2343229 2043520 2520982 2386657 2281117 2381798 2199809 2237158 2331966 2557672 2537481
15799B537481j63158K22017K2263K51703K72267l780q943N3895M6429K28647k67947
$$ 2537481 2374323 2596340 2618603 2870306 3142573 3138793 3129850 3183745 3230174 3458821 3190874
15788C190874L32216k17462l7685q1214M72526k44312O45318j54723J44102M9836
$$ 3190874 3523090 3305628 3267943 3186729 3659255 3414943 4060261 3905538 4049640 4099476
15778D099476O2319M10035n9208Q146K2266J74248k17514n5150R156N812J23335
$$ 4099476 4161795 4571830 4512622 4520768 4543034 4717282 4499768 4444618 4453774 4459586 4582921
15767D582921k80536J75480K05118K6878J60374j70763M10819n7859j45093j7728
$$ 4582921 4302385 4477865 4682983 4709861 4870235 4699472 5110291 5052432 4907339 4889611
15757D889611o7404J83478l40948Q4803O5998m4370j1424J83619n7844J09705
$$ 4889611 4822207 5005685 4664737 4749540 4815538 4771168 4759744 4943363 4885519 4995224
15747D995224K6383J79318J15442J09850L06785K28179J58390K20918J6141L02207
$$ 4995224 5021607 5200925 5316367 5426217 5733002 5961181 6119571 6340489 6356630 6658837
15737F658837J25562J46801o1603J55631k24145J56086j18351J48963K28299J90283
$$ 6658837 6784399 6931200 6869597 7025228 6801083 6957169 6838818 6987781 7216080 7406363
15727G406363J25196m1988q1793J10389j59013j83152o70478R2596k36827K47568
$$ 7406363 7531559 7489571 7407778 7518167 7359154 7176002 6505524 6598120 6361293 6608861
15717F608861k46316j41027J21026P8807K04232k59776l34924P3353O0583k89971
$$ 6608861 6362545 6221518 6342544 6421351 6625583 6365807 6030883 6104236 6164819 5874848
15707E874848m1626j4893J15382M08993J3234K24031L71475k4462L64648j93689
$$ 5874848 5833222 5818329 5933711 6342704 6355938 6579969 6951444 6926982 7291630 7097941
15697G097941J89011M3496L06905N538j10538k3349K95121j09994k07113n7553
$$ 7097941 7286952 7330448 7637353 7642891 7532353 7509004 7804125 7694131 7487018 7429465
15687G429465J41858l43614o2960k7931j13861M1814M284M5841q4463J6398j72909
$$ 7429465 7571323 7227709 7164749 7136818 7022957 7064771 7069055 7114896 7030433 7046831 6873922
15676F873922K7883m98934l5825L6783j29189j43030Q9144L1309j00680J78908
$$ 6873922 6901805 6402871 6367046 6403829 6274640 6131610 6220754 6252063 6151383 6330291
15666F330291o2401J57540M6979K33135J85071P5548L99052J79303K35705N43933
$$ 6330291 6267890 6425430 6472409 6705544 6890615 6966163 7365215 7544518 7780223 8324156
15656H324156L11700M03362O13422L30885O07800M57446N88732N61061M18487
$$ 8324156 8635856 9039218 9652640 9983525 10591325 11048771 11637503 12198564 12617051
15647A2617051P65867M03003M63726O99678N53221Q73058O17742Q30729R49972
$$ 12617051 13382918 13785921 14249647 14949325 15502546 16375604 16993346 17824075 18774047
15638A8774047P64269J096482Q57968N73010L48515K58763j86174j29970o61391
$$ 18774047 19538316 20634798 21492766 22065776 22414291 22673054 22486880 22356910 21695519
15629B1695519J04761k84946o1522J34515K24418L3934l3254l1157j87573p00562
$$ 21695519 21800280 21515334 21453812 21588327 21812745 21846679 21813425 21782268 21594695 20894133
15619B0894133m32217j070347j087324j074969j013422r27552n17996o14502o15362
$$ 20894133 20461916 19391569 18304245 17229276 16215854 15288302 14770306 14155804 13540442
15610A3540442k07119l07757j40801l98275p27222k67358l79551l49966l26600
$$ 13540442 13333323 13025566 12884765 12486490 11759268 11491910 11112359 10762393 10435793
15601A0435793j37562l28610k80166K00020j71678J92870L2101L22920P49432
$$ 10435793 10298231 9969621 9689455 9889475 9717797 9910667 9942768 10265688 11015120
15592A1015120J134028J958382M934032J0326332J4864242J5104247J0252438
$$ 11015120 12149148 14107530 19041562 29367894 44232136 59336383 69588821
15585F9588821O756823M630902K624579L362k881840q138518j5958421j8448547
$$ 69588821 76345644 80976546 83601125 83604487 80722647 72584129 56625708 38177161
15577C8177161j3391723p352495m094816j971710j489088q40139n56878k00711
$$ 38177161 24785438 17432943 13338127 11366417 9877329 9037190 8480312 8279601
15569H279601J94405p6582J22428K03584M49033l12256K76122L88981K00812j08499
$$ 8279601 8474006 8397424 8519852 8723436 9172469 8860213 9136335 9525316 9726128 9617629
15559I617629O94557Q92045J702367L399041Q104553J4883341K0756077J8193270
$$ 9617629 10312186 11204231 12906598 16305639 24410192 39293533 60049610 78242880
15551G8242880J2026782P996239N180714K473427j033557n211138j3741981k2930564
$$ 78242880 90269662 98265901 103446615 105920042 104886485 99675347 85933366 63002802
15543F3002802k2599785j5251156q004142m367651k647820j621094j161754m90874
$$ 63002802 40403017 25151861 17147719 12780068 10132248 8511154 7349400 6858526
15535F858526m98375j75412k15304K43113m50096j25447m8922K2623n64492N1935
$$ 6858526 6360151 6184739 5969435 6212548 5762452 5637005 5588083 5610706 5046214 5098149
15525E098149l3647o21714J22332l73782m4482j71735j0642j10765J62651j19981
$$ 5098149 5064502 4442788 4565120 4191338 4146856 3975121 3964479 3853714 4016365 3896384
15515C896384M3378J61516J35994J44766L78998k7755Q2482q0506K28771l9303
$$ 3896384 3939762 4101278 4237272 4382038 4761036 4733281 4815763 4735257 4964028 4924725
15505D924725q8855L9428k13400m5464l1247k89764J19716j43491k35416K81954
$$ 4924725 4835870 4875298 4661898 4616434 4585187 4295423 4415139 4271648 4036232 4318186
15495D318186m0513J76659l10243L71447k04635K75493M3409R2391j52346M58194
$$ 4318186 4277673 4454332 4144089 4515536 4310901 4586394 4629803 4722194 4569848 5028042
15485E028042p796N54022K93360R8600K98245Q3939L07807j02243M4505j04318
$$ 5028042 5020246 5574268 5867628 5966228 6264473 6348412 6656219 6553976 6598481 6494163
15475F494163Q8409k32842K01117L20078M63743O69542J108302Q23097Q43278
$$ 6494163 6582572 6349730 6550847 6870925 7334668 8004210 9112512 9935609 10778887
15466A0778887M51017O36407J89210j34501k05598o92350n30920p29688k03604
$$ 10778887 11229904 11866311 12055521 11921020 11715422 11023072 10492152 9762464 9558860
15457I558860j9283N74379K69087P44545O80110O14650M45942M09586j74118n28643
$$ 9558860 9539577 10113956 10383043 11127588 11807698 12422348 12868290 13277876 13103758 12575115
15447A2575115l11540p62989q75538o76722l89416n1407j97728L49105J25891
$$ 12575115 12263575 11500586 10625048 9948326 9558910 9507503 9309775 9658880 9784771
15438I784771K47884J43295n2150j80474p9483k88316l11220p51216j65181o08787
$$ 9784771 10032655 10175950 10123800 9943326 9863843 9575527 9264307 8513091 8347910 7739123
15428G739123j30542l60630K79835o21429j54574p7349j03162k04671l79298L4248
$$ 7739123 7608581 7247951 7527786 6906357 6751783 6674434 6571272 6366601 5987303 6021551
15418F021551p8056m03191O4673r0995m59902L35341m05434q2157K86376k88619
$$ 6021551 5943495 5540304 5604977 5513982 5054080 5389421 4983987 4901830 5188206 4899587
15408D899587P4768J79584k64108O0732o020N5437J94661K38225j71785J76098
$$ 4899587 4974355 5153939 4889831 4950563 4944543 4999980 5194641 5432866 5261081 5437179
15398E437179L55553k02792J83727l07432m5620J51238j76484q971Q0188K4893
$$ 5437179 5792732 5589940 5773667 5466235 5420615 5571853 5395369 5386398 5466586 5491479
15388E491479k74493L7356R9327r1245R8880K1793J63703j92898K03102j27827
$$ 5491479 5216986 5254342 5353669 5262424 5361304 5383097 5546800 5353902 5557004 5429177
15378E429177K05905L1304j69399P559j43250J34932k6826j99129K57235P0066
$$ 5429177 5635082 5666386 5496987 5504546 5361296 5496228 5469402 5270273 5527508 5597574
15368E597574j8091J39663J49416k15694J10337K84307p4863K76561K72959j1402
$$ 5597574 5579483 5719146 5868562 5652868 5763205 6047512 5972649 6249210 6522169 6510767
15358F510767J26305n6025Q0520K52047J45887L08679N23283K74296N11593J074054
$$ 6510767 6637072 6581047 6661567 6913614 7059501 7368180 7891463 8165759 8677352 9751406
15348I751406J797799L852498O291306Q318229Q132309N602832L875683K878095
$$ 9751406 11549205 15401703 21693009 30011238 38143547 43746379 47622062 50500157
15340E0500157J325431j8309k139969n290361q511533q848645o138139l313793
$$ 50500157 51825588 51807279 49667310 44376949 35865416 27016771 20878632 17564839
15332A7564839j926884j168402j16325n35649j99765n11169n27774k11603m02683
$$ 17564839 15637955 14469553 14353228 13817579 13617814 13106645 12578871 12367268 11964585
15323A1964585j07854K46921J65304J57194K75976P22712O69756J351173K719035
$$ 11964585 11856731 12103652 12268956 12426150 12702126 13424838 14094594 15445767 18164802
15314A8164802M987020R119491J3324996J4594098J3227330J0302093O305843
$$ 18164802 23151822 32271313 45596309 60190407 73417737 83719830 90025673
15307I0025673L594635J080952k537349p427251j3152474j6464028j5520461j1535782
$$ 90025673 93620308 94701260 92163911 84736660 71584186 55120158 39599697 28063915
15299B8063915p198623l957705k080666j357246m01681n71491J79409m5076R9841
$$ 28063915 20865292 16907587 14826921 13469675 13067994 12496503 12675912 12630836 12730677
15290A2730677p5705m2159j44332J48879l07101K35653m32254R7558N37376P47304
$$ 12730677 12654972 12612813 12468481 12617360 12310259 12545912 12113658 12211216 12748592 13495896
15280A3495896J991990M060773O911747Q063169O842983M771320L544813J966118
$$ 13495896 15487886 19548659 26460406 34523575 41366558 46137878 49682691 51648809
15272E1648809P70370p31514k998529n814569q556718r054206n805332l115318
$$ 51648809 52419179 51687665 48689136 42874567 34317849 25263643 19458311 16342993
15264A6342993k389479j067728p84598r46696r03945n44704o47085j30884K69935
$$ 16342993 13953514 12885786 12101188 11154492 10250547 9705843 9058758 8927874 9197809
15255I197809j9113K32921R0945M90791L43547K66109K15077K1777j6935m51078
$$ 9197809 9178696 9411617 9502562 9993353 10336900 10603009 10818086 10839863 10822928 10371850
15245A0371850j33518j66744l01120l62971j49729p01710L466m11628J59317J39795
$$ 10371850 10238332 10071588 9770468 9407497 9257768 8556058 8559524 8147896 8307213 8447008
15235H447008O64452O78623N66678M09961P40947J85980P534j96283J26673m19979
$$ 8447008 9111460 9790083 10356761 10766722 11507669 11693649 11701183 11504900 11631573 11211594
15225A1211594l60357m25222n97889m41634l69700J39555Q1642L681J63598K32882
$$ 11211594 10851237 10426015 9828126 9386492 9016792 9156347 9237989 9241670 9405268 9638150
15215I638150K72599N17939N70870L50588J20543J46890j69802k74724o46154
$$ 9638150 9910749 10428688 10999558 11350146 11470689 11617579 11447777 11173053 10526899
15206A0526899q14454l82953q30219o23470n77145k10575j86007j01642q095k37665
$$ 10526899 9712445 9329492 8499273 7875803 7298658 7088083 6902076 6800434 6792339 6554674
15196F554674j24652j58783J69995l18059J28688J60788J96166l5381L6858J30186
$$ 6554674 6430022 6271239 6441234 6123175 6251863 6412651 6608817 6573436 6610294 6740480
15186F740480J22458J86677K14529k27904Q400J67224J22869J11210J79804Q9440
$$ 6740480 6862938 7049615 7264144 7036240 7044640 7211864 7334733 7445943 7625747 7715187
15176G715187K79192J29385J11008o6382m8988J59130k6849k7547k4276j26056
$$ 7715187 7994379 8123764 8234772 8168390 8119402 8278532 8251683 8224136 8199860 8073804
15166H073804j32350K4580J16432k0640K9719K03828k67131M13125O2547L33392
$$ 8073804 7941454 7966034 8082466 8061826 8091545 8295373 8028242 8441367 8503914 8837306
15156H837306j13899J65843L25480p1260k60919K31725l67538m1585j38242O6693
$$ 8837306 8723407 8889250 9214730 9143470 8882551 9114276 8746738 8705153 8566911 8633604
15146H633604k78145K15354j89993J66548q4831j40813L43676l36246Q8649k16742
$$ 8633604 8355459 8570813 8380820 8547368 8462537 8321724 8665400 8329154 8417803 8201061
15136H201061J3648M0871p7284K20825K4168j14904l59976M1285J52412P9985
$$ 8201061 8214709 8255580 8178296 8399121 8423289 8308385 7948409 7989694 8142106 8222091
15126H222091m625n7298o4723J6429P1102l05694P7376P3530j13984j7548j82952
$$ 8222091 8217466 8160168 8095445 8111874 8182976 7877282 7954658 8028188 7914204 7896656 7713704
15115G713704j70557L99232k67385p1949K06249J01801J45458J64756j56278K56662
$$ 7713704 7543147 7942379 7674994 7603045 7809294 7911095 8056553 8221309 8065031 8321693
15105H321693J85610J34237K21999R4492O98584j95996K46141L80329K42091J49909
$$ 8321693 8507303 8641540 8863539 8958031 9656615 9460619 9706760 10087089 10329180 10479089
15095A0479089K65467P90761j2063O69119J043340K286595K613145L423104K972926
$$ 10479089 10744556 11535317 11523254 12192373 13235713 15522308 18135453 21558557 24531483
15086B4531483K373285J537362J270770N63990j93706p66215j842352k701406
$$ 24531483 26904768 28442130 29712900 30276890 30083184 29316969 27474617 24773211
15078B4773211k245119j240009L78301J511197K577746L131947K287023J807993
$$ 24773211 22528092 21288083 21666384 23177581 25755327 28887274 31174297 32982290
15070C2982290J226927Q18188N3313o29261j400413j637749m54965K223506M186340
$$ 32982290 34209217 35027405 35080718 34451457 33051044 31413295 30958330 33181836 37368176
15061C7368176M351111K934895K651430K929200K313073K313457J388136j225504
$$ 37368176 41719287 44654182 47305612 50234812 52547885 54861342 56249478 55023974
15053E5023974l643095k918179k46796J370366L087424L179730K959914J687088
$$ 55023974 51380879 48462700 48215904 49586270 52673694 55853424 58813338 60500426
15045F0500426R18805R51186J321182J856843J374180p53280k904419l113110
$$ 60500426 61419231 62370417 63691599 65548442 66922622 66169342 63264923 60151813
15037F0151813k533313j387946j068581n19699q42346k54014J903577M479291
$$ 60151813 57618500 56230554 55161973 54642274 53799928 53545914 55449491 59928782
15029E9928782P274284Q408316Q281422P478162P252785O285560M667182K611409
$$ 59928782 67203066 75611382 83892804 91370966 98623751 104909311 109576493 112187902
15021A12187902m37559l469956n269320m386616l282498k498734j830369k468282
$$ 112187902 111750343 108280387 103011067 98624451 95341953 92843219 91012850 88544568
15013H8544568l168356l003373k620401k613252k709157l196358m794887n461715
$$ 88544568 85376212 82372839 79752438 77139186 74430029 71233671 66438784 60977069
15005F0977069n066587l846874k776846k067557q85124m20290J96817J555382
$$ 60977069 55910482 52063608 49286762 47219205 46334081 45913791 46110608 47665990
14997D7665990J811599J540873J383903P99837Q97138m32240r94778j955846k057538
$$ 47665990 49477589 51018462 52402365 53202202 54099340 53667100 52672322 50716476 48658938
14988D8658938k019934q29354L62626Q55181L20434K85734Q97409J204263M01393
$$ 48658938 46639004 45809650 46172276 47027457 47347891 47633625 48531034 49735297 50136690
14979E0136690j033254k200479l839561m075869l297473k680341k551307k187122
$$ 50136690 49103436 46902957 43063396 38987527 35690054 33009713 30458406 28271284
14971B8271284j885979j192301j93516R719L98097P80126N82846P40527N69680
$$ 28271284 26385305 25193004 24999488 25009207 25407304 26187430 26770276 27510803 28080483
14962B8080483P81902R32937J400037J969957K934059M421017O259151R617273
$$ 28080483 28862385 29795322 31195359 33165316 36099375 40520392 46779543 56396816
14954E6396816J3286035J8556861K3526716K7561342L0837085L5127120L6682375
$$ 56396816 69682851 88239712 111766428 139327770 170164855 205291975 241974350
14947B41974350L6205505L5599982L3141648K5931726J1712755r07421j0155618
$$ 241974350 278179855 313779837 346921485 372853211 384565966 383658545 373502927
14940C73502927j7787140k2997929k4545456k6989659l1419257l2643144k6223684
$$ 373502927 355715787 332717858 308172402 281182743 249763486 217120342 190896658
14933A90896658j6927873j0009129p919763r002823j1828185j3312305j2078084
$$ 190896658 173968785 163959656 156039893 147037070 135208885 121896580 109818496
14926A09818496j0668456q383265n775376k733734j232430j901576k344485k664894
$$ 109818496 99150040 90766775 84991399 82257665 81025235 79123659 76779174 74114280
14918G4114280k939939l335274m109200n865964r088515r966543r366606o295740
$$ 74114280 71174341 67839067 63729867 57863903 48775388 38808845 29442239 23146499
14910B3146499m080606k631945j788463q13181n17291m40526N80446M22987O10675
$$ 23146499 19065893 16433948 14645485 13832304 13315013 12874487 13454933 13877920 14488595
14901A4488595J202723J273873J475491J402702K312335L025913M857281N791908
$$ 14488595 15691318 16965191 18440682 19843384 22155719 25181632 30038913 35830821
14893C5830821N751031L843620K147133J083134K51559m76595k290500m757946
$$ 35830821 41581852 45425472 47572605 48655739 48907298 48430703 46140203 41382257
14885D1382257o887997p214163n487473l221628j812497j250395n20585q028L2637
$$ 41382257 34494260 27280097 21792624 18570996 16758499 15508104 14987519 14979491 15012128
14876A5012128N96862R66500J054175Q83753P49220J80063M32863J76025N76929
$$ 15012128 15608990 16575490 17629665 18513418 19262638 19442701 19875564 20051589 20628518
14867B0628518q4475k31189n52208m39664L32039J041446J828483L746994N898907
$$ 20628518 20544043 20312854 19760646 19320982 19653021 20694467 22522950 26269944 32168851
14858C2168851Q824906R526473J0888230J1370115J0499880Q867995N374934J865910
$$ 32168851 40993757 50520230 61408460 72778575 83278455 92146450 97521384 99387294
14850I9387294k488487o584536r753530j1119855j1758293j1757788j0563356
$$ 99387294 96898807 90314271 80560741 69440886 57682593 45924805 35361449
14843C5361449p691148m591173k975565j748601j216216n13232o81342o69429
$$ 35361449 27670301 23079128 20103563 18354962 17138746 16625514 15944172 15274743
14835A5274743l83209j76877L85287l67327J60281k23690L53461L99963O35594
$$ 15274743 14891534 14714657 15099944 14732617 14892898 14669208 15022669 15422632 16058226
14826A6058226O76459R87709R72298Q42759J733486K557277M819265P498079Q968858
$$ 16058226 16734685 17722394 18694692 19537451 21270937 23828214 28647479 36145558 45114416
14817D5114416Q609296O323706M174813K689696O23974j310769l875932p540413
$$ 45114416 53723712 60047418 64222231 66911927 67535901 66225132 62349200 54808787
14809E4808787j0183101j0891145q598816n806135k692600k130168j130428o09590
$$ 54808787 44625686 33734541 25135725 19329590 16636990 14506822 13376394 12766804
14801A2766804n77062k47576o64112k6376j58860j81093n99172m5034l46043p21097
$$ 12766804 12189742 11942166 11278054 11251678 11092818 10911725 10312553 10267519 9921476 9200379
14791I200379k48296p425k17354k14426l49032K69341j53692M05121K41337l6358
$$ 9200379 8952083 8944658 8727304 8512878 8163846 8433187 8279495 8684616 8925953 8889595
14781H889595L48650P97208O21946R67869Q83013N88482K36989L04867L655k20878
$$ 8889595 9238245 10035453 10657399 11625268 12508281 13096763 13333752 13638619 13642274 13421396
14771A3421396j95173j001661p09038j400425n11458m78756j87862k00830J82418
$$ 13421396 13226223 12224562 11515524 10115099 9603641 9124885 8937023 8736193 8918611
14762H918611j71289L53628L35098K10713Q8108M18228J60359L3126L11767k32132
$$ 8918611 8747322 9100950 9436048 9646761 9734869 10153097 10313456 10346582 10658349 10426217
14752A0426217M86233J68648J12805N162J36175P3261j98701M11196J05572O39644
$$ 10426217 10912450 11081098 11193903 11199065 11335240 11408501 11209800 11620996 11726568 12366212
14742A2366212P1869N56073N78466P53890P69466J639235K260379K627070L439871
$$ 12366212 12438081 12994154 13572620 14326510 15095976 16735211 18995590 21622660 25062531
14733B5062531N084455P951676J1996827J9205567K7806432L5044271L8204641
$$ 25062531 30146986 38098662 50095489 69301056 97107488 132151759 170356400
14726A70356400L7663349L2697765K3860886J4174061M381497p120905k1116461
$$ 170356400 208019749 240717514 264578400 278752461 283133958 276013053 254896592
14719B54896592l2954148l9615655m1698017l8013585k9584326k0292852j3187383
$$ 254896592 221942444 182326789 140628772 102615187 73030861 52738009 39550626
14712C9550626q602832n391442m066902l072386k107432j581502j077162q70590
$$ 39550626 30947794 25556352 21489450 18417064 16309632 14728130 13650968 12780378
14704A2780378q58121o70814j063200q70800n35399l08327l99565l07746l36171
$$ 12780378 11922257 11251443 10188243 9317443 8782044 8473717 8074152 7766406 7430235
14695G430235j49276l2166l60121J70151j9756j50384P8713K63152J43805K77244
$$ 7430235 7280959 7248793 6888672 7058823 7039067 6888683 6967396 7230548 7374353 7651597
14685G651597r3730j6998M29240M08891j19323L23583K9334L19690R08547P44815
$$ 7651597 7557867 7540869 7970109 8379000 8259677 8583260 8612594 8932284 9840831 10585646
14675A0585646P81480O73405M14991K78639j89512k03525m55460q27334r71872
$$ 10585646 11367126 12040531 12455522 12734161 12544649 12341124 11885664 11058330 10086458
14666A0086458j390680p31183n95498k42495k07774N096r9605m3030j8342r8887
$$ 10086458 8695778 7964595 7369097 7126602 6918828 6923924 6824319 6781289 6762947 6664060
14656F664060j92446n32224P6497k33862J9014j69482J34200J24282J62093K29057
$$ 6664060 6471614 5939390 6015887 5782025 5801039 5631557 5765757 5890039 6052132 6281189
14646F281189o8260o1899L96661K13256M8989L79344r6556L73969K73078O43788
$$ 6281189 6212929 6151030 6547691 6760947 6809936 7189280 7092724 7466693 7739771 8383559
14636H383559N15149P60316O59085M78275K36190k40237o5459m83184r36026j011475
$$ 8383559 8898708 9659024 10318109 10796384 11032574 10792337 10726878 10243694 9307668 8296193
14626H296193q77261j199897n36870o23823k72494O0097j20145j21883L9210K92720
$$ 8296193 7418932 6219035 5682165 5058342 4785848 4845945 4725800 4603917 4643127 4935847
14616D935847l8604l49943n6983P0267k01981j56085j25661k33844J88389k73253
$$ 4935847 4897243 4547300 4490317 4560584 4358603 4202518 4076857 3843013 4031402 3758149
14606C758149k64361l2145k8897k0556K04284J81861M69253M07509J103773P27164
$$ 3758149 3493788 3461643 3432746 3412190 3616474 3798335 4267588 4675097 5778870 6506034
14596F506034P93839M33097M25636m7367Q723m82950l36554j032372p74480q84140
$$ 6506034 7299873 7732970 8158606 8111239 8119962 7637012 7300458 6268086 5493606 4609466
14586D609466l49418m53025n695q9159j0986L80905l2770K0607R002P195m2618
$$ 4609466 4260048 3807023 3801328 3712169 3701183 4082088 4049318 4069925 4078927 4086122 4043504
14575D043504O9009L74108j10161l0684J50798J79588K29112J29517L07785M64827
$$ 4043504 4112513 4486621 4376460 4345776 4496574 4676162 4905274 5034791 5342576 5807403
14565E807403N96596M58228O12789Q82373J797989L414058O281416Q956314Q654169
$$ 5807403 6403999 6862227 7475016 8357389 10155378 13569436 19850852 28807166 37461335
14556C7461335P090520M371722L143251K002640P5632j508440m624501q572275
$$ 37461335 44551855 48923577 52066828 54069468 54145100 52636660 48012159 39439884
14548C9439884j0095074p500427l259722K1414M001627P646103R560847Q103245
$$ 39439884 29344810 21844383 18584661 18606075 22607702 30253805 39814652 47917897
14540D7917897N692990M143256K044636P60217j427041m231630q006332j0955929
$$ 47917897 53610887 57754143 59798779 60558996 59131955 54900325 46893993 35938064
14532C5938064j0263328o182342l566619j339452o85828q8341J22516J58359K84569
$$ 35938064 25674736 19492394 15925775 14586323 13900495 13812154 13934670 14093029 14377598
14523A4377598j23787j44543O33539J661235M760219N974847O115230M148625
$$ 14377598 14253811 14109268 14742807 16404042 21164261 27139108 33254338 37402963
14515C7402963K801462K279734J062993K71148j414013l244624o652767o140128
$$ 37402963 40204425 42484159 43547152 43818300 42404287 39159663 32506896 26366768
14507B6366768l490933r98926J427314L802195N930542O005669M472396K731961
$$ 26366768 22875835 21876909 23304223 27106418 33036960 39042629 43515025 46246986
14499D6246986J545240P26235m75597k015908l926392o319129p502408o112554
$$ 46246986 47792226 48518461 48042864 46026956 42100564 35781435 28279027 22166473
14491B2166473l730657k479291k033803j397466j260555j127127p17908j365960
$$ 22166473 18435816 15956525 13922722 12525256 11264701 10137574 9419666 8053706
14483H053706j359427q44228p60247j62410l74191R0060k09723J03490K3304m36871
$$ 8053706 6694279 5850051 5089804 4927394 4553203 4643263 4433540 4537030 4560334 4123463
14473D123463Q3948L70903K44430M55877R41615J93414M00745K55823K0215K45587
$$ 4123463 4207411 4578314 4822744 5278621 6220236 6413650 6814395 7070218 7090433 7336020
14463G336020l1710j73295k75868j90989J05771P09007O22529K65169K80890Q2142
$$ 7336020 7304310 7131015 6855147 6664158 6769929 7478936 8101465 8366634 8647524 8729666
14453H729666J85181l50941k86294o01423m46536q39986j1989K44683L17566M11628
$$ 8729666 8914847 8563906 8277612 7676189 7229653 6389667 6377678 6622361 6939927 7351555
14443G351555L56735O32696n0208M11461L12920j42080M6936L02947k68312L83550
$$ 7351555 7708290 8340986 8290778 8702239 9015159 8873079 8920015 9222962 8954650 9338200
14433I338200M1297M72723P56789J419050K663080M472634O100348O612890O349802
$$ 9338200 9379497 9852220 10609009 12028059 14691139 19163773 25264121 31877011 38226813
14424C8226813N242855L887179K501598J072626n33950l128103n318934o991099
$$ 38226813 43469668 47356847 49858445 50931071 50397121 47269018 41950084 34958985
14416C4958985p084430n826453m064280k868037k298890j612370p50153o84511
$$ 34958985 27874555 22048102 17983822 15115785 12816895 11204525 10454372 9769861
14408I769861m77077m77341J67590k39194J74370N7561k38814J24252m4305J39587
$$ 9769861 9292784 8815443 8983033 8743839 8918209 8975770 8736956 8861208 8816903 8956490
14398H956490o672R65236L81741J374489J991432L950149N996682Q511938J0711535
$$ 8956490 8949818 9915054 10296795 11671284 13662716 17612865 23609547 32121485 42833020
14389D2833020J1519073J0197643P992911N786374L285466N77541l301052o836908
$$ 42833020 54352093 64549736 72542647 78329021 81614487 82192028 78890976 72054068
14381G2054068j0627967j2151349j1332935r309977p003164m485680l098796k275998
$$ 72054068 61426101 49274752 37941817 28631840 21628676 17142996 14044200 11768202
14373A1768202j240069p83189m60793p50250M0627j29992j48565j71530k0315
$$ 11768202 10528133 9744944 9284151 8533901 8574528 8444536 8295971 8124441 8104126
14364H104126r9814J20138J40822J50833L04824P46077J141922J302587K483473
$$ 8104126 8004312 8124450 8265272 8416105 8720929 9467006 10608928 11911515 14394988
14355A4394988K823842M207591M929747N077040M976256M272191L268190K153988
$$ 14394988 17218830 21426421 26356168 31433208 36409464 40681655 43949845 46103833
14347D6103833J893287O19515M66681N37625J669344M062310O787668R099061
$$ 46103833 47997120 48616635 49083316 49620941 51290285 55352595 62140263 71239324
14339G1239324Q685928P624659O906416O158203L738612M27627m551655r260918
$$ 71239324 79925252 87549911 94456327 100614530 104353142 104780769 100229114 90968196
14331I0968196j2727672j3411818j1698252r539504q606626q220251o597143m382038
$$ 90968196 78240524 64828706 53130454 43590950 34984324 26764073 20166930 15784892
14323A5784892l068783j748225j524852j290866p85984r15924n01394l68658l92060
$$ 15784892 12716109 10967884 9443032 8152166 7366182 6450258 5948864 5580206 5188146
14314E188146k99926l43772j78043k53607r8039p0214k57556j20949Q6582k13699
$$ 5188146 4888220 4544448 4366405 4112798 4014759 3944545 3686989 3566040 3652622 3438923
14304C438923j33049p0591j99906j77311L8207L7007j54087k20693J00226j5997
$$ 3438923 3305874 3235283 3035377 2858066 2896273 2933280 2779193 2558500 2658726 2642729
14294B642729k4796k0423j09775k5249o7609J43890l3402L2467P1697j66491J2443
$$ 2642729 2617933 2597510 2487735 2462486 2394877 2538767 2505365 2537832 2609529 2443038 2455481
14283B455481k2781L8059O069J22240K4234J70682o8955O0017K39464Q6588r234
$$ 2455481 2432700 2470759 2476828 2599068 2623302 2793984 2725029 2785046 3024510 3111098 3101864
14272C101864L01601j56124n363K1293j28950j62149j16838j98776j26569J3070
$$ 3101864 3403465 3247341 3241978 3263271 3134321 2972172 2855334 2656558 2529989 2543059
14262B543059j34914K26989j08965k34914J16752k01724L0307j8113j11508j6468
$$ 2543059 2408145 2635134 2526169 2291255 2408007 2206283 2236590 2218477 2106969 2090501
14252B090501K47849k99665O4388p7917J48190j14603J45306p4098R1953k19318
$$ 2090501 2338350 2038685 2103073 2025156 2173346 2058743 2204049 2129951 2221904 2002586
14242B002586j80590K58477J53691k03134J51111K40370M0918M7653J71146M7083
$$ 2002586 1821996 2080473 2234164 2031030 2182141 2422511 2463429 2511082 2682228 2729311
14232B729311l35186K13484k84217j15948n6444j84918j73974R7363r5194K9847
$$ 2729311 2394125 2607609 2323392 2207444 2151000 1966082 1792108 1889471 1794277 1824124
14222A824124J54178j32970J30965J02085j0234q9998K11934L21338j96806K10541
$$ 1824124 1978302 1845332 1976297 2078382 2068148 1978150 2190084 2511422 2314616 2525157
14212B525157k0166K40169l13472O2091P17539P45762J99742M21662L80276m43128
$$ 2525157 2504991 2745160 2431688 2493779 3211318 3957080 4156822 4578484 4958760 4515632
14202D515632M8781J51129K00363n27132q74830j023523m06692r2100j34959L91773
$$ 4515632 4564413 4715542 4915905 4388773 3513943 2490420 2083728 1991628 1856669 2248442
14192B248442K4748j41204j52706K03257r5313j14869j11549K55342o4427o6045
$$ 2248442 2273190 2131986 1979280 2182537 2087224 1972355 1860806 2116148 2051721 1985676
14182A985676j63291j49042K33567L37705N1612J28849K91733Q2044J07005J82250
$$ 1985676 1822385 1673343 1906910 2244615 2296227 2425076 2716809 2798853 2905858 3088108
14172C088108l94016K31094k41333k40110l06163j24493j69686J81804l08579
$$ 3088108 2694092 2925186 2683853 2443743 2137580 2013087 1843401 2025205 1716626
14163A716626O0473J49097L4130L1441q0374j37178L10821L33797l02492L41502
$$ 1716626 1777099 1926196 1960326 1991767 1911393 1774215 2085036 2418833 2116341 2457843
14153B457843k57854K26252k50266L0975J53819j96063O0435K59014K4647J69439
$$ 2457843 2199989 2426241 2175975 2206950 2360769 2164706 2225141 2484155 2508802 2678241
14143B678241J39919L27411N90540P24374J149116J383321J071383R36586P26604
$$ 2678241 2818160 3145571 3736111 4460485 5609601 6992922 8064305 9000891 9727495
14134I727495L83349L50J64329p61201r06162j597047j254347j078894k82684
$$ 9727495 10110844 10111194 10275523 9514322 8608160 7011113 5756766 4677872 4395188
14125D395188o31235l08339o92280M03082J05525J43962J85825K74152J60858
$$ 4395188 3763953 3455614 2763334 3166416 3271941 3415903 3601728 3875880 4036738
14116D036738J64831J10968j72411k40236j9444n71964j89672r3466n05219P6063
$$ 4036738 4201569 4312537 4140126 3899890 3880446 3308482 3118810 3025344 2520125 2596188
14106B596188n0648k63730K53229j44486K52173m0855J47237L04246N52550L62929
$$ 2596188 2545540 2281810 2535039 2390553 2642726 2601871 2749108 3053354 3605904 3968833
14096C968833M08729N93796L48236J97322l0585K71172k43204o5514l68330n15439
$$ 3968833 4377562 4971358 5319594 5516916 5486331 5757503 5514299 5448785 5080455 4565016
14086D565016j68585K03513N59397P02926P28062K29066M89607N74832L92964
$$ 4565016 4396431 4599944 5159341 5862267 6590329 6819395 7309002 7883834 8276798
14077H276798O1381J94473N93438K8262M28322O47876J084458J613591K571069
$$ 8276798 8338179 8532652 9126090 9154352 9582674 10230550 11315008 12928599 15499668
14068A5499668L189657M480172O261287Q815583J1031772J2198518J2100351R822543
$$ 15499668 18689325 23169497 29430784 38246367 49278139 61476657 73577008 83399551
14060H3399551P801194M651597K426254p58400m711461r402901j3429220j4435836
$$ 83399551 91200745 95852342 98278596 97520196 92808735 83405834 69976614 55540778
14052E5540778j2556505j0050331p056236n333175l919693k601581j829518j104013
$$ 55540778 42984273 32933942 25877706 20544531 16624838 14023257 12193739 11089726
14044A1089726r20619q38987m18577l84682l48728k55076n85225r49060k94737
$$ 11089726 10169107 9330120 8911543 8526861 8178133 7923057 7337832 6388772 6094035
14035F094035o44548o64863k61757n45512l41671l4925p5768m40152L00663k05726
$$ 6094035 5449487 4784624 4522867 3977355 3635684 3600759 3524991 3084839 3385502 3179776
14025C179776r4273j83200j41834J10061k73127J15846j56182j09058j68940p375
$$ 3179776 3085503 2902303 2760469 2870530 2597403 2713249 2557067 2448009 2279069 2271694
14015B271694J66002p1248j78958J58206o1895n2761M0772p6476L56286m23637
$$ 2271694 2437696 2366448 2187490 2345696 2283801 2231040 2271812 2195336 2551622 2127985
14005B127985Q2907l42908K81962j10223m0540J33376J94823j03169K33417K9983
$$ 2127985 2210892 1867984 2149946 2039723 1999183 2132559 2327382 2224213 2457630 2487613
13995B487613J52657j45822K03040r5543N0961L97335K35235L93943O17396J188105
$$ 2487613 2640270 2494448 2697488 2601945 2652906 3050241 3285476 3679419 4296815 5484920
13985E484920J085558J048124J163485J000419R64986Q7510L31536l20184m58608
$$ 5484920 6570478 7618602 8782087 9782506 10747492 10835002 11166538 10846354 10387746
13976A0387746r47094j190390j464379j163793p59151o74293m44139k01568l63623
$$ 10387746 9440652 8250262 6785883 5622090 4862939 4188646 3744507 3542939 3179316
13967C179316J26837k32116K04302l51051K27392M9294k54853p736N408k50288
$$ 3179316 3306153 3074037 3278339 2927288 3154680 3203974 2949121 2941385 2946793 2696505
13957B696505l62212J10729j63309j9480Q7432j94035K1378J73592L31248J25795
$$ 2696505 2334293 2445022 2281713 2262233 2349665 2155630 2177008 2350600 2681848 2807643
13947B807643J81492Q0613K23742J83526L67415M65528J054831J824236K037899
$$ 2807643 2989135 3069748 3293490 3477016 3844431 4309959 5364790 7189026 9226925
13938I226925K516386L098334K708092K358773J897816M26111k14667r61326k319869
$$ 9226925 11743311 14841645 17549737 19908510 21806326 22232437 22017770 21056444 18736575
13929A8736575k766148l251542k514618l006735j956891j223380o67759m80115
$$ 18736575 15970427 12718885 10204267 7197532 5240641 4017261 3349502 2869387
13921B869387m62277k33344j23309j39533j27330j01221R8285O7837k03978j65683
$$ 2869387 2407110 2173766 2050457 1910924 1783594 1682373 1780658 1848495 1644517 1478834
13911A478834J70777K08120k60074K00232l64012K02723k06740P2502m4656J2067
$$ 1478834 1649611 1857731 1597657 1797889 1433877 1636600 1429860 1502362 1457706 1469773
13901A469773L5762j73110J19107J7683K10189j99530L1871k35333Q8348M2645
$$ 1469773 1505535 1332425 1451532 1469215 1679404 1479874 1511745 1276412 1364760 1407405
13891A407405J05829r451j26126K66118k50241L71072m74057J97049K4207k8145
$$ 1407405 1513234 1503783 1377657 1643775 1393534 1764606 1290549 1487598 1511805 1483660
13881A483660O1875m54375J06649R1683M7324J37102P2742Q906k19256Q8512J43307
$$ 1483660 1545535 1091160 1197809 1289492 1336816 1473918 1546660 1555566 1336310 1424822 1568129
13870A568129j40829R9897K47463j24175k27689J11887k6666J74698j46443J54926
$$ 1568129 1427300 1527197 1774660 1650485 1422796 1534683 1508017 1682715 1536272 1691198
13860A691198p0100P957J35373j80958O0411q8271k62252M26595l14241l503J51479
$$ 1691198 1621098 1629055 1764428 1583470 1643881 1555610 1293358 1719953 1405712 1402209 1553688
13849A553688n3663R4467M0843J40179k66509R0158m8405q3432K62703j35872
$$ 1553688 1500025 1594492 1635335 1775514 1509005 1599163 1550758 1467326 1730029 1594157
13839A594157k2628k02159q5631K5727o5209K06259m4973q0342J16810r8368m9365
$$ 1594157 1571529 1369370 1283739 1309466 1244257 1450516 1405543 1325201 1442011 1343643 1294278
13828A294278J39392l5702K51362j27040j62473K16544j45804n6356m2506q9609
$$ 1294278 1433670 1397968 1649330 1522290 1359817 1576361 1430557 1374201 1331695 1242086
13818A242086l3464J92153r8907k56008L5412l1526K55125q5649k2567j42080
$$ 1242086 1208622 1400775 1301868 1045860 1081272 1049746 1304871 1219222 1196655 1054575
13808A054575K04429j74622M21578k30195k063j03948J47296K61349l3626j64727
$$ 1054575 1259004 1084382 1505960 1275765 1273702 1169754 1317050 1578399 1544773 1380046
13798A380046P87k9927K69485l54982L07043l07966m8547J92182l36642K29439
$$ 1380046 1380833 1350906 1620391 1265409 1572452 1264486 1215939 1408121 1071479 1300918
13788A300918n1839m8368j61589J63985Q7760q2715O0131p9402j839Q6037K12585
$$ 1300918 1249079 1200711 1039122 1203107 1290867 1208152 1268283 1188881 1187042 1273079 1485664
13777A485664k1216k38750L86411K44076m31700L45822o1932j1802l8367J17735
$$ 1485664 1464448 1225698 1612109 1856185 1424485 1770307 1708375 1696573 1658206 1775941
13767A775941j19035k99143J94916j39790p473J0314j61900j588M0737L7366M0181
$$ 1775941 1656906 1357763 1552679 1412889 1405416 1415730 1253830 1252242 1292979 1330345 1370526
13756A370526m3965P7264r7838P8294m7852J23539k4058r4293K09250j84603p645
$$ 1370526 1326561 1403825 1305987 1384281 1336429 1459968 1435910 1341617 1550867 1366264 1358619
13745A358619L8588L46056j98286J37463k75950J45177o983L1021j06595M30576
$$ 1358619 1397207 1743263 1544977 1682440 1406490 1551667 1544684 1575705 1469110 1899686
13735A899686j95126L6809o117k88187o1901J44735L70338l77634J43788N7807
$$ 1899686 1704560 1741369 1735252 1447065 1385164 1529899 1900237 1522603 1666391 1724198
13725A724198l1851K52344j19697J03966L44k36262q5463J53659M8722J78975
$$ 1724198 1692347 1944691 1824994 1928960 1929304 1693042 1607579 1761238 1809960 1988935
13715A988935J35177j85591J61516K308j06351J06602Q026j2374r8155J91260
$$ 1988935 2124112 1938521 2100037 2102345 1995994 2102596 2110622 2098248 2000093 2191353
13705B191353j52156J16887j52831J9865P1037n5791q8851O4047r6112J82313
$$ 2191353 2039197 2156084 2003253 2023118 2094155 2038364 1949513 2013560 1917448 2099761
13695B099761L9587M19502R7096J369J04302L0166r0568K26805k58510k0235l35614
$$ 2099761 2139348 2558850 2655946 2657315 2761617 2791783 2701215 2928020 2669510 2649275 2313661
13684B313661k26490j0760j33789L2455k35205J04303J43817R018O8626J71402
$$ 2313661 2087171 2076411 1942622 1975077 1739872 1844175 1987992 1997010 2065636 2237038
13674B237038j41788l23305L13107k19638N7917o1169L09436K882L07732o0963
$$ 2237038 2095250 1771945 2085052 1865414 1923331 1862162 2171598 2174480 2482212 2421249
13664B421249L61785J55160J05542q0103J72029O8811q1863n6125l40447j1808
$$ 2421249 2783034 2938194 3043736 2963633 3135662 3204473 3122610 3066485 2726038 2714230
13654B714230k14086j92811m8467O0470k85487l7661M14271n74792O2935J8244
$$ 2714230 2500144 2307333 2258866 2319336 2033849 1996188 2410459 1835667 1898602 1916846
13644A916846N5208J21074j12532N9897J66699j25658j30138j5682J41705J69171
$$ 1916846 1972054 2093128 1980596 2040493 2207192 2081534 1951396 1935714 2077419 2246590
13634B246590M33419J9666L01218j54997p0204K41151N1886m58473Q6210k31954
$$ 2246590 2680009 2699675 3000893 2845896 2775692 3016843 3068729 2610256 2696466 2464512
13624B464512m25297J18549m37257Q5679p1160P8242j4865J60672m18843K68869
$$ 2464512 2039215 2157764 1720507 1806186 1735026 1813268 1798403 1959075 1540232 1809101
13614A809101Q3071o4234l4349Q0169J54490o0845R9602K97165j35481k36506
$$ 1809101 1892172 1827938 1793589 1873758 2028248 1967403 2067005 2364170 2228689 1992183
13604A992183J66705k6876J22769j40945j22948M1330j53314j0149q2180l6102
$$ 1992183 2158888 2132012 2254781 2113836 1990888 2032218 1878904 1868755 1786575 1750473
13594A750473L30046k13494J52055K33132m1291l29733K97052k43500J83020j77259
$$ 1750473 2080519 1867025 2019080 2252212 2210921 1881188 2178240 1934740 2117760 1940501
13584A940501Q0918l04387J14919k11105N3579m3442M16255m26700o470K79946
$$ 1940501 2021419 1717032 1831951 1620846 1674425 1630983 2047238 1620538 1614068 1894014
13574A894014k66929j25010K28953o1327k0347j17984r2018J32268j16260L26552
$$ 1894014 1627085 1502075 1731028 1669701 1649354 1531370 1439352 1571620 1455360 1781912
13564A781912K6697k66918K32543n2260J93133j67589l01286J97622P028j1643
$$ 1781912 1808609 1541691 1774234 1721974 1915107 1747518 1446232 1643854 1650882 1639239
13554A639239k8575j82619J83956m7062P1307J6004o439L8497j23941N195J03366
$$ 1639239 1610664 1428045 1612001 1564939 1636246 1652250 1645811 1684308 1560367 1565562 1668928
13543A668928L57284M15276j49530k31901K86375m382K9384k73743P1618r8762
$$ 1668928 2026212 2441488 2291958 2060057 2346432 2342050 2371434 2097691 2169309 2070547
13533B070547k11325r4076q1968J06656j61919j63684J12228J32460L15035Q0320
$$ 2070547 1859222 1765146 1683178 1789834 1627915 1464231 1576459 1708919 2023954 2104274
13523B104274J23895n7915K3018p6193R3108p9979l6569k76182k20045o047k87307
$$ 2104274 2228169 2170254 2193272 2117079 2210187 2130208 2093639 1817457 1597412 1591365 1304058
13512A304058K21943j45728J26169j58793j37404K31019k63025J96340p6174p1971
$$ 1304058 1526001 1380273 1506442 1347649 1210245 1441264 1178239 1374579 1298405 1226434
13502A226434J20084j82156J5504R1598q7341J42620K4409R3133q9481L4603L3358
$$ 1226434 1346518 1164362 1179866 1271464 1184123 1326743 1351152 1444285 1354804 1389407 1422765
13491A422765r9067J30767j33853J4306O1722J29883l58313J04990K25993k60191
$$ 1422765 1323698 1454465 1320612 1334918 1396640 1526523 1168210 1273200 1499193 1239002
13481A239002K29067o3322j57537L6364j06042J95567o5865j12279J50880L2895
$$ 1239002 1468069 1404747 1247210 1283574 1177532 1373099 1307234 1194955 1345835 1378730
13471A378730J36641m6746j74058j92476L18896p1098j42160n6461J34555K11281
$$ 1378730 1515371 1468625 1294567 1102091 1420987 1349889 1207729 1151268 1285823 1497104
13461A497104j28616M0507K9577l9856J23616J44874o4498k2226J45259L02245
$$ 1497104 1368488 1408995 1438572 1398716 1522332 1667206 1602708 1580482 1725741 2027986
13451B027986J12242K3045K7692K23007J72022m05510K0134j13708m5143j54879
$$ 2027986 2140228 2163273 2190965 2413972 2585994 2180484 2200618 2086910 2041767 1886888
13441A886888k00784k34044J32359q917p5190k9725o0338J05246j23365j662L8987
$$ 1886888 1686104 1452060 1584419 1575502 1500312 1470587 1410249 1515495 1392130 1390468 1429455
13430A429455P9028J9913l2107k9209j96634J89749K14025P1416J71174P8178
$$ 1429455 1508483 1528396 1496289 1467080 1270446 1460195 1674220 1745636 1916810 1994988
13420A994988R2475K64641k96992K48949J23408j12928k46176J48524m13841O0386
$$ 1994988 2087463 2352104 2055112 2304061 2427469 2314541 2068365 2216889 1803048 1863434
13410A863434K64177m52691l10312L73881k42962m0731M7546J14039Q662M401
$$ 1863434 2127611 1674920 1364608 1738489 1495527 1454796 1502342 1616381 1625043 1629444
13400A629444K74543m03253K65464j84554p2404J42349J41507R1279j03761J84932
$$ 1629444 1903987 1500734 1766198 1581644 1509240 1651589 1793096 1884375 1780614 1965546
13390A965546Q2475l1655J27448J24099L3745r0286K96728j92452J64653L4526
$$ 1965546 2048021 2016366 2143814 2267913 2301658 2211372 2508100 2315648 2480301 2514827
13380B514827k97581J80452M2148N0899j60588j87403j92065K09768j58756k12439
$$ 2514827 2217246 2397698 2439846 2490745 2330157 2142754 1950689 2160457 2001701 1789262
13370A789262O5026J94508j33349K65597J27327l16760K31308j91889K31634j57910
$$ 1789262 1854288 2048796 1915447 2181044 2308371 1991611 2222919 2031030 2262664 2104754
13360B104754m8488j48697N6804K55068j27969k4388L62136k07939K85692K9553
$$ 2104754 2056266 1907569 1964373 2219441 2091472 2067084 2429220 2221281 2506973 2536526
13350B536526k4472K4825q7397j9311j68699N6859J3819r1470J26874m01956K8866
$$ 2536526 2512054 2536879 2449482 2430171 2261472 2318331 2332150 2240680 2367554 1965598 1994464
13339A994464k4218K45627j56005j11327R0057k8829P0867M5081j77192P4978
$$ 1994464 1970246 2215873 2059868 1948541 2038598 2009769 2080636 2125717 1948525 2023503
13329B023503Q0759K89750k67993J12745N4178P2634Q3493J08869l90173K70175
$$ 2023503 2104262 2394012 2126019 2238764 2292942 2365576 2449069 2557938 2167765 2437940
13319B437940j44587J92239O9415R1419j07016L02047J85986l72914R0333N2097
$$ 2437940 2293353 2485592 2555007 2646426 2539410 2841457 3027443 2654529 2744862 2796959
13309B796959J35646j70021L10301j73326K55442j75521j35607j53493O3215K83136
$$ 2796959 2932605 2762584 3072885 2899559 3155001 2979480 2843873 2690380 2753595 3036731
13299C036731J06990J71464k25972J69317l231Q9692R4924j17030J72608j65764
$$ 3036731 3143721 3315185 3089213 3258530 3255299 3344991 3439915 3322885 3495493 3329729
13289C329729j96380j08461L14087n0401j65933L10831m33572N30344j44444j2149
$$ 3329729 3133349 3024888 3338975 3288574 3122641 3433472 2999900 3530244 3385800 3373651
13279C373651M0108J69166l158n683P2484K9549j06243R7224J67235O954j03020
$$ 3373651 3413759 3582925 3579767 3574084 3646568 3676117 3569874 3667098 3834333 3841287 3738267
13268C738267n5416M44449k37871m1112J01426J24656K68235j89802Q5791R9579
$$ 3738267 3682851 4127300 3889429 3848317 3949743 4074399 4342634 4152832 4238623 4338202
13258D338202n7177J30092J99379j0680J71840J42L76150k33424M9349J57232
$$ 4338202 4281025 4411117 4610496 4599816 4771656 4771798 5147948 4914524 4963873 5121105
13248E121105L94071q0495O1153L40065o695m0293J60349L07314j89261L65269
$$ 5121105 5515176 5434681 5495834 5835899 5829204 5788911 5949260 6256574 6067313 6432582
13238F432582q7806J22726J56021k01895J94700J15569J62314k402N0341J64968
$$ 6432582 6344776 6467502 6623523 6421628 6616328 6731897 6894211 6891809 6942150 7107118
13228G107118K79659J2047L21642n5310N9253N59471J390Q2203J54626L24798
$$ 7107118 7386777 7398824 7720466 7665156 7724409 8283880 8285270 8367473 8522099 8846897
13218H846897l13967O8185K23035k44487J61833K19821m58446J4954k46397p1545
$$ 8846897 8532930 8601115 8824150 8579663 8741496 8961317 8502871 8517825 8271428 8199883
13208H199883J27754k93420p4615J4897m4594k26152L5401q103l90360L45713
$$ 8199883 8327637 8034217 7959602 7974499 7929905 7703753 7739154 7731051 7340691 7686404
13198G686404l69184J55166j92387N6476k23642r0320K11619k23252N0682r8509
$$ 7686404 7317220 7472386 7279999 7336475 7112833 7022513 7234132 7010880 7061562 6963053
13188F963053j25214k78460J3717r6763j51605j33214k56941J62507k61558M1874
$$ 6963053 6837839 6559379 6573096 6476333 6324728 6191514 5934573 6097080 5835522 5877396
13178E877396k61665o3580L0296k67666N8339j12163k20757J86841j96339J94912
$$ 5877396 5615731 5552151 5582447 5314781 5373120 5260957 5040200 5227041 5030702 5225614
13168E225614k5036K36673j51143l2794J32521p9158L34100J25758K4565J51605
$$ 5225614 5200578 5437251 5286108 5253314 5385835 5306677 5640777 5766535 5791100 5942705
13158E942705M50347M0143J63595M38096l04653J67321K13801j47210j0595k25873
$$ 5942705 6393052 6433195 6596790 7034886 6730233 6897554 7111355 6964145 6953550 6727677
13148F727677p9309N5561m5642r9343j98575J71555j590l6913j49887k62087j49131
$$ 6727677 6648368 6703929 6658287 6558944 6360369 6531924 6530334 6493421 6343534 6081447 5932316
13137E932316l29784l01109l02623r3316j66264l69904j2587j61488p0935j41726
$$ 5932316 5602532 5301423 4998800 4905484 4739220 4369316 4356729 4195241 4124306 3982580
13127C982580K16826J7428j753l65373K65875P4702q6431l72234K09438l89089
$$ 3982580 4199406 4216834 4215081 3849708 4115583 4190285 4103854 3731620 3941058 3551969
13117C551969K4193R0425k26148M2081P9423k08138K64503j48581o0442J51164
$$ 3551969 3576162 3666587 3440439 3482520 3561943 3353805 3618308 3469727 3409285 3560449
13107C560449j2970p721J13363k23996J60749J76315R160P7198K56805L05742
$$ 3560449 3547479 3539758 3653121 3429125 3589874 3766189 3775349 3852547 4109352 4415094
13097D415094K27579L98101K15748K54479N49769K74034J81922l1380l3396K30328
$$ 4415094 4642673 5040774 5256522 5511001 6060770 6334804 6516726 6485346 6451950 6682278
13087F682278J6633k30328l4838k30862L01719k31216K4086l4556o852k94453
$$ 6682278 6698911 6468583 6433745 6202883 6504602 6273386 6297472 6262916 6256064 5961611
13077E961611l6359k33811m85292m20879k47936l23315j82270j16948l00320j39176
$$ 5961611 5925252 5691441 5206149 4785270 4537334 4214019 4031749 3914801 3614481 3475305
13067C475305j754k64223Q6074j2954K13474k05297l2805j52019M83610k87799
$$ 3475305 3473551 3209328 3295402 3282448 3495922 3290625 3257820 3105801 3589411 3301612
13057C301612L514K17763J30658j3632K2253k26196L37213l28264K10613m46631
$$ 3301612 3305126 3522889 3653547 3639915 3662168 3435972 3773185 3444921 3655534 3208903
13047C208903K87760Q7083K558k52113J68862J64254J51095l14196J97189j34240
$$ 3208903 3496663 3583746 3586304 3334191 3503053 3667307 3818402 3504206 3701395 3567155
13037C567155J20752L47548j02677K28419j71445j01206J76251J88984J02846
$$ 3567155 3687907 4035455 3932778 4161197 3989752 3888546 4064797 4253781 4356627
13028D356627q9711Q6235J64256q5318N5109j6197r5837J67046K62447q4622j4089
$$ 4356627 4266916 4353151 4517407 4432089 4487198 4471001 4375164 4542210 4804657 4720035 4705946
13017D705946M26516k70903K19096r8304M38066j43892n7399K53003O7269p3683
$$ 4705946 5132462 4861559 5080655 4982351 5420417 5276525 5219126 5472129 5539398 5465715
13007E465715K18624q877K76409k14026M14192O4993j27661P9245m4169J27977
$$ 5465715 5684339 5675462 5951871 5737845 6152037 6217030 6089369 6168614 6124445 6252422
12997F252422n0975K31227K59048o2219K37701J557Q8722j64674K92577p0971
$$ 6252422 6201447 6432674 6691722 6629503 6867204 6868761 6957483 6792809 7085386 7014415
12987G014415k48522Q4150Q8007N169m7719j88388K15423k93276M13515j98691
$$ 7014415 6765893 6850043 6938050 6943219 6895500 6707112 6922535 6629259 7042774 6844083
12977F844083J02358j76851k5991m7206L6531j95353k59622j30240K49655k91435
$$ 6844083 6946441 6769590 6743599 6696393 6732924 6537571 6277949 6147709 6397364 6105929
12967F105929Q1886p2069K3841k95947K3402J31592k33349J53413q9526q3074
$$ 6105929 6187815 6115746 6139587 5843640 5867042 5998634 5765285 5918698 5829172 5746098
12957E746098K8039J17762K9289j15600K32782j38157N1405N8918j11977K5716
$$ 5746098 5774137 5891899 5921188 5805588 6038370 5900213 5951618 6010536 5898559 5924275
12947E924275m8064j6723L9130K32563j49725k35613K32485l5231m0267K55948
$$ 5924275 5876211 5859488 5898618 6131181 5981456 5745843 5978328 5943097 5902830 6158778
12937F158778j69834m7509j0632K279j58957L15767J93921k10929L17271m8164
$$ 6158778 5988944 5941435 5930803 5933082 5774125 6089892 6283813 6072884 6390155 6341991
12927F341991j07575j00917J01735k24802l54669N1126j3028j2988j70937O1104
$$ 6341991 6234416 6133499 6235234 6010432 5655763 5706889 5693861 5680873 5509936 5571040
12917E571040N424k29748Q311k16714o5067j19066l67392K7005j12672o1896O8668
$$ 5571040 5576464 5346716 5355027 5138313 5073246 4954180 4586788 4613793 4501121 4439225 4507893
12906D507893j412p703j29040j71777k63617J35419k48321J79121k6426j43207
$$ 4507893 4506481 4498778 4369738 4197961 3934344 4069763 3821442 4000563 3974137 3830930
12896C830930k47082K47221n5975m2094r2449j00740k51772K08283O9120p9217
$$ 3830930 3583848 3831069 3775094 3733000 3640551 3539811 3288039 3496322 3565442 3486225
12886C486225j2181l9518j90710J15382K49740j43174Q9300j33169j66450J5444
$$ 3486225 3474044 3434526 3243816 3359198 3608938 3465764 3555064 3421895 3255445 3270889
12876C270889p7967K4405o6948J20080o7398J64843n79600K76735l63720K78131
$$ 3270889 3192922 3217327 3150379 3270459 3203061 3367904 2788304 3065039 2701319 2979450
12866B979450Q7278q2120k29356l7689j5584J70032M6979m8530K11107j87222
$$ 2979450 3066728 2984608 2755252 2717563 2701979 2872011 2918990 2870460 3081567 2894345
12856B894345j75173k1879J41083J06164M3329j66693J9366M6948J13644l75987
$$ 2894345 2719172 2697293 2838376 2944540 2987869 2821176 2840542 2887490 3001134 2625147
12846B625147K01391j22629n3189K29382l00646J97140L2727m6154K42953k59870
$$ 2625147 2826538 2703909 2650720 2880102 2579456 2776596 2809323 2763169 3006122 2746252
12836B746252k5029n2471m4931P9778R8369j71404Q4989k6892K3423n7140K23378
$$ 2746252 2721223 2668752 2623821 2703599 2801968 2630564 2715553 2688661 2712084 2654944 2878322
12825B878322k66780K06525o417l79289N27957k31087J64138j94267l1656N1582
$$ 2878322 2611542 2818067 2811650 2432361 2960318 2729231 2893369 2699102 2667446 2719028
12815B719028K6928P0168j74046K20251k1804l723k64982K33967j9035m1554M8979
$$ 2719028 2745956 2816124 2642078 2862329 2840525 2836802 2571820 2805787 2786752 2745198 2794177
12804B794177l9151j24242n635L05408j90740J26636j40358K82941p2248l06228
$$ 2794177 2755026 2630784 2625149 2930557 2739817 2866453 2726095 3009036 2936788 2630560
12794B630560P8776L723K14687j31843l2319K3745j8899Q993L0801L20905j73793
$$ 2630560 2709336 2713059 2927746 2795903 2763584 2787329 2768430 2777423 2808224 3129129 2955336
12783B955336k43170L70165j26709j34863K7182n8765J51417k49458k9274R8514
$$ 2955336 2712166 3082331 2955622 2820759 2847941 2789176 2940593 2691135 2661861 2760375
12773B760375N7860Q2426p1352j7095J09133J94181j28011o2315p348Q2188p7813
$$ 2760375 2818235 2900661 2829309 2812214 2921347 3115528 2987517 2925202 2917854 3000042 2922229
12762B922229J85613l7784j03465l876P8951k06449m6784K03781Q8267O9882j23514
$$ 2922229 3107842 3070058 2966593 2962717 3041668 2835219 2788435 2992216 3080483 3150365 3026851
12751C026851j18375M6332M3872j61867J30372q6600K43916k31386M5006o2157
$$ 3026851 2908476 2954808 2998680 2836813 2967185 2880585 3124501 2893115 2938121 2875964
12741B875964J67757o9402J24220j20304j49598J68209J90241j81469k3242K12192
$$ 2875964 3043721 2974319 3098539 2978235 2828637 2996846 3187087 3005618 2982376 3194568
12731C194568q0176O0603j36968K03073k37196N5725J90820l7692l52102K76121
$$ 3194568 3114392 3174995 3038027 3241100 3003904 3059629 3250449 3212757 2860655 3136776
12721C136776q8894J61843r4421p1920m1773J69705O631l6543K04770k68935r3799
$$ 3136776 3047882 3209725 3115304 3043384 3001611 3171316 3177947 3141404 3346174 3077239 2983440
12710B983440L80330J7938J826N1097j15527K66051J68693l23585N17263m3913
$$ 2983440 3363770 3381708 3383534 3434631 3319104 3585155 3753848 3430263 3947526 3903613
12700C903613k21344K99420M4421k2309j29864K87853O7509K25989L46265j04418
$$ 3903613 3682269 3981689 4026110 4003801 3873937 4161790 4229299 4455288 4801553 4697135
12690D697135O16763M98063Q48790J72420K52406J34752l7885j74616K031k37096
$$ 4697135 5313898 5811961 6660751 6833171 7085577 7220329 7182444 7007828 7009859 6772763
12680F772763p00817m50054o79392j89596k95026m3963K6278k06360J87292k2643
$$ 6772763 6071946 5621892 4942500 4752904 4457878 4413915 4440193 4233833 4421125 4398482
12670D398482p4938J94031n1035J00679M044L42966m0550o1825j0267J58715J0416
$$ 4398482 4323544 4517575 4466540 4567219 4571263 4914229 4873679 4811854 4801587 4960302 4970718
12659D970718k22740l764L22058o29072L31678J87425Q3494L93470M1470j6481
$$ 4970718 4747978 4744214 5066272 4437200 4768878 4956303 5039797 5433267 5474737 5458256
12649E458256M09883J71200k0687L74015L2220j35644O4189j82906K28690l24068
$$ 5458256 5868139 6039339 6018652 6392667 6424887 6289243 6353432 6170526 6399216 6075148
12639F075148J7395K11854j33190Q7825m2206L30751L59144m92333J68692P2599
$$ 6075148 6092543 6304397 6171207 6259032 6216826 6547577 6906721 6414388 6583080 6655679
12629F655679M7462R2161r6083m0394J58207r1320k82936Q4845l05531j54404
$$ 6655679 6703141 6795302 6699219 6658825 6817032 6725712 6442776 6527621 6222090 6067686
12619F067686l61300j72089l79121K08140m75795r3194O6872K67627M42850L30960
$$ 6067686 5706386 5534297 5155176 5363316 4887521 4794327 4861199 5128826 5571676 5902636
12609E902636L62632O30303K52061N74736N33833M35827M4955j53728m82830l06463
$$ 5902636 6265268 6895571 7147632 7722368 8256201 8692028 8736983 8583255 8100425 7793962
12599G793962m19032n68968m76107l61055m78084l73623P1956k91107j6153L66366
$$ 7793962 7374930 6805962 6329855 5968800 5490716 5117093 5189049 4897942 4881789 5248155
12589E248155K37374j25294L84898j83105L15306N3965O5201P738j0292M2717
$$ 5248155 5485529 5360235 5745133 5562028 5877334 5931299 5996500 6004238 5993946 6036663
12579F036663k01910M59192M89298l82646N37971Q0801o1218j27600k47419k34949
$$ 6036663 5834753 6293945 6783243 6400597 6938568 7019369 6958151 6830551 6583132 6348183
12569F348183l27279n66505m5880p84038J09524j54976K5484J2121J50841k50806
$$ 6348183 6020904 5454399 5408519 4624481 4734005 4579029 4604513 4616634 4767475 4516669
12559D516669J29410J25269N4643J96479k90957K35270k70044l1528p5143J19413
$$ 4516669 4646079 4771348 4825991 5022470 4731513 4966783 4696739 4665211 4590068 4709481
12549D709481Q9315r2971K00376k92457K00935r6945k056N35159N0586m7939K34982
$$ 4709481 4798796 4705825 4906201 4613744 4814679 4717734 4715678 5250837 5301423 5253484 5488466
12538E488466n2484K38938L2244q1073r533m95326K808j69049o2749j30560l17800
$$ 5488466 5435982 5674920 5707164 5626091 5616558 5121232 5124040 4954991 4892242 4761682 4443882
12527D443882K46150j22794O2214k44556J79007K04736k50981K81633j023K19186
$$ 4443882 4690032 4567238 4629452 4384896 4563903 4768639 4517658 4799291 4798268 5017454
12517E017454P1647j22458K5174n6206N09717L44420P29593K5809M9135M71169
$$ 5017454 5089101 4966643 4991817 4935611 5445328 5789748 6519341 6545150 6594285 7065454
12507G065454J35216M0034l27327q8334k8939q48318k06071j90956k62559k69139
$$ 7065454 7200670 7240704 6913377 6825043 6796104 5947786 5741715 5550759 5288200 5019061
12497E019061O3751L18257k17821r3316R6482J1871q2571p6940K66673l0455N2525
$$ 5019061 5082812 5401069 5183248 5089932 5186414 5198285 5115714 5038774 5305447 5274992 5327517
12486E327517N5794p9231J99538j81128M54318L4730K30407K12J2747o0611L79892
$$ 5327517 5383311 5304080 5503618 5322490 5776808 5811538 6041945 6042157 6054904 5994293 6374185
12475F374185j49233r5818m58287j88310j47894q9116k42510n1975Q0034J36112
$$ 6374185 6224952 6129134 5670847 5482537 5334643 5245527 5003017 4951042 5031076 5167188
12465E167188k5400l3864k887J26239q0274O4679J43624j54458J71541j23109
$$ 5167188 5141788 5107924 5105037 5231276 5151002 5215681 5359305 5204847 5376388 5253279
12455E253279K7736K40910P3584l7580l0619J98401m9181j9198m4668J85890M50139
$$ 5253279 5281015 5521925 5595509 5557929 5527310 5725711 5676530 5657332 5612664 5798554 6248693
12444F248693N359J24455K42062J05998K51975J25207K54554k3556J13273M4325
$$ 6248693 6254052 6378507 6620569 6726567 6978542 7103749 7358303 7334747 7448020 7492345
12434G492345J88924O8746K24822m6262m3749K49548J58045J98950L0453K7036
$$ 7492345 7681269 7750015 7974837 7928575 7884826 8134374 8292419 8491369 8521822 8548858
12424H548858R9100O724K55052l31122J91385j8738j3622L40179O1816N11417
$$ 8548858 8647958 8654682 8909734 8578612 8769997 8751259 8737637 9077816 9139632 9651049
12414I651049P0616N05195Q0408M21519K65306L00955R3949J44915p9312L03706
$$ 9651049 9721665 10226860 10307268 10728787 10994093 11295048 11388997 11533912 11454600 11758306
12404A1758306K7299k25294K24231J1199j16984J63872k10593j66986K70710l19167
$$ 11758306 11785605 11560311 11784542 11795741 11678757 11842629 11632036 11465050 11735760 11416593
12394A1416593J55271M4295o6058N5187L28994J39484M6433N33741L38205L42184
$$ 11416593 11571864 11616159 11550101 11605288 11934282 12073766 12120199 12653940 12992145 13334329
12384A3334329J60186N21500J82922P5289M78521K13449J72549K13948j18587
$$ 13334329 13494515 14016015 14198937 14274226 14752747 14966196 15138745 15352693 15234106
12375A5234106K29232Q041L42266k15703J89837N3196j58373J07206Q2634k76771
$$ 15234106 15463338 15471379 15813645 15597942 15787779 15840975 15682602 15789808 15872442 15595671
12365A5595671J04686k39307J37968l25022J42102J8120n07293k4022k36982j2138
$$ 15595671 15700357 15461050 15599018 15273996 15416098 15434218 14926925 14902903 14665921 14653783
12355A4653783J95134m81058J83411m43751J02486j8145l83821l70180j47666
$$ 14653783 14848917 14367859 14551270 14107519 14210005 14191860 13808039 13437859 13290193
12346A3290193j54706j07058j88266R4343j08203Q9090L45482j46769L70447M68984
$$ 13290193 13135487 13028429 12840163 12934506 12826303 12915393 13260875 13114106 13484553 13953537
12336A3953537K42113N77208M41850L7436N35267L88180J90310M28295K80575
$$ 13953537 14195650 14772858 15214708 15252144 15787411 16175591 16365901 16794196 17074771
12327A7074771L32802J82711N1140K62515J61753J50070K97254K89032l42154
$$ 17074771 17407573 17590284 17641424 17903939 18065692 18215762 18513016 18802048 18459894
12318A8459894K03115p034q4166k23012K48502k14302p61J02081K34926L56829
$$ 18459894 18663009 18655975 18571809 18348797 18597299 18382997 18382236 18484317 18719243 19076072
12308A9076072J46827L50550Q4061M12813N08732M66512J9036N13980J34201j16150
$$ 19076072 19222899 19573449 19657510 20070323 20579055 21045567 21064603 21578583 21712784 21596634
12298B1596634m45252n22683l44447o01849o15822m82257l40722j14135j84579
$$ 21596634 21151382 20628699 20284252 19682403 19066581 18584324 18243602 18129467 17944888
12289A7944888k96367j86636j06442l46666k16224m42830o49437n04981m20581
$$ 17944888 17648521 17461885 17355443 17008777 16792553 16349723 15700286 15195305 14774724
12280A4774724q56279l56393m14460k49079m32233l46108k33631k00097j50798
$$ 14774724 13918445 13562052 13147592 12898513 12466280 12120172 11886541 11686444 11535646
12271A1535646j15006k3624J44147l50214J12508J04719j58676l9521M0861n9555
$$ 11535646 11420640 11397016 11541163 11190949 11303457 11408176 11249500 11209979 11250840 11191285
12261A1191285k98752L90720q4484j27083Q1956L8146L07847K20864L41197L07483
$$ 11191285 10892533 11283253 11198769 11071686 11153642 11191788 11499635 11720499 12061696 12369179
12251A2369179O19685M26710M95749J265920P29529R89983J167415Q99886J150593
$$ 12369179 12988864 13415574 13911323 15177243 15906772 16896755 18064170 18964056 20114649
12242B0114649R86911Q89425O06721M69342q2425L80393n16303j20496l2591k30594
$$ 20114649 21101560 21990985 22597706 23067048 22984623 23365016 22848713 22728217 22695626 22465032
12232B2465032k00895P4736l91697r3978k03582m18050n51210n84248r64726j124065
$$ 22465032 22264137 22338873 21947176 21853198 21649616 21231566 20680356 20096108 19131382 18007317
12222A8007317r64508j067848p88191j252635p04848p90177l67660n18507k1567
$$ 18007317 17042809 15974961 15186770 13934135 13229287 12439110 12071450 11552943 11531376
12213A1531376m10733n1060n10775k38868l25351O0495l98737p6716k27013j44531
$$ 11531376 11120643 11069583 10558808 10319940 9994589 10055084 9656347 9579631 9352618 9208087
12203I208087k9993k04233J83785O1863J5445m2002J9680l11280M61395q9592
$$ 9208087 9178094 8973861 9157646 9219509 9234954 9192952 9212632 8901352 9362747 9273155
12193I273155l06071L11836K97297l6542N0109L56096K97593J45095K43936j18630
$$ 9273155 8967084 9278920 9576217 9539675 9589784 9945880 10243473 10388568 10632504 10513874
12183A0513874L65256K56396L3054K10403m2726J38597J14419j0205k27621N8712
$$ 10513874 10879130 11135526 11168580 11378983 11336257 11474854 11589273 11579068 11351447 11410159
12173A1410159j9263r6650q3410L5102J72391Q4226r7508L40716R3541K60258
$$ 11410159 11390896 11294246 11210836 11245938 11418329 11502555 11405047 11745763 11839304 12099562
12163A2099562K38449N42394M56312O06135N79461N49158K85844O1341nk3025
$$ 12099562 12338011 12880405 13336717 13942852 14522313 15071471 15357315 15418656 15418651 15395626
12153A5395626m41198l59205n0268k10061j14415O0519O16037L80484M01574L99838
$$ 15395626 14954428 14595223 14544955 14334894 14220479 14280998 14897035 15277519 15679093 16078931
12143A6078931J70716K36958M02012O1902M07431K43516J13749L89346P24879
$$ 16078931 16249647 16486605 16888617 16950519 17357950 17601466 17715215 18104561 18829440
12134A8829440Q70198O75694J623013J427592J264574K260297J808499K011342
$$ 18829440 19699638 20375332 21998345 23425937 24690511 26950808 28759307 30770649
12126C0770649K228806J482565J620883J453411J004536L54567M98330j41654
$$ 30770649 32999455 34482020 36102903 37556314 38560850 38915417 39413747 39272093
12118C9272093k51721k98892n85466l63436q26259p36293p92194o51104n48083
$$ 39272093 39020372 38721480 38136014 37772578 36946319 36210026 35417832 34766728 34218645
12109C4218645q60550k41320r77945k95246l75777q0835K59590K88357M92298
$$ 34218645 33358095 33116775 32138830 31843584 31467807 31386972 31646562 31934919 32427217
12100C2427217L00752L67406N57342j39720J44646l26131j005903o87685j078603
$$ 32427217 32727969 33095375 33652717 33512997 33657643 33331512 32325609 31637924 30559321
12091C0559321r25307p99447j53878J93778O15801L14280N67285Q06153P11188
$$ 30559321 29634014 28834567 28680689 28874467 29490268 29804548 30371833 31177986 31889174
12082C1889174P78609J89202L48242J18350l70723l53552j14329R3074k02229
$$ 31889174 32667783 32856985 33205227 33323577 32952854 32599302 32484973 32578047 32375818
12073C2375818L1138J09831j04468n25015l19566o67661n94915j007094q69494
$$ 32375818 32406956 32516787 32412319 31887304 31567738 30900077 30305162 29298068 28428574
12064B8428574r63255j140030q56649j045969m89223o80984m70386l50270l20721
$$ 28428574 27465319 26325289 25468640 24422671 23933448 23252464 22782078 22431808 22111087
12055B2111087l86429j90668n75447n03849n82300k9372o00579l97445n34685
$$ 22111087 21724658 21533990 20958543 20454694 19872394 19843022 19242443 18844998 18310313
12046A8310313P354m22899j13842j22294l94427m65725j14453l91994o14244k64753
$$ 18310313 18317667 17894768 17780926 17658632 17264205 16798480 16684027 16292033 15677789 15413036
12036A5413036l06250k17192m21126J82845j18199K26183M08721L06768K24795
$$ 15413036 15106786 14889594 14468468 14651313 14533114 14759297 15168018 15474786 15699581
12027A5699581O89655M44750j09540L85148k5693n14384p21860m06445m07101
$$ 15699581 16389236 16833986 16724446 17109594 17083901 16569517 15847657 15441212 15034111
12018A5034111o13367k87624k83275l41201l73575n1702j81425j44450k64042
$$ 15034111 14420744 14133120 13849845 13508644 13135069 13083367 12901942 12757492 12493450
12009A2493450m75543l35765k82435m02188J33302O8135J15796L83420M0320N31609
$$ 12493450 12017907 11682142 11399707 10997519 11130821 11198956 11314752 11698172 11738492 12270101
11999A2270101K84838p8945j57361l48906m25623j16970n45565k53897m54442
$$ 12270101 12554939 12475994 12318633 11969727 11544104 11427134 10881569 10627672 10173230
11990A0173230j72218p018q3375m4793j9847k36903r0424j47877j63196o63682
$$ 10173230 10001012 9993994 9910619 9865826 9845979 9609076 9518652 9370775 9207579 8543897
11980H543897l27831k74644k25504k28229j38426N090j04800j08683k73520K82757
$$ 8543897 8216066 7941422 7715918 7487689 7349263 7354353 7249553 7140870 6867350 7150107
11970G150107n7960l89474k36544m14239k49390J06776k12992m6983m5503n8410
$$ 7150107 7092147 6702673 6466129 6051890 5802500 5909276 5696284 5649301 5603798 5545388
11960E545388l8252K25531L20146L04498k43985L96152K21345o9929J4044J89181
$$ 5545388 5507136 5732667 6052813 6357311 6113326 6509478 6730823 6660894 6674938 6864119
11950F864119l17475L5791J4948j5392N8475J22179J88355K46423K54153j15863
$$ 6864119 6546644 6582435 6597383 6581991 6640466 6762645 6951000 7197423 7451576 7335713
11940G335713K69195L40994K43634j16664r6456K83529k33453q417L07711k41517
$$ 7335713 7604908 7945902 8189536 8072872 7976416 8259945 8026492 8018075 8325786 8084269
11930H084269K91679M3690n7810j98018M7713o2330k37194m92631j18525m24095
$$ 8084269 8375948 8419638 8361828 8163810 8211523 8149193 7911999 7419368 7300843 6876748
11920F876748k09585j81185O8120n4516j91550J9461k28905j6578j00304r7451
$$ 6876748 6667163 6485978 6554098 6499582 6308032 6327493 6098588 6082010 5981706 5884255
11910E884255M60278P43571K046284J925146J162980O34186M70015J4017M19175
$$ 5884255 6344533 7088104 9134388 11059534 12222514 12856700 13326715 13340732 13759907
11901A3759907m27825q41730k259144k254043j886003l80913j79367l66840p9069
$$ 13759907 13332082 12490352 10231208 7977165 6091162 5710249 5530882 5164042 5084973
11892E084973J63435k2461J04773M92283L66380N48994N41697Q65172P42803J012305
$$ 5084973 5248408 5225947 5330720 5823003 6189383 6738377 7280074 8145246 8888049 9900354
11882I900354O00827N16742J66155K6358k4665m97114l00505j187717o81983o87740
$$ 9900354 10501181 11017923 11184078 11210436 11185771 10688657 10388152 9200435 8518452 7830712
11872G830712l05541k17610r43748l20746m23779j40771l72736k60930L543k11638
$$ 7830712 7525171 7307561 6363813 6043067 5619288 5478517 5105781 4844851 4848394 4636756
11862D636756Q7570k29070K9917J66613k62002K59624J29r7055Q4365R6243J72114
$$ 4636756 4724326 4495256 4525173 4691786 4429784 4689408 4689537 4592482 4676847 4773090 4945204
11851D945204k45065K94798J50591L77359Q0801K99371J22415M64930M73371Q45586
$$ 4945204 4700139 4994937 5145528 5522887 5603688 5903059 6025474 6490404 6963775 7809361
11841G809361O35390M99077M98420L72413k21039K08773j83122m67021n05677
$$ 7809361 8444751 8943828 9442248 9814661 9593622 9802395 9619273 9152252 8646575
11832H646575m58516J03300j4244j06617k6032P5214j83891j96026j38367q37913
$$ 8646575 8188059 8291359 8277115 8170498 8144466 8219680 8035789 7839763 7701396 6863483
11822F863483k11867j274069r1205m25353k70457j54156p0667Q0128m18879j18199
$$ 6863483 6651616 5377547 5286342 4860989 4590532 4436376 4365709 4445837 4026958 3908759
11812C908759J45538r7978j2372M7892j36898o6121j26008L2503j31929R1425
$$ 3908759 4054297 3956319 3943947 3991839 3854941 3788820 3662812 3695315 3563386 3654811
11802C654811Q4244K14575l26570K55461k10067L46037o9902j12617J97218K7562
$$ 3654811 3739055 3953630 3627060 3882521 3672454 4018491 3948589 3835972 4033190 4060752
11792D060752J23145L17372M33368L14599O40260M75571N35099J72580K01684
$$ 4060752 4183897 4501269 4934637 5249236 5889496 6365067 6900166 7072746 7274430
11783G274430j9291k40904n25168j90874n95607p61498l14456m80955k52036k75028
$$ 7274430 7255139 7014235 6489067 6298193 5702586 4941088 4626632 4145677 3893641 3618613
11773C618613p3868o3528L9885M890j48837j38848J86525j26262j76180J75753
$$ 3618613 3544745 3481217 3521102 3525992 3377155 3238307 3424832 3298570 3122390 3298143
11763C298143r8027q124o1740N8415m71126N66270k30782m7539j95878M2601K568
$$ 3298143 3200116 3191992 3130252 3188667 2717541 3283811 3053029 3005490 2809612 2852213 2854781
11752B854781o5219J27999j26724L07727k27712Q8405J16316k06545L07997l38760
$$ 2854781 2789562 2917561 2790837 3098564 2870852 2959257 3075573 2869028 3177025 2838265
11742B838265K06616k51558J68046j38372J2473j16853q4258O1047k14156J61833
$$ 2838265 3044881 2793323 2961369 2822997 2835470 2718617 2634359 2695406 2481250 2643083
11732B643083K45328l25608L04297r5295l51844R7301K54041j16073j64148J12760
$$ 2643083 2888411 2562803 2867100 2771805 2419961 2517262 2771303 2655230 2491082 2603842
11722B603842L5328n7109j58879K14009M9070p4020P8988j6411j38737J41798
$$ 2603842 2639170 2582061 2423182 2637191 2686261 2612241 2691229 2674818 2536081 2677879
11712B677879J10263q3217j03006R3379K2816P196l36686J85796o4395l1747J61796
$$ 2677879 2788142 2704925 2601919 2695298 2718114 2725310 2388624 2574420 2510025 2478278 2640074
11701B640074J37635j98354M6036R7916j3058K18209P3484k57686J50955J25912
$$ 2640074 2777709 2579355 2625391 2723307 2710249 2928458 3001942 2744256 2895211 3021123
11691C021123q4402k72423L44463N4365P6438j29108q3511L70806N66q8014o5804
$$ 3021123 2936721 2664298 3008761 3063126 3139564 3010456 2926945 3297751 3298317 3210303 3144499
11680C144499R4613J06840P5533m8220J59051j73680J44751r1236J62424j5454
$$ 3144499 3239112 3345952 3421485 3373265 3532316 3358636 3503387 3412151 3574575 3559121
11670C559121k73360J69753L2752j9015o7218R4183m6687M2704j41292m5317J14640
$$ 3559121 3285761 3455514 3488266 3469251 3402033 3496216 3449529 3492233 3350941 3305624 3420264
11659C420264l9274m4259o761J15574J9754k79250J90528n9596P5245k64874J99517
$$ 3420264 3380990 3336731 3329970 3445544 3465298 3186048 3376576 3316980 3392225 3127351 3326868
11648C326868K47014k41158N6968K4700k60180Q1131J86533j46333J8748j93526
$$ 3326868 3573882 3332724 3389692 3414392 3154212 3235343 3421876 3275543 3294291 3100765
11638C100765J34889j55947J9496P3737k03404J20065k21796O6269M1392k5017
$$ 3100765 3235654 3079707 3099203 3172940 2969536 3089601 2867805 2934074 2975466 2950449
11628B950449j08474J90585o4710p3921J39719j05204P3160p1273M4814j72117
$$ 2950449 2841975 3032560 2967850 2893929 3033648 2928444 3001604 2930331 2975145 2803028
11618B803028J31329q9567J28659N3631j2751q4377K3355m0726J54872j02543
$$ 2803028 2934357 2844790 2973449 3027080 3014329 2929952 2953307 2912581 3067453 2964910
11608B964910R5042m9752P8693J45098L064j66048j8182J26643J5150R2787k9214
$$ 2964910 3059952 3010200 3088893 3233991 3237055 3071007 3052825 3179468 3194618 3287405 3258191
11597C258191J32056j43574j65497J17402p7469K4402J75273k11572K08958r7001
$$ 3258191 3390247 3246673 3081176 3198578 3121109 3145511 3320784 3109212 3318170 3221169
11587C221169p3369M74L9601O5693j32588M7098K13473O3629q8297k32232M36789
$$ 3221169 3147800 3148274 3187875 3253568 3120980 3168078 3381551 3445180 3356883 3124651 3561440
11576C561440l3346j44167J74756j0091O6662k44407J70308O1131k9077j45642
$$ 3561440 3528094 3383927 3558683 3548592 3615254 3370847 3541155 3602286 3573209 3427567
11566C427567J42057k57733K89531J25686n6936k3101n219J49359Q7246q0534
$$ 3427567 3569624 3311891 3601422 3727108 3670172 3647071 3641852 3791211 3878457 3797923
11556C797923m3955J15344K8759J5614J41350M7415j61364K19519j73112l19507
$$ 3797923 3753968 3869312 3898071 3913685 4055035 4102450 3941086 4160605 3987493 3667986
11546C667986J12861n12385L22532J66580k74775K4203J16922j12090k2569j26509
$$ 3667986 3780847 3268462 3590994 3757574 3482799 3507002 3623924 3511834 3489265 3362756
11536C362756k34979K49105J35386j39300Q7289P9292l72722L21354k59373L20924
$$ 3362756 3127777 3376882 3512268 3372968 3460257 3539549 3166827 3488181 3228808 3549732
11526C549732j81586Q011o7414J73597k1510j75881K48646O2681j58394J98450
$$ 3549732 3368146 3376157 3308743 3482340 3460830 3284949 3533595 3596276 3437882 3636332
11516C636332L4284O4943R8466k74401K50971r6193j9064L7300J81916K00631
$$ 3636332 3670616 3735559 3834025 3559624 3810595 3714402 3695338 3732638 3914554 4115185
11506D115185q8030j06418O6098L5215k3999j3639j79440K81483J05977n23200
$$ 4115185 4027155 3920737 3986835 4022050 3998051 3984412 3804972 4086455 4192432 3669232
11496C669232Q5718K5033K194j25052o9057K91367k41233p84J31579J45718M5812
$$ 3669232 3754950 3779983 3782177 3657125 3588068 3879435 3638202 3637418 3768997 3914715 3960527
11485C960527k06823J52086J01952j27855r5304J58815K52899l45426L62640o2858
$$ 3960527 3753704 3905790 4007742 3879887 3784583 3943398 4196297 3850871 4213511 4150653
11475D150653k51857J57695j23553J27172k23661J13627j84446J22292n7561n5476
$$ 4150653 3898796 4056491 3932938 4060110 3836449 3950076 3765630 3887922 3830361 3774885
11465C774885j95754J5743J94183p8785Q5267J49456j84598J95329M3946p6352
$$ 3774885 3579131 3594874 3789057 3710272 3795539 3944995 3760397 3955726 3999672 3923320
11455C923320j17483j62987r0944L42351k70943J27099M9304O1460m82m3346J70152
$$ 3923320 3805837 3642850 3551906 3894257 3623314 3750413 3799717 3861177 3860695 3817349 3987501
11444C987501p9138J99944P1569k5069k37498K68967J19742Q9512j42517K7060
$$ 3987501 3908363 4108307 4179876 4154807 3917309 4186276 4306018 4395530 4253013 4280073
11434D280073J06764K90134j11489P0901p5950J98705J29548j64665P2956o5815
$$ 4280073 4386837 4676971 4565482 4636383 4560433 4759138 4888686 4724021 4796977 4731162
11424D731162j00261O5969K1075J16073J0887k81994J86038j24620K9953O4413
$$ 4731162 4630901 4696870 4717945 4834018 4844905 4562911 4748949 4624329 4654282 4718695
11414D718695K00341k16156J61826j09120p5422M12737k76360M005k11123K69704
$$ 4718695 4919036 4702880 4864706 4755586 4680164 5092901 4816541 4820546 4609423 4879127
11404D879127J72675L7791j03645J84086J58990Q7662l70153K11689M30337R1373
$$ 4879127 5051802 5089593 4985948 5170034 5329024 5416686 5046533 5258222 5688559 5779932
11394E779932j54921J54750J5599j58005J90288J7278L52649j54256K15984J88025
$$ 5779932 5625011 5779761 5795360 5637355 5827643 5844921 6197570 6043314 6259298 6447323
11384F447323l6930N8304K6700J48951O1414R3314k01702J36914K9743k4802m0381
$$ 6447323 6410393 6468697 6495397 6644348 6705762 6799076 6597374 6734288 6764031 6739229 6698848
11373F698848P6285N6167J7201J42370m7395o69j00282J64431J4499q668j70245
$$ 6698848 6775133 6831300 6848501 6990871 6943476 6942807 6842525 7006956 7021455 7012787 6842542
11362F842542J59695q507N277J73408j57646P304l6443J15539l001l4077J45809
$$ 6842542 7002237 6993730 6999007 7172415 7014769 7022073 6985630 7101169 7098168 7064091 7209900
11351G209900n6299P3548j17651J86038K5860l49714K64776j10385J56062k93683
$$ 7209900 7153601 7227149 7109498 7295536 7321396 6971682 7236458 7126073 7282135 6988452
11341F988452J11308j02733O0316R0280J21022o6130k21525l1012k50696N03602
$$ 6988452 7099760 6997027 7057343 7147623 7268645 7202515 6980990 6949978 6699282 7202884
11331G202884k32871k61207L4859p7183j22987j63562j00185J37934k93670j38990
$$ 7202884 6970013 6708806 6743665 6666482 6543495 6379933 6279748 6417682 6124012 5985022
11321E985022J12408j31835M3661j04813j6664k12543j188k3887m02700J20001
$$ 5985022 6097430 5965595 6009256 5904443 5887779 5675236 5674048 5650161 5247461 5367462
11311E367462r0687j76279M3486j35273P8963k64075j07876Q1535K5351l52778
$$ 5367462 5276775 5100496 5143982 5008709 5087672 4823597 4715721 4797256 4822607 4469829
11301D469829k01122K19019k33957K35796m07755l8067j7856J41528k83105J88536
$$ 4469829 4268707 4487726 4253769 4489565 4081810 4043743 4025887 4167415 3884310 4072846
11291D072846k05589K208p8830l37161M04938j64848k01203J99973k39116k01758
$$ 4072846 3867257 3869465 3790635 3453474 3858412 3693564 3492361 3692334 3453218 3251460
11281C251460J26624j39530J43645k06206L3977R0253k20867r2880K15665o5921
$$ 3251460 3378084 3238554 3382199 3175993 3209970 3300223 3079356 2986476 3202141 3136220
11271C136220r530k27585K63855k78800P2569J11020k6386p8999p2244K05133
$$ 3136220 3126690 2899105 3162960 2884160 2956729 3067749 3041363 2962364 2890120 3095253
11261C095253l48718J82406o8237Q6404j04810R6113j14475O940j36566l0045
$$ 3095253 2746535 2928941 2860704 2947108 2842298 2938411 2823936 2830876 2694310 2664265
11251B664265K40425k33777J2433o17Q1617K83569k26990p7758O5918j43768J7578
$$ 2664265 2904690 2670913 2683346 2682729 2764346 3047915 2820925 2743167 2809085 2665317 2682895
11240B682895N2770j3010J24007r0333j07714L27007l98797M91235j79725j75254
$$ 2682895 2735665 2722655 2846662 2756329 2648615 2975622 2576825 3068060 2888335 2713081
11230B713081j5727o8637L52349j28069J86202K16714L8531R66783Q46612R2465
$$ 2713081 2697354 2628717 2981066 2852997 3039199 3255913 3294444 4261227 5107839 5200304
11220E200304M54391L26255J5792L7549q5611k37354l91154q44890r11244l32887
$$ 5200304 5654695 5980950 5996742 6034291 5948680 5711326 5320172 4475282 3564038 3231151
11210C231151j62933P4410l20341N06n0777K15619j66852j96106J92459p5187
$$ 3231151 3068218 3142628 2822287 2822793 2772016 2987635 2820783 2624677 2817136 2741949
11200B741949J47218r00J83913p8095N53694L79539N72697N67572O25056K04064
$$ 2741949 2889167 2888267 3072180 2994085 3547779 3927318 4500015 5067587 5692643 5896707
11190E896707K64463N0622k32490K6378O6763q72848q28877m01115l68786l47363
$$ 5896707 6161170 6211792 5979302 6005680 6072443 5199595 4370718 3969603 3600817 3253454
11180C253454R088k02243J83857k9747J16188q2279j45393P7132K86531q8449
$$ 3253454 3262542 3060299 3244156 3214409 3330597 3248318 3102925 3180057 3466588 3378139
11170C378139j29488L22667m51519J7767J28191J46499k10632L0785K01571k08895
$$ 3378139 3248651 3571318 3119799 3137566 3265757 3412256 3201624 3232409 3433980 3225085
11160C225085P2455j90564K61043J78364l09755K4553J7296q5873N3993L63962
$$ 3225085 3297540 3106976 3368019 3546383 3236628 3261181 3278477 3192604 3246597 3610559
11150C610559l49822N13040n15762K26641l1331Q0596j05794Q7752K6432O3769
$$ 3610559 3260737 3773777 3258015 3484656 3453325 3533921 3428127 3515879 3542311 3606080
11140C606080k35720K21433m8126j21944l8942J99304P3198J8893J03449J1050
$$ 3606080 3370360 3591793 3543667 3421723 3382781 3582085 3655283 3674176 3777625 3788675
11130C788675p27l0710J27327k5383j59654K22045R9629O0776r0767J12952j08465
$$ 3788675 3787948 3757238 3884565 3859182 3699528 3921573 4021202 4081978 3991211 4104163 3995698
11119C995698q0299J51848j12076P9633j3112K07979p8480k07697k9844L05322
$$ 3995698 3915399 4067247 3955171 4034804 4021692 4229671 4151191 3943494 3913650 4218972
11109D218972q8201J51539o9731k91049K18149j05429J51n9773j79987K49957
$$ 4218972 4130771 4282310 4212579 3921530 4139679 4034250 4034401 3974628 3794641 4044598
11099D044598k65047l2321Q0016j38007L6921l8681j55396r2652K75871q1257
$$ 4044598 3779551 3747230 3827246 3689239 3726160 3687479 3532083 3439431 3715302 3634045
11089C634045n0785J71484l45952K07504k12481K27223k81229K04705K348j42155
$$ 3634045 3583260 3754744 3408792 3616296 3403815 3631038 3349809 3554514 3556862 3414707
11079C414707J28377K56204N0377k32636O7852j42143M4518J3424j72989J42862
$$ 3414707 3543084 3799288 3849665 3617029 3684881 3542738 3587256 3600680 3427691 3570553
11069C570553K65157n4724K17239o0532l3685M8181k05j16556M21930j9812j63065
$$ 3570553 3835710 3780986 3998225 3937693 3904008 3952189 3951984 3835428 4257358 4237546 4074481
11058D074481O3083l2935M2471j13263L5945J44401j59041J05051K6830K51485
$$ 4074481 4137564 4104629 4147100 4033837 4069782 4214183 4055142 4160193 4187023 4438508
11048D438508k97007j35348J42869p5433J58233j81860j50701K57871J80954M7042
$$ 4438508 4141501 4006153 4149022 4073589 4231822 4049962 3899261 4157132 4338086 4385128
11038D385128l66565K86676j05168L58064l935j64974J59056J76337n0314J30462
$$ 4385128 4018563 4305239 4200071 4558135 4554200 4389226 4548282 4724619 4674305 4804767
11028D804767K48769l77476O37073j23717M53917j53294K399N01229j59735K10425
$$ 4804767 5053536 4676060 5313133 5189416 5643333 5490039 5492438 5993667 5833932 6044357
11018F044357m3180M2523o1308K33733J49562Q2892N8986q9882J79200L7961n8198
$$ 6044357 6001177 6043700 5982392 6216125 6365687 6448579 6507565 6417683 6596883 6634844 6576646
11007F576646j81167L98421j5057L21489j56320L24407j12114J95833J56655J54920
$$ 6576646 6395479 6793900 6778843 7100332 6944012 7268419 7156305 7352138 7508793 7663713
10997G663713L46128K64865K21197j11731L73420j42958J93898J67638l15K20978
$$ 7663713 8009841 8274706 8495903 8384172 8757592 8614634 8808532 8976170 8975855 9196833
10987I196833J4506L33719p9156Q112K08885K00415O0202M56179J71323K95330
$$ 9196833 9211339 9545058 9465902 9474014 9682899 9883314 9943516 10399695 10571018 10866348
10977A0866348J85501R9626K05578Q6968N6813j7931L07094j06299K26311K23806
$$ 10866348 11051849 11151475 11357053 11444021 11500834 11482903 11789997 11683698 11910009 12133815
10967A2133815M63632N56J60987M32115J22470M22911K46654J54212K72468J17367
$$ 12133815 12597447 12598003 12758990 13191105 13313575 13736486 13983140 14137352 14409820 14527187
10957A4527187J61644N69469K29635L27735J15645P47756m1298M07167K27510
$$ 14527187 14688831 15258300 15487935 15815670 15931315 16679071 16637773 17044940 17272450
10948A7272450M16508O8587K92938K21128K74927K54190J69296L31605J3862K97125
$$ 17272450 17688958 17757545 18050483 18271611 18546538 18800728 18970024 19301629 19315491 19612616
10938A9612616L67777K04000K03828M30983K39675k18535O00664J75488L20572
$$ 19612616 19980393 20184393 20388221 20819204 21058879 20840344 21441008 21616496 21937068
10929B1937068L44470N23744L42702M84512L95774N82236N77312L46091M86418
$$ 21937068 22281538 22805282 23147984 23632496 24028270 24610506 25187818 25533909 26020327
10920B6020327K61215N08254J85420K87085K54679O3793n1688o979J35101K56113
$$ 26020327 26281542 26789796 26975216 27262301 27516980 27580773 27529085 27522106 27657207 27913320
10910B7913320N4003o2961P7921j1832O8951r5562K61637K75639k61790J2077
$$ 27913320 27967323 27904362 27982283 27970451 28039402 27943840 28205477 28481116 28219326 28231403
10900B8231403J15689J8904J50649M8355J82665Q5005k2052M59206P1432L12051
$$ 28231403 28347092 28365996 28516645 28565000 28747665 28832670 28810618 29269824 29341256 29653307
10890B9653307J81748N18623K81798N80030M02603N80164M59494O54628J002461
$$ 29653307 29835055 30353678 30635476 31215506 31618109 32198273 32657767 33312395 34314856
10881C4314856P53846J106366J364286J152313J469510J698149J740212K017187
$$ 34314856 35068702 36175068 37539354 38691667 40161177 41859326 43599538 45616725
10873D5616725J830755K453788J813124J953448K357575J765666J623322J137335
$$ 45616725 47447480 49901268 51714392 53667840 56025415 57791081 59414403 60551738
10865F0551738Q59791N83036J8621l55878p21306j220233j578430j465296j876337
$$ 60551738 61411529 61994565 62013186 61657308 60936002 59715769 58137339 56672043 54795706
10856E4795706k157499j807557k413818k130793k322609k225414k021146k079816
$$ 54795706 52638207 50830650 48416832 46286039 43963430 41738016 39716870 37637054
10848C7637054j926258k108393j636829j799136j826483j615069j483834j350483
$$ 37637054 35710796 33602403 31965574 30166438 28339955 26724886 25241052 23890569
10840B3890569j466928r54604j165334j435213q18629q66815q26433p25256q32357
$$ 23890569 22423641 21469037 20303703 18868490 18049861 17183046 16356613 15631357 14799000
10831A4799000o83688q00737m70255m91888o78063k24913p65781l57496m70529
$$ 14799000 14115312 13314575 12844320 12352432 11674369 11449456 10683675 10326179 9855650
10822I855650m41347j41484l92064l03711l27448Q2315j19776j81374j89207K1651
$$ 9855650 9414303 9272819 8880755 8577044 8249596 8331911 8212135 8030761 7841554 7863205
10812G863205O2690m82981M16166m18017P2101l14322k10977j26397m75058k71639
$$ 7863205 7925895 7442914 7859080 7441063 7513164 7198842 6987865 6861468 6386410 6114771
10802F114771j97956k94418l76494j15073J39329l23256O0453n8657k83554K0154
$$ 6114771 5916815 5622397 5245903 5130830 5270159 4946903 5007356 4948699 4665145 4685299
10792D685299k53186k20330K62698k12353m6951J3570n0323j93108J9392N6590
$$ 4685299 4432113 4211783 4474481 4262128 4215177 4228747 4178424 3985316 4004708 4061298
10782D061298Q1331k94902j26607K11302l25726K45213n85500K13277R2975k27653
$$ 4061298 4142629 3847727 3721120 3932422 3606696 3851909 3266409 3479686 3572661 3345008
10772C345008l1623j1642j51595K52856j66652R5723m9960k08996n6562n1098
$$ 3345008 3313385 3301743 3150148 3403004 3236352 3332075 3282115 3073119 3016557 2965459
10762B965459j2896n2124J87703j13329M9747j61411J99810p3404J44351J4765
$$ 2965459 2952563 2900439 3088142 2974813 3024560 2863149 3062959 2989555 3133906 3148671
10752C148671j8953j30855r098K95858l88642K02026J5797j56609j46737p6931
$$ 3148671 3129718 2998863 2989765 3285623 2896981 3099007 3114804 2958195 2811458 2734527
10742B734527n4934m5930L13558j58075k07814j34638J86831L0049P0461L7102
$$ 2734527 2679593 2633663 2947221 2789146 2581332 2446694 2633525 2663574 2734035 2771137
10732B771137r3305K01706j51900K97750k86241K68924L2716J02152j02395r5326
$$ 2771137 2677832 2879538 2727638 3025388 2739147 3008071 3040787 3142939 3040544 2945218
10722B945218j59714L40279l34094L38291q4324k61647L08869l7865j02678J36185
$$ 2945218 2785504 3125783 2791689 3129980 3045656 2784009 3092878 3055013 2952335 3088520
10712C088520K0166j4378r2094L12684q8716J16650j61812k2279J67434m1143
$$ 3088520 3108686 3094308 3002214 3314898 3226182 3342832 3181020 3158741 3326175 3285032
10702C285032k9232j42095J70164j90476L4211j19073j75754J94943k95501N5007
$$ 3285032 3255800 3113705 3283869 3093393 3127604 3008531 2832777 3027720 2732219 2787226
10692B787226l095j31256L15877j57138K33121j07253N2133O4243N9826l01656
$$ 2787226 2784131 2652875 2968752 2811614 3044735 2937482 2989615 3053858 3113684 2812028
10682B812028o3527m6150J19693M702m2506J30293J05417R991r3795K16774j05479
$$ 2812028 2748501 2702351 2822044 2826746 2784240 2914533 3019950 3029941 2936146 3152920 3047441
10671C047441j31075P8081j18139j92059j03665J31462j90229j36655J42494J17936
$$ 3047441 2916366 2994447 2876308 2684249 2580584 2712046 2521817 2385162 2527656 2645592
10661B645592j61733l16013R1980o6735N6861k17899J78195k05777K79857m6921
$$ 2645592 2483859 2167846 2259826 2193091 2249952 2032053 2210248 2004471 2284328 2237407
10651B237407m4087M1130k21143J68537J87832m07566L9405P331J18705k64916
$$ 2237407 2193320 2234450 2013307 2181844 2369676 1962110 2001515 2008846 2127551 1862635
10641A862635J1097l7367k06081K81741m669q8705q4495J45289j42091R000P2608
$$ 1862635 1873732 1836365 1630284 1912025 1907356 1818651 1734156 1879445 1737354 1746354 1818962
10630A818962k3450L3680j32566L382J1822p3261M2747j37529J84499J1192K9092
$$ 1818962 1795512 1829192 1696626 1700008 1711830 1638569 1681316 1543787 1728286 1739478 1768570
10619A768570m0977k05669Q8007J40256l76672N72038k80294J32945K1359j26424
$$ 1768570 1727593 1521924 1609931 1750187 1373515 1945553 1665259 1798204 1819563 1693139
10609A693139J35347j60801j49886J48809p8396K4427j97626J80984q5301N7560
$$ 1693139 1828486 1667685 1517799 1666608 1588212 1612639 1415013 1595997 1510696 1568256
10599A568256M18347k27261p2994J26742q9539O8737K9787l20625K19570J75786
$$ 1568256 1986603 1759342 1686348 1813090 1723551 1792288 1822075 1501450 1721020 1896806
10589A896806k59167R5381j36316L77826j84356J10332J18163j45185N9070k07342
$$ 1896806 1637639 1733020 1596704 1974530 1790174 1900506 2018669 1873484 1932554 1725212
10579A725212L67909k11319q8109J66092k12412J68561j77162K08686r3656Q762
$$ 1725212 2093121 1881802 1793693 1959785 1747373 1915934 1738772 1947458 1853802 1862564
10569A862564o3564l09865J38801J33282j63532l8292j551P528L4974j45407K27706
$$ 1862564 1799000 1489135 1627936 1761218 1597686 1559394 1557843 1565371 1600345 1454938 1682644
10558A682644j54921J5769j10890K8048l9376P3698N014n5653R3006j44326l6853
$$ 1682644 1527723 1543492 1432602 1460650 1421274 1494972 1499986 1444333 1537339 1393013 1356160
10547A356160j75514J72588r3424r0252J74552J6814j23262K79354j18718M4295
$$ 1356160 1180646 1353234 1259810 1169558 1344110 1360924 1237662 1517016 1398298 1442593
10537A442593n1474Q7104N7338n9106N9399K4259n4662J39275O4613k02124N1805
$$ 1442593 1391119 1478223 1535561 1476455 1535854 1560113 1505451 1644726 1709339 1507215 1559020
10526A559020N8264J11805K1976M7309j90800M19489q6775J89898P5889L9808
$$ 1559020 1617284 1729089 1751065 1798374 1607574 2027063 1940288 2130186 2206075 2245883
10516B245883J23403O2551J65067n2534j97924j44749J5851o6618l76936J73461
$$ 2245883 2369286 2431837 2596904 2544370 2346446 2201697 2217548 2150930 1773994 1947455
10506A947455l39987p6017o6276N8480K03957K6525R0904k06968R04L07807j3538
$$ 1947455 1607468 1531451 1465175 1523655 1727612 1754137 1845041 1638073 1638977 1946784 1933246
10495A933246J56771m63338J41283K55565K68593m239j35289K82600m9315K82655
$$ 1933246 2090017 1626679 1767962 2023527 2292120 2287881 2152592 2435192 2385877 2668532
10485B668532k94234N6087M7313j69389j51823q2400j03237j76699K54945j05421
$$ 2668532 2374298 2430385 2477698 2308309 2156486 2074086 1970849 1794150 2049095 1943674
10475A943674j1684J3846J97310M4795j04170j19686K13075l5404m8807J06901
$$ 1943674 1931990 1945836 2143146 2187941 2083771 1964085 2177160 2141756 2092949 2199850
10465B199850K07656M4427J09758o9552K56770K44900k86562j58321K29492K1764
$$ 2199850 2407506 2451933 2561691 2492139 2748909 2993809 2707247 2548926 2778418 2800182
10455B800182K0603j19762L32241j82427L25673q4829Q7355O8201j11735j04400
$$ 2800182 2820785 2701023 3033264 2850837 3176510 3091681 3179036 3247237 3135502 3031102
10445C031102j87867J04456k68156j15284k5767n9304K73240K55916J73992K0515
$$ 3031102 2843235 2947691 2679535 2564251 2538484 2479180 2752420 3008336 3182328 3202843
10435C202843J12935J87167N8606j5870j14415m80350k32973j50326l87541J34318
$$ 3202843 3315778 3502945 3561551 3545681 3431266 2950916 2717943 2567617 2180076 2314394
10425B314394k63535J46170k67712K52124j48141P295K05085j36749p881l3678
$$ 2314394 2050859 2197029 1929317 2181441 2033300 2040595 2245680 2108931 2101050 2067372
10415B067372L5142J09193q2862J61692M93868O8609K58142o0449q7456K41737
$$ 2067372 2102514 2211707 2128845 2290537 2784405 2853014 3111156 3050707 2963251 3204988
10405C204988L2542K54189K24176J6344N1897j11818J5001K68212L00974K01201
$$ 3204988 3237530 3491719 3715895 3732239 3784136 3672318 3687319 3955531 4256505 4457706
10395D457706K66554M90102M35354M85632P60307K99463M76468K98261J98482
$$ 4457706 4724260 5214362 5649716 6135348 6895655 7195118 7671586 7969847 8168329
10386H168329K40659j02189K0218k91139k81588p03221m58007k75668m48611k60062
$$ 8168329 8408988 8306799 8327017 8035878 7754290 7051069 6593062 6317394 5868783 5608721
10376E608721l17295q4026r547J5164k58918J64207j36291L39072n8381l9451
$$ 5608721 5291426 5207400 5197853 5213017 4954099 5118306 4982015 5321087 5262706 5223255
10366E223255K8494p382K02217k74493J16929K0584l51458j67116j44741r9269
$$ 5223255 5251749 5244367 5446584 5172091 5289020 5309604 4958146 4791030 4646289 4547020
10356D547020n607o5932O4878j14797j95207M2094N062j3416L946m38514K10745
$$ 4547020 4541413 4475481 4540359 4425562 4230355 4272449 4277511 4264095 4268041 3829527 4040272
10345D040272j16022k15205P9145Q6958k7492J0030J41962L936M6903l8441J14423
$$ 4040272 3924250 3709045 3788190 3875148 3847656 3857686 3999648 4003584 4050487 4012046 4126469
10334D126469P6839J94909j45641j28k3460J30035n98082J83853J12608J08503
$$ 4126469 4203308 4398217 4252576 4252448 4228988 4359023 3760941 3944794 4057402 4165905
10324D165905r4450k11669J11852j51687K46048k18214O9104J93724N4872K69271
$$ 4165905 4071455 3859786 3971638 3819951 4065999 3847785 3916889 4110613 4165485 4434756
10314D434756n6050o9768r2073P8565L78103k62231J51352o7257N28669k03247
$$ 4434756 4378706 4308938 4216865 4295430 4673533 4411302 4562654 4495397 5024066 4820819
10304D820819K31909k72933K35617j38921k01433j17803K07981r1659j5733m0916
$$ 4820819 5052728 4779795 5015412 4876491 4675058 4557255 4765236 4673577 4657844 4616928
10294D616928J4874K773K41971j47528K12603K89909j17898L25987Q5219J46453
$$ 4616928 4631802 4634575 4876546 4729018 4941621 5231530 5113632 5439619 5524838 5671291
10284E671291K40202J10347N25910j669N14459J41068M91825Q6807J18112L19829
$$ 5671291 5911493 6021840 6547750 6546081 7060540 7201608 7693433 7780240 7898352 8218181
10274H218181P465K58629J56888K08617J94022L34627K39035O6050L70277P6458
$$ 8218181 8225646 8484275 8641163 8849780 9043802 9378429 9617464 9683514 10053791 10130249
$$ [...]
##END NTUPLES=NMR SPECTRUM
##END=
