##TITLE=Coffee green (M2-ROVE20 + 1.5mL buffer 50/50,  450uL extracto + 50uL (D2O+TMS))
without heating, vortex and centrifuged, temperature 0oC.
##JCAMPDX= 6.0         $$ Bruker NMR JCAMP-DX V2.0
##DATA TYPE= NMR SPECTRUM
##DATA CLASS= NTUPLES
##ORIGIN= Bruker BioSpin GmbH
##OWNER= Administrator
$$ 1.72 TOPSPIN		Version 2.1
$$ 2012-05-22 16:12:18.840 -0700  Administrator@X
$$ Compression mode = diff/dup
##.OBSERVE FREQUENCY= 400.13188198
##.OBSERVE NUCLEUS= ^1H
##.ACQUISITION MODE= SIMULTANEOUS (DQD)
##.ACQUISITION SCHEME= undefined
##.AVERAGES= 64
##.DIGITISER RES= 22
##SPECTROMETER/DATA SYSTEM= spect
##.PULSE SEQUENCE= noesygppr1d
##.SOLVENT NAME= H2O+D2O
##.SHIFT REFERENCE= INTERNAL, H2O+D2O, 1, 14.97969
##AUDIT TRAIL= $$ (NUMBER, WHEN, WHO, WHERE, PROCESS, VERSION, WHAT)
$$ ##TITLE= Audit trail, TOPSPIN		Version 2.1
$$ ##JCAMPDX= 5.01
$$ ##ORIGIN= Bruker BioSpin GmbH
$$ ##OWNER= Administrator
$$ $$ c:\Bruker\TOPSPIN/data/jwist/nmr/11-coffee-green-quantification-2/91/pdata/1/auditp.txt
$$ ##AUDIT TRAIL=  $$ (NUMBER, WHEN, WHO, WHERE, PROCESS, VERSION, WHAT)
(   1,<2011-11-17 15:37:45.466 -0500>,<Administrator>,<TOPSPIN>,<go>,<TOPSPIN 2.1>,
      <created by zg
	started at 2011-11-17 15:28:50.669 -0500,
	POWCHK enabled, PULCHK disabled,
       configuration hash MD5:
       DA 63 81 1B EF 4C B5 72 B4 DF EA D9 B4 DB 4C 08
       data hash MD5: 64K
       21 7D DC 15 F9 4C 09 CC 3B 5A F6 6F 64 0F 5B BD>)
(   2,<2011-11-17 18:16:22.888 -0500>,<Administrator>,<TOPSPIN>,<proc1d>,<TOPSPIN 2.1>,
      <Start of raw data processing
       efp LB = 0 FT_mod = 6 PKNL = 1 PHC0 = 0 PHC1 = 0 SI = 32K 
       data hash MD5: 32K
       8D 5B EE E1 32 97 3A F4 58 B2 CF ED A5 CA 97 9A>)
(   3,<2011-11-17 18:16:23.247 -0500>,<Administrator>,<TOPSPIN>,<proc1d>,<TOPSPIN 2.1>,
      <pk PHC0 = 24.02161 PHC1 = 0 
       data hash MD5: 32K
       87 F6 5A 73 33 84 35 5A 48 11 B0 8E 09 EC FE 24>)
$$ ##END=
$$ 
$$ $$ hash MD5
$$ $$ A5 7C 47 A4 38 2F AE 50 99 3F 5A 37 7F 2D E8 41
##$RELAX= 
##$RELAX= 
##$RELAX= 
##$RELAX= 
##$RELAX= 
##$RELAX= 
$$ Bruker specific parameters
$$ --------------------------
##$DU= <Z:>
##$EXPNO= 91
##$NAME= <11-coffee-green-quantification-2>
##$PROCNO= 1
##$TYPE= <nmr>
##$USER= <jwist>
##$ACQT0= -8.21135746543268
##$AMP= (0..31)
100 100 100 100 100 100 100 100 100 100 100 100 100 100 100 100 100 100
100 100 100 100 100 100 100 100 100 100 100 100 100 100
##$ANAVPT= -1
##$AQSEQ= 0
##$AQ_mod= 3
##$AUNM= <au_prof>
##$AUTOPOS= <>
##$BF1= 400.13
##$BF2= 400.13
##$BF3= 400.13
##$BF4= 400.13
##$BF5= 400.13
##$BF6= 400.13
##$BF7= 400.13
##$BF8= 400.13
##$BYTORDA= 0
##$CFDGTYP= 0
##$CFRGTYP= 9
##$CHEMSTR= <none>
##$CNST= (0..63)
1 1 145 1 1 1 1 1 1 1 1 1 1 1 1 1 1 1 1 1 1 1 1 1 1 1 1 1 1 1 1 1 1 1 1
1 1 1 1 1 1 1 1 1 1 1 1 1 1 1 1 1 1 1 1 1 1 1 1 1 1 1 1 1
##$CPDPRG= <>
##$CPDPRG1= <>
##$CPDPRG2= <>
##$CPDPRG3= <>
##$CPDPRG4= <mlev>
##$CPDPRG5= <mlev>
##$CPDPRG6= <mlev>
##$CPDPRG7= <mlev>
##$CPDPRG8= <mlev>
##$CPDPRGB= <>
##$CPDPRGT= <>
$$ [...]
150 150 150 150 150 150 150 150
##$TP07= 0
##$TPNAME0= <>
##$TPNAME1= <>
##$TPNAME2= <>
##$TPNAME3= <>
##$TPNAME4= <>
##$TPNAME5= <>
##$TPNAME6= <>
##$TPNAME7= <>
##$TPOAL= (0..7)
0.5 0.5 0.5 0.5 0.5 0.5 0.5 0.5
##$TPOFFS= (0..7)
0 0 0 0 0 0 0 0
##$TUNHIN= 0
##$TUNHOUT= 0
##$TUNXOUT= 0
##$USERA1= <user>
##$USERA2= <user>
##$USERA3= <user>
##$USERA4= <user>
##$USERA5= <user>
##$V9= 5
##$VALIST= <valist>
##$VCLIST= <CCCCCCCCCCCCCCC>
##$VD= 0
##$VDLIST= <DDDDDDDDDDDDDDD>
##$VPLIST= <PPPPPPPPPPPPPPP>
##$VTLIST= <TTTTTTTTTTTTTTT>
##$WBST= 2048
##$WBSW= 25
##$XGAIN= (0..3)
0 0 0 0
##$XL= 0
##$YL= 0
##$YMAX_a= 4992508
##$YMIN_a= -1922924
##$ZGOPTNS= <>
##$ZL1= 120
##$ZL2= 120
##$ZL3= 120
##$ZL4= 120
##$ABSF1= 0
##$ABSF2= 0
##$ABSG= 0
##$ABSL= 0
##$ALPHA= 0
##$AQORDER= 0
##$ASSFAC= 0
##$ASSFACI= 0
##$ASSFACX= 0
##$ASSWID= 0
##$AUNMP= <proc_prof1d>
##$AXLEFT= 0
##$AXNAME= <>
##$AXNUC= <1H>
##$AXRIGHT= 0
##$AXTYPE= 0
##$AXUNIT= <>
##$AZFE= 0.1
##$AZFW= 0.1
##$BCFW= 0
##$BC_mod= 0
##$BYTORDP= 0
##$COROFFS= 0
##$CY= 15
##$DATMOD= 1
##$DC= 0
##$DFILT= <>
##$DTYPP= 0
##$F1P= 14.9796895980835
##$F2P= -5.57284135567231
##$FCOR= 0.5
##$FTSIZE= 32768
##$FT_mod= 6
##$GAMMA= 0
##$GB= 0
##$INTBC= 1
##$INTSCL= 1
##$ISEN= 128
##$LB= 0
##$LEV0= 0
##$LPBIN= 0
##$MAXI= 10000
##$MC2= 0
##$MEAN= 0
##$ME_mod= 0
##$MI= 0
##$NCOEF= 0
##$NC_proc= -6
##$NLEV= 6
##$NOISF1= 0
##$NOISF2= 0
##$NSP= 0
##$NTH_PI= 0
##$NZP= 0
##$OFFSET= 14.97969
##$PC= 1
##$PHC0= 24.02161
##$PHC1= 0
##$PH_mod= 1
##$PKNL= yes
##$PPARMOD= 0
##$PPDIAG= 0
##$PPIPTYP= 0
##$PPMPNUM= 2147483647
##$PPRESOL= 1
##$PSCAL= 4
##$PSIGN= 0
##$PYNMP= <proc.py>
##$REVERSE= no
##$SF= 400.13
##$SI= 32768
##$SIGF1= 0
##$SIGF2= 0
##$SINO= 400
##$SIOLD= 32768
##$SPECTYP= <>
##$SREGLST= <1H.H2O+D2O>
##$SSB= 0
##$STSI= 32768
##$STSR= 0
##$SW_p= 8223.68421052631
##$SYMM= 0
##$S_DEV= 0
##$TDeff= 65536
##$TDoff= 0
##$TI= <>
##$TILT= no
##$TM1= 0
##$TM2= 0
##$TOPLEV= 0
##$USERP1= <user>
##$USERP2= <user>
##$USERP3= <user>
##$USERP4= <user>
##$USERP5= <user>
##$WDW= 1
##$XDIM= 32768
##$YMAX_p= 384211342
##$YMIN_p= -28914115
##$CURPLOT= <Network HP LaserJet P1505>
##$CURPRIN= <$Network HP LaserJet P1505>
##$DFORMAT= <normdp>
##$LAYOUT= <+/1D_H.xwp>
##$LFORMAT= <normlp>
##$PFORMAT= <normpl>
##$SURQMSG= 1
$$ End of Bruker specific parameters
$$ ---------------------------------
##NTUPLES= NMR SPECTRUM
##VAR_NAME=  FREQUENCY,     SPECTRUM/REAL,   SPECTRUM/IMAG
##SYMBOL=    X,             R,               I
##VAR_TYPE=  INDEPENDENT,   DEPENDENT,       DEPENDENT
##VAR_FORM=  AFFN,          ASDF,            ASDF
##VAR_DIM=   32768,         32768,           32768
##UNITS=     HZ,            ARBITRARY UNITS, ARBITRARY UNITS
##FACTOR=    0.250966925370066, 1,           1
##FIRST=     8223.43324360094, -45928,       -48515
##LAST=      0,             79883,           -148505
##MIN=       0,             -28914115,       0
##MAX=       8223.43324360094, 384211342,    0
$$ Real data points
##PAGE= N=1
##DATA TABLE= (X++(R..R)), XYDATA
$$ [...]
23423 201608 265887 133307 528756 255262 279206 485916 343674 298553 336893 347601
23413 347601 456678 183761 377455 218082 267805 346029 365387 316446 256815 297882 312437
23402 312437 446558 385618 392064 638500 511582 452372 333783 418168 307872 326072 496313
23391 496313 454434 457905 265593 519017 476481 349385 650353 607402 540064 714762 574541
23380 574541 647510 1111896 1003530 1282170 1437333 1731012 2319106 2865357 3788279 5219649
23370 5219649 6610130 8534652 10217784 12638392 14720536 17255192 19417720 21609544
23362 21609544 23696879 25002797 25885601 26088692 26227276 25713051 24307555 22886203 20460067
23353 20460067 18222287 15900089 13588191 11487302 9168114 7172789 5601378 4245480
23345 4245480 3223126 2275740 1857716 1453627 1263685 1094745 823325 465881 633683
23336 633683 481870 318636 471571 515378 274339 522160 449828 227770 377839 373511
23326 373511 369661 39061 323387 63469 243910 218246 352273 227367 363719 470783
23316 470783 475574 217743 319645 423789 287394 92779 367000 209699 203233 208227 485914
23305 485914 114688 306291 198106 245575 150800 191969 245906 187128 196466 388832 338783
23294 338783 174470 114081 206366 423894 168733 129791 185778 323375 170542 271493
23284 271493 190503 344803 325877 276869 243489 450152 319107 584777 292130 158459
23274 158459 308483 286397 306051 455331 345845 109932 316345 423133 255938 170230
23264 170230 365731 237335 226966 230058 74015 430091 52871 144365 76389 484559 135827
23252 393872 323499 252569 333957 293284 384618 261375 44481 281129 196258 430146 308741
23241 308741 40462 258834 124761 75117 128220 255634 141824 271631 295434 106869
23230 307918 225444 363802 168952 146318 148170 285960 65724 -140267 303182 -8705 224477
23218 312255 167897 173467 173852 138810 150391 319891 195058 343235 237033 368566 330501
23207 330501 72975 254878 -71892 362048 4592 289983 465191 314836 474172 284369
23197 284369 31753 77735 136912 233518 17627 95393 166968 320577 189964 149067 197665
23186 197665 50046 51461 134050 217852 2238 250075 135737 59093 352165 312359 -88589
23174 158839 305298 115680 237380 228600 298929 -4257 289777 420026 -1249 82617 226649
23163 226649 289383 217152 207857 300246 157356 154804 404353 247382 37994 245465 294367
23152 294367 116835 329665 123650 461868 -31971 350119 267301 8709 138949 145820 371222
23141 371222 208347 184217 226156 482403 83479 448730 253727 149013 318096 224187
23131 224187 491552 253034 451820 449679 13614 329853 134114 253600 361637 244417
23121 244417 162336 296503 288519 178065 126031 58745 281562 189221 389746 273871 234870
23110 234870 334373 175139 208814 107370 191511 485038 395160 634090 335890 260185
23100 260185 401346 241521 329717 477907 132388 264305 385883 277080 497027 244931
23089 202662 262966 280178 358680 328141 273805 436721 119923 249592 253957 266601 325610
23078 325610 61128 521955 348818 372038 213255 411408 287966 213950 275161 257520
23068 257520 301887 312766 198077 394654 331861 408460 179944 229276 422950 343648 215600
23057 215600 57089 252968 277684 167937 271747 399027 279508 105862 327294 447518
23047 447518 288744 196955 461655 174238 358667 137733 425134 131627 285586 72557
23036 308225 231414 69508 123172 384935 353234 385495 90608 237585 435020 253976 303739
23025 303739 400541 384841 517453 151161 528009 240749 232583 224211 236598 436201 330684
23014 330684 337114 37535 391179 392220 202890 226128 499626 363159 337494 357742 376598
23003 376598 311509 328291 456813 348994 522181 312379 265273 261779 293319 474834 453173
22992 453173 239001 366752 306200 195401 316213 472574 487205 593096 517248 277884
22982 277884 796460 246427 544451 522987 258809 551303 486006 608343 518637 664844
22972 664844 348759 830665 280419 466147 591676 683069 560875 611578 661195 652872
22962 652872 441958 630238 765483 843406 755907 807838 1067619 925053 1028888 961574
22952 961574 1280171 1567359 2384789 2959814 3915709 4920859 6065099 7202834 8876937
22943 8876937 10319540 11836154 12752684 13660906 13978251 14104557 14413107 14151943 13505313
22934 13505313 12198302 11108173 9753517 8523557 7433768 6383086 5049264 4164862
22926 4164862 3388297 2775712 2462739 2543553 2559227 2671479 2980063 3638556 4222813 5297959
22916 5297959 6507650 8074048 9874856 11926520 14290089 16562098 18506881 20958871
22908 20958871 22517879 23904179 24681492 25281414 25232047 25087632 23719668 22175684 20213282
22899 20213282 18448046 16434267 14338656 12249142 10268565 8653245 7758834 7111975
22891 7111975 6425377 6566004 6757961 7055153 7831899 8408103 9073249 9753419 10394290
22882 10394290 11121187 11490814 11673294 11707706 11397085 11251094 10606906 10063695 9038952
22873 9038952 8333693 7321275 6426631 5311725 4744346 4090772 3532101 2662459 2545947
22864 2545947 2170571 1811561 1708221 1543322 1117274 1168735 1019595 793448 1008904 998597
22854 998597 715307 725940 727163 774728 553197 383886 482892 424502 261102 576642 413728
22843 413728 501985 512172 420106 333173 496463 544499 533820 261162 336778 607340 381218
22832 381218 318758 316193 416738 610372 414998 258706 443402 391128 447861 302416
22822 302416 526182 558073 472515 306703 425247 594308 360118 233223 392526 284591
22812 284591 325202 168216 384642 233027 435829 370226 430358 258189 188225 369697
22802 369697 313648 359024 524184 181466 323401 422596 425345 329540 419004 234498 195221
22791 195221 458639 307221 297627 395870 301883 320976 267372 58952 390811 431923 359361
22780 359361 398409 101185 235301 299596 359440 214779 261511 313543 406002 195136 432656
22769 432656 419921 388662 322992 480550 362796 446197 183943 254134 184242 293628 213459
22758 213459 18476 262119 375910 237801 430967 399680 267528 277912 404672 268223
22748 268223 378945 560495 163820 390123 246203 203821 272064 410627 325613 236734
22738 236734 169681 310246 142706 309635 229298 209659 287311 623818 484046 504522
22728 504522 636997 469062 439965 498777 484517 248824 306144 308225 332453 135957 179793
22717 179793 18787 174823 293151 166166 276018 353003 337972 159987 115196 293356
22707 293356 414441 217880 131461 386566 101214 23845 241292 -74203 552722 317508
22697 317508 383795 308415 321365 392458 307226 368392 143972 323695 302650 324960 187047
22686 187047 281521 288267 208538 120605 291196 359518 112952 314614 276509 301983 267348
22675 267348 215840 397313 172475 327541 446405 310677 455642 343679 243968 389140
22665 389140 438227 330547 109945 238626 169773 272972 311226 324281 277617 261142 427693
22654 427693 244401 202061 182039 354432 369305 432812 534121 276811 376088 191302
22644 191302 359859 488766 380745 321065 321232 239227 174430 410996 433936 474537 324405
22633 324405 155762 433460 223702 370959 215110 550402 428489 531986 621748 273516
22622 192814 561384 350243 250825 593334 -57356 391826 425406 573062 355150 409096
22612 409096 663692 461385 420426 91574 327509 423066 482806 292236 250551 504194
22602 504194 276032 346784 291212 492128 377930 415976 366509 477938 379019 351020 303799
22591 303799 405509 403657 443522 410857 374993 713911 567378 76327 365486 223159 308071
22580 308071 438041 229887 413472 562192 658810 276878 289780 501473 418594 638044
22570 638044 246707 520459 586102 554886 461730 415501 430847 474438 239787 404432 583587
22559 583587 542323 343424 364154 221353 661844 203803 479726 609222 549815 330397
22549 330397 371041 442547 473744 365037 366431 443021 267575 291801 372713 273531 440387
22538 440387 454670 363002 263985 508617 479346 486115 570557 276207 594427 326330 496042
22527 496042 628605 299744 342252 592982 581320 638775 229209 429724 399286 298930
22517 298930 464808 689366 452571 541344 480591 450176 579455 562369 593615 497836 560372
22506 560372 523840 513872 434049 376358 640133 566272 659012 411547 559466 573085 205072
22494 413902 392033 333374 538022 401876 581641 683720 225415 384405 479511 546220
22484 546220 156923 659455 492466 450832 320678 384693 414401 586155 329257 307316
22474 307316 338891 393543 601674 403935 597797 464281 417206 445066 631477 551861
22464 551861 424254 337588 277246 494500 330270 342898 455580 352126 548152 281264
22454 281264 405112 450166 532005 649745 270367 484201 443046 555932 645248 477715
22444 477715 266490 197215 364956 415148 401497 343882 638215 585439 652254 411720 380000
22433 380000 511967 544751 351175 492943 386190 287090 624057 407601 446681 518484
22423 518484 513921 724102 416284 332563 424275 298801 497013 611889 540716 263539
22412 437857 421329 521864 624894 487690 332698 615595 619811 731436 487579 682114
22402 682114 305981 561453 554813 527480 484888 660937 393299 633858 501939 170549
22391 643175 604879 380916 555456 724841 312267 527668 365628 545957 336975 430589
22381 430589 627936 513398 479093 538714 635550 308427 339044 603530 303511 539961
22371 539961 566162 544024 517746 526669 328427 653936 617960 275021 441630 208701 595727
22360 595727 454658 436813 375410 469553 470293 397448 699647 649628 573872 440862 803263
22349 803263 585378 383950 703693 343445 488047 362943 555762 506094 588884 494381
22339 494381 432968 616018 633854 454494 277423 568109 695255 622435 873100 1020216
22329 1020216 1278522 1339208 1067860 1262680 1205981 1208420 1139675 1001248 677482 565708
22319 565708 799738 849137 708326 423713 548794 734086 630008 443294 752626 675396
22309 675396 747943 720549 768490 687304 530505 723351 344581 573056 656887 527089
22299 527089 397746 739177 624766 379243 658114 584220 570036 613248 460525 782358
22289 782358 578329 709110 648196 691596 607941 590676 577841 341328 688485 717631 486776
22278 486776 399837 678015 514966 439125 813280 771937 808065 603529 534727 691986
22268 691986 769893 712972 588513 746287 561618 586902 720373 474000 544115 746301
22258 746301 747845 744554 657893 560023 600628 837562 854675 687246 637307 927974 788439
22247 788439 498691 803327 612958 747573 651538 681696 788286 350039 582274 573525
22237 573525 607850 697962 891043 774824 446838 765068 554981 498059 687574 729106
22227 729106 704747 678026 709789 665351 739448 671098 632769 556533 678209 714643 779285
22216 779285 677936 703877 825854 446646 811828 738699 838982 748783 672750 791185
22206 791185 471771 933303 637321 613144 1006123 853399 725439 707719 828505 916437
22196 916437 791737 953266 850418 614098 757285 810309 712500 825071 755125 747373
22186 747373 878850 595995 870999 1065020 687670 662922 548027 872363 781566 861958
22176 861958 510032 752961 670479 674584 838202 810259 731214 562392 616720 757180 931374
22165 931374 692176 616200 585083 578445 622023 711692 622743 468955 462070 867537 739075
22154 739075 752541 1112176 741304 729290 908811 786177 843518 894936 549853 828788
22144 828788 776063 800557 673192 578423 477923 559015 701264 612564 894310 754753
22134 754753 603046 833150 575568 602974 861228 779056 850757 555768 674059 706584
22124 706584 791608 649870 656805 847092 674438 456508 681430 564043 768701 550007
22114 550007 481815 612247 694237 550256 812747 430730 608954 587221 721732 883548
22104 883548 668092 750330 689982 746771 829013 695304 583634 892377 754309 753663 544986
22093 544986 606985 738579 664880 757120 877563 851796 495322 628579 944123 707106
22083 707106 948760 768150 414617 666601 817027 692612 838128 600157 821765 590334
22073 590334 782808 747928 768901 606906 807297 982629 683156 794435 639227 454836
22063 454836 939232 921453 787205 804835 589243 919842 851393 774640 725251 731797 943354
22052 943354 760884 877495 824595 531277 732836 849303 698954 821927 818377 678478
22042 678478 840190 724383 942293 725985 787762 701508 726038 909371 895934 749339
22032 749339 722215 548736 656251 827530 533834 622334 721584 570611 702601 659671
22022 659671 884624 674339 934572 638338 772487 928485 775859 857605 774206 768700
22012 768700 879860 694982 764560 711991 611742 756272 946063 658315 679490 761628
22002 761628 965324 760070 951737 892269 814592 729996 727469 799118 603013 709583 712620
21991 712620 810355 581382 1000465 885397 1122045 678250 964402 829202 794353 829121
21981 829121 707898 710394 913878 793912 715123 739295 698814 713497 831481 804658 769128
21970 769128 951758 777321 693367 673029 911758 830009 827605 657826 627088 874627 871833
21959 871833 656573 834417 890187 1029959 796137 986777 806139 828776 795131 886618
21949 886618 708809 668683 1084087 917891 905440 787851 739468 747618 847782 873713 921259
21938 921259 776265 807411 732243 887932 1074643 1000998 750949 1059147 1065634 791976
21928 791976 1041120 818719 721346 860281 399233 683870 853643 736558 856767 1021791
21918 1021791 936185 920187 892317 911705 657577 851396 1011495 1013868 737565 905985
21908 905985 1049240 899997 1023682 988727 734135 939859 1089346 1066948 846249 881664
21898 881664 895953 829306 912979 777223 877523 1075243 934646 816653 897073 805650
21888 805650 882744 841818 786024 1060178 812463 744581 790606 904826 777015 943700
21878 943700 1031895 689695 1121851 762671 748271 705685 851568 849414 1142621 898173
21868 898173 880773 869118 1056789 751314 794044 698481 802768 724974 738786 677271 807784
21857 807784 649891 1105053 862745 827944 742659 871584 677679 783680 882958 969976
21847 969976 748844 747616 961846 1228862 762210 1015114 977438 1011248 1043019 846722
21837 846722 899984 722827 613432 687241 646124 617534 783842 669014 721335 870083
21827 870083 761579 650377 688911 690485 775519 438246 731918 761681 690779 782627 858958
21816 858958 794917 975792 895640 956208 775504 667625 756483 801185 696897 916880
21806 916880 794421 883329 889695 724125 918995 1018524 877188 657649 732126 648316 749133
21795 749133 714148 691100 629101 853485 774408 671023 723758 649462 900927 1003405 843912
21784 843912 937085 849507 963278 710833 883935 798742 571555 871728 720750 851938
21774 851938 835425 753395 786810 968096 576818 866893 879293 995522 771627 1090778
21764 1090778 877887 773004 970475 961862 1032938 947264 1193408 1393617 1262711 1227684
21754 1227684 1441608 1711584 1682345 1723607 2040884 2114169 2402235 2653298 3140159 3617677
21744 3617677 4375507 4807934 5496686 6170089 6614104 7521745 7680553 7977539 7642026
21735 7642026 7408601 7238904 6879820 6032883 5358393 5018532 4433550 4217917 3947825
21726 3947825 3807421 3902630 4034811 4323772 4611220 4814321 5420347 6061158 6574346 7505874
21716 7505874 8233546 8955220 9766428 10389401 10882565 10981399 10960440 11329326 11130925 10918859
21706 10918859 10810303 10233151 9747262 9234251 8244328 7693728 6598153 6129267 5470363
21697 5470363 4764430 4469283 4070155 3915293 3965456 3820351 3748097 3692638 4401921 4747962
21687 4747962 4931947 5330615 6171351 6168287 7050489 7025004 7478776 7155044 7011741 6595831
21677 6595831 5671797 5285816 4636263 3934778 3646624 2987869 2442376 2323513 1905996
21668 1905996 1972821 1605317 1478203 1633037 1595234 1406933 940220 1263488 1093256 1180041
21658 1180041 1086740 1123968 1107155 924748 1042122 958425 1092301 1110356 861390 965578
21648 965578 906522 659754 747039 722945 677280 1008904 737776 845716 775543 774070 635811
21637 635811 877403 707885 838035 744485 960444 693182 358578 660074 708296 613639
21627 613639 758133 775963 828155 562450 823554 743229 874689 913303 666060 595522
21617 595522 838266 669669 839175 749598 794950 880249 574268 866979 554238 775247
21607 775247 772979 601578 771995 881911 849542 880344 838247 856792 901578 864671 1094813
21596 1094813 930841 1106387 985318 714007 942331 851973 804116 958246 771696 847835
21586 847835 886679 897545 1059929 724601 886125 755189 775211 925235 825094 726784
21576 726784 872809 830723 812737 801269 872992 610700 918768 530845 880886 804961
21566 804961 937249 792248 703399 846750 574362 721452 695322 708367 690932 749946
21556 749946 589862 674898 776947 856271 433061 751900 558358 648800 736367 727465 366203
21545 366203 597847 485345 707211 853089 942569 815432 765969 718613 1009335 855398
21535 855398 976463 885526 878384 750003 872112 958970 644589 1054655 752749 722562
21525 722562 715834 803798 789129 671628 840862 878522 1013293 739811 1111661 829164
21515 829164 805294 963656 954173 747518 815940 929870 783777 940837 1198340 803332
21505 803332 844439 1040650 975983 818236 1101359 886925 937339 1132666 1047038 857336
21495 857336 907782 941754 1020396 864599 864707 974022 744497 1023600 831117 941913 969650
21484 969650 1000981 828018 1039497 883001 1115871 954356 690939 1185823 914754 1207402
21474 1207402 967766 913387 1020119 845269 1105053 876168 975691 786168 1113616 1011054
21464 1011054 951510 852511 991671 978864 866256 1124729 851542 965701 944273 978263
21454 978263 898297 670073 700091 1013797 831869 997829 997087 942732 807558 1033198 939260
21443 939260 738744 758506 992910 1047054 1116897 1006369 766379 910397 999561 777548
21433 777548 1105819 887901 907675 1108597 883381 927427 812738 1097072 866993 1082281
21423 1082281 933278 1044474 971324 919788 812995 974180 885570 939068 835603 787103
21413 787103 848408 758450 746235 1032677 824166 746729 732223 821758 938588 1191244 847537
21402 847537 834823 1089731 986403 963424 943440 702587 950728 805868 866990 918207
21392 918207 982248 934952 731835 749154 977821 1140821 1070873 994023 854279 970800
21382 970800 1017493 866740 966558 820186 977341 1127424 1073784 1164935 976896 1112234
21372 1112234 889234 1110675 1101025 1107250 1078923 1052344 1011642 1259105 1083009 993746 1009934
21361 1009934 946842 971965 1076528 1381650 1025431 1197135 825790 1031581 1135310 1408402
21351 1408402 1042964 1223022 1166639 1278264 1275601 1257860 1324298 1355679 1374654 1443029 1284295
21340 1284295 1393622 1629100 1494209 1373381 1673404 1807276 1511721 1662336 1841373
21331 1841373 1716479 1719362 1806432 1975604 1883564 2162368 1984423 2270141 2152776 2198846
21321 2198846 2549515 2480255 2743635 2532781 2901076 3053142 3303913 3246026 3502128 3965225
21311 3965225 4112808 4584074 4714107 5134495 5766416 6286390 7104048 7698333 8381051
21302 8381051 9439113 10684848 11773786 13214801 14673767 16133463 17431411 18311861
21294 18311861 19207397 19784822 20210826 19981877 19403116 18634654 17502430 16367943 15039401
21285 15039401 13566019 12391586 11030913 9783270 8661692 7788107 7133894 6506212
21277 6506212 5879016 5260770 4824231 4698057 4228164 3734799 3574374 3404142 3133117
21268 3133117 3048797 2672234 2653421 2734938 2633619 2409721 2349103 2065181 2030755 2121020
21258 2121020 2157365 1892874 1798500 1832762 1581347 1518767 1526441 1498274 1573258 1302139 1558564
21247 1558564 1465909 1178587 1638812 1289060 1409731 1226454 1170129 1296681 1315920 1254426
21237 1254426 1197632 1333799 1242273 1217108 1139430 1056479 1160623 1013700 1056583 1121177 1181485
21226 1181485 1084070 1017741 1096103 1286398 1208196 1063229 1159171 1337453 1408974 1037930
21216 1037930 1098755 1328264 878546 1371853 1256430 1185941 1093846 1054866 1173394 1236925
21206 1236925 1107405 1070520 1072119 1130982 1119561 1139339 950736 1466115 966714 944373 1046920
21195 1046920 980972 1098552 1077863 1156862 972541 1103027 1125750 1036587 1290021 1050005
21185 1050005 884635 1137571 1163238 1077396 1086445 1132526 1143579 1162333 1139980 1142843 1096868
21174 1096868 1198654 1250790 1141941 1198150 1147775 1318912 1125528 1103015 1225569 1022915
21164 1022915 1032494 980924 958290 915761 876501 813482 1163136 783650 972304 929889 770348
21153 770348 901619 752817 822642 1116915 945665 865633 997346 945462 924972 704698
21143 704698 1057188 1024146 957021 1163749 1260854 963433 1176973 1063557 1069898 1079895 1149412
21132 1149412 1015058 996590 1036337 937196 1104269 1226637 1267171 1428788 1250869 1116270
21122 1116270 1510905 1627534 1442115 1665726 1499720 1415104 1589700 1429790 1345716 1376014
21112 1376014 1255249 1360977 986845 1145174 1042791 959390 1267570 1515978 1248628 1293232
21102 1293232 1421921 1323600 1435646 1357088 1468754 1330201 1373556 1689678 1421309 1535919
21092 1535919 1400236 1365667 1375184 1391233 1373873 1309495 1257007 1375041 1241893 1255881 1361262
21081 1361262 1355210 1410475 1427715 1360117 1149090 1139852 1504563 1338214 1552039 1249625 1504773
21070 1504773 1488071 1570439 1449633 1837147 1676327 1826607 1841277 2181350 2632843 3166937
21060 3166937 3260722 4030317 4138775 4798490 4776215 5114571 4678573 4561434 4167980 3577722
21050 3577722 3012516 2649643 2214240 2158314 2003499 2277904 2253247 2044413 2198707 2113341
21040 2113341 2175806 2394956 2483166 2869316 2820289 3084589 3644978 4348906 4243643 4561937
21030 4561937 4677306 4723445 4856379 4625729 4272747 3827536 3511143 3019078 2935139 2761308
21020 2761308 2207891 2303949 2295924 2162173 2383978 2192096 2101808 2020212 2017016 2090540 2092475
21009 2092475 2203712 2115962 2263353 2160098 1795157 2113659 2358718 2355423 2336033 2891934
20999 2891934 2930002 3143622 4037151 4426782 4619841 5341666 5333815 5707327 5808809 5546053
20989 5546053 5238599 4831459 4427886 4250220 4133394 4252405 4762444 5260355 5894348
20980 5894348 6633837 7337999 7995261 8977457 10053303 11295380 12762524 14682982 16815222
20971 16815222 19166141 21432787 23369177 24734808 24975879 24575724 23278065 21244513
20963 21244513 18580375 15840021 13197969 10602870 8999158 7374562 6473921 5368171
20955 5368171 5125300 4555869 4051735 3708037 3329501 3507497 3050360 2936015 2717810
20946 2717810 2626427 2694645 2332902 2443285 2275485 2268189 2328624 2206504 2287951 2162992
20936 2162992 1955271 2102484 2273083 2273825 2326994 2406671 2256513 2460675 2495625 2508449 2771354
20925 2771354 2599996 2840008 2820372 3156757 3620611 3762641 4293098 5233755 6088240 6579524
20915 6579524 7509941 8194537 9247422 10432105 11792619 13482279 15347363 17586833
20907 17586833 19735020 21357256 22381107 23128814 23084010 21793429 19952291 17491869
20899 17491869 14822998 12272179 10219673 7992703 6527788 5557507 4632400 4130227
20891 4130227 3891503 3143098 3239296 2894805 2597452 2674821 2304226 2278528 1898265 2035711
20881 2035711 1763462 1807925 1838891 1660381 1616078 1732044 1827227 1691148 1645995 1593174
20871 1593174 1754866 1704383 1567107 1512731 1722732 1754230 1564912 1617455 1566653 1665900
20861 1665900 1499842 1593825 1341144 1413002 1551286 1606099 1564183 1656374 1360834 1554456
20851 1554456 1652851 1692955 1721459 1783379 1803599 2009515 1796161 1991199 2129034 2049570
20841 2049570 1928215 1850361 1968478 1937126 2079897 1935835 1637358 1885335 1825938 1721321
20831 1721321 1746666 1503881 1592589 1702810 1595368 1795865 1452494 1564870 1524834 1569950
20821 1569950 1594703 1668746 1526053 1589153 1753488 1843003 1898280 1685281 1894488 1946464
20811 1946464 1930249 1870469 1932802 2165927 1839939 1730991 1752711 1877743 1646187 1587045
20801 1587045 1848787 1451482 1441411 1534804 1384583 1630074 1356764 1501682 1581061 1476251
20791 1476251 1619324 1685286 1405000 1589958 1387534 1280217 1406166 1624411 1623530 1260341
20781 1260341 1378552 1284112 1523730 1391180 1555823 1548161 1297653 1488605 1307983 1284936
20771 1284936 1425713 1261622 1364230 1725164 1390329 1459558 1244519 1416409 1294714 1324717
20761 1324717 1428521 1510606 1208582 1355377 1339797 1278394 1359033 1327331 1204939 1439888
20751 1439888 1375873 1279798 1221237 1412379 1265963 1403517 1469375 1483606 1361793 1317854
20741 1317854 1422960 1343481 1262609 1447721 1286217 1322038 1345708 1162168 1332488 1370499
20731 1370499 1403186 1167800 1257234 1475337 1449883 1562783 1667789 1712354 1268812 1385699
20721 1385699 1274731 1784839 1275974 1432347 1389362 1482799 1417582 1366800 1369298 1458353 1288985
20710 1288985 1402231 1545616 1501532 1292221 1505216 1337277 1062569 1678373 1471657 1458384
20700 1458384 1299960 1423064 1338450 1253612 1311388 1432422 1158642 1452204 1348126 1170161
20690 1170161 1705118 1288333 1223832 1410489 1398660 1428539 1501766 1625488 1523255 1415084
20680 1415084 1671854 1701996 1739220 1645418 1769430 1842397 1666132 1950317 1531673 1749854
20670 1749854 1494218 1333461 1650613 1406060 1422238 1495493 1644106 1345759 1440768 1538057
20660 1538057 1419043 1338233 1438999 1373839 1279811 1401908 1543733 1622057 1621995 1839186 1970632
20649 1970632 1813950 1873186 1948180 1975080 1837241 1832377 1699420 1456762 1735881 1702235
20639 1702235 1545719 1405329 1296142 1317627 1423231 1501298 1277158 1341596 1427315 1425274
20629 1425274 1397034 1351729 1275311 1141284 1368349 1543363 1372375 1555944 1504253 1469705
20619 1469705 1361523 1647718 1329686 1596431 1393043 1756376 1525550 1370262 1228436
20610 1228436 1381166 1366493 1349308 1323164 1129039 1304334 1336537 1376310 1418470 1303645
20600 1303645 1300000 1175118 1159271 1289209 1365877 1115535 1242646 1228853 1351628 1318698
20590 1318698 1223640 1252131 1445871 1471307 1311718 1565680 1291143 1390156 1301126 953877
20580 953877 1263654 881863 1070843 1080944 1088067 1044303 1193289 1059081 1116469 1154275 1121753
20569 1121753 1333205 1026227 1250280 1084640 1384198 1067381 1308459 1403433 1043162 1340516
20559 1340516 1366013 1190089 1107451 1136755 1087939 1278487 1300351 1381466 1392569 1307538 1396805
20548 1396805 1265209 1511628 1260299 1465936 1088115 1477267 1211682 1275313 1385524 1635191
20538 1635191 1564109 1550823 1770894 1525526 1829446 1781366 1615923 1696763 1745706 1747299 1839173
20527 1839173 1814846 1873124 1800335 1371262 1541518 1316076 1478720 1424767 1294701 1460252
20517 1460252 1314420 1242234 1331746 1366492 1369008 1472485 1452823 1498999 1616583 1397944 1631014
20506 1631014 1671651 1447785 1541073 1794310 1937779 2011083 1821716 1875500 1540319 1826432
20496 1826432 1840104 1679086 1612468 1823753 1550087 1375378 1484590 1520939 1247777 1444967
20486 1444967 1590547 1543169 1706904 1341152 1657633 1507254 1823790 1646107 1674888 1678922
20476 1678922 1803330 1812971 1577325 1587615 1604980 1649519 1610795 1842155 1548500 1611925 1464478
20465 1464478 1295010 1529330 1655256 1376909 1441576 1473601 1624621 1218427 1277852 1551861
20455 1551861 1436761 1363020 1289780 1367691 1503409 1363786 1320184 1499234 1309350 1329194
20445 1329194 1171478 1288498 1482819 1201004 1439690 1249300 1312363 1264319 1396442 1353792
20435 1353792 1475782 1098478 1426779 1369277 1452681 1368133 1694479 1546886 1607911 1613092
20425 1613092 1664468 1476634 1797141 1618432 1656506 1598747 1538855 1699936 1535891 1675023
20415 1675023 1393065 1613910 1618571 1654657 1593178 1555363 1745093 1626952 1739440 1746361 1570393
20404 1570393 1580033 1431141 1928942 1659173 1618237 1776445 1681004 1523348 1512662 1589514
20394 1589514 1598045 1752101 1733279 1574911 1413376 1501394 1438364 1496832 1432190 1548663 1425977
20383 1425977 1603181 1382989 1550832 1525459 1489441 1395211 1650079 1576444 1423889 1803197
20373 1803197 1447024 1569672 1669979 1421206 1696966 1682270 1505327 1793309 1778076 1656643
20363 1656643 1911983 1898609 1789286 1900405 1997741 1919623 2030143 2082677 2268917 2191251
20353 2191251 2117998 2374809 2435811 2530024 2471141 2261768 2276097 2137616 2092140 2000567 2189788
20342 2189788 2111501 1906416 1893627 1890117 1810515 1800156 1685249 1799032 1588630 1914658
20332 1914658 1757958 1874366 1784120 1818762 1861920 2041868 1827824 1539143 2089243 1836451
20322 1836451 2191584 1724525 2022964 1963555 2091707 2332246 2217581 2632469 2733140 2957332
20312 2957332 2966450 3701776 4102149 4446931 4799623 5138711 5500891 5553443 5856198 5916664
20302 5916664 6032607 6007078 5845332 5766647 5716330 5469965 5090848 4861419 4865369 3904414
20292 3904414 3690915 3240025 3122232 2811159 2652258 2490480 2728493 2396437 2360235 2437793
20282 2437793 2494039 2400925 2228699 2173093 2305939 2315970 2234223 2255336 2525200 2205417
20272 2205417 2171167 2033462 2110959 2218519 2258904 2145632 2059268 2096674 2049121 2142252 2180690
20261 2180690 2031207 2244364 1955331 2052520 2196296 2146076 2300557 2210969 2462025 2361043
20251 2361043 2343916 2506275 2494234 2472976 2749477 2548442 2762658 2721250 3121734 3145532
20241 3145532 3370948 3700476 4259349 4648115 5147985 5911858 6225037 6906913 7760511
20232 7760511 8015800 8620014 8881482 9320335 9802337 9950677 9848220 10098146 9719060
20223 9719060 9780817 9277706 8914132 8344234 7838840 7369942 6844295 6409984 5828080 5277308
20213 5277308 5143820 4884865 4618692 4768650 4585659 4791254 5018568 5369791 5802929
20204 5802929 6007577 6585811 6942476 7680458 8462494 9592606 10991151 12337437 14326759
20195 14326759 16372456 18443589 20574285 22815268 24700759 26427116 28088093 29135786
20187 29135786 30050521 30382143 30572579 30297050 29753301 28973479 27748003 26166976 24105171
20178 24105171 22001203 19289609 16815859 14757829 13022267 11137273 9706611 8671692
20170 8671692 7835764 6964940 6367472 6134189 5794721 5518518 5572479 5302900 5103511 5167910
20160 5167910 5353564 5559510 5256534 5372608 5505606 5483323 5554150 5498028 5492411 5135215
20150 5135215 5401904 5145205 5200515 5258815 5287122 5137623 5173368 5592624 5366138 5533357
20140 5533357 5732974 6074033 6035073 6062353 6114127 6026668 5995279 5958227 5669187 5484032
20130 5484032 5355591 5010072 4799870 4688568 4433246 4165167 3795951 3601280 3747770
20121 3747770 3623604 3649115 3602462 3704428 3568140 3999813 4276476 4494485 5070929 5535984
20111 5535984 6030712 6735563 7556422 8572909 9176675 10486671 11658576 13088308 14036005
20102 14036005 15120541 16579451 17093528 17770269 18358986 18471142 18338810 17954262 17554108
20093 17554108 17014478 15829110 15011901 14464162 13229473 12431610 11242468 10077611 9436646
20084 9436646 8562198 7990789 7243948 6809249 6788469 6690439 6670652 6850347 7524950 7913600
20074 7913600 8277036 9448945 10204128 11989277 12831323 14419227 15542675 16486052 17344462
20065 17344462 18318574 18676875 18693499 18645888 18334060 17731672 17377211 16502894 15583066 14770871
20055 14770871 13375418 12002217 10330761 8959816 7913151 6770122 5986508 5376245
20047 5376245 4703255 4380959 4109939 3639609 3340088 3414267 3142892 3066211 3006339 2910812
20037 2910812 2552335 2737565 2412015 2355213 2254038 2147175 2192213 1941193 2236716 1925807
20027 1925807 1854299 1998209 1995181 1946534 2081863 1739052 1928877 1889390 1741718 1358334
20017 1358334 1721636 1713900 1697764 1577685 1891275 1668556 1559420 1767771 1768879 1652108
20007 1652108 1630775 1600367 1587139 1599647 1472037 1700778 1595975 1635058 1692486 1555488
19997 1555488 1610668 1720693 1312493 1778806 1627766 1839923 1876840 1584295 1620106 1661814
19987 1661814 1572830 1611293 1666645 1706663 1449831 1887152 1682548 1718178 1606101 1688658
19977 1688658 1747604 1869201 1902168 1760124 1749866 1817899 1562813 1589763 1659140 1826146
19967 1826146 1784624 2009319 1719919 1765021 1872666 1713956 1857582 1840638 2002861 1834374
19957 1834374 1898464 1903222 1962353 2050455 1883572 1957002 1987974 1986366 1869596 1994417 2101451
19946 2101451 2067067 2025532 2024559 2484147 2080344 2229528 2151051 1935340 1869268 2058012 2129754
19935 2129754 2031706 2108079 2000542 2068468 1951134 2086449 1922477 2069823 2001979 1921085
19925 1921085 2128187 1827833 2136611 2142645 2257904 2000810 1764238 2090391 2300373 2240403
19915 2240403 1876325 2422147 2194113 2197410 1967605 2292592 2298545 2378828 2023845 2211126
19905 2211126 2397787 2340058 2403090 2478996 2236637 2434694 2437118 2140940 2536748 2496513
19895 2496513 2449448 2456551 2399693 2495108 2443339 2799650 2700782 2841326 3019155 2950276 3148165
19884 3148165 3293413 3191934 3461294 3537134 3587392 3470370 3686629 3760452 3874521 3902168
19874 3902168 4172562 4321874 4320258 4661974 4856454 4823353 5377627 5576686 5857942 6606884
19864 6606884 7264938 7696050 8710456 9929591 10676243 11463557 12282508 13002843 13645947
19855 13645947 13981403 14299816 14842506 15499731 16312560 17634951 19096282 20912905 22543754
19846 22543754 23752956 24982231 25254585 25224072 24377187 22849721 21046626 19171807 17023014
19837 17023014 15216876 13989561 12744477 11797496 11291569 10999729 10903641 11044125 11275415
19828 11275415 11589201 11852382 12375196 13026226 13289110 13373921 13386907 13440421 13496744 13689949
19818 13689949 14280882 15311265 16484912 17482030 19138698 19844414 20259477 20079660 19968457
19809 19968457 18972966 17511287 15829545 14116301 12374808 10804601 9553699 8401766
19801 8401766 7765656 6945746 6535066 5980549 5442558 5095489 4767271 4271255 4213673 4009646
19791 4009646 3829135 3811234 3725855 3348044 3438975 3106748 3042656 2708794 2913733 2897736
19781 2897736 2770417 2929203 2726689 2632407 2915203 2693579 2897321 2742831 2767080 2770182
19771 2770182 2536859 2839734 2624237 2975478 2702442 2782846 2854143 2758768 2816815 2597743
19761 2597743 2841126 2586860 2567003 2600769 2475675 2606374 2507548 2658016 2484035 2396542
19751 2396542 2570347 2438556 2197010 2500064 2201878 2370379 2578028 2354572 2414259 2489046
19741 2489046 2396471 2181906 2332968 2437156 2403180 2392284 2295634 2223212 2373784 2221971
19731 2221971 2363505 2194455 2172617 2375277 2174586 2190583 2440579 2293750 2309304 2134649
19721 2134649 2223683 2115039 2253190 1950904 2334257 2303796 2111668 2198294 2145102 2021715
19711 2021715 2011879 2284207 2226902 2050907 2112727 2142259 2033475 2403037 2101425 2004110
19701 2004110 2032977 1841511 2084583 1811738 2040711 2046736 2119778 2031551 2214450 1952161
19691 1952161 1960691 2002186 2223638 1855850 2172255 1911069 2059555 2066367 1906023 1823930
19681 1823930 2030209 1973437 1956388 1849903 1718483 2099870 1696894 1809119 1883756 1735457
19671 1735457 1908919 1723231 1963582 1811678 1868144 1837830 1638533 2046933 1939154 1776809
19661 1776809 2053554 1956721 1875441 1851863 1932171 2081204 2047086 2019379 1923610 1996948 1661235
19650 1661235 1752603 1894158 1856384 1822711 1909779 1737175 2023024 1751627 1683898 2017866
19640 2017866 1869186 1876216 2048327 1822351 1898653 1859636 1933901 1682551 1942354 1765524
19630 1765524 1842862 1837120 1844312 1856450 1736402 1795084 1898169 1860097 1811125 2017266 1850068
19619 1850068 1694733 1726786 1611501 1881647 1655941 1717411 1831376 1751564 1826027 1692569
19609 1692569 1566172 1642075 1671820 1535308 1548688 1696736 1527421 1555718 1535319 1452623
19599 1452623 1651705 1542551 1502544 1495778 1497295 1682881 1518421 1489108 1466150 1219771 1559116
19588 1559116 1606716 1381245 1433270 1435949 1514765 1350184 1368553 1703517 1673788 1250344 1593695
19577 1593695 1522821 1211002 1539351 1257731 1325926 1191414 1241857 1533216 1272706 1299484
19567 1299484 1418501 1627079 1366803 1542473 1539645 1152578 1432631 1423006 1530307 1391575
19557 1391575 1235733 1509395 1372231 1312897 1340978 1291293 1380218 1079377 1359945 1154590
19547 1154590 1106078 1344606 1235721 1215091 1472139 1571173 1540434 1442399 1634575 1485383
19537 1485383 1492609 1466174 1404701 1341440 1031293 1356961 1436155 1361864 1248254 1403030 1192106
19526 1192106 1376632 1420873 1622318 1369942 1428945 1261298 1273787 1373094 1564361 1351522
19516 1351522 1301880 1285454 1569104 1208902 1541477 1336357 1328090 1259363 1266202 1318594 1328041
19505 1328041 1131060 1153250 1079163 1404346 1259644 1398593 1001774 1168779 1215626 1175971
19495 1175971 977999 1380576 1313397 1255735 1339907 1164460 1474064 1339666 1343764 1274072
19485 1274072 1288532 1079836 1138128 1483447 1344577 1181122 1228513 935217 1129850 1029116
19475 1029116 1241033 981630 1052342 1031988 1173778 933275 975815 1139386 954970 1150729
19465 1150729 645011 797746 1085921 762980 980871 928548 754711 803745 994968 930206
19455 930206 820821 632040 757664 942384 819540 789255 965107 1003903 887544 928451
19445 928451 850877 896946 829140 949134 959982 873928 874325 834511 754348 743303 976529
19434 976529 913724 885166 898068 657389 1008841 753148 818276 997001 1339425 776582
19424 776582 783953 680867 1001650 668238 917456 688424 982974 783965 843614 779778
19414 779778 753633 952275 961471 806557 797414 933250 878599 742363 970817 1101784 880111
19403 880111 839122 829122 523253 794805 791463 528965 849636 736190 555718 925507
19393 925507 639159 930199 857029 805423 794626 854963 940920 757739 837945 572019 931454
19382 931454 860111 831040 985013 830005 916443 753856 893273 956559 1062009 914784
19372 914784 598996 899168 709045 907056 967851 860252 869493 980538 750258 913030
19362 913030 1057755 848965 830633 832819 955217 874163 876013 798510 971633 635326 1076317
19351 1076317 792525 912861 825587 636882 736047 829643 737935 686332 729415 817649 614176
19340 614176 848034 961111 1022499 935504 773068 872107 811323 859572 1089254 1123600 1147669
19329 1147669 934931 820623 1022758 917428 646846 913674 1131745 999702 934545 931820
19319 931820 1061635 716221 771823 1051511 1041069 1009204 870847 900677 828730 761878 942134
19308 942134 827698 929316 932106 812646 815741 797595 1043142 786424 989344 1027420 840615
19297 840615 747732 861361 1007649 689487 704405 703517 705854 678570 947475 857453 717077
19286 717077 655451 851683 796337 673905 635381 715118 768602 582632 810063 834713 680981
19275 680981 742631 628354 564081 697180 536359 692789 719983 751982 971365 847095
19265 847095 942564 899077 842111 777259 895936 796605 762659 851872 975940 754046 776900
19254 776900 819329 843609 646666 931289 574181 852742 789175 705069 843089 815194
19244 815194 719478 770946 886284 975131 1169553 1308594 1238444 1484661 1488832 1579831 1362998
19233 1362998 1205010 917831 935078 878885 727839 931026 997649 800138 936197 778339
19223 778339 749572 813406 723703 488761 847827 616436 621087 513681 715857 548120
19213 548120 684229 838704 637364 650330 780414 584411 641233 518935 635299 817571
19203 817571 684378 607848 729459 790770 550967 706868 762185 605053 797794 705566
19193 705566 696097 764690 787324 623953 716598 705319 943857 623300 619492 972914 735290
19182 735290 877701 517975 1068478 842899 733559 760153 791485 550748 827343 946649
19172 946649 1127704 952589 1171752 1034957 1002312 1088892 1173320 1134355 1073055 1030008 1050571
19161 1050571 917979 1023345 839028 1006749 1125860 1048344 1136275 1133914 1211729 1073766
19151 1073766 1150268 1058294 1097099 1185545 939119 1074508 1022898 988301 784929 973539
19141 973539 890477 1048611 773281 1072687 940395 932605 1071057 1182244 1002501 1026362
19131 1026362 1260611 1012833 1093303 1079499 1185117 1194116 1040639 1169718 1115093 865180
19121 865180 1060363 800626 1293007 1029873 1148700 1264807 1116568 1280939 1364605 1378346
19111 1378346 1245851 1282295 1465930 1615726 1868583 1944697 2233019 1944399 2291486 2629420
19101 2629420 3116183 3449492 4016676 4382098 4612416 4748369 4685426 4785422 4290106 4004804
19091 4004804 3030771 2612929 2529274 2108763 1785490 1857931 1739053 1527085 1342640 1729503
19081 1729503 1567137 1336625 1757680 1512456 1798215 2045091 2359648 3067735 3206997
19072 3206997 3655837 3936923 4103920 4446539 4463440 4175939 4066420 3623099 3318414 3722434
19062 3722434 3829979 4235284 4415477 4738264 4519816 4796901 4761866 4314210 3711289 3392654
19052 3392654 2828615 2537328 2251101 2061049 1912330 1956071 1917104 2081759 1818326 1997754
19042 1997754 2006054 1702808 2161322 2340122 2874839 3325722 3781419 4108250 4529154 4787258
19032 4787258 4752071 4759800 4518978 3847699 3371768 2793370 2412216 2094498 1566816 1938842
19022 1938842 1709053 1891895 1847933 1902129 2054492 1932970 2110955 2036733 2258074 2556951
19012 2556951 2637306 3050701 3900941 4015097 4218958 4712623 4873251 5124632 5165119 5102269
19002 5102269 5138791 5058443 5078988 5457127 5944504 6564161 7153171 8009860 8723087 9525300
18992 9525300 10509002 11787535 13360134 14704097 16991350 19032628 20608494 21680534
18984 21680534 22344074 22311872 21245244 19649308 16979180 14620890 12314605 10188366
18976 10188366 8227615 6866375 5889543 4991139 4378821 3977071 3376551 3122996 2850413
18967 2850413 2644725 2605855 2524543 2119142 2034831 2104556 1994046 2187674 1408617 1769105
18957 1769105 1843768 1600314 1648337 1735507 1515185 1756095 1685802 1845605 1737387 1879695
18947 1879695 1746135 1930165 1818284 2021217 1950627 1931072 2319177 2225555 2236095 2587980
18937 2587980 2581250 2689567 3045335 3284574 3729051 4010144 4451218 5333668 6293675 7512947
18927 7512947 9298021 11100621 13060486 15697801 17547789 19182058 20140699 20489079
18919 20489079 20185383 19086181 17201494 14614479 12402176 10103205 7972310 6766259
18911 6766259 5455314 4545946 3952079 3254607 3164821 2739088 2572815 2119355 2053370 1695661
18901 1695661 1761557 1612459 1649449 1336569 1585016 1291037 1492834 1151346 1046026 886571
18891 886571 1229453 930653 931088 888283 1024341 816575 654160 889778 691860 930871
18881 930871 664660 598269 651277 723088 726154 861607 696485 752263 687443 633535 942531
18870 942531 720076 736604 676289 823059 765824 704001 710547 635213 539041 647711 560758
18859 560758 780531 667075 695083 718604 862307 721847 765117 556668 586161 1013095
18849 1013095 659480 935696 696400 638469 788881 804775 932649 656423 624979 582784
18839 582784 646988 759325 668600 549775 501012 462069 625070 648225 610194 694563 606601
18828 606601 545643 604855 447137 578541 428745 482529 345905 797833 585864 567457
18818 567457 420262 689265 733739 549042 902133 881366 448402 548236 705998 577058
18808 577058 556191 806782 685333 591502 701598 635757 716343 870922 709374 568332
18798 568332 706750 668470 815968 840381 762395 533081 798427 683382 672788 1116065
18788 1116065 750614 764265 814239 752503 781819 638218 735674 710484 928483 739259
18778 739259 837145 958540 670957 764867 556687 794924 875360 656309 638014 670476
18768 670476 555562 863469 591296 832873 627843 572502 567429 835603 636952 597677
18758 597677 786442 381008 667392 752129 361028 582543 680415 753754 582138 530850
18748 530850 619040 478087 581315 413036 527977 638489 488130 573304 519351 619401
18738 619401 382334 616368 775336 685664 574612 736045 745408 657220 665617 610100 670769
18727 670769 684694 643377 545485 641768 731182 302214 721364 600819 427386 616222
18717 616222 556804 528939 589218 601413 342116 463734 718441 548167 608237 636704 566475
18706 566475 542092 450562 692735 718341 645513 766255 554687 468729 626205 503913
18696 503913 535088 525671 392202 716037 439671 573241 780673 685691 541148 639454
18686 639454 554943 539968 524034 713364 736508 634496 702436 740574 681955 743962 606837
18675 606837 724664 580594 434863 759602 732485 633440 798346 437078 511670 618298
18665 618298 543856 475385 596671 733208 521163 620555 479054 553375 581410 724482
18655 724482 745737 645457 576640 656856 687362 671554 488230 587238 412363 687036 225998
18643 498222 696728 438917 465938 552188 589289 516852 508396 548957 607175 352737 405292
18632 405292 589799 493734 497086 672464 750938 676992 449740 530597 642626 508096 567569
18621 567569 412609 430607 513323 296366 445908 647090 572906 634445 568423 731046
18611 731046 552787 416188 709806 550291 619340 679617 665439 549908 805258 828930
18601 828930 375922 645052 529178 752759 646262 757757 816423 846574 841022 869222
18591 869222 959537 817787 451512 760636 612376 787987 776893 985827 586041 703846
18581 703846 750761 698340 546244 581565 754985 657578 803963 660610 635884 835277
18571 835277 699381 504932 536106 554117 524816 487424 712386 551273 739692 576177
18561 576177 653227 461569 500957 547734 633575 640851 525356 639137 645611 475645 624667
18550 624667 410928 572525 546317 789261 453025 568919 596942 554693 694621 626459
18540 626459 572244 423077 592688 624802 524739 753582 618969 519929 468302 618114
18530 618114 490152 602228 509500 639882 432682 564894 539738 504496 343488 388763
18520 388763 508063 593133 473484 440904 424170 502610 396370 533500 656609 485581
18510 485581 406606 510751 507697 738403 579828 436659 735574 550534 574650 298953
18500 298953 469773 517293 450084 591700 651395 681853 549250 631352 747791 524577
18490 524577 484182 544226 623550 823115 655723 378838 696110 650681 468339 615992
18480 615992 604054 541689 418882 468191 616586 801734 580827 551682 551860 385633 602864
18469 602864 768386 826346 722065 690501 712410 644180 484001 762575 536125 874786
18459 874786 545744 463572 656938 563842 658960 789472 800091 619126 644046 766612
18449 766612 587337 804648 688475 1005448 764388 636169 633784 660028 404231 548108
18439 548108 636260 679778 706558 499959 474475 540212 669135 669487 677323 672638 598359 594547
18427 594547 635498 630514 794463 865714 515390 811719 783386 934112 893449 832115 705264
18416 705264 655755 377304 465914 667955 320254 580067 448502 387605 622574 577034
18406 577034 449944 344536 569700 799991 418941 601680 655362 389354 548033 796953
18396 796953 601365 248269 557653 445501 444680 530631 446691 514669 694013 550794 522201
18385 522201 440350 384861 479641 544637 513788 659915 237434 713338 527703 446978 219586
18373 521453 479999 546504 372979 370933 440421 501377 575082 631712 493261 460221 476304
18362 476304 590748 651748 803424 739177 701519 559668 590618 522799 346111 453811
18352 453811 698818 723504 626110 572365 608462 643139 605930 768063 719103 625938 722326
18341 722326 712149 637673 967628 708217 737298 686126 707269 560257 598386 670513 490024
18330 490024 387935 530494 515783 364568 457350 790312 532335 735179 561552 511470
18320 511470 512711 651805 365461 593053 649979 441899 707256 672228 697417 756273 723429
18309 723429 448782 593286 598949 684577 467941 556294 333158 700269 479040 558039
18299 558039 579375 541827 474366 549884 445367 476191 463816 615835 476190 470712 502379
18288 502379 277619 511148 481364 366596 648386 757580 293760 510098 500559 532903
18278 532903 236671 529437 314781 322101 626861 504535 588944 544815 677323 510800
18268 510800 436547 392324 396101 513710 330750 476493 539668 641250 580276 572426 615386
18257 615386 797113 687167 577051 669442 438650 659677 837175 827924 723326 562806
18247 562806 624516 447934 351253 419808 772195 434410 702411 537204 418755 325813
18237 325813 546849 413484 562212 666660 573919 621247 479913 453098 336875 484504
18227 484504 300343 379437 167349 456149 497441 569545 510804 428018 517183 463107 597566
18216 597566 424717 575371 679539 426714 561170 446024 240504 698423 588212 561334
18206 561334 409118 344531 544675 530792 603731 592441 606526 516002 675185 392855 422307
18195 422307 765354 583194 772524 466770 625903 621238 623052 630082 758962 573138 726123
18184 726123 610037 679291 706754 578731 688902 668252 352012 452254 444821 453052 606217
18173 606217 434394 532195 355393 220911 430693 595675 431503 606896 460194 715452
18163 715452 460345 616848 443487 612511 600009 727780 481267 588888 545905 502348
18153 502348 721193 645637 493364 742631 740515 370209 476173 530175 564082 500786 619287
18142 619287 465538 589379 462629 367738 401195 315573 652546 460996 403456 672795
18132 672795 711955 468298 524156 406570 319703 519066 599356 687541 566715 440318
18122 440318 536768 508515 511202 536225 284080 715889 751589 731082 659772 302232 798104
18111 798104 663184 628719 552238 296421 484723 326752 813583 788823 631077 250957
18100 487767 514886 633630 554120 410048 514303 545584 543688 649803 459443 389750 556324
18089 556324 553642 513902 559286 431536 849945 411009 446099 668733 589898 575013 610511
18078 610511 596785 595219 411105 510906 349981 460525 552788 450673 408679 714362 321811
18066 476773 364732 341430 319106 835980 513142 385867 436418 648465 785611 549894
18056 549894 587290 372134 514037 588065 646650 606729 537604 622644 346850 470641 517778
18045 517778 342301 396419 421317 361703 425161 393568 535588 357273 437104 611579 649466
18034 649466 381678 301948 344031 562220 437187 476743 411039 551403 528565 493693 417295
18023 417295 229887 399524 473589 346891 330327 350481 532164 306222 480765 250219
18013 250219 485042 388523 544233 489610 539819 495197 303842 572300 640570 411779
18003 411779 589063 207039 297986 306435 420510 494020 381191 574435 465296 515213
17993 515213 628934 328979 438552 353255 499912 364644 628870 436885 711597 497534
17983 497534 771864 447639 470843 576888 509569 284905 542430 269549 530312 311630
17973 311630 887930 627021 532379 670783 526174 581777 369428 699481 347890 422487
17963 422487 656855 489279 457617 723868 602404 603147 587749 587487 482561 416054 546078
17952 546078 343193 643116 618902 432478 429374 393486 816020 537455 507379 560634 413488
17941 413488 748334 436449 595472 562420 832714 627204 566098 720730 568994 698429
17931 698429 402832 557970 541167 629712 670130 582096 623649 429873 373200 558192 743658
17920 743658 499053 468202 615603 603728 666782 551911 556243 702301 447958 388122 681193
17909 681193 816040 626607 641806 671770 702172 654417 545310 780775 787487 730948 818077
17898 818077 580531 720693 705041 412237 532568 727799 717578 407808 860671 731075
17888 731075 679506 738792 842226 580492 913161 904301 495090 597085 530738 793367
17878 793367 749286 829025 651119 783109 632471 828490 536855 437357 670270 764945
17868 764945 706177 773018 650463 694901 800506 743553 714241 650324 629309 626855 614310
17857 614310 498310 465626 600579 835917 551502 536171 597105 739311 582574 450552
17847 450552 692607 804814 671362 504606 693153 806608 584397 516520 702164 514052
17837 514052 764815 668977 776257 562372 826414 584365 827319 649463 602754 669343
17827 669343 684337 599302 684581 664990 775559 772848 774009 759008 808767 804209 789764 979476
17815 979476 545275 1039047 1047100 1040142 920830 1056435 1100720 915930 1005204 775743 770266
17804 770266 661995 855579 721208 774292 901502 899603 762497 1097253 991470 1150042
17794 1150042 1036160 729933 837114 630350 700815 978198 650921 829768 745071 555397
17784 555397 555049 775079 723341 692522 474107 742924 643215 665965 519114 550956 700325
17773 700325 904408 664597 650721 668925 700195 630563 458947 682540 605829 813694
17763 813694 640659 556341 921042 645362 657954 597279 626067 656632 338239 621365
17753 621365 585656 793273 541055 760658 605789 413276 494823 509914 680763 759928
17743 759928 536495 669876 608259 664497 985562 607236 856717 862147 873524 630597
17733 630597 737726 463465 650933 569352 607005 338791 731695 751677 585219 580159
17723 580159 812626 636863 494202 327846 532628 691628 835460 758335 707619 663186
17713 663186 777938 914599 583659 630436 651593 667278 741149 553744 865301 586229
17703 586229 553714 539710 652941 855287 754181 452869 744748 881485 773498 651792
17693 651792 748596 548987 812531 573542 706768 555992 810925 500900 685936 603714
17683 603714 764072 722666 666610 665225 692806 810407 852899 652649 709361 873040 762510
17672 762510 664084 611721 518589 823047 843862 859761 579408 773995 731110 824189 759354
17661 759354 581699 825804 760138 928510 746961 778769 791421 961365 802010 907061
17651 907061 638667 839497 1004066 845057 738834 773817 951730 939512 845148 834359
17641 834359 1020740 1069112 1046504 900574 932455 813060 886549 800448 1079088 1161784 812596
17630 812596 1043236 811459 985512 927495 823052 1035004 1070044 1164358 1199547 904919
17620 904919 1132379 1055669 989428 1089301 1162399 1156923 1095779 1048857 1162463 1294496 1023373
17609 1023373 1240770 1214615 1136419 1001371 1269778 1136807 1031056 1345007 1392090 1358781
17599 1358781 1127188 1212071 1417982 1272044 1333499 1358296 1328416 1506557 1431833 1540656
17589 1540656 1367456 1382959 1311756 1386342 1311016 1298303 1246507 1446502 1347505 1349991 1393523
17578 1393523 1462246 1507095 1424901 1475922 1547960 1385105 1526625 1483941 1507838 1295392 1444310
17567 1444310 1548129 1347806 1396970 1251564 1361012 1513678 1198300 1204555 1192747 1107835
17557 1107835 1389099 1276522 1297083 1212501 1324751 1124768 1194704 1243800 1181739 1447856
17547 1447856 1430952 1291086 1370640 1394436 1414354 1309849 1261917 1463665 1511601 1201002
17537 1201002 1274574 1394659 1272485 1369729 1329834 1172218 1204447 1389491 1337451 1362508
17527 1362508 1417613 1387298 1271927 1206278 1403892 1380139 1344221 1708628 1420847 1285795
17517 1285795 1420645 1198455 1532830 1428778 1430304 1850000 1838142 1886413 2089352 2070618
17507 2070618 2209030 2288139 2454172 2427403 2286984 2340427 2024227 2350645 2383407 2483087
17497 2483087 2669650 2728452 3029498 3272463 3621386 4152444 4486895 4973221 5565293 6228994
17487 6228994 7334945 9088755 12437610 18427553 27773606 40219418 54491249 67087827
17479 67087827 76754578 82796884 85689232 84546076 78444679 67815682 53229753 39018826
17471 39018826 29048856 24639620 25302984 30860235 40890106 53567455 66376558 76761875
17463 76761875 83509392 86567868 85835848 80816272 70612309 56206501 40000750 26287423
17455 26287423 16962945 11548992 8594761 6619310 5673048 4862643 4353327 3915686 3483265
17446 3483265 3520546 3585737 3678500 3733610 3527660 3681977 3602602 3576267 3511119 3120261 2973939
17435 2973939 2900839 2651823 2822103 2611405 2921102 3039401 2986283 3212224 3048812 2902302
17425 2902302 2997900 2809748 2950382 2733038 2685786 2191140 2338791 2061490 2109732 1890355
17415 1890355 2109433 2015572 2332644 2039346 2017125 2138075 2097044 2259354 2046286 2023689
17405 2023689 2014376 2340007 2111744 2465374 2624034 2474257 2746153 2949489 2788582 2997521
17395 2997521 3209182 3276345 3561903 3888217 4158582 4646605 4990083 5551784 6077140 6512368
17385 6512368 6635101 6826950 6654480 6827706 6549241 6375768 6211017 5675008 5424441
17376 5424441 5182183 5278587 5066479 5479187 5825904 5940768 6116568 6522625 7019436 7138763
17366 7138763 7734635 7691210 7851593 7571492 7494336 7515466 7252765 7269061 6794094 6764998
17356 6764998 6874827 7163565 7060309 7207977 7505761 7980318 8516151 8987254 9450213
17347 9450213 10285405 11157478 11612043 12107692 12409596 12789050 12894898 12699243 12571288
17338 12571288 12308801 11967914 11435426 10985131 10717013 10278272 10159126 10277835 10664306
17329 10664306 10699974 11124146 11756244 11941303 12190350 12642014 12549198 12737223 12579488 12086914
17319 12086914 12426192 11831914 11475800 11145787 10804959 10444972 10007394 9744034 9692586
17310 9692586 9932640 9615753 9444365 9709570 10109446 10375519 10554262 11057240 11280220
17301 11280220 11634741 11649171 11579124 11388568 11245047 10616772 10403362 10225864 9740046 9568238
17291 9568238 9705586 9318773 9455723 9446313 9479647 9998397 10207873 10084491 9766278 10279224
17281 10279224 9868768 9489242 8992693 8267345 7566049 7118197 6529615 5975916 5219769
17272 5219769 4890751 4627216 4417383 4201584 3930548 3992728 3592813 3857601 3815907 3609259
17262 3609259 3421501 3359863 3665627 3096226 3407009 3159512 3170253 2949523 3152829 2871987
17252 2871987 3029096 2815788 2817319 2473979 3086002 2954924 2629915 2835120 2760989 2738530
17242 2738530 2654408 2631193 2630598 2675904 2607879 2345402 2694427 2482356 2453604 2359423 2358356
17231 2358356 2261514 2251834 2549101 2175616 2312671 2257602 2384469 2452486 2403769 2240542
17221 2240542 2163199 2490152 2408890 2577695 2411853 2605385 2532004 2504355 2646262 2789358
17211 2789358 2577560 2863665 2423670 2379759 2567388 2693855 2630175 2667462 2603015 2579771
17201 2579771 2698548 2655877 2487776 2289068 2380429 2455232 2076207 1771803 1950133 1918857
17191 1918857 1902665 1502995 1581965 1962911 1717957 1923837 1695870 1879925 1751574 1698350
17181 1698350 1648315 1603515 1464321 1385420 1589106 1658406 1747891 1850538 1719227 1515392
17171 1515392 1697862 1829412 1485387 1880104 1772240 1686848 1760253 1735981 1724594 1748730
17161 1748730 1812225 1720057 1804326 2092311 1678355 1934285 1862465 2016557 1886668 1708361
17151 1708361 2033777 1939310 1898018 2046151 1817232 1754995 2129865 2179566 1983754 2196175
17141 2196175 2124482 1817919 1997771 2051304 2416081 2262194 2378774 2086577 2150502 2166838
17131 2166838 1917831 1743296 1982517 1870783 1910017 2077204 2099534 2103434 2073259 2239412
17121 2239412 2010836 2189578 2258480 2175109 2201617 2042547 2444555 1951593 2163328 2300563
17111 2300563 2474517 2457743 2731886 2653971 2783897 3096301 2877061 2901164 2978973 3127471
17101 3127471 2923217 2808247 2499418 2392005 2599181 2224360 2120528 1924369 1798275
17092 1798275 1395026 1621595 1639051 1393771 1234640 1280908 1387798 1120287 1059754 1298673
17082 1298673 1046800 1201257 1113642 1088954 1280485 1037301 1358309 1095004 1110154 1076118
17072 1076118 1209114 1219013 1282779 1387495 1167840 1164414 1293290 1201814 1107762 1321009 1315751
17061 1315751 1149680 1192172 1526540 1602684 1519458 1548081 1839071 1995895 2184666 2542401
17051 2542401 2595036 2813409 2915447 2916092 2834418 3144102 2951989 3070477 3100197 3194932 3288040
17040 3288040 3327946 3551318 3614244 3464198 3309051 3535600 3268199 2983796 2916080 2444244
17030 2444244 2495427 1960659 1771561 1988275 1828214 1791451 1940227 1648489 1452290 1747065
17020 1747065 1594265 1306218 1323353 1287337 1397454 1314558 1293326 1199998 895898 1328327
17010 1328327 1308379 1234534 1220795 1379820 1022428 1233742 1228741 1062473 1140486 1170618 1189076
16999 1189076 1295623 1197469 1243820 1172017 1215776 1247075 1155477 1258295 1218991 1142540 1145345
16988 1145345 1289503 1159752 1126419 1354174 1104393 1370715 1340380 1270959 1219104 1377126
16978 1377126 1432531 1224882 1484811 1369596 1120037 1592071 1499388 1696198 1647576 1713240
16968 1713240 1520898 1912712 1803594 1753837 1968260 2177918 2141877 2543826 2472433 2519416
16958 2519416 2659862 2860115 2818748 2871008 2651328 2515024 2590681 2714070 2620730 2621664 2542976
16947 2542976 2040857 2082703 2286893 2190898 2017517 2055145 1956324 1586541 1426480 1153537
16937 1153537 1454199 1469509 1234603 1558439 1474926 1492009 1552451 1288488 1304593 1246838
16927 1246838 1390465 1394448 1298564 1082089 1307873 1154269 1311674 1014694 1116722 992163
16917 992163 1077866 912623 1084650 989847 1037479 669183 927371 946972 1021626 987418 795149
16906 795149 1015041 975402 897456 824779 1074499 1031936 969289 861260 923677 973349 942524
16895 942524 1073482 857001 1068900 1153178 940158 1003014 767650 878177 913973 813087
16885 813087 732897 850344 707584 899337 766886 921266 697446 766381 904710 1109217
16875 1109217 991541 893363 682765 1075424 947572 918311 992358 839406 970419 918428
16865 918428 932488 920901 823659 893472 993550 781102 931590 938233 995363 1039620 1128918
16854 1128918 781126 886783 976931 811901 887931 1089032 958758 865053 876866 903019
16844 903019 832810 774451 1007758 828324 691421 886527 987526 969684 877552 1039218
16834 1039218 1037158 1038792 1059009 1056074 1103975 1205634 1251650 1071188 1512277 1189306 1530193
16823 1530193 1216891 1517352 1464877 1460802 1469348 1428000 1804786 1720594 1757058 1992042 1883003
16812 1883003 1873264 1913018 1739418 1775755 1688320 1721190 1610711 1976389 1668632 1626970 1634102
16801 1634102 1544253 1662858 1731081 1663308 1551965 1613429 1459349 1701443 1483880 1246909
16791 1246909 1325490 1326212 1207980 1148762 893845 1215887 1007773 807743 1038157 737462
16781 737462 829765 1024930 738122 933103 968281 939174 769272 779528 822441 1044668
16771 1044668 815773 634070 886098 961996 969779 788199 846017 916077 923421 878124 896679
16760 896679 829665 838706 818227 853682 597095 959013 869719 935363 680156 1040260 1026534
16749 1026534 935199 1014751 1047460 897442 1039312 979759 924616 1047566 987068 962108 942009
16738 942009 923983 1024940 1007226 806397 1055968 939416 632230 688594 1097001 713960
16728 713960 1102789 899252 838980 674124 893071 812466 1116879 900498 1095836 1083263
16718 1083263 1032666 1177843 964515 1082369 1017264 828082 1075855 808672 802061 1214482
16708 1214482 849447 920792 1214752 1422139 1257289 1500604 1699148 1662543 1936439 1569171
16698 1569171 1870242 1839714 1856260 1704467 1739007 1617064 1691823 1613613 1724110 1902250
16688 1902250 2083016 1963293 1979382 1851974 1944617 1630182 1462190 1475346 1173439 1085221
16678 1085221 1237194 1226926 1210071 1313561 1120492 1262516 1355325 1549385 1324747 1435916
16668 1435916 1723289 1606472 1822808 1806491 2086472 1740329 2201415 1801438 1970717 1801020
16658 1801020 1663016 1784206 1652434 1712536 1724881 1768160 1794109 1712513 1710396 2033550 1733359
16647 1733359 1357873 1263459 1133249 855605 919947 818327 748400 748806 1049743 848779
16637 848779 928023 822648 944708 846747 795027 660492 798418 722911 798088 915302
16627 915302 744962 885819 999914 956202 1041624 811974 778991 899614 1061054 934069
16617 934069 1004432 1051877 952347 907650 1139067 783705 977777 1159023 1196754 1206843 1236067
16606 1236067 1249649 1041508 1127981 1009073 1089012 1110957 1147217 913916 992917 1071698 1056906
16595 1056906 960275 955537 939560 1028798 1090013 1028668 873493 1195140 1123609 1271579 749543
16584 749543 993293 1066189 977444 1056619 917574 999423 927077 920770 1157403 1171031 945599
16573 945599 1067849 909327 904122 788393 789868 645211 631843 619101 746809 708429 583762
16562 583762 660649 522179 768566 847592 562472 918177 592536 746269 838518 1012692
16552 1012692 834246 1051952 1096535 1082139 743232 1022282 972517 873158 1069846 960705
16542 960705 813343 969055 1033112 1053746 969387 858072 1091465 1038042 924775 902831
16532 902831 897141 1070635 998969 1065856 1040510 1035055 684556 1030269 865191 806278 882131
16521 882131 793168 907439 927109 803564 981389 844641 1056083 943399 769270 829717
16511 829717 899745 801746 1022716 1276083 1031262 1164797 1423567 1706345 1440353 1452049
16501 1452049 1652961 1218352 1491124 1635687 1577366 1483482 1414772 1152775 1327887 1264943
16491 1264943 1543856 1558717 1532498 1577159 1764469 1680004 1839120 1871016 1957233 1922397 1792565
16480 1792565 2009832 2113769 2122765 2103122 2016397 2233439 2334087 2338392 2239450 2471691 2435340
16469 2435340 2423502 2434645 2206546 2180518 2416432 2274899 2377790 2429503 2539439 2426768
16459 2426768 2571843 2120085 2498304 2086229 2107963 2350474 2352067 2400713 2070479 2523154
16449 2523154 2479190 2568206 2935276 2858545 3083664 3195941 3330900 3383357 3325022 3675285
16439 3675285 4053960 4287569 4438919 4484778 5282868 5538040 5769046 6514187 7176893 7644037
16429 7644037 8578330 9960660 11104473 12304606 13798111 15242977 17074912 18817157
16421 18817157 20843175 23380083 25806082 28738983 31785596 35018551 38532624 42515686
16413 42515686 46329232 50769887 55540523 60273260 64556634 67574034 69433656 70880351
16405 70880351 71583896 71691444 71752888 71356183 70551368 68828885 66635333 64399488 62479668
16396 62479668 61103528 60195814 59989555 59468459 58909909 58570881 60178275 65528859 74691015
16387 74691015 85270343 92415036 93454147 88048563 77023103 61668034 42747677
16380 42747677 23058507 4353599 -12228498 -24135458 -28914115 -27446844 -22339635 -16292315
16372 -16292315 -11035875 -7021745 -3978344 -2285169 -1445821 -663510 -450671 -212902 -289715
16363 -289715 -120213 -146328 144433 165637 494351 675518 782822 1110228 1321296 1210938
16353 1210938 1320440 1330562 1168142 1060728 1024327 494570 445209 373820 482467 470955
16343 470955 450909 210377 220268 545821 317006 505979 518661 128082 193467 139200 -69739
16331 -223209 -361403 -422730 -618327 -628758 -683698 -696884 -985316 -1090266 -837762 -981277
16321 -981277 -794813 -1003069 -676306 -666017 -828708 -559224 -465647 -631633 -704991 -437195
16311 -437195 -497381 -510924 -559344 -303569 -492645 -556489 -235683 -157665 -353654 -291727 -98529
16299 -320609 -124881 19477 -84338 -166998 -37781 -174938 -63340 315347 297977 264870 28754
16287 129773 278090 261342 88938 192007 268883 268843 294662 38480 223773 444267 422392
16276 422392 410793 380666 601790 726610 808866 875887 722616 799129 752238 415822 670374
16265 670374 450767 227430 326810 193267 -10375 129614 335667 195299 115847 225673
16255 225673 74624 253547 277213 44568 479787 142228 350097 223614 246332 352605
16245 352605 26046 299056 327407 514643 627686 654839 725899 668967 794189 744496 753359
16234 753359 590572 495673 345935 268130 373308 372200 419426 560042 244720 550651
16224 550651 402247 410087 559310 444698 378039 305137 411097 507698 461117 435782 145772
16212 125112 180376 137404 273473 542627 376679 201615 393696 233791 354272 343598
16202 343598 135216 354127 227981 260742 436223 484483 535765 141527 498120 444027
16192 444027 324304 336531 565675 311286 471086 609513 646090 599868 602233 477014
16182 477014 298858 565920 453013 632224 373848 333750 654654 427465 479642 492856
16172 492856 488525 188506 513578 391008 281079 661140 306842 626693 406228 351889
16162 351889 302203 333523 348282 500217 703948 529146 108320 824801 520080 459303
16152 459303 401763 405124 684049 404912 615768 508956 619378 467741 209840 648415
16142 648415 747528 655156 777225 806332 780363 702451 494730 591872 767869 502493 430312
16131 430312 906065 600651 456700 755287 721763 456061 616696 731853 364919 512111
16121 512111 677776 479758 616783 803447 725576 556528 552409 586036 783387 707143
16111 707143 799640 437684 484358 564205 716365 583720 653793 895371 602500 955568
16101 955568 796688 783154 664847 698278 785289 809587 936930 951108 828007 1088086
16091 1088086 944881 867647 1148277 889985 826105 905085 1029841 1019332 1055510 817071
16081 817071 902850 814359 761230 846258 867618 969470 871168 902381 1262400 888513 1143993
16070 1143993 835711 989820 1093926 1022582 1386450 1079213 1236874 1433663 1258356 1117864
16060 1117864 1200198 1258011 1146071 1373894 1283502 1229417 948385 1236529 1245108 1133726
16050 1133726 1206643 1194543 1349866 1165012 1343607 1289634 1294455 1158003 1412352 1318609
16040 1318609 1414727 1647059 1513147 1352707 1513380 1262500 1415961 1576259 1517221 1564246
16030 1564246 1461886 1478851 1400101 1681971 1553384 1500671 1719898 1754728 1903490 1691982
16020 1691982 1725605 1509031 1827490 1705875 1954390 1754638 2040591 1883903 2021660 1817727
16010 1817727 1967682 2003256 2039114 1819206 2084238 1943714 1915124 1789648 1969454 1716603
16000 1716603 1870304 1951454 1904931 1875047 1955235 1918015 1621413 1920524 2025909 1946838
15990 1946838 1793445 1980553 2000832 1963566 1616857 1998449 1954219 2227231 1805384 1890372
15980 1890372 2005041 2078714 2198658 2142849 1918701 1850422 2116116 2181759 1848522 2051598
15970 2051598 2146990 1994500 1833034 2068488 2016634 2043909 1820578 2009717 2055954 1979476
15960 1979476 1974954 1992655 2167431 1956064 1875767 1978971 2175705 1942456 1950413 2177557
15950 2177557 1850286 2004489 2122251 2095558 2048078 2143961 2030516 2196279 1884408 2180977
15940 2180977 2125305 1995876 2272553 2025219 2051780 2246989 2220758 2055839 2551817 2522650
15930 2522650 2520887 2884154 2674364 2705623 2892477 2890555 2749840 3230567 3210216 3413064
15920 3413064 3512404 3580435 3735532 4157344 4575261 4933794 5280922 5973631 6981348 8539585
15910 8539585 10537768 13096842 17047376 23243536 31041472 40081085 50106160 59457500
15902 59457500 67295812 72666144 74593213 73441641 68669167 60605065 50532600 39995441
15894 39995441 29884412 21842241 16378246 12573786 9831359 8107825 6596258 5706179
15886 5706179 5036714 4479512 3893391 3616646 3283967 3216163 3024286 2827559 2708538 2757060
15876 2757060 2633888 2473262 2327779 2320363 2445776 2530617 2376838 2499913 2365799 2494804
15866 2494804 2467475 2196040 2456139 2432076 2076328 1958131 2001724 2097495 2214221 2159795
15856 2159795 2200582 2007291 1883043 2240276 1949403 2073241 2082165 2037580 2003846 2081929
15846 2081929 1972609 2026218 2133143 2076323 1916523 2041865 1953010 1968822 2074694 2312541
15836 2312541 2131643 2511386 2418515 2208381 2486394 2425006 2341874 2284293 2305056 2100842
15826 2100842 2142027 2165713 2041264 1911923 1987336 1840458 1850385 2107048 2056282 2181039
15816 2181039 2021409 1698160 2155789 2074211 1901701 2186010 2143082 2271600 2046581 2226259
15806 2226259 2128793 2153597 2247611 2224287 2255768 2238678 2395744 2147576 2384254 2409938 2902510
15795 2902510 2797975 2814031 3031515 2997711 2902649 3338225 3277911 3207667 3156030 3330199
15785 3330199 3305629 3318535 3454861 3563695 3922486 4030719 4101589 4188910 4356854 4391343
15775 4391343 4476938 4553482 4257031 4428293 4221153 4470969 4410423 4301544 4272495 4253395
15765 4253395 4455937 4588875 4744388 4633534 4787307 4777817 4871871 4738287 4886300 4763457
15755 4763457 4979990 4535335 4671196 4536583 4640351 4712969 4774201 4798653 4914405 5236648
15745 5236648 5244902 5227200 5421567 5647290 5634333 6082291 6395620 6472066 6620126 6909852
15735 6909852 6747014 6697293 6835868 6585333 6877587 7032971 7188885 7312163 7608873 7493963
15725 7493963 7596105 7781799 7326561 7166297 6582262 6486356 6206198 6036420 6120664 6113403
15715 6113403 6188487 6579913 6518044 6584122 6274756 6308925 5949683 5665106 5607822 5593215
15705 5593215 5789835 5973581 6149662 6418377 6350622 6622718 7211739 6983034 6971514 7201021
15695 7201021 7372074 7494784 7605996 7288982 7673244 7545094 7356233 7305089 7236812 7189646
15685 7189646 7054889 6863049 6931598 6661073 6638820 6691848 7018877 6722685 6613730 6516690
15675 6516690 6665478 6399802 6064951 6030737 6189406 5869288 6012892 5954906 6014173 5917915
15665 5917915 6086052 6128522 6331074 6641236 6915901 7343225 7224697 8005742 8006469 8396856
15655 8396856 8635531 9454281 9821057 10598891 10682287 11594020 12241407 12823640 13570626 13748305
15645 13748305 14319799 14626379 15497473 16157694 16436212 17512258 18196840 19344834 20141524
15636 20141524 21137253 21965922 22438445 22969476 22716216 22333686 21985564 21715639 21290261
15627 21290261 21336399 21088862 21278174 21482476 21903678 21755336 21745118 21351310 20603468 19703220
15617 19703220 18745951 17274722 16417250 15395198 14603359 14023162 13690090 13322638 12859174
15608 12859174 12877082 12439432 12137723 11623581 11286448 10927139 10660023 10077084 9802731
15599 9802731 9566142 9831190 9573060 9750634 9863188 9667058 10265761 10874152 12251478
15590 12251478 14876891 20090052 31212556 47334732 63400588 74441983 81293944
15583 81293944 85872275 87040544 85624501 78469528 61761563 40773871 25150695 17237670
15575 17237670 13387543 11274626 9742766 9080729 8291392 8156624 8208617 8178908 8585759
15566 8585759 8298830 8549664 8736692 8961648 9050492 8998188 9157042 9874015 10389305 11522548
15556 11522548 13263166 17380946 26205348 42742387 64486550 84226396 97440783
15549 97440783 104933829 109660372 110440561 106553985 94216508 69706926 42633436 25223254
15541 25223254 16821758 12445977 10011843 8509206 7258395 6778448 6468139 6277374
15533 6277374 6006044 6128527 5856339 5647952 5596484 5368830 5235951 5224724 5007933 4984392
15523 4984392 4423041 4331067 4237408 4385404 4218086 4251186 4062016 3947633 4284817 4292724
15513 4292724 4456959 4322895 4521881 4402752 4651805 4656519 4783773 4768045 4820452 4893382
15503 4893382 4864474 4614098 4648694 4472780 4274300 4126400 4313507 4163432 4199565 4239295
15493 4239295 4611329 4456414 4262110 4283999 4470666 4802650 4764221 4839096 4836231 5104687
15483 5104687 5623296 5884706 6056794 6168272 6361273 6503826 6649232 6656406 6669825 6458420
15473 6458420 6426890 6544128 6924678 7568778 8156800 9439096 10215988 10996871 11825760
15464 11825760 12100311 11981324 11903675 11293865 10705964 10106927 9544457 9256004 9275992 9887595
15454 9887595 10581387 11405380 12209217 12786183 13237350 13057293 13212782 12673912 11878651
15445 11878651 10860685 10215511 9629821 9162066 9183734 9100380 9625909 10006670 9865553
15436 9865553 10438139 10084601 10019019 9693288 9486672 8968160 8617166 8009239 7730671 7436397
15426 7436397 7298016 7166100 6785690 6873520 6911281 6529517 6394634 6374044 5804401 5727688
15416 5727688 5700192 5224555 5333309 5178651 4964460 5102865 4966224 5000276 5191875 5031424
15406 5031424 5073090 5139992 4989395 5162928 5095213 4883746 5470455 5353917 5483820 5516080
15396 5516080 5486615 5674097 5577560 5667539 5623657 5522917 5482773 5322661 5023634 5263802
15386 5263802 5036667 5095396 5294418 5217162 5473067 5338390 5202232 5409453 5446817 5250789
15376 5250789 5372709 5525130 5697662 5326613 5353690 5321469 5282351 5372869 5495314 5463162
15366 5463162 5483401 5614519 5532965 5774762 5906117 6112514 6273073 6298727 6234645 6361749
15356 6361749 6584868 6746044 6770854 7125503 7556455 7680035 8227865 8939664 10038190
15347 10038190 12211769 16247868 23461368 32102399 40795669 46935857 50895337 53342183
15339 53342183 54036094 52448425 47371645 37969423 27694357 20418804 17062881 15419002
15331 15419002 14965166 14519914 14190843 13748738 13305375 12701625 12203604 11750373 11539004
15322 11539004 11687285 11648842 12079996 12556569 12776454 13609554 14275886 15502781 18630998
15313 18630998 24470488 34381650 48852551 64723376 79000955 89183888 95599109
15306 95599109 98198885 96838759 90124790 76462368 58285312 40933340 27929467
15299 27929467 20430432 16901643 14642943 13617145 12813755 12435063 12333668 12544580 12678420
15290 12678420 12600804 12618480 12566600 12564555 12422746 12382142 11777907 11941192 12012414 12590784
15280 12590784 13661931 16332870 20673933 27775457 36283048 43973603 49260767 52391328
15272 52391328 53930346 53716853 51271295 45233337 35648431 26139235 19412146 16055238
15264 16055238 14355903 13039817 12105066 11210669 10482602 9722378 9024975 8839319 8829557
15255 8829557 8821335 9271482 9472533 9552462 10174754 10444171 10554403 10742029 10664459 10522085
15245 10522085 10644385 10161777 10100811 9464047 9129850 8704407 8624413 8262606 8491584 8681603
15235 8681603 8915232 9509067 9989903 10570250 11123091 11715535 11896970 12128273 11955588
15226 11955588 11814288 11251297 10681554 10165440 9494428 8978329 9028746 8736461 9127515
15217 9127515 9219056 9375909 9871074 10161986 10789680 11090472 11754915 11790401 11824717 11351732
15207 11351732 10792030 10332837 9449362 8690750 8039533 7420832 7022676 6840783 6873940
15198 6873940 6537044 6449476 6059409 6141310 6212681 6156141 6270971 6534056 6751177 6517380
15188 6517380 6853789 7049580 6973246 6977508 7117351 6914108 7169953 7182140 7242650 7248736 7430360
15177 7430360 7831517 7955580 8102236 8240556 8254186 8144200 8006880 8158575 7990517 8035924
15167 8035924 8038727 8069261 7942409 7904343 8045575 7877861 8085070 7762683 8158513 8212820
15157 8212820 8611209 8685332 8731132 8708966 8935496 8920378 9105361 8702016 8566628 8651684
15147 8651684 8420949 8380639 8369935 8298486 8331130 8408575 8255376 8352982 8209359 8634950
15137 8634950 8150407 8350802 8264536 8171171 8265831 8005517 8025996 7879039 7898482 8294261
15127 8294261 8179956 8244625 8166936 8169463 8015303 8295833 8007118 7858868 8038191 7659792
15117 7659792 7767873 7753934 7798126 7534267 7785896 7489097 7597626 7575392 7750540 7829415
15107 7829415 7848248 7716334 8060116 8105136 8384655 8634129 8821513 8878928 9405006 9673803
15097 9673803 9664702 10090455 10248064 10621286 10981550 11322728 11892319 13179598 15085719
15088 15085719 18346548 21947029 24964792 27621914 29225455 30320079 30349445 29698813
15080 29698813 28119386 25159916 22145797 20368260 19929514 20783693 22989559 26133077
15072 26133077 29808360 32155160 33813255 35065711 35367178 35042175 33831764 31310836
15064 31310836 28633896 28483856 32155769 37577399 42212525 45927596 48902269 51319690
15056 51319690 53667047 55323017 54430342 50667204 47185154 46057307 47076805 49279255
15048 49279255 52206191 55417096 57848123 59130007 60166962 61412767 62288735 63302980
15040 63302980 62745743 60280550 56440557 53276060 51311673 49890094 48768084 46680770
15032 46680770 44277926 42441169 42642344 45355718 50272553 56598362 62160233 67976978
15024 67976978 73749756 79211052 84969172 90067169 92585710 94274297 97200613 101856777
15016 101856777 107082896 112713268 117734148 121620341 122481730 120966664 117308726 111712201
15008 111712201 104599451 95882585 85664615 76165819 68360192 62605143 58629310 54929343
15000 54929343 52664813 51479167 51403378 52577226 53870908 55359563 56011819 56527955 56528406
14991 56528406 55693224 53583171 50869654 47747515 45458013 45027236 45902613 47111781
14983 47111781 47515507 48493689 49656371 50751672 50935921 49165924 44996915 40385113
14975 40385113 36767915 33984424 31105923 28375421 26239557 25142402 24727261 24908038
14967 24908038 24999382 25137105 25893090 26563028 27119628 27474385 28532230 29535506 30866050
14958 30866050 33300352 36112959 40765596 47790151 57924612 72597411 92498155 117775682
14950 117775682 146751189 179956171 216477075 253826378 290089886 324531881 355370163
14943 355370163 376231986 384211342 379642993 363785403 339409576 312623479 284821217
14936 284821217 253790944 219492036 190589083 172724992 163511502 156996791 149505908
14929 149505908 138649235 125200651 112553630 101464438 92151420 84259598 79524463
14922 79524463 77223039 77100303 76647509 75267235 73514309 70682281 67252823 61760990
14914 61760990 52886598 42098085 31427864 24331978 19754319 17151507 15544796 14302882
14906 14302882 13725751 13276698 13356237 13869194 14509098 15157527 16740902 17937856 19452012
14897 19452012 20842773 22809853 26291650 31484732 37758799 43742734 47421227 49924576
14889 49924576 50881329 50869459 48657889 43918873 36640304 28779631 22594551 18740005
14881 18740005 17216902 15819136 15336804 15186211 15095684 15652509 16141993 17076489 18260227
14872 18260227 19093765 19828821 20217557 20534562 20549410 20933458 20618562 19709576 19017661
14863 19017661 19179578 19842148 21593960 23514762 27346863 33978562 43129986 53873561
14855 53873561 65802587 77412411 88565683 97417969 101773446 100764136 94699974 84513990
14847 84513990 72994863 60720343 47814021 36669061 28300107 23518842 20539300
14840 20539300 18761256 17565466 16613531 16272717 15584863 15184646 14953381 15043378 14786043
14831 14786043 14749334 14452915 14633836 14950901 15443583 16250795 17114105 17830941 18645413
14822 18645413 19805404 21703917 24676494 29863769 37964784 47357822 56497895 63550214
14814 63550214 68011985 69997223 69691310 66113618 58604464 47477540 35188547 25512594
14806 25512594 19616240 16373707 14482977 13419096 12607433 12330065 12037394 11657486 11341527
14797 11341527 11200484 11086254 10844202 10530585 10087723 9847165 9298138 9132743 8642292
14788 8642292 8834042 8433736 8621613 8563446 8576253 8747101 8919113 9274025 9649580 9965180
14778 9965180 11085345 11972157 12837165 13591494 13982139 14046006 14109434 13424540 12826412 11803819
14768 11803819 10352578 9627468 9185212 8831757 8892145 8777303 8997221 8819900 8969765
14759 8969765 9216276 9337300 9476245 9827874 10427823 10215493 10290245 10633943 10723772 11006454
14749 11006454 11146518 11363740 11122270 11505151 11422963 11606347 12002691 12067204 12352334 12547198
14739 12547198 13210835 14212633 15660869 16762157 18868232 21651570 25536304 31227676
14731 31227676 39424304 52288000 73148054 102422066 139876790 180751871 220717838
14724 220717838 254880418 278639031 290504042 289088321 271211638 238552462 196930653
14717 196930653 152214520 110594178 77643455 55292107 41265954 32407424 26473225
14710 26473225 22700117 19601531 17319737 15699899 14440748 13529168 12433448 11910259
14702 11910259 10870864 9878153 9442260 8766843 8555025 8284151 7994551 7519549 7445133
14693 7445133 7494270 7522794 7518045 7614843 7446828 7683449 7739922 8052608 8094777 7900474 7925287
14682 7925287 8161270 8580906 8527205 8835354 9222850 9621489 10118402 11102079 11930792 12633252
14672 12633252 13178981 13121062 13136815 12949650 12103639 10766435 9243755 8195128 7476397
14663 7476397 7329014 7427145 7428536 7304287 7430667 7505398 7387037 6916313 6491929 5909621
14653 5909621 5975879 5771210 5936550 5849309 5999936 6324574 6154860 6464803 6601967 6835365
14643 6835365 6967105 7155427 7470017 7441092 7665902 8080391 8536596 8920189 9779598 10301861
14633 10301861 11062658 11634580 11636799 11613399 11466845 10193977 9221459 7894093 6807613
14624 6807613 5674405 5024845 4763753 4540656 4594160 4522326 4735331 4702509 4503648 4639838
14614 4639838 4605557 4506893 4603812 4636844 4481586 4425094 4372800 4592429 4068858 3826489
14604 3826489 3583405 3396506 3372933 3761535 3893372 4487120 5272608 6184354 7355708
14595 7355708 8187645 8792372 8895610 8696827 8404614 7953099 6903566 5977676 4872367
14586 4872367 4240187 4138641 3705020 3760045 4085286 4058914 4071943 4025257 4180955 4090654
14576 4090654 4259403 3952039 4079182 4410949 4171546 4434848 4755762 4780235 4919371 5333236
14566 5333236 5851472 6426104 6796012 7259007 8113890 9308382 10817947 14857530 21425764
14557 21425764 30317068 40240453 47231047 52360217 55429949 56682782 55933181 51573654
14549 51573654 42826602 31005817 21902674 17431586 16075760 17742412 22788445 31322587
14541 31322587 41468212 50791494 57118291 61253046 62879563 62693334 59319335 51521517
14533 51521517 39300394 27260928 19217273 15537717 13938521 13510597 13666264 13859322
14525 13859322 14067666 14186074 14025177 14217712 13612246 14244709 16454007 21325812 28247919
14516 28247919 34784876 39595204 42914579 44928451 45575581 44512111 40971549 34121409
14508 34121409 26558524 21941717 20466235 21252197 23429961 27928008 34128243 40641656
14500 40641656 45118395 47965980 49503929 50084561 48547144 45296662 38879410 30195318
14492 30195318 23140863 18786199 16559702 14718841 13024982 11662567 11107224 9895063
14484 9895063 8374480 6982135 5975165 5142433 4617154 4587093 4616129 4424329 4395444
14475 4395444 4184672 4345030 4193353 4393057 4507625 4921875 5325870 6435482 6887673
14466 6887673 7330998 7327790 7624310 7469612 7290901 6971916 6415924 6463487 7036693 7714621
14456 7714621 8287928 8853673 9165828 9322391 8985505 8787422 8060328 7256815 6555147
14447 6555147 6227630 6247470 6643025 6941688 7335489 7769024 8122516 8540636 8663672 8716958
14437 8716958 8760294 8708849 8693709 8972136 9068213 9347737 10099215 10892927 12409814 15394945
14427 15394945 20181163 26485821 33817837 40597424 45813053 49617269 51798660 52155496
14419 52155496 49415139 44175194 36815432 29517399 22898693 18463883 15581894 13227200
14411 13227200 11662903 10496965 9623702 8973921 8675697 8714067 8422314 8685641 8581973
14402 8581973 8780831 8323011 8535773 8403801 8672654 9076672 9461800 10357988 11734597
14393 11734597 14560897 18657354 24781235 33869177 45405048 57395834 67979244 76652055
14385 76652055 82115632 84143985 82630976 76383837 65751321 52801345 39907327 29324894
14377 29324894 22317782 17337079 13669049 11856886 10589401 9626990 9008760 8684703
14369 8684703 8260716 8261855 7988139 7824833 7601111 7830965 7606554 7281788 7348810 7548573
14359 7548573 8260689 8853082 9929464 11362363 13654317 16545025 20843615 25594261
14351 25594261 31168730 35410317 39373742 41501537 42211179 41495524 39587938 35985799
14343 35985799 31809080 27925431 25660473 25434463 27052507 30806443 36837364 46199259
14335 46199259 59252262 74936103 90359940 102740770 112146044 117984768 119712197
14328 119712197 116765720 107719278 92362005 74156716 57870882 44645375 35335147
14321 35335147 28055249 22708083 18611833 15639337 13155357 11671403 10084296 8879488
14313 8879488 8259168 7145094 6952707 6138522 5926649 5752150 5430542 4960478 4716378
14304 4716378 4565856 4289985 4001566 3712777 3522394 3533358 3656087 3234380 3268216 3343914
14294 3343914 3323885 3090005 2900878 3090154 2757962 2832205 2809174 2568074 2578891 2447972
14284 2447972 2600921 2677452 2879659 2856625 2778275 2903600 2929711 3075431 3062229 3175416
14274 3175416 3188886 3530955 3363873 3331221 3412227 3387097 3096831 3081295 2947867 2994052
14264 2994052 2799984 2611653 2574719 2698191 2655273 2651634 2638738 2422902 2275465 2374449
14254 2374449 2208104 2170280 2354453 2154867 2247666 1898931 2116725 2401471 2076349 2120347
14244 2120347 2168763 2116928 2210913 2107776 2126132 2145541 2184622 2648218 2387082 2593580
14234 2593580 2588161 2748370 2813740 2470547 2391474 2161438 2199295 2301100 1913905 2203798
14224 2203798 2104802 1886238 1897609 1758868 2110105 2089396 1995707 1968673 2182388 2233648
14214 2233648 2399951 2463574 2527895 2618289 2473700 2453548 2511521 3054614 3952344 4636564
14204 4636564 4728454 4998293 5113628 4895627 4910693 4944960 3752324 2592224 2048031 2286271
14194 2286271 1904723 2083529 2151047 2163607 1948267 2067489 2151080 2173687 2251914 2060570
14184 2060570 2113325 1967111 2092085 2094091 1610561 2082579 2179514 2326028 2689331 2742240
14174 2742240 2715334 2946583 2912749 2846301 2737194 2676818 2180149 2076046 2102333 1880484
14164 1880484 1851884 1767759 1771382 1825371 1908737 1755225 1805498 2012690 2396887 2089844 2440541
14153 2440541 2302398 2482777 2431642 2574235 2565095 2398263 2443642 2338223 2249218 2448685
14143 2448685 3075866 2970709 3447314 3970561 4815669 5940303 7253366 8510977 9448857
14134 9448857 10069374 10725548 10629417 10411244 9184754 7736489 6372818 5220392 4289196
14125 4289196 3610965 3116958 3050762 2770233 2951433 3336645 3494284 3795060 4099384 4212273
14115 4212273 4561392 4358821 4411331 4113703 3933842 3349293 2656178 2796382 2549562 2547634
14105 2547634 2238539 2666541 2381352 2642143 2612053 2707477 2789128 2941315 3658582 4071021
14095 4071021 4515804 5240341 5538867 5509409 5656582 5388761 5273663 4904650 4360269 4021766
14085 4021766 4188749 4460569 5151574 5402967 6425028 6654948 7172773 7322248 7870441
14076 7870441 7744993 7563712 7261564 6772124 6764523 7003175 7340731 7893450 8576231 9741194
14066 9741194 10840656 12372381 14502412 17253297 21131048 26267974 33430952 43044712
14058 43044712 55174982 68648341 82499530 94247664 102921242 107853220 108696605 105442720
14050 105442720 97035853 83973098 68873888 54138720 42235493 33583201 27154656
14043 27154656 22672590 19300011 17240775 15260345 13750418 12445302 10953188 9493111
14035 9493111 8546993 7762626 6916702 6020354 5545760 5179339 4746114 4415019 4333609 4410801
14025 4410801 3615430 3538627 3578991 3426586 3291303 3288136 3159963 3049375 2845255 2666522
14015 2666522 2839012 2956048 2685222 2547882 2462188 2688305 2597733 2757432 2447959 2639572
14005 2639572 2264338 2309540 2295898 2380289 2413740 2170525 2365800 2334751 2377588 2395129 2853437
13994 2853437 2399856 2918600 2747799 2716927 3034016 2958988 3463419 3844895 4324381 5455849
13984 5455849 6469450 7695082 8992015 9838155 10448534 10607167 10771766 10533939 9721558
13975 9721558 8567352 6974264 5770426 4868378 4425749 4054066 3575333 3201333 3158702
13966 3158702 3206059 3309949 3182447 3079267 3122626 3045719 2949487 2767650 2791851 2558181
13956 2558181 2733628 2579634 2541848 2378845 2355391 2353805 2122428 2203975 2701679 3090784
13946 3090784 2996857 3273893 3720039 3822853 4189434 4298190 5216964 6836596 9585053
13937 9585053 12771580 15993222 19362458 22511601 24686686 25538102 25062657 23126026
13929 23126026 20130812 16649139 13087297 9465395 6817967 4874913 3724757 3495062
13921 3495062 2759878 2388846 2148279 1918878 1926369 2043817 1885968 1740455 1801673 1856773
13911 1856773 1746344 1557181 1632228 1627570 1556167 1768291 1642280 1712509 1746350 1502942
13901 1502942 1685996 1383543 1420225 1588338 1470963 1457743 1607840 1547000 1495800 1420336
13891 1420336 1652740 1391802 1371435 1666509 1343859 1660185 1654783 1601514 1596512 1552334 1488605
13880 1488605 1587572 1593048 1559449 1527820 1308422 1420596 1326967 1398480 1354889 1575369 1609336
13869 1609336 1536203 1344302 1641223 1738272 1767739 1701188 1846312 1739861 1657395 1605003
13859 1605003 1688020 1580945 1702106 1622990 1860196 1640975 1470947 1618488 1625130 1339398
13849 1339398 1493964 1738517 1578318 1546281 1593788 1578144 1663154 1671403 1676405 1475726 1470897
13838 1470897 1618816 1488927 1277104 1511589 1616077 1496008 1475482 1280990 1436934 1554098
13828 1554098 1528814 1637626 1482892 1479304 1412355 1587351 1505727 1449439 1236916 1142652 1297939
13817 1297939 1393848 1368751 1206783 1422078 1451011 1126693 1348370 1323685 1508669 1453349
13807 1453349 1296450 1151535 1303494 1236211 1259852 1434547 1385107 1347708 1559394 1284594
13797 1284594 1448137 1414610 1535807 1347260 1378648 1543647 1216854 1389349 1196952 1127068
13787 1127068 1331202 1183435 1357312 1501377 1328678 1181427 1101114 1475149 1162123 1259510
13777 1259510 1493654 1356484 1254752 1430017 1426240 1378635 1545793 1582387 1730730 1941523
13767 1941523 1810639 1637208 1606343 1982112 1685464 1804462 1777363 1516876 1508328 1346009
13757 1346009 1603100 1577631 942309 1166446 1338885 1320251 1252740 1279579 1391578 1283419
13747 1283419 1525408 1284354 1582294 1395146 1412702 1244214 1521456 1465572 1545356 1488215
13737 1488215 1519787 1830595 1728727 1775685 1692371 1665761 1765822 1566189 2025379 1917840
13727 1917840 1634995 1597508 1739976 1871238 1700341 1775032 1617866 1850510 1732824 1897921
13717 1897921 2070699 1787894 1879671 1970633 1953191 1827748 1996597 2103193 2412038 1897604
13707 1897604 2048206 1895164 2219618 2224511 2140170 2034639 1948725 2045738 1912734 1891306
13697 1891306 1908329 2026760 2091727 2439592 2614443 2533774 2819097 2832502 3002184 2878529
13687 2878529 2879608 2648878 2644802 2056137 1850611 2141693 1889956 1813457 1694970 1792443
13677 1792443 1860499 1675764 1754051 2032622 2168236 2018770 1941146 1768883 1847315 1978870
13667 1978870 2342686 2361494 2467056 2534503 2946438 3177770 3157312 3114289 3244339 3225765
13657 3225765 3099739 2840153 2789334 2303210 2495563 2603009 2163844 2109874 2093937 1979239
13647 1979239 2241723 1930646 1923772 1841868 2234774 1969293 1992745 2163123 2320457 2082215
13637 2082215 2113716 2132323 2321179 2386087 2687614 2998801 2964933 2713289 3103042 3386695
13627 3386695 2972665 2769484 2571462 2330632 1931116 2095233 1866160 1919222 1796364 1825754
13617 1825754 1692074 1852952 1843529 1888121 1840954 1975127 1674421 1689931 2061907 1975483
13607 1975483 2284385 2142484 2352837 2221601 2071897 2210637 2059599 1998500 1988058 1776712
13597 1776712 1879518 1835767 1933386 1833103 1808989 2166953 2114420 2349180 2021316 2023841
13587 2023841 2053228 2203833 2143822 1623179 1781518 1636046 1704799 1843668 1715274 1921740
13577 1921740 1893034 1640765 1679197 1585320 1453484 1658621 1660166 1515247 1602812 1514167 1665535
13566 1665535 1603050 1637772 1704798 1952113 1591017 1748686 1928072 1875258 1768112 1797066
13556 1797066 1637778 1573667 1674178 1360628 1512781 1497443 1437641 1588732 1556023 1639050
13546 1639050 1555867 1575958 1688814 1733431 2056872 2152369 2408430 2369848 2614922 2476528
13536 2476528 2554718 2206368 2120979 2054754 1728189 1768371 1822070 1664912 1540703 1475228
13526 1475228 1897258 2203710 1940464 2380836 2475102 2481714 2351615 2450862 2302719 2153716
13516 2153716 1589890 1486489 1420499 1307816 1236389 1554241 1259864 1497215 1531604 1246050
13506 1246050 1328421 1320173 1143113 1183419 1259258 1308566 1326866 1250133 1252196 1267969 1094272
13495 1094272 1292334 1323397 1225123 1312189 1435327 1571000 1391404 1216058 1198219 1258169
13485 1258169 1093243 1220196 1355681 1272156 1484306 1416085 1303044 1266731 1522404 1137918
13475 1137918 1462914 1109606 1285036 1408257 1425195 1419494 1004724 1195079 1303046 1052542
13465 1052542 1381901 1439829 1341459 1282077 1476792 1353570 1620737 1484868 1513088 1461936
13455 1461936 1608854 1433780 1562746 1636012 2161773 2268235 2424889 2545855 2645492 2398798
13445 2398798 2382622 2303062 2151164 1482939 1768677 1777449 1553737 1519314 1533475 1473374 1449444
13434 1449444 1495126 1554015 1506767 1459137 1566133 1292967 1764074 1471589 1553333 1503628
13424 1503628 1514996 1523964 1711653 2297428 2245215 2554401 2543387 2487598 2346787 2566001
13414 2566001 2363660 2117027 2008566 1729327 1865238 1636864 1528650 1832096 1622362
13405 1622362 1499055 1668903 1399016 1829119 1433768 1417879 1479220 1465560 1304439 1504279
13395 1504279 1661616 1666983 1749642 1728639 2083865 1930635 1902861 1972181 2324064 2187124
13385 2187124 2313101 2298041 2520734 2752281 2536544 2514456 2475824 2576546 2341232 2299301
13375 2299301 2211980 2085327 1885604 1927006 1887567 2058969 1981759 2082918 2189947 2124842
13365 2124842 2086831 1984388 2102973 2108499 2186053 2201805 2021921 2031938 1998548 2140739 2204462
13354 2204462 2072311 2264124 2455986 2612644 2280120 2439793 2462905 2647872 2200733 2143068
13344 2143068 2235325 1743780 1963731 1929269 1964446 1894095 2079735 2126279 1954042 2170762
13334 2170762 2073584 2251921 1956174 2129748 2196458 2079276 2158445 2067654 2112011 2058861
13324 2058861 2286609 2128572 2291222 2175493 2072923 2205301 2084181 2271841 2361006 2530150
13314 2530150 2558134 2634093 3147347 2945886 3005076 3078225 3032281 3021078 3004670 2982519 2590811
13303 2590811 3031658 2706789 2818041 2901171 3012122 3037771 3411313 3217192 3555080 3473111
13293 3473111 3574443 3539569 3220331 3077576 3237897 3342611 3145145 3076765 3117984 3135992
13283 3135992 3228019 3246168 3280549 3276812 3290703 3249334 3385810 3381715 3200858 3508938 3544858
13272 3544858 3723127 3657833 3699684 3706649 3860168 3883568 3969889 3731910 3885289 4223941
13262 4223941 4054141 3953540 4195969 3964801 4108826 4334213 4370003 4607870 4559745 4587977
13252 4587977 4695046 4940098 5185678 5088925 5046731 5369359 5426821 5635361 5685496 5609304
13242 5609304 5933391 5563495 5989760 5634579 5938358 5979032 6193978 6328526 6417806 6587830
13232 6587830 6684220 6903680 6935245 6848391 7056264 7326131 7153446 7546576 7594710 7712262
13222 7712262 8087055 7975779 8230753 8209768 8124306 8288189 8564674 8605149 8592881 8541275
13212 8541275 8329596 8153833 8028596 8106785 8118618 7745316 7650785 7571539 7558251 7340519
13202 7340519 7480854 7361209 7373667 7452935 7509895 7311190 7229455 7071628 7086509 7112128
13192 7112128 7182633 7028066 7021450 6728595 6615192 6679261 6395700 6369456 6133155 6206623
13182 6206623 5955042 5723142 5828027 5887160 5405619 5455268 5560505 5521949 5480214 5057095
13172 5057095 5209896 5226525 4954085 5072635 5254556 5281258 5026768 5212602 5270628 5333256
13162 5333256 5394084 5719725 5834182 6035856 6304284 6370824 6523147 6843338 7273843 7159556
13152 7159556 7191640 6818656 7125621 6856802 6529329 6344888 6644652 6570699 6464706 6607969
13142 6607969 6512335 6516197 6615643 6470800 5909275 5644768 5534557 5241665 5098355 4657596
13132 4657596 4532148 4293970 4390010 3948484 4002946 3967542 4142177 3985821 4197162 4225141
13122 4225141 4074339 4114393 4117146 3765663 3562652 3780396 3671175 3573302 3634566 3562494
13112 3562494 3369908 3570417 3332606 3319912 3304126 3226809 3308650 3435977 3374564 3567788
13102 3567788 3455718 3571309 3622888 3782604 4270171 4414362 4672130 5084939 5530211 5799992
13092 5799992 6156065 6498464 6425940 6657053 6598667 6546448 6408456 6246453 6224203 6296632
13082 6296632 6353369 6169128 6284272 6155171 6073313 5924543 5490336 5447611 5004318 4409454
13072 4409454 4216780 4018793 3923725 3685038 3596021 3262904 3339145 3360042 3481745 3537258
13062 3537258 3232383 3239559 3513851 3146849 3380617 3550879 3464438 3470915 3669835 3425368
13052 3425368 3587117 3572259 3448008 3555278 3078649 3563585 3452193 3349839 3504407 3519341
13042 3519341 3586024 3541813 3634414 3552282 3770472 3661791 3940919 3592019 3751251 3827444
13032 3827444 3837595 3839076 4026483 3893745 4339198 4033897 4357693 4269589 4311311 4291101
13022 4291101 4683563 4353467 4664559 4691036 4697230 4850436 4786044 4761680 4878335 5280922
13012 5280922 5145868 4971423 5344544 5441426 5567188 5453350 5616501 5704865 5793958 5942434
13002 5942434 6050604 6079646 6052414 6077523 6146210 6289014 6311191 6381193 6284038 6491805 6634994
12991 6634994 6832971 6857846 7165074 7079589 6865299 7024274 6747277 6986769 6883022 6807152
12981 6807152 6734147 6794419 6810345 6799534 7039756 6949057 6727859 6738540 6595810 6532388 6264590
12970 6264590 6208152 6059224 6111756 6190722 6184499 5993205 5954299 5805952 5904444 5952504 5672746
12959 5672746 5927497 5746965 5676812 5930463 5822180 5833445 5956685 5817330 5846691 5931916
12949 5931916 5885448 5899352 5811418 5999527 5814823 5840148 5813868 5682381 5832057 6004227
12939 6004227 5825672 5878961 6040671 5804815 5753943 5894347 5801722 6051014 6025098 6191225
12929 6191225 6217302 6153896 6166414 6307988 6176463 6085610 5630253 5716128 5443664 5404728
12919 5404728 5718527 5438221 5535002 5734707 5541482 5493081 5361024 5111979 5005805 4518891
12909 4518891 4468102 4408097 4521098 4191629 4255674 4316918 4220608 4118618 4117441 4182841 3904587
12898 3904587 3795882 4034227 3579132 3412667 3670622 3580155 3407100 3643083 3352622 3577785
12888 3577785 3490827 3421596 3541745 3569038 3463109 3545158 3546897 3647563 3490355 3417689 3444489
12877 3444489 3202457 3152526 3087186 3288295 3306991 3093169 2916544 2904626 2884837 3003913
12867 3003913 3215859 2941876 2755320 3013340 2863492 3031101 2824104 3015216 2897088
12858 2897088 2767405 2816026 2986647 2911340 3062684 2943095 3022712 2704446 2838135 2779644
12848 2779644 2771561 2810725 2636625 2867113 2860629 2801199 2836429 2685979 2810459 2706185 2744320
12837 2744320 2801625 2743015 2774474 2658331 2727556 2850286 2855926 2817500 2629848 2820980 2872268
12826 2872268 2706638 2631512 2808653 2887530 2732019 2917388 2661999 2624209 2757399 3011610
12816 3011610 2900033 2648100 2756932 2883447 2872552 3022340 2857747 2853904 2937345 2597610
12806 2597610 2668305 2643273 2830587 2869812 2963040 2832461 2783251 2871240 2775711 2735456 3023395
12795 3023395 2788376 2818929 2744166 3316548 2670774 2863631 3015274 2774763 2838563 2915681
12785 2915681 2871023 2983131 2803909 2936156 2926230 3123822 2868606 2836126 2852179 2768477
12775 2768477 3092590 2785506 3159398 3153415 2730272 2810478 2680441 2724993 3151192 2817674
12765 2817674 2953129 3024073 2941239 3031133 2840117 2833038 2923761 2972520 2978778 2878622 2896259
12754 2896259 3138924 2860105 3071958 2857145 2931150 2997530 2881891 2963751 3069678 2893756
12744 2893756 3077676 3081990 3134774 2981445 3029426 2977827 3080702 3050005 3093158 3240381 3094416
12733 3094416 3211548 2998059 3181451 3187431 3268520 2938591 2934688 3124305 2945900 3083961
12723 3083961 2867383 3115722 2956162 3377151 2979690 3174163 3062447 3297836 3078700
12714 3078700 3089615 3390936 3104423 3293642 3224359 3088151 3263003 3196177 3132255 3599139
12704 3599139 3423556 3299782 3693811 3815762 3759109 3979821 3899178 3956412 4165972 4452175
12694 4452175 4208480 4476058 4327616 4600032 5156284 5505757 5830585 6584048 6945833
12685 6945833 7311573 7563720 7659951 7070784 7189343 6659187 6187477 5324667 4986511 4839778
12675 4839778 4549284 4571800 4259855 4190685 4215466 4453960 4446997 4305290 4596908 4568047
12665 4568047 4803091 4831013 4890500 4904573 4999750 4826661 4777363 4873151 4905973 4743337 4845422
12654 4845422 4760344 4963507 5049869 5387368 5333925 5721819 5945967 6437242 6324301 6380281
12644 6380281 6236861 6359190 6215090 6167384 6191409 6358746 6133260 6306338 6082622 6685700
12634 6685700 6650915 6519659 6648666 6571997 6921002 6866532 6756839 6964873 7012210 7036540
12624 7036540 6909876 7026284 6574267 6466407 6296708 5951515 5910014 5542429 5221832 4914017
12614 4914017 4852425 4967950 5017934 5344699 5471497 6416422 6430884 7126292 7621564 8109503
12604 8109503 8444226 8758912 8884005 8417203 8197999 7675049 7040480 6693310 6081493
12595 6081493 5520741 5060830 4895896 5011904 4873393 4973593 5225920 5536048 5660722
12586 5660722 5792631 5791084 5901792 5890872 5875123 5939309 5887483 5953859 6086405 6473572 6561838
12575 6561838 7072058 7052830 7072778 7128214 6945106 6507594 6139922 5554046 5107266 4884792
12565 4884792 4684014 4537356 4376632 4626943 4816709 4939669 4778048 4841847 4782573 4925264
12555 4925264 5008372 4728585 4862599 4744662 4757169 4574683 4765315 4690382 4788671 4470937
12545 4470937 4859297 4897255 4844445 4997656 4997413 5379914 5295588 5604130 5471059 5798386
12535 5798386 5851902 5802961 5702299 5454103 5091851 4893077 4582832 4815148 4679177 4647872
12525 4647872 4664675 4819933 4588274 4592218 4898768 4748558 5012769 4752863 5053835 4922917
12515 4922917 4919624 5293914 5298337 5486314 5688147 6313145 6749378 7120439 7356540 7353302
12505 7353302 7416463 7261323 6696828 6323904 6047001 5700041 5203391 5297660 5269560 5169826
12495 5169826 5358457 5131301 5212448 5436577 5257677 5316564 5177993 5093910 5331528 5437152
12485 5437152 5282290 5420243 5551551 5434334 5633482 5891671 6057666 6180967 6321945
12476 6321945 6474040 6280100 6200438 5588571 5667806 5420837 5367939 5175313 5063645 5179743
12466 5179743 5254556 5197460 5249022 5207920 5027131 5163343 5234771 5314157 5402864 5442043 5651983
12455 5651983 5679780 5614282 5550877 5671744 5511475 5806099 5827655 5887871 6149863 6040340
12445 6040340 6257197 6255050 6382660 6618361 6576519 7039142 6953675 7299024 7417324 7496250
12435 7496250 7503068 7849020 7903755 7797640 7839027 8043374 7904064 8094115 8036728 8179664
12425 8179664 8630270 8577238 8538013 8753465 8733269 8803845 9002744 9083844 8929423 9317239
12415 9317239 9341947 9834471 10289907 10377257 10925882 11020434 11315219 11525157 11613527 11800374
12405 11800374 11991913 11840295 11566327 11651729 11514483 11572936 11502527 11515024 11362041 11237814
12395 11237814 11209593 11168761 11555952 11507201 11550823 11574934 11576224 12200895 12372639 12767437
12385 12767437 13166378 13445628 13708990 14031649 14449562 14659737 14892282 14932951 15167082
12376 15167082 15383676 15565006 15540462 15740068 15755210 15998585 15931267 15717296 15496276 15830373
12366 15830373 15594727 15550686 15347936 15718484 15453695 15282468 15114682 15071917 15065719 14823084
12356 14823084 14579251 14697804 14832504 14330816 14377591 14414511 14044293 13996764 13857021 13714831
12346 13714831 13362180 13067407 13110708 13068539 12893522 12992151 13443501 13400149 13762531 14011169
12336 14011169 14210662 14976253 15172938 15454770 15658315 16352097 16534377 16833946 17259599
12327 17259599 17433992 17959203 18290839 18024107 18179643 18552982 18596589 18627982 19029566 18681972
12317 18681972 18826971 18744270 18671783 18849808 18704992 18884047 18745328 18936311 18984874 19332415
12307 19332415 19619131 19834504 20389242 20656882 20998846 21538729 21688869 21820423 21790872
12298 21790872 21708057 21437504 20927539 20356785 19818431 19111199 18419872 18067080 18052228 17745715
12288 17745715 17928925 17650466 17599527 17118468 16828529 16106574 15641916 14988150 14643113
12279 14643113 14059650 13456547 13109931 12762645 12456743 12289030 11964460 11794177 11765541
12270 11765541 11613266 11853148 11580022 11613845 11615528 11727746 11395718 11520896 11483918 11428211
12260 11428211 11388778 11069549 11503060 11401153 11482690 11313216 11774390 12036362 12408682 13005244
12250 13005244 13833397 14357906 15148146 15875254 16866535 17879780 18975499 20223909 21165379
12241 21165379 22294779 23067444 23517150 23849955 23864169 23731063 23310454 22803681 22638081
12232 22638081 22419716 22564360 22424575 22394193 22024587 21712530 21278298 20659754 19699330
12223 19699330 18607616 17568019 16507570 15485060 14625509 13568782 12648932 12513191
12215 12513191 11952612 11488427 11427211 11305127 10913629 10757952 10415125 10175451 10118615 9484063
12205 9484063 9499014 9231974 9079036 9297911 9161777 9238769 9450209 9300275 9222061 9384970
12195 9384970 9237293 8999599 9238141 9229444 9617080 9620006 9963762 10131401 10349243 10229601
12185 10229601 10896665 10798240 10879608 11082138 11246820 11346833 11760788 11670991 11727694 11672756
12175 11672756 11519110 11577315 11351841 11259557 11203189 11176646 11177152 11403797 11712142 11678443 12102469
12164 12102469 12137215 12508679 12587858 12952073 13685980 14280135 14578948 15452771 15634073 15980546
12154 15980546 15842509 15486668 14997171 14522453 14123198 14083867 14346814 14520552 14915012
12145 14915012 15598453 16164145 16312193 16941911 17174667 17311295 17669787 17732198 17931791
12136 17931791 18366888 18946521 19616110 20601961 21878044 22905266 24488884 26277273 28058886
12127 28058886 29954043 32273123 34019321 35846182 37476328 38348808 39456233 39736423
12119 39736423 39587845 39690670 39160617 38441827 38010246 37616459 36674219 36004364 35549122
12110 35549122 34669405 33768731 33233101 32404547 32017290 31634081 31664408 31582385 31871466 32321825
12100 32321825 32889544 33208387 33202280 33430226 33486874 33479083 32933270 32163226 31042121 29932197
12090 29932197 28720330 28329734 28448934 28747855 29325051 30376961 31104858 32169116 32635473
12081 32635473 33150769 33435743 33407064 33105392 32638870 32867937 32763615 32687215 32595065 32352809
12071 32352809 32334695 32357360 31777219 31411665 30931867 29799258 28939462 27821503 26780088
12062 26780088 25387692 24716580 23820374 23346467 22940845 22394337 22310766 21803627 21628753
12053 21628753 21161811 20854429 20439922 19919471 19585163 19031499 18636010 18521483 18119256
12044 18119256 18026254 17904883 17530792 17334839 16895223 16637773 16389242 15888254 15174295
12035 15174295 15059189 14975113 14677852 14349262 14405337 14832154 15448525 15563065 16249594 16672249
12025 16672249 17080636 17258661 17302125 16724862 16727606 16029528 15236202 14385382 14127079 13847072
12015 13847072 13322344 13471699 13065508 13104122 12953084 12555435 12159503 11911535 11472247
12006 11472247 11075918 10828091 11071976 11260172 11644466 11880433 12271078 12678328 12509216
11997 12509216 12733850 12296946 11961517 11401525 11167965 10681724 10240529 9986936 9767556
11988 9767556 9626360 9734895 10062010 9946280 9576790 9713520 9307717 8823755 8261284
11979 8261284 7934285 7868184 7670240 7583149 7538019 7667312 7472074 7400982 7138190 7023531
11969 7023531 6678693 6587069 6354897 6150910 5994306 5862082 5808522 5673826 5565676 5719089
11959 5719089 5664002 5612635 5887160 6072616 6559172 6465462 6841101 6837032 6955595 6943798
11949 6943798 6659348 6611028 6730741 6615487 6702289 6796113 7114733 7082824 7449442 7867828
11939 7867828 7831448 8035950 8003300 7893317 8136605 8125723 8381302 8320420 8192064 8364359
11929 8364359 8107722 8282233 8544622 8460224 8189732 8093320 7743078 7577277 7344908 6851853
11919 6851853 6836307 6646544 6453734 6643324 6334855 6280223 6140360 5984749 6180742 6230034
11909 6230034 6534230 8091914 10376959 13227510 14673161 15525955 16386727 16394392 16074045
11900 16074045 15258685 12809008 8817081 6502729 5939986 5498569 5324864 5366911 5237950
11891 5237950 5396915 5374743 5644058 5683110 6323044 6796945 7532250 8233040 9323034 10027800
11881 10027800 10728722 11059350 11392369 11494046 10991239 10598246 9877956 8922248 8366734
11872 8366734 7604114 7022152 6687302 6379578 5656817 5519527 5285626 5126861 5042425 4834853
11862 4834853 4769132 4540700 4709763 4554799 4449307 4774389 4651840 4482746 4718246 4643654
11852 4643654 4629702 4526884 4972847 5096716 5264550 5474309 5706486 6027071 6360378 6695137
11842 6695137 7180156 7956132 8566828 9108040 9593113 9623021 9633734 9690804 9215272 8488762
11832 8488762 7967795 7776768 7794302 8005612 8217063 8179783 8196171 7928282 7667962 7149883
11822 7149883 6444110 5831615 5093702 4675874 4636470 4424730 4305716 4235662 4002003 4052479
11812 4052479 4086670 4149000 3751796 3964385 3921018 3754356 3564854 3794516 3816393 3455912
11802 3455912 3622057 3814607 3611456 3701689 3770340 3768698 3900321 4023613 3753720 4051714
11792 4051714 4256113 4390813 4573838 4900060 5364935 5984826 6351536 6965907 7107672
11783 7107672 7315384 7253691 7057849 6544001 5601996 5101238 4743278 4155238 3941478 3780643
11773 3780643 3671434 3284960 3185683 3174357 3294995 3190391 3180583 3219998 3130798 3245158
11763 3245158 3085970 2898727 3317813 3270203 3040361 3175511 3068518 2968706 3012531 2844339
11753 2844339 2837826 2981204 3062604 2965808 2854219 2858581 3023750 2894391 3207485 3119119 2928433
11742 2928433 2871854 3029838 3112549 3020880 2528997 2562412 2758293 2704092 2929691 2897769
11732 2897769 2623918 2639987 2643239 2758820 2598552 2670582 2659401 2511329 2478694 2743916
11722 2743916 2829655 2562306 2749189 2591227 2522060 2818846 2724797 2665735 2667484 2796934
11712 2796934 2720851 2563183 2463998 2633425 2595678 2468124 2599621 2782244 2729589 2791263
11702 2791263 2695437 2750790 2726867 2570754 2696035 2679463 2603707 2858174 2823537 2829707 2899991
11691 2899991 2797848 2805079 2914278 2894622 3090453 2972405 2754046 2906634 3080373 2995960
11681 2995960 3108533 3171030 3084413 3142438 3383625 3272603 3490259 3153141 3456914 3341140
11671 3341140 3386381 3281732 3488575 3443010 3409662 3531044 3339482 3470906 3338979 3727493
11661 3727493 3448875 3236974 3507974 3387407 3271482 3431238 3360602 3324510 3322064 3210886
11651 3210886 3212181 3063504 3240749 3338261 3355312 3270964 3162125 3343017 3098276 3111911
11641 3111911 3085667 3217089 3037468 2985409 3113091 3106451 2867588 2978130 3244381 3136969
11631 3136969 2915621 2970231 3064440 3194798 3115387 3031156 3037068 3008991 2743236 2962082 2890245
11620 2890245 2922510 2686014 2834189 2899660 2862822 2871964 3025085 2902589 3053404 2794705
11610 2794705 2972432 2910865 3073078 3002972 3227045 3138525 3106833 3109853 3067894 2886384 2960458
11599 2960458 3176377 3095613 3234855 3171045 3374073 3321495 3366614 3253591 3179655 3086508
11589 3086508 3190513 3154316 3101103 2914215 3121310 2950496 3222953 3269039 3303087 3383261
11579 3383261 3192593 3505890 3498000 3372637 3370520 3532840 3473533 3322859 3448423 3304242
11569 3304242 3632988 3379564 3601415 3566735 3591668 3663252 3443810 3677547 3332164 3519829
11559 3519829 3713730 3422525 3819288 3457405 3664430 3731626 3656545 3857316 4027880 3933750
11549 3933750 3960744 3666697 3677930 3670784 3845219 3607162 3411236 3707057 3456846 3528189
11539 3528189 3534675 3663346 3381287 3369444 3415045 3320406 3363738 3479556 3395136 3271816 3166949
11528 3166949 3456890 3263421 3256655 3270131 3368245 3295862 3543700 3324829 3529423 3346717
11518 3346717 3659670 3726185 3370608 3656719 3542745 3430844 3639045 3658527 3631439 3489697
11508 3489697 3885354 4060631 3704010 3805859 3997606 3633800 4103965 4069321 4006902 3788867
11498 3788867 3738230 3664078 3499064 3511997 3730879 3815039 3459507 3631129 3762969 3748411
11488 3748411 3733332 3731608 3726173 3716361 3929129 3883541 3867673 3818322 3959947 3719334 3749098
11477 3749098 3861973 3797691 3869565 3941819 3834956 3988315 3944830 3841960 3883483 3974618
11467 3974618 3585129 3823233 3588333 3764221 3567587 3826185 3900451 3567315 3519711 3905113
11457 3905113 3735079 3733970 3613893 3576024 3770831 3502022 3506602 3680312 3933221 3740335
11447 3740335 3640982 3758804 3740703 3995015 4009413 3984556 3899368 3931836 3968881 4135850 4067531
11436 4067531 4310125 4284536 4177077 4369928 4506684 4519284 4614791 4584604 4762838 4597775
11426 4597775 4753765 4639236 4974513 4781223 4557169 4695417 4564309 4341689 4939258
11417 4939258 4859069 4668053 4913047 4631748 4817939 4769019 4910496 4630239 4587761 4843114
11407 4843114 4943143 4817138 5056619 5053728 4827552 4846585 4889102 5184069 5109568 5281792
11397 5281792 5117365 5215913 5280222 5466474 5259595 5732156 5368382 5719642 5520762 5735572
11387 5735572 6004950 5905259 5919258 6329435 6226170 6333246 6299479 6478797 6413867 6661294
11377 6661294 6508795 6607145 6377116 6682977 6442871 6443768 6784113 6833936 6738210 6740720 6902114
11366 6902114 6530366 6800671 6655116 6944560 6900079 6790251 6833654 6732069 6895413 6747427
11356 6747427 6937636 7098653 6832828 6985937 7193663 6964920 7008010 7015495 6801934 6874225
11346 6874225 7100806 7001171 7057013 6928546 6998561 6810785 6803795 6955356 6662795 6872365
11336 6872365 6783783 6713214 6750638 6804661 6737791 6684740 6748584 6452018 6254350 6062801 6420014
11325 6420014 6121810 6282196 6003470 6158778 6032376 6208370 5661460 5585785 5602425 5678223
11315 5678223 5396970 5269571 5119784 5200654 5167227 5180478 5108621 4893317 4738136 4596934
11305 4596934 4495603 4426133 4417738 4382706 4437381 4244278 4364891 4394457 4237939 4124562
11295 4124562 3998532 3946453 3774432 3731188 3589219 3509923 3921717 3677616 3676612 3490122
11285 3490122 3497023 3540514 3352365 3239095 3520032 3328385 3403840 3187695 3114794 3165755
11275 3165755 3228834 3205989 2829358 2978698 3424623 2981509 2865041 3076754 3136018 2834780
11265 2834780 2660904 3169547 2734844 2790036 2867538 2850001 2772341 2762380 2907797 2768763
11255 2768763 2775694 2722685 2694859 2628489 2648658 2878897 2545715 2628023 2872348 2894670 2505226
11244 2505226 2545743 2688101 2824117 2723308 2439699 2867453 2722853 2767150 2707818 2764131
11234 2764131 2666704 2866170 2800394 2720564 2799512 2791232 2795320 2830483 2975626 3133020 3167647
11223 3167647 3848767 4541537 5274519 5958534 6193095 6647392 6595013 6505003 6387766 5807488
11213 5807488 4686679 3732507 3307669 3094278 3077357 2891914 2750414 2853251 2919853 2698573
11203 2698573 2522600 2677792 2650646 2753989 2570636 2854121 2863715 3091356 3257943 3886061
11193 3886061 4626913 5651701 6005921 6444484 6413549 6782672 6799612 6253584 5550537 4574333
11183 4574333 4196264 3496436 3141466 3039332 3056426 3170294 2802482 3114254 2952217 3409987
11173 3409987 3167891 2926204 3056572 3176723 3009007 3214604 3220883 3184891 3070302 3359480
11163 3359480 3154388 3186584 3563892 3247923 3379572 3363770 3163734 3333660 3308246 3342807
11153 3342807 3224471 3366777 3438798 3321706 3286056 3352061 3145143 3170481 3123041 3250274
11143 3250274 3299103 3499869 3408179 3313927 3618078 3182912 3513116 3431578 3615043 3747661
11133 3747661 3521439 3521951 3528727 3765379 3637685 3647360 3632838 3832966 4038586 3867739 3732086
11122 3732086 3976351 4099537 3898550 3948779 3869539 3925389 3998228 4026294 4050449 4023966 3908887
11111 3908887 4000400 3968626 4000903 4261845 3900145 3948099 3854795 4114460 4113477 3795040 3944806
11100 3944806 3794174 3964389 3869819 3939661 3771345 3805245 3758886 3899791 3560089 3592685
11090 3592685 3575293 3900002 3517848 3568164 3413994 3152860 3272346 3502694 3392012 3385143
11080 3385143 3537579 3373600 3422606 3410769 3639683 3652805 3661268 3603337 3681270 3629266 3651365
11069 3651365 3982827 3737661 3769459 3699202 3744555 3904388 3558119 3718407 3834345 4009386
11059 4009386 4049610 4089967 4098651 3957213 4098755 4076203 4060285 4201108 4122644 4022606 4074965
11048 4074965 4242978 4248489 4216466 4026382 4053518 4176622 4086621 4110121 4129895 4231061 4349039
11037 4349039 4376303 4376163 4241541 4299193 4429874 4429691 4591307 4627375 4966944 4997097 5111162
11026 5111162 5049059 5139395 5316594 5401803 5665416 5617338 5730537 5764824 5898856 5928874
11016 5928874 6127284 6302536 6343110 6466222 6099367 6114605 6340925 6411247 6326587 6658740
11006 6658740 6650935 6749721 6909572 7038748 7120290 6975290 7293831 7531160 7390426 7843747
10996 7843747 7914876 8044537 8251570 8306853 8449140 8542433 8945848 8950981 8949432 8855096 9020934
10985 9020934 9298578 9066624 9214956 9480621 9651381 9846942 10288502 10457397 11100122
10976 11100122 11074817 11181834 11568425 11530656 11511027 11304483 11327867 11565961 11614303 12205473
10966 12205473 12391772 12733681 12885007 13362813 13416316 13777772 13966137 14258889 14554022
10957 14554022 14560425 15046392 15078019 15492283 16024939 16236698 16504888 16900992 17302841 17467213
10947 17467213 17800225 18103479 18035054 18287359 18286579 18865400 18735857 19084900 19318313 19671525
10937 19671525 19955445 20344917 20249020 20729499 20875590 21305076 21625976 21928049 22241366
10928 22241366 22544612 22953453 23076852 23702414 24120829 24563501 25140897 25386867 25934297
10919 25934297 26314248 26706601 26782026 27014047 26936775 26913263 26894049 26999958 26942573 26994934
10909 26994934 26955611 26990867 26691074 26884502 26838057 26821678 26947828 26957126 26944975 27197125
10899 27197125 27189476 27157053 27283546 27492267 27535856 27974243 28032498 28281744 28487644 28548005
10889 28548005 29264809 29489265 29956798 30688611 31161754 32024236 32642740 33477341 34657589
10880 34657589 35800448 37145055 38493406 40061049 41813505 43729767 45728067 47945967
10872 47945967 50359161 52527012 54366007 56459003 57850789 59381335 60388317 60737122
10864 60737122 60808985 60392595 59263307 58047482 56519248 54830376 52734652 50714650
10856 50714650 48385368 45974728 43936444 41435296 39469946 37430891 35263537 33312467
10848 33312467 31548650 29892850 28070745 26414567 24928511 23583242 22254552 21038797
10840 21038797 20017196 18821037 17835658 16954398 16149935 15161889 14581746 14036813 13368986
10831 13368986 12595189 12217710 11788009 11205088 10736975 10181226 10006831 9526809 9097175
10822 9097175 8792626 8444940 8339993 8139958 7798993 7736315 7394382 7265415 7307547 7221950
10812 7221950 7293121 7152705 7316700 7011436 7148700 7060643 7066564 6584683 6173227 6208272
10802 6208272 5759262 5617370 5466537 5204408 4775610 4925994 4724756 4505569 4572521 4746233
10792 4746233 4202629 4212535 4437027 4236296 4146596 3909062 3968657 3972864 3964939 3826490 3750123
10781 3750123 3868718 3675426 3676930 3570883 3652261 3594481 3428830 3383884 3398668 3691150
10771 3691150 3397882 3345691 3166447 3368690 3144160 3026874 3173257 3131709 3064535 3108188
10761 3108188 2916036 2994064 2951994 2899885 3209316 3094668 3013020 2735872 3060940 3068339
10751 3068339 3189173 3084453 3061812 3265039 3225712 3025778 2972336 3033431 2921229 2665454
10741 2665454 2581993 2627701 2373356 2550518 2532940 2728221 2454430 2404990 2515351 2668616
10731 2668616 2885332 2783980 2834557 2840935 2789969 2979361 2617426 2930651 2852719 3143194
10721 3143194 2834296 2692507 2774671 2984281 3052043 2878428 2892267 3076846 2953396 2962532
10711 2962532 2995015 3172576 3219904 3201700 3236000 3343116 3142089 3166630 3269621 3292118
10701 3292118 3220832 3171441 3045649 3214759 3001332 2978209 2670022 2819230 2868272 2864166
10691 2864166 2851027 2690237 2903708 2829736 2914783 2797700 3130394 2798295 2893144 2674091
10681 2674091 2701927 2891546 2554388 2862682 2726851 2822231 2834128 2936596 3068901 3094751
10671 3094751 3174597 2905871 2679544 2903943 2771251 2923979 2456261 2606448 2613897 2567076
10661 2567076 2604620 2476209 2303166 2309649 2383787 2228554 2168310 2043020 2129809 2230658
10651 2230658 2448974 2421436 2330914 2405550 2365792 2359642 2128744 2120280 2035258 1776786 2161746
10640 2161746 1906743 1736365 1683861 1726499 1804655 1778420 1717709 2092375 1794113 1841009
10630 1841009 1756508 1645285 1697168 1751055 1545115 1607896 1655731 1638967 1807653 1630479
10620 1630479 1600003 1712724 1772562 1568545 1732218 1269685 1678617 1513192 1778485 1594706
10610 1594706 1508993 1567884 1630816 1604375 1573664 1729114 1556967 1630881 1731565 1573181
10600 1573181 1465842 1751876 1704026 1665857 1675588 1756791 1638535 1573374 1867510 1768048 1635970
10589 1635970 1703539 1702607 1700281 1895754 1570025 1724813 1705225 1913250 1934489 1913327 1973221
10578 1973221 1912247 1998241 1820898 1905846 1840304 1863850 1947905 1718674 1784323 1677900 1786073
10567 1786073 1703046 1581557 1370235 1756311 1387207 1790738 1312225 1535924 1508856 1552902
10557 1552902 1347252 1539279 1563930 1711239 1460851 1542050 1427891 1467831 1517229 1566716
10547 1566716 1401456 1271435 1406068 1268206 1586729 1427871 1326033 1378554 1402391 1582475
10537 1582475 1302830 1368398 1550029 1570312 1555469 1605215 1259518 1612553 1565974 1550790
10527 1550790 1506982 1574677 1531337 1501122 1688946 1697622 1794961 1746535 2040431 1995268 2235047
10516 2235047 2322436 2334702 2533360 2584556 2415356 2411029 2107477 1874868 1583653 1423836
10506 1423836 1617859 1617314 1832514 1840745 1830330 1605764 1845675 1584823 1738682 1882472
10496 1882472 1718058 1957854 1853171 1909790 2058833 2173032 1984907 2308281 2483165 2346961
10486 2346961 2465497 2622650 2327769 2376463 2317563 2072196 1962017 2036919 1982855 1823726
10476 1823726 2105276 1961989 1884634 1908318 2018817 2024267 1786898 2113229 2049106 1981231
10466 1981231 2180461 2160816 2278144 2551911 2566775 2684192 2771291 2816575 2475425 2714253
10456 2714253 2403533 2526985 2394246 2582215 2956115 2744041 2821045 2805563 2904852 3142139
10446 3142139 3074900 3076148 2969900 3096630 2823493 2737780 2735518 2684088 2906343 3046732 3229802
10435 3229802 3301848 3431073 3451824 3432388 3469571 3231781 2710379 2402856 2436238 2151194
10425 2151194 2284839 2041168 2040598 2123885 2212630 2103003 2118417 2368295 2300896 2108952 1916845
10414 1916845 2203423 2389199 2100726 2419332 2453154 2597851 3089923 3245904 3243818 3388321
10404 3388321 3512193 3688054 3531764 3379079 3433044 3208665 3506583 3296451 3821287 4083312
10394 4083312 4331179 4705842 5095855 5797874 5974651 6749435 7040408 7517645 7452835 8079804
10384 8079804 8099405 8185675 8015864 7231305 6962860 6382018 6264485 5826643 5405262 5382427
10374 5382427 5129376 5147141 4917562 5065124 5048843 4883301 5124081 5203690 5380389 5096616
10364 5096616 5475912 5397945 5156461 5287912 5094349 4970730 4672842 4560562 4815042 4404211
10354 4404211 4715020 4534658 4419698 4521792 4348672 4203182 4275231 3904972 4167954 4086067
10344 4086067 4076526 3791022 3888706 3816645 3690557 3735203 4127606 4002890 4308653 4420711
10334 4420711 4427684 4302009 4182419 4273890 4365107 4210622 4063804 4379706 4031433 3991890
10324 3991890 4062090 3984576 4016351 4250787 4095055 4198556 4053017 4281495 4273896 4196385
10314 4196385 4006252 4183919 4110061 4242669 4361853 4415813 4576940 4968958 4805876 5094421
10304 5094421 4984215 5137647 5003469 4897425 4646356 4757061 4448774 4476154 4584087 4930988
10294 4930988 4431633 4843931 4843548 5011250 4809207 4925450 5222052 5375788 5630020 5698205
10284 5698205 6034050 6438146 6519732 6837552 7206598 7333454 7797944 7977866 7790248 8329349
10274 8329349 8301349 8610167 8672917 8811205 8966292 9308623 9540390 9620665 9961546 10188528
10264 10188528 10289472 10361436 10666807 10988306 11175664 11358493 11851997 12179542 12271504 12963115
10254 12963115 13312084 13189981 13728233 13640335 13931554 14034100 13756213 13830121 13932351 14401345
10244 14401345 14036076 14382610 14172610 14536670 14725121 14594247 14783970 14477620 14205832
10235 14205832 13854449 13557100 13581587 13201909 12779387 12553572 12403293 12154254 12049381
10226 12049381 11557502 11550254 11443872 11556253 11228344 10916677 10743415 10542740 10251466 10173844
10216 10173844 10178684 9773177 9795640 9607670 9355029 9095702 8947793 8789544 8687853 8331099
10206 8331099 7959122 7783293 7669210 7313757 7103457 6522338 6734010 6324888 5948098
10197 5948098 5889296 5794354 5507193 5438467 5195290 4987872 4998848 4826331 4546651 4530920
10187 4530920 4601091 4759421 4478605 4247738 4548249 4153280 4347870 4400370 4344720 4114121
10177 4114121 4107906 3982674 4202384 3943991 4074024 3836685 3919141 3724215 3816329 3734487
10167 3734487 3505637 3518947 3660308 3503582 3542517 3370490 3409648 3379962 3230539 3265941
10157 3265941 3341553 3302157 3159921 2972261 3170983 3472940 3118505 3023816 3174432 3072936
10147 3072936 3089030 3094514 2854675 3061858 2754286 2808035 2814086 2803861 2958434 2763119 2678567
10136 2678567 2836716 2859085 2924729 2606910 2508579 2872426 2970598 2578406 2697817 2608317
10126 2608317 2733854 2547443 2356975 2629107 2637862 2628015 2786830 2804379 2688493 2837831
10116 2837831 2793039 2605663 2830636 2741258 2468040 2454042 2451603 2754268 2489559 2477050
10106 2477050 2554898 2529067 2532739 2409838 2488746 2567599 2254857 2353226 2554379 2609379 2543923
10095 2543923 2421663 2696740 2281213 2304399 2518152 2332088 2538931 2306187 2574510 2415128
10085 2415128 2392073 2465857 2613185 2549248 2440189 2809909 2618281 2784626 2672411 2402051
10075 2402051 2497180 2662882 2771269 2840216 3015428 2958408 2980670 2963179 2972856 2873468 2911289
10064 2911289 2754186 2845393 2906761 2494407 2622297 2714427 2727633 2585372 2787177 2719905
10054 2719905 2611832 2631325 2897445 2573413 2542963 2747986 2624178 2693086 2603590 2637260
10044 2637260 2692470 2519291 2630428 2629513 2542001 2709597 2488169 2461986 2511763 2492897 2453074
10033 2453074 2476733 2406175 2443893 2456271 2354616 2525239 2446447 2279027 2399206 2516249
10023 2516249 2180998 2160663 2370667 1974826 2303075 2171867 2243067 2150525 2082296 2285434
10013 2285434 1945956 2003266 2141547 2127954 2042805 1929475 2275693 2076235 1831633 1791011
10003 1791011 2075659 1742722 2107707 1974440 1911399 1977925 1888381 1954460 1937008 1681483
9993 1681483 1792469 1937818 1540101 1710470 1764187 1682663 1620752 1707063 1561784 1938876
9983 1938876 1841891 1614771 1753106 1523664 1436202 1584772 1488946 1380410 1198617 1549134
9973 1549134 1338438 1577919 1285003 1367238 1303985 1426704 1180738 1360977 1374994 1341633
9963 1341633 1252120 1367857 1214190 1151990 1313230 1260809 1280549 1378983 1236927 1035561
9953 1035561 999613 1030684 1068687 1265995 1055747 1091340 949606 1203954 1218237 946716
9943 946716 1149673 1251834 857854 947533 1307317 1100002 1141581 1063810 1129996 1183371 976630
9932 976630 1320452 1205825 1348476 831079 836298 1044128 1047501 1176819 951280 952578 1062786
9921 1062786 928038 979365 998757 694385 975398 1086902 972298 1188425 874325 1076230
9911 1076230 1045173 1078040 1110835 1158031 939660 1093156 1066876 1239668 879732 1029928
9901 1029928 981801 934471 734060 759910 1039446 922770 934250 1074193 746606 809783
9891 809783 902969 1229003 990126 1034642 986677 926763 694658 954879 740649 836363 675124
9880 675124 919320 840968 866807 872496 1128651 948412 1048442 799384 853949 789344 871636
9869 871636 799219 1053054 1007021 782621 832169 1051923 767230 747254 933207 870501 944039
9858 944039 822000 863741 875853 699213 843119 768463 1013498 812745 1046962 1175064
9848 1175064 759232 883003 897098 1112814 1004273 829751 856931 795454 934209 884721
9838 884721 890108 880244 914006 719751 863765 951734 993421 759108 816952 837981 1117321
9827 1117321 835141 877238 745567 725058 1014538 764513 580124 816778 719468 779236
9817 779236 872231 606719 1060870 933491 779429 1149894 930928 961020 920398 731709
9807 731709 773131 778509 866377 609325 973383 674493 715166 851038 921087 879392 1120646
9796 1120646 746575 793028 883836 665598 712155 850594 1065115 648015 811831 828674
9786 828674 887850 686313 658070 632522 707034 676991 676800 779537 864426 642463 774714
9775 774714 816308 789686 598043 595644 783689 788858 577891 669085 621040 487099 627938
9764 627938 622984 582884 637413 708523 817573 698775 692980 719501 521365 580784 658319
9753 658319 498031 628037 798170 518960 620946 663710 405113 615198 574592 737295
9743 737295 727967 577366 400279 552727 452965 575159 388082 596630 536448 645318
9733 645318 615772 521394 418416 495195 582088 649320 374409 397668 436341 494714 544689
9722 544689 555525 532083 504881 503507 695362 456387 482083 419714 667036 382105 669256
9711 669256 402087 392728 434611 612792 465171 372706 239033 442936 186305 517450
9701 517450 303760 533904 511821 360702 262158 673181 398431 390260 493062 411851 457946
9690 457946 414131 409609 464602 264069 462905 558749 568242 233416 354064 516451 275251
9679 275251 311684 395802 461574 382122 495969 357886 305654 442836 356355 319194 203513
9668 203513 412082 271165 332577 406201 351143 385578 377181 462376 237961 105736 384680
9657 384680 420439 343653 530650 232914 289006 298274 396281 448466 231054 374193 375406
9646 375406 519410 376048 425363 535813 358350 459549 264801 292779 170370 510164
9636 510164 358401 303704 415561 471284 398947 584854 333090 478589 466108 255122
9626 255122 576221 333298 390121 437152 396991 388054 122883 366655 561079 490809 582731
9615 582731 401465 410127 205590 234524 533920 374998 464002 289579 217135 424961 459163
9604 459163 361743 204274 195664 564267 467085 399942 366290 425234 407345 480015 116361
9592 506844 483326 555295 304556 428334 163636 399985 318042 531204 520522 395556
9582 395556 428514 541324 125047 456256 647558 274309 454145 588243 163617 373652
9572 373652 404401 388347 410728 352664 332529 193976 345274 326507 262843 384724 319313
9561 319313 264339 259164 361833 199230 444592 402691 369359 163097 392267 443865 406849
9550 406849 417321 291399 365753 423580 518379 512651 364431 415156 135689 226245 207936
9539 207936 153503 352082 405327 472670 383304 292772 147655 288230 309633 446705 386487
9528 386487 340600 497231 439154 161545 371370 248667 150342 424160 179931 348075
9518 348075 253278 276394 216164 339026 275283 101531 386461 349478 238962 161424 448119
9507 448119 300015 133384 138961 479209 145237 403497 188605 218620 247566 292958 240854
9496 240854 145948 166936 471937 324394 178570 465813 335584 366544 172358 314038
9486 314038 184108 302259 279395 383907 118537 401200 193394 204567 187710 176648
9476 176648 448299 288151 214143 182261 336686 140683 435729 419160 321945 289033 269744
9465 269744 232428 316616 112542 356937 325800 316667 125566 233119 -59152 226843 315002
9454 315002 212573 116278 195031 288849 239042 304818 218284 337616 253653 324718 312015
9443 312015 191430 151866 26051 209009 329554 335660 201895 240913 129348 155565 300014
9432 300014 289006 123183 53754 314905 344479 155019 252929 180508 266142 199026 250463
9421 250463 225280 234819 378199 337955 240252 226384 245159 350463 121998 167968 348264
9410 348264 176266 238613 231503 337465 392811 487254 345033 246244 291482 228791 310974
9399 310974 449840 436580 183374 510962 265282 405530 357747 302770 133063 230177
9389 230177 243758 180411 73527 200383 204278 324445 73617 128858 324800 413359 235586
9378 235586 169650 156064 322802 523470 251915 195454 74174 79307 147778 243015 272050
9367 272050 423633 63287 194876 84437 246268 317229 183311 236171 190844 233708 128704
9356 128704 293402 78539 250575 372171 88451 33854 331517 66822 122770 72418 424320
9345 424320 264234 232171 45044 117496 257202 336872 283936 -152133 198924 180491 202000
9334 202000 210303 -16737 415538 227872 214623 173530 195836 354198 161239 368289 330901
9323 330901 28199 385553 299084 225609 296308 120107 446510 395507 416040 297656 418899
9312 418899 130242 253770 192532 243537 68720 147617 415206 250000 391098 371232 150931
9300 156526 126859 99345 171657 274751 171895 94437 247881 105063 35677 24945 -20643
9288 395290 260631 142885 368217 248670 147883 111765 223519 307174 123726 353428
9278 353428 357037 285171 81516 61063 27610 124787 348212 215134 380319 -31758 186726
9266 188788 50075 288967 43387 111668 99781 210783 333337 -30754 147358 178597 93766
9255 93766 138269 153350 75859 324263 132317 379698 261034 146597 49362 226389 124160
9244 124160 331855 205833 186082 114045 267817 195390 383507 210562 124823 251599
9234 251599 151752 -100293 327521 32597 63733 9701 104603 329767 307145 268813 159277
9223 159277 376109 30290 18118 109960 281347 316156 138947 379838 73698 54741 57243
9212 57243 398997 203876 168799 87387 309491 105847 359964 77818 -23741 104129 -29966
9200 241271 156127 144830 329995 81982 200094 -60783 7338 168373 61693 366686 377584
9189 377584 103899 209136 227256 138312 154314 160016 218951 232902 -11577 101765 113300
9178 113300 63011 178035 58735 73772 129623 83750 180151 290712 439269 109668 28883
9166 144367 279390 -346 393437 34560 319570 212357 181944 211248 316396 375741 339887
9155 339887 249969 212572 310354 119992 147648 37640 348791 -5025 320864 514458 421
9143 132592 2695 290304 194458 294728 181269 288622 105029 98178 241236 326061 170551
9132 170551 49832 123636 311291 124810 181272 309773 306308 293308 287387 224721 427565
9121 427565 166704 78983 205687 199105 -61214 106131 161031 379284 173298 251227 247960
9110 247960 360357 362427 235852 424179 63432 309943 310192 -16332 388119 221767 206771
9099 206771 359902 467563 187610 368262 138574 238700 415990 264477 285743 144712
9089 144712 282123 341882 192737 344881 298392 232225 -31141 141834 537331 193600
9078 163678 270686 321409 179929 227079 322233 114109 289123 337856 368406 330297 312832
9067 312832 150035 269940 211712 106238 219241 335564 131840 270334 261812 80477
9056 412821 380897 299408 219865 338822 279833 320132 351018 215909 312947 266320 106316
9044 258984 317726 381524 278658 123722 65216 299669 268887 76918 68210 156478 257640
9033 257640 303606 151931 181379 232748 241605 231512 186091 370275 126387 154656 99186
9022 99186 228165 167675 239119 189339 100593 252607 200933 126911 250297 252459 29300
9010 320207 270447 55584 135473 94861 -54431 164961 150056 267896 327339 307820 82093
8998 168738 153562 62953 102949 145900 288905 99554 3431 124975 247359 266226 287910
8987 287910 102385 -28127 167166 139023 134393 298528 -68767 15697 104588 173541 67993
8975 -78308 302935 102559 275745 260169 -16915 76336 164616 20364 163949 360602 168102
8963 58564 301942 287882 309192 27234 149276 264002 162048 257830 165027 275793 236019
8952 236019 284566 66747 256865 153562 195192 110007 129408 26219 194196 24472 93750
8941 93750 44276 240121 284411 181560 94388 145854 207361 296492 220330 136378 68358
8930 68358 545 -11530 180325 377744 163425 381139 260518 370265 290825 395516 479507
8919 479507 304215 368600 150963 337341 299461 276309 358437 202362 386528 204218
8909 204218 228942 329386 203908 136963 211186 528614 133361 495011 624899 322818
8899 322818 324747 342341 408008 301956 431068 196466 395017 486597 346454 208450 387507
8888 387507 411161 485758 330925 522337 528330 439032 445299 403310 300140 485889 395407
8877 395407 525333 447036 661843 561781 501567 470261 659012 447048 527110 493630 589139
8866 589139 378870 398918 492727 613801 349384 389762 511824 558796 438593 312969
8856 312969 317282 400772 253137 545564 356491 204424 190601 344721 222306 254279 551119
8845 551119 297437 408448 270193 8270 212734 268864 435046 -2564 389143 148234 183317
8834 183317 182161 249919 185197 122818 325429 453589 311173 431167 400697 248980 398373
8823 398373 268475 219350 287020 84567 137081 82684 204726 49777 60504 129652 338445
8812 338445 209023 178331 1015 152124 18543 383360 114814 191915 247043 78462 234044
8801 234044 287200 -31034 304783 104714 118656 46630 183505 201678 -17969 15815 161665
8790 161665 -19246 271848 310599 285263 161815 200225 247135 161227 55993 166065 112961
8779 112961 331386 383508 261813 125957 49607 154358 210756 232594 157595 49112 92631
8768 92631 93131 147408 96853 -20279 -206781 209844 191379 122679 109766 90645 145273 154946
8756 154946 116838 244739 -24001 209771 44110 274407 173872 317410 199660 304673
8746 304673 74666 378611 183504 282202 101204 176802 178306 19630 136531 74176 344399
8735 344399 125930 133758 200845 465806 207136 92688 109994 310228 106389 332061 75962
8723 228606 277265 232756 -16520 213192 157817 124669 227803 305506 244226 -92106 272863
8711 172349 79690 163765 288691 42209 -40966 198420 -36181 157764 -14785 242094 -98978
8699 102749 101641 57789 182146 92851 185534 -80265 105448 43150 126582 197879 194948 156795
8687 156795 244927 -19911 55155 291985 92568 82470 -17674 359171 -27096 323015 84671
8675 27978 129822 142756 109521 -14986 -69134 143389 237539 158575 121020 243271 256872
8664 256872 145227 -522 103509 146594 246262 -49238 193032 -156086 59139 76481 199993
8653 199993 -4657 110796 143444 186764 246337 -24720 144812 300938 356321 7311 342325
8642 342325 94823 -17606 45066 95204 -126022 277497 368673 137649 -139454 148562 287199
8631 287199 119482 191239 255967 110962 71805 53669 377474 312633 106753 253684 209813
8620 209813 361728 283892 -59107 117128 173276 220027 20718 188019 64746 139076 113945
8609 113945 48449 245670 232211 287254 18044 135858 -37917 -135628 101014 189435 33013
8597 90381 124932 154799 -23242 46812 14470 195891 161092 228894 146528 128328 97006 108564
8585 108564 46051 116803 136844 -36170 261904 210803 378890 126571 157992 174656 305534
8574 305534 251907 -55867 42489 146200 121432 211915 76785 131883 -169178 206782 -10928
8562 240827 167445 133518 315846 293202 49256 123165 -52709 96808 257889 328849 264557
8551 264557 -11678 218554 318407 84491 223077 77554 85611 135955 265841 209989 385805
8540 385805 50323 308198 232053 217341 75750 160201 59607 10706 32252 206298 330026
8529 330026 169714 131823 16486 126840 242098 187230 -131778 -95452 92074 139652 43354
8517 225981 205814 -65886 206347 83339 152469 107405 80292 46436 -6621 259973 119371
8505 282859 260020 -61003 -5532 65610 260585 13992 98840 105380 334550 -42765 179129
8493 -40130 -92947 106067 20107 343700 230438 301954 232835 165221 47634 147066 242685
8482 242685 -20999 236430 261491 159070 -50082 168109 177139 351025 145249 139325 175212
8471 175212 220534 121578 -2458 204784 182720 229548 47637 96087 -26824 -81196 -96912 79735
8458 198862 91807 69576 -184397 87864 184303 95626 178244 20602 -64170 149963 194837
8447 194837 66202 67240 -6117 90248 145746 101265 -10816 143800 332272 136052 233749
8436 233749 194953 -31871 271476 3902 30823 292573 -21888 104826 161821 77924 -3001
8424 50549 297380 92380 196066 153059 146425 90581 202460 -133321 -172536 145413 -30355
8412 83515 70907 27623 109707 178339 102081 136826 191147 52297 270000 207613 235055 189791
8400 189791 183224 191200 -84958 142503 376184 268638 -125279 27802 158975 109509 83914
8389 83914 -20581 75470 120081 83230 261595 270046 184727 302012 396811 110689 45800
8377 99843 -16832 41227 97559 154788 -98901 -44474 63869 45300 42373 -1952 112542 -4208
8364 -28170 185763 83470 319130 -110278 271274 235954 112496 239857 108234 12173
8353 -5233 195879 193955 74317 249598 155962 80891 -128065 23845 116725 154112 -139339
8341 24346 -8687 54865 15423 119988 90820 157771 -3378 80680 232539 358226 332646 190437
8329 190437 169052 80726 4616 117770 180394 283050 -26406 -4936 155340 8727 256437
8318 256437 -12311 169524 105798 454 311520 -1824 98167 129200 88253 -45239 118266 282278
8306 282278 -27000 1201 152410 150939 203331 151938 134608 39037 181949 270308 261487 -7043
8293 49720 81652 157944 28558 103659 160283 165450 272899 116553 98680 16160 26505 116348
8281 116348 8842 -40406 120907 -30373 -10784 105241 179689 -97043 -67740 84647 166332
8270 166332 209326 323823 -136977 136485 141848 36335 -72036 98267 187109 74800 132088
8259 132088 -136658 33469 -90511 40066 -165578 102091 43427 115019 98012 31617 65714
8248 65714 216505 148487 -102373 -42573 66252 57326 110478 90012 -15833 179902 224701
8237 224701 59837 -84101 -46628 268109 103122 186035 155698 206986 -82261 131126 42017
8225 85595 157119 116043 271388 -1373 30181 51623 227996 184329 31871 231353 141392
8214 141392 35184 153112 12934 252552 165980 90541 5594 90055 20874 113317 280120
8203 280120 132926 -26342 74004 121718 158116 68403 221537 162629 44981 127383 137420
8192 137420 5656 224238 101395 45083 17208 -67607 177088 115050 210492 135872 -100035
8180 224824 172490 47484 10703 234170 -32479 285696 -116584 93247 10821 275677 109695
8168 160842 225257 -79150 -88404 56934 89096 31016 217399 34283 209190 -111402 217256
8156 129477 80689 95059 181226 94058 377782 81658 64635 413715 185892 108194 -43928
8144 39183 1651 44989 235663 94300 185692 183325 -103392 209337 104234 77464 265140
8133 265140 217973 285947 90061 -31116 -37526 -103271 118973 45730 223381 38685 151823
8122 151823 60119 157021 47953 -592 -161395 -143624 231956 204887 106593 147869 48287 59681
8110 59681 87460 74546 270140 170193 175457 55043 -149541 123894 -126643 -129734 208636
8098 245943 124481 223938 149333 34067 -102517 165608 15517 -165258 101636 -68175 327655
8086 -95099 -135807 25520 -52451 -101290 -5196 435227 36588 -105125 269959 -41292 83583
8074 -142779 172123 139839 5657 58617 311095 73090 134884 -42803 129008 162943 119729
8063 119729 135841 169122 117200 154138 37595 71278 126797 -147637 49603 -12676 -97803
8052 -97803 219997 144816 -45496 14161 135544 -79268 187772 -4915 -4262 -38509 198373 -136982
8039 -106361 107023 162212 62528 27183 33 -76662 167204 -142079 130726 152398 60295
8027 19922 169349 64344 -190022 216213 78031 100682 230234 -74354 306994 136372 52420
8015 118674 108905 169956 87225 248849 10101 39032 219527 148090 168172 308719 -337076
8003 -58681 294866 -69084 202466 96923 182938 61913 134162 67445 -44745 182658 82858
7991 49932 238971 140327 135832 100691 63668 137901 116336 129602 196848 171779 50678 -57565
7978 428869 23373 127050 -8253 158241 67828 -68372 119181 142783 21803 169542 180091
7967 180091 141132 -104366 69439 177808 60041 -58267 -31604 77740 136845 50635 218813
7956 218813 73551 -12235 -13381 95954 176993 67941 44123 -89119 -31876 361378 399182 47140
7943 9652 201923 -116099 138733 -155975 64397 81437 213154 4041 180025 186918 127558
7932 127558 94416 160848 114162 247079 67091 53174 -159334 149208 95678 205490 135899
7921 135899 -28656 -145010 15025 92365 199228 11047 195277 43625 -48679 228205 110022
7909 -49820 247907 213380 -92134 23680 221311 323 -113008 184337 234991 61699 56746 165458
7897 165458 206774 -47696 17441 130514 164557 -145484 122673 -18146 402197 67771 48859
7886 48859 82374 122470 267182 52339 -3572 68282 196107 92946 84070 192973 -190396
7874 75760 302984 104768 -67833 -26723 205114 316868 115178 109312 318142 230330 -27628
7862 -49397 -135389 41021 -102472 172407 -7414 -158540 101402 33945 252560 -34995 -104020
7851 -104020 181133 129149 179043 11631 127272 33579 -53580 261445 305210 159882 177060
7840 177060 -136037 -15414 123047 163301 121069 14230 120405 250724 7167 106925 78660
7829 78660 138536 -32286 247509 184116 120578 138325 -71258 90870 51387 119868 174787 -37613
7816 80459 97999 114572 100820 -130602 8552 205803 47133 30610 180697 164144 139046
7805 139046 161668 -18895 53471 33598 150445 -76181 14751 -72357 1818 -12960 -55507 -73719
7793 -73719 -43585 -19542 229939 47090 179117 89370 274345 287112 101408 159083 61562
7781 148004 32816 -98196 20905 69065 105649 -33759 44821 102499 137428 -21813 -33596 115602
7768 -32433 -26694 95401 123631 118063 41425 57509 2264 155189 124859 42190 -39713 9923
7755 53676 303778 167747 -10877 -40008 126845 80093 129409 52143 -30176 246721 -12032
7743 184315 28209 38097 90558 93659 23071 146959 162028 31916 -40580 294059 -5688 -108283
7731 -108283 192802 267437 40003 192385 281096 208411 -39756 -104452 60895 185468 -64063
7719 54401 -142780 8019 226024 34985 84572 173069 21529 77852 63388 126455 -26023 350948
7706 142374 -180918 -26408 125848 4391 -57874 -6339 184346 176809 286848 23299 69868
7695 69868 162889 -17087 9842 95612 64513 61760 140456 146082 122400 88606 7849 188127
7683 188127 38970 25809 69544 -103425 43501 -56731 -65757 293176 38215 145888 76649
7672 76649 -76990 233266 109220 -8536 -234932 190856 -18739 -58480 185120 97761 369150
7661 369150 92609 82868 129348 92624 -10476 187220 204599 20962 121334 170528 -49690
7649 183862 25207 7906 11105 100740 415606 258867 109073 50297 -30366 40992 377581
7638 377581 13614 -61994 -102333 -17168 40982 232826 50482 106177 140018 12712 100181
7627 100181 195075 146413 112921 81272 139239 130618 31905 117896 77925 112692 201276 131452
7615 131452 246710 -51283 146220 175789 235133 -112679 157024 31413 46165 -103752 203906
7603 -100789 204197 -55724 139733 -2374 120731 23724 162815 2215 46327 70146 -45585
7591 330214 188019 118430 334487 286275 79203 -18075 14923 3961 301793 -58987 103024
7579 208100 160855 133234 -124441 221357 64061 74644 58798 123712 210154 22276 116376
7568 116376 -76907 271491 -442248 263398 -49126 -57227 -140901 -9303 71322 203326 33635
7556 94822 37956 316365 142511 -143138 -99754 -6212 -189465 34409 291228 33094 -90057
7544 176558 -59027 106350 -4586 -100508 110245 -88251 367520 -42785 77401 123090 98083
7533 98083 114236 69050 229574 55279 94942 6107 -22341 71321 33679 -53518 -73271 137925
7520 253496 164862 57861 -181368 -100284 -138808 32655 192417 109446 84333 36571 220441
7509 220441 147171 -23291 65463 310855 -176120 93415 15203 -126765 341616 175920 98491
7498 98491 187023 98816 63817 176637 15587 -60323 -152235 135589 -178351 -171396 -55118
7486 -6541 20104 124290 127724 112688 187328 137609 41879 166760 -6699 18796 238786 -195097
7473 -127798 87448 14314 -9469 195094 -123860 -159103 104563 27934 62646 12639 195558
7462 195558 164476 109418 -59809 -17046 80326 -41907 66902 171055 -167602 -89683 150743
7450 262505 235411 50454 -50172 191751 70501 220704 337221 55649 195070 244990 121231
7438 23919 -9508 105827 -52272 116411 122654 -137429 -71521 -27021 410449 -127803 66117
7426 25415 9913 111201 -55933 231531 173610 -86905 25540 3977 207227 188627 78046 48091
7414 48091 53854 75255 70106 222187 -231601 179222 224185 -121170 42445 -17572 -15870 -50517
7402 -50517 -112958 -4995 294986 46683 14054 -39303 91307 16843 225480 143965 123574 -131576
7389 162364 122358 -70136 166565 -154056 91120 -59245 186760 317370 39671 63269 49236
7378 49236 -102661 91702 -188513 164495 103984 51424 5883 258950 -39742 142963 -116513
7366 96611 87641 2319 24600 -136964 16217 209003 64356 78393 147321 154133 -130601 40311
7353 95413 -50285 -54177 219917 4070 100988 189333 317911 203309 13644 28438 288478
7342 288478 147792 119817 6402 -49612 51813 197412 663 -8097 -80487 -47132 105461 93117
7330 93117 -11494 -57614 152484 112725 -152699 156992 -89872 -95446 116245 50345 129238
7319 129238 257452 -83574 26843 -49133 -86451 -11700 161231 227188 126389 139080 -212571
7307 53606 256611 -19925 115661 206564 225564 66302 59175 191209 45479 50717 83078 -51420
7294 185929 -122360 46708 98781 129569 117138 -7162 187032 138845 42529 197214 -105927
7282 108350 133286 27346 187793 99815 82685 -935 85410 297146 98570 -38049 103507
7270 44338 67207 -96626 243754 116416 -35823 36768 -105488 -11980 146161 139202 18924
7258 44415 -112172 -266000 3372 183777 95632 9954 98680 89110 -107679 7946 -121710 -72609
7246 -72609 -60310 -43139 -94155 58746 -12664 -33238 120703 -68669 -23310 -65965 -13794 205961
7233 -102576 363607 -64057 211516 -63011 213707 -4167 308750 128498 -48461 -57005 92849
7221 5925 262339 -72431 -110864 49944 19942 -36556 42858 -5890 56845 205848 179800 46171
7208 142637 -153635 -188578 64128 -27361 -142086 207518 256709 -97763 98815 -7645 -37807
7197 -37807 -1735 -81583 39877 117459 -128894 -25891 39452 -55780 94542 32298 132371 250365
7185 250365 -215606 52212 -110136 158293 58390 136191 176562 160684 28316 4709 -60591
7173 59794 54287 102820 51253 14249 -168867 -85846 59728 100688 227783 188352 49359 -54783
7160 91238 -227497 158014 121883 183873 20136 280249 63552 253426 -115891 -33748 107641
7148 11386 134612 -145909 140416 9945 -88738 184570 217665 57347 207551 146881 93886
7137 93886 -18575 150848 177497 -154645 55748 56260 78853 -118324 109077 137887 78508
7126 78508 36852 87897 36220 -46669 8001 72647 -82424 196406 81538 262936 -120778
7114 93212 221796 172682 31243 49086 -6135 41305 -44193 47179 42409 -81149 28331 -58063
7101 26582 -162608 -75518 -286589 141696 -28156 -114049 -74648 296517 -38530 41454 26208
7090 26208 67931 -38882 61865 -309178 134559 111728 -151175 92381 247499 112119 40729
7078 261 192278 116856 21803 276658 44015 -136628 115788 -19297 -57104 124117 16552
7066 188227 -102766 -606 -136302 343026 -16491 -38072 -93405 -92074 21009 45844 -125522
7054 331181 131204 161565 -55591 49056 98598 -142973 51619 19523 61909 105079 -29657
7042 107148 133986 -63693 253159 56641 108076 -80604 -116579 193655 240874 -133933 -5325
7030 -155077 21705 194170 -124785 -16835 250264 72912 121804 -91088 118910 -40377 57035
7018 142803 -15030 356582 -117569 148673 100110 -58600 71833 154409 32750 24177 -15679
7006 210895 14433 173586 27174 135602 23874 -77754 198617 87362 51747 81520 51039
6995 51039 -36471 65817 -68534 -149930 32753 93031 263364 202724 322792 117818 16021
6983 -115259 138359 219170 122351 40841 320414 -71088 104734 23349 83234 92482 -76925
6971 -18712 187155 -66840 86713 -82867 83162 53501 268828 2920 191082 28641 -7812 -18583
6959 -18583 -56790 66760 16689 28479 22041 195514 299075 115106 139503 -171519 171461
6947 45129 103356 18142 158151 70811 -83689 -340707 99725 -85333 118860 286215 -29347
6935 72027 -46746 43217 11925 55386 -102879 138155 46325 164135 175882 66801 62779
6924 62779 149270 -35386 -19928 162049 -149071 93553 -113678 198611 232284 95372 1685
6912 74576 137352 125103 7249 -134047 274978 10338 122892 -125648 5012 246342 218626
6901 218626 8610 88548 -33818 -77341 57626 98291 -81668 277523 122016 -22991 -16226 27093
6888 191916 183221 71529 68135 -153695 69023 67380 137889 97659 149348 33035 59583 33799
6876 33799 144036 185544 165937 -21586 102986 38048 169925 -11355 59750 -75464 28514
6864 164585 2974 -117816 -239996 203777 -70423 -11035 166437 168402 -47773 -72758 -1603
6852 115028 154594 -133314 -103972 69018 -37767 -61041 -22825 -316307 -1583 -88340 239283
6840 -14261 58668 -30977 -94079 21072 -19758 38453 -90694 166857 109925 39153 58853 101400
6828 101400 100866 27975 -96352 -39354 250849 78365 301733 169427 194710 162405 183598
6817 183598 258118 34598 -85450 -79013 -99494 -170841 193248 -16116 -164016 -52057 -4927 -42232
6805 -42232 4027 135002 130267 52444 134444 148100 -59689 28077 119275 86852 157481 110014
6793 110014 27366 60405 203449 -23037 172485 -10007 -150885 154542 37312 -84364 -95574
6782 -95574 -46751 228451 75466 23814 -17302 233585 -94986 -29342 102834 -44632 -30797
6771 -30797 -90161 223824 32912 97118 88673 196783 -64691 130821 20983 169445 149052
6760 149052 130784 89038 -54823 87414 56790 203631 -84778 5543 24870 75527 128278 314822
6748 314822 93017 4326 65466 260528 38209 27426 -147351 -80682 130275 22629 37418
6737 37418 119315 121352 145498 28670 142507 77728 69785 100572 -95494 48190 85555 -70832
6724 -135343 349607 218501 300177 -39552 -16310 149159 -50929 122860 178920 1983 187693
6713 187693 48020 -38151 80453 115041 -7954 90745 -115723 -139680 -50174 105683 -149528
6701 95813 307325 138036 94270 -31147 154868 -24062 -69885 102164 -22103 -74273 -116098
6690 -116098 -263094 189495 199942 10331 -4264 -215914 17652 36973 79818 208441 118246
6679 118246 -54629 161620 106502 130315 31131 -73523 186911 6420 20949 -111535 38238
6667 38003 -151853 62523 -201358 -23572 -48932 -133563 106258 -219280 -140401 -107225 -7266
6655 43451 74879 -92589 327651 -70626 -155397 -28637 154255 35846 -28097 319623 196690
6644 196690 116702 143174 -1209 -73498 19843 169125 -58678 269088 162510 -108349 301906
6632 -22070 -50192 61648 64871 118485 -140406 -57687 221589 84679 178063 -60094 249133
6620 -161461 70529 -32329 6551 -118255 -111382 18726 -7474 202542 85636 -141437 -56398 183813
6607 107993 -53311 -56837 30438 114390 115802 6635 -17366 40920 -44603 120165 52328 211219
6595 211219 252701 128459 -113768 32552 164043 175824 154584 -109056 -143968 -91194 123190
6583 130101 339198 -91196 182224 116497 -156912 151432 66023 -290962 72089 109902 142833
6572 142833 222509 -22040 157049 232663 95671 102278 -8452 44232 23173 -60922 -77456 168433
6559 -87145 59671 -11028 52686 923 35735 -74141 175226 -169493 -42932 178931 9144 -45917
6546 80180 -186188 155278 44385 110502 93598 21722 142918 249936 58374 15537 20351
6535 20351 148733 17645 -181599 131784 72503 -71476 204100 -29223 -30776 41297 -160007
6523 14650 -142766 27565 -46397 148115 185772 -3391 -14910 60208 -53007 -417 328865 -2107
6510 79475 54567 -23371 33090 144318 72382 182975 89000 129957 37673 50729 -105019
6498 78233 -7808 -56463 -36592 -42255 90573 231878 240350 113090 -89882 -169333 130592 157953
6486 157953 349038 -116095 -29034 167933 -21325 139537 44189 127667 110582 -127303 -212708
6475 -212708 20068 205721 54420 219594 96734 44351 219512 -31606 -32132 -64229 108599
6463 292350 -81416 167559 228901 61339 -86297 31341 -133939 40865 225006 -84305 54540
6451 86818 -98785 42026 231889 -66354 51432 -33365 -51679 182130 -13720 -30012 197105
6439 36514 109826 113693 153764 101530 -36449 -50446 78777 -65037 -9438 54780 82223 -43733
6426 -11144 4972 -71399 -41337 12538 73399 40072 65555 41634 19056 222839 414510 -232227
6413 113062 99751 103478 72931 62779 -39325 105164 -91011 200820 -69249 -99978 135708
6401 222339 30109 -74884 -66375 272491 86952 158584 149155 241152 194510 -5733 -92103 86672
6388 235706 -175461 -15143 -50744 198083 272061 -188 -56650 119728 -119337 130986 -84350
6376 192886 -144585 49680 -68549 234510 -200949 52227 -31448 103361 130558 -22263 15012
6364 41230 -64112 -29659 141736 -80458 24681 274147 -183357 44913 -106654 -200234 -57820
6352 -5623 -68554 224401 299258 52794 39526 -46470 -201271 -102487 -115828 99693 3327 -45719
6339 94552 57647 21040 189494 67834 -11007 -35477 105106 73586 -40043 244478 225416
6328 225416 -127149 215985 275782 48332 -8902 166558 95432 -72111 109935 284239 9197
6316 -164019 134187 -170003 235417 47340 -46594 156846 119497 -36858 -128884 201360 80942
6304 80070 107762 43374 -67159 47166 -36546 226068 224333 -77424 -124421 21801 55187 -51465
6291 -85393 38890 224470 -62944 286357 6318 92436 62016 17674 -20438 -121663 -21801
6279 -58779 276475 -211173 -50769 11310 -285199 -140601 -16607 144404 130875 143405 190066
6268 190066 71389 -61268 -97359 133153 70463 -79383 2043 82758 223819 -3366 333324
6256 138018 134185 109765 -284388 3575 28460 185736 -160143 147300 50469 1241 238348
6245 238348 159473 53310 74752 18470 56055 -11396 -83993 -140194 51954 126774 214292 65926
6232 265119 66530 104159 143994 -94580 -111990 64223 -27703 80993 310078 15989 -109005
6220 -34272 5040 -137610 69779 43042 -33114 47538 31418 -4853 -63276 14922 206976 20323
6207 91085 -134284 98625 97462 -13883 -15200 55061 92100 117715 3575 175544 93885 156680
6195 156680 16937 300059 14810 -77146 -197448 21440 205259 -19946 205615 7478 66019
6184 66019 -63707 36208 -242903 6095 -82987 -131618 286469 242907 31831 84926 135542 166056
6172 166056 -128777 -77272 -82422 -13272 45257 179645 224022 33663 158518 23272 89007
6161 89007 5042 -16015 -31738 97014 -129398 98074 66946 22308 -60134 145326 100843 69344
6149 69344 -48534 125648 -156750 114290 120358 -80687 -30587 160343 56129 135438 -9365
6137 10543 -41135 102851 164668 182061 139457 -47071 218224 29779 213841 -89773 162591
6125 43891 -112427 -85233 169513 102190 119641 -130234 74158 50459 790 161461 -72737
6113 17494 186228 -5834 -82241 111868 142662 55681 125186 121805 180870 -135774 129508
6101 84512 28003 17887 86796 -91090 -45948 269875 46241 -42724 -82765 61258 -43475 146155
$$ [...]
##END NTUPLES=NMR SPECTRUM
##END=
