##TITLE=Coffee green (M2-ROVE40 + 1.5mL buffer 50/50,  450uL extracto + 50uL (D2O+TMS))
without heating, vortex and centrifuged, temperature 0oC.
##JCAMPDX= 6.0         $$ Bruker NMR JCAMP-DX V2.0
##DATA TYPE= NMR SPECTRUM
##DATA CLASS= NTUPLES
##ORIGIN= Bruker BioSpin GmbH
##OWNER= Administrator
$$ 1.72 TOPSPIN		Version 2.1
$$ 2012-05-22 16:13:11.200 -0700  Administrator@X
$$ Compression mode = diff/dup
##.OBSERVE FREQUENCY= 400.13188198
##.OBSERVE NUCLEUS= ^1H
##.ACQUISITION MODE= SIMULTANEOUS (DQD)
##.ACQUISITION SCHEME= undefined
##.AVERAGES= 64
##.DIGITISER RES= 22
##SPECTROMETER/DATA SYSTEM= spect
##.PULSE SEQUENCE= noesygppr1d
##.SOLVENT NAME= H2O+D2O
##.SHIFT REFERENCE= INTERNAL, H2O+D2O, 1, 14.97969
##AUDIT TRAIL= $$ (NUMBER, WHEN, WHO, WHERE, PROCESS, VERSION, WHAT)
$$ ##TITLE= Audit trail, TOPSPIN		Version 2.1
$$ ##JCAMPDX= 5.01
$$ ##ORIGIN= Bruker BioSpin GmbH
$$ ##OWNER= Administrator
$$ $$ c:\Bruker\TOPSPIN/data/jwist/nmr/11-coffee-green-quantification-2/151/pdata/1/auditp.txt
$$ ##AUDIT TRAIL=  $$ (NUMBER, WHEN, WHO, WHERE, PROCESS, VERSION, WHAT)
(   1,<2011-11-17 17:19:20.450 -0500>,<Administrator>,<TOPSPIN>,<go>,<TOPSPIN 2.1>,
      <created by zg
	started at 2011-11-17 17:10:25.747 -0500,
	POWCHK enabled, PULCHK disabled,
       configuration hash MD5:
       DA 63 81 1B EF 4C B5 72 B4 DF EA D9 B4 DB 4C 08
       data hash MD5: 64K
       29 E5 96 66 0E E2 9B A5 78 FE 03 8C CC 85 DA 0D>)
(   2,<2011-11-17 18:22:22.529 -0500>,<Administrator>,<TOPSPIN>,<proc1d>,<TOPSPIN 2.1>,
      <Start of raw data processing
       efp LB = 0 FT_mod = 6 PKNL = 1 PHC0 = 0 PHC1 = 0 SI = 32K 
       data hash MD5: 32K
       90 CB 6C BC 8B 0E 04 2C 58 37 E3 9C EA E9 3C 40>)
(   3,<2011-11-17 18:22:22.904 -0500>,<Administrator>,<TOPSPIN>,<proc1d>,<TOPSPIN 2.1>,
      <pk PHC0 = 20.08301 PHC1 = 0 
       data hash MD5: 32K
       E7 E7 BB E4 65 2B 30 7B B2 38 08 BE 7F D0 7C 5D>)
$$ ##END=
$$ 
$$ $$ hash MD5
$$ $$ D3 3C A5 92 27 D9 58 DC 09 71 29 A3 F4 4A 0A 1C
##$RELAX= 
##$RELAX= 
##$RELAX= 
##$RELAX= 
##$RELAX= 
$$ Bruker specific parameters
$$ --------------------------
##$DU= <Z:>
##$EXPNO= 151
##$NAME= <11-coffee-green-quantification-2>
##$PROCNO= 1
##$TYPE= <nmr>
##$USER= <jwist>
##$ACQT0= -8.18779609996853
##$AMP= (0..31)
100 100 100 100 100 100 100 100 100 100 100 100 100 100 100 100 100 100
100 100 100 100 100 100 100 100 100 100 100 100 100 100
##$ANAVPT= -1
##$AQSEQ= 0
##$AQ_mod= 3
##$AUNM= <au_prof>
##$AUTOPOS= <>
##$BF1= 400.13
##$BF2= 400.13
##$BF3= 400.13
##$BF4= 400.13
##$BF5= 400.13
##$BF6= 400.13
##$BF7= 400.13
##$BF8= 400.13
##$BYTORDA= 0
##$CFDGTYP= 0
##$CFRGTYP= 9
##$CHEMSTR= <none>
##$CNST= (0..63)
1 1 145 1 1 1 1 1 1 1 1 1 1 1 1 1 1 1 1 1 1 1 1 1 1 1 1 1 1 1 1 1 1 1 1
1 1 1 1 1 1 1 1 1 1 1 1 1 1 1 1 1 1 1 1 1 1 1 1 1 1 1 1 1
##$CPDPRG= <>
##$CPDPRG1= <>
##$CPDPRG2= <>
##$CPDPRG3= <>
##$CPDPRG4= <mlev>
##$CPDPRG5= <mlev>
##$CPDPRG6= <mlev>
##$CPDPRG7= <mlev>
##$CPDPRG8= <mlev>
##$CPDPRGB= <>
##$CPDPRGT= <>
##$D= (0..63)
$$ [...]
150 150 150 150 150 150 150 150
##$TP07= 0
##$TPNAME0= <>
##$TPNAME1= <>
##$TPNAME2= <>
##$TPNAME3= <>
##$TPNAME4= <>
##$TPNAME5= <>
##$TPNAME6= <>
##$TPNAME7= <>
##$TPOAL= (0..7)
0.5 0.5 0.5 0.5 0.5 0.5 0.5 0.5
##$TPOFFS= (0..7)
0 0 0 0 0 0 0 0
##$TUNHIN= 0
##$TUNHOUT= 0
##$TUNXOUT= 0
##$USERA1= <user>
##$USERA2= <user>
##$USERA3= <user>
##$USERA4= <user>
##$USERA5= <user>
##$V9= 5
##$VALIST= <valist>
##$VCLIST= <CCCCCCCCCCCCCCC>
##$VD= 0
##$VDLIST= <DDDDDDDDDDDDDDD>
##$VPLIST= <PPPPPPPPPPPPPPP>
##$VTLIST= <TTTTTTTTTTTTTTT>
##$WBST= 2048
##$WBSW= 25
##$XGAIN= (0..3)
0 0 0 0
##$XL= 0
##$YL= 0
##$YMAX_a= 5341075
##$YMIN_a= -1681975
##$ZGOPTNS= <>
##$ZL1= 120
##$ZL2= 120
##$ZL3= 120
##$ZL4= 120
##$ABSF1= 0
##$ABSF2= 0
##$ABSG= 0
##$ABSL= 0
##$ALPHA= 0
##$AQORDER= 0
##$ASSFAC= 0
##$ASSFACI= 0
##$ASSFACX= 0
##$ASSWID= 0
##$AUNMP= <proc_prof1d>
##$AXLEFT= 0
##$AXNAME= <>
##$AXNUC= <1H>
##$AXRIGHT= 0
##$AXTYPE= 0
##$AXUNIT= <>
##$AZFE= 0.1
##$AZFW= 0.1
##$BCFW= 0
##$BC_mod= 0
##$BYTORDP= 0
##$COROFFS= 0
##$CY= 15
##$DATMOD= 1
##$DC= 0
##$DFILT= <>
##$DTYPP= 0
##$F1P= 7.97998428473878
##$F2P= 5.99313105466096
##$FCOR= 0.5
##$FTSIZE= 32768
##$FT_mod= 6
##$GAMMA= 0
##$GB= 0
##$INTBC= 1
##$INTSCL= 1
##$ISEN= 128
##$LB= 0
##$LEV0= 0
##$LPBIN= 0
##$MAXI= 10000
##$MC2= 0
##$MEAN= 0
##$ME_mod= 0
##$MI= 0
##$NCOEF= 0
##$NC_proc= -6
##$NLEV= 6
##$NOISF1= 0
##$NOISF2= 0
##$NSP= 0
##$NTH_PI= 0
##$NZP= 0
##$OFFSET= 14.97969
##$PC= 1
##$PHC0= 20.08301
##$PHC1= 0
##$PH_mod= 1
##$PKNL= yes
##$PPARMOD= 0
##$PPDIAG= 0
##$PPIPTYP= 0
##$PPMPNUM= 2147483647
##$PPRESOL= 1
##$PSCAL= 0
##$PSIGN= 0
##$PYNMP= <proc.py>
##$REVERSE= no
##$SF= 400.13
##$SI= 32768
##$SIGF1= 0
##$SIGF2= 0
##$SINO= 400
##$SIOLD= 32768
##$SPECTYP= <>
##$SREGLST= <1H.CDCl3>
##$SSB= 0
##$STSI= 32768
##$STSR= 0
##$SW_p= 8223.68421052631
##$SYMM= 0
##$S_DEV= 0
##$TDeff= 65536
##$TDoff= 0
##$TI= <>
##$TILT= no
##$TM1= 0
##$TM2= 0
##$TOPLEV= 0
##$USERP1= <user>
##$USERP2= <user>
##$USERP3= <user>
##$USERP4= <user>
##$USERP5= <user>
##$WDW= 1
##$XDIM= 32768
##$YMAX_p= 320169381
##$YMIN_p= -108814806
##$CURPLOT= <Network HP LaserJet P1505>
##$CURPRIN= <$Network HP LaserJet P1505>
##$DFORMAT= <normdp>
##$LAYOUT= <+/1D_H.xwp>
##$LFORMAT= <normlp>
##$PFORMAT= <normpl>
##$SURQMSG= 1
$$ End of Bruker specific parameters
$$ ---------------------------------
##NTUPLES= NMR SPECTRUM
##VAR_NAME=  FREQUENCY,     SPECTRUM/REAL,   SPECTRUM/IMAG
##SYMBOL=    X,             R,               I
##VAR_TYPE=  INDEPENDENT,   DEPENDENT,       DEPENDENT
##VAR_FORM=  AFFN,          ASDF,            ASDF
##VAR_DIM=   32768,         32768,           32768
##UNITS=     HZ,            ARBITRARY UNITS, ARBITRARY UNITS
##FACTOR=    0.250966925370066, 1,           1
##FIRST=     8223.43324360094, 52403,        -69269
##LAST=      0,             152520,          -269573
##MIN=       0,             -108814806,      0
##MAX=       8223.43324360094, 320169381,    0
$$ Real data points
##PAGE= N=1
##DATA TABLE= (X++(R..R)), XYDATA
$$ [...]
19649A835738m4695R2682O7631K05589j80473j50949M3348j9406M7518N5790J62026
19638B114799j79251n6943j48345L21277n3797j31585J79688k4464k6312m3192
19628A951875J84076n1523j01329r6789k53210K33413J91332k54174l1446M1354
19618A813579p755q625m6066o4209m842J13422K32319n27272M86769m25671K27721
19607A789370l22504L26493j61427J2766K39688k28676K6065J09679r5021m1293
19597A655140J5377k69Q5013k12233K995K91973k80652K39608j66056J6319Q0584
19586A727799J9025q1487N8398J61177k87871J44157J14836j36252O6906j01221
19576A685467j23048P8917j15660O0900q2987m7420m3326J07628L16063k14704
$$ plain form
19649 1835738 1791043 1883725 1951356 2156945 1976472 1825523 1868871 1849465 1896983 1952773 2114799
19638 2114799 1935548 1878605 1730260 2051537 1997740 1866155 2045843 2021379 1995067 1951875
19628 1951875 2135951 2084428 1983099 1886310 1633100 1866513 2057845 1803671 1772225 1813579
19618 1813579 1805824 1797199 1751133 1686924 1682082 1795504 2027823 1500551 1987320 1561649 1789370
19607 1789370 1466866 1793359 1631932 1644698 1884386 1655710 1681775 1791454 1696433 1655140
19597 1655140 1670517 1670248 1755261 1543028 1546023 1837996 1557344 1796952 1630896 1647215 1727799
19586 1727799 1746824 1665337 1723735 1884912 1597041 1741198 1856034 1719782 1786688 1685467
19576 1685467 1562419 1641336 1525676 1586576 1503589 1456169 1412843 1520471 1836534 1621830
19566A621830k98098J09735P1225Q8527j79382J35316j46274K41322k18689K37535
19556A663047k47769j9008j50667J06200j3792J11448J22366j88025j63034J7
19546A220783L61058l35823K24879j51375J70423j67287j415J27366j77814l7169
19536A233626J00890J73537j9828Q2777k26599K2714P6703O8589q5607J47990
19526A574792n2811o4439J03030j91359p3668L12346k36922J98624l01383L02203
19516A570413P1303q7117j54697K93412k82559J42724j04555M042j72125J65143
19506A445984p5513L38844l54428m5080O5880J18791m16804K97265n8711k7601
19496A288627N3485P8020j65025Q6530J7871j40390K74114o2801l57885K50673
$$ plain form
19566 1621830 1323732 1433467 1504692 1593219 1413837 1549153 1402879 1644201 1425512 1663047
19556 1663047 1415278 1396270 1245603 1351803 1338011 1449459 1571825 1383800 1220766 1220783
19546 1220783 1581841 1246018 1470897 1319522 1489945 1322658 1321243 1448609 1270795 1233626
19536 1233626 1334516 1508053 1488225 1571002 1344403 1367117 1443820 1512409 1426802 1574792
19526 1574792 1521981 1457542 1560572 1369213 1295545 1607891 1370969 1569593 1268210 1570413
19516 1570413 1641716 1554599 1399902 1693314 1410755 1553479 1448924 1452966 1280841 1445984
19506 1445984 1370471 1709315 1354887 1309807 1375687 1494478 1077674 1374939 1316228 1288627
19496 1288627 1342112 1420132 1255107 1341637 1359508 1219118 1493232 1430431 1072546 1323219
19486A323219j0079K6262j04769J62726j23061o154L7415j91497J63823j9396
19476A258489K1973l01077K18518j99156o0232P2896J9487l0755M3070k42J2055
19465A055026J9469j31529M9745q5129K34267p0792J00337k11147J89813K0884
19455A170944r6551p6915m6136L3527o313O680l6964o3586J41956j07756j8704
19444I00182j41754L63041j52605k0612R2948l00382R7358o1643Q5960L4004J51809
19433A048306j47769P5782k4566m0425m1053j81203K49401p9855L51072l58637
19423H51053R3750r3311J28990q9452J94650k15117J1012p1185J4024m6848J78426
19412I55992o2734R3358j23468k50607J85647J15798j04978M3463j07400J55846
$$ plain form
19486 1323219 1313140 1339402 1234633 1397359 1274298 1268144 1305559 1114062 1277885 1258489
19476 1258489 1280462 979385 1197903 998747 938515 1011411 1030898 1000143 1043213 1042971 1055026
19465 1055026 1074495 942966 992711 907582 1141849 1071057 1171394 960247 1150060 1170944
19455 1170944 1074393 997478 951342 984869 978556 985236 948272 884686 1026642 918886 900182
19444 900182 758428 1121469 968864 948252 1041200 740818 838176 776533 862493 896497 1048306
19433 1048306 900537 976319 951753 911328 870275 689072 938473 858618 1209690 851053
19423 851053 944803 851492 980482 891030 1085680 870563 881575 810390 824414 777566 955992
19412 955992 893258 986616 863148 612541 798188 913986 809008 852471 745071 900917
19402I00917p7730N5200J06393k41855m3877K55982j31042j4596n3761k51K12816
19391I68196j92823j57856K81644k5843j6188j25295K01763M0638k38761L5616
19381G71091J30930o6889l6356J29327j51255J00428q0870K67811j04637q5409
19371H74171O9403j7179l6367j89070Q9368J94811j20382k45397L40945j66598
19361G93705P3345K13520r5795M501k44134K59989j30880k418M2871Q9419k30188
19350G73935q1789K12508L154l81593L76682j58549K52496j54452j37356j1888
19340F93148K73122k94245L2702p064J33575r3205J75229j01310j70564Q8103
19330G29491K84062j96297j7996J96537m9484m4056j50693K38066N1685j93474
$$ plain form
19402 900917 823187 878387 984780 742925 699048 955030 823988 809392 755631 755380 968196
19391 968196 775373 617517 899161 873318 857130 731835 933598 974236 735475 771091
19381 771091 902021 835132 798776 928103 776848 877276 796406 1064217 959580 874171
19371 874171 943574 926395 890028 700958 790326 985137 864755 619358 960303 793705
19361 793705 867050 1080570 984775 989276 745142 1005131 874251 871833 914704 1004123 773935
19350 773935 692146 904654 907808 526215 902897 744348 996844 842392 705036 693148
19340 693148 966270 672025 704727 697663 831238 738033 913262 811952 641388 729491
19330 729491 1013553 817256 799260 995797 946313 902257 751564 989630 1041315 847841
19320H47841J92404l62721N91679l05342j58058k4156Q2814p3417k4583J87318
19310I53779J98748l63390L24848m25548J57666J05525k32184J24629J50318j57817
19300H36574K17280k28653m359K2055K56706l8046l15741M8211K18583J1758j85807
19289H38561j32381M9219K76588k90079j8411L7896j3727j63847J72100j65112
19279E90807J94904j57821J48237j59218J71809m5536j1110J71099k08021M1051
19269G36201j40396K28466J59632k14726k12636J01848K26620j85738Q1231r4850
19259F85652M4838j472Q33J06187j16390P963M701p0266R6087O0193R4776J1164
19247I24266k49877k4236J01176P8599j71938K15030J00414J17223K64110m1099
$$ plain form
19320 847841 1040245 677524 1269203 963861 805803 781647 864461 791044 766461 953779
19310 953779 1152527 789137 1113985 688437 846103 951628 719444 844073 994391 836574
19300 836574 1053854 825201 820842 842897 1099603 1061557 745816 794027 1012610 1024368 838561
19289 838561 706180 755399 1031987 741908 723497 761393 747666 583819 755919 590807
19279 590807 785711 627890 776127 616909 788718 743182 732072 903171 695150 736201
19269 736201 595805 824271 983903 769177 556541 658389 885009 699271 780502 685652
19259 685652 730490 729018 729851 836038 719648 727611 732312 662046 758133 818326 913102 924266
19247 924266 674389 650153 751329 829928 657990 873020 973434 1090657 1354767 1313668
19237A313668K72971l16706o3357p5525J7149L9951l47030M3009J96464m29611
19227F50983N6190J8965j69359L15527j02519J2684k42016K10581k5482O7571
19217G93125l25370M51549k21762j5683J79474p6336j6641k02381L03693j87015
19207F82653J6668k72397J97022J08783J08483k24288j48387L75066l31235K12544
19197G24912m0596P2862p4381L6917N3870Q1663j66979l00809M31634k07401J48273
19186G59965l01442J47711O4037M1600Q4468q8680p8118j99246m476L26801k20225
19175E32395K15642J98365O3227j14979j83878K21027r8010p6075J60819q5033
19165H33500l04593K31720J25674J10216K0154n1317K75745j35263L8393N5241
$$ plain form
19237 1313668 1586639 1269933 1206576 1131051 1148200 1188151 841121 884130 1080594 650983
19227 650983 707173 726138 556779 872306 769787 782471 540455 751036 725554 793125
19217 793125 467755 919304 697542 681859 861333 784997 768356 565975 869668 682653
19207 682653 699321 426924 623946 732729 841212 616924 468537 843603 512368 724912
19197 724912 684316 757178 682797 719714 773584 855247 688268 387459 819093 611692 759965
19186 759965 458523 606234 670271 711871 796339 707659 629541 430295 425819 752620 532395
19175 532395 748037 946402 1009629 894650 710772 931799 833789 757714 918533 833500
19165 833500 528907 760627 886301 996517 1016671 965354 1241099 1105836 1144229 1199470
19155A199470j97938J60090J50220k90027L9363j29068J47958m8597J11616j59444
19145I83643P5327O2219P3060q3818L2492k7131r3731o429J14398o7509J33778
19134A196299k92192J7046m8136J81476o5640Q491J18639j4936o0080q6340K47780
19123A202407j46470j96293J02603J768q1469n4387Q9386L64403k38571P9320
19113A122697J68139r1024j47723O0156R8385j36212k1514M5350r4767K1298L53646
19102A378431k62124K55818L06283l74499M09246q9581K57512K9239O4298M86529
19092B461152L27078K77347K17828M75100J84486N55441O9990L30924l92664k23153
19082D283529k43611o33529k70743r8371l35074o6456n14862J28982k48062n42
$$ plain form
19155 1199470 1001532 1161622 1311842 1021815 1061178 932110 1080068 1031471 1143087 983643
19145 983643 1058970 1121189 1194249 1110431 1142923 1115792 1022061 1015632 1130030 1062521 1196299
19134 1196299 904107 921153 873017 1054493 988853 997344 1115983 1101047 1040967 954627 1202407
19123 1202407 1055937 859644 962247 964015 882546 828159 917545 1281948 1043377 1122697
19113 1122697 1290836 1199812 1052089 1112245 1210630 1074418 1052904 1098254 1003487 1024785 1378431
19102 1378431 1116307 1372125 1678408 1303909 1713155 1623574 1881086 1910325 1974623 2461152
19092 2461152 2788230 3065577 3283405 3758505 3942991 4498432 4568422 4899346 4506682 4283529
19082 4283529 4039918 3406389 3135646 3037275 2702201 2635745 2120883 2249865 2001803 2001261
19072B001261j14367j8011j61953L93074r4429L86877M2723O02430L44553M49740
19062C831898M11813l09056L21958n46408M7666j73295l16431P4249l3238J98101
19052C507257J1731L25532K34931M39206J23976N21163k4952j18082j48818k01572
19042D670372o26213j09613l33857k42503k05962m93496r6576j49255l8789p5221
19032B298887O4441p9241j78063K04289O20889J81254K81843N91517J63927L30665
19022D480408J69065j84381k04912k74207k16433l91965l20568k88853j23437
19013B644717n6357k34751k12223N7199K8214q5216j01490J06918L11818J08656
19003B567485L57936M17773M11993L98019J46425M63609M7476k8710l9691m07791
$$ plain form
19072 2001261 1886894 1868883 1706930 2100004 2005575 2392452 2435175 3037605 3382158 3831898
19062 3831898 4243711 3934655 4256613 3710205 3757871 3584576 3268145 3342394 3309156 3507257
19052 3507257 3518988 3844520 4079451 4518657 4642633 5163796 5138844 5020762 4871944 4670372
19042 4670372 4044159 3934546 3600689 3358186 3152224 2658728 2562152 2412897 2374108 2298887
19032 2298887 2363328 2284087 2106024 2310313 2931202 3112456 3394299 3985816 4149743 4480408
19022 4480408 4649473 4465092 4260180 3985973 3769540 3377575 3057007 2768154 2644717
19013 2644717 2588360 2353609 2141386 2198585 2226799 2141583 2040093 2147011 2458829 2567485
19003 2567485 2925421 3343194 3755187 4153206 4299631 4763240 4810716 4782006 4742315 4334524
18993D334524J38309j48095K52567K4089K77428J93686P86100N23919Q09487R09865
18983H101879O23639J081255Q26202J077525J353838J620171J624610J828071
18975A8137190J899822J206926M51028k82862n89596j217111j348819j794864
18967A6461714j773955j540017j654340j387600j146502j112660j010017o93801
18959F142822r00432o89561n58361k75259o23586k27027k92714M0254k13992k88541
18949B113603j45441J42895m6083j13846j21176J02216k73576J49680j60736K16172
18939A863708K09672l52905R7298K51683o0334N5405j7550n9209k5445K09684
18929B172007k956L19950q8109L97337q2119L19216L07530N35010L76374L15993
$$ plain form
18993 4334524 4472833 4324738 4577305 4601394 4878822 5072508 5858608 6382527 7192014 8101879
18983 8101879 8725518 9806773 10632975 11710500 13064338 14684509 16309119 18137190
18975 18137190 20037012 21243938 21694966 21412104 20822508 19605397 18256578 16461714
18967 16461714 14687759 13147742 11493402 10105802 8959300 7846640 6836623 6142822
18959 6142822 5242390 4552829 3994468 3719209 3095623 2868596 2575882 2616136 2402144 2113603
18949 2113603 1968162 2111057 2064974 1951128 1829952 1932168 1658592 1808272 1647536 1863708
18939 1863708 2073380 1720475 1817773 2069456 2009122 2064527 2046977 1987768 1962323 2172007
18929 2172007 2169051 2489001 2400892 2798229 2716110 3035326 3342856 3877866 4254240 4570233
18919D570233P66158Q74408J097429J419853J659405J776209J600347K226852
18911A5990894J481347J179888L37311J03733q46443j130169j231743j538760
18903A4346058j767604j254922j430932j433678j023438r55219q65940p78713
18895D835612p65358m92382m44291l65475k53275j30972n52343M196j86821q6356
18885A562535j20157r286M6904j76040o5233P7986l19875J02482j02761J73775
18875A170330j39898j36283o2931l0620K6115l733M723j53545L22065m47782J76195
18864G24636J6595L25117m67023K99948o5716j5516p2948L6625J10039n0230k79419
18853E62108O3770J3964J98732P4141j56607m6778J27937M7250j58088N5588q0818
$$ plain form
18919 4570233 5336391 6210799 7308228 8728081 10387486 12163695 13764042 15990894
18911 15990894 17472241 18652129 18989440 19093173 18246730 17116561 15884818 14346058
18903 14346058 12578454 11323532 9892600 8458922 7435484 6480265 5614325 4835612
18895 4835612 4070254 3577872 3133581 2768106 2514831 2383859 1831516 1835712 1648891 1562535
18885 1562535 1442378 1433092 1479996 1303956 1238723 1316709 996834 1099316 996555 1170330
18875 1170330 1030432 894149 831218 800598 826713 822980 827703 674158 996223 548441 724636
18864 724636 741231 1066348 599325 899273 833557 818041 745093 781718 891757 841527 562108
18853 562108 625878 639842 838574 912715 756108 709330 837267 884517 726429 782017 701199
18842G01199j43136O7603R2964o6340j7333J1003P1907j43527P2783R826k463
18831F54486r5874K7924P5714k4635J56818m1316j53797N1143M1535k3082Q001
18820F76917L9906J44836k33826J43144o4769O9438j16728k01738L46040o4643
18810G38577l51807N36410l91850L31292j84108J35142j97691L73027k02537k58309
18800E28146M11373k34742n0014J32739r1184P8789J172k06688J35287j92148
18790E12730J99029R6440P2578j02951m6325q2541R9784N2149n7042J73489j58634
18779G58706J01130j91231K76802m65318L49508j09689J32621j40825R7484k78081
18769E31107J40629r6232L10290l80636L10534k91356J24946K41979l34857n5525
$$ plain form
18842 701199 558063 625666 718630 652290 634957 645960 717867 574340 647123 656949 654486
18831 654486 558612 586536 662250 637615 794433 753117 599320 650463 691998 668916 676917
18820 676917 716823 861659 627833 770977 706208 775646 658918 457180 803220 738577
18810 738577 386770 923180 531330 862622 678514 813656 615965 988992 786455 528146
18800 528146 939519 704777 654763 787502 696318 775107 776279 569591 704878 512730
18790 512730 711759 808199 880777 777826 731501 648960 748744 800893 743851 917340 758706
18779 758706 859836 668605 945407 480089 829597 719908 852529 711704 809188 531107
18769 531107 671736 575504 885794 505158 815692 524336 649282 891261 556404 500879
18759E00879J46158L3880j15413J70382j126j24309L09651j87572k39508J66477
18749F59499j73969J94583r9255P8800P2699k48394J13997O92p7005K57951j21508
18738F58090L3020k7298j0507j39267Q9798k3840k01641N38800j62760J6327j3193
18727G57529Q0766k111j51093L2449j044j26549K12140n164L2594j68768R6666
18716G57415j20245R5583k8486J13751k46879j2233J60700j70511L4391J34744
18706G18230j18804m6162J22584k51616J52533L93424l80338r6334K39347j05067
18696F27797L20758l10262j59540n8041K20798r8245N3313j42140L74234j67084
18686F61588j23475M06769m33405J16433J88147k74609J28821P2377k65254O9855
$$ plain form
18759 500879 647037 680917 565504 735886 734760 610451 920102 732530 493022 659499
18749 659499 485530 680113 580858 659658 732357 483963 597960 598652 521647 779598 658090
18738 658090 691110 663812 653305 514038 603836 579996 378355 917155 754395 770722 757529
18727 757529 838295 836184 685091 717540 716496 589947 802087 796923 829517 660749 757415
18716 757415 637170 732753 704267 818018 571139 558906 719606 549095 583486 718230
18706 718230 599426 553264 675848 424232 576765 970189 589851 493517 732864 627797
18696 627797 948555 638293 478753 420712 641510 543265 596578 454438 828672 661588
18686 661588 538113 944882 511477 627910 816057 541448 670269 742646 477392 547247
18676E47247K8242J00341r4387o4725k8964J31466J491n7962O3164J05186j59516
18665E71583k4006J78197r4192r4954M5957J79090k48429L2289q0495j41340K77063
18654F00763k64237L95984j40443q9741P473K09488j70358K17447m7617J70957
18644H89716k01484J80205j97417j02439L2438M1637j81657K59549j98262j44033
18634C78253K93971k99482o6290J96422n608L2333N1232N7465j86315l8061O8237
18623D82157L91182l00397R3988m5820L8815j92034O2251o1023J66185J0565k39445
18612D06424M19457l02409J52715j70011j05944L75940k37146j5285O5963J51939
18602G41643N0359p4834j85893J42463r7909R9386M772o7362K4583J22116O7623
$$ plain form
18676 547247 575489 675830 581443 516718 487754 619220 620711 562749 625913 731099 571583
18665 571583 547577 725774 631582 536628 582585 761675 513246 545535 465040 323700 600763
18654 600763 336526 732510 592067 502326 509799 719287 548929 766376 718759 889716
18644 889716 688232 868437 671020 568581 601019 642656 460999 720548 522286 378253
18634 378253 672224 372742 306452 502874 497266 529599 580831 638296 451981 413920 482157
18623 482157 873339 572942 666930 621110 659925 467891 530142 469119 635304 645869 406424
18612 406424 825881 523472 676187 506176 400232 776172 539026 523741 589704 741643
18602 741643 792002 717168 531275 673738 575829 675215 679987 612625 637208 759324 826947
18591H26947k84392L4967K10055j06946n884p2947r5426J84410r6696L17137o9454
18580H41771N3421j60377p9038r2375J27160k3960K4070R7260M5661k15924P7780
18569F95449j07624n1408j569K29423k32785P9950Q9857j32491j53769N7755q1003
18558C91785R9394m7674J17880j2230O5341k20647L45011j10366A08799L18617
18548D27416K93660j70658n0992m8319M1437P8481j7426p8902o3666J91752N2419
18537F55202m8593q8430J04964n2374j15066P7969k09093J42363j25082J38348
18527D80208N9460J24704k81983O3914O7890J26745j34161M7891J00471N1459
18517G06598j91684K05481j76019r7052P9878L6606j67944J25680J57086k1931
$$ plain form
18591 826947 542555 577522 787577 680631 674747 601800 506374 690784 594088 911225 841771
18580 841771 895192 734815 655777 563402 690562 666602 690672 787932 833593 617669 695449
18569 695449 587825 536417 534848 764271 531486 611436 701293 568802 415033 472788 391785
18558 391785 491179 443505 561385 549155 614496 393849 738860 628494 108799 427416
18548 427416 721076 550418 499426 451107 492544 571025 553599 474697 411031 602783 655202
18537 655202 606609 518179 623143 570769 455703 533672 324579 466942 341860 480208
18527 480208 539668 664372 382389 446303 514193 640938 506777 554668 655139 706598
18517 706598 514914 720395 544376 447324 527202 563808 395864 521544 678630 656699
18507F56699j55117L8225K38034j96769r8138J50899j45933J62718n6484J64089
18497G58223l26191p7224K18255j02207q9220J78288q0040K37079o5570j03866
18487E47527J52111j43296l7194m7171j18939J19673M4407J4387K1464j10121
18477D42848J97991k40199p6977K99013j56232R7914k7046O251m5326J95003j12586
18466E80654N8183j98974R4149K34436l26685J30656J6064J57349j80246J76014
18456G41600j04925j19415j8860O5094J35413q7190l3738J64843l21171J07523
18446E29174K20585l46n7396k34556M8655O3487r6702N5824k1767J79009j6194
18435F69773J69990k28546m494L0060J91194B26441J99662K26775k77740L30151
$$ plain form
18507 656699 501582 539807 777841 581072 482934 633833 487900 650618 594134 758223
18497 758223 432032 354808 573063 470856 381636 559924 479884 716963 651393 547527
18487 547527 699638 556342 519148 471977 353038 472711 517118 531505 552969 442848
18477 442848 640839 400640 323663 622676 466444 564358 537312 543563 498237 693240 580654
18466 580654 638837 439863 534012 768448 441763 572419 588483 745832 565586 741600
18456 741600 636675 517260 498400 563494 698907 611717 577979 742822 421651 529174
18446 529174 749759 749413 692017 457461 506116 569603 472901 528725 506958 685967 669773
18435 669773 839763 611217 606723 636783 827977 226441 426103 652878 375138 705289
18425G05289L3666j06720j79587L09966C80281L48216j54118J99578k04784K25473
18415G94646j41628j60399J29038O3420j72185L27882k14732L2967k60781J40270
18405E38498M55369l32704j80436J72397n6190L1327M9805j15890l7441p3035
18395D51700J2602o8923m6545J82632k62926L07491k86638L97601j18021j9625
18385E49348j24262P945J19608J36258j55554q0237K345J57528l8516k32419n1421
18374B90623K96268k4794j97987k9895K21024O7703o9409K24663k14701k2579
18364E40916O8069J6213j19992j9942n4902r5970J41824B37228J84753J9353P5989
18353E17323l9958O3063J18098k74174J09656o4886J40885Q1456K3280q8229L27737
$$ plain form
18425 705289 738955 632235 452648 762614 380281 728497 574379 773957 569173 794646
18415 794646 653018 492619 621657 685077 512892 840774 626042 659009 398228 538498
18405 538498 993867 661163 480727 653124 596934 628261 678066 562176 524735 451700
18395 451700 464302 395379 348834 531466 268540 576031 289393 686994 568973 549348
18385 549348 425086 433031 552639 688897 533343 453106 455451 612979 574463 342044 290623
18374 290623 586891 562097 364110 334215 555239 622942 553533 778196 563495 540916
18364 540916 608985 625198 505206 485264 430362 334392 476216 237228 421981 441334 517323
18353 517323 477365 540428 658526 384352 494008 429122 570007 651463 674743 586514 914251
18342I14251m50183L17787j43713q5524L5937j3813o6738J45160k3524J75758
18332H05398k59068j74700M51583j94438k70328K7215P0535Q7268q4104J59182
18322F18543j33651l3710J89130j49674l8182k5517J16225j2226q0666N3335p789
18311D95818o2298K1618K54728m3858j06401j82548M21338l27301J49286l5513
18301E84869R5226k55011O7146K08094O9065j17730r3091l852j32457J10605q5394
18290D47470L84187m01734q1620N0684K26740j30739j43167l5198K42100N873
18280E64596j04337r1868J37688p4520k3360j2731n935p7797K85849j21986J84222
18269F59821q2390k0206N2802j08735k2179l9467K54739l3976j32919j41562M715
$$ plain form
18342 914251 464068 781855 638142 552618 588555 574742 508004 653164 629640 805398
18332 805398 546330 371630 823213 628775 358447 385662 456197 543465 459361 618543
18322 618543 484892 451182 640312 490638 452456 426939 543164 530938 450272 503607 495818
18311 495818 433520 455138 709866 666008 559607 377059 798397 471096 620382 584869
18301 584869 680095 425084 492230 700324 769389 651659 558568 554716 422259 532864 447470
18290 447470 831657 429923 348303 398987 625727 494988 351821 316623 558723 564596
18280 564596 460259 368391 506079 431559 408199 395468 389533 311736 597585 475599 659821
18269 659821 577431 557225 610027 501292 479113 439646 694385 660409 527490 385928 390643
18258C90643J7387K68009j91322Q8019R2330q3539M94943n34636j12418J27905
18248E57321k0333R307M5954l5029K7228K8518J80458q1676k73708R7598R866
18237E45504j26454J95095N8701J15106j40828q6878J50981q8512j10738L2553
18227E44530k290p3155R3984l1436r3950O0653J08838k15410A82872J15406K66741
18216E65019O1747j4650J9498k99175J49000o934M029J5559p0794K45275k32725
18205D35849J76429j57013j1966K52840O9336l51227L16626k62848J34319r1376
18195E10969m8964j04865J21497L18064j54144l03436M45730l17440J94407J27145
18185G88963j75871j23472O5214M3016m3589M6873l6434Q4250q306n7323r2678
$$ plain form
18258 390643 408030 676039 484717 572736 665066 581527 1076470 541834 429416 557321
18248 557321 536988 546295 592249 557220 584448 612966 793424 711748 438040 535638 545504
18237 545504 419050 614145 672846 787952 647124 560246 711227 622715 511977 544530
18227 544530 542240 469085 563069 531633 437683 498336 607174 391764 182872 298278 565019
18216 565019 626766 612116 631614 332439 481439 474505 478534 494093 423299 668574 435849
18205 435849 612278 455265 443299 696139 765475 414248 730874 468026 602345 510969
18195 510969 462005 357140 478637 796701 642557 339121 784851 467411 661818 788963
18185 788963 613092 489620 554834 597850 554261 601134 564700 648950 640644 583321 490643
18174D90643p4650J89903P6364l32535L56516k11053J51175k12315J82717Q686
18164F25451k5398k653m209k24151J33305q39m1075K30255j66852K44468j9406
18153G48896C19161J78032q0636l0078K22349j14615P0047j08700J5609P8536
18143E49705k3421j1181M8095J62704Q768j76380Q0139M235B55317L34491J1764
18132F01572j89376K44389l3954L2455n0731j06902Q970k3321P0965j80127n268
18121C68672J07863n1168K97807p1504k97386o7999K64442j66116J95182q1607
18111D98186O9904j11711K8006J50100k96374L80209B85043L06214K0480j27509
18101D84228J2690o1758j01057J28264K59505j38805K24787l67540P1519M7053
$$ plain form
18174 490643 415993 605896 682260 349725 706241 495188 646363 434048 616765 625451
18164 625451 600053 597400 593191 369040 502345 501506 460431 690686 523834 768302 748896
18153 748896 319161 497193 416557 386479 608828 494213 564260 455560 471169 549705
18143 549705 526284 515103 563198 725902 734670 558290 638429 642664 255317 589808 601572
18132 601572 412196 656585 622631 655086 604355 497453 506423 483102 554067 373940 368672
18121 368672 476535 425367 723174 651670 354284 286285 550727 384611 579793 498186
18111 498186 568090 456379 484385 634485 338111 718320 285043 591257 611737 484228
18101 484228 496918 435160 334103 462367 721872 583067 807854 440314 511833 558886
18091E58886L0760J46415k20237J13196k24182k638L55554k90829O5030P3003
18081F04958j57701K77167C51651J85198p7807J42852r5251j71787O55499m79321
18071E11034J20497j83643R9442Q4468o2910Q2451j54311J46962k96668J33785
18061D81107m0487J48529k74039J97414K23319l43986P3970j51720L49434C04464
18050G45437k45841J77739q5963k42918n8376K12926l3937k663J59044j37831
18040D87617j4032K6343J4575n0547J02966j57669j9751J17675n9762n0306L53951
18029G51060k98236p8832K47152l02045K07719o3058r7049K20369j43985R9357
18019E42452J7898p1137p5297J22024K0921q4701J57518A43587K16701o1486J88416
$$ plain form
18091 558886 589646 736061 515824 629020 404838 402200 757754 466925 531955 604958
18081 604958 447257 724424 351651 536849 459042 601894 506643 334856 990355 511034
18071 511034 631531 447888 547330 631798 568888 651339 497028 643990 347322 481107
18061 481107 440620 589149 315110 512524 735843 391857 465827 314107 663541 304464
18050 745437 499596 677335 591372 348454 290078 503004 469067 466404 625448 487617
18040 487617 473585 499928 514503 463956 566922 409253 389502 507177 447415 397109 751060
18029 751060 452824 373992 621144 319099 526818 463760 366711 587080 443095 542452
18019 542452 560350 489213 413916 535940 556861 472160 629678 143587 360288 298802 487218
18008D87218n8540J97100B78484K56288p7287A83778Q4462M6303J04711L42735
17998G61989l13416J64899O8505k25334N2151L5844j62380J03641J42813k06565
17988D22147J2607r6741J3380K48658j64805j49735K97453m3184n8728J24111
17978F05163j79926R6737L4800J76397k37408m565J80513j46835K2022B68697
17967F46031j24078k09235J87727N9075M3370o754n6461p3316J13451k03924J44727
17956E20613j6345p1699K20151k13474M1528J74526n4805K11172l54764L30261
17946G87164K0831k97893J88956M9447k49448J53106j92256J55174q7529l4990
17936D92562K36487j83532M100Q4051k85296P7678J71675l9833p1862K53247k24754
$$ plain form
18008 487218 428678 625778 278484 534772 457485 183778 268240 314543 419254 761989
17998 761989 448573 613472 681977 456643 508794 544638 382258 485899 628712 422147
17988 422147 434754 338013 351393 600051 435246 285511 582964 539780 481052 605163
17978 605163 425237 521974 556774 733171 495763 491198 671711 524876 546898 268697
17967 646031 521953 312718 500445 559520 602890 596136 539675 466359 579810 375886 520613
17956 520613 504268 432569 652720 439246 480774 655300 600495 811667 456903 787164
17946 787164 807995 510102 699058 748505 499057 652163 459907 615081 527552 492562
17936 492562 729049 545517 549617 633668 348372 426050 597725 557892 486030 739277 514523
17925E14523P2468K57849k91942J30855q2934O2427K24595k23273N8364j30616
17915E92316M6242p4633J80902k86480J0519m6434j4313M6245K40300O4270q6595
17904F72339j10999N3140K9828J87391k49485L7355J77864k77954K58506n6202
17894G21783J48792K41005m86296J53772P6512j04826J09496j82737n1133j6265
17884F10103K2032r3125J63895J66465L5094q3495j10397Q5293j33205q3159K92172
17873H71673j86079J06196K5223l30352J65627J26127j49921J40693j43553K92583
17863I18217m42063l7207L09506p0823R6784J12223j13060J4502k13498m2626
17853E31955J77845m5538k03145K0606M35577j78620P8209C43155N03433C90017
$$ plain form
17925 514523 586991 844840 552898 683753 600819 663246 887841 664568 722932 592316
17915 592316 638558 563925 744827 458347 468866 422432 408119 454364 694664 758934 672339
17904 672339 561340 614480 644308 831699 582214 619569 797433 519479 777985 721783
17894 721783 870575 1111580 625284 779056 855568 750742 860238 677501 626368 610103
17884 610103 632135 539010 702905 869370 904464 820969 710572 795865 662660 579501 871673
17873 871673 685594 791790 817013 486661 652288 778415 628494 769187 625634 918217
17863 918217 476154 438947 748453 677630 774414 886637 773577 788079 574581 531955
17853 531955 709800 664262 461117 481723 917300 738680 816889 343155 846588 390017
17842G46187j71058L77725k98067j7976K6017p3394j31592l3186J05905J01803
17832F32364M593J7518l000R9730n104p1503P586q4062L34906m23968K88905J12611
17820I10576j94124q3199m9709K24149m2325l8037K37960K1714q41n4974l2586
17809H98604R038Q3991m6631k25628O099J36144K6334k24487r595K94734o1868
17798H86735N3160m0163K26495j6387k70631K67592l17133J10690j97936J33640
17788H36062l7777k82519K02170J27160k16773J59832q4923m4966l4803P9329
17778G02792j13428L140L4775M8919K6194L280j16827J89323j5334l3642j29136
17767F00056M3959p0467J57573j97058k5175k6387p248L75335k73326l8280K28747
$$ plain form
17842 746187 575129 952854 654787 636811 662828 589434 457842 424656 530561 632364
17832 632364 636957 654475 651475 751205 746101 674598 682184 598122 933028 509060 797965 910576
17820 910576 716452 633253 583544 807693 765368 727331 965291 987005 986164 931190 898604
17809 898604 907642 991633 945002 719374 725473 861617 887951 663464 653869 948603 886735
17798 886735 939895 899732 1126227 1109840 839209 1106801 789668 900358 702422 836062
17788 836062 798285 515766 717936 845096 628323 788155 703232 658266 623463 702792
17778 702792 589364 592504 627279 676198 702392 705672 588845 778168 762834 729192 600056
17767 600056 644015 573548 731121 534063 508888 482501 475253 850588 577262 538982 767729
17756G67729j54250J53663l34096J08143J34449M212Q6563k09470K38100q6337
17746G08706J31054j73861r3589j65517K84683J4330l0379J47600j15351Q9259
17736G96935p7712n5880n3245j13737L24822j87306m8856R5645j39350L8592K15652
17725G95560l7712j04069J05490P4347q6159j2660l06525L3756L4547J9221m173
17714E11623M6512j40995J12372J44164j08679q330K31999O3086k37524L2486
17704F46714l2902J27098n5578j13005P7029k13211P0972P6886K42033j51935
17694F74101r7403J69581l5535q2976J25945j16332p1740j23683K73982k416o1221
17683F52303m3274o081r695J747K62794j81357L591p280K2560J07667k87788K9530
$$ plain form
17756 767729 613479 767142 433046 541189 675638 679850 766413 556943 795043 708706
17746 708706 839760 665899 572310 406793 691476 705806 675427 823027 707676 796935
17736 796935 719223 663343 610098 496361 821183 633877 585021 680666 541316 579908 795560
17725 795560 757848 653779 759269 833616 747457 734797 428272 462028 496575 515796 511623
17714 511623 558135 417140 529512 673676 564997 556667 788666 851752 614228 646714
17704 646714 613812 740910 685332 572327 649356 436145 507117 584003 826036 674101
17694 674101 576698 746279 710744 627768 753713 637381 565641 441958 715940 713524 652303
17683 652303 609029 602948 593253 595000 857794 676437 680028 672748 695308 802975 515187 544717
17671E44717J86990j11144Q3434P8181j8145k24774K0691L27976k02710J98289
17661H83505j76794J02266L3368N9465j23419j73602K12586m1230l7263p1149
17651F67733l7696l7868J66469M229j40741K77787q5323K30029k37918J57991
17641I64692o0624k09588R6972K10090Q48k33203J65152K4818L747l3989J63503
17630A092418j95037K06699O1173j76900K04300j99763K13616Q1361j56338j64446
17620I67083J19113N8263m128R1500Q3718j86478J57107j55695M7477L7241j78037
17609A037164L3384K14981P9579k64449K21333q3934Q5856j3744o2332L7019j05820
17598A179037j5534K1759K62677l02272J39042P3799O3530j67056P3777j06291
$$ plain form
17671 544717 731707 620563 703997 782178 764033 539259 559950 887926 685216 883505
17661 883505 706711 808977 842345 901810 778391 604789 817375 776145 738882 667733
17651 667733 630037 592169 758638 762867 622126 899913 814590 1044619 806701 964692
17641 964692 904068 694480 791452 1001542 1002390 769187 934339 959157 962904 928915 1092418
17630 1092418 897381 1104080 1165253 988353 1192653 992890 1206506 1287867 1131529 967083
17620 967083 1086196 1144459 1140331 1231831 1315549 1129071 1286178 1130483 1177960 1215201 1037164
17609 1037164 1070548 1285529 1365108 1100659 1321992 1238058 1323914 1310170 1247838 1284857 1179037
17598 1179037 1163503 1185262 1447939 1145667 1284709 1358508 1422038 1254982 1328759 1222468
17588A222468m9254K63557l8916p3266j3620O6513j08970L6155k05648J85974
17578A284993O1402J6818p5804j22998J76652j56878n3812Q2237j00274J59727
17568A272063j36651J94359l2303j04464K45113J04409j59601j35428J76459j40542
17558A283414m3886P5710k80877J20867N4997O2412j01090p6947J11424j35188
17548A070836m6130Q2278J29497J44328j37588o0178K41803j19561r5402K47454
17538A457337j03295k9705M5844p1692q9023J17157o8352J48844j21912M3963
17528A329166K2130L27j56727K61148j48955J27961p4659R4535j32640k8981j01072
17517A192233J78446J74894j20150K21279k36911K06504K24654o1505K85323J5612
$$ plain form
17588 1222468 1173214 1436771 1397855 1324589 1310969 1377482 1268512 1304667 1099019 1284993
17578 1284993 1346395 1363213 1287409 1164411 1341063 1184185 1130373 1212610 1112336 1272063
17568 1272063 1135412 1329771 1297468 1193004 1438117 1542526 1382925 1247497 1423956 1283414
17558 1283414 1239528 1315238 1034361 1155228 1210225 1272637 1171547 1094600 1206024 1070836
17548 1070836 1024706 1106984 1236481 1380809 1243221 1183043 1424846 1305285 1209883 1457337
17538 1457337 1354042 1324337 1370181 1298489 1209466 1326623 1258271 1407115 1285203 1329166
17528 1329166 1351296 1351623 1194896 1456044 1307089 1435050 1360391 1454926 1322286 1293305 1192233
17517 1192233 1370679 1545573 1425423 1646702 1409791 1616295 1840949 1779444 2064767 2080379
17507B080379l001p6166J34248L60802k85551O9442j97975L21374o0890P3572
17497B416234J34336K94943K92690K13062J18134N61355M86396L70301M44972
17488E332423P46016R35343J829307K749711M376893O629537R127400J0300950
17480D2027580J0298712Q295281N055053J924118j627629m164633n691874o873622
17472D9242986o189487m830684k914215j071514J416567N022185P406944Q547625
17464E6630407P342764M758464J537958j700008m196116o672910p916465p912542
17456D1871552o933755n948574n245622m776054l916200k701785k354678j571693
17448H423191j282098j241210p54669m91185l89762k13942k69428k60581K17982
$$ plain form
17507 2080379 2077378 2001212 2135460 2496262 2210711 2280153 2082178 2403552 2342662 2416234
17497 2416234 2550570 2845513 3138203 3351265 3469399 4030754 4517150 4887451 5332423
17488 5332423 6078439 7013782 8843089 11592800 15969693 22599230 31726630 42027580
17480 42027580 52326292 60621573 65676626 67600744 65973115 61808482 56116608 49242986
17472 49242986 43053499 38222815 35308600 34237086 35653653 40675838 48082782 56630407
17464 56630407 63973171 68731635 70269593 68569585 64373469 57700559 49784094 41871552
17456 41871552 34937797 28989223 23743601 18967547 15051347 12349562 9994884 8423191
17448 8423191 7141093 5899883 5145214 4654029 4264267 4050325 3780897 3520316 3738298
17439C738298o8317K2096m55514n3225j10353Q6689k87895K52241j17153Q969
17429C015836K09973l35391L64534j56758n0427k35892Q0546L3352m33338j11000
17419B381435J66919k38915K6913j65967n8734R1107K0456p394k40033k00455
17409A775332M36013j48278l6578K98168O4853j13664N6635K18210k01874L74094
17399B722911J28933j36860K18143J19298J08341J55992Q1895M51545J34828M20484
17389D405510N27437M75990K12289M55959K07795M08904J01194O6142l26028J31945
17379F667137l03339m8483m46617p3071J05580j52448R2201O6310L4496L46992
17369F288758K29989M69148J65294M28341L72255j09896k2555K1675j27932p4709
$$ plain form
17439 3738298 3669981 3692077 3236563 3183338 3072985 3159674 2871779 3124020 3006867 3015836
17429 3015836 3225809 2890418 3254952 3098194 3047767 2811875 2892421 2925773 2492435 2381435
17419 2381435 2548354 2309439 2336352 2170385 2111651 2202758 2223214 2215820 1975787 1775332
17409 1775332 2211345 2063067 2026489 2324657 2389510 2275846 2332481 2550691 2348817 2722911
17399 2722911 2851844 2714984 2933127 3052425 3160766 3316758 3398653 3850198 3985026 4405510
17389 4405510 4932947 5408937 5621226 6077185 6284980 6693884 6795078 6861220 6535192 6667137
17379 6667137 6363798 6315315 5868698 5795627 5901207 5748759 5840960 5907270 5941766 6288758
17369 6288758 6518747 6987895 7153189 7581530 7953785 7843889 7821334 7843009 7715077 7640368
17359G640368N7170l84662J24416o7914K16615k42817K55514J09095N12159L13052
17349H532996M71789N99953Q41433M8095P84882O75400K61979K79378L70169J75272
17339A3041346k14660m80565J3516k84609l20955m74449L6550j43999J58773j59609
17329A1171339K05176J02923L25940L77880Q5095M33359j31726J97646J49243
17320A2916875j78473k77910p8394k02608l84739m66164k58283n63586n0555l25958
17310A0130205k22434j55077m5358J12510n6248L81629M71632J08334K97225K21807
17300A1244225J58044j05943m593m9801o04967O1157k56521k02086l90709n7608
17290I791198j90692k7446r3875p9874K05341J29410q1701L0355J361p3726m13944
$$ plain form
17359 7640368 7697538 7312876 7437292 7369378 7585993 7343176 7598690 7707785 8219944 8532996
17349 8532996 9004785 9604738 10446171 10494266 11279148 11954548 12216527 12495905 12866074 13041346
17339 13041346 12826686 12346121 12359637 12075028 11754073 11279624 11316174 11172175 11330948 11171339
17329 11171339 11376515 11479438 11805378 12183258 12268353 12701712 12569986 12767632 12916875
17320 12916875 12738402 12460492 12382098 12179490 11794751 11328587 11070304 10506718 10456163 10130205
17310 10130205 9907771 9752694 9707336 9819846 9763598 10145227 10616859 10725193 11022418 11244225
17300 11244225 11402269 11296326 11291733 11241932 10636965 10698122 10441601 10239515 9848806 9791198
17290 9791198 9600506 9573060 9479185 9399311 9604652 9734062 9652361 9682716 9684077 9610351 9196407
17279I196407l05918k86011o71398l64179o47870k61011n62414q87362r7218k20562
17269D892464Q42o02373k00162K31898n69372l02547J08489N3933l27706J33645
17259C419111J18336l33146q8004l91600J11020J87688j14116O4362l14952m3455
17249B615244N6774O3838K46108j41548k41641j86373J38244r6590J94653J53335
17239B802044j71425q098j92731m0921J60049j16538k86211J81079N494m8506
17229B284236J35048j27538j24702R098K60302j65482J975K46812r5439j45767
17219B278543K53738j77561K44538J20716m48995J99567j47993J47713L0995O6586
17209B567847k04641J16859j12206O5266J75541j49028L07341l1067j31636N2560
$$ plain form
17279 9196407 8890489 8604478 7933080 7568901 6921031 6660020 6097606 5210244 5113026 4892464
17269 4892464 4893306 4290933 4090771 4322669 3753297 3450750 3559239 3613172 3285466 3419111
17259 3419111 3537447 3204301 3116297 2724697 2835717 3023405 2909289 2973651 2658699 2615244
17249 2615244 2672018 2735856 2981964 2840416 2598775 2412402 2550646 2454056 2648709 2802044
17239 2802044 2630619 2622521 2429790 2388869 2548918 2432380 2146169 2327248 2332742 2284236
17229 2284236 2419284 2291746 2167044 2176142 2436444 2270962 2272937 2519749 2424310 2278543
17219 2278543 2532281 2354720 2599258 2719974 2270979 2470546 2322553 2470266 2501261 2567847
17209 2567847 2363206 2480065 2367859 2433125 2608666 2459638 2766979 2735912 2604276 2656836
17199B656836L3909O1298n48184J34546n5963k94006N70379n04229j50113L3023
17189A937496P3461N3325R3975q8665n26044K51744L7761j62091l7457j06233
17179A527272L629K6772O1970j05031m1659K41968j58261K59390k83743K02923
17169A735230j28920N5203K540j09967K06692K4480Q2892k64151J39848p0589
17159A673258j21293J49989J58358k12062K56787J3503J2078L0309j07352j11086
17149A742489N3071o0440J78724M5999j03299m4526O9769O1690p9800p1321L16803
17138B109159k63039N7626N9968Q3179J2961p0961Q9447M0779j43693J1935j85841
17127A801520P0350J6483k20517M46970l22155L88011j65033L7833K81582m31803
$$ plain form
17199 2656836 2690745 2752043 2203859 2338405 2282442 1988436 2558815 2054586 1904473 1937496
17189 1937496 2010957 2064282 2158257 2069592 1543548 1795292 1833053 1670962 1633505 1527272
17179 1527272 1530901 1557673 1619643 1514612 1472953 1714921 1556660 1816050 1532307 1735230
17169 1735230 1606310 1661513 1664053 1554086 1760778 1785258 1868150 1603999 1743847 1673258
17159 1673258 1551965 1701954 1860312 1648250 1905037 1918540 1930618 1960927 1853575 1742489
17149 1742489 1795560 1735120 1913844 1959843 1856544 1812018 1881787 1943477 1863677 1792356 2109159
17138 2109159 1846120 1903746 1963714 2046893 2059854 1988893 2078340 2119119 1975426 1987361 1801520
17127 1801520 1871870 1888353 1667836 2114806 1792651 2180662 2015629 2053462 2335044 1903241
17117A903241K9750Q8911j52008L19329O221o5454O1652n631p3192L6143J07625
17106B256587k1102N1190K12098J23122j00743k25231q959J92742k68940l1184
17096B179580r0948N6772K5826k85032k55965n3857K15489k35591q4808k07515
17086A263951N9300J2610p9186r8990l3235Q5777O7376k70497K83185r5519O9696
17075A264468j92043j45512K71155L1752p8936o9125K28973k8079n1620k67916
17065I63117J92293J50320n3724l651Q8819J9109J37109q0663J40248j78793J61386
17054A535570K42292K2925R2180J50272J39998j90352J17826Q7855K69031o9735
17044B397862J2196Q6145k0185L39008J65444j27225k72397M42987j91631O0160
$$ plain form
17117 1903241 1932991 2021902 1869894 2189223 2195444 2129990 2191642 2186011 2112819 2148962 2256587
17106 2256587 2235485 2286675 2498773 2621895 2521152 2295921 2286962 2479704 2210764 2179580
17096 2179580 2088632 2145404 2171230 1886198 1630233 1576376 1791865 1556274 1471466 1263951
17086 1263951 1323251 1335861 1256675 1157685 1124450 1210227 1277603 1007106 1290291 1194772 1264468
17075 1264468 1072425 926913 1198068 1229820 1150884 1081759 1310732 1282653 1231033 963117
17065 963117 1155410 1305730 1252006 1248355 1337174 1356283 1493392 1412729 1552977 1374184 1535570
17054 1535570 1777862 1800787 1892967 2043239 2183237 1992885 2110711 2198566 2467597 2397862
17044 2397862 2410058 2496203 2476018 2815026 2980470 2853245 2580848 3023835 2832204 2892364
17034B892364k88344J14374j61892l6318j10240l16500p5578k90054P0024o5755
17024A732081r8601P7513j12168r4066j23319N9377j00887J02069M3539k53827
17014A231711j70629J52271q0258J42362M9400o3700j93816J73086J00654k11802
17004A129279l3247q8560P8463j07243K89347r145j57531J14100P806K6235l8872
16993A210632j22810J98305l74194J82886n7613l3086K2546J65929m8676J60146
16983A304065L569j68857J42161j51000M711J12854J72917r1989n1956j11792
16973A164683N56502l90333L04088j29629J47425J08888p4577P5033R3450K19818
16963B075348k6978N8609M3255P0116j11241K24887N5645K00849J20811j68427
$$ plain form
17034 2892364 2604020 2718394 2556502 2520184 2409944 2093444 2017866 1727812 1797836 1732081
17024 1732081 1633480 1710993 1598825 1504759 1381440 1440817 1339930 1441999 1485538 1231711
17014 1231711 1061082 1213353 1133095 1275457 1324857 1261157 1067341 1240427 1341081 1129279
17004 1129279 1096032 1007472 1085935 978692 1268039 1258894 1101363 1215463 1223269 1249504 1210632
16993 1210632 1087822 1286127 911933 1094819 1037206 1004120 1026666 1192595 1143919 1304065
16983 1304065 1307634 1138777 1280938 1129938 1134649 1247503 1420420 1328431 1276475 1164683
16973 1164683 1721185 1330852 1634940 1505311 1652736 1761624 1687047 1762080 1855530 2075348
16963 2075348 2048370 2106979 2150234 2220350 2109109 2333996 2389641 2590490 2711301 2542874
16953B542874K53785j19706k03395J22506l5959m7614m14590K11337k4780k11440
16943B073018o2075k69699K55371j6855m21324K40087j89568P4943k1360k30645
16933A431893j32373R4023q9969L8126m4844J39419R4574j83456j05264j37743
16923A104386O7355m6463k5354l1148j2202L79847m33187J35671O6542m5703j15486
16912A044258L2578j30887O4104L5357k7478k55283K32099o9491P8482J5006N1636
16901A070381J92345m90301L67966l08673m3942J24478j35246L649J22050j37017
16891G65690N4550J70664k83627R1791J32098j45850J09765q8544J59101M774
16881I70412k45866l642K14911j47556J56807O7228j34425J32636j79621J46382
$$ plain form
16953 2542874 2796659 2676953 2473558 2596064 2560105 2512491 2097901 2309238 2284458 2073018
16943 2073018 2010943 1741244 1996615 1979760 1558436 1798523 1608955 1683898 1662538 1431893
16933 1431893 1299520 1393543 1303574 1341700 1296856 1436275 1530849 1347393 1242129 1104386
16923 1104386 1171741 1125278 1099924 1068776 1056574 1436421 1003234 1138905 1205447 1159744 1044258
16912 1044258 1076836 945949 1010053 1045410 1017932 762649 994748 925257 1003739 1018745 1070381
16901 1070381 1262726 772425 1140391 831718 787776 912254 777008 780657 902707 765690
16891 765690 820240 990904 707277 799068 931166 785316 895081 806537 965638 970412
16881 970412 724546 720904 935815 788259 945066 1012294 877869 1010505 830884 977266
16871I77266O1272l25119j6345K00797J7403j19239K50492k07968J22092j46176
16861H14475r6615K08460m3311J71968O8952k14520Q013l0607j8537J04542K32045
16850A204865j17223j489r7838K2059k61012K06725q5948J77670J29724j82963
16840I94570K03252j85842Q7708Q330k3429q5008P1716n2278L7281K17202k9438
16829A244064n353j65597Q4407O8898j29632P4838J45426J05431j55130K98428
16819A565780k10755J60342R04Q9876N7054k8517j25686K97475k70742L5787J18362
16808A689880q6568k56629J12067L43171j78873Q9235Q57J70920m17013K31353
16798A698400j35672j55467j701J61348j14779M874N8762k35172K73l19657R9458
$$ plain form
16871 977266 1038538 713419 697074 897871 915274 796035 1046527 838559 960651 814475
16861 814475 717860 926320 883009 1054977 1123929 909409 917422 886815 868278 972820 1204865
16850 1204865 1087642 1086153 988315 1010374 749362 956087 870139 1047809 1177533 994570
16840 994570 1197822 1011980 1099688 1108018 1084589 999581 1071297 1019019 1056300 1273502 1244064
16829 1244064 1238711 1073114 1157521 1226419 1096787 1171625 1317051 1422482 1267352 1565780
16819 1565780 1355025 1515367 1516271 1606147 1663201 1634684 1508998 1806473 1535731 1571518 1689880
16808 1689880 1603312 1346683 1458750 1801921 1623048 1712283 1713140 1884060 1467047 1698400
16798 1698400 1562728 1407261 1405560 1566908 1452129 1457003 1515765 1280593 1280866 961209 1060667
16787A060667r80J83947j67837o0763n8007P9264l8508k3088k64435J92329l1473
16776H71116j07343J83424j25497n1945K9462J14966J68721M2659j81404K7911
16766I72070q2818k16525L96231K2142j21557N5113q2356j94303K39533r6715
16756H90815L36812l78703K10076K7834o1344J30370k13809N062q4699K09672
16746A072086l542J01323j32863R7891l56352K75628K6460j13989N5138Q7541
16736A109321j95705K4818K54791N73k8523n6397K4023k28264J70357J21374l9122
16725A157246o3881j99624J97690r6875q831L94611k66548j22770N6715K13393
16715A261126k17687j78691K61673m1080p5561K01873j16675m6480J61793q4527
$$ plain form
16787 1060667 1059687 1243634 1075797 1015034 957027 1036291 997783 974695 710260 902589 871116
16776 871116 763773 947197 821700 769755 799217 914183 1082904 1125563 944159 972070
16766 972070 889252 672727 1068958 1091100 969543 1024656 942300 747997 987530 890815
16756 890815 1227627 848924 1059000 1086834 1025490 1155860 942051 947113 862414 1072086
16746 1072086 1068544 1169867 1037004 1134895 778543 1054171 1080631 966642 1021780 1109321
16736 1109321 913616 938434 1193225 1193798 1165275 1108878 1132901 904637 1074994 1196368 1157246
16725 1157246 1093365 893741 1091431 994556 985725 1380336 1113788 991018 1047733 1261126
16715 1261126 1043439 864748 1126421 1085341 1009780 1211653 1094978 1048498 1210291 1125764
16705A125764P4841J98294R4342K2462J60526J22305k3741j08352j630j91665
16695A473146L67887l55182L14828K00745m31935J77770p828m5394L03071k60264
16685A736844K51293k29437k15856J72586Q9388k62423J33668j58526j74449K89699
16675A632787k00689j83722k5137O2880J84966J37790l64503J35024K6238L53284
16665A758918R1038K8703J21885q0098R7119k34368p3741o8747K18442K3263j7269
16654A865145K38463K00857q7766j66539J72684j42878l05245q366j88039K8792
16644A607108j28271j23867M1426J34400l58963N2438k29016q2553k10508K33452
16634I35646R2658j58082j8115J51593j11641p7551n4112j3970J88150q8188M0844
$$ plain form
16705 1125764 1200605 1398899 1493241 1515703 1676229 1798534 1774793 1666441 1664811 1473146
16695 1473146 1841033 1485851 1800679 2001424 1569489 1747259 1739431 1694037 1997108 1736844
16685 1736844 1988137 1758700 1542844 1715430 1804818 1542395 1676063 1517537 1343088 1632787
16675 1632787 1432098 1248376 1223239 1286119 1471085 1608875 1244372 1379396 1405634 1758918
16665 1758918 1849956 1878659 2000544 1920446 2017565 1783197 1709456 1640709 1859151 1882414 1865145
16654 1865145 2103608 2304465 2216699 2050160 2222844 2079966 1774721 1766355 1578316 1607108
16644 1607108 1478837 1354970 1396396 1530796 1171833 1224271 995255 912702 702194 935646
16634 935646 1028304 870222 852107 1003700 892059 814508 760396 746426 934576 846388 887232
16623H87232M3861p5575j03947K20655J18098j2077j96683J35379M0561L705p6656
16612I84553L23038k93512O006R4723r2221J0650O3858K48644P6873j08328J5169
16601A329453j95160L61942k66976k55605M01816j92767L55921j03891j0615J0392
16591A434510j5279K94744l16519p8521O39573m61510J59852J85860l97499K77372
16581A722583l70156K5529j0364J86073J573k53340J94388p6677j64194K4355
16571A279770j27905J46689m1743J35858j14708J1714p8348J11207K783k3026
16561A302291j76299L45500j1755N6197q3409l9488J11764n6140J74449n5149
16551A567961O1565j65308R7015L7561N8049R1275j894j1525M8207j02017j29351
$$ plain form
16623 887232 931093 855518 751571 972226 1090324 1078247 881564 1016943 1057504 1061209 984553
16612 984553 1307591 1014079 1020085 1114808 1022587 1033237 1097095 1345739 1422612 1314284 1329453
16601 1329453 1134293 1496235 1229259 973654 1375470 1182703 1538624 1434733 1424118 1434510
16591 1434510 1419231 1713975 1397456 1318935 1958508 1496998 1656850 1842710 1445211 1722583
16581 1722583 1352427 1377956 1367592 1553665 1555238 1301898 1496286 1419609 1255415 1279770
16571 1279770 1151865 1298554 1256811 1392669 1277961 1289675 1211327 1322534 1325317 1302291
16561 1302291 1125992 1471492 1459737 1515934 1432525 1393037 1504801 1448661 1623110 1567961
16551 1567961 1629526 1464218 1561233 1598794 1656843 1748118 1746224 1734699 1782906 1680889 1551538
16540A551538Q8112m693k12691L96107l09430J28111L47092k23576J62659o2089
16530A861140q1457J58523j57931M46989j26754k5154K18035J82139k04112N1500
16520B322918K272J00983Q4538j24340L717L1377j44537L33362k07875J46663
16510B549078Q3272m3477N428P60J65609o953J20847n2543K5961J84820J65994
16499C198796p3145k9031K52148k48790o5700L09218J15542p5876K90354k58645
16489C414871L17539K6988o8003L12384Q1614J34947N55703K28837K48839K5303
16479E279022L49112O27708J30604K49111K65010N72253N21133N03662M52890
16470H950505O95700P27116M61468J216078P82835J198692J378559J486697J643294
$$ plain form
16540 1551538 1639650 1634957 1422266 1818373 1508943 1637054 1984146 1760570 1923229 1861140
16530 1861140 1779683 1938206 1780275 2227264 2100510 2075356 2293391 2475530 2271418 2322918
16520 2322918 2325190 2426173 2510711 2386371 2390088 2421465 2276928 2610290 2402415 2549078
16510 2549078 2632350 2588873 2594301 2595061 2760670 2753717 2874564 2822021 2847982 3032802 3198796
16499 3198796 3125651 3096620 3348768 3099978 3034278 3343496 3459038 3383162 3673516 3414871
16489 3414871 3732410 3759398 3691395 4003779 4085393 4220340 4776043 5004880 5253719 5279022
16479 5279022 5628134 6255842 6386446 6635557 6900567 7472820 7993953 8497615 8950505
16470 8950505 9646205 10373321 10834789 12050867 12833702 14032394 15410953 16897650 18540944
16461A8540944J377918J825469J907828K294491K412365K680769K917201L145876
16453C7102861L879554M457840N511394O183590O541483O201137O011014O012404
16445H1901277N639663O380135O634286P052234P300483P856713Q597663Q933536
16437A40295990P417786N192482M549840N112489M757318M922544M521930L756851
16429A80527230K892044K511634K488625J536192P18393j07488o44413j156270
16421A88765947j437923k359256k437031l119976l482648m145585n152142o039080
16413A60592306o886208o854969p321089p443605p259535p400241p861624q129414
16405A01435621q180902q328847q316992q515188q705445q436902q280083q420961
$$ plain form
16461 18540944 19918862 21744331 23652159 25946650 28359015 31039784 33956985 37102861
16453 37102861 40982415 45440255 50951649 57135239 63676722 69877859 75888873 81901277
16445 81901277 87540940 93921075 100555361 107607595 114908078 122764791 131362454 140295990
16437 140295990 147713776 152906258 157456098 162568587 167325905 172248449 176770379 180527230
16429 180527230 183419274 185930908 188419533 189955725 190674118 190566630 189922217 188765947
16421 188765947 187328024 184968768 182531737 179411761 175929113 171783528 166631386 160592306
16413 160592306 153706098 146851129 139530040 132086435 124826900 117426659 109565035 101435621
16405 101435621 93254719 84925872 76608880 68093692 59388247 50951345 42671262 34250301
16397C4250301p653994p055493o247000m129834j509902K032549O604342J2156167
16389B8447136J7024565J7090881J2501637O580496J794577j504624m447899o436559
16381G1050210p984279r401512j4153936A9115142e457738k7564970l0629461
16374f3652169k7954139j6959336k49162J7601268L2369502b0575562A4661077
16366D2418512J8623680J0953831N290636J7269l607073o313390o973429p138888
16358E3271148o789712o422975n960176m851828m070553m035093l315054k854275
16350A4971482k348818k126259j731455j641933j032514j077606p30328r25643
16342C356926o68300n30521o50906k12001n31247k99717N8834b2493D41O2707
$$ plain form
16397 34250301 26596307 19540814 13293814 9163980 7654078 9686627 16290969 28447136
16389 28447136 45471701 62562582 75064219 81644715 83439292 81934668 77486769 71050210
16381 71050210 63065931 53664419 39510483 19115142 -5457738 -33022708 -63652169
16374 -63652169 -91606308 -108565644 -108814806 -91213538 -58844036 -20575562 14661077
16366 42418512 61042192 71996023 77286659 77303928 73696855 67383465 60410036 53271148
16358 53271148 46481436 40058461 34098285 29246457 25175904 21140811 17825757 14971482
16350 14971482 12622664 10496405 8764950 7123017 6090503 5012897 4282569 3356926
16342 3356926 2688626 2158105 1507199 1295198 763951 464234 523068 -22493 441 63148
16332F3148f1406l630C0250M4652J30345L64404A34142K27902l2231K71933m5417
16321E56329J88203J51238j27790K57490J6950R7568m4207M3677l8347J4598j0910
16310A104799k46138n7753N0444J17139r5802J13026L425n5261M4494J70027n39713
16299F08687L64216N5502j6759K47176m17527n1436L61433O3904k39271o5824
16289I10101L91671k69230l4301j47411N8864q934o0168J1752J86317l53766j7610
16278F67285j053j87316J05191J88015j55863P6920r911J9982j08104k199J41685
16267G34632j83136R9500j09727J44553k30656R0621N1421J0100J76090j64658
16257F18740K34022l75796J69412J1967K8455O8682q6458M4665j10071J25181
$$ plain form
16332 63148 -61406 -65036 30250 74902 205247 569651 134142 362044 329813 601746 556329
16321 556329 744532 895770 767980 1025470 1042420 1139988 1095781 1139458 1101111 1115709 1104799
16310 1104799 858661 800908 851352 968491 872689 985715 989140 933879 978373 1148400 608687
16299 608687 972903 1028405 1011646 1258822 841295 789859 1151292 1215196 975925 910101
16289 910101 1301772 1032542 998241 850830 909694 900760 840592 852344 1038661 684895 667285
16278 667285 666232 478916 584107 772122 616259 693179 683268 703250 595146 592947 734632
16267 734632 551496 650996 541269 685822 455166 545787 597208 607308 783398 618740
16257 618740 852762 476966 646378 658345 686800 755482 669024 713689 603618 728799
16247G28799k76494L4909r8226k2226J30442L82231k76648k0678L35066N7997
16237I75172j30407l47073L11643K39692r2241j69914O445j57586K9318K46774
16227I11823R399j11240l7835j0753j0278P4732J8794j35420O4444k36147Q4029
16216F21548K62566j16582M1622p819K4787Q6766k47540J04155J16237J27773
16206A013513q5104j2321J47648j60499j23140J74600J14732k21058R9138j4890
16196I32619j4376P17k29722J83366k8625r3048k8605M742l8574J56312m0290
16185H04516L5461j44346m1022k27052K29073l7300Q6356q4245o3168o6434R8269
16174E90108j18936J52141M9623q8179J03743m9967P5440K01370k60400j43641
$$ plain form
16247 728799 452305 487214 388988 366762 497204 879435 602787 582109 917175 975172
16237 975172 844765 497692 809335 1049027 956786 786872 793317 635731 665049 911823
16227 911823 921222 809982 772147 761394 751116 825848 844642 709222 773666 537519 621548
16216 621548 884114 767532 809154 801335 826122 912888 665348 769503 885740 1013513
16206 1013513 928409 916088 1063736 903237 780097 954697 1069429 848371 947509 932619
16196 932619 918243 918960 689238 872604 843979 750931 722326 727068 688494 844806 804516
16185 804516 839977 695631 654609 427557 656630 619330 705686 621441 558273 491839 590108
16174 590108 471172 623313 672936 584757 688500 638533 713973 915343 654943 511302
16164E11302M219J85470r2871M2844j00697K2732j72557L47088j88353J911k5427
16153E35661J12510B96964K82256J3718k3517k4139J82667p5731q2871M524j2565
16142E61306P8960J81317j12004J52155l1625k37560J72273j12974Q2600m6592
16132F87856m1846J05757j00238J24265n9564j51622l1583K09169j59339J29782
16122G12637j26091J54673J97399l50114L5162K81453l81106L17948D06336L01265
16112G07601J12331k77575N8875R1367r7505J3123J42771Q677J6726J81727m9572
16101I08546J05457k61991K03542q9141J04689r9262L9587J48436j04856J11981
16091A066988K2612O160l11123K03868l77025M25828o0939r7379J21657j02580
$$ plain form
16164 511302 515521 700991 608120 650964 550267 572999 400442 747530 559177 561088 535661
16153 535661 648171 296964 579220 592938 569421 545282 727949 652218 569347 573871 561306
16142 561306 640266 821583 709579 861734 830109 592549 764822 651848 734448 687856
16132 687856 646010 751767 651529 775794 716230 564608 533025 742194 582855 712637
16122 712637 586546 741219 938618 588504 623666 905119 524013 841961 406336 707601
16112 707601 819932 542357 601232 692599 595094 608217 750988 759665 776391 958118 908546
16101 908546 1014003 752012 955554 866413 971102 871840 911427 1059863 955007 1066988
16091 1066988 1089600 1095760 784637 988505 611480 1037308 976369 878990 1000647 898067
16081H98067j51837J90129n8573K3821o444J78411j78378J60947l886k99754N1585
16070H04088J78996K5605J60791q7236J52796l3231l4710r7231Q0995J38315M9867
16059A339045k00586K9596J12956n5612j35888Q6699Q9193j9636J23564K3966
16049A393297j01210L25524l89554J72731j29752m1961J89372L0774q0472j83441
16039A185308m700K85943O3463n0458J62165j28195j69122J23423J1810K1363
16029A501000L85696j73737J4336p5108K9601J33185j06601k4227j32766J51004
16019A702383N4087O030j55630K61783k66302M03603k08395J55243K06350k21873
16009A937279k6442K0771m0288J14586l34764L83458j80248J98380J29766j53850
$$ plain form
16081 898067 746230 936359 877786 901607 895163 1073574 895196 1056143 1052257 752503 804088
16070 804088 983084 1008689 1169480 1082244 1235040 1201809 1167099 1069868 1150863 1289178 1339045
16059 1339045 1138459 1168055 1281011 1225399 1089511 1176210 1265403 1245767 1369331 1393297
16049 1393297 1292087 1617611 1228057 1400788 1271036 1229075 1418447 1449221 1368749 1185308
16039 1185308 1180608 1466551 1530014 1479556 1641721 1513526 1344404 1467827 1479637 1501000
16029 1501000 1886696 1712959 1727295 1652187 1681788 1814973 1708372 1684145 1551379 1702383
16019 1702383 1756470 1762500 1606870 1868653 1602351 2005954 1797559 1952802 2159152 1937279
16009 1937279 1910837 1931608 1891320 2005906 1671142 2054600 1874352 2072732 2202498 2048648
15999B048648L0388l1430P2769m56521N51717j08203j28583q9087J65324J11796
15989B166818k60642J70411r4282j86743R0089J80032r9908J02562L04788m00987
15979A972138J60196J01609j21008L39J64987l38498L52155N5354l42668K12436
15969B217040p4907m0343o3584K42885k43221N6179J33823k11188J14863j31008
15959B000539j20435J31192J81424j19457O3429k57124K14108J6423J4176j84490
15949A939785J72336K38666k11332j07022J70840O8245k34086K62633r3882K13334
15939B419517j65960K08848J24850k02400j08953n8171K52649K33998k13527J55748
15929B646599R8463k13437K66479j29540L23167r4582O9812L96687l3363K58118
$$ plain form
15999 2048648 2079036 2047606 2120375 1663854 2215571 2107368 1978785 1889698 2055022 2166818
15989 2166818 1906176 2076587 1982305 1795562 1885651 2065683 1965775 2068337 2373125 1972138
15979 1972138 2132334 2233943 2112935 2113274 2278261 1939763 2291918 2347272 2004604 2217040
15969 2217040 2142133 2101790 2038206 2281091 2037870 2094049 2227872 2016684 2131547 2000539
15959 2000539 1880104 2011296 2192720 2073263 2136692 1879568 2093676 2110099 2124275 1939785
15949 1939785 2112121 2350787 2139455 2032433 2203273 2271518 2037432 2300065 2206183 2419517
15939 2419517 2253557 2462405 2587255 2384855 2275902 2217731 2470380 2704378 2490851 2646599
15929 2646599 2745062 2531625 2798104 2668564 2991731 2897149 2966961 3363648 3330285 3588403
15919C588403J74426J71156J69878L16217J06549M18557O79207N52434Q57354
15910G034181P65646J481910J993649L155197M090012N830810O618498P717746
15902C8687649Q623123P003798N451154L251250J51345k217901m081963n400709
15894E1467746o136796o091012n772534n086697m493795m205728l323684k888410
15886A3469090k003861k012304j525862j202722q44619j090763n98059k92227
15878C898673m35208k60701K790l82065k91352J70326j69663J72362l38958J52991
15868B519195J03528j82431R7135k32199O8643j33139j29258J64332j9302R2166
15858B348670j18940j37484N3966k4834o954k6154n8320N7964L1283q1986J77027
$$ plain form
15919 3588403 3762829 3933985 4103863 4420080 4526629 4945186 5624393 6176827 7034181
15910 7034181 7799827 9281737 11275386 14430583 18520595 24351405 30969903 38687649
15902 38687649 47310772 54314570 59765724 63016974 63168319 60950418 56868455 51467746
15894 51467746 45330950 39239938 33467404 28380707 23886912 19681184 16357500 13469090
15886 13469090 11465229 9452925 7927063 6724341 5879722 4788959 4190900 3898673
15878 3898673 3463465 3202764 3205554 2823489 2532137 2702463 2532800 2705162 2366204 2519195
15868 2519195 2622723 2440292 2537427 2305228 2373871 2240732 2111474 2275806 2256504 2348670
15858 2348670 2229730 2092246 2146212 2121378 2114424 2088270 2029950 2087914 2119197 2037211 2214238
15847B214238P7016j15068k73995P3730J36864j99857K26022j31161k4680M3029
15837B026138K70708j96563J65019j73275K00761N7668L7891k98302J79604j0904
15827B258745m6455k13622J31499R4111k14888J76773k20649J3987J30345n8101
15817B051745m0535J99595j10216J5667m0607J8408M9825j18724J82138J02121
15807B309417p4859K0707R303J67472j31631p7543J42379L36027k52658L03223
15797B751837k039j90228M71779j18873K00001Q5539L1454J36509j75621j57407
15787C032951M40941L666l49477L55964J78062K3362L96760K3639K45144k02279
15777D148733M97216m40781N98911l11108p167L19032k98943K99009k48086m3083
$$ plain form
15847 2214238 2291254 2176186 1902191 1975921 2112785 1912928 2138950 2007789 1983109 2026138
15837 2026138 2296846 2100283 2265302 2092027 2292788 2350456 2388347 2090045 2269649 2258745
15827 2258745 2212290 1998668 2130167 2224278 2009390 2186163 1965514 1979501 2109846 2051745
15817 2051745 2011210 2210805 2100589 2116256 2075649 2094057 2143882 2025158 2207296 2309417
15807 2309417 2234558 2255265 2264568 2432040 2300409 2222866 2365245 2701272 2448614 2751837
15797 2751837 2749798 2559570 3031349 2912476 3112477 3198016 3229470 3365979 3190358 3032951
15787 3032951 3473892 3477558 3128081 3484045 3662107 3685469 4082229 4105868 4351012 4148733
15777 4148733 4645949 4205168 4804079 4492971 4485804 4804836 4505893 4804902 4556816 4513733
15767D513733O3295k5855J85803J49808L8644L12444j86087j01269Q1792j09770
15757D922538j70472K72152p4151k91215K1989J90030L4803m9851o3597j47687
15747D644539L92594J13412P693K21750J00129J31081J60551K41082J47318J04675
15737F264824L64037r495J68305j67610o1436M5881o0361L33757J56301k9914
15727G004289L56361J24510j46945j51059j18863k73980j66020j86007J62226
15718F604512j09004l16137J92517M1961j65836K82907j91567k73827k71765N7405
15708E851166p8970J9150M8654q9010J60399K32718J37002L26130M283K24994
15698F836516L0344j00070L42082j52709K66931j44157J78846j45595J31647K4230
$$ plain form
15767 4513733 4577028 4551173 4736976 4886784 4925428 5237872 5051785 4950516 5032308 4922538
15757 4922538 4752066 5024218 4950067 4658852 4680841 4870871 4905674 4855823 4792226 4644539
15747 4644539 5037133 5150545 5158238 5379988 5480117 5611198 5771749 6012831 6160149 6264824
15737 6264824 6628861 6619366 6787671 6620061 6558625 6604506 6544145 6877902 7034203 7004289
15727 7004289 7360650 7485160 7338215 7187156 7068293 6794313 6628293 6442286 6604512
15718 6604512 6495508 6179371 6371888 6413849 6248013 6530920 6339353 6065526 5793761 5851166
15708 5851166 5772196 5791346 5840000 5750990 5911389 6144107 6281109 6607239 6611522 6836516
15698 6836516 6866860 6766790 7108872 6956163 7223094 7078937 7257783 7112188 7243835 7268065
15688G268065k32881k39448P5163Q9816m3630m04071J67778J08525j15717J20053
15678F793653l17157J19102k54844j48799O8845m36788P5579O4896n4389k93376
15668E616722K88883J2541M8738p6181J72621N22044N3823L51904M82344K34749
15658G708188J20918L07047M21358K86923M92464P41926N88335M46713O43272
15649A1757144P12867N10779N18950M70220O39633O62020J92618R88143O16736
15640A7069110Q11948Q96611R31888J041926Q13740P89599L57756k329n7043L72028
15630B3025234m15712k72653r3207J07404r8671K18580J71259J27176k40063l58874
15620B2170473n96944m90885j056752q43740j093197o96694p68416r05728q27266
$$ plain form
15688 7268065 7035184 6795736 6870899 6960715 6917085 6513014 6680792 6789317 6673600 6793653
15678 6793653 6476496 6595598 6340754 6191955 6260800 5824012 5899591 5964487 5910098 5616722
15668 5616722 5905605 5918146 5966884 5890703 6063324 6585368 6639191 6991095 7473439 7708188
15658 7708188 7829106 8136153 8557511 8844434 9336898 10078824 10667159 11113872 11757144
15649 11757144 12470011 12980790 13499740 13969960 14609593 15271613 15464231 16452374 17069110
15640 17069110 17881058 18777669 19709557 20751483 21565223 22354822 22712578 22710249 22653206 23025234
15630 23025234 22609522 22336869 22243662 22351066 22252395 22470975 22642234 22769410 22529347 22170473
15620 22170473 21573529 21082644 20025892 19182152 18088955 17392261 16623845 15718117 14890851
15611A4890851m01996k22069o40184l87157p38467j57120o41626k17001k39079
15602A1246152j66209m99795l35161R6913l29852k13385m5074K25468J87401M14917
15592A0581375R47951J477770K766353N096959Q210847J1770577J1364887R615377
15584F1832096N525324J689627j420741l667348o416635q838051q601467n248010
15576C4854795m104635n847586m980220k933155k225164j412185j938268r83844
15568A0429738n31881n93910l78930J5505j9440J44866P2098o9218L57634L36682
15558I763144R57790J090121K479569M423776P609370J2285212J5410929J4922098
15550F8942009J1421575N390749J091278k652008o189862r492146j1808315j0482384
$$ plain form
15611 14890851 14488855 14266786 13626602 13239445 12500978 12343858 11702232 11485231 11246152
15602 11246152 11079943 10580148 10244987 10341900 10012048 9798663 9753589 9979057 10166458 10581375
15592 10581375 11529326 13007096 15773449 20870408 29081255 40851832 52216719 61832096
15584 61832096 67357420 69047047 67626306 63958958 57542323 48704272 40102805 34854795
15576 34854795 30750160 24902574 19922354 16989199 14764035 13351850 11413582 10429738
15568 10429738 9897857 9303947 8925017 8940522 8921082 9065948 9138046 9068828 9426462 9763144
15558 9763144 10720934 11811055 14290624 18714400 26323770 38608982 54019911 68942009
15550 68942009 80363584 85754333 86845611 84193603 78003741 68511595 56703280 46220896
15542D6220896o248942n868003p773913n646414l691299k607926j950136j932103
15534A0502160j519888j014986q29754o54943k47500m89404q6567l51146j63948
15525E144024l53943K4278j4343j09655l20972j56102j15082J21145r3105J15511
15515D241756j48517L12473k9114J17040j80361L62494j32496m9083M23722n5534
15505D862380n9694J87992j24461l16523M9528j09712r434k31805J93514r2898
15495D348887o0843L13029l31748J26649J42004J7200m7857J07713L20931j82632
15485D753333J41215L70393j18618L54904K87249J79722K13450m0833M5825q4575
15475F102065J27598o3997L36343J5663L03464N35592P91172O03589P93847N34149
$$ plain form
15542 46220896 39971954 34103951 26330038 20683624 16992325 14384399 12434263 10502160
15534 10502160 8982272 7967286 7137532 6482589 6235089 5745685 5659118 5307972 5144024
15525 5144024 4790081 4814359 4800016 4690361 4369389 4213287 4098205 4219350 4126245 4241756
15515 4241756 4093239 4405712 4376598 4493638 4313277 4675771 4543275 4494192 4917914 4862380
15505 4862380 4802686 4990678 4866217 4549694 4599222 4489510 4480076 4248271 4441785 4348887
15495 4348887 4288044 4601073 4269325 4395974 4537978 4555178 4507321 4615034 4935965 4753333
15485 4753333 4894548 5264941 5146323 5501227 5788476 5968198 6181648 6140815 6186640 6102065
15475 6102065 6229663 6165666 6502009 6517672 6821136 7356728 8147900 8751489 9545336 10079485
15465A0079485M75886J65529r5692N0828n70030j84220m33569J49448j83578K41088
15455I695175L78063M09770N55274L02904L86472K13813j7405k03057k8238q97511
15445A0795260k04605m71184j92684k52882l32692K84955L5872o4190J15617K47083
15435I960550j23065k78479l77063j17669l11200j70893k56174j38472n59856
15426G627679J44334l88859p8735p7231l20691l01894k37345n510j51296l48397
15416E862055j00657J18353m13100P032j13426n2693j74139j10190J7902L43773
15406E384910k60228q1599O6674K55343l49004J40770L9008J85925K12322l7835
15396E556286R7449J2470O4399k08881J00021q3292k25301o173K94722l20212
$$ plain form
15465 10079485 10555371 10720900 10625208 10676036 10106006 9921786 9488217 9637665 9454087 9695175
15455 9695175 10073238 10483008 11038282 11341186 11727658 11941471 11924066 11721009 11692771 10795260
15445 10795260 10590655 10119471 9926787 9673905 9341213 9626168 9662040 9597850 9713467 9960550
15435 9960550 9837485 9559006 9181943 9064274 8753074 8582181 8326007 8187535 7627679
15426 7627679 7772013 7383154 7304419 7227188 6906497 6604603 6367258 6361748 6210452 5862055
15416 5862055 5761398 5879751 5466651 5473683 5360257 5307564 5133425 5023235 5041137 5384910
15406 5384910 5124682 5043083 5109757 5365100 5016096 5156866 5195874 5381799 5594121 5556286
15396 5556286 5653735 5666205 5730604 5521723 5621744 5538452 5313151 5306978 5601700 5281488
15386E281488J20121p9699K34449k50364j1711R1578o233J21882j49813J42483
15376E494181q4619j06822K1484J61289j09525P1351M2932K67715l30558J58018
15366E585446j40686J86186k2592K12335J49591R9753J01606j804K12998M1782
15356F424615O1414J65657L67167J89804K45519L97751N69572N93833J417220
15347A0432552K351511L439647N459676O701042O628032M894940K818242O88873
15339D3414515m38017k337136l870550m451815l802685k329818k516690k521740
15331B1146064k057098r98658j491550p73124j275032o87503o22104m16699j75984
15322A2648312n2172K45009r1849M31682J11040O13956Q07278J716987K892515
$$ plain form
15386 5281488 5401609 5321910 5556359 5305995 5294284 5385862 5379629 5501511 5351698 5494181
15376 5494181 5409562 5302740 5324224 5485513 5375988 5447339 5490271 5757986 5427428 5585446
15366 5585446 5444760 5630946 5608354 5820689 5970280 6070033 6171639 6169835 6382833 6424615
15356 6424615 6486029 6651686 7018853 7208657 7454176 7851927 8421499 9015332 10432552
15347 10432552 12784063 16223710 21683386 28384428 35012460 39907400 42725642 43414515
15339 43414515 42976498 40639362 36768812 32316997 28514312 26184494 23667804 21146064
15331 21146064 19088966 18090308 16598758 15825634 14550602 13863099 13240995 12824296 12648312
15322 12648312 12596140 12841149 12749300 13180982 13292022 13905978 14713256 16430243 19322758
15313A9322758M940813Q393802J0970855J1670483J0957490P822930L692477L65191
15305G8136799l503963o043191q017958q676625p184142o330384n868300n343220
15297B7169016l896764l324936k104597j404182j337742r69076n66332m05576
15289A3159811k09763k10183r6589k81076r6040M9754K3663K05798P97590Q95548
15279A4238513K150698L839287N328275O149878N869624M299965J872611J02964
15271D3851815j386751k573219m104978m668911l803596k617778k850883k978279
15263A8867420k280960j586788j555365j393038j057329q47152m80935j18966
15255I546887k13783J53779q4452M3071L63173K38406P3312j86306Q7191K3678
$$ plain form
15313 19322758 24263571 32657373 43628228 55298711 66256201 74079131 77771608 78136799
15305 78136799 74632836 68589645 60571687 51895062 44710920 38380536 32512236 27169016
15297 27169016 23272252 19947316 17842719 16438537 15100795 14131719 13565387 13159811
15289 13159811 12950048 12739865 12643276 12362200 12266160 12315914 12339577 12545375 13342965 14238513
15279 14238513 16389211 20228498 25556773 31706651 37576275 41876240 43748851 43851815
15271 43851815 42465064 39891845 35786867 31117956 27314360 24696582 21845699 18867420
15263 18867420 16586460 14999672 13444307 12051269 10993940 10146788 9665853 9546887
15255 9546887 9333104 9486883 9402431 9445502 9808675 10047081 10120393 9934087 10021278 10044956
15245A0044956K05470j62494k90439l65921l95649n0485p7588O530P1325M5310
15235I031015K05158L32961M31511O41992L06270L46898P3126J68521l40457k51039
15225A0945956l98852k48715j95304j32166l31239j35426j26879J91473J0052
15216I578900m8904K97458L58290M73349J72129J55134J63335l99983j27326n34584
15206A0087798n12405m64527k65371n70994l33925l45191l61753l36327j64151
15197F733154j09178j71394k20602Q5406J69237k64639O1956K57429O9766J80202
15187F791337j72760J50216J14704R1372j42161J69543Q2921Q041J29496L17252
15177G539961J995K74148J08652n2691M3125J61864J00835Q0671k54456J2923
$$ plain form
15245 10044956 10250426 10087932 9797493 9431572 9035923 8985438 8907850 8914380 8985705 9031015
15235 9031015 9236173 9569134 10000645 10642637 10948907 11295805 11368931 11537452 11196995 10945956
15225 10945956 10547104 10298389 10103085 9970919 9639680 9504254 9377375 9568848 9578900
15216 9578900 9529996 9827454 10185744 10659093 10831222 10986356 11149691 10749708 10622382 10087798
15206 10087798 9575393 9110866 8845495 8274501 7940576 7595385 7233632 6897305 6733154
15197 6733154 6623976 6452582 6231980 6317386 6486623 6221984 6283940 6541369 6611135 6791337
15187 6791337 6618577 6768793 6883497 6974869 6832708 7002251 7085172 7093213 7222709 7539961
15177 7539961 7541956 7816104 7924756 7872065 7915190 8077054 8177889 8258560 8004104 8017027
15167H017027J64648j41843J10803j06834j52623N6461K02823m88402L84900K61820
15157H308780k64781K07751J39137k2022k6769N9065K8613j52380Q5930j17254
15147H246070k10895J96604l00291J07113L5013j21274Q2353j42747K86695o6808
15137H111833J34235j84998O5223k0345p10p0494m7168q781Q4825k09517J72218
15126H026321p4041O678K60376m3335q1985j95084m0063k5414q5293k07752J1281
15115G551689R4442k82897J80436J45803k01383K45420L7270P5758p6796K99361
15105H069103k82479J87297J95704Q3850J02058K32765P00130p2643K09279L05231
15095I730295R4741L93386M77773L62419P00698J152593J538892K200916K600328
$$ plain form
15167 8017027 8181675 8039832 8150635 8043801 7891178 7947639 8150462 7662060 8046960 8308780
15157 8308780 8043999 8251750 8390887 8368865 8342096 8401161 8429774 8277394 8363324 8246070
15147 8246070 8035175 8231779 7931488 8038601 8073614 7952340 8034693 7891946 8178641 8111833
15137 8111833 8246068 8061070 8126293 8105948 8105238 8034744 7987576 7978795 8063620 7854103 8026321
15126 8026321 7952280 7958958 8219334 8175999 8094014 7898930 7858867 7833453 7748160 7540408 7551689
15115 7551689 7646131 7363234 7543670 7689473 7488090 7733510 7770780 7846538 7769742 8069103
15105 8069103 7786624 7973921 8169625 8253475 8355533 8588298 9288428 9215785 9425064 9730295
15095 9730295 9825036 10218422 10696195 11058614 11759312 12911905 14450797 16651713 19252041
15086A9252041K475371K142662J385998O00451O0419q68212q82297j272709p74237
15077B2119487m47178k37824N69215J382330K060777K672398J797530J275560
15069C1192295M95021J6149p32585j084588q86334l80572J223032K594920L393682
15060C5831020L844318L006556J658732J413178P67367N51035j02277o50717J39313
15051D6458525P91620M06611J23014J298245K067580K129244J641690J231942
15043E6148471J99435J83455o03556n24935j149759j724226j749691j812059k568670
15034D6398465k692910k791243j779397j292674n12552J305873K115216K932411
15026D3683189K762106J863765J439731R07716M94641K77234Q73413J900015L746808
$$ plain form
15086 19252041 21727412 23870074 25256072 25856523 25916942 25048730 24166433 22893724 22119487
15077 22119487 21672309 21434485 22003700 23386030 25446807 28119205 29916735 31192295
15069 31192295 31687316 31703465 30970880 29886292 28999958 28619386 29842418 32437338 35831020
15060 35831020 39675338 42681894 44340626 45753804 46521171 47072206 46969929 46319212 46458525
15051 46458525 47250145 47656756 47779770 49078015 51145595 53274839 54916529 56148471
15043 56148471 56347906 56531361 55927805 55402870 54253111 52528885 50779194 48967135 46398465
15034 46398465 43705555 40914312 39134915 37842241 37329689 38635562 40750778 43683189
15026 43683189 46445295 48309060 49748791 50656507 51151148 51428382 52301795 54201810 57948618
15017E7948618N008414N387725O017058P543429P360308O879074N967041N809198
15009A07920865N482019M493591L996101K344741J230931k36743j737610l975648
15001A19518247m391910n521622n313271m720782m649305m542285m236193m201716
14993H1941163m428463l743302m100977l972238m255220l693264k944522j656857
14985E3146320m39601n27280j29694n10592j80214q09550j473240k005009k335456
14976D4735684k768691k495060k643349k675381k187127j390810j067704j157871
14968B8349691n74475m25809M1690k51385K83195L84790R22655N18350J092682
14959C0341384J177955K105344K996228M364941O415273R128667J2450814J6228759
$$ plain form
15017 57948618 62957032 68344757 74361815 81905244 89265552 96144626 102111667 107920865
15009 107920865 113402884 117896475 121892576 124237317 125468248 125231505 123493895 119518247
15001 119518247 115126337 109604715 104291444 99570662 94921357 90379072 86142879 81941163
14993 81941163 77512700 73769398 69668421 65696183 61440963 57747699 54803177 53146320
14985 53146320 52706719 52179439 52049745 51539153 51358939 50549389 49076149 47071140 44735684
14976 44735684 41966993 39471933 36828584 34153203 31966076 30575266 29507562 28349691
14968 28349691 27775216 27349407 27391097 27139712 27422907 27807697 28730352 29248702 30341384
14959 30341384 31519339 33624683 36620911 40985852 47401125 56529792 68980606 85209365
14951H5209365K0581602K3752241K6080931K8475633K9184294K8658558K6910164
14944B68852788K3982102J7636536R513015J84940q800367j5499598j7670716
14937B78198700j7671759j9298810j9802708j6339272j3828863j4048785j3873671
14930A63334832j2883023j1702441j1755344j0698796r884278r613142q055157
14923H8742651n445408l555631j679187j432809k255110l580352m290501n058531
14915F1445122n998284o876102o970661n474695m358019l978534m029890k680711
14907B1078226k339659j522494q95933p08759k21682k23008N40489M22962J170262
14898A7300404R69133J466783K005187K774704M373144M935094M641483L355558
$$ plain form
14951 85209365 105790967 129543208 155624139 184099772 213284066 241942624 268852788
14944 268852788 292834890 310471426 319984441 320169381 311369014 295869416 278198700
14937 278198700 260526941 241228131 221425423 205086151 191257288 177208503 163334832
14930 163334832 150451809 138749368 126994024 116295228 106410950 96797808 88742651
14923 88742651 83297243 79741612 78062425 76629616 74374506 70794154 66503653 61445122
14915 61445122 55446838 48570736 41600075 36125380 31767361 27788827 23758937 21078226
14907 21078226 18738567 17216073 16320140 15611381 15389699 15166691 15707180 16130142 17300404
14898 17300404 18269537 19736320 21741507 24516211 28889355 33824449 38465932 41821490
14890D1821490J663648K27900j227679k268282l285588m041370l294232l129751
14882B6466136k535497k104227k017039q94116j046954m56452l2745m52127N59595
14873A7486574O32551P23295N95732J67579J76025J59829J72366k97100M8043
14864A9864894K29880J95667R00807J045041K111785L683717N166938P904705
14856D1103434Q785009Q879998R206392P486931N235461K094626j562874m219431
14848G7009546n892560o653230p620938p633136o893942n511514m809149m198360
14840B7796717l135532k415567j810286j440175j028265j027166q23253o46282
14832A5470191n60446j64068p2079R1015J04648M03492K73094Q42296P08502Q80835
$$ plain form
14890 41821490 43485138 43713038 42485359 40217077 36931489 32890119 29595887 26466136
14882 26466136 23930639 21826412 19809373 18915257 17868303 17411851 17379106 16926979 17486574
14873 17486574 18119125 18842420 19438152 19605731 19781756 19941585 20113951 19816851 19864894
14864 19864894 20094774 20290441 21191248 22236289 24348074 28031791 33198729 41103434
14856 41103434 49888443 58768441 67974833 75461764 80697225 82791851 81228977 77009546
14848 77009546 71116986 64463756 56842818 49209682 42315740 36804226 31995077 27796717
14840 27796717 24661185 22245618 20435332 18995157 17966892 16939726 16116473 15470191
14832 15470191 14909745 14745677 14673598 14764613 14869261 15272753 15545847 16388143 17096645 17977480
14822A7977480P60678J989956K889325M675952O281527P898289O971828N264356
14814E4709391K587188M14632j892003l778085n174663o163918n290176m604119
14806C0808247m115735l842204k956072k504801j358416j535217j021161p24958
14798A2749683l76667r78039k58378k97920l42683o12541k6587l40908k93527
14789I222433J79935l33722m8047k09546j23014P4819J11340M7676M87187K47687
14779I656748L45524M86279J114411N10391N96512L06024O1940l24826j10397
14770A2642606o23034m68705o07179n42309j36632n22552k24393j68642N8426
14761I407586j76673j61358K26824M28702j54722N04735r1525K29161K45937J20874
$$ plain form
14822 17977480 18738158 20728114 23617439 28293391 34574918 42473207 49445035 54709391
14814 54709391 57296579 57711211 55819208 52041123 46866460 40702542 35412366 30808247
14806 30808247 26692512 22850308 19894236 17389435 16031019 14495802 13474641 12749683
14798 12749683 12373016 11394977 11136599 10838679 10495996 9883455 9856868 9515960 9222433
14789 9222433 9402368 9068646 9020599 8811053 8688039 8762858 8874198 8921874 9409061 9656748
14779 9656748 10002272 10488551 11602962 12113353 12709865 13015889 13077829 12753003 12642606
14770 12642606 12019572 11550867 10943688 10401379 10264747 9742195 9517802 9349160 9407586
14761 9407586 9230913 9069555 9296379 9725081 9570359 10075094 9983569 10212730 10458667 10579541
14751A0579541L1896L56539L73882J94480J6936L39136J85004K18640k2178M14927
14741A2688803L81854N14247N01696R26266P58857J780837J967489K463908L343729
14732B5327686N215204P617751J1342640J6943741K4095961K9259796L2242706
14725A52045485L0837651K5602300J6600726O384494m074696j3326982j9909230
14718A94159748k2767603k3964704k3902662k1192717j7909810j5472949j3089824
14711E5859479j0086512p717954o150314n176584l814546l376191k355360k110853
14703A5071165j578532j284427j256903n79857n90894p74306k96025l51114k63445
14694H095662l80558K25119j25879J16629j34421Q417p5423j0455N4461j51888
$$ plain form
14751 10579541 10611437 10967976 11341858 11536338 11553274 11892410 12077414 12296054 12273876 12688803
14741 12688803 13070657 13584904 14086600 15012866 15771723 17552560 19520049 21983957 25327686
14732 25327686 30542890 38160641 49503281 66447022 90542983 119802779 152045485
14725 152045485 182883136 208485436 225086162 231470656 227395960 214068978 194159748
14718 194159748 171392145 147427441 123524779 102332062 84422252 68949303 55859479
14711 55859479 45772967 38055013 31904699 26728115 22913569 19537378 17182018 15071165
14703 15071165 13492633 12208206 10951303 10371446 9780552 9006246 8710221 8359107 8095662
14694 8095662 7715104 7940223 7814344 7930973 7796552 7804969 7729546 7719091 7773552 7621664
14684G621664Q0453L66356n066J85161K51357O1631M57363K72098L24036Q70665
14674A0485718Q23539O92365L61903K50477r9877o49297q07952o01635q08740
14665I646501l96613j85787l95854J20402q952k66114l33019j90928l61940l89534
14655G238162k00734m32819J01972l38837j82969n0913J38806j28114M84178m825
14645F623907K22218L00267M13426J80581j59149K50724K40416M01269L70048
14636H843707L46294R33789P83042L61190K51969J22822K4197j008856o69270
14627I988884p06560r79558q98668p18170m75491m79792n20567k96757k62564
14618D650757M4676o4120j88251j62647K7576k55995J8678J7582Q5316j91551
$$ plain form
14684 7621664 7702117 8068473 8063407 8248568 8499925 8561556 9018919 9291017 9615053 10485718
14674 10485718 11309257 12001622 12363525 12614002 12514125 11864828 11056876 10455241 9646501
14665 9646501 9249888 9064101 8668247 8788649 8779697 8513583 8180564 7989636 7627696 7238162
14655 7238162 7037428 6604609 6706581 6367744 6184775 6133862 6272668 6144554 6628732 6623907
14645 6623907 6846125 7146392 7559818 7740399 7581250 7831974 8072390 8473659 8843707
14636 8843707 9190001 10123790 10906832 11268022 11519991 11642813 11667010 10658154 9988884
14627 9988884 9282324 8302766 7404098 6685928 6210437 5730645 5210078 4913321 4650757
14618 4650757 4695433 4631313 4443062 4280415 4307991 4051996 4070674 4088256 4173572 3982021
14608C982021k20160J71764l50812K81694K7961P4326K7819L45343M81300O62288
14598E483544M36110R78263P58530P61211N59525k09043k9512n39910m30608p84205
14588F983905o08959l65872m49841n56014k95894m24756P5812m1006j09339k54598
14578C953438K89466j9729J10866l27911K21233N2091L2215K65732j88990L51911
14568D740322O12864M4151O99586L43872Q12997P22793Q18238J300245J493494
14559A1588562L098860M577150O988403P385153O546737L930250J777374j82699
14551D5709790j853055l740090m707889n045733l405507j968030j883470j07373
14543B2998643K299184N469575O767223O713168M965809K489784J75805j901893
$$ plain form
14608 3982021 3761861 3933625 3582813 3864507 3892468 3966794 3994613 4339956 4821256 5483544
14598 5483544 5919654 6897917 7656447 8417658 8977183 8768140 8738628 8198718 7768110 6983905
14588 6983905 6374946 6009074 5559233 5003219 4707325 4282569 4358381 4317375 4208036 3953438
14578 3953438 4242904 4223175 4334041 4006130 4227363 4279454 4311669 4577401 4388411 4740322
14568 4740322 5353186 5397337 6096923 6440795 7253792 7976585 8794823 10095068 11588562
14559 11588562 14687422 19264572 26252975 33638128 40184865 44115115 45892489 45709790
14551 45709790 43856735 40116645 35408756 30363023 26957516 24989486 23106016 22998643
14543 22998643 25297827 30767402 37534625 44247793 49213602 51703386 51879191 49977298
14535D9977298l220527n373919n821366n010522l644042l114940l226409k092580
14527A8472993j131307j119754p32117p48574p81707n04961J2723P62492K141089
14518A6370877L803001N125765M863402M411186K261448R40472m85659j285643
14510C6004849k638324k855029k790741j339981n99413q78600Q03912K259074
14502B7965747L658678M354104L814845K063447N85313o16718j716069k782505
14494C7326842l716460m335231k919541k262628k665697k805132k244464j841448
14486A4536241j665856j638174j756056j126051j149481q98155m58210p49340
14478E094918j55366k05533k56604m0084j68887l13326M70638O8879N88679M46825
$$ plain form
14535 49977298 46756771 41382852 35561486 30550964 26906922 23791982 20565573 18472993
14527 18472993 17341686 16221932 15489815 14741241 13959534 13454573 13467296 14229788 16370877
14518 16370877 20173878 25299643 30163045 34574231 36835679 37776151 37290492 36004849
14510 36004849 33366525 30511496 27720755 26380774 25781361 24902761 25706673 27965747
14502 27965747 31624425 35978529 39793374 41856821 42442134 41825416 40109347 37326842
14494 37326842 33610382 29275151 26355610 24092982 21427285 18622153 16377689 14536241
14486 14536241 12870385 11232211 9476155 8350104 7200623 6302468 5844258 5094918
14478 5094918 4939552 4734019 4477415 4437331 4268444 3955118 4425756 4494635 5083314 5530139
14468E530139M56885M30693N15145J08440N6915n1145j74158k5823k06892K44022
14458F884221M36516M97638O73558K31965K44323N057m94819j71423m19682n92320
14448G295034l32537P4688k02386J48081j35585L15512K73633n8692N28106o1645
14438G844209J23046L05341K49368q8449N65704O1476L15751L47665J219569J500937
14428A2444617K388782L849664M996559N427073N541251L992747K467539J045287
14420D2153519n94102j948017l227718l624598l317252l470608l015524l069870
14412A9885830k718642k006840j897117j277036j026509o96054n13819o81742
14404I068071m25000N7132k75912m99044M40962J55400N5440J45959O56321J103260
$$ plain form
14468 5530139 5987024 6417717 6932862 7041302 7098217 7047072 6872914 6847091 6640199 6884221
14458 6884221 7320737 7818375 8491933 8723898 8968221 8973278 8478459 8307036 7887354 7295034
14448 7295034 6962497 7037185 6834799 6982880 6847295 7162807 7436440 7377748 7905854 7844209
14438 7844209 7967255 8272596 8521964 8433515 8999219 9060695 9376446 9724111 10943680 12444617
14428 12444617 14833399 18683063 23679622 29106695 34647946 38640693 41108232 42153519
14420 42153519 41559417 39611400 36383682 32759084 29441832 25971224 22955700 19885830
14412 19885830 17167188 15160348 13263231 11986195 10959686 10263632 9749813 9068071
14404 9068071 8643071 8700203 8424291 7925247 8366209 8521609 8577049 8723008 9379329 10482589
14394A0482589J289046K205122L800184N347144P175098Q722405R418005Q148245
14386E6587838O065600L521586O55169k271449m247800o061219o646029o531175
14378D1072521n850383n311119n144725m016105k879732k693305j825186j404937
14370A1947029j463465r53427l39361o61140l40271l76149j87185k85529j46297
14361G194205p0852P7906O55906N90678O86395J276994J806888K481868L205749
14352A7905737L524033L774626L401187K592563J225141M8569j184115j611944
14344B9675797k752848k683891k515437k244381j876230j283377q76294l80892
14336A5062447Q22268J764655K756244L099326L072752K331432K239384K128416
$$ plain form
14394 10482589 11771635 13976757 17776941 23124085 30299183 39021588 48439593 56587838
14386 56587838 62653438 66175024 66830193 64558744 60310944 54249725 47603696 41072521
14378 41072521 35222138 29911019 24766294 20750189 17870457 15177152 13351966 11947029
14370 11947029 10483564 9530137 9190776 8529636 8189365 7813216 7626031 7340502 7194205
14361 7194205 7123353 7201259 7857165 8447843 9134238 10411232 12218120 14699988 17905737
14352 17905737 21429770 25204396 28605583 31198146 32423287 32471856 31287741 29675797
14344 29675797 26922949 24239058 21723621 19479240 17603010 16319633 15443339 15062447
14336 15062447 15884715 17649370 20405614 23504940 26577692 28909124 31148508 33276924
14328C3276924K634439L770942M193613O650575R600774J1471338J0997419J0996389
14320I3592413Q460203M612389M67335l480489p393483q950017r900559r149766
14312F8258026q930826q225481p543876o816395n338548m734492m111327l561484
14304A8995597k808074k466535j932797j400016j357512j004338q50357q84195
14296F291773l68954k04347o42641k41776J9442m41464k73562k36720j98157j90504
14286C513090P2487k40553n6046N9418j95912O4035R5420m9173M2945k47536J33268
14275C191443J203L01586M9316P262j4675j32381r3683k8602L9313k36640j91361
14264B892781J5652k67077J14534P2156k14533J19384l54417J30463J28301l53692
$$ plain form
14328 33276924 35911363 39682305 43875918 50526493 60127267 71598605 82596024 93592413
14320 93592413 102052616 106665005 107132340 103651851 96258368 87308351 77407792 68258026
14312 68258026 59327200 51101719 43557843 36741448 31402900 26668408 22557081 18995597
14304 18995597 16187523 13720988 11788191 10388175 9030663 8026325 7175968 6291773
14296 6291773 5922819 5718472 5075831 4834055 4853497 4412033 4138471 3901751 3703594 3513090
14286 3513090 3585577 3345024 3288978 3348396 3152484 3216519 3311939 3262766 3305711 3058175 3191443
14275 3191443 3192646 3494232 3543548 3550810 3536135 3403754 3310071 3281469 3320782 3084142 2892781
14264 2892781 2908433 2641356 2755890 2828046 2613513 2732897 2378480 2508943 2637244 2283552
14254B283552j17274J74744R0073n0669O6399k01952K9346j7981L0312j17429
14244B169121k2297J8007j36664L11199k39470P2073O8974J81794j42171J04106
14234B384672N6526Q8797k10242Q6440l05504K03285j80828J01916l32834Q1673
14224A973901M138k70092J05235L36815j44633m6253P4785J94788j01583L16580
14214B443681j81596k2818J75743J08730n56546N17689J89368M08341P10933K83455
14204D076980M38724M5620J6853k22146l45470j65806p03231k55105k9282m6182
14194B810955o61079J03109P8690j57636M3357k65079K43726J751j22352J47649
14184B223091l74078K74560q6465j58749P89J13556p0908J415L74895p7694J07657
$$ plain form
14254 2283552 2166278 2341022 2431095 2380426 2446825 2244873 2274219 2256238 2286550 2169121
14244 2169121 2146824 2164831 2028167 2339366 2099896 2171969 2240943 2422737 2280566 2384672
14234 2384672 2441198 2529995 2319753 2406193 2100689 2303974 2123146 2225062 1892228 1973901
14224 1973901 1978039 1707947 1813182 2149997 2005364 1959111 2033896 2228684 2127101 2443681
14214 2443681 2262085 2239267 2415010 2523740 1967194 2484883 2674251 3082592 3793525 4076980
14204 4076980 4515704 4561324 4578177 4356031 4010561 3844755 3141524 2886419 2857137 2810955
14194 2810955 2149876 2252985 2331675 2174039 2217396 1952317 2196043 2197794 2075442 2223091
14184 2223091 1849013 2123573 2037108 1878359 1879148 1992704 1921796 1923211 2298106 2220412 2328069
14173B328069J56445K2891J7058o4527j58441k47688j50937J65007j91793K30579
14163B106663k91754L27230k54574P8831j16751K22831n7732K1117K09165l66468
14153A878558L03149k87319L38735J31411l33558L14661k9796j6963K30741l8476
14143B491143J27556L05255L01787M59827R22453R53663J292581J224019O32921
14134H711205M75570L45986j77495m01215q12750r19296p44001o41842n12756
14125E323406o91544o29885k01404l13359k24578L11296L81538n0305J81517K0289
14115D106971J24040P9357j80997k92792k60495j59175m00068p259k48618n2366
14105B708598K8720l9787J82581l76872K8976L18587K00204N90M81639L74071
$$ plain form
14173 2328069 2484514 2507405 2524463 2459936 2301495 2053807 1902870 2067877 1876084 2106663
14163 2106663 1814909 2142139 1887565 1966396 1849645 2072476 2014744 2035861 2245026 1878558
14153 1878558 2181707 1894388 2233123 2364534 2030976 2345637 2315841 2298878 2529619 2491143
14143 2491143 2618699 2923954 3225741 3685568 4608021 5561684 6854265 8078284 8711205
14134 8711205 9186775 9532761 9355266 8954051 8141301 7222005 6478004 5836162 5323406
14125 5323406 4631862 4001977 3800573 3487214 3262636 3573932 3955470 3905165 4086682 4106971
14115 4106971 4231011 4310368 4129371 3836579 3576084 3416909 3016841 3009582 2760964 2708598
14105 2708598 2737318 2697531 2880112 2503240 2532216 2850803 3051007 3051597 3533236 3907307
14095C907307M50655J71095L27191O1265P1589L9l54746j85130n1005q3258Q8340
14084D403342M657M48698M25765L93122M60454L66359O3028l04895O7249l36610
14074E991169l56937j15760l48595m2975J95056l32408K25750r3434J65554M31287
14064E718707L72599K88009O43119M23482Q63109J159850Q68350J466520J412354
14055A3216099K026217J743411K414035L229846M411684N776905P784130R869399
14047E0471726J2226063J3746386J3216463J1318226P293236L025599j461208
14040A09836491n803021q699148j0272271j0105180r458685r064871q222156p983600
14032D0227559o058729n244306m609100l719431l100582k676092j884007j791839
$$ plain form
14095 3907307 4357962 4529057 4856248 4917513 4989102 4989141 4634395 4449265 4398260 4315002 4403342
14084 4403342 4407999 4856697 5282462 5675584 6136038 6502397 6565425 6260530 6327779 5991169
14074 5991169 5634232 5518472 5169877 5126902 5321958 4989550 5215300 5121866 5287420 5718707
14064 5718707 6091306 6379315 7022434 7445916 8309025 9468875 10337225 11803745 13216099
14055 13216099 15242316 16985727 19399762 22629608 27041292 32818197 40602327 50471726
14047 50471726 62697789 76444175 89660638 100978864 108272100 111297699 109836491
14040 109836491 104033470 95334322 85062051 74956871 65498186 56433315 48211159 40227559
14032 40227559 34168830 28924524 24315424 20595993 17495411 14819319 12935312 11143473
14024A1143473j345965j129779r38683q98946k04567p09972n22110l60763l20446
14015D712242j63019m15934K7576l46071j95283p4642l36652L8811j12855J0605
14005C144778k52589J39149j30687P3403j82694j75833J48093m5959J05809J3959
13995B837429l3703M7719j32629L21585o7455p7918K19669L48339L39996M14625
13985D217657M45526P49775N97871R19142O21090M59206N05596N1046m38801j85220
13975G942888j79675r31148m40171p09800m63102n17988o78847k6742k86662r0995
13965C617758r663k45781j25789L9196j61101j23244j06041m8286j86971j91572
13955B458506j75479K20751k36890J46689K1263J30476k2177J24104K65384Q5083
$$ plain form
14024 11143473 9797508 8667729 7729046 6830100 6625533 5915561 5393451 5032688 4712242
14015 4712242 4549223 4133289 4160865 3814794 3619511 3544869 3208217 3247028 3134173 3144778
14005 3144778 2892189 3031338 2900651 2974054 2791360 2615527 2763620 2717661 2823470 2837429
13995 2837429 2803726 2851445 2718816 3040401 2972946 2895028 3114697 3463036 3803032 4217657
13985 4217657 4663183 5412958 6010829 6929971 7551061 8010267 8515863 8566909 8128108 7942888
13975 7942888 7763213 6832065 6391894 5682094 5218992 4701004 4022157 3995415 3708753 3617758
13965 3617758 3608095 3362314 3236525 3275721 3114620 2991376 2885335 2837049 2650078 2458506
13955 2458506 2283027 2503778 2266888 2413577 2434840 2565316 2543139 2667243 2932627 3017710
13945C017710L91843L20937K1557J45552N44438O90102J627473K055506L155806
13936A1970924K738652L357678K868447K399572J276282j29566r07835j799599
13928B1774555k321350k408098k634994k371037j826807k001566j293339j156910
13920E760454j056633o32516o78941o09907l46945N516j27078j32268m59259L26105
13910B048528l43892J61918o2282j49443J16035j8181l89602L54630j69428N78
13900A548861o8641j09251J33981R6262j46414J57975m7965j34304K64028k86539
13890A407993K85430q4229N0925l6823J44832k05461J51881o6174j05770k5921
13880A516683N0157M2777k30767K06383j85024j5783o6649K69278l18722K60297
$$ plain form
13945 3017710 3409553 3730490 3752047 3897599 4442037 5132139 6759612 8815118 11970924
13936 11970924 14709576 18067254 20935701 23335273 24611555 24481989 23574154 21774555
13928 21774555 19453205 17045107 14410113 12039076 10212269 8210703 6917364 5760454
13920 5760454 4703821 4071305 3392364 2782457 2435512 2441028 2313950 2181682 1722423 2048528
13910 2048528 1704636 1866554 1804272 1654829 1770864 1752683 1363081 1717711 1548283 1548861
13900 1548861 1480220 1370969 1504950 1601212 1454798 1612773 1564808 1430504 1694532 1407993
13890 1407993 1693423 1609194 1660119 1623296 1768128 1562667 1714548 1648374 1542604 1516683
13880 1516683 1566840 1609617 1378850 1585233 1400209 1384426 1317777 1587055 1268333 1528630
13870A528630J02965L0805J6668J56529j42016k10442J75565J12110j75900j01724
13860A493190J03697R3569k8428J44700j50494q3581R7150j33173J96608k4046
13850A709192P6262k10418K8814K77569k7622k47630P9445L46531j59013K3108
13840A896238l59549K09477m9077j31370j0722O7158j3926j02127j18091J96747
13830A584758r3141j03251L49157m86454K13243m7101j65884L46251j07455j16868
13820A373255k2663L00445k94249L6533J76871k42922j37878N3377M368J56436
13810A403573k98413L61351l6860j00713j25541K5162J91183r3119j24566O5053
13800A267110K97556l10299K82353k7853J607j25439J19926M2222j10544J55989
$$ plain form
13870 1528630 1631595 1662400 1679068 1835597 1693581 1483139 1658704 1770814 1594914 1493190
13860 1493190 1596887 1690456 1662028 1806728 1656234 1572653 1669803 1536630 1733238 1709192
13850 1709192 1785454 1575036 1603850 1881419 1853797 1606167 1685612 2032143 1873130 1896238
13840 1896238 1536689 1746166 1697089 1565719 1554997 1622155 1608229 1506102 1388011 1584758
13830 1584758 1491617 1388366 1737523 1251069 1464312 1417211 1251327 1597578 1490123 1373255
13820 1373255 1350592 1651037 1356788 1393321 1570192 1327270 1189392 1242769 1247137 1403573
13810 1403573 1105160 1466511 1429651 1328938 1203397 1228559 1419742 1326623 1202057 1267110
13800 1267110 1564666 1254367 1536720 1508867 1510474 1385035 1504961 1547183 1436639 1592628
13790A592628l53524K42929j15678j16174Q989K49006j52582k3040N5818p4365
13780A314007l0706K4406m8290J22226l91885K57273Q8700k5423Q2782J08487
13770A501577j38191J89814j54031J47795j59654n4924K68409k29680R7436J70757
13760A639308j14773L34520k04602K26624n8291J40081J121l14622J70193k04325
13750A615234J95091k91121J11952j9950J15707k16073Q9384P7092j83419K222
13740A496119k587J71220k9885j37603L53197k01821q749l67842L40958r0316
13730A522691O3874K391J01356M3936k85946R3572J11751M9430l9986l3618J97681
13719A827132l27714J9864J46627p2930M11372k27993J84202k6689O1579j43916
$$ plain form
13790 1592628 1239104 1482033 1366355 1250181 1259170 1508176 1355594 1332554 1388372 1314007
13780 1314007 1283301 1307707 1259417 1381643 989758 1247031 1335731 1310308 1393090 1501577
13770 1501577 1363386 1553200 1399169 1546964 1387310 1332386 1600795 1371115 1468551 1639308
13760 1639308 1524535 1859055 1654453 1881077 1822786 1962867 1963988 1649366 1819559 1615234
13750 1615234 1810325 1519204 1631156 1611206 1726913 1510840 1600224 1677316 1493897 1496119
13740 1496119 1493532 1664752 1634867 1497264 1850461 1648640 1639891 1272049 1613007 1522691
13730 1522691 1586565 1588956 1690312 1734248 1448302 1541874 1653625 1703055 1663069 1629451 1827132
13719 1827132 1499418 1519282 1665909 1592979 2004351 1776358 1960560 1933871 1995450 1851534
13709A851534r3882K65352j05660j02193Q7341P4328J10447J5433k52268p7499
13699A772933M3105J40298l1097L0243J04638L2243K48312K92341J2167N9215
13689B704398K371o4597q8337n1586k41403k4471k07064q2899n866j17415K82039
13678B105170k1176j23962Q501l4048O9119k68613O0754j06795K20612Q5065K51072
13667B245699L4685m2355J30543q2252N06603l245J21043P7391M3262j35245R5455
13656B991584k08608r079k89999j6392j956k47489m94k10927J39630p5982J20318
13645B190606j80411q5994J81793l45764M58203k51867j35478J03827L9073J80899
13635B154887p5583L43719j10205L34130L09914N4274r7460r4526m3767l26374
$$ plain form
13709 1851534 1757652 2023004 1917344 1815151 1902492 1976820 2087267 2102700 1850432 1772933
13699 1772933 1816038 1956336 1925239 1955482 2060120 2092363 2340675 2633016 2645183 2704398
13689 2704398 2706769 2642172 2553835 2502249 2260846 2236375 2029311 1946412 1940546 1823131 2105170
13678 2105170 2083994 1960032 1968533 1934485 2003604 1734991 1795745 1688950 1909562 1994627 2245699
13667 2245699 2280384 2238029 2368572 2286320 2792923 2789678 2910721 2988112 3031374 2896129 2991584
13656 2991584 2782976 2773897 2483898 2467506 2465550 2218061 2217567 2006640 2146270 2070288 2190606
13645 2190606 2010195 1924201 2105994 1760230 2218433 1966566 1831088 1934915 1973988 2154887
13635 2154887 2079304 2423023 2312818 2646948 2956862 3011136 2913676 2819150 2775383 2449009
13625B449009P2459M2459q155l09981O5335l97016J19544p8317j3183j14116n0076
13614A777962j91614L61679N9016k69750K21818j66212N76658k86292n9830K60040
13604B283475j83956O0849k63224Q5872J69757j56295k8876j90457M27553m27604
13594A777094L5800o5080J92643L5784R6520k9501J08375Q3902j67825j95597
13584A872115j7561J27007R0560j86305j47763o2263L0417K20536k65833m8400
13574A612510n0859p314K179O2895j7121Q3734k31342L71987n5608J7668l13516
13563A475213L29248r9915k95139K71427O5785j29150p8481P6767q6767n9646
13553A469342j35051P2228K65372k68595L22496k4842O0913j64404o621p207L08389
$$ plain form
13625 2449009 2521468 2563927 2555772 2245791 2311126 1914110 2033654 1955337 1942154 1828038 1777962
13614 1777962 1586348 1948027 2007043 1737293 1959111 1792899 2369557 2083265 2023435 2283475
13604 2283475 2099519 2160368 1897144 1983016 2152773 1996478 1967602 1777145 2204698 1777094
13594 1777094 1812894 1747814 1940457 1976241 2072761 2043260 2151635 2235537 2067712 1872115
13584 1872115 1854554 1981561 2072121 1885816 1738053 1675790 1706207 1926743 1660910 1612510
13574 1612510 1561651 1554337 1556516 1619411 1602290 1686024 1454682 1826669 1771061 1788729 1475213
13563 1475213 1804461 1704546 1409407 1680834 1746619 1617469 1538988 1615755 1528988 1469342
13553 1469342 1334291 1406519 1671891 1403296 1725792 1700950 1761863 1597459 1590838 1583631 1892020
13542A892020K42333j17220M49532k07304J7876K13807o3532k95506k3332j35505
13532A973169J23309j80691j52928P2027k043n4888K91192K87384l08371K34243
13522B282403Q7215P5312n4979j34909o0372j88292K3032k74708K8373n5121j99352
13511A528602j49698k5052Q4813J43381k54968J58008l5457k53058K5854J17591
13501A340016J1329K0703j84029p0734J58813J686j55831K77072q5661N1049j65052
13490A199361M4055k0542J44873j25572k5700J1417K7380L7316k3426J9924l6543
13479A252543Q9130L3454N4883j77658K2006j10547J68437j45366L72210l49155
13469A209937J43770j87375J49631j54928J13627Q5793o5457K16509r0665k8458
$$ plain form
13542 1892020 2134353 2017133 2466665 2259361 2277237 2491044 2427512 2132006 2108674 1973169
13532 1973169 2096478 1915787 1762859 1834886 1832843 1777955 2069147 2356531 2048160 2282403
13522 2282403 2369618 2444930 2389951 2255042 2194670 2006378 2029410 1754702 1783075 1727954 1528602
13511 1528602 1378904 1353852 1438665 1582046 1327078 1485086 1449629 1196571 1222425 1340016
13501 1340016 1351345 1372048 1188019 1117285 1276098 1277784 1121953 1399025 1313364 1364413 1199361
13490 1199361 1243416 1222874 1367747 1242175 1216475 1227892 1255272 1292588 1269162 1289086 1252543
13479 1252543 1341673 1375127 1430010 1252352 1274358 1163811 1332248 1186882 1559092 1209937
13469 1209937 1353707 1166332 1315963 1161035 1274662 1360455 1294998 1511507 1420842 1392384
13459A392384j40362mQ2187m2053K45087J1381J22645J57386M5962J93427L49503
13448B417543N2552j20746O033o8023j51981m4301j56360j62290J20919j63167
13438A730179l3860l41753K25193m9555j20488K05172j74493Q7825n4715k16560
13428A256945L27598l7417J57729k38900M4588J71493K56755Q0943p212K79330
13418B291852p0554J85839M5002q2577m5711j16626n0041n5071p3669j64074l33003
13407A531367J21558m7439p2806L13871m82524R1360j12264K50490L9908o1994
13397A571527K87958l26507K23817n658j91681J40510J19567J94522P3069Q8845
13387B175969l91948K25533L63613l23212K24260j2887j03135K11823J05587r4141
$$ plain form
13459 1392384 1252022 1252018 1334205 1292152 1537239 1548620 1671265 1828651 1874613 2068040 2417543
13448 2417543 2470095 2349349 2355382 2287359 2135378 2091077 1934717 1772427 1893346 1730179
13438 1730179 1696319 1354566 1579759 1530204 1409716 1614888 1440395 1528220 1473505 1256945
13428 1256945 1584543 1547126 1704855 1465955 1510543 1682036 1938791 2019734 2012522 2291852
13418 2291852 2221298 2407137 2452139 2369562 2323851 2207225 2157184 2102113 2028444 1864370 1531367
13407 1531367 1652925 1605486 1532680 1846551 1364027 1455387 1343123 1593613 1633521 1571527
13397 1571527 1859485 1532978 1756795 1751137 1559456 1699966 1819533 2014055 2087124 2175969
13387 2175969 1784021 2009554 2373167 2049955 2274215 2261328 2158193 2370016 2475603 2381462
13377B381462j08253k8361J692j5311l3981J37550j63782m36062M28007j80485
13367A982476l18572N74806L6734j49899J16737j85098P8394L2110k25899J33928
13357B075717m8767P1324K78411k95774Q9281J33898p0949P9489o2070K25832
13347B476392k45690K12914k41092j36890j8168O6912J001l6973k28406J17038
13337A967038J65196j55643J01943j7469j02795P7519J23782m9197n3743r632
13327B046999k71097M03320k14570j14148L30140J52048r6834q5695M8757j76283
13317B022637K83696j76025r180K06551J51014K72659m0602q0180L27226j04509
13307B853287L5941j61369p8736K37235l43004O9421J99747k92383M30020q6397
$$ plain form
13377 2381462 2273209 2244848 2246540 2231229 2197248 2334798 2171016 1734954 2162961 1982476
13367 1982476 1663904 2238710 2275444 2125545 2242282 2057184 2135578 2167688 1941789 2075717
13357 2075717 2026950 2098274 2376685 2080911 2170192 2304090 2233141 2312630 2250560 2476392
13347 2476392 2230702 2443616 2202524 2065634 2047466 2114378 2115379 2078406 1850000 1967038
13337 1967038 2132234 1976591 2078534 2061065 1958270 2035789 2159571 2110374 2056631 2046999
13327 2046999 1775902 2179222 1964652 1850504 2180644 2332692 2235858 2150163 2198920 2022637
13317 2022637 2306333 2130308 2121128 2327679 2478693 2751352 2710750 2630570 2957796 2853287
13307 2853287 2889228 2727859 2649123 2886358 2543354 2612775 2812522 2520139 2950159 2863762
13297B863762K96566j09251J74188L46394k55319J24169l22491p3239j6157O2530
13287C091152r0924j71322L82077m15929M12286q4717j05127M3762M3702J02300
13277C207260J3282j03151J07560J43077j50215O8565K91194M4627l48615J32549
13267C406133o923P4907K79207j77239M9106K45987k29415K32649J1653j26404
13257C759661K92607j33095L93452p9220L86558k58358K94886O211J98814J86667
13247E048183n1503K05367j00916K33608J82431k02633R982L51414m9097j02708
13237E524128K55967l6756J15377n8701K25495J15679L6228L14751j71857L30695
13227F651006M6025O5283J83466J70075L09833K46663m11600L74901J20586M4840
$$ plain form
13297 2863762 3160328 3051077 3225265 3571659 3316340 3440509 3118018 3044779 3028622 3091152
13287 3091152 3000228 2828906 3210983 2795054 3207340 3122623 3017496 3061258 3104960 3207260
13277 3207260 3220542 3117391 3224951 3368028 3217813 3286378 3577572 3622199 3273584 3406133
13267 3406133 3399210 3474117 3753324 3576085 3625191 3871178 3641763 3874412 3886065 3759661
13257 3759661 4052268 3919173 4312625 4233405 4619963 4361605 4656491 4662702 4861516 5048183
13247 5048183 4996680 5202047 5101131 5334739 5517170 5314537 5324519 5675933 5626836 5524128
13237 5524128 5780095 5743339 5858716 5800015 6025510 6141189 6177417 6492168 6320311 6651006
13227 6651006 6697031 6762314 6945780 7115855 7425688 7672351 7260751 7635652 7756238 7801078
13217G801078P5152q3561j90220K53485l4675j71935p1905P8434k28077N6393
13207G484169r2610j6308m6562k31970J85386m8957k5501M9853m36717L89070
13197G209853k21357k7993J19859n4981k08518J87314j72538r9343J12165j7291
13187F827170m07949j61019J8641j30885P4410m76835K56881k24096n6123k23610
13177E496585J85411l99307P1581r5312K42445m07341R2847k87445L75898r7989
13167E177373P6505j2421j38306Q44O0178M70661P0046J42108j96587N79988M7095
13156F277484M96435n0063k47108Q5015K60173N2670p0339m3025k88496J38899
13146F611645k07663O4281n8369k5122q4225J42610q0802k14678n9707l62723
$$ plain form
13217 7801078 7876230 7792669 7602449 7855934 7821259 7649324 7577419 7655853 7427776 7484169
13207 7484169 7391559 7375251 7328689 7096719 7282105 7233148 7207647 7257500 6820783 7209853
13197 7209853 6988496 6960503 7080362 7025381 6816863 7004177 6831639 6732296 6844461 6827170
13187 6827170 6419221 6258202 6276843 6145958 6220368 5743533 6000414 5776318 5720195 5496585
13177 5496585 5681996 5282689 5354270 5258958 5501403 5094062 5186909 4899464 5275362 5177373
13167 5177373 5253878 5241457 5103151 5103995 5164173 5634834 5704880 5846988 5650401 6230389 6277484
13156 6277484 6773919 6723856 6476748 6561763 6821936 6874606 6804267 6761242 6472746 6611645
13146 6611645 6403982 6468263 6409894 6384772 6300547 6443157 6362355 6147677 6087970 5725247
13136E725247k04354j20215n02171O2215k09574k96217K16256j34429k04565k57129
13126D075064L40896j41901O170J05076j67860k7823l9424k90029j22913j84139
13116C553117m1183K0648J87205j16388l32461J28145l8147j21615K31633k45533
13106C225421J45153j53234R7667K14940j08310P5900k3440J49413K00374K02375
13096D026259L36885K26713L77439L81020K22367L46322N7915J17464M9983Q3280
13086F225647K194k91202j2246o2288K38158J84662k30362O8103q4079l22071
13076E716516k63646l37956j57974k61822j57163n21615l05463Q0260j87493j75130
13066C428514j63276N5622j77621J66691k11020J20715O9382k7714j69069K32719
$$ plain form
13136 5725247 5520893 5400678 4898507 4960722 4751148 4454931 4671187 4536758 4332193 4075064
13126 4075064 4415960 4274059 4280229 4385305 4217445 4189622 4150198 3860169 3737256 3553117
13116 3553117 3511934 3532582 3719787 3603399 3270938 3399083 3360936 3239321 3470954 3225421
13106 3225421 3370574 3217340 3315007 3529947 3421637 3497537 3474097 3623510 3823884 4026259
13096 4026259 4363144 4589857 4967296 5348316 5570683 5917005 5974920 6092384 6142367 6225647
13086 6225647 6227841 5936639 5924393 5862105 6100263 6284925 6054563 6122666 6038587 5716516
13076 5716516 5452870 5114914 4956940 4695118 4537955 4016340 3710877 3791137 3603644 3428514
13066 3428514 3265238 3320860 3143239 3309930 3098910 3219625 3289007 3261293 3092224 3324943
13056C324943K85517j78457K0066n9840l5531l7645k36219L06616q6872j33620
13046C168958K8780K5887j38546j11539K78274j54409K94853p32o0373K93442
13036C624595j66727J18850n852j81280L04828K9602J09443J9507n2263R0098
13026C890801m3757K45391O0309k1931J1565p0073N2906J74515K91735j92739
13016D398722l9914J67315J83418L1376J7867k9786L08009m8903K80063k44058
13006E024109K54226n050J63626P7319n0946K75755k03451K99687J1919J82384
12996F029578m6146K50291L8480N6158J8013L84606j09088R0805K66709l63294
12986F616112P7616M5693k76981J98243m1549p0489J34660J47977l22801J88273
$$ plain form
13056 3324943 3610460 3432003 3452069 3392229 3356698 3319053 3082834 3389450 3302578 3168958
13046 3168958 3197738 3223625 3085079 2973540 3251814 3097405 3392258 3391526 3331153 3624595
13036 3624595 3457868 3576718 3570866 3389586 3694414 3724016 3833459 3852966 3800703 3890801
13026 3890801 3847044 4092435 4152744 4130813 4142378 4072305 4125211 4299726 4591461 4398722
13016 4398722 4358808 4526123 4709541 4740917 4758784 4728998 5037007 4988104 5268167 5024109
13006 5024109 5278335 5273285 5436911 5514230 5463284 5739039 5535588 5835275 5847194 6029578
12996 6029578 5983432 6233723 6272203 6328361 6346374 6730980 6621892 6712697 6979406 6616112
12986 6616112 6693728 6739421 6462440 6660683 6619134 6548645 6683305 6831282 6508481 6696754
12976F696754p2911q4688k7021j7237j24313j22889j82756J8355O1710n0582j72725
12965E921697Q4792l29879K5710m9888L9422j08126L01458j6874j83687p0300
12955E614325k30507J55235J39956j18934j79677K24348M2886R0271m5712Q7572
12945E779763j35930J16763j38774o3948K94594j70909M7218j43528K56889j49655
12935E692483p8119K50311N6196j6056n1502J49694n8556o3257J00387O8841j39099
12924E911323k80950P704k46137K08297j62447K66816o1214J13954j29133k90289
12914E337924R1120k84324j09029k33820J07243j43446j78279J5246k05564j94958
12904D202113J03253r7474n619k82292J14039r2124J87825l20463j8699j20721
$$ plain form
12976 6696754 6623843 6539155 6512134 6494897 6370584 6247695 6064939 6083294 6145004 6094422 5921697
12965 5921697 6006489 5676610 5702320 5652432 5691854 5583728 5885186 5868312 5684625 5614325
12955 5614325 5383818 5539053 5679009 5560075 5380398 5604746 5647632 5737903 5692191 5779763
12945 5779763 5643833 5760596 5621822 5557874 5852468 5681559 5728777 5585249 5842138 5692483
12935 5692483 5614364 5864675 5920871 5904815 5853313 6003007 5944451 5881194 5981581 6050422 5911323
12924 5911323 5630373 5638077 5391940 5600237 5437790 5704606 5643392 5757346 5628213 5337924
12914 5337924 5429044 5144720 5035691 4801871 4909114 4765668 4587389 4602635 4397071 4202113
12904 4202113 4305366 4207892 4202273 3919981 4034020 3941896 4129721 3809258 3790559 3669838
12894C669838J51601l72470o7511R4444K2065m7932m5287j02792Q5548n8664M4912
12883C373752L2248p9622K34494k18533j77930p2559J16284J4509k645P5088j47104
12872C147982j43263K5373k9807k06704K9077J17254j985n604l60596K73723R7655
12861B943105k06812J8238O0155k10764K33817O9211L4274n7041L4084m27j08429
12850B809411L11448j43119q3188l34113K10207J82738l29505k5819K21479l34447
12840B485092K18887J79120j8677k98164J24308k5719o6451P0407K04152j41623
12830B731332M5666J0303j88588K05771k838k38660j45478M07563j42096L549
12820B686524j16694K31005j08461J29845l26967P0408J51350j06381Q5600j37003
$$ plain form
12894 3669838 3821439 3448969 3381458 3475902 3497967 3450035 3404748 3301956 3387504 3328840 3373752
12883 3373752 3406000 3326378 3560872 3342339 3164409 3091850 3208134 3222643 3219998 3295086 3147982
12872 3147982 3004719 3030092 3000285 2793581 2822658 2939912 2937927 2932323 2571727 2845450 2943105
12861 2943105 2736293 2754531 2814686 2603922 2837739 2906950 2941224 2884183 2918267 2917840 2809411
12850 2809411 3120859 2977740 2894552 2560439 2770646 2953384 2623879 2598060 2819539 2485092
12840 2485092 2703979 2883099 2864422 2566258 2690566 2664847 2598396 2668803 2872955 2731332
12830 2731332 2776998 2787301 2598713 2804484 2801646 2562986 2417508 2825071 2682975 2686524
12820 2686524 2569830 2800835 2692374 2822219 2495252 2565660 2717010 2610629 2696229 2559226
12810B559226J9657L9983K85023k2599r0226j75978j05221J98296j25865n9720
12800B522576L19537l29821L18681j22222K92561K221l49716K6990J02778L0261
12790B813846j0598j27532K05251n9648J35895R6646k16085K07101l87442K36770
12780B894204n0096R782l5298k9506J9681K79820m14275l9532K31334j25884r5773
12769B644457O318K09175J8499J11179j32731R6933n5069o4964J71059q0296j31381
12758B793179J33377j22055K61169k43232M6291O9630K7617q9940n0458J20844
12748B946422o2084J13315k1836M1957l7545k13411J19378k8672K16312j30120
12738B943716q4662J29288n2816J86278j11359j98056j4197L24941n186k17847
$$ plain form
12810 2559226 2578883 2618866 2903889 2881290 2791064 2615086 2509865 2708161 2582296 2522576
12800 2522576 2842113 2512292 2830973 2708751 3001312 3003533 2653817 2680807 2783585 2813846
12790 2813846 2803248 2675716 2880967 2821319 2957214 3053860 2837775 3044876 2657434 2894204
12780 2894204 2844108 2853890 2818592 2789086 2808767 3088587 2674312 2634780 2866114 2740230 2644457
12769 2644457 2650775 2859950 2878449 2989628 2856897 2953830 2898761 2833797 3004856 2924560 2793179
12758 2793179 2926556 2804501 3065670 2822438 2868729 2938359 2965976 2876036 2825578 2946422
12748 2946422 2884338 2997653 2975817 3017774 2980229 2766818 2886196 2857524 3073836 2943716
12738 2943716 2859054 2988342 2935526 3121804 3010445 2812389 2798192 3123133 3117947 2900100
12728B900100q4379P6275K3788k1663J67756j02301n7629m8603K97531J09982
12718C260857l99664K36621J51105q5831j93331n964j18113L09937J86591j09240
12708C232968R779J74842k03952J27318K89289m14539J78819K02769M779P0338
12698C672410K2432K94355j30373o347L23253k29459L26541L41063L65864M68217
12688E447956K45451N69476K88710L65861L4663J44585j43828l88095k08865o01906
12678E754008j78428j45990l01200l65578M1161m13885K60138j48282J13293j87618
12668D427619P5104K9176k86796L62641J02449m561J12377k36068P8696R9628
12658D760265j60815J86646j93966K59474m2846k23757M56799j68921J33418O28900
$$ plain form
12728 2900100 2815721 2891996 2915784 2894121 3061877 2959576 2901947 2853344 3150875 3260857
12718 3260857 2861193 3097814 3248919 3163088 2969757 2963793 2845680 3155617 3342208 3232968
12708 3232968 3242747 3417589 3213637 3340955 3630244 3215705 3394524 3597293 3602072 3672410
12698 3672410 3694842 3989197 3858824 3852477 4175730 3946271 4272812 4613875 4979739 5447956
12688 5447956 5693407 6262883 6551593 6917454 6952117 7096702 6952874 6564779 6355914 5754008
12678 5754008 5575580 5429590 5128390 4762812 4803973 4390088 4650226 4501944 4615237 4427619
12668 4427619 4502723 4531899 4245103 4607744 4710193 4705632 4818009 4581941 4660637 4760265
12658 4760265 4599450 4786096 4592130 4851604 4808758 4585001 5041800 4872879 5006297 5635197
12648E635197J03404j2869K49660l6064K28568J63509k77069J16555N3979j0271
12638F214599j81543K56640r5462L4999M4926K63718j59358J1848K23378j06348
12628F507397K8262O7947m9552J64750L7034p6281j57576k1315k71739k9291l36182
12617E863454j93893q2635l57680k12839K72465j09809K30185M41891K95710L06905
12607F453754L79810L27532N84551K96533J49415P9074j76385k33098m22961m19874
12597G018351l60898n64533k87770l23463j72163Q0276l12147M23428k75427K97351
12587E523005r3626J83186J11883l2444L22804J52m60519K04023L24418J97386
12577F280268K59205R0219J34579N059P4070k5192l78312j63521m20138r3908
$$ plain form
12648 5635197 5738601 5725732 5975392 5939328 6167896 6331405 6054336 6170891 6224870 6214599
12638 6214599 6033056 6289696 6194234 6229233 6274159 6537877 6378519 6390367 6613745 6507397
12628 6507397 6535659 6603606 6554054 6718804 6755838 6679557 6521981 6500666 6228927 6199636 5863454
12617 5863454 5669561 5586926 5229246 5016407 5288872 5179063 5409248 5851139 6146849 6453754
12607 6453754 6833564 7161096 7745647 8042180 8191595 8270669 8094284 7861186 7438225 7018351
12597 7018351 6657453 6092920 5805150 5481687 5309524 5389800 5077653 5501081 5225654 5523005
12587 5523005 5429379 5612565 5724448 5692004 6014808 6014960 5554441 5758464 6082882 6280268
12577 6280268 6539473 6629692 6764271 6769330 6843400 6818208 6439896 6276375 5856237 5762329
12567E762329l76812j36744n9070l59122J53446k29423n9262K23360j75195P8165
12557D821672k5276k6379l2835k5350r7393j4914o8498j04622L75947k59026J93939
12546D737265J10586r097q3849n0210K27260j14305N11749Q8576J15879l6215
12536E497639q0441N1769J46394k15470k70480O6198m6870o6297j92256j73576
12526D716610J1119P133J16139j68076j5192K34924j93610m8248R7022K0589K40154
12515E018564N7470p5946Q9393L43738L57067L09990M30678L82656m8115O3639
12505F929134k09j93718m7269n99877m3909j85962j81843l55458l15123J63832
12495E169598Q1247Q988k14876J07233l9808j49973K18120Q7024p2774j07818
$$ plain form
12567 5762329 5385517 5248773 5189703 4830581 4984027 4754604 4695342 4918702 4743507 4821672
12557 4821672 4796396 4770017 4737182 4711832 4614439 4599525 4531027 4426405 4802352 4543326 4737265
12546 4737265 4847851 4838754 4754905 4704695 4931955 4817650 5329399 5417975 5533854 5497639
12536 5497639 5417198 5468967 5615361 5399891 5129411 5195609 5148739 5082442 4890186 4716610
12526 4716610 4727729 4734862 4851001 4682925 4667733 4902657 4709047 4660799 4757821 4778410 5018564
12515 5018564 5076034 5000088 5089481 5433219 5790286 6100276 6530954 6913610 6865495 6929134
12505 6929134 6928925 6735207 6687938 6088061 6044152 5858190 5676347 5320889 5005766 5169598
12495 5169598 5250845 5259833 5044957 5152190 5112382 4962409 5180529 5267553 5194779 5086961
12485E086961J5797Q5058J11742J94275J36860L25840J75202j3381l18526L02729
12475F102557k15909N059k35380j3294j76967n5634p366k07329J09348J55017
12465E460102l60020k7488P0046J29305J28116j50996L4655M9674J20514l04694
12455E149214K04184J46889k245j8905K26651K3813J12473K04506j26295Q3110
12445F003395J70102J06195J74028j8728M52079J8615J55409Q6271k2009K16558
12435G341915J75890J58410k46201J84956J69895J34137j1600q211J60305J10645
12425H170141K80594O4357k167n7106k8796K87930l9461M43990L4395K26835J43309
12414I524021K88883L21544K46923R7809J26766O03943O7775j74646P8144J86995
$$ plain form
12485 5086961 5102758 5187816 5299558 5493833 5630693 5956533 6131735 6118354 5799828 6102557
12475 6102557 5886648 5891707 5656327 5643033 5466066 5410432 5403066 5195737 5305085 5460102
12465 5460102 5100082 5072594 5142640 5271945 5400061 5249065 5283720 5333394 5453908 5149214
12455 5149214 5353398 5500287 5498042 5479137 5705788 5729601 5842074 6046580 5920285 6003395
12445 6003395 6173497 6279692 6453720 6434992 6887071 6905686 7061095 7147366 7125357 7341915
12435 7341915 7517805 7676215 7430014 7614970 7784865 7919002 7907402 7899191 8059496 8170141
12425 8170141 8450735 8515092 8512925 8455819 8427023 8714953 8675492 9119482 9153877 9380712 9524021
12414 9524021 9812904 10134448 10381371 10479180 10605946 11209889 11277664 11103018 11181162 11368157
12404A1368157J20647o7894r263j32619K00543N2559k97505j29792J57294J09359
12394A1371486q0450j11691M60841J92019j03092M74216J67593L54925K33465
12385A2959312K32296L95639M91686j66232O79788L6048M12463O0530J17693K89667
12375A5508890J52509M136K04824n4156J05697L343n3458Q5430q8972J45031k62442
12364A5750832q1984K08281k80866K04368Q1333l45304K8848k92259O7659k58907
12354A5082001k3680J72544k47832j09410j71872j76137j34173o9156l88904r5223
12344A3838158j74868N2119o5982J25198J18124L21087K0447J66167O26417K29709
12334A5256576K42077M08649J82055O80158K28919J51350O54716K47087J77851
$$ plain form
12404 11368157 11488804 11420910 11411647 11279028 11479571 11532130 11234625 11104833 11262127 11371486
12394 11371486 11291036 11179345 11640186 11832205 11729113 12203329 12370922 12725847 12959312
12385 12959312 13191608 13587247 14078933 13912701 14592489 14628537 15041000 15101530 15219223 15508890
12375 15508890 15661399 15665535 15870359 15816203 15921900 15925243 15871785 15957215 15868243 16013274 15750832
12364 15750832 15668848 15877129 15596263 15800631 15881964 15536660 15565508 15273249 15340908 15082001
12354 15082001 15058321 15230865 14983033 14873623 14701751 14525614 14391441 14322285 13933381 13838158
12344 13838158 13663290 13715409 13649427 13774625 13892749 14213836 14234283 14400450 15026867 15256576
12334 15256576 15498653 15907302 16089357 16769515 16998434 17149784 17804500 18051587 18229438
12325A8229438M30713o3180K90254J0566L70961N8975K9709J6351J33470R0371
12315A9597628j15596P8221m4642J22875P6320J62304r5141M76923J42327J52669
12305B0553888M11600O19694K36461J81598L12016r232R3515l55951k61897k74689
12295B1507003m71432n38276n20045l72570l36439j20246j30241n19562N3494
12286A8551686m42762m69214m21976m95133n27903m64726o43151m72622n10539
12277A4103660l57646l38963l00142l22177m60236O2704J17796m35193L0868Q5715
12267A2186386l51601J28703j84610j98641r930q409K75017j73733K8578k91885
12257A1399875M44673k11832M50381J77541N29385K34907L09077O76618O64785
$$ plain form
12325 18229438 18660151 18596971 18887225 18897791 19268752 19327727 19357436 19373787 19507257 19597628
12315 19597628 19482032 19560253 19515611 19638486 19714806 19877110 19781969 20258892 20401219 20553888
12305 20553888 20965488 21585182 21821643 22003241 22315257 22306025 22399540 22043589 21781692 21507003
12295 21507003 21035571 20497295 19977250 19604680 19268241 19147995 19017754 18498192 18551686
12286 18551686 18108924 17639710 17217734 16722601 16194698 15729972 15086821 14614199 14103660
12277 14103660 13746014 13407051 13106909 12784732 12324496 12387200 12504996 12069803 12100671 12186386
12267 12186386 11834785 11963488 11778878 11580237 11570307 11561898 11836915 11663182 11691760 11399875
12257 11399875 11844548 11632716 12083097 12260638 12790023 13024930 13334007 14010625 14675410
12248A4675410P17515R43773R61029J265243P93302J220727P47036J161851O64002
12239B3149888L65736N57653P410l64128j49419J19765j3249L4363l31733J4359
12229B3390645k56104l94337o84251l66158q34271o64094r30726j126114r24378
12220A7210212j063915r77769n69059j055811m77211n68531l94125j60107n74166
12211A1369518l86438r5024l57026k96621l39794n6970l38821k87209K5154r743
12201I227026m1746j10781K45131l17744K41326p0020j13687J9805J84485Q9363
12191I353158J83314J3203J26745N5035M16398J20121R358J97065L56845J63586
12181A0994828j29819L84307j96188L75188j16412J37269l13798L39590o72395
$$ plain form
12248 14675410 15392925 16336698 17297727 18562970 19356272 20576999 21324035 22485886 23149888
12239 23149888 23515624 24073277 24080687 23716559 23567140 23686905 23673656 23708019 23376286 23390645
12229 23390645 23134541 22740204 22055953 21689795 20855524 20191430 19260704 18134590 17210212
12220 17210212 16146297 15168528 14599469 13543658 13066447 12497916 12103791 11943684 11369518
12211 11369518 10983080 10888056 10531030 10234409 9894615 9837645 9498824 9211615 9236769 9227026
12201 9227026 9185280 9074499 9319630 9001886 9243212 9173192 9059505 9079310 9263795 9353158
12191 9353158 9536472 9549675 9676420 9731455 10147853 10267974 10277332 10474397 10831242 10994828
12181 10994828 10865009 11249316 11053128 11428316 11311904 11449173 11135375 11474965 10802570
12172A0802570J11124K58490j53690L46084J72142r6175j99611J83291J85513
12163A1609738K08434J83022L01594M95200O83047L85886K58533L34842J03741
12154A4564037J87079k40845k44186k24823J611j43344L89739M21781K72201L30223
12144A5313473L01251K03058O15590L75449L46505J94128M58689L32400R57062
12135A9097605M25114P68393P89217J186895J324004J238052J721253J686439
12127B8236972J753859K214363J673726J679588J274320J294614O43395M10158
12119C9180995K01454J50766j8842n00404m30399o74007n03186o76265j066569
12110C5663543m65814p35583q01949l54642p04706l88137k70667k63066O7584
$$ plain form
12172 10802570 10913694 11172184 11018494 11364578 11536720 11440545 11240934 11424225 11609738
12163 11609738 11818172 12001194 12302788 12797988 13481035 13866921 14125454 14460296 14564037
12154 14564037 14751116 14510271 14266085 14041262 14042873 13899529 14289268 14711049 14983250 15313473
12144 15313473 15614724 15817782 16433372 16808821 17155326 17349454 17808143 18140543 19097605
12135 19097605 19522719 20291112 21080329 22267224 23591228 24829280 26550533 28236972
12127 28236972 29990831 32205194 33878920 35558508 36832828 38127442 38770837 39180995
12119 39180995 39382449 39533215 39514373 39013969 38583570 37909563 37406377 36730112 35663543
12110 35663543 35197729 34462146 33660197 33305555 32600849 32212712 31942045 31678979 31746563
12101C1746563j17915O64497k48242J11649N24980l25658k11133n95987p06242
12092C0842512p37814n32324m04447m81580R2252Q9752O76018N00469P08564N71787
12082C1325189L18232L55424O63352J91018J2327J35741K05601P5J45611j52428
12072C3200142k02757j6587j1250n18873n38625o99987q01738r21509q44460r86187
12062B7658169r99905r55758q01818k79880n05868p11378m60456j09361n20279
12053B2313466p24577l77633m24323l63007o68254l62222j69740m66205k7586
12044A8729919m64230m24666j00029l00778n46029l36811k57035m45682n11188
12035A5343471k29134j27047j72621k9697J34247K10029K58057K68079O09806
$$ plain form
12101 31746563 31628648 32293145 32044903 32156552 32681532 32355874 32144741 31548754 30842512
12092 30842512 30104698 29572374 29167927 28686347 28778599 28868351 29544369 30044838 30753402 31325189
12082 31325189 31643421 31998845 32662197 32853215 32865542 33001283 33206884 33206959 33352570 33200142
12072 33200142 32997385 32980798 32969548 32450675 31912050 31212063 30410325 29488816 28644356 27658169
12062 27658169 26658264 25702506 24900688 24620808 24114940 23403562 22943106 22833745 22313466
12053 22313466 21588889 21211256 20786933 20423926 19755672 19393450 19223710 18757505 18729919
12044 18729919 18265689 17841023 17740994 17440216 16894187 16557376 16300341 15854659 15343471
12035 15343471 15114337 14987290 14814669 14784972 14919219 15129248 15387305 15655384 16265190
12026A6265190O0773L30359j13956q9995q0026n23659l59390o11702m00131n00056
12016A3977407j91704n61513j90370j98095j87738l25700l67410l89030j62993
12007A1402854l43350k64286j00194L2964J48620O0949J79224L01714j21369K72004
11997A1569130j10445M964m16607k80876j65315m34614n4034n53695j0249l5973
11987I512286R3274j47716N6238l56270j71919l71362m60466r1744k13453j38185
11977G710683k29290M2664p1256J519l4193q7727l19838k05285m19453K00362
11967F588186k86314k19890J39482l69349J34561m61054J23173k05424j4047J87792
11957E617116J30337j5905K91944K0652K75298J0587l8228l7302q4660J35581
$$ plain form
12026 16265190 16325963 16656322 16542366 16452371 16372345 15848686 15489296 14877594 14477463 13977407
12016 13977407 13785703 13224190 13033820 12835725 12647987 12322287 11954877 11565847 11402854
12007 11402854 11059504 10795218 10695024 10727988 10876608 10937557 11116781 11418495 11297126 11569130
11997 11569130 11458685 11463649 11047042 10766166 10600851 10166237 10112203 9558508 9548259 9512286
11987 9512286 9605560 9457844 9514082 9157812 8985893 8614531 8154065 8062321 7848868 7710683
11977 7710683 7481393 7524057 7452801 7454320 7420127 7332400 7012562 6807277 6387824 6588186
11967 6588186 6301872 6081982 6221464 5852115 5986676 5525622 5648795 5443371 5429324 5617116
11957 5617116 5747453 5731548 6023492 6044144 6319442 6330029 6291801 6254499 6169839 6305420
11947F305420L5117J1423J17269j06273K64978R6172J20879L06888J90286j40360
11937G201799L01711J4873J93285J83524k66989J28511j04956M13609l49056J85205
11927G901516K15210k67414k49107j02443j5183o8523n26613J91344l93601J49125
11917F834311l09890j46053k02933J23770j52572k2736Q2494M36975N66740J820897
11907I031003K581280K554290K045157P40436J69007k22948p64070j463413k083802
11898A2586940j981843j010161l69369j594102j147631p6293l01427l22096j47419
11889E636599K5008k6581L00970K18768L54344Q94978O64259O13483M92722M13166
11879I587716J98673P3763j22656k19572l29648n52031l43720l09876o51273m25584
$$ plain form
11947 6305420 6340537 6351960 6469229 6362956 6627934 6724106 6844985 7151873 7342159 7201799
11937 7201799 7503510 7518383 7711668 7895192 7628203 7756714 7651758 8065367 7716311 7901516
11927 7901516 8116726 7849312 7600205 7497762 7482579 7414056 6887443 7078787 6685186 6834311
11917 6834311 6524421 6378368 6175435 6299205 6146633 6123897 6206391 6643366 7210106 9031003
11907 9031003 11612283 14166573 16211730 16952166 17121173 16898225 16134155 14670742 12586940
11898 12586940 10605097 9594936 9225567 7631465 6483834 6407541 6106114 5784018 5636599
11889 5636599 5661607 5635026 5935996 6154764 6509108 7404086 8068345 8681828 9174550 9587716
11879 9587716 9786389 9860152 9737496 9517924 9188276 8636245 8292525 7982649 7331376 6905792
11869F905792l68329n28259k02304l14728k62347k34926j38322j18286n9809j37817
11859D540665O3536j12588J77063j19444j3514k19376N8616L06860L6839J79412
11849D898069j52478L65084j5476K46802J60858J70223O11888N03411M56376L98115
11839G642872M07294M53032l111p0481N784m48445l07004q4576j2620j25927K74788
11828G731606p1729j50511K4164m73323j33919k93622o50148l07444l25287k36074
11818E113713m01750N4787n32698m078R3300l31953k3364j33267J5725j32621
11808C717794j68916j41727J15974p4288O7026j22222N770r1097L39718m80236
11798C167796K87752P293k3817J18057N729O8134J70773O4269L39499R1224M18748
$$ plain form
11869 6905792 6537463 6009204 5806900 5492172 5229825 4994899 4856577 4738291 4678482 4540665
11859 4540665 4604201 4491613 4668676 4549232 4535718 4316342 4374958 4681818 4718657 4898069
11849 4898069 4745591 5110675 5095199 5342001 5502859 5673082 6284970 6788381 7244757 7642872
11839 7642872 8050166 8503198 8500087 8429606 8435390 7986945 7679941 7595365 7582745 7456818 7731606
11828 7731606 7659877 7509366 7533530 7060207 6926288 6632666 5982518 5675074 5349787 5113713
11818 5113713 4711963 4766750 4234052 4229974 4323274 3991321 3967957 3834690 3850415 3717794
11808 3717794 3548878 3407151 3523125 3448837 3515863 3393641 3399411 3308314 3648032 3167796
11798 3167796 3455548 3462841 3439024 3557081 3562810 3630944 3801717 3865986 4205485 4296709 4715457
11787D715457O44919M89186Q1618K70273q0292r6056j90853l28430k45831m65147
11777D794844l22548m035m51582k99951L4450K9098j51421m68863j909j7983k7787
11766C112313j40102m4245j48477J3499K65719l5666J3353j43900N7569j84251
11756B765812k50612J08733J12057J19310j74395K79931m70942J13826j41220
11747B462500J18151M6576N3952K7897K2936O7001j32384K30713J43947m57406
11737B583883k17239K32036N5528q9066M1274J06496k66416Q159J14492j15854
11727B453293K37925k69341O8109j32342K693P9247J4818p9322K2423K64757j65645
11716B496615j72241J14417K45926l97779K69456k48885J54040P409O6441j2509
$$ plain form
11787 4715457 5360376 5849562 5931180 6201453 6121161 6025105 5834252 5505822 5259991 4794844
11777 4794844 4472296 4468261 4016679 3716728 3751178 3780276 3628855 3159992 3158083 3140100 3112313
11766 3112313 2972211 2927966 2779489 2792988 3058707 3023041 3036394 2892494 2950063 2765812
11756 2765812 2515200 2623933 2735990 2855300 2680905 2960836 2489894 2603720 2462500
11747 2462500 2580651 2627227 2681179 2709076 2732012 2799013 2666629 2897342 3041289 2583883
11737 2583883 2366644 2598680 2654208 2565142 2606416 2712912 2446496 2454655 2569147 2453293
11727 2453293 2691218 2421877 2489986 2357644 2360337 2439584 2454402 2375080 2397503 2662260 2496615
11716 2496615 2324374 2438791 2684717 2286938 2556394 2307509 2461549 2468958 2535399 2522890
11706B522890j96033K03978j57875J00785j08592J07749o312p2238K21307O0588
11696B676247j24186Q2689m2702o5504o0970J3722K10906j69949K25003k71422
11686B473834J32344L33432j96769N8849J35297j09115J29792j84190K06585J4794
11676B994853N478q6851K97222j13355p8119P3338M3416j04010j19943o1688K19459
11665C069800j04112Q2952K260R9226j34650Q1220L9017Q2634m27051K20342j3516
11654B998122J36434j56301J39173O852k55554J5453K99522N5938k99516K1649
11644B961772q5518o9130J49625j67225l8742p7296K44173j90508J73284j78614
11634B721821Q4639N4261K5296q5435K80463k30517j29807K86308k83586j9067
$$ plain form
11706 2522890 2326857 2530835 2372960 2473745 2365153 2472902 2466590 2394352 2615659 2676247
11696 2676247 2552061 2634750 2592048 2526544 2465574 2479296 2690202 2520253 2745256 2473834
11686 2473834 2606178 2939610 2742841 2801690 2936987 2827872 2957664 2773474 2980059 2994853
11676 2994853 3000331 2913480 3210702 3097347 3019228 3092566 3135982 3031972 2912029 2850341 3069800
11665 3069800 2965688 3048640 3050900 3150126 3015476 3096696 3135713 3218347 2791296 3011638 2998122
11654 2998122 3134556 2978255 3117428 3124280 2868726 2884179 3183701 3239639 2940123 2961772
11644 2961772 2876254 2807124 2956749 2789524 2750782 2673486 2917659 2727151 2900435 2721821
11634 2721821 2806460 2860721 2886017 2800582 3081045 2850528 2720721 3007029 2723443 2704376
11624B704376n5974J13427J9876l9937k30469L89079k86402P8354q192P8239l9699
11613B722678j63504J18586J19730r0967j24541J94507J7855j38895J89038j25321
11603B719166K12345q9135J39655j07800n0778J69919j60315K45007P5904k58780
11593B895188J85185j25308J65519l14444J69931j25726K79027j55613R7610n1997
11583C019372K6310O6205k40950L15282k21084J44315O1470j116n8806J3879J44226
11572C269103N8487P9012R1423k71089m2910Q8310J03928l26637J77132J08928
11562C335687k21153p7922Q8875K31662o3914J46505o8459L9941j61948L36068
11552C585342J4825l24680Q5967M0205L6706j43065Q4684J68998l1336j26186
$$ plain form
11624 2704376 2648402 2761829 2781705 2741768 2511299 2900378 2613976 2692330 2684138 2762377 2722678
11613 2722678 2559174 2677760 2797490 2706523 2581982 2776489 2794344 2655449 2844487 2719166
11603 2719166 2931511 2842376 2982031 2874231 2823453 2993372 2833057 3078064 3153968 2895188
11593 2895188 3080373 2955065 3120584 2806140 2976071 2850345 3129372 2973759 3071369 3019372
11583 3019372 3045682 3111887 2870937 3186219 2965135 3109450 3170920 3169804 3110998 3124877 3269103
11572 3269103 3327590 3406602 3498025 3226936 3184026 3272336 3376264 3049627 3226759 3335687
11562 3335687 3114534 3036612 3125487 3357149 3293235 3439740 3371281 3411222 3249274 3585342
11552 3585342 3600167 3275487 3361454 3401659 3438365 3295300 3379984 3548982 3517646 3391460
11542C391460j50117N7663j24154q3668k986J44882j00541K58309j98664j12627
11532C079557K08375r9278N6031j4123m8516J08889N4005j37009j42158K21637
11522C287410K0615o5947j18246K41547k94322Q2695J00845n6163J62842J38085
11512C499361j70340k467J8280J16352L1772J27620k8071j04975J90405j31188
11502C546749q5588p4011L0789K6964J85526j76895n8219j16962K4046n0413N2245
11491C304231O9721j22070J88781j48749L9710J51795M2206M0118j309N7903l74454
11480C247883M84245j43282j40738R6061K21885j91501j35698L03895q5283j50125
11470C507342k5132r0448k9489L35762j12071P4106m1505k93996j8123K35869
$$ plain form
11542 3391460 3241343 3299006 3174852 3091184 3088198 3233080 3132539 3390848 3192184 3079557
11532 3079557 3287932 3188654 3244685 3230562 3182046 3290935 3344940 3207931 3065773 3287410
11522 3287410 3308025 3242078 3123832 3365379 3071057 3153752 3254597 3198434 3361276 3499361
11512 3499361 3329021 3326554 3344834 3461186 3492958 3620578 3592507 3487532 3677937 3546749
11502 3546749 3461161 3387150 3417939 3444903 3630429 3453534 3395315 3278353 3302399 3251986 3304231
11491 3304231 3373952 3251882 3440663 3291914 3331624 3483419 3525625 3565743 3564434 3622337 3247883
11480 3247883 3732128 3588846 3448108 3544169 3766054 3574553 3438855 3742750 3657467 3507342
11470 3507342 3482210 3391762 3362273 3698035 3585964 3660070 3618565 3324569 3306446 3542315
11460C542315k81382j31554K87215n0574J05757q1815J24248p7202l1408n1072
11450C354528J8460n8102l6878J09404o4234m8816Q7414p2052K44145j61484J83590
11439C555975j37171J19916k20005K18630q65J47273N3438J89740k74284K16288
11429C868935J55088k2031k9520J65218j49497K37086r4212l277J71011K39591
11419D538392l37463j8997K20011k82915K77862q3996K05463l04072J29655K8194
11409D372134n5102q0444J0893J95508P7651r5039K02576J1141J9791j44676K57261
11398D771694k9722m8888J30755j60030Q8298M08751j09878J74428j40506N4284
11388E139186K29061l6559Q7563J18784R1519j72689K51157j39596K37182O4998
$$ plain form
11460 3542315 3260933 3129379 3416594 3366020 3471777 3389962 3514210 3437008 3405600 3354528
11450 3354528 3372988 3314886 3278008 3387412 3323178 3274362 3361776 3289724 3533869 3372385 3555975
11439 3555975 3418804 3538720 3318715 3537345 3536480 3683753 3737191 3926931 3652647 3868935
11429 3868935 4024023 4001992 3972472 4137690 3988193 4225279 4131067 4127790 4298801 4538392
11419 4538392 4200929 4181932 4401943 4119028 4396890 4312894 4518357 4214285 4343940 4372134
11409 4372134 4317032 4236588 4247481 4442989 4520640 4425601 4628177 4639318 4659109 4514433 4771694
11398 4771694 4741972 4693084 4823839 4663809 4752107 5160858 5050980 5225408 5084902 5139186
11388 5139186 5368247 5331688 5419251 5538035 5629554 5456865 5708022 5568426 5805608 5870606
11378E870606J060K60084j03814q1073J82490R812J16952j78749K02235k9265
11368F250338j19576K36108q7930j13845K32188r1402N5944j06333K4290O1734
11358F341516J38271Q9242k55213J38820j12061k2453J74056J06555q6897j59844
11348F351992L07138r4063j2992j07529N2556J74920o6661k24724K7697j05003
11338F303331J22530k21979L813p1866Q5011j24938J00547L8948q8883k13004
11328E933510M0277j82135M6783J55383l9552j80848k82158m2075J76461k89217
11318E336429J48038j28772j71330J25185k12701o2237j71351n6471J36224j58841
11308D784173k79493k15399K09553j16686j43868P9290r2590j20220J72063l96253
$$ plain form
11378 5870606 5871666 6131750 6027936 5946863 6129353 6139165 6256117 6077368 6279603 6250338
11368 6250338 6130762 6366870 6278940 6165095 6397283 6305881 6361825 6255492 6279782 6341516
11358 6341516 6479787 6569029 6313816 6452636 6340575 6318122 6492178 6598733 6511836 6351992
11348 6351992 6659130 6565067 6552075 6444546 6497102 6672022 6605361 6380637 6408334 6303331
11338 6303331 6425861 6203882 6207695 6135829 6220840 6095902 6196449 6235397 6146514 5933510
11328 5933510 5973787 5791652 5838435 5993818 5954266 5773418 5491260 5449185 5625646 5336429
11318 5336429 5484467 5355695 5184365 5309550 5096849 5034612 4863261 4806790 4943014 4784173
11308 4784173 4504680 4289281 4498834 4382148 4238280 4317570 4224980 4104760 4276823 3880570
11298C880570L5068p4155q2713K3626J39299k86447r0935o8426L8205M9808j16855
11287C447045O218p1287j76837R47J46940k16728k96849K88649N4014j49612K28052
11276C260552j26665k21835J17303K00890k83666j41537N5270N3230K9470J4416
11266B957428l60347L52227k83110Q1671l9075r0138O4349L926p3271l7463J18063
11255B694260j0167K47520m25025m7439L77764l11730J48946j65585K39908l75276
11245B373176K12086J71284l34418J12278n4414K03798j87750M03169k44554K47160
11235B901815l96039Q7851p5087J65835J7582j10660J2681j17466O9938L47764
11225B904214Q4715N31423L45054M63470O02632N13016M25679L65805p1120k95167
$$ plain form
11298 3880570 3915638 3841483 3758770 3782396 3921695 3635248 3544313 3475887 3514092 3563900 3447045
11287 3447045 3453263 3381976 3205139 3206086 3353026 3136298 2839449 3128098 3182112 3032500 3260552
11276 3260552 3133887 2912052 3029355 3230245 2946579 2805042 2860312 2913542 2943012 2957428
11266 2957428 2597081 2949308 2666198 2747869 2708794 2618656 2683005 2686931 2613660 2576197 2694260
11255 2694260 2684093 2931613 2506588 2459149 2836913 2525183 2674129 2508544 2748452 2373176
11245 2373176 2585262 2756546 2422128 2534406 2479992 2683790 2496040 2899209 2654655 2901815
11235 2901815 2505776 2593627 2518540 2684375 2701957 2591297 2603978 2486512 2556450 2904214
11225 2904214 2988929 3520352 3865406 4328876 4931508 5444524 5870203 6236008 6164888 5869721
11215E869721k36020o34715l69800l71031j38882n49298r9410k12431j21267j09143
11205C027724r0254n6590j3401J38960j42188k43483K41652j5504K48565K64354
11195C359835J61270M07252L50093P77868Q84161n1832L24500p7320k41261n76091
11185E318475j68270m09568l99900l61193r494m01955j76984k33046l1752j54456
11175B971857M4344j72200K870O5333j06003J81723p2552K71421l23720K42515
11165C105588j02556j97998K38763L5604j10752r0893j27717K70359J54585o6214
11155C108769L1372n7271o8901K98635j25631k32221J8730L05959k76383N7992
11145C061050J31105p2555L16456l59566J15530M3582L5311j65788r6475L29928
$$ plain form
11215 5869721 5633701 4998986 4629186 4258155 4119273 3569975 3470565 3258134 3136867 3027724
11205 3027724 2937470 2880880 2867479 3006439 2864251 2620768 2862420 2846916 3095481 3359835
11195 3359835 3521105 3928357 4278450 5056318 5940479 5888647 6213147 6135827 5894566 5318475
11185 5318475 5150205 4740637 4340737 3979544 3970050 3568095 3391111 3158065 3126313 2971857
11175 2971857 3016201 2844001 2846871 2912204 2806201 2987924 2915372 3186793 2863073 3105588
11165 3105588 3003032 2805034 3043797 3079401 2968649 2877756 2750039 3020398 3174983 3108769
11155 3108769 3140141 3082870 3013969 3312604 3186973 2954752 2973482 3279441 3003058 3061050
11145 3061050 3192155 3119600 3436056 3076490 3192020 3235602 3270913 3105125 3008650 3338578
11135C338578j62408R2020Q3300l25656N53462l05891J42256o760j0420j41077
11125C257404L55293k82561Q2363K12536n4780J47402j60204m3393L2294R6292
11115C642646N6065j34842K13797k66561K3784K1700J03112j00483K39418j62981
11105C635655N6263r6361o3572Q2999L81205l72610n1027J61423j36878l7134
11095C559963n0850r8757J27668j63124J3809j97808L08018P3281j81662K17600
11085C608138l94651J34567j02925K03764r00k21434K18724l76024L52198k59463
11075C161994J2460M3752K31065m28343N74032n1234l2865j76295J84000N6421
11065C574987N4547P8223j11342J34913p6046Q8251K07690J24762l77924k1795
$$ plain form
11135 3338578 3176170 3268190 3351490 3025834 3579296 3273405 3415661 3408901 3398481 3257404
11125 3257404 3612697 3330136 3412499 3625035 3570255 3717657 3557453 3514060 3546354 3642646
11115 3642646 3698711 3563869 3777666 3511105 3534889 3556589 3659701 3559218 3798636 3635655
11105 3635655 3691918 3595557 3531985 3614984 3996189 3623579 3572552 3733975 3597097 3559963
11095 3559963 3509113 3410356 3538024 3374900 3388709 3190901 3498919 3572200 3390538 3608138
11085 3608138 3213487 3348054 3245129 3448893 3447993 3226559 3445283 3069259 3421457 3161994
11075 3161994 3174454 3218206 3449271 3020928 3594960 3543726 3510861 3334566 3518566 3574987
11065 3574987 3629534 3707757 3596415 3731328 3655282 3743533 3951223 4075985 3698061 3676266
11055C676266K30252P5159p2506r3619o7855l8103J87386k6343M5529k3624R7361
11044C989903K20111m08553K10216O589p2687K24655k70801P4574K07701k9142
11034D152566K3482P6285r109J7022K48819K2597o11j6231K44956L13005k10671
11023D862110L44083j10593L72408l51140L32017K12780j91574J35392L7347J63791
11013E806621J91262k97162K96648j06396N84188k70662P7120K5159K13740o543
11003F513975K48305J94178k42461L15186l6436K13458L7330l384L52060J05989
10993G698200K24437k6325M46768j66237L1767J65130j38942J93323J63991P5172
10983H667284J04111K99296J9924L72820L81462J46545K45832K52936O3262J21607
$$ plain form
11055 3676266 3906518 3981677 3909171 3815552 3747697 3709594 3896980 3870637 3916166 3892542 3989903
11044 3989903 4210014 3801461 4011677 4018266 3945579 4170234 3899433 3974007 4181708 4152566
11034 4152566 4176048 4252333 4243224 4260246 4509065 4531662 4531051 4514820 4759776 5072781 4862110
11023 4862110 5206193 5095600 5468008 5116868 5448885 5661665 5470091 5605483 5642830 5806621
11013 5806621 5997883 5700721 5997369 5890973 6475161 6204499 6281619 6306778 6520518 6513975
11003 6513975 6762280 6956458 6713997 7029183 6992747 7206205 7243535 7240151 7592211 7698200
10993 7698200 7922637 7896312 8343080 8176843 8208610 8373740 8234798 8428121 8592112 8667284
10983 8667284 8771395 9070691 9090615 9463435 9844897 9991442 10237274 10490210 10553472 10675079
10973A0675079J17864J29357n5516m8822L80788J01908P9615N41964N684K60588
10963A2188509J73247N67640J29757K87034K46157K35468L53231L4442M60453
10954A4675938J79679M29130K43156O06863K1352N25556O366O4919L55603M0311
10944A7148873M55527J86373K28467K27071J91330J96610L0564N13963K43319
10935A9422097O05153j02175N39877J87758J45722J31288M98705K79624L61913
10926B2069962J86360K53271L66937M50496L46427J80733N01198N08441Q1884
10917B4945709K73443J90071r919J74022J52797j31216K27559k49543k0279j0207
10907B5542437p2190J1063K09961L412j64434L05426k10337M00936j19038P6191
$$ plain form
10973 10675079 10792943 10922300 10866784 10817962 11198750 11300658 11380273 11922237 11927921 12188509
10963 12188509 12361756 12929396 13059153 13346187 13592344 13827812 14181043 14215485 14675938
10954 14675938 14855617 15284747 15527903 16134766 16156118 16681674 16688040 16752959 17108562 17148873
10944 17148873 17604400 17790773 18019240 18246311 18437641 18634251 18664815 19178778 19422097
10935 19422097 20027250 19925075 20464952 20652710 20798432 20929720 21428425 21708049 22069962
10926 22069962 22256322 22509593 22876530 23327026 23673453 23854186 24355384 24863825 24945709
10917 24945709 25219152 25409223 25399304 25573326 25726123 25594907 25822466 25572923 25552644 25542437
10907 25542437 25470247 25481310 25691271 25694683 25530249 25835675 25625338 26026274 25907236 25983427
10897B5983427L02138N6002O3566M36279l8616M00375M66543R5304M51057L56356
10887B8572431M21719Q69039L49265J007247P35860R42434J094044Q62195J292595
10878C6146829J593934J388939J708328J806796J933246J941823J797614J733206
10870E0050715J572153J599961J140248J036630L95051K62310j16823m69185n93719
10861E4877341r64379j309214j587242j498239j561040j881135j879543j810147
10853D2386402j991833j898751j616510k148672j619203j625255j846448j412791
10845B8226939j550062j258245j456495j207470j235554j033703j287191r50394
10837A8247825r95665q39556p86046o90486m74612q76901p12412l87179o40687
$$ plain form
10897 25983427 26285565 26341567 26405133 26841412 26802796 27203171 27669714 27765018 28216075 28572431
10887 28572431 28994150 29863189 30212454 31219701 31955561 32897995 33992039 34854234 36146829
10878 36146829 37740763 39129702 40838030 42644826 44578072 46519895 48317509 50050715
10870 50050715 51622868 53222829 54363077 55399707 55794758 56057068 55940245 55471060 54877341
10861 54877341 53912962 52603748 51016506 49518267 47957227 46076092 44196549 42386402
10853 42386402 40394569 38495818 36879308 34730636 33111433 31486178 29639730 28226939
10845 28226939 26676877 25418632 23962137 22754667 21519113 20485410 19198219 18247825
10837 18247825 17252160 16412604 15626558 14936072 14461460 13584559 12872147 12484968 11844281
10828A1844281n80836p45114k05247m03728l85187n47334r2459m57986p6848m89973
10818G859569k61804j10533j12538k04767k82190j11817N3299j28368k36064J33500
10808F598287n6615m19039P1321K06927k54425k03909m8896m55311p0195j28499
10798E239646m48287L3157J309k23541p9163j77334k2472p9102J01784j97850
10788D148147k60255K06437k97987P6412K4777p7540R0332k12191j44943J08816
10778C662005j40614l3821r7097J53549j5220l23761J36209k01000r5637l1611
10768C013002J5216q3888L7123j0166J51886l23216K20994k20555J4410J85761
10758C000567l9487q5005P0190k17791L23661k40412L0163J49637P4940k3748
$$ plain form
10828 11844281 11263445 10518331 10313084 9909356 9524169 8976835 8884376 8426390 8349542 7859569
10818 7859569 7597765 7487232 7374694 7169927 6887737 6775920 6829219 6700851 6464787 6598287
10808 6598287 6541672 6122633 6193954 6400881 6146456 5942547 5893651 5438340 5368145 5239646
10798 5239646 4791359 4824516 4825825 4602284 4523121 4345787 4323315 4244213 4345997 4148147
10788 4148147 3887892 4094329 3796342 3872754 3897531 3819991 3910323 3698132 3553189 3662005
10778 3662005 3521391 3487570 3390473 3544022 3528802 3205041 3341250 3140250 3044613 3013002
10768 3013002 3028218 2944330 2981453 2971287 3123173 2799957 3020951 2800396 2814806 3000567
10758 3000567 2961080 2876075 2946265 2728474 3052135 2811723 2841886 2991523 3066463 3042715
10748C042715j04424N6473J20376j29482j58681O5930k3890k23531p3724M4271
10738B616033j94944K2676J43027j51137k30971K65335l634K000J54149O0178
10728B682712J13049k46316j48090J60774P9079J036M9784M6413k85483P4671
10718B527629L52405l23856N1646O4204n2767K6515J6773J71158j0326j56700
10708B666681Q4367R6542k0516J96137l33644j55612K64902J23947m2783J77834
10698C057855k03363K0842M2887k57860J92733j04857j80951J45432j30468N9144
10688B641394j3017J70273p1859n3344o7613J85981j89218j62901J9802K10899
10678B670397j30471J5054J6954r5964K44809R6602p8188L2455k76204J68400
$$ plain form
10748 3042715 2938291 2994764 3115140 2985658 2826977 2892907 2869017 2645486 2571762 2616033
10738 2616033 2421089 2443765 2586792 2435655 2204684 2470019 2466385 2468385 2622534 2682712
10728 2682712 2795761 2549445 2401355 2562129 2641208 2642244 2692028 2738441 2452958 2527629
10718 2527629 2880034 2556178 2607824 2672028 2619261 2645776 2662549 2833707 2823381 2666681
10708 2666681 2751048 2847590 2827074 3023211 2689567 2533955 2798857 2922804 2880021 3057855
10698 3057855 2854492 2875334 2918221 2660361 2853094 2748237 2567286 2712718 2582250 2641394
10688 2641394 2628377 2798650 2726791 2673447 2605834 2791815 2602597 2439696 2459498 2670397
10678 2670397 2539926 2554980 2571934 2475970 2720779 2817381 2739193 2771648 2495444 2663844
10668B663844p8317J94827m10362l6660R4220k4170R3319j27790k04886J68363
10658B332388j31488L11289k88066m4347M5001j54529K06758J21874j68561k18014
10648B012305L84443k41823k77176K63762n1976k7169j33262j41600J09994R648
10638A907146j61576O5650J40915k33501O2391J5890j75929K28587N5432k77185
10628A627820k2165K15714j77238k00568K74052k91278L93602j93144k05143J11685
10618A533337j05906L31457k64679K23193j6114K30828k16192j42038M770P7814
10608A656470j5430N194j44802L6867M0261N0872o7815R3568j58856L00160j17803
10597A678686k71607M07792k88582J39858j82472J60334K70716k77583q8824K50335
$$ plain form
10668 2663844 2585527 2780354 2369992 2333332 2427552 2403382 2496701 2368911 2164025 2332388
10658 2332388 2200900 2512189 2224123 2179776 2224777 2070248 2277006 2398880 2230319 2012305
10648 2012305 2396748 2154925 1877749 2141511 2089535 2062366 1929104 1787504 1897498 1907146
10638 1907146 1745570 1811220 1952135 1718634 1781025 1796915 1620986 1849573 1905005 1627820
10628 1627820 1605655 1821369 1644131 1443563 1717615 1426337 1819939 1626795 1421652 1533337
10618 1533337 1427431 1758888 1494209 1717402 1701288 1932116 1715924 1573886 1578656 1656470
10608 1656470 1641040 1646234 1501432 1538299 1578560 1629432 1561617 1655185 1496329 1796489 1678686
10597 1678686 1407079 1814871 1526289 1666147 1483675 1644009 1914725 1637142 1548318 1798653
10587A798653j32344J7066m2618K91012k17872J91211J7119N0291k51727K60033
10577A980824l04706J79941n426Q7854k6682k31175L39832l54040J18441j39759
10567A645104K06647j84991M4677j44710K05700l20116M1485J37108j66480j08643
10557A355781J27572j72580M9575o1952J79029j04081L47902l17343M4773j5727
10547A432949O2515o8442j7747m9747J413k3103L6667j37418K67213k37909J20333
10536A386724J94534q0935l49565K76616P464J47821o6235L2012k55495J47289
10526A440230J46423K056k72543K72169J11250O5366j53932K22006R0352R2334
10516B015711R3372O0315R3278M195J23214j73503k16351j05143O154Q889j23363
$$ plain form
10587 1798653 1666309 1683375 1640757 1931769 1713897 1905108 1922227 1972518 1720791 1980824
10577 1980824 1676118 1856059 1850633 1938487 1911805 1680630 2020462 1666422 1784863 1645104
10567 1645104 1851751 1666760 1711437 1566727 1772427 1452311 1493796 1630904 1464424 1355781
10557 1355781 1483353 1310773 1360348 1298396 1477425 1373344 1721246 1403903 1448676 1432949
10547 1432949 1495464 1427022 1409275 1359528 1360941 1337838 1374505 1237087 1504300 1266391 1386724
10536 1386724 1581258 1500323 1150758 1427374 1434838 1582659 1516424 1548436 1292941 1440230
10526 1440230 1586653 1588709 1316166 1588335 1699585 1764951 1611019 1833025 1923377 2015711
10516 2015711 2109083 2169398 2262676 2266871 2390085 2216582 2000231 1895088 1901242 1910131 1786768
10505A786768r928j59973R8468R402j03858M1588J5969J17217k6466j98155M19563
10494A990595n2084j57197P6310K56267J2571J70810K7479K07738k48314J89579
10484B473754j64790n573k3561P3091k35594j70355k5090j86513M48380j73911
10474B009838j9050k86020K74774o3587j40580L74747p8134O6993r1668J8851
10464B066164j13379K90326n4158L03522o3181j98456J50627k188m5410p0423
10454B263444o8957o655K5756K44626N6454L6651J38981j19975J37781j91762
10444B516344R9105R7664j40093K21979p7485K49346j7732M3246M9455L62066
10434C403895N0439j43237k80726L81434m64353p6056k2918k44458J33171j58151
$$ plain form
10505 1786768 1776840 1616867 1715335 1724737 1620879 1662467 1678436 1795653 1769187 1571032 1990595
10494 1990595 1938511 1781314 1857624 2113891 2126462 2297272 2324751 2532489 2284175 2473754
10484 2473754 2308964 2303391 2279830 2352921 2117327 1946972 1921882 1735369 2183749 2009838
10474 2009838 1990788 1704768 1979542 1915955 1775375 2150122 2071988 2138981 2047313 2066164
10464 2066164 1952785 2243111 2188953 2492475 2429294 2230838 2381465 2379277 2333867 2263444
10454 2263444 2194487 2187832 2213588 2458214 2514668 2551319 2690300 2570325 2708106 2516344
10444 2516344 2615449 2713113 2573020 2794999 2717514 2966860 2949128 2992374 3041829 3403895
10434 3403895 3454334 3311097 3030371 3411805 2947452 2871396 2848478 2604020 2737191 2579040
10424B579040k014j70766k37098p1093J2046J95755k01385N2926j39451J70794
10414B188754j73959J64123K04575p6480J9536J58826J55511M21316j41257J05358
10404C026303M9697K81460k94633J05683J39984k77171J57428J92883J4733j59975
10394C236392K36084L13340L757M14794R8125L37436K47240M78456K35876M55208
10384F056708k3105J95067P0109l95755L02854j5995j52703k04138o8944k09325
10374E554773j08372m25982o5179n8647j71687j7214k0570K14775P1833l9402
10364D934328J6172k65265K9097k30470K14885r1132q6471k7263l16366J69477
10354D346992k29227J52941l3829M426j2642k20575J366O2806k51446l8450J96161
$$ plain form
10424 2579040 2577026 2406260 2169162 2098069 2110115 2305870 2104485 2157411 2017960 2188754
10414 2188754 2014795 2178918 2383493 2307013 2326549 2485375 2640886 3062202 2920945 3026303
10404 3026303 3076000 3357460 3062827 3168510 3308494 3031323 3188751 3381634 3396367 3236392
10394 3236392 3472476 3785816 3789573 4204367 4302492 4639928 4887168 5365624 5601500 6056708
10384 6056708 6033603 6228670 6298779 5903024 6205878 6189883 6037180 5833042 5764098 5554773
10374 5554773 5446401 5020419 4955240 4896593 4724906 4707692 4687122 4901897 4973730 4934328
10364 4934328 4950500 4685235 4714332 4483862 4698747 4607615 4521144 4493881 4177515 4346992
10354 4346992 4117765 4270706 4236877 4241303 4228661 4008086 4009452 4072258 3820812 3782362 3978523
10343C978523j87139j05765O3296K16064Q3460j68930m9578K15754l0882M2530
10333D057333J35274q0723J64894j46282r1617P1065j39677J78204o7846k23431
10323C857194J0366j6130l9129K55831q1662l5208J08650j37405J95832L3863
10313D152202j84807M0882J63030K42459L0334R9322J482K82125n215q8764K17085
10302D950135O4315j63184K2826j65320O8179k14267N3495K5370M5765l00597
10292D386717M44094O5744k35816L41215J46645J89634o6056K63903j05024M27366
$$ plain form
10343 3978523 3791384 3685619 3748915 3964979 4048439 3879509 3829931 4045685 4014803 4057333
10333 4057333 4192607 4111884 4276778 4130496 4038879 4109944 3970267 4148471 4080625 3857194
10323 3857194 3867560 3851430 3812301 4068132 3986470 3951262 4059912 3922507 4118339 4152202
10313 4152202 3967395 4008277 4171307 4413766 4444100 4543422 4544904 4827029 4821814 4733050 4950135
10302 4950135 5014450 4851266 4874092 4708772 4776951 4562684 4616179 4641549 4687314 4386717
10292 4386717 4830811 4896555 4660739 5001954 5148599 5338233 5272177 5536080 5431056 5858422
$$ [...]
##END NTUPLES=NMR SPECTRUM
##END=
