##TITLE=Coffee green (M2-ROVE60 + 1.5mL buffer 50/50,  450uL extracto + 50uL (D2O+TMS))
without heating, vortex and centrifuged, temperature 0oC.
##JCAMPDX= 6.0         $$ Bruker NMR JCAMP-DX V2.0
##DATA TYPE= NMR SPECTRUM
##DATA CLASS= NTUPLES
##ORIGIN= Bruker BioSpin GmbH
##OWNER= Administrator
$$ 1.72 TOPSPIN		Version 2.1
$$ 2012-05-22 16:14:23.903 -0700  Administrator@X
$$ Compression mode = diff/dup
##.OBSERVE FREQUENCY= 400.13188196
##.OBSERVE NUCLEUS= ^1H
##.ACQUISITION MODE= SIMULTANEOUS (DQD)
##.ACQUISITION SCHEME= undefined
##.AVERAGES= 64
##.DIGITISER RES= 22
##SPECTROMETER/DATA SYSTEM= spect
##.PULSE SEQUENCE= noesygppr1d
##.SOLVENT NAME= H2O+D2O
##.SHIFT REFERENCE= INTERNAL, H2O+D2O, 1, 14.97964
##AUDIT TRAIL= $$ (NUMBER, WHEN, WHO, WHERE, PROCESS, VERSION, WHAT)
$$ ##TITLE= Audit trail, TOPSPIN		Version 2.1
$$ ##JCAMPDX= 5.01
$$ ##ORIGIN= Bruker BioSpin GmbH
$$ ##OWNER= Administrator
$$ $$ C:\Bruker\TOPSPIN/data/jwist/nmr/11-coffee-green-quantification-2/221/pdata/1/auditp.txt
$$ ##AUDIT TRAIL=  $$ (NUMBER, WHEN, WHO, WHERE, PROCESS, VERSION, WHAT)
(   1,<2011-11-18 13:12:03.075 -0500>,<Administrator>,<TOPSPIN>,<go>,<TOPSPIN 2.1>,
      <created by zg
	started at 2011-11-18 13:03:08.591 -0500,
	POWCHK enabled, PULCHK disabled,
       configuration hash MD5:
       DA 63 81 1B EF 4C B5 72 B4 DF EA D9 B4 DB 4C 08
       data hash MD5: 64K
       62 CA 40 70 D6 A8 07 DE 70 C5 97 F7 F3 D6 5A 0C>)
(   2,<2011-11-18 15:24:27.419 -0500>,<Administrator>,<TOPSPIN>,<proc1d>,<TOPSPIN 2.1>,
      <Start of raw data processing
       efp LB = 0 FT_mod = 6 PKNL = 1 PHC0 = 0 PHC1 = 0 SI = 32K 
       data hash MD5: 32K
       6A BC 28 F8 03 55 BF 3D C6 2A 4D 7B EF 9F 2B A1>)
(   3,<2011-11-18 15:24:27.810 -0500>,<Administrator>,<TOPSPIN>,<proc1d>,<TOPSPIN 2.1>,
      <pk PHC0 = 23.80737 PHC1 = 0 
       data hash MD5: 32K
       00 BC 7B 65 4C 2E 98 6E C8 D9 AC 3B F3 F0 33 52>)
$$ ##END=
$$ 
$$ $$ hash MD5
$$ $$ C1 C5 20 CC 64 88 B1 B2 C1 F9 AB B4 C7 0F 55 F8
##$RELAX= 
##$RELAX= 
##$RELAX= 
##$RELAX= 
##$RELAX= 
##$RELAX= 
##$RELAX= 
$$ Bruker specific parameters
$$ --------------------------
##$DU= <Z:>
##$EXPNO= 221
##$NAME= <11-coffee-green-quantification-2>
##$PROCNO= 1
##$TYPE= <nmr>
##$USER= <jwist>
##$ACQT0= -8.17975531651648
##$AMP= (0..31)
100 100 100 100 100 100 100 100 100 100 100 100 100 100 100 100 100 100
100 100 100 100 100 100 100 100 100 100 100 100 100 100
##$ANAVPT= -1
##$AQSEQ= 0
##$AQ_mod= 3
##$AUNM= <au_prof>
##$AUTOPOS= <>
##$BF1= 400.13
##$BF2= 400.13
##$BF3= 400.13
##$BF4= 400.13
##$BF5= 400.13
##$BF6= 400.13
##$BF7= 400.13
##$BF8= 400.13
##$BYTORDA= 0
##$CFDGTYP= 0
##$CFRGTYP= 9
##$CHEMSTR= <none>
##$CNST= (0..63)
1 1 145 1 1 1 1 1 1 1 1 1 1 1 1 1 1 1 1 1 1 1 1 1 1 1 1 1 1 1 1 1 1 1 1
1 1 1 1 1 1 1 1 1 1 1 1 1 1 1 1 1 1 1 1 1 1 1 1 1 1 1 1 1
##$CPDPRG= <>
##$CPDPRG1= <>
##$CPDPRG2= <>
##$CPDPRG3= <>
##$CPDPRG4= <mlev>
##$CPDPRG5= <mlev>
##$CPDPRG6= <mlev>
##$CPDPRG7= <mlev>
##$CPDPRG8= <mlev>
##$CPDPRGB= <>
$$ [...]
150 150 150 150 150 150 150 150
##$TP07= 0
##$TPNAME0= <>
##$TPNAME1= <>
##$TPNAME2= <>
##$TPNAME3= <>
##$TPNAME4= <>
##$TPNAME5= <>
##$TPNAME6= <>
##$TPNAME7= <>
##$TPOAL= (0..7)
0.5 0.5 0.5 0.5 0.5 0.5 0.5 0.5
##$TPOFFS= (0..7)
0 0 0 0 0 0 0 0
##$TUNHIN= 0
##$TUNHOUT= 0
##$TUNXOUT= 0
##$USERA1= <user>
##$USERA2= <user>
##$USERA3= <user>
##$USERA4= <user>
##$USERA5= <user>
##$V9= 5
##$VALIST= <valist>
##$VCLIST= <CCCCCCCCCCCCCCC>
##$VD= 0
##$VDLIST= <DDDDDDDDDDDDDDD>
##$VPLIST= <PPPPPPPPPPPPPPP>
##$VTLIST= <TTTTTTTTTTTTTTT>
##$WBST= 2048
##$WBSW= 25
##$XGAIN= (0..3)
0 0 0 0
##$XL= 0
##$YL= 0
##$YMAX_a= 5118832
##$YMIN_a= -1750362
##$ZGOPTNS= <>
##$ZL1= 120
##$ZL2= 120
##$ZL3= 120
##$ZL4= 120
##$ABSF1= 0
##$ABSF2= 0
##$ABSG= 0
##$ABSL= 0
##$ALPHA= 0
##$AQORDER= 0
##$ASSFAC= 0
##$ASSFACI= 0
##$ASSFACX= 0
##$ASSWID= 0
##$AUNMP= <proc_prof1d>
##$AXLEFT= 0
##$AXNAME= <>
##$AXNUC= <1H>
##$AXRIGHT= 0
##$AXTYPE= 0
##$AXUNIT= <>
##$AZFE= 0.1
##$AZFW= 0.1
##$BCFW= 0
##$BC_mod= 0
##$BYTORDP= 0
##$COROFFS= 0
##$CY= 15
##$DATMOD= 1
##$DC= 0
##$DFILT= <>
##$DTYPP= 0
##$F1P= 7.86110484944533
##$F2P= 6.24365343106181
##$FCOR= 0.5
##$FTSIZE= 32768
##$FT_mod= 6
##$GAMMA= 0
##$GB= 0
##$INTBC= 1
##$INTSCL= 1
##$ISEN= 128
##$LB= 0
##$LEV0= 0
##$LPBIN= 0
##$MAXI= 10000
##$MC2= 0
##$MEAN= 0
##$ME_mod= 0
##$MI= 0.1
##$NCOEF= 0
##$NC_proc= -6
##$NLEV= 6
##$NOISF1= 0
##$NOISF2= 0
##$NSP= 0
##$NTH_PI= 0
##$NZP= 0
##$OFFSET= 14.97964
##$PC= 1
##$PHC0= 23.80737
##$PHC1= 0
##$PH_mod= 1
##$PKNL= yes
##$PPARMOD= 0
##$PPDIAG= 0
##$PPIPTYP= 0
##$PPMPNUM= 2147483647
##$PPRESOL= 1
##$PSCAL= 0
##$PSIGN= 0
##$PYNMP= <proc.py>
##$REVERSE= no
##$SF= 400.13
##$SI= 32768
##$SIGF1= 0
##$SIGF2= 0
##$SINO= 400
##$SIOLD= 32768
##$SPECTYP= <>
##$SREGLST= <1H.CDCl3>
##$SSB= 0
##$STSI= 32768
##$STSR= 0
##$SW_p= 8223.68421052631
##$SYMM= 0
##$S_DEV= 0
##$TDeff= 65536
##$TDoff= 0
##$TI= <>
##$TILT= no
##$TM1= 0
##$TM2= 0
##$TOPLEV= 0
##$USERP1= <user>
##$USERP2= <user>
##$USERP3= <user>
##$USERP4= <user>
##$USERP5= <user>
##$WDW= 1
##$XDIM= 32768
##$YMAX_p= 304220566
##$YMIN_p= -57139585
##$CURPLOT= <Network HP LaserJet P1505>
##$CURPRIN= <$Network HP LaserJet P1505>
##$DFORMAT= <normdp>
##$LAYOUT= <+/1D_H.xwp>
##$LFORMAT= <normlp>
##$PFORMAT= <normpl>
##$SURQMSG= 1
$$ End of Bruker specific parameters
$$ ---------------------------------
##NTUPLES= NMR SPECTRUM
##VAR_NAME=  FREQUENCY,     SPECTRUM/REAL,   SPECTRUM/IMAG
##SYMBOL=    X,             R,               I
##VAR_TYPE=  INDEPENDENT,   DEPENDENT,       DEPENDENT
##VAR_FORM=  AFFN,          ASDF,            ASDF
##VAR_DIM=   32768,         32768,           32768
##UNITS=     HZ,            ARBITRARY UNITS, ARBITRARY UNITS
##FACTOR=    0.250966925370066, 1,           1
##FIRST=     8223.43324360094, -156326,      -121788
##LAST=      0,             -43372,          27830
##MIN=       0,             -57139585,       0
##MAX=       8223.43324360094, 304220566,    0
$$ Real data points
##PAGE= N=1
##DATA TABLE= (X++(R..R)), XYDATA
$$ [...]
19664A962239N5648J34608j8400j46244L00349r3183j80361J1038J26872j17415
$$ 1962239 2017887 2152495 2134095 1987851 2288200 2195017 2014656 2025694 2152566 2035151
19654B035151J23004J59089j55038k4169o8280J67845j14753K72030k17615N0111
$$ 2035151 2158155 2317244 2162206 2138037 2069757 2237602 2122849 2394879 2177264 2227375
19644B227375j32207O1025J06174j22007k9560R9346k97619K04264J13610K00330
$$ 2227375 2095168 2156193 2262367 2140360 2110800 2210146 1912527 2116791 2230401 2430731
19634B430731l53740P3291J52999j94392j25964Q1315r1563L1541k4001Q6376
$$ 2430731 2076991 2150282 2303281 2108889 1982925 2064240 1972677 2004218 1980217 2066593
19624B066593N9746J6006o400M5624j13898k66021K17142m6660J45591j42444
$$ 2066593 2126339 2142345 2135945 2181569 2067671 1801650 2018792 1972132 2117723 1975279
19614A975279j2770p8514J3082J24343j05860J75154k75243P6985Q6995n5063
$$ 1975279 1962509 1883995 1897077 2021420 1915560 2090714 1815471 1892456 1979451 1924388
19604A924388m486J43073j24476k16737J33741N5878R4713J64375k42559j71326
$$ 1924388 1919902 2062975 1938499 1721762 1855503 1911381 2006094 2170469 1927910 1756584
19594A756584J93907J30896l09302K31038j42318K9875J57948N0064j33977p4365
$$ 1756584 1950491 2081387 1772085 2003123 1860805 1890680 2048628 2098692 1964715 1890350
19584A890350p8825L83575r0295j54519n767o9748J00401J73537j68032p2570
$$ 1890350 1811525 2195100 2104805 1950286 1944519 1874771 1975172 2148709 1980677 1908107
19574A908107J7622R2958p3194q7947j1704j35572J71490J43754o1591k75684
$$ 1908107 1925729 2018687 1945493 1857546 1845842 1710270 1881760 2025514 1963923 1688239
19564A688239L45189k14089r1737M6829L36450k94413J18313j29755q8419J54157
$$ 1688239 2033428 1819339 1727602 1774431 2110881 1816468 1934781 1805026 1716607 1870764
19554A870764J12535l87010Q4044N2570M2597N071l7916J13824j82425R3194j38855
$$ 1870764 1983299 1596289 1680333 1732903 1775500 1780571 1742655 1856479 1674054 1767248 1628393
19543A628393j48461K12911l8366o1170L1699j17716K60347k71331K0614J41801
$$ 1628393 1479932 1692843 1654477 1593307 1625006 1507290 1767637 1496306 1516920 1658721
19533A658721l0221j52682J36332j03163J58911J16332j92337L2156J91204j89646
$$ 1658721 1628500 1475818 1612150 1508987 1667898 1784230 1591893 1624049 1815253 1625607
19523A625607J25167j65853K55733j36818r5454J56608k33023K95796p167m3444
$$ 1625607 1750774 1584921 1840654 1703836 1608382 1764990 1531967 1827763 1820596 1777152
19513A777152N3859j55857O8754J16914J37347n91953R8322J40592r109J08823
$$ 1777152 1831011 1675154 1743908 1860822 1998169 1406216 1504538 1645130 1636021 1744844
19503A744844m9199J79746j39458j9589k68176J91538j21741o2985K82476k0616
$$ 1744844 1695645 1875391 1735933 1716344 1448168 1639706 1517965 1454980 1737456 1716840
19493A716840l81940L51671k65062j38684J13589K76710j10119J2175k59540K03521
$$ 1716840 1334900 1686571 1421509 1282825 1396414 1673124 1563005 1575180 1315640 1519161
19483A519161n3735M4170R6949q3031j08621m7435J85456l41920J01017j18272
$$ 1519161 1465426 1509596 1606545 1523514 1414893 1367458 1552914 1210994 1312011 1193739
19473A193739L08402k53642j043M2264R183J6337j35310j82208m0222J75202J39779
$$ 1193739 1502141 1248499 1247456 1289720 1298903 1315240 1179930 997722 957500 1132702 1272481
19462A272481r4030p2457O9066l00999L66832l37074L8594L45105k20368k25412
$$ 1272481 1178451 1105994 1175060 874061 1240893 903819 942413 1287518 1067150 841738
19452H41738J52381K55789n6430J16838j93289M0733Q0372j71509O8777k5029
$$ 841738 994119 1249908 1193478 1310316 1117027 1157760 1238132 1066623 1135400 1110371
19442A110371J05879m95945L22520M3737k63604K02736j44205K23615j48955j9151
$$ 1110371 1216250 720305 1042825 1086562 822958 1025694 881489 1105104 956149 936998
19432I36998n096J54190k9419j07119j99840L84465p8193k36383j6529O0367K80525
$$ 936998 931902 1086092 1056673 949554 749714 1134179 1055986 819603 803074 863441 1143966
19421A143966j07768R8429j83769q6625M6268L4725q2595j45491K57973J32769
$$ 1143966 1036198 1134627 950858 864233 910501 945226 862631 717140 975113 1107882
19411A107882j54443J12313j50305J44821O7388m8095q2484j27343j15187R8341
$$ 1107882 953439 1065752 915447 1060268 1127656 1079561 997077 869734 754547 852888
19401H52888J02724n0375k0180j07288Q8432j4145K44572k14000N7962n584j86327
$$ 852888 955612 905237 885057 777769 866201 852056 1096628 882628 940590 935006 748679
19390G48679J31476R4046P5115j16050k6715k16046J74201j0472J27439P7484
$$ 748679 880155 974201 1049316 933266 906551 690505 864706 854234 981673 1059157
19380A059157J1423j20462m802j6386N3442j1529j12147R2226m3405k18501M44974
$$ 1059157 1070580 950118 945316 928930 982372 970843 858696 950922 907517 689016 1133990
19369A133990m72690J22676J70552R8146j84868J41161j95141j0138J66565l538
$$ 1133990 661300 783976 954528 1052674 867806 1008967 813826 803688 970253 966715
19359I66715o5357n9983Q028q4038J82079j48629K12756l37639J18534K35150
$$ 966715 901358 841375 849403 765365 947444 798815 1011571 673932 792466 1027616
19349A027616q3198K8267J40258r8861l54693L3175M8934j3973J61900j28145
$$ 1027616 944418 972685 1112943 1014082 659389 692564 741498 727525 889425 761280
19339G61280l4360J40269L2671J7843j33743l4037l321P5761N3025O1572J3001
$$ 761280 726920 867189 899860 917703 783960 749923 746602 822363 875388 936960 949961
19328I49961l84934K88361j66038K14676j94459N7459J70142J13179l62806K47686
$$ 949961 565027 853388 687350 902026 707567 765026 935168 1048347 685541 933227
19318I33227P220n9584M4641k44733J48903q9685K75531l36461K13897Q4620K5594
$$ 933227 940447 880863 925504 680771 829674 739989 1015520 679059 892956 977576 1003170
19307A003170k15368L39753j74128r0896J22487k8060k71611L54132k29959j12742
$$ 1003170 787802 1127555 953427 862531 985018 956958 685347 1039479 809520 696778
19297F96778J83806M871m2295J00825o187j759P8509l1077j6770r0544J55035
$$ 696778 880584 885455 843160 943985 937798 936039 1014548 983471 966701 876157 1031192
19286A031192l59055K54529J05336N2024j99236Q1083K754k0533J31022j11830
$$ 1031192 672137 926666 1032002 1084026 884790 965873 968627 948094 1079116 967286
19276I67286O6323j92791K1028K09645l48587L9086J79372k30612J05686j5424
$$ 967286 1033609 840818 861846 1071491 722904 761990 941362 710750 816436 801012
19266H01012J45754L5699l17918K55001o5868j65892K13381P1796l49702K02564
$$ 801012 946766 982465 664547 919548 853680 687788 901169 972965 623263 825827
19256H25827m806O5723j89561l4489K49545l7637p0790J05169j83062L6353J00163
$$ 825827 821021 886744 697183 662694 912239 874602 803812 908981 725919 762272 862435
19245H62435N8472k80187P01121j64771N0200K92913n4874l536k48587Q058j08288
$$ 862435 920907 640720 1341841 1177070 1227270 1520183 1465309 1461773 1213186 1221244 1112956
19234A112956K1774K598k81779K6360R0867r8054l07713L88572l09623J46302
$$ 1112956 1134730 1137328 855549 881909 972776 874722 567009 955581 645958 792260
19224G92260J87973J66782k44322R5480p9956k50604P6604K28820k29822J67643
$$ 792260 980233 1147015 902693 998173 918217 667613 744217 973037 743215 910858
19214I10858k48495J38323M3349m2152K00381j95670j88190J5926K81808k97279
$$ 910858 662363 800686 844035 801883 1002264 806594 618404 634330 916138 618859
19204F18859J69974k47744J47891J53594k05039o7824J29551q8905Q1196o8953
$$ 618859 788833 541089 688980 842574 637535 569711 699262 610357 691553 622600
19194F22600J115K2223K04153j4434k5493l62791K15474n7314K22421r5173N9921
$$ 622600 623715 645938 850091 835657 810164 447373 662847 605533 827954 732781 792702
19183G92702l23042J89411Q3341K8313J249j04649l5965J71259L6422j74321M1456
$$ 792702 469660 659071 742412 770725 771974 667325 631360 802619 839041 664720 706176
19172G06176K18320k36632K05782j84706l9560j14351L51865l6255l8502l9347
$$ 706176 924496 687864 893646 708940 669380 555029 906894 870639 832137 792790
19162G92790J86136m81730K76765J24137n7935j90849L51669l10754K51488J15494
$$ 792790 978926 497196 773961 898098 840163 649314 1000983 690229 941717 1057211
19152A057211J21331K4063J32593j39273L6088J50827j12581J16228J08630p5036
$$ 1057211 1178542 1202605 1335198 1195925 1232013 1382840 1270259 1386487 1495117 1420081
19142A420081k55168J60843j21497j07349P569J56070m3339l0140P3224Q8145
$$ 1420081 1164913 1325756 1204259 1096910 1104479 1260549 1217210 1187070 1260294 1348439
19132A348439j3030j72127J45812l5295p8763R7682j60442N094N1395n8344j97252
$$ 1348439 1335409 1163282 1309094 1273799 1195036 1292718 1132276 1137370 1188765 1130421 933169
19121I33169L57892j07102j8299j22031J60751M6785m1582J344k32114N9544J22465
$$ 933169 1291061 1183959 1165660 1043629 1204380 1251165 1209583 1210927 978813 1038357 1160822
19110A160822j9062q3992N1868L6741K65263o4229r2861O8341P9458l25721J74444
$$ 1160822 1141760 1057768 1109636 1146377 1411640 1347411 1254550 1322891 1402349 1076628 1251072
19099A251072j00247L86899j32670q4280J34317j56218N9616j51462N02934j71233
$$ 1251072 1150825 1537724 1405054 1320774 1455091 1298873 1358489 1207027 1709961 1538728
19089A538728L22494k33709K50195j01879N79416K37118K27747J76100O15745
$$ 1538728 1861222 1627513 1877708 1775829 2355245 2592363 2820110 2996210 3611955
19080C611955M77160M11345J18302M13892L615j37263o9867j57670j61703l89731
$$ 3611955 4089115 4500460 4618762 5032654 5036269 4899006 4829139 4671469 4509766 4120035
19070D120035m03847l62801k83862n49986l47065J55760r9779r0172K9916j689
$$ 4120035 3716188 3353387 3069525 2519539 2172474 2328234 2228455 2138283 2168199 2166510
19060B166510J69199N03562N90303R7828N12825p732K53185k78903L26609O1504
$$ 2166510 2335709 2839271 3429574 3527402 4040227 4032495 4285680 4006777 4333386 4394890
19050D394890k27862k41060k44450m22467k05629j70616k48585m9714M02492K01528
$$ 4394890 4167028 3925968 3681518 3259051 3053422 2882806 2634221 2584507 2986999 3188527
19040C188527J45581M89037Q06221M21160K01487N32069J20019j18104o3645J61310
$$ 3188527 3334108 3823145 4629366 5050526 5252013 5784082 5904101 5785997 5722352 5883662
19030E883662j95994n53673o89788m78504o05756l51404m98036N4537k85N28J0897
$$ 5883662 5687668 5133995 4444207 3965703 3359947 3008543 2510507 2565044 2564759 2565287 2576184
19019B576184L81849K23305P53074Q4359L04747N28344j89378N1020L33613k38768
$$ 2576184 2958033 3181338 3934412 4018771 4323518 4851862 4662484 4713504 5047117 4808349
19009D808349k42837k84232n07718l50289n60828j95975Q5228n20504n0374J32253
$$ 4808349 4565512 4281280 3773562 3423273 2862445 2666470 2751698 2231194 2180820 2313073
18999B313073p5991o402K22396K29680K85937M48595N94910L86576O0693K05102
$$ 2313073 2237082 2230680 2453076 2682756 2968693 3417288 4012198 4398774 4459467 4664569
18989D664569J76175j09604K90663k82626k93762j95940o6882l54385n6409K19490
$$ 4664569 4840744 4731140 5021803 4739177 4445415 4249475 4182593 3828208 3771799 3991289
18979C991289P9541K98999M35508J070386Q24443J002806R61310J174986J035222
$$ 3991289 4070830 4369829 4805337 5875723 6700166 7702972 8664282 9839268 10874490
18970A0874490J570244J487439J852011K037652K101510J614894J207375P19093
$$ 10874490 12444734 13932173 15784184 17821836 19923346 21538240 22745615 23464708
18962B3464708L55131j58949n76136p76600j572816j856684k249088k008104k497105
$$ 23464708 23819839 23660890 23084754 22308154 20735338 18878654 16629566 14621462 12124357
18953A2124357j664149j854929j190859j063551q99689p48144o17594k72108m35187
$$ 12124357 10460208 8605279 7414420 6350869 5451180 4703036 4085442 3813334 3378147
18944C378147m08683k33296l9218j78860k34936k41952P9076M2789j79790j06035
$$ 3378147 2969464 2736168 2696950 2518090 2283154 2041202 2120278 2163067 1983277 1877242
18934A877242J55923q7200N2342l55554K12672n8415J40586J27263k82062L92776
$$ 1877242 2033165 1945965 1998307 1642753 1855425 1797010 1937596 2064859 1782797 2175573
18924B175573k1891k48442K26452J14523J19804p050o0700M34480j1699j32013
$$ 2175573 2153682 1905240 2131692 2246215 2366019 2358969 2298269 2732749 2721050 2589037
18914B589037K63902M19928K52052M54702O21245M86940Q49940Q86902J123534
$$ 2589037 2852939 3272867 3524919 3979621 4600866 5087806 5937746 6824648 7948182
18905G948182J729362K104023K225572K058568J850059J366960R57248N17963
$$ 7948182 9677544 11781567 14007139 16065707 17915766 19282726 20239974 20757937
18897B0757937j9554j71057r30296j798285j470856k292192k089844j858352j767996
$$ 20757937 20738383 20567326 19637030 17838745 16367889 14075697 11985853 10127501 8359505
18888H359505j338943j257965p65052q02859n51353m17247j71068m81763l69888
$$ 8359505 7020562 5762597 4997545 4194686 3643333 3226086 3055018 2573255 2203367
18879B203367l5109q0009j37811k36249r2624r1518o9545K3680j82668q3730M5748
$$ 2203367 2168258 2088249 1950438 1714189 1621565 1530047 1460502 1484182 1301514 1217784 1263532
18868A263532j89495J51613j96786q2136J27787J68202k68738K17623r4209r1046
$$ 1263532 1074037 1225650 1028864 946728 1074515 1242717 973979 1191602 1097393 1006347
18858A006347l01838o11O0698j73249K92556j88250J41465K57798l64371J42817
$$ 1006347 704509 703898 764596 591347 883903 695653 837118 1094916 730545 873362
18848H73362j7377Q7456N6268k65297K34202J19621l95922K41870N3860j30734
$$ 873362 855985 943441 999709 734412 968614 1088235 692313 934183 988043 857309
18838H57309j9220j30141j1005j9663k6909K10150k10059K22977q5940k25270
$$ 857309 838089 707948 696943 677280 650371 860521 650462 873439 787499 562229
18828E62229J40136M111o2619J01804l1326J45391j1727j3900P9152L778j75812
$$ 562229 702365 706476 643857 745661 714335 859726 847999 834099 913251 917029 741217
18817G41217K74989N1951l17510J08461k04812j69361K15602N3955j96930J71334
$$ 741217 1016206 1068157 750647 859108 654296 484935 700537 754492 557562 728896
18807G28896j53757K97761J64488l35546l3133j30760L56571k67953K60780o0462
$$ 728896 575139 872900 1037388 701842 668709 537949 894520 626567 887347 826885
18797H26885j82478L24209k14125J59085j25781K45808l35092J89665j57284J83382
$$ 826885 644407 968616 754491 913576 787795 1033603 698511 888176 730892 914274
18787I14274n101m8351J10579O8209r5600p3470J1328L5534k3057l909J93418
$$ 914274 909173 860822 971401 1039610 944010 870540 881868 917402 894345 890436 1083854
18776A083854j05111j24665P4530q2906k7578O1633k34501P4819j01858K44313
$$ 1083854 978743 854078 928608 845702 818124 879757 645256 720075 618217 862530
18766H62530n0515k84787J74511j72735J88314n0165j6366L0215j6514m3086J14262
$$ 862530 812015 527228 701739 529004 717318 667153 650787 681002 664488 621402 735664
18755G35664j49940j02988M19235m42757L24766R1277j43293J12756j70357J14469
$$ 735664 585724 482736 901971 459214 783980 875257 731964 844720 674363 788832
18745G88832j74401J01656N8980m0997l19477K2056L10704j47152K200K33315
$$ 788832 614431 716087 775067 734070 414593 436649 747353 600201 602401 835716
18735H35716k85533L30721j38288p757p1030J47102k6412j61171L43925k04751
$$ 835716 550183 880904 742616 734859 663829 810931 784519 623348 967273 762522
18725G62522j04801K28078k23790J59472P2666m4068o6409J4315J91293l4007
$$ 762522 657721 885799 662009 821481 894147 850079 783670 797985 989278 955271
18715I55271k30446J99003r9233P4452k24617M7953K30387j91871k91607K73835
$$ 955271 724825 923828 824595 899047 674430 722383 952770 760899 469292 743127
18705G43127q216J83307k45104k344j8411K10562q3723l47582J88724K0376N3605
$$ 743127 734911 918218 673114 670770 652359 862921 779198 431616 620340 640716 694321
18694F94321j51292J82203j44507J39041k26720M807J01784M820J43842r7751
$$ 694321 543029 725232 580725 719766 493046 497853 599637 604457 748299 650548
18684F50548r900j69061J77923J4009j07202J10688o9451j92314N9610J23803
$$ 650548 640648 471587 649510 663519 556317 667005 597554 405240 464850 588653
18674E88653j60017N5559j448P5003r6127J49186r3120J60453j08715j90850L29495
$$ 588653 428636 484195 482747 557750 461623 610809 517689 678142 569427 378577 708072
18663G08072j34049n5925j037K70232k52216J12644m7624J41060l7191n5595l3753
$$ 708072 574023 518098 517061 787293 535077 647721 600097 741157 703966 648371 614618
18652F14618j91227J30425J36723k3590o8836n1865P5703O8010k8034J29000k3867
$$ 614618 423391 553816 690539 666949 598113 546248 621951 689961 661927 790927 767060
18641G67060l50501K99943J68971j93499m8421j6245j4533J56254j35913M3151
$$ 767060 416559 716502 885473 691974 643553 627308 612775 769029 633116 676267
18631F76267J2358k0609k04854P0633J35158q0984K04945r5500r7456Q0682j98382
$$ 676267 688625 668016 463162 533795 668953 587969 792914 697414 599958 680640 482258
18620D82258J50875j33373j26731L47956B87020K33680O9325p0388J42758j74704
$$ 482258 633133 499760 373029 720985 287020 520700 590025 519637 662395 487691
18610D87691K02214j49652K10111n7242J28391j93972J67293j63803o423M6535
$$ 487691 689905 540253 750364 693122 821513 627541 794834 631031 624608 671143
18600F71143l15336L91312J47538l5124j65031j52341O7312R2301P8228l41m7218
$$ 671143 355807 747119 894657 859533 694502 542161 609473 701774 780002 779661 732443
18589G32443N166k59365L16205o3539r688J33130k24282P6000j31227L0882j20843
$$ 732443 737609 478244 794449 730910 721222 854352 630070 706070 574843 605725 484882
18578D84882L7756J24353R4607j50569Q6377J35091J72550o3964k54704k1881
$$ 484882 522638 646991 741598 591029 677406 812497 985047 921083 666379 644498
18568F44498L0739J1600J16606k18105J091K12371l23507J93786j69286J32063
$$ 644498 675237 686837 803443 585338 586429 798800 475293 669079 499793 631856
18558F31856O8960o4772j92005J82572p050M7719k37107j6942K31910J8944j94750
$$ 631856 700816 636044 444039 626611 619561 667280 430173 413231 645141 664085 469335
18547D69335k03909M19965l00793j14059K90731j3003Q5737r2208l6421j55323
$$ 469335 265426 685391 384598 270539 561270 548267 634004 541796 505375 350052
18537C50052L01244j52576P7001j82420J64980n9091j9167J53797j59874r8035
$$ 350052 651296 498720 575721 393301 558281 499190 480023 633820 473946 375911
18527C75911P0684p5167J12654O6745k60847L36878J30664p6008q2852j65747
$$ 375911 446595 371428 484082 550827 289980 626858 757522 681514 598662 432915
18517D32915J47572j02623J0161k11085K30888J18040j84282r271j40065L4448
$$ 432915 580487 477864 488025 276940 507828 625868 441586 432315 292250 326698
18507C26698K73667j23294L3723M5131Q7782j87965K22572j12146B38972K31946
$$ 326698 600365 477071 510794 555925 643707 455742 678314 566168 238972 470918
18497D70918k07770K15560J27780j96751K86502n3455k13516K44253J19180j94868
$$ 470918 263148 478708 606488 409737 696239 642784 429268 673521 792701 597833
18487E97833j921j23090K84963j49747k8231J46146j00024j14986K4063J7792
$$ 597833 595912 472822 757785 608038 579807 725953 625929 510943 535006 552798
18477E52798r4985k11103L25267O6723n3497K6008k77101k0563L29224k66082
$$ 552798 457813 246710 571977 638700 585203 611211 334110 313547 642771 376689
18467C76689M8518K47397l3144j81713J55108J6703j5691N0411K2565k05748J511
$$ 376689 425207 672604 639460 457747 612855 629558 613867 664278 686843 481095 482606
18456D82606J36541n7073j87550L52581j58399L5820P0915k40819m1437L46369
$$ 482606 619147 562074 374524 727105 568706 604526 675441 434622 393185 739554
18446G39554j61420j90563M00679k54892K8304J9049J81258n4538k2365p7266
$$ 739554 578134 387571 788250 533358 561662 580711 761969 707431 685066 607800
18436F07800K20019k39558M7604r880r9965K84665k05601j17354k576Q1836l467
$$ 607800 827819 588261 635865 625985 526020 810685 605084 487730 485154 566990 563523
18425E63523n8633P1488P3364m9614q9447j32636L73714q4234k49741l6731K48949
$$ 563523 504890 576378 649742 600128 510681 378045 751759 667525 417784 381053 630002
18414F30002K34039k10214j27673J21531q3000N5604k20679L57519l3205o70j07457
$$ 630002 864041 653827 526154 647685 564685 620289 399610 757129 723924 723254 615797
18403F15797L2920l8145R9624j73634M1652j50447J59834P336k5383P1389j28402
$$ 615797 648717 610572 710196 536562 578214 427767 587601 594937 569554 640943 512541
18392E12541J44282j78261o8621J6971l8324A74302J52316J56857J933K08671
$$ 512541 656823 478562 409941 426912 388588 174302 326618 483475 485408 694079
18382F94079k07557K86094k54153J6060k30640Q0128J72414j6322j78118J44569
$$ 694079 486522 772616 518463 534523 303883 384011 556425 540103 361985 506554
18372E06554L620R9215j5566N3830k71747K47886l510j4755j31598R8137M6073
$$ 506554 510174 609389 593823 647653 375906 623792 620282 605527 473929 572066 618139
18361F18139j77169o2673K1084J55703J25780r9475q933j12110Q3487q8739J38035
$$ 618139 440970 378297 399381 555084 680864 581389 572456 460346 543833 455094 593129
18350E93129p5702N1602K2109r2870K76205j50777p2992k27686K11283j03062
$$ 593129 517427 569029 591138 498268 774473 623696 550704 323018 534301 431239
18340D31239J04190R3003r2842j89529P8395P5037j7285K15931k00780j21860
$$ 431239 535429 628432 535590 346061 424456 499493 482208 698139 497359 375499
18330C75499L40710p8723j28916J64501j66063J67194j38474k2952n574J4754
$$ 375499 716209 637486 508570 673071 507008 674202 535728 512776 507202 521956
18320E21956J69623j36516R6794k17704p3331J19362j65150K19695q3051K90452
$$ 521956 691579 555063 651857 434153 360822 480184 315034 534729 451678 742130
18310G42130j48180q7750q2025K32577k75206L4905L95521l29349M6968R890M3531
$$ 742130 593950 506200 424175 656752 381546 416451 811972 482623 529591 539481 583012
18299E83012K48138k56572J3216J97083k52954L04815r2627j9272j42650O6881
$$ 583012 831150 574578 587794 784877 531923 836738 744111 724839 582189 649070
18289F49070k6504R7244k13860K58539k74734j23304K18970k40391J40999O517
$$ 649070 622566 719810 505950 764489 489755 366451 585421 345030 486029 492546
18279D92546J42978j42720o0555K08055p0073B79727M1098Q7664K44763k12264
$$ 492546 635524 492804 432249 640304 570231 279727 320825 408489 653252 440988
18269D40988M5192j0188M4316o8808L0696J60717r4799J5990P8901j17841Q3608
$$ 440988 486180 475992 520308 451500 482196 642913 548114 564104 643005 525164 608772
18258F08772j96370l4162K69832J43778k38329P8164j60126J92402m7964k3093
$$ 608772 412402 378240 648072 791850 553521 631685 471559 663961 615997 592904
18248E92904m084j21720R3175L7325j75722K31941r7340r0026K7171K2616N5842
$$ 592904 588820 467100 560275 597600 421878 653819 556479 466453 493624 516240 572082
18237E72082N376j58478p8484J68615p0761j41147L13503j46021J76169k33015
$$ 572082 577458 418980 340496 509111 438350 297203 610706 464685 640854 407839
18227D07839K62208q5006j16005M3988n084B52224K22005N3485O4053k82424K47090
$$ 407839 670047 585041 469036 513024 507940 252224 474229 527714 591767 309343 556433
18216E56433p9526J45145P2605j51427J58479l49857J02898L7775K43004k87843
$$ 556433 476907 622052 694657 543230 701709 351852 454750 492525 735529 447686
18206D47686j36491K88683Q8636j88015N415q2248j1111L54642j30903m5548o7504
$$ 447686 311195 599878 688514 500499 505914 423666 412555 767197 636294 590746 523242
18195E23242J51331j7520j74096J95057k03243K4041Q3755o954K7406n4815J76179
$$ 523242 674573 657053 482957 678014 474771 498812 582567 575613 603019 548204 724383
18184G24383l9655j91238J50033n6579Q0552j43765j40194J6870K4712K11695
$$ 724383 684728 493490 643523 586944 667496 523731 383537 400407 425119 636814
18174F36814j34614M7913P559l7930J42156j69300R857j23715J90632J46440k00275
$$ 636814 502200 550113 557672 519742 661898 492598 502455 378740 569372 715812 515537
18163E15537N9506O3690k23756Q7417K47660l69550J58093q6211J96793P0883
$$ 515537 575043 638733 414977 502394 750054 380504 538597 452386 649179 720062
18153G20062J0691l18315K5134J0101L13381j65252j68290K66965k34546Q7238
$$ 720062 730753 412438 437572 447673 761054 595802 427512 694477 459931 547169
18143E47169k48015K58073L9614k74894L42230C23617J27428J9737j32777J99758
$$ 547169 299154 557227 596841 321947 664177 323617 451045 470782 338005 537763
18133E37763j11924J10264K480j60796P2752p8526K88067k42164J41609K15470
$$ 537763 425839 536103 538583 377787 450539 372013 660080 417916 559525 774995
18123G74995k38654J4343B65725L60730q5230J56731k28617K8686K88395C55067
$$ 774995 536341 550684 265725 626455 541225 697956 469339 498025 786420 355067
18112E17969n9024K3950M1951M5911N5840j21534j02467O7087Q6682R6843j21850
$$ 517969 458945 482895 524846 570757 626597 505063 402596 469683 556365 653208 531358
18101E31358j78942M18819B82928K33950J18111k37232L9017J57884r8296r6607
$$ 531358 352416 771235 282928 516878 634989 397757 436774 594658 496362 399755
18091C99755K30358j41956q1597J15765J3859k1751L5289B38129L76247q908M915
$$ 399755 630113 488157 406560 522325 536184 514433 549722 238129 614376 605468 610383
18080F10383k61658K15062k05909J53997l4146j3990P9425j39537J48029q2499
$$ 610383 348725 563787 357878 511875 477729 463739 543164 403627 551656 469157
18070D69157j27109j2831K01636M7632j46910M146l1244L4493J21482j09484J14494
$$ 469157 342048 329217 530853 578485 431575 435721 404477 438970 560452 450968 565462
18059E65462j69397O2530r3211J21844M7602j56998J45788J6487n9913j87012
$$ 565462 396065 458595 365384 487228 534830 377832 523620 540107 480194 293182
18049B93182L21062o4269j20317R3852J49425B81989J92599O1823l5495J51628
$$ 293182 614244 549975 429658 523510 672935 281989 474588 536411 500916 652544
18039F52544B41200J91628J71684j04065J13691P1599n9030k5283j09356l1237
$$ 652544 241200 432828 604512 500447 614138 685737 626707 601424 492068 460831
18029D60831j0473p0571J32478J06855j14558A76837M30714r824j99356J89294
$$ 460831 450358 379787 512265 619120 504562 176837 607551 597727 398371 587665
18019E87665k36940O1916J07265A76607M53888Q0164k00266j2731j01878J10955
$$ 587665 350725 412641 519906 176607 630495 710659 510393 497662 395784 506739
18009E06739P1313l356J29565C14941K79427k09681J43409B44618L00780M6514
$$ 506739 578052 574696 704261 314941 594368 384687 528096 244618 545398 591912
17999E91912p4105j89244L49108j78694P839N001P4447J19732q5467r6712k51681
$$ 591912 517807 328563 677671 498977 506816 511817 586264 705996 620529 523817 272136
17988B72136P9918M8140K4225R7798k9050B17027K76526J37892k5988K860l9603
$$ 272136 352054 400194 424419 522217 493167 217027 493553 631445 605457 608317 568714
17977E68714k36664L19725j88914J52207j69816J94573r6589A98304L46002k1554
$$ 568714 332050 651775 462861 615068 445252 639825 543236 198304 544306 522752
17967E22752n3585J24044l8018N4819n8754o8452r7123J35634k9758J25451K13137
$$ 522752 469167 593211 555193 610012 551258 482806 385683 521317 491559 617010 830147
17956H30147k69216m1557l1924j64343J07915J10865j94627K0527J01009q453
$$ 830147 560931 519374 487450 323107 431022 541887 347260 367787 468796 460343
17946D60343K18266M183q2776r9846L3919Q4058L4985o7255O9446n6496j34245
$$ 460343 678609 682792 600016 500170 534089 618147 653132 585877 655323 598827 464582
17935D64582L43681j42412j09868N273Q4086j77324J2330j81029N62746k67313
$$ 464582 808263 665851 555983 561256 645342 468018 480348 299319 862065 594752
17925E94752r4327m5726K45823k1360P3658l12892K82630o6547J24471k39843
$$ 594752 500425 454699 700522 679162 752820 439928 722558 656011 780482 540639
17915E40639j4974K29518o3448j19443J48481J8427M8835j84438O415q904K01031
$$ 540639 525665 755183 691735 572292 720773 739200 788035 603597 610012 601108 802139
17904H02139R7589l36841J54133R4826o1250j61839J73654j33030K51140O1850
$$ 802139 899728 562887 717020 811846 750596 588757 762411 629381 880521 942371
17894I42371j43912k0506N9751J01296j68191q7861J81656m4596j36190O9281
$$ 942371 798459 777953 837704 939000 770809 682948 864604 820008 683818 753099
17884G53099J52851R6914m19921L56695M828r4010P3144j0069M3003l83515L45587
$$ 753099 905950 1002864 582943 939638 944466 850456 923600 913531 956534 573019 918606
17873I18606j060J3170r4912k42336K64889J6653j76040R4640J04689k28723N9336
$$ 918606 917546 930716 835804 593468 858357 875010 698970 793610 898299 669576 728912
17862G28912J3952R3354L1363k27704O4124L7848j09205L08929l15015J0846J55179
$$ 728912 742864 836218 867581 639877 704001 741849 632644 941573 626558 637404 792583
17851G92583j62735J38399m3399j89328J24956L19505l20667Q9905l41725M33154
$$ 792583 629848 768247 724848 535520 660476 979981 659314 749219 407494 840648
17841H40648J0936q5658J14402k83667J04517k4238j29209K90304P3377k1653
$$ 840648 851584 765926 880328 596661 701178 676940 547731 838035 911412 889759
17831H89759k59123j7914R9199o862j97838J58349J37130j48166N7368r2557L12639
$$ 889759 630636 612722 711921 705059 507221 665570 802700 654534 711902 619345 931984
17820I31984j52832j03098q6409K18705J26109m5864l3159R9930k2770k9859m6076
$$ 931984 779152 676054 589645 808350 934459 888595 855436 955366 932596 902737 856661
17809H56661j36891J28402M8080j11893Q6509k4219R5913j58731j93776N0959
$$ 856661 719770 848172 896252 784359 870868 846649 942562 783831 590055 641014
17799F41014M89861j71677r4071O3534j18197J75596k04062P3666n846p2696m0791
$$ 641014 1130875 959198 865127 928661 810464 986060 781998 855664 849818 777122 736331
17788G36331k7698R0884k00233J25810j3494j65940K32994l12394J7066L39656
$$ 736331 708633 799517 599284 725094 711600 545660 778654 466260 483326 822982
17778H22982j84818r3987k4090J37990M3984j48728N6499N6988J28651j97784
$$ 822982 638164 544177 520087 658077 702061 553333 609832 666820 795471 597687
17768E97687J43347o3836J13822o2702L1185n0733O8972K2434j61599j35560L98716
$$ 597687 741034 677198 791020 728318 759503 708770 777742 800176 638577 503017 901733
17757I01733k23791J24884j88958k10910K99881K1243p5489j31742L05111j08865
$$ 901733 677942 802826 613868 402958 702839 724082 648593 516851 821962 713097
17747G13097O3784j04379k18857K98668j2016j50690K48659k45548K24282r8915
$$ 713097 776881 672502 453645 752313 740297 589607 838266 592718 817000 718085
17737G18085N45j60584O6084K50596l12394J84394J12119l81669O0033M13606
$$ 718085 718630 558046 624130 874726 562332 746726 858845 477176 537209 950815
17727I50815k29657j29247j73727J47486J28284L1051K35172k78006K18631k79018
$$ 950815 721158 591911 418184 565670 693954 725005 960177 682171 900802 621784
17717F21784r5733L4831J02737J17951p5460K2304j78011Q5119j66392L86113
$$ 621784 526051 560882 663619 781570 706110 728414 550403 635522 469130 855243
17707H55243j23541j83659J2973M8064k06836K94341j13586J16417l6719P2036
$$ 855243 731702 548043 561016 609080 402244 696585 582999 699416 662697 734733
17697G34733n8115J16551j11439J09097K81801l83071J0254j42149J41389m5771
$$ 734733 676618 793169 681730 790827 1072628 689557 699811 557662 699051 653280
17687F53280L7214k0197j60311K80710p1144J20534k96175J92119n2807J12971
$$ 653280 690494 670297 509986 790696 719552 840086 543911 736030 683223 796194
17677G96194J64644j85671p6617L4895L1710j96941J36356n3860j7337o8575K74435
$$ 796194 960838 775167 698550 733445 765155 568214 704570 650710 633373 564798 839233
17666H39233k08860J53280j94437J47309Q3097j42171K06026k7750n2320o2754
$$ 839233 630373 783653 589216 736525 819622 677451 883477 855727 803407 740653
17656G40653J93985k08172J9862n60J09624n5341j64732L42499l4874N4375q0653
$$ 740653 934638 726466 746328 745768 855392 800051 635319 977818 942944 997319 916666
17645I16666Q227O2355j84561O1062J26762j57247J55611r1623J6066k26486P1364
$$ 916666 924893 987248 802687 863749 990511 833264 988875 897252 913318 686832 758196
17634G58196K36429Q2537j50934j12722J93578J36384n5028j10299K35837k27660
$$ 758196 994625 1077162 926228 813506 1007084 1143468 1088440 978141 1213978 986318
17624I86318K31025J66606j07478j68308n9233R4737J37638M6829L5307j73140
$$ 986318 1217343 1383949 1276471 1108163 1048930 1143667 1281305 1328134 1363441 1190301
17614A190301K7758N0597m8303J55663m443J79572l10734J73517j04151l7650
$$ 1190301 1218059 1268656 1220353 1376016 1371573 1551145 1240411 1413928 1309777 1272127
17604A272127L057N6946R0545K0548j0587J96139k76150Q8934o4842Q9746K18102
$$ 1272127 1275184 1332130 1422675 1443223 1432636 1628775 1352625 1441559 1376717 1466463 1684565
17593A684565j37265j92520L2872J62814j12579q7999K0593l627L4181j13453
$$ 1684565 1547300 1354780 1387652 1550466 1437887 1349888 1370481 1366854 1401035 1287582
17583A287582l9647J79463o8849Q8907J26232r0974j36701k70302K24080m5491
$$ 1287582 1247935 1427398 1358549 1447456 1573688 1482714 1346013 1075711 1299791 1254300
17573A254300J56286k40418K86143o5124j7508j47770J68714j83309J77623j8542
$$ 1254300 1410586 1170168 1456311 1391187 1373679 1225909 1394623 1211314 1388937 1370395
17563A370395j01241n4089P7599j09972J86560j66942m8951L1174m0833J85144
$$ 1370395 1269154 1215065 1292664 1182692 1369252 1202310 1153359 1184533 1143700 1328844
17553A328844j64458j97610L00258J11839l16814J25393m8396J05595l5034R7441
$$ 1328844 1164386 966776 1267034 1378873 1062059 1187452 1139056 1244651 1209617 1307058
17543A307058Q9135P6345k81576Q8891j53689K13509J256o6039J45509M2302k11744
$$ 1307058 1396193 1472538 1190962 1279853 1126164 1339673 1340929 1274890 1420399 1462701 1250957
17532A250957L65680k13565N7360n6796k03515J6158L7010Q1504j2620R0912j38218
$$ 1250957 1616637 1403072 1460432 1403636 1200121 1216279 1253289 1334793 1322173 1413085 1274867
17521A274867R0704l1998N9031n6965j3930j27480K50661J48922P979M3959K10079
$$ 1274867 1365571 1333573 1392604 1335639 1321709 1194229 1444890 1593812 1601791 1645750 1855829
17510A855829j39430L18309j01249m8178j23279M15880R3432j98426J02145J87351
$$ 1855829 1716399 2034708 1933459 1885281 1762002 2177882 2271314 2072888 2175033 2362384
17500B362384j3667j22310K72848N5722L85804J18670Q3867M24374N62026L44521
$$ 2362384 2348717 2226407 2499255 2554977 2940781 3059451 3143318 3567692 4129718 4474239
17490D474239Q42840P45387J331646K711554M787666O899473Q763462R416435
$$ 4474239 5317079 6062466 7394112 10105666 14893332 21792805 30556267 39972702
17482C9972702P895730O049471M065890K297317J073486p06685k632289m163576
$$ 39972702 47868432 53917903 57983793 60281110 61354596 60647911 58015622 53852046
17474E3852046o045897o955511n995245l379924O55938M532458P006891O743434
$$ 53852046 47806149 40850638 34855393 31475469 32131407 36663865 43670756 50414190
17466E0414190N512680L501774K089624Q32174j021216k744587m204904o743835
$$ 50414190 55926870 59428644 61518268 62350442 61329226 58584639 54379735 47635900
17458D7635900q238136q691955q253423n969347m452276k863412j881772j420344
$$ 47635900 39397764 30705809 22452386 16483039 12030763 9167351 7285579 5865235
17450E865235q08010o42659m41222k39639l16460J97426J06412K3775r8929o3239
$$ 5865235 5057225 4414566 3973344 3733705 3417245 3614671 3721083 3744858 3645929 3582690
17440C582690O0812j95638R5047j77642O6630k15166l6040N5647j48945l5061
$$ 3582690 3643502 3447864 3542911 3365269 3431899 3216733 3180693 3236340 3087395 3052334
17430C052334L05665j30389R7202j04745j91251j14756J80067l08531M6801k61041
$$ 3052334 3357999 3227610 3324812 3220067 3028816 2914060 3094127 2785596 2832397 2571356
17420B571356k22887J67149k02098R8793j51700L52092m72012L9990k64164L55654
$$ 2571356 2348469 2515618 2313520 2412313 2260613 2612705 2140693 2180683 1916519 2272173
17410B272173k39568K22307r2752J08691L9884K16916J79517Q5539K79848n2609
$$ 2272173 2032605 2254912 2162160 2270851 2310735 2527651 2707168 2792707 3072555 3019946
17400C019946j52838K52546p534n7231J87174M56661k4479M11160L61100L14846
$$ 3019946 2867108 3119654 3112120 3054889 3242063 3698724 3674245 4085405 4446505 4761351
17390D761351O37895M36346J18160O41668L48292L87775k3800K4232k37829J56395
$$ 4761351 5399246 5835592 5953752 6595420 6943712 7331487 7307687 7331919 7094090 7250485
17380G250485k42240m42519k916j93308m14955K49476j74951L60197K0504M02771
$$ 7250485 7008245 6565726 6562810 6369502 5954547 6204023 6029072 6389269 6409773 6812544
17370F812544L21065M70268N2563K71496L65765k27831O01261j13942k45763K76152
$$ 6812544 7133609 7603877 7656440 7927936 8293701 8065870 8667131 8553189 8307426 8583578
17360H583578l03734r8081j69256j15101m3844K95119K59245L69183Q0656M71208
$$ 8583578 8279844 8181763 8012507 7897406 7853562 8148681 8407926 8777109 8857765 9328973
17350I328973N64531N90813M91017O23536P37700L72325O05038N06161K41555
$$ 9328973 9893504 10484317 10975334 11598870 12336570 12708895 13313933 13820094 14061649
17341A4061649j28178j43653k12671j40885n46909k99419l98312k04511p2131
$$ 14061649 13933471 13789818 13577147 13436262 12889353 12589934 12191622 11987111 11914980
17332A1914980p3695M4617J64439L83240L87121K15730K33294M69943K18105K40648
$$ 11914980 11841285 11885902 12050341 12433581 12820702 13036432 13269726 13739669 13957774 14198422
17322A4198422J025k90257k38221k99976j99784n03239l58161o52859n19207o18521
$$ 14198422 14199447 13909190 13670969 13370993 13171209 12667970 12309809 11656950 11137743 10519222
17312A0519222M8999l36337m22542L01501l92881M84871J28751M52012N42116
$$ 10519222 10568221 10231884 9809342 10110843 9717962 10202833 10331584 10783596 11325712
17303A1325712q0666J77082K39280R9005n7597m3588j62341p1599l16311k06930
$$ 11325712 11245046 11422128 11661408 11760413 11702816 11659228 11496887 11425288 11108977 10902047
17293A0902047p87054k14460j53561j06339P3366k59479M06489l08873K3933j93575
$$ 10902047 10114993 9900533 9746972 9640633 9713999 9454520 9861009 9552136 9576069 9382494
17283I382494K48097o07418j36535l47176l34482m94887n89069l20617o66629
$$ 9382494 9630591 9023173 8886638 8539462 8204980 7710093 7121024 6800407 6133778
17274F133778m76301m01433m77198l58665k497l51710j61366j64963J69566l74381
$$ 6133778 5657477 5256044 4778846 4420181 4417684 4065974 3904608 3739645 3909211 3534830
17264C534830j37205n3383j47337k0462k75125K5586k1607m4100N8288j6538j0573
$$ 3534830 3397625 3344242 3196905 3176443 2901318 2926904 2905297 2861197 2919485 2902947 2892374
17253B892374j24543k01184J49798k17274l417m6637J31854k63170n8042J73516
$$ 2892374 2767831 2566647 2716445 2499171 2495754 2449117 2580971 2317801 2259759 2433275
17243B433275M6920L2569l90567L58914n6949j39929Q2449j18560N0815q341n222
$$ 2433275 2480195 2512764 2122197 2481111 2424162 2284233 2366682 2248122 2298937 2290596 2285374
17232B285374k35317J87610k0555L5795m6965J83483r9993o7200R0767j49308
$$ 2285374 2050057 2237667 2217112 2252907 2205942 2389425 2289432 2222232 2312999 2163691
17222B163691M83369j38829k9603O5656j66152K42789l48585J87704j4842O0035
$$ 2163691 2647060 2508231 2478628 2544284 2378132 2620921 2272336 2460040 2445198 2505233
17212B505233k46165K69617K27164k66543J6397O6617L23573p1899k20524p9633
$$ 2505233 2259068 2528685 2755849 2489306 2505703 2572320 2895893 2823994 2603470 2523837
17202B523837r125J58345j9219l05390o7856M7383j72049j9299j60044k566k43930
$$ 2523837 2514712 2673057 2653838 2348448 2280592 2327975 2155926 2136627 1976583 1974017 1730087
17191A730087L94717k12278j35939j8478J9837k30007K04835j62j04578j21716
$$ 1730087 2124804 1912526 1776587 1758109 1777946 1547939 1752774 1752612 1648034 1526318
17181A526318o5783R740K27767j14612o9868J41279l21063J84881K08561j38180
$$ 1526318 1460535 1470275 1698042 1583430 1513562 1654841 1333778 1518659 1727220 1589040
17171A589040J3487n1587J18294l1797j6809k2396J13122j60434J37285L0079
$$ 1589040 1602527 1550940 1669234 1637437 1620628 1598232 1711354 1550920 1688205 1718284
17161A718284L1105J22742j49196P4666j5951K52791k42031r5638K3133L36876
$$ 1718284 1749389 1872131 1722935 1797601 1781650 2034441 1792410 1696772 1719905 2056781
17151B056781q3098j72325K4391J76811k88763Q9795k56096K97671o6259L03896
$$ 2056781 1973683 1801358 1825749 2002560 1713797 1803592 1547496 1845167 1778908 2082804
17141B082804p7070k21638K75992j66459O9652L11662l51605m0683M9379K4650
$$ 2082804 2005734 1784096 2060088 1893629 1963281 2274943 1923338 1882655 1932034 1956684
17131A956684q615p719k13454R5997k28764K25813j83802J68860J6626J72543
$$ 1956684 1948069 1940350 1726896 1822893 1594129 1819942 1636140 1805000 1821626 1994169
17121A994169q4155r1370K71920k26671J15871Q0832j2483k72889p1154J53338
$$ 1994169 1910014 1818644 2090564 1863893 1979764 2060596 2048113 1775224 1704070 1857408
17111A857408L46101k78220P8919j15948L477J10229P1712N8615k82771K01451
$$ 1857408 2203509 1925289 2004208 1888260 1891737 2001966 2073678 2132293 1849522 2050973
17101B050973j17835O7813k01411J88230k09781J71492l47671p8107j9554j43700
$$ 2050973 1933138 2000951 1799540 1987770 1777989 1949481 1601810 1523703 1504149 1360449
17091A360449N7284m5743J13743k79632j9427j82031J10790j07037J92176j89197
$$ 1360449 1417733 1371990 1485733 1206101 1186674 1004643 1115433 1008396 1200572 1011375
17081A011375N53561l65873r3472n3194j85189M34853k50673K18140k7742L8004
$$ 1011375 1564936 1199063 1105591 1052397 867208 1302061 1051388 1269528 1241786 1279790
17071A279790n2726J9075m8064m2241J99757l75897J35160q5215J66385j46093
$$ 1279790 1227064 1246139 1198075 1155834 1355591 979694 1114854 1029639 1196024 1049931
17061A049931M5265J28517k34280K53677Q5867L9664J08848k3924L36403j93878
$$ 1049931 1095196 1223713 989433 1243110 1328977 1368641 1477489 1453565 1789968 1596090
17051A596090J32671j2466J8773J03087q7684Q7956p6113J36360J48034K58274
$$ 1596090 1728761 1716295 1735068 1838155 1750471 1838427 1762314 1898674 2046708 2304982
17041B304982j78150J91640M0870j00865l124o1715J91798k83720k62544L31871
$$ 2304982 2126832 2318472 2359342 2258477 2255353 2193638 2385436 2101716 1839172 2171043
17031B171043j26267m70896J80340k80432n0982K02736k85892M0522N2784j03964
$$ 2171043 2044776 1573880 1754220 1473788 1422806 1625542 1339650 1380172 1432956 1328992
17021A328992r0922j8096R5617l15996J63691l9921R6392k18449K1410m156K37205
$$ 1328992 1238070 1219974 1315591 999595 1163286 1123365 1219757 1001308 1022718 1018562 1255767
17010A255767l37935L76821j87473p6255k224L09946k12325k18182K49950j34256
$$ 1255767 917832 1294653 1107180 1030925 1028701 1338647 1126322 908140 1158090 1023834
17000A023834J70510l61467L17951l8119P0170k0792p2979M1725k76394J37883
$$ 1023834 1194344 832877 1150828 1112709 1182879 1162087 1089108 1130833 854439 992322
16990I92322o875J55163K9470P4234r8807j72660N45405j96655M6302k17453J16993
$$ 992322 985447 1140610 1170080 1244314 1145507 972847 1518252 1321597 1367899 1150446 1267439
16979A267439L5280J13160k23499L3484J03086o2772K10028j1015p9149J46581
$$ 1267439 1302719 1415879 1192380 1225864 1328950 1266178 1476206 1465191 1386042 1532623
16969A532623O258m4372M74406k72519M03400q2527K13360P9664J36124J11754
$$ 1532623 1538881 1494509 1968915 1696396 2099796 2017269 2230629 2310293 2446417 2558171
16959B558171J32730k15172J73878r1952Q5215l0365m1594J07388j82397k7833
$$ 2558171 2690901 2475729 2649607 2557655 2642870 2612505 2570911 2678299 2495902 2468069
16949B468069P9882n6267k68289k93942J58817J6175j81552k4203j14193j14996
$$ 2468069 2547951 2491684 2223395 1929453 2088270 2104445 1922893 1898690 1784497 1669501
16939A669501o7334j24918j70237p0904O7156j8397O4733n9607P038J77144k10532
$$ 1669501 1602167 1477249 1307012 1236108 1303264 1284867 1349600 1289993 1297031 1474175 1263643
16928A263643J31241k45209j67384K58098p4981J72230J5706k20586L20997l94438
$$ 1263643 1394884 1149675 982291 1240389 1165408 1337638 1353344 1132758 1453755 1059317
16918A059317k13663K58588N1937m8571k06302J42283j64070J37031J5830N7321
$$ 1059317 845654 1104242 1156179 1107608 901306 1043589 879519 1016550 1032380 1089701
16908A089701j01870q7209J15862j81602j25852L51029q8330p6271l7075o0829
$$ 1089701 987831 900622 1016484 834882 709030 1060059 971729 895458 858383 797554
16898G97554O8350J3186l226M131M5899j39793Q5436J854p9123J86440l22029
$$ 797554 865904 879090 875864 879995 925894 786101 871537 873391 794268 980708 658679
16887F58679K5658Q9003M2522J60254n8731l92125K87538l3650l2245M2041R8912
$$ 658679 684337 773340 815862 976116 917385 525260 812798 779148 746903 788944 887856
16876H87856j91117O32J64341p9014J20355k70969L36570k63670J97674j58874
$$ 887856 696739 697371 861712 782698 903053 632084 968654 704984 902658 743784
16866G43784K19294m4830n6802p9764J65028j68806J87622K2927l09108K28884
$$ 743784 963078 918248 861446 781682 946710 777904 965526 988453 679345 908229
16856I08229l4588J90952l04674j1452J04702k3314J8545j07349R6369J28780
$$ 908229 873641 1064593 759919 748467 853169 829855 848400 741051 837420 966200
16846I66200j97659L24006m89025K80085j04265J76036l1442l9382j58582L24762
$$ 966200 768541 1092547 603522 883607 779342 955378 923936 884554 725972 1050734
16836A050734k09475K88604j47277l9846j0268Q2740k0563L0024k1047J06052
$$ 1050734 841259 1129863 982586 942740 932472 1015212 994649 1024673 1003626 1109678
16826A109678L687j2867R9683l1911K90578k73628M1324K79949k22279J96106
$$ 1109678 1113365 1100498 1200181 1168270 1458848 1185220 1226544 1506493 1284214 1480320
16816A480320N0830P6874j90079r4697J63340N9390K9604J622j03973j54258N5076
$$ 1480320 1531150 1608024 1417945 1323248 1486588 1545978 1575582 1577204 1473231 1318973 1374049
16805A374049J74558J9461k19708J17768o5274k8417J62691j48957k12659k7135
$$ 1374049 1548607 1568068 1348360 1466128 1400854 1372437 1535128 1386171 1173512 1146377
16795A146377J97759k07834J08532k23375Q2956j87699N2525Q8279k40219l3999
$$ 1146377 1344136 1136302 1244834 1021459 1104415 916716 969241 1057520 817301 783302
16785G83302M5459j0272l1954J85932l95600J06946J14653k18422J98268j59786
$$ 783302 828761 818489 786535 972467 576867 683813 798466 580044 778312 618526
16775F18526J99825J4071N7122L9938l42575K63227j62000M4799K45625j57797
$$ 618526 818351 832422 889544 929482 586907 850134 688134 732933 978558 820761
16765H20761L8933l12663K33619P4179Q2103k12471N8490m2131K51865J7284k24886
$$ 820761 859694 547031 780650 854829 936932 724461 782951 740820 992685 1009969 785083
16754G85083Q5355J46795j02987j8384J693J44877j49539j01661J01615j33233
$$ 785083 870438 1017233 914246 895862 897555 1042432 892893 791232 892847 759614
16744G59614L0746L1911K73920j95577k5436n4830Q9987R0815j07047R438K25793
$$ 759614 790360 822271 1096191 900614 875178 820348 910335 1001150 894103 903541 1129334
16733A129334l9513j68477J2492q066n5228P2807j09102K42082P8040j29703K63709
$$ 1129334 1089821 921344 933836 925770 870542 943349 834247 1076329 1154369 1024666 1288375
16722A288375l60058J50297r2028Q9262j9878J7472J57307l45989K63523j16462
$$ 1288375 928317 1078614 986586 1075848 1055970 1073442 1230749 884760 1148283 1031821
16712A031821O365n6144l571j3611K85640J01915j4310J89695k17297L18357J85890
$$ 1031821 1038186 982042 978471 964860 1250500 1352415 1338105 1527800 1310503 1628860 1814750
16701A814750j962k09437R0656K05536j2210k75783M2486Q667j33066J85839P2062
$$ 1814750 1812788 1603351 1694007 1899543 1887333 1611550 1654036 1662703 1529637 1715476 1787538
16690A787538j10256P8805j1186j54033L26428l17279J14121J31749j98086m13429
$$ 1787538 1677282 1756087 1744901 1590868 1917296 1600017 1714138 1845887 1647801 1234372
16680A234372K5902J03478j32099k99139K93630n4510Q1725k88342L17038L9492
$$ 1234372 1260274 1363752 1231653 932514 1226144 1171634 1253359 965017 1282055 1321547
16670A321547K07795j92504K21392N4445N3124K51533k31727j74344J90875n1920
$$ 1321547 1529342 1336838 1558230 1612675 1665799 1917332 1685605 1511261 1702136 1650216
16660A650216J6182J03947N2083r587L6085k5499n9570J1884P915J51609o27709
$$ 1650216 1666398 1770345 1822428 1812841 1848926 1823427 1763857 1775741 1783656 1935265 1307556
16649A307556K05370O4240l69622j72634n9924j12167o0055m7059o9163J30395
$$ 1307556 1512926 1577166 1207544 1034910 974986 862819 802764 755705 686542 816937
16639H16937j65656j52958J65016J51432k79156J42164R5624J8882N655k06323
$$ 816937 651281 498323 663339 814771 535615 677779 773403 792285 797940 591617
16629E91617K2221J85555n4034o2773p8982N4932k40843o5594L69960k21822K61734
$$ 591617 613838 799393 745359 682586 603604 658536 417693 352099 722059 500237 761971
16618G61971m3807J25562j30621M4852m3890K77994k19485q8479J99672P6759
$$ 761971 718164 843726 713105 757957 714067 992061 772576 684097 883769 960528
16608I60528l3262K33492m87800K11641j35246J29847K8327J2930j25893K55821
$$ 960528 927266 1160758 672958 884599 749353 879200 907527 920457 794564 1050385
16598A050385r0256q06j10148J21817j36696J38016K1033K9670l18533K29032
$$ 1050385 960129 959323 849175 970992 834296 972312 993345 1023015 704482 933514
16588I33514P7990J11081k35525m2028N8910K8582J80657j30087n4838l8228J46871
$$ 933514 1011504 1122585 887060 845032 903942 932524 1113181 983094 928256 890028 1036899
16577A036899m84629L38597l77141R9496o5007K78675m8657j26141J5302K64455
$$ 1036899 552270 890867 513726 613222 548215 826890 778233 652092 667394 931849
16567I31849j39682q7732L71620j14922j4196L5083J46944k26343n4179K12944
$$ 931849 792167 704435 1076055 961133 946937 982020 1128964 902621 848442 1061386
16557A061386m7084k6431R4445L45348l11682P0700P8463j20987P0634Q782o6258
$$ 1061386 1014302 987871 1082316 1427664 1115982 1186682 1265145 1144158 1214792 1223574 1157316
16546A157316k27522k3017N008O5462j99132R7470K01085j56345K8655O36M9193
$$ 1157316 929794 906777 911785 977247 778115 875585 1076670 920325 948980 949616 998809
16535I98809j0464p8067K07802k13919Q2806Q3404k38593j2175L33339k48198
$$ 998809 988345 910278 1118080 904161 986967 1070371 831778 819603 1152942 904744
16525I04744P84J07796q1501j85182K22236k05323k7476J46059Q2820m1990j00884
$$ 904744 905528 1013324 931823 746641 968877 763554 736078 882137 964957 922967 822083
16514H22083k4029R316p8252J58355j61338M26491j78970j2793o5110O8967P8979
$$ 822083 798054 807370 729118 887473 726135 1152626 973656 960863 895753 964720 1043699
16503A043699j44785J53025j15019r3562j3943j75269N51781j48793l21142K85144
$$ 1043699 898914 1051939 936920 843358 829415 654146 1205927 1057134 735992 1021136
16493A021136j51972J57239j23781K95438L6127M2150J22351N4782n159L9236
$$ 1021136 869164 1026403 902622 1198060 1234187 1276337 1398688 1453470 1448311 1487547
16483A487547J37035K62857n3922J93954k63867M14653n36122L28313O1799k34946
$$ 1487547 1624582 1887439 1833517 2027471 1763604 2178257 1642135 1970448 2032247 1797301
16473A797301J5564j5859r958J74256O6842J93566L2122P7706J02280J9076K6347
$$ 1797301 1812865 1797006 1787048 1961304 2028146 2221712 2253834 2331540 2433820 2452896 2479243
16462B479243J75124J66189j61074L66728j40673L9740M89918M8153j4174K16083
$$ 2479243 2654367 2820556 2659482 3026210 2885537 2925277 3415195 3463348 3449174 3665257
16452C665257P7983O8869K68586L01964Q4007M960J32338J04900L73008J35062
$$ 3665257 3743240 3812109 4080695 4382659 4466666 4471626 4603964 4708864 5081872 5216934
16442E216934P43429L83023Q01759N74807M79325R09134J026171J233524J043350
$$ 5216934 5960363 6343386 7145145 7719952 8199277 9108411 10134582 11368106 12411456
16433A2411456J327395J552064J557111J570166K019872K288605K592735K514777
$$ 12411456 13738851 15290915 16848026 18418192 20438064 22726669 25319404 27834181
16425B7834181L024013L800667L491201M235907M632433M916603N659201N871499
$$ 27834181 30858194 34658861 38150062 42385969 47018402 51935005 57594206 63465705
16417F3465705O538092O501956N309970L905605L024548K858752J973785J695694
$$ 63465705 70003797 76505753 81815723 85721328 88745876 91604628 93578413 95274107
16409I5274107J315398Q94880R67997K2954j205139k771248l583751m179044m537039
$$ 95274107 96589505 97484385 98452382 98475336 97270197 94498949 90915198 86736154 82199115
16400H2199115m849648m867638n468616n273613n068706n142269l520995n65024
$$ 82199115 77349467 72481829 67013213 61739600 56670894 51528625 48007630 47442606
16392D7442606M086643J0369948J5593278J3857032O027170k637030o769802q761417
$$ 47442606 51529249 61899197 77492475 91349507 97376677 94739647 87969845 79208428
16384G9208428r490617q248237n047639l028581n223881j1676198A5507832a3183113
$$ 79208428 69717811 61469574 56421935 53393354 48169473 36493275 15507832 -13183113
16375d1333506j5806079L223039K1427506a124042C1775677K6127649J6799198
$$ -41333506 -57139585 -53916546 -32489040 -1124042 31775677 57903326 74702524
16368G4702524Q857715K963130K64768j488846k990366l943550m667027l906254
$$ 74702524 83560239 86523369 86788137 85299291 82308925 78365375 73698348 69792094
16360F9792094m573018m371317m661928m453677m174365l729688l359469l277799
$$ 69792094 65219076 60847759 56185831 51732154 47557789 43828101 40468632 37190833
16352C7190833k950215k842893l056488k435917k530150k244431k142756j483602
$$ 37190833 34240618 31397725 28341237 25905320 23375170 21130739 18987983 17504381
16344A7504381j412519j193158j392817q26029j362303j279205j427934j161202
$$ 17504381 16091862 14898704 13505887 12679858 11317555 10038350 8610416 7449214
16336G449214p66234r77993r38384o25678p38967o09217o21670j17008m62437
$$ 7449214 6682980 5704987 4766603 4140925 3401958 2792741 2171071 2054063 1591626
16327A591626j55376k34895j33212q6489j36300n8002J43079j6904l54347N0947
$$ 1591626 1436250 1201355 1068143 981654 845354 787352 930431 913527 559180 610127
16317F10127M3631Q9942R8679K25179j31064Q4721P3249r0703J43519K5095r2368
$$ 610127 653758 743700 842379 1067558 936494 1021215 1094464 1003761 1147280 1172375 1080007
16306A080007k6289J12916r7946L47874k73862r4700j15821M53662k31403j88593
$$ 1080007 1053718 1166634 1068688 1416562 1142700 1048000 932179 1385841 1154438 965845
16296I65845L3620J55072l95945L07981k20564P8177m7386j97563J75729n6007
$$ 965845 999465 1154537 758592 1066573 846009 924186 876800 679237 854966 798959
16286G98959n6628R5488j08910L01852J01036k34284K92859J15448j64691O888
$$ 798959 742331 837819 728909 1030761 1131797 897513 1190372 1305820 1141129 1148017
16276A148017j6541p6656j71857K47001j28883j49221R8256J37420o5404m17153
$$ 1148017 1131476 1054820 882963 1129964 1001081 851860 950116 1087536 1022132 604979
16266F04979K82170p3131K8662k08739m3833k37052J36102r1514r1013R1976L41968
$$ 604979 887149 814018 842680 633941 590108 353056 489158 397644 306631 398607 740575
16255G40575k29488J05539J84867k67235K44147K67831j95674k5274K8237n5930
$$ 740575 511087 616626 801493 534258 778405 1046236 850562 825288 853525 797595
16245G97595J77209n1404r2209K63696l52382K86670k2687J83282j20740k19321
$$ 797595 974804 923400 831191 1094887 742505 1029175 1006488 1189770 1069030 849709
16235H49709K82972m4200J41141j91197o1553j31034P2314j68746J65956N7234
$$ 849709 1132681 1088481 1229622 1038425 976872 845838 918152 749406 915362 972596
16225I72596r4585N4774j52236J20603J04079o0049o0360o9243Q6047j16661J17234
$$ 972596 878011 932785 780549 901152 1005231 945182 884822 815579 901626 784965 902199
16214I02199q9503p471q2339K84444j26877M1949p0931m4225j35250J50317k8322
$$ 902199 812696 805225 722886 1007330 880453 922402 851471 807246 671996 822313 793991
16203G93991K1833j6850K19076k50916J10806N1481Q5856k61440K65952k98449
$$ 793991 815824 798974 1018050 767134 877940 929421 1015277 753837 1019789 721340
16193G21340K78485N5405q7870L61858j71465l28111J37999K2845k20526L86688
$$ 721340 999825 1055230 967360 1329218 1157753 829642 967641 990486 769960 1156648
16183A156648k90445l3693j37733J48095J92797k26934j95542K49991m0989M10129
$$ 1156648 866203 832510 694777 842872 1035669 808735 613193 863184 822195 1232324
16173A232324l97709M5687m3838q0705k7589M669J59846N8529j13737M9654j49603
$$ 1232324 834615 880302 836464 755759 728170 732839 892685 951214 837477 887131 737528
16162G37528n9908J92116j87491R3248m9540K14125k52861J44726j12361J63091
$$ 737528 677620 869736 682245 775493 725953 940078 687217 831943 719582 882673
16152H82673k51131K28819N9769R2715l92189K65729Q8884m7679m6463K6810O670
$$ 882673 631542 860361 920130 1012845 620656 886385 975269 927590 881127 907937 914607
16141I14607J29259m23562M67919l86707j2519l0691L8401m8839K69561l3492
$$ 914607 1043866 620304 1088223 701516 688997 658306 696707 647868 917429 883937
16131H83937j63434j24628Q6159J9548K46356K1647k17980K36157j28645K20043
$$ 883937 720503 595875 682034 701582 947938 969585 751605 987762 859117 1079160
16121A079160l15240J33429j57870J11454Q2864r6810K5581r7273J10307J84703
$$ 1079160 763920 897349 739479 850933 933797 836987 862568 765295 875602 1060305
16111A060305j74689M0925r5873j05355K09705j9503K57569l17051r4586L71771
$$ 1060305 885616 926541 830668 725313 935018 915515 1173084 856033 761447 1133218
16101A133218j52476L1179r8066O3225K57339j88740k01145m1764J28202J7798
$$ 1133218 980742 1011921 913855 977080 1234419 1045679 844534 802770 930972 948770
16091I48770J07625M4081J26610j4963l05627K20184l1303j47404L1042O3165
$$ 948770 1056395 1100476 1227086 1212123 906496 1126680 1095377 947973 979015 1042180
16081A042180J39606P9200k51349K05580j02663M0645k9922Q8003l07870L28440
$$ 1042180 1181786 1260986 1009637 1215217 1112554 1153199 1123277 1211280 903410 1231850
16071A231850m826p5779J44182L26749l94468P0174j62979M5908K33966n1309
$$ 1231850 1227024 1151245 1295427 1622176 1227708 1297882 1134903 1180811 1414777 1363468
16061A363468j48351j99666L08468K4280j43244n265J88121J18830k43223L08782
$$ 1363468 1215117 1015451 1323919 1348199 1204955 1199690 1387811 1506641 1263418 1572200
16051A572200J802k74232J47180P7569R4614k73949K83201l33826L49787p034
$$ 1572200 1574002 1299770 1446950 1524519 1619133 1345184 1628385 1294559 1644346 1637312
16041A637312M8892j92914m447R6283K8091N3284k27316J91211L16861l36524
$$ 1637312 1686204 1493290 1488843 1585126 1613217 1666501 1439185 1630396 1947257 1610733
16031A610733J75214J35661k02893L1211l6679J1890K58645k27569K46812r8658
$$ 1610733 1785947 1921608 1718715 1749926 1713247 1725137 1983782 1756213 2003025 1904367
16021A904367N5286l60095L66449l0182R1950O0110O749j41943N4660K7559P2147
$$ 1904367 1959653 1599558 1966007 1935825 2027775 2087885 2094634 1952691 2007351 2034910 2107057
16010B107057K04097l80485L25613r1171q8776J50690j41791J73092J4774K337
$$ 2107057 2311154 1930669 2256282 2165111 2076335 2227025 2085234 2258326 2273100 2275437
16000B275437Q7219k37619J51831j06501l31192J65945K7802J55283O2838j53008
$$ 2275437 2362656 2125037 2276868 2170367 1839175 2005120 2032922 2188205 2251043 2098035
15990B098035L3506M1533j58718L24058r8989k89740J78162R5320Q1874k8007
$$ 2098035 2131541 2173074 2014356 2338414 2239425 1949685 2127847 2223167 2305041 2277034
15980B277034j33037J92904j79290J40887J40306l92437L79614j61064J61293
$$ 2277034 2143997 2336901 2157611 2298498 2438804 2046367 2425981 2264917 2426210
15971B426210k59870O3545P5206N6977j77860J51531j65581M2093j52873J75465
$$ 2426210 2166340 2229885 2305091 2362068 2184208 2335739 2170158 2212251 2059378 2234843
15961B234843j36574k8923K20130m11399K22122q500J21105k9700J45055q2816
$$ 2234843 2098269 2069346 2289476 1878077 2100199 2091699 2212804 2183104 2328159 2245343
15951B245343k59446J72661R0024k0004m4504J55199R586N1260Q924q3043M4152
$$ 2245343 1985897 2158558 2248582 2228578 2184074 2339273 2348859 2400119 2409043 2326000 2370152
15940B370152j12162J01545J56898K76365k87268J0426O5543K6746K19241j40353
$$ 2370152 2257990 2359535 2516433 2792798 2505530 2515956 2581499 2608245 2827486 2687133
15930B687133j26760J27900M05653k71667J66084Q1487l9463L16763p3441Q5082
$$ 2687133 2560373 2688273 3093926 2822259 2988343 3069830 3030367 3347130 3273689 3358771
15920C358771K05811J3685K60486M40623m4694K42215L76955O87792N89319O95753
$$ 3358771 3564582 3578267 3838753 4279376 4234682 4476897 4853852 5541644 6130963 6826716
15910F826716R85390J530043K766219L295318N075086O488403P160796Q179387
$$ 6826716 7812106 9342149 12108368 15403686 20478772 26967175 34127971 42307358
15902D2307358P143968N999343M176116K928036Q39937r61521k773019m731326
$$ 42307358 49451326 55450669 59626785 62554821 63394758 62433237 59660218 54928892
15894E4928892o041515p484898p474180o955609o183235m549827l331689k507035
$$ 54928892 48887377 41402479 33928299 26972690 20789455 16239628 12907939 10400904
15886A0400904k043089j454025p51741q99936p29137k21684n63457j38444m14262
$$ 10400904 8357815 6903790 6152049 5252113 4522976 4301292 3737835 3599391 3185129
15877C185129k5458j69408p2600j23216J30076k68077O432K8205j57890m4639
$$ 3185129 3159671 2990263 2917663 2794447 2924523 2656446 2662878 2691083 2533193 2488554
15867B488554J19213j55155Q3482j90222j10510L5216j84809K99450O1957j49589
$$ 2488554 2607767 2452612 2536094 2345872 2235362 2270578 2085769 2385219 2447176 2297587
15857B297587q2137l57l6022k57062L73252j87820r1411n9873K23192j93930r936
$$ 2297587 2215450 2215093 2179071 1922009 2295261 2107441 2016030 1956157 2179349 1985419 1975483
15846A975483K2037L59531m36488J86941J201k43960L31198l12938L58836O6970
$$ 1975483 1997520 2357051 1920563 2107504 2108705 1864745 2195943 1883005 2241841 2308811
15836B308811J52172k00928p1491L20230j20986M7238j69038K4168N5224k16142
$$ 2308811 2460983 2260055 2188564 2508794 2387808 2435046 2266008 2290176 2345400 2129258
15826B129258R0511R0297k20348J61463o1346l1429K1956n6522Q602K5655J1309
$$ 2129258 2219769 2310066 2089718 2251181 2189835 2158406 2180362 2123840 2132442 2158097 2169406
15815B169406j94694J18649K24892r0402q4609M2873J74956K78155k65361J90699
$$ 2169406 1974712 2093361 2318253 2227851 2143242 2186115 2361071 2639226 2373865 2564564
15805B564564l49719J73879p925o1983K54635n1420J47699O1211K12185J35173
$$ 2564564 2214845 2388724 2380799 2318816 2573451 2522031 2669730 2730941 2943126 3078299
15795C078299K01110l6588J05701K32629m1432J8323J64639P3139l7753k74224
$$ 3078299 3279409 3242821 3348522 3581151 3539719 3558042 3722681 3795820 3758067 3483843
15785C483843O51054k37214M07388j31538M70456k3713J45063K79170k0243j22224
$$ 3483843 4134897 3897683 4305071 4173533 4643989 4620276 4765339 5044509 5024266 4902042
15775D902042J57957j52204L9225k81846K59609r2603J03225l947K90660p3914
$$ 4902042 5059999 4907795 4947020 4665174 4924783 4832180 4935405 4931458 5222118 5148204
15765E148204p2628K7551P8187J38723J62448n21753J69672k7855J28252k84053
$$ 5148204 5075576 5103127 5181314 5320037 5482485 4960732 5130404 5102549 5230801 4946748
15755D946748K45164j33638o4288j65945J64811J97533j10597j47367M70322m7472
$$ 4946748 5191912 5058274 4993986 4828041 4992852 5190385 5079788 4932421 5402743 5355271
15745E355271K17565N8118o425N44871Q6608m1236K11992K00076J88065J9554
$$ 5355271 5572836 5630954 5624529 6169400 6256008 6214772 6426764 6626840 6814905 6834459
15735F834459j42588L02433N0001P9266n3258K71174M7418J36100N3504k63597
$$ 6834459 6691871 6994304 7044305 7123571 7070313 7341487 7388905 7525005 7578509 7314912
15725G314912P902n1439o5405k16273j24174o8281j00596l35629R5099J29507
$$ 7314912 7322814 7271375 7205970 6989697 6865523 6797242 6696646 6361017 6456116 6585623
15715F585623k49279o6507m1537P6199O8695m88364J63706j26328K32599l09699
$$ 6585623 6336344 6269837 6228300 6304499 6373194 5884830 6048536 5922208 6154807 5845108
15705E845108L17286J08307R7513K46846K34651J93644J1151Q2670Q4213L3903
$$ 5845108 6162394 6270701 6368214 6615060 6849711 7043355 7054506 7137176 7221389 7255292
15695G255292K79407j89620j50448J55895k79003J67918k81904j29622p243K2883
$$ 7255292 7534699 7345079 7194631 7350526 7071523 7239441 6957537 6827915 6820672 6843555
15685F843555r3333l72840K13679r0643r3247p4895l9148j87748J52490l85177
$$ 6843555 6750222 6377382 6591061 6500418 6407171 6332276 6293128 6105380 6257870 5872693
15675E872693J68997k04351r525m07563K28338K40282R430O6864j5087J80866
$$ 5872693 6041690 5837339 5827814 5420251 5648589 5888871 5898301 5965165 5950078 6130944
15665F130944L10414K92610K61527M09842L31366L96336M00857O03564L38169
$$ 6130944 6441358 6733968 6995495 7405337 7736703 8133039 8533896 9137460 9475629
15656I475629P34484N48418L22256Q37899O18189O63814N75118Q81882M53544
$$ 9475629 10210113 10758531 11080787 11918686 12536875 13200689 13775807 14657689 15111233
15647A5111233P11651N44908K67263J028316R61028Q46329R16779P73246J316074
$$ 15111233 15822884 16367792 16635055 17663371 18624399 19470728 20387507 21160753 22476827
15638B2476827O36361N77273L12603L02602L89098q0535n9842m04475r4721k13357
$$ 22476827 23113188 23690461 24003064 24305666 24694764 24614229 24554387 24149912 24055191 23841834
15628B3841834j74272J88465k44742q4441j07625j50093o26163o84546p41273
$$ 23841834 23667562 23856027 23611285 23526844 23419219 23269126 22642963 21958417 21217144
15619B1217144j067904q08135j147501o48285j233844o92705o87839o43155m31862
$$ 21217144 20149240 19341105 18193604 17545319 16311475 15618770 14930931 14287776 13855914
15610A3855914m73669l74633k79074q50208k82015m36722j29452n33992l80978
$$ 13855914 13382245 13007612 12728538 11878330 11596315 11159593 11030141 10496149 10115171
15601A0115171j31530r2155k88908K07359o8715J82956K41706O30438J119095
$$ 10115171 9983641 9891486 9602578 9809937 9741222 9924178 10165884 10796322 11915417
15592A1915417K556649N547277R857091J1800723Q067908N451016L755469K190738
$$ 11915417 14472066 20019343 29876434 41677157 49745065 55196081 58951550 61142288
15584F1142288J234513k53155j797737m617729p080718q610910r115793q482143
$$ 61142288 62376801 62123646 60325909 55708180 48627462 40016552 30900759 22418616
15576B2418616n256362l027740k062857j881848j132315m81098j63191k29920
$$ 22418616 17162254 14134514 12071657 10189809 9057494 8576396 8413205 8183285
15568H183285j76933J13148M6822r3236J5217K29664M74062L58893M75066Q38979
$$ 8183285 8006352 8119500 8166322 8073086 8088303 8317967 8792029 9150922 9625988 10464967
15558A0464967K111048M119415Q692798J4391603J4431950R924540O224689M486452
$$ 10464967 12576015 16695430 25388228 39779831 54211781 64136321 70361010 74847462
15550G4847462K498301Q81325o33986l755178o656589j0127654j1448050j2489591
$$ 74847462 77345763 78227088 77593102 73837924 67181335 57053681 45605631 33116040
15542C3116040j0094970o181583l604301k435135j680145j518243n40600p54910
$$ 33116040 23021070 16839487 13235186 10800051 9119906 7601663 7061063 6306153
15534F306153l52756Q4557l72270Q5102j91642k8559j88240j72913r6660j92115
$$ 6306153 5953397 6037954 5665684 5750786 5559144 5530585 5342345 5169432 5072772 4880657
15524D880657j54164j59718j3193k5688j74484J32772j82274O2615J00848M6806
$$ 4880657 4726493 4566775 4553582 4527894 4353410 4486182 4303908 4366523 4467371 4514177
15514D514177j4021Q7894L41133k03977K09557K1175J72871m5633P4601j72418
$$ 4514177 4500156 4588050 4929183 4725206 4934763 4955938 5128809 5083176 5157777 4985359
15504D985359l7824j72335K41908l30948L1960l5166j30621R4776J61669j92796
$$ 4985359 4947535 4775200 5017108 4686160 4718120 4682954 4552333 4647109 4808778 4615982
15494D615982J3650K1945K28923k54977J43079J80695K58305L2910N1545L09510
$$ 4615982 4629632 4651577 4880500 4625523 4768602 4949297 5207602 5240512 5292057 5601567
15484E601567J42953P0845L61546k24700K54532R7404R4208k9980J91185J15575
$$ 5601567 5744520 5815365 6176911 5952211 6206743 6304147 6398355 6368375 6559560 6675135
15474F675135L5464M80936L51838M94919N19248N99111O30838L02578J91143K63033
$$ 6675135 6710599 7191535 7543373 8038292 8557540 9156651 9787489 10090067 10281210 10544243
15464A0544243K15188j99806l07520j57632l67704j38127r7678J73024M70279
$$ 10544243 10759431 10559625 10252105 10094473 9726769 9588642 9490964 9663988 10134267
15455A0134267J57010O00322J01399M03533K87139r7894J28711l33014k49847
$$ 10134267 10291277 10891599 10992998 11396531 11683670 11585776 11714487 11381473 11131626
15446A1131626l70209l91117k54924k45421O0752l20944J42049J5099L2196R5939
$$ 11131626 10761417 10370300 10115376 9869955 9930707 9609763 9751812 9766911 9799107 9895046
15436I895046O3124k30848k18858k12677l85427k94925l53571J8458l42658m61778
$$ 9895046 9958170 9727322 9508464 9295787 8910360 8615435 8261864 8280322 7937664 7475886
15426G475886r4555j5505k16669k65892k60550N1448k22247k50331R6114l70049
$$ 7475886 7381331 7365826 7149157 6883265 6622715 6674163 6451916 6201585 6297699 5927650
15416E927650q0396j51827j36224k40221P9721K4068j44533Q8242m1451Q2751
$$ 5927650 5847254 5695427 5559203 5318982 5398703 5422771 5278238 5366480 5325029 5407780
15406E407780O9130N4426J2938J97355R705M8994O5171j9196J93149j8686O4240
$$ 5407780 5476910 5531336 5544274 5741629 5751334 5800328 5865499 5846303 6039452 6020766 6085006
15395F085006l3808J07195k47747N6436j81603l25510J94573m4181M0146l10828
$$ 6085006 6051198 6158393 5910646 5967082 5785479 5459969 5654542 5610361 5650507 5339679
15385E339679M67457n1383O958M814K25176j95846o1676j41943l777J13881j21677
$$ 5339679 5807136 5755753 5762711 5767525 5992701 5796855 5735179 5593236 5589459 5703340 5581663
15374E581663o9521K1480N6091o0809K73451J46784l90562L85890k26933K53048
$$ 5581663 5512142 5533622 5589713 5528904 5802355 5949139 5558577 5944467 5717534 5970582
15364E970582K37991M3008o6073J82143J47549L41595k55189K20379J2359L37249
$$ 5970582 6208573 6251581 6185508 6367651 6515200 6856795 6601606 6821985 6834344 7171593
15354G171593L06478J67653O33245N79352J476999K200690M395583O389153N725349
$$ 7171593 7478071 7645724 8278969 8858321 10335320 12536010 16931593 23320746 29046095
15345B9046095M108754K833681K239547J475178N68105k79404j450816k533783
$$ 29046095 33154849 35988530 38228077 39703255 40271360 39991956 38541140 36007357
15337C6007357l627170m338221m703510l520762k375259j348471q77020q60742
$$ 36007357 32380187 28041966 23338456 19817694 17442435 16093964 15216944 14356202
15329A4356202n35099l70128m50604j05457j33113l89466J26867j42771K47496
$$ 14356202 13821103 13450975 13000371 12894914 12761801 12372335 12499202 12356431 12603927
15320A2603927J28216N14114J037065J572308L296724N947248R198723J0460843
$$ 12603927 12732143 13246257 14283322 15855630 19152354 25099602 34298325 44759168
15312D4759168R369020P181760N024405K742244J819565n7711j940976m301046
$$ 44759168 54128188 61309948 66334353 69076597 70896162 70838451 68897475 64596429
15304F4596429o889330q698645r573749q616524p105996m728794k730029j735526
$$ 64596429 57707099 49008454 39434705 30818181 23712185 18983391 16253362 14517836
15296A4517836j129713q75803l26556R0634j42737q6483j99932J81696k38784
$$ 14517836 13388123 12512320 12185764 12276398 12133661 12047178 11847246 12028942 11790158
15287A1790158K56194K44951l19615K66606N57010J081959K488055M398037O067392
$$ 11790158 12046352 12291303 11971688 12238294 12795304 13877263 16365318 20763355 26830747
15278B6830747N078749L497218K199805J675385J159282j02501p01121j844210
$$ 26830747 31909496 35406714 37606519 39281904 40441186 40338685 39637564 37793354
15270C7793354l252568m294608m780750m973007l547870k351175j664308j215660
$$ 37793354 34540786 30246178 25465428 20492421 16944551 14593376 12929068 11713408
15262A1713408q61153m24427j047064N2614j54053j11245n1694L31930n7213J21758
$$ 11713408 10852255 10427828 9380764 9433378 9279325 9168080 9116386 9448316 9391103 9512861
15252I512861L05945K99506J29126J22045m7661q0714j39288q2934k49427k90547
$$ 9512861 9818806 10118312 10247438 10369483 10321822 10241108 10101820 10018886 9769459 9478912
15242I478912m9292l58875j60245M03913j41163K34270P12404J61989P03070M34622
$$ 9478912 9429620 9070745 8910500 9314413 9173250 9407520 10119924 10281913 10984983 11419605
15232A1419605l1269N32903l90895K48090j78301n37049J22063p71152p1981l40615
$$ 11419605 11388336 11921239 11530344 11778434 11600133 11063084 11185147 10413995 10342014 10001399
15222A0001399l56690r5112J33216J10519L85062J73129K6165M54082J49775j06431
$$ 10001399 9644709 9549597 9682813 9793332 10178394 10351523 10377688 10831770 10981545 10875114
15212A0875114K26936k52220o0932o08709j10459k89021o51488n09844m67002
$$ 10875114 11102050 10849830 10788898 10180189 10069730 9780709 9129221 8619377 8152375
15203H152375n06642o36823M7747l50999j61877j57054j77375p5548N5345J00621
$$ 8152375 7645733 7008910 7056657 6705658 6543781 6386727 6209352 6133804 6189149 6289770
15193F289770K36998Q2917K93407K4096R7861P0039J04426J73584j64388J42705
$$ 6289770 6526768 6609685 6903092 6927188 7025049 7095088 7199514 7373098 7208710 7351415
15183G351415m9751J92984J90696n0364K55857J24701J13332K73827J05034l7198
$$ 7351415 7301664 7494648 7685344 7634980 7890837 8015538 8128870 8402697 8507731 8470533
15173H470533l41332L78747n6011j10621J0079J0173o7699k35524J06483L71265
$$ 8470533 8129201 8507948 8451937 8341316 8351395 8361568 8293869 8058345 8164828 8536093
15163H536093l23383k52195J61700j59683K03959J95756J63376k21044K78855
$$ 8536093 8212710 7960515 8122215 7962532 8166491 8362247 8525623 8304579 8583434
15154H583434p7087k0374p3244N756j75800j8584l5106p2383J1142j67777J17367
$$ 8583434 8506347 8485973 8412729 8418485 8242685 8224101 8188995 8116612 8127754 7959977 8077344
15143H077344M414K74872j76767k34595M11298k98513M03335k04939q1396J05450
$$ 8077344 8081758 8356630 8179863 7945268 8356566 8058053 8461388 8256449 8175053 8280503
15133H280503p532j02700L4309J37311j21229k51460J63479L3504k22950r9462
$$ 8280503 8272971 8170271 8204580 8341891 8220662 7969202 8132681 8166185 7943235 7843773
15123G843773J44626L5253k75056L16796l57317K0244K0011n6891k11724j0735
$$ 7843773 7988399 8023652 7748596 8065392 7708075 7728319 7748330 7691439 7479715 7468980
15113G468980n9447j62235K85927L6131n4541K7561R5511K08667K09796K4120
$$ 7468980 7409533 7247298 7533225 7569356 7514815 7542376 7637887 7846554 8056350 8080470
15103H080470K80294J20864K01772J12202L70177p3057M20012M51949J25559O08968
$$ 8080470 8360764 8481628 8683400 8795602 9165779 9092722 9512734 9964683 10090242 10699210
15093A0699210P01244J075484J422927K651494K385075J823715J390617J081897
$$ 10699210 11400454 12475938 13898865 16550359 18935434 20759149 22149766 23231663
15085B3231663N76621L14450L15649k09907p00174p75886j144638n45019p80J382500
$$ 23231663 23808284 24122734 24438383 24228476 23528302 22752416 21607778 21062759 21061979 22444479
15075B2444479K053393J936933J342870P97562R41778L41938K52755l9368m02031
$$ 22444479 24497872 26434805 27777675 28575237 29517015 29858953 30111708 30072340 29670309
15066B9670309L17243R06385K191163K127948J373427J825309J385529K276471
$$ 29670309 29987552 30893937 33085100 35213048 36586475 38411784 39797313 42073784
15058D2073784K167706J969999J646579L84895m53723o61758j056012J92858K033391
$$ 42073784 44241490 46211489 47858068 48242963 47789240 47127482 46071470 46264328 48297719
15049D8297719K451399J445244Q30277K50935J03820O88715M60797Q2101l18572
$$ 48297719 50749118 52194362 53024639 53275574 53379394 54068109 54528906 54611007 54292435
15040E4292435j787806k855804k731912k920526k201105k384622k244519j885761
$$ 54292435 52504629 49648825 46916913 43996387 41795282 39410660 37166141 35280380
15032C5280380j117035J46314J400935J079984N80181Q14328R73880M99015J467116
$$ 35280380 34163345 34309659 35710594 36790578 37370759 38185087 39158967 39657982 41125098
15023D1125098O70519O20252M57393K14739J198912K126878M123618M915844N426867
$$ 41125098 41795617 42415869 42873262 43088001 44286913 46413791 50537409 55453253 60880120
15014F0880120N260074N366536N283940N066817L623922K625339J988535R66755
$$ 60880120 66140194 71506730 76790670 81857487 85481409 88106748 90095283 91062038
15006I1062038J026814P82878J301670K751323L803256M980528O343631P371780
$$ 91062038 92088852 92871730 94173400 96924723 100727979 105708507 112052138 119423918
14998A19423918P090426O426421M545461L142409J015972j271878m106169o165646
$$ 119423918 126514344 132940765 137486226 140628635 141644607 140372729 136266560 130100914
14990A30100914p708472q171536q116175q324399p833761p103740n693328n009374
$$ 130100914 122392442 114220906 106104731 97780332 89946571 82842831 77149503 72140129
14982G2140129m291731m005787l868298l715061m190447m251019m195573l549376
$$ 72140129 67848398 63842611 59974313 56259252 52068805 47817786 43622213 40072837
14974D0072837k731583k563440k734987j683935j179665q94200k41552P0136M7629
$$ 40072837 37341254 34777814 32042827 30358892 29179227 28285027 28043475 28113611 28161240
14965B8161240K16621k3853M56808O85319R67786J637333K593152M475530N763233
$$ 28161240 28377861 28354008 28810816 29496135 30463921 32101254 34694406 39169936 44933169
14956D4933169Q298037J1351527J5295140J8501756K1223163K4102685K7017089
$$ 44933169 53231206 64582733 79877873 98379629 119602792 143705477 170722566
14949A70722566K7201701K6938285K7453224K5444711J7674239Q615351J70489
$$ 170722566 197924267 224862552 252315776 277760487 295434726 304050077 304220566
14942C04220566n810636r899601j1881727j5338129j8289889k0977029k1031406
$$ 304220566 298409930 288510329 276628602 261290473 243000584 222023555 200992149
14935B00992149k0492037j8044946j4107180j0252473r090142r340659r142584
$$ 200992149 180500112 162455166 148347986 138095513 129005371 119664712 110522128
14928A10522128r866025q954065o651796m478487k520591k487224l356067l716106
$$ 110522128 100656103 91702038 85050242 80571755 78051164 75563940 72207873 68491767
14920F8491767l500843l697301l536722l762389m122176n175915n987361n767749
$$ 68491767 64990924 61293623 57756901 53994512 49872336 44696421 38709060 32941311
14912C2941311n902311m524544l335057k069834j178513q53895n63040n3254j3115
$$ 32941311 27039000 22514456 19179399 17109565 15931052 15077157 14514117 14460863 14447748
14903A4447748N54126P64917P72786J196449J375755K508389L823334M458114
$$ 14447748 15001874 15766791 16539577 17736026 19111781 21620170 25443504 29901618
14895B9901618M183298K990806K064134J205709N96208m3514q70533j817949k560842
$$ 29901618 34084916 37075722 39139856 40345565 40941773 40898259 40027726 38209777 35648935
14886C5648935l583912m085180l811784k774096k296233j191049o33532m26196
$$ 35648935 32065023 27979843 24168059 21393963 19097730 17906681 17273149 16846953
14878A6846953n06230N11525O63436Q88935L64226L23488R2204K24416M07961
$$ 16846953 16340723 16852248 17515684 18404619 18768845 19092333 19184537 19408953 19816914
14869A9816914L99204J87462K95413j719o8220M81292J055449K012703M219865
$$ 19816914 20216118 20403580 20698993 20697274 20629054 21110346 22165795 24178498 28398363
14860B8398363O043636P214771P450628P770673Q127282N903869M170658K254294
$$ 28398363 34441999 41656770 49107398 56878071 65005353 70909222 75079880 77334174
14852G7334174L804j417566l969508n911708p207282p508045q001927p383613
$$ 77334174 77337978 75920412 71950904 66039196 58831914 51323869 43321942 35938329
14844C5938329n972348m649406l367313j624464j741050j069495r11763p95115
$$ 35938329 29965981 25316575 21949262 20324798 18583748 17514253 16602490 15807375
14836A5807375k22646l19397m41448l17922j80823P4651K82386j80248O56292
$$ 15807375 15584729 15265332 14823884 14505962 14325139 14399790 14682176 14501928 15158220
14827A5158220L00055N50176Q05216J319988K177877L253143N263657O982801
$$ 15158220 15458275 16008451 16813667 18133655 20311532 23564675 28828332 35811133
14819C5811133O109249M851437L209078J941961R80905n12443j170134k734597
$$ 35811133 41920382 46771819 49980897 51922858 52903763 52391320 51221186 48486589
14811D8486589m361523n848388o085586o341386n275820l200666k331914j271267
$$ 48486589 44125066 38276678 32191092 25849706 20573886 17373220 15041306 13770039
14803A3770039j021049p88011n67122l27102k44464k5607O7519m42337J2891m50947
$$ 13770039 12748990 11960979 11393857 11066755 10822291 10796684 10864203 10421866 10434757 9983810
14793I983810j25342k02098J05358k46244k78499j992r0533Q5099k9101J31095
$$ 9983810 9858468 9656370 9761728 9515484 9236985 9234993 9144460 9229559 9200458 9331553
14783I331553J44109J91179O31404N83910R58332K17851O69710n3043M73913J64970
$$ 9331553 9475662 9666841 10298245 10882155 11840487 12058338 12728048 12675005 13148918 13313888
14773A3313888m64004j9667l58952m32327n33315q39740m05433n81528j65381
$$ 13313888 12849884 12830217 12471265 12038938 11505623 10665883 10260450 9678922 9513541
14764I513541j03649J83525j97987j97108J21998K60663Q6139L57180k32001J24240
$$ 9513541 9409892 9593417 9395430 9198322 9320320 9580983 9667122 10024302 9792301 9916541
14754I916541K54034L63079P2596N74001J20372L93397K5818K61766M2931K12260
$$ 9916541 10170575 10533654 10606250 11180251 11300623 11694020 11719838 11981604 12024535 12236795
14744A2236795j71792N48587N18141K09721M80479J030885J108324J841467K286777
$$ 12236795 12065003 12613590 13131731 13341452 13821931 14852816 15961140 17802607 20089384
14735B0089384K718808M854686P354006J1186026J8018950K3970051K6412271
$$ 20089384 22808192 27662878 35016884 46202910 64221860 88191911 114604182
14728A14604182K7875622K5558708K0275862J3992619Q165926K007005l609340
$$ 114604182 142479804 168038512 188314374 202306993 210472919 212479924 208870584
14721B08870584j0392488j6969969k2606856k6438561k6393396k3858120j9825415
$$ 208870584 198478096 181508127 158901271 132462710 106069314 82211194 62385779
14714F2385779j4834057j0177501o954309n036602m033385k942295j802070j592572
$$ 62385779 47551722 37374221 30419912 25383310 21349925 18407630 16605560 15012988
14706A5012988r57431q74025r15841o88012o96000p79875o84638n07490p5013
$$ 15012988 14055557 13181532 12265691 11577679 10881679 10101804 9417166 8909676 8834663
14697H834663k21794l50065J87560j08398m4339p0685j91487J28678j01605J04224
$$ 8834663 8612869 8262804 8450364 8341966 8297627 8226942 8035455 8164133 8062528 8166752
14687H166752p4380J48148M9639Q971K2090K6132M05000J9069P63012Q51521O13222
$$ 8166752 8092372 8240520 8290159 8299130 8321220 8347352 8752352 8771421 9534433 10385954 10999176
14676A0999176P48607P21994J78393L02476k32186k89231l68311n31298n64910
$$ 10999176 11747783 12469777 12648170 12950646 12718460 12429229 12060918 11529620 10964710
14667A0964710m21869l93668o42360l30791l34816j15045n19959K84105k16380
$$ 10964710 10542841 10149173 9506813 9176022 8841206 8726161 8206202 8490307 8273927
14658H273927j78358j59246l04030n60244k71605k13727j49801L023J16896M21985
$$ 8273927 8095569 7936323 7632293 7072049 6800444 6586717 6436916 6439939 6556835 6978820
14648F978820M53539J86690K45518K37228L37715J67209R5588O41601K21612M00413
$$ 6978820 7432359 7619049 7864567 8101795 8439510 8606719 8702307 9343908 9565520 9965933
14638I965933P08256N11731Q91067L53606O785n6854j66174l07694n54455p62106
$$ 9965933 10674189 11185920 12076987 12430593 12437378 12380524 12214350 11906656 11352201 10590095
14628A0590095r80835j255034j056770q90404q32574p14084k16479l14619J11905
$$ 10590095 9609260 8354226 7297456 6407052 5574478 4860394 4643915 4329296 4441201
14619D441201K6342j56186L5982j08411J0634r6251k01848j89537K94524O7836
$$ 4441201 4467543 4311357 4347339 4238928 4249562 4153311 3951463 3761926 4056450 4124286
14609D124286k91576j09081l7397J23530k02229J33676L65973N74172N98423R79931
$$ 4124286 3832710 3723629 3686232 3809762 3607533 3741209 4107182 4681354 5279777 6259708
14599F259708Q60922J059920M63919M98382O6509j17988L19846k74778m69388
$$ 6259708 7120630 8180550 8644469 9142851 9209360 9091372 9411218 9136440 8667052
14590H667052p44188q66693p94660p14936n47774m30739k79067J00998p0445k44445
$$ 8667052 7922864 7056171 6261511 5546575 4998801 4568062 4288995 4389993 4319548 4075103
14580D075103R8234k3347O7079p4807J06599J49471k26448K29684N26620j73222
$$ 4075103 4173337 4149990 4217069 4142262 4248861 4398332 4171884 4401568 4928188 4754966
14570D754966L31470K69301P13273N43458O12633P27843O80077R79695J633232
$$ 4754966 5086436 5355737 6069010 6612468 7225101 7952944 8633021 9612716 11245948
14561A1245948L686280N558138O840936N522582L389381K661893J612334P81303
$$ 11245948 14932228 20490366 27331302 32853884 36243265 38905158 40517492 41298795
14553D1298795J85629p80897k356482l747455m436826m849016m229812m57228
$$ 41298795 41484424 40703527 38347045 34599590 30162764 25313748 21083936 20626708
14545B0626708K523582N899497N854479M686923L441081K077501J160021N14187
$$ 20626708 23150290 29049787 34904266 39591189 43032270 45109771 46269792 46783979
14537D6783979m22238k278609l946649m753708n783350n748913m385331l272615
$$ 46783979 46361741 44083132 40136483 35382775 29599425 23850512 19465181 16192566
14529A6192566j479970j041161q04318m71109q0724J25902m3669J076487K473612
$$ 16192566 14712596 13671435 12867117 12396008 12315284 12441186 12397517 13474004 15947616
14520A5947616M441561M539836L357085K292981J759948J272539R93966K58938
$$ 15947616 20389177 24929013 28286098 30579079 32339027 33611566 34605532 34864470
14512C4864470k04689j053419k475604k734171l298624j768806L63025K632972
$$ 34864470 34659781 33606362 31130758 28396587 25097963 23329157 23692182 26325154
14504B6325154M302622L191505K131877J669315R78952K94536k67982j015540
$$ 26325154 30627776 33819281 35951158 37620473 38599425 38893961 38625979 37610439
14496C7610439j805923k740851l532793m221495m181921l452237k267516k066906
$$ 37610439 35804516 33063665 29530872 25309377 21127456 17675219 15407703 13340797
14488A3340797j620995j251249j102595j218387j186627r22930p16997o36939
$$ 13340797 11719802 10468553 9365958 8147571 6960944 6038014 5321017 4684078
14480D684078k72694l81680P8917j78670N8751j04938K58517K51729N53555Q12121
$$ 4684078 4411384 4029704 4108621 3929951 3988702 3883764 4142281 4394010 4947565 5759686
14470E759686M45972K99426K03401L93263r7017J92836m7391J14203j7175K76547
$$ 5759686 6205658 6505084 6708485 7101748 7004731 7197567 7150176 7264379 7247204 7523751
14460G523751K21381M44064J83384M57061p2806K24519J73554l01655l08611k35608
$$ 7523751 7745132 8189196 8372580 8829641 8756835 8981354 9154908 8853253 8544642 8309034
14450H309034l78602n41901n06897k36849k06961K961K38159L42333M1474J80502
$$ 8309034 7930432 7388531 6881634 6644785 6437824 6440785 6678944 7021277 7062751 7243253
14440G243253N95505J02831J53455M6590K40771K40018K10349O68191R30358J249030
$$ 7243253 7838758 7941589 8095044 8141634 8382405 8622423 8832772 9500963 10431321 11680351
14430A1680351L014162M161661M468950M664237M026893K765846K300200J415307
$$ 11680351 14694513 18856174 23325124 27989361 32016254 34782100 37082300 38497607
14422C8497607O85498l7256j621880k659198l360836m188505m397070m038059
$$ 38497607 39183105 39145849 37523969 34864771 31503935 27315430 22918360 18880301
14414A8880301k713717k395955j457902j391215j259602o52778n77609n27481
$$ 18880301 16166584 13770629 12312727 10921512 9661910 9009132 8431523 7904042
14406G904042l50248K0421j96640J72520l46251M11529n9996M33266M67355Q09930
$$ 7904042 7553794 7574215 7377575 7550095 7203844 7615373 7555377 7988643 8455998 9265928
14396I265928J241318K211817L276571N600671P495530Q274051P538374O482780
$$ 9265928 10507246 12719063 15995634 21596305 29091835 37365886 44904260 51387040
14388E1387040N052052L417160J849480n5115j394927l511890n488290o909786
$$ 51387040 56439092 59856252 61705732 61650617 60255690 56743800 51255510 44345724
14380D4345724p616883o874287o460327m804427l540350k409974j916094j269869
$$ 44345724 36728841 29854554 23394227 18589800 15049450 12639476 10723382 9453513
14372I453513o58803o56368l99561k38323k05406m71616K7346k33224k2026m4733
$$ 9453513 8794710 8138342 7738781 7500458 7295052 6823436 6850782 6617558 6595532 6550799
14362F550799K06901J48380P19012L86050J409731J368767K531122K754343L726787
$$ 6550799 6757700 6906080 7625092 8011142 9420873 10789640 13320762 16075105 19801892
14353A9801892L432507K380958J896581J513204J33251l57648p79307j768495
$$ 19801892 23234399 25615357 27511938 29025142 29158393 28800745 28021438 26252943
14345B6252943k288741k818249k991815k943520k379654j579241q30711N39418
$$ 26252943 23964202 21145953 18154138 15210618 12830964 11251723 10421012 10960430
14337A0960430K015988K698292J300256R38795Q50078R12728K35651M24728k93027
$$ 10960430 12976418 15674710 16974966 17913761 18763839 19676567 19912218 20336946 20043919
14328B0043919o08983j092183j185851j527844q96894K36700J257655J902123
$$ 20043919 19434936 18342753 17156902 15629058 14732164 14968864 16226519 18128642
14320A8128642K258617L452549N253393O312508R137931J2871372J4775467J5806451
$$ 18128642 20387259 23839808 29093201 35405709 44543640 57415012 72190479 87996930
14312H7996930J3683708J1041563P821783N121361J637606j153076m919057q443090
$$ 87996930 101680638 112722201 120543984 125665345 127302951 126149875 121230818 112787728
14304A12787728j2037508j4866214j5684095j4158432j1703991q784496o913006
$$ 112787728 100750220 85884006 70199911 56041479 44337488 35552992 28639986
14297B8639986n155852m134845k919082k349626j977505j575474j087857j150023
$$ 28639986 23484134 19349289 16430207 14080581 12103076 10527602 9439745 8289722
14289H289722p48976n53369m08307n46973k17441l10183l80618l92732j20339
$$ 8289722 7540746 6987377 6579070 6032097 5814656 5504473 5123855 4731123 4610784
14280D610784j16285j59877j74372J55966k12738k8380n982j82954j56468L28032
$$ 4610784 4494499 4334622 4160250 4316216 4103478 4075098 4069116 3886162 3729694 4057726
14270D057726l41510o5296l16124j26251j2698j74650N11j09644R5567k25483
$$ 4057726 3716216 3650920 3334796 3208545 3195847 3021197 3021708 2912064 3007631 2782148
14260B782148J93535J2880k93016O9069k3807k09675p4008Q2035j70195R4389
$$ 2782148 2975683 2988563 2695547 2764616 2740809 2531134 2457126 2539161 2368966 2463355
14250B463355j61573j37262L14408k23731L8505j1930j37848K14835o7802K52867
$$ 2463355 2301782 2164520 2478928 2255197 2293702 2281772 2143924 2358759 2290957 2543824
14240B543824m44741J02968n5937p5148L71111Q4221l47809L43339k70244p951
$$ 2543824 2099083 2202051 2146114 2070966 2442077 2526298 2178489 2521828 2251584 2243633
14230B243633l6839k73099K7721J11003K803K07465k60657O0991j13252j36051
$$ 2243633 2206794 1933695 1961416 2072419 2075222 2282687 2022030 2083021 1969769 1833718
14220A833718K66419l5435j1404K4324K41867K869j41211J06498j3727J78781
$$ 1833718 2100137 2064702 2053298 2077622 2319489 2322358 2181147 2287645 2273918 2452699
14210B452699L738Q78944L95685M10086j05979M9037K30206k15613K11786j37444
$$ 2452699 2456437 3335381 3731066 4141152 4035173 4084210 4314416 4098803 4310589 4173145
14200D173145k18540o66305p3150q33612k70292N0644M8928j3805q3841K65787
$$ 4173145 3954605 3288300 3215150 2381538 2111246 2161890 2210818 2197013 2113172 2378959
14190B378959k46754J29804J06254k82413j20249m2025L00013k36664n3978J6493
$$ 2378959 2132205 2262009 2368263 2085850 1965601 1923576 2223589 1986925 1932947 1949440
14180A949440j4817K32540m4453q8R2093O9890m2844j82423K52055j30611P482
$$ 1949440 1934623 2167163 2122710 2122622 2214715 2284605 2241761 2059338 2311393 2180782 2188264
14169B188264k83748K37961j03752p8780J44960r7555j31256J85186j61276J53692
$$ 2188264 1904516 2142477 2038725 1959945 2104905 2007350 1876094 2061280 1900004 2053696
14159B053696m9614L28968r8729k41272J15828P3992J01840j19777j2946L21856
$$ 2053696 2004082 2333050 2234321 1993049 2108877 2182869 2284709 2164932 2151986 2473842
14149B473842j47607J50656M9214j70612L92019J97106K69701N60391Q18519J496625
$$ 2473842 2326235 2476891 2526105 2355493 2747512 2944618 3214319 3774710 4593229 6089854
14139F089854P81678R03806P62354M30038L19621Q8488L6518n79339o96683n24785
$$ 6089854 6871532 7775338 8537692 8967730 9287351 9375839 9412357 8833018 8136335 7611550
14129G611550j544201p72277p12299n20256l75024l75030N897J35651L47780J07979
$$ 7611550 6067349 5295072 4582773 4062517 3687493 3312463 3318360 3454011 3801791 3909770
14119C909770M0439J36754j25939L47186j37413j61955j52925j10659m98719l9656
$$ 3909770 3950209 4086963 3961024 4308210 4170797 4008842 3855917 3745258 3246539 3206883
14109C206883n41423J44675j75868N3083o8782j61490J16730M2503Q1818M81027
$$ 3206883 2665460 2810135 2634267 2687350 2618568 2457078 2573808 2616311 2698129 3179156
14099C179156L96762K69635L83315K08470L88087j1161J44266j03275O1453k64846
$$ 3179156 3575918 3845553 4228868 4437338 4825425 4814264 4958530 4855255 4916708 4651862
14089D651862l92189o9496j12734M05023M54536L51930M32312J82494J57361j75849
$$ 4651862 4259673 4190177 4077443 4482466 4937002 5288932 5721244 5903738 6061099 5885250
14079E885250L17105l02965o1071k20003k57442l94045n24708k56759k16049q800
$$ 5885250 6202355 5899390 5838319 5618316 5360874 4966829 4442121 4185362 3969313 3960513
14069C960513P7951k27262J34901r0980K77399K55237J57568M48490L99317N97070
$$ 3960513 4038464 3811202 3946103 3855123 4132522 4387759 4545327 4993817 5393134 5990204
14059E990204O52818m961M23118N07200J77675L93267N42306L86755P21467L52951
$$ 5990204 6643022 6638061 7061179 7568379 7746054 8139321 8681627 9068382 9789849 10142800
14049A0142800J205422J250961J666524K039537K470002L726119M268170N710508
$$ 10142800 11348222 12599183 14265707 16305244 18775246 22501365 26769535 32480043
14041C2480043P722131J0628063J3928045J6335160J5627911J3108531J0194189
$$ 32480043 40202174 50830237 64758282 81093442 96721353 109829884 120024073
14034A20024073P073447L965919N85164k867652o462343j0179967j3432381j6266179
$$ 120024073 127097520 131063439 131648603 128780951 122318608 112138641 98706260 82440081
14026H2440081j5967742j3795109j0788102q405169o020724m951181l551112k949030
$$ 82440081 66472339 52677230 41889128 33483959 27463235 22512054 18960942 16011912
14018A6011912k458275j533710j469328j387565p49680o61469q99563m75293l75543
$$ 16011912 13553637 12019927 10550599 9163034 8413354 7751885 6852322 6377029 6001486
14009F001486m16658k82898n71722j14906k73059k69374j30170p2829k81685o9008
$$ 6001486 5584828 5301930 4730208 4615302 4342243 4072869 3942699 3869870 3588185 3519177
13999C519177k75735J67749k1412k088k59995K00010R1894o1015K7867K75286
$$ 3519177 3243442 3411191 3389779 3387691 3127696 3327706 3419600 3358585 3386452 3661738
13989C661738L17248J40429N68766M53152N99712N68995P03760K03546L20169
$$ 3661738 3978986 4119415 4688181 5141333 5741045 6310040 7013800 7217346 7537515
13980G537515J50297o6215n4002k57312l19948o48429n89658o20842k68246m42031
$$ 7537515 7687812 7621597 7567595 7310283 6990335 6341906 5752248 5131406 4863160 4421129
13970D421129n18929k42861l24612j06012K14792n11285L16313k34577l01641
$$ 4421129 3902200 3659339 3334727 3228715 3443507 2932222 3248535 3013958 2712317
13961B712317J69419m54613L06348j55680l79429J26605P104j19008R0937J63744
$$ 2712317 2881736 2427123 2733471 2577791 2198362 2324967 2332071 2213063 2304000 2467744
13951B467744R5301K85212J06903q160K58799K27525j03889N05048M94592O70318
$$ 2467744 2563045 2848257 2955160 2947000 3205799 3433324 3329435 3834483 4329075 4999393
13941D999393J292192K087624L050221L228963L618871L181290L352215J974669
$$ 4999393 6291585 8379209 11429430 14658393 18277264 21458554 24810769 26785438
13933B6785438J059387N21583o68413j155964k415470l251345l308461l274553
$$ 26785438 27844825 28366408 27697995 26542031 24126561 20875216 17566755 14292202
13925A4292202l341086k595011k077982j359346j092318p87177l42528m32017
$$ 14292202 10951116 8356105 6278123 4918777 3826459 3039282 2696754 2264737
13917B264737J47211l15984N4305j10117k87993K767N7362J59282q1153j35811
$$ 2264737 2411948 2095964 2150269 2040152 1752159 1754926 1812288 1971570 1890417 1754606
13907A754606O9476k67424J93151Q1874j3551N0506k62792J56457j85785R0367
$$ 1754606 1824082 1556658 1749809 1831683 1818132 1868638 1605846 1762303 1576518 1666885
13897A666885Q8498q0313j63486O6472K01975k11681J57006J92475m4033l75431
$$ 1666885 1755383 1675070 1511584 1578056 1780031 1568350 1725356 1917831 1873798 1498367
13887A498367p091J87070L79J26148L1474k05175j15364O8923q1075M7869N1861
$$ 1498367 1491276 1678346 1678725 1804873 1836347 1631172 1515808 1584731 1503656 1551525 1603386
13876A603386j6628n5697l4719J71120q047k75972K20162J41732m3919j81681
$$ 1603386 1586758 1531061 1496342 1667462 1659415 1383443 1603605 1745337 1701418 1519737
13866A519737L10671m2270K6760L3746J22988l47054K3729M6833R7265K17488
$$ 1519737 1830408 1788138 1814898 1848644 1971632 1624578 1648307 1695140 1792405 2009893
13856B009893o1189j56514k4254L00404k53029o9168J0290j5256K02663J13300
$$ 2009893 1948704 1792190 1767936 2068340 1815311 1746143 1756433 1741177 1943840 2057140
13846B057140k49795j384M2995j24212j03686J23099q2997k54655K7568J36556
$$ 2057140 1807345 1805961 1848956 1724744 1621058 1744157 1661160 1406505 1434073 1570629
13836A570629p686J08056l83418K16211J90462j96687j93797L55515K1178M1202
$$ 1570629 1562943 1670999 1287581 1503792 1694254 1497567 1303770 1659285 1680463 1721665
13826A721665l64775J49721n8829Q9743J14529q1395m3912j40258n818j28530
$$ 1721665 1356890 1506611 1447782 1537525 1652054 1570659 1526747 1386489 1380671 1252141
13816A252141J24476n7863J35467q6254j86873K49990K37138k65989q7369J68735
$$ 1252141 1376617 1318754 1454221 1367967 1181094 1431084 1668222 1402233 1314864 1483599
13806A483599l2782j299k47069K87734J32602j87414O1863O3521l05406J11212
$$ 1483599 1450817 1449518 1202449 1490183 1622785 1435371 1497234 1560755 1255349 1366561
13796A366561J27363Q5327j3185m7259K7451K2520j06065o0538P438J496m6739
$$ 1366561 1493924 1579251 1566066 1518807 1546258 1568778 1462713 1402175 1409613 1411109 1364370
13785A364370j75319J09784P561o6153k12633K65842J35082k76761O2214O15J48496
$$ 1364370 1189051 1298835 1306396 1240243 1027610 1293452 1428534 1151773 1213987 1214602 1363098
13774A363098j62632K07634m1611p7214O2222j3263Q1446J33117l9718j5297J38882
$$ 1363098 1200466 1408100 1366489 1289275 1351497 1338234 1419680 1552797 1513079 1497782 1636664
13763A636664m04252K71173j53056J95909l7191l9166n6505j67721Q3346N3033
$$ 1636664 1232412 1503585 1350529 1546438 1509247 1470081 1413576 1245855 1329201 1382234
13753A382234L32570k04435J20809K33413j2608L542m5877J44775J702N4291j45
$$ 1382234 1714804 1510369 1631178 1864591 1851983 1855525 1809648 1954423 1956125 2010416 2010271
13742B010271L7759j34365R0014m53184K04933l7207M8179l97326L79017k59293
$$ 2010271 2048030 1913665 2003679 1550495 1755428 1718221 1766400 1369074 1748091 1488798
13732A488798K63784j11259L1060n3794j59996J54571L434R0582L0701l51441
$$ 1488798 1752582 1641323 1672383 1618589 1458593 1613164 1616598 1707180 1737881 1386440
13722A386440K23916j61809L99736o8233l22093J61766j37110K29973j04706K29405
$$ 1386440 1610356 1448547 1848283 1780050 1457957 1619723 1482613 1712586 1607880 1837285
13712A837285k85421O2240K04357R2576q9746o8901J28753M266K419p6801L28854
$$ 1837285 1551864 1614104 1818461 1911037 1821291 1752390 1881143 1885409 1887828 1811027 2139881
13701B139881l92365J89555j39873J65364J9310J47579L09025n6324J66289J02319
$$ 2139881 1747516 1937071 1797198 1962562 1981872 2129451 2438476 2382152 2548441 2650760
13691B650760J9712r3666N6399j17810m1137k29542k7594m32828K69012j46189
$$ 2650760 2670472 2576806 2633205 2515395 2474258 2244716 2217122 1784294 2053306 1907117
13681A907117k82912J81314J52514J8423n0627l2083K01498k94125K15690J58584
$$ 1907117 1624205 1805519 1958033 1976456 1925829 1893746 2095244 1801119 2016809 2175393
13671B175393m8628K1864j5895K87678p208J77717K90810K92519J39886l51487
$$ 2175393 2126765 2148629 2132734 2420412 2413204 2590921 2881731 3174250 3314136 2962649
13661B962649Q0621P7529j58120M6902n4771k76065M9825m32858R0079p4844l41757
$$ 2962649 3043270 3120799 2962679 3009581 2954810 2678745 2728570 2295712 2385791 2310947 1969190
13650A969190K99583k77387P5817j62529O7134M4135R5322j13588M3869M4874
$$ 1969190 2268773 1991386 2067203 1904674 1971808 2015943 2111265 1997677 2041546 2086420
13640B086420k43953L19925J97334P5180J52771n6675K12512j00021L50930l52994
$$ 2086420 1842467 2162392 2359726 2434906 2587677 2531002 2743514 2643493 2994423 2641429
13630B641429J93224k00842O0800L1945j22347k78310j26665m2143r210k40469
$$ 2641429 2834653 2633811 2694611 2726556 2604209 2325899 2199234 2157091 2147881 1907412
13620A907412j81818L3691Q7000p0522l7260J92677j55867k2573K2210J17883
$$ 1907412 1725594 1759285 1846285 1775763 1738503 1931180 1775313 1752740 1774950 1892833
13610A892833J98504P5952j0245k57454J69181K29617q7893k54182N2395J27025
$$ 1892833 2091337 2167289 2157044 1899590 2068771 2298388 2210495 1956313 2008708 2135733
13600B135733p1737k82976P1285J16038m44M7309J24964O5035p3288M7374Q3185
$$ 2135733 2063996 1781020 1852305 1968343 1967899 2015208 2140172 2205207 2131919 2179293 2262478
13589B262478j38592n8918O114n3441R182j45557O3997l64744K83324j71536l2254
$$ 2262478 2123886 2064968 2071082 2017641 2026823 1881266 1945263 1580519 1863843 1692307 1660053
13578A660053K71218l25926J18521k02758K0406M4595p9464J86091L38549l06945
$$ 1660053 1931271 1605345 1723866 1521108 1541514 1586109 1506645 1692736 2031285 1724340
13568A724340r3643j24441K18677J8448J0266j14923J20977j58344r4737J35425
$$ 1724340 1630697 1506256 1724933 1743381 1753647 1638724 1759701 1601357 1506620 1642045
13558A642045j40278j14038K40639O3136l05484J60703J00413r8169j68990J88719
$$ 1642045 1501767 1387729 1628368 1691504 1386020 1546723 1647136 1548967 1379977 1568696
13548A568696j29125J56184J60112M70335J6501l6153J60190J78764j20257K91944
$$ 1568696 1439571 1595755 1755867 2226202 2242703 2206550 2366740 2545504 2425247 2717191
13538B717191j35893j07753K561m31179N6821j26494N7056j48821K9316l18345
$$ 2717191 2581298 2473545 2476106 2044927 2101748 1975254 2032310 1883489 1912805 1594460
13528A594460N53314M0596J87444L1065J04457q8796J20144l44658R2824J90788
$$ 1594460 2147774 2188370 2375814 2406879 2511336 2422540 2542684 2198026 2290850 2481638
13518B481638m23064n0680p5289k79673k09567J859M9069k00593J77902n0899
$$ 2481638 2058574 2007894 1932605 1652932 1443365 1445224 1494293 1293700 1471602 1420703
13508A420703o8660p2620r9483L31193r4460N2349l94045K99624J0599R8428k41926
$$ 1420703 1352043 1279423 1179940 1511133 1416673 1469022 1074977 1374601 1385200 1483628 1241702
13497A241702M9205J06162j4848j73450L06559l19775l4979J02172n2942r744
$$ 1241702 1290907 1397069 1382221 1208771 1515330 1195555 1160576 1262748 1209806 1200062
13487A200062K09719j78784J47119j6513j20817L20472l59933K9993M6097j10978
$$ 1200062 1409781 1230997 1378116 1361603 1240786 1561258 1201325 1231318 1277415 1166437
13477A166437P4553K15704l1466j58513K50620k00493K54583l65419J29906L04356
$$ 1166437 1240990 1456694 1425228 1266715 1517335 1316842 1571425 1206006 1335912 1640268
13467A640268m17871J46327m54609M88908q5118O7278j00145r4495J48950r0406
$$ 1640268 1222397 1368724 914115 1403023 1317905 1385183 1285038 1190543 1339493 1249087
13457A249087J32878P6476J72174L29775L61218k25748K96891Q2526J21119j61890
$$ 1249087 1381965 1458441 1630615 1960390 2321608 2095860 2392751 2475277 2596396 2434506
13447B434506Q9937j45606j5474j38546k74795O2126l08057j0496j08348j22279
$$ 2434506 2524443 2378837 2363363 2224817 1950022 2012148 1704091 1693595 1585247 1462968
13437A462968P5499q8180M3664p9019q3353K77869n5334j30036L7798P149k4424
$$ 1462968 1538467 1450287 1493951 1414932 1331579 1609448 1554114 1424078 1461876 1469025 1444601
13426A444601K29246N821K69679K01182J29907J94790Q0399o175k70312J71388
$$ 1444601 1673847 1679668 1949347 2150529 2280436 2475226 2555625 2549450 2279138 2450526
13416B450526l2192j38291m116l13688J5531m12379J05591k00234K51671l09145
$$ 2450526 2418334 2280043 2275927 1962239 1977770 1565391 1670982 1470748 1722419 1413274
13406A413274J78170k3021N8504l49252M22343j69719J16652k25162J18538R2767
$$ 1413274 1591444 1568423 1626927 1277675 1700018 1530299 1646951 1421789 1540327 1633094
13396A633094p1471K07254N8145R4529j64302J35371J56371j12655Q5400K26471
$$ 1633094 1561623 1768877 1827022 1921551 1757249 1892620 2048991 1936336 2021736 2248207
13386B248207K42967Q1457j38217J07012J17170q3289m2975j67503J13671o5048
$$ 2248207 2491174 2572631 2434414 2541426 2658596 2575307 2532332 2364829 2478500 2413452
13376B413452k22064n1416k98519J71584J41914j55756j7600l6467L19633q1252
$$ 2413452 2191388 2139972 1841453 2013037 2154951 1999195 1981595 1945128 2264761 2183509
13366B183509k30659k7984K4210k8753J38833n2932k59848K80764j67191M10201
$$ 2183509 1952850 1924866 1949076 1920323 2059156 2006224 1746376 2027140 1859949 2270150
13356B270150N586k16866K33378M4830j03824P7768J48685J1173r3719o0367m2160
$$ 2270150 2275736 2058870 2292248 2337078 2233254 2311022 2459707 2470880 2377161 2316794 2274634
13345B274634k1841l5285n4737l43978O5864Q9688J94566l18499L27641k22637
$$ 2274634 2252793 2217508 2162771 1818793 1884657 1974345 2168911 1850412 2178053 1955416
13335A955416Q1097k63930O7160P4889j2525M167l0093J57378k59561L41053j2526
$$ 1955416 2036513 1772583 1839743 1914632 1902107 1906274 1876181 2033559 1773998 2115051 2102525
13324B102525J7549k86846M84114m20313M19447j82844L8290K1190M61245j97207
$$ 2102525 2120074 1833228 2317342 1897029 2316476 2133632 2171922 2193112 2654357 2457150
13314B457150K16081K81806o8877n8057J67825j94573m1021N863R1467N5057k38192
$$ 2457150 2673231 2955037 2886160 2828103 2995928 2801355 2760334 2766197 2857664 2912721 2674529
13303B674529k9463J74833J23314Q5177O7408n1801J54147O581R3087j08995j8863
$$ 2674529 2645066 2819899 2943213 3028390 3095798 3043997 3198144 3204725 3297812 3188817 3169954
13292C169954O3100o2634j91820P288L7982n7394J17379k10794j71907J06966
$$ 3169954 3233054 3170420 2978600 2985888 3023870 2966476 3083855 2873061 2701154 2808120
13282B808120K55719M8615j01102J71364J49795k52070Q8742r711j17049J32657
$$ 2808120 3063839 3112454 3011352 3182716 3332511 3080441 3169183 3159472 3042423 3175080
13272C175080L66500p2560M5176o0576K93367j36020o0212o800J54923Q8289J02329
$$ 3175080 3541580 3469020 3514196 3453620 3746987 3610967 3550755 3543955 3698878 3787167 3889496
13261C889496Q6221L20374k21668J94171P4058Q7663J50589J48860O4717N3227
$$ 3889496 3975717 4296091 4074423 4268594 4342652 4430315 4580904 4729764 4794481 4847708
13251D847708J9325k0284L03877R5831j62270J35986j03729J78579K28036L1199
$$ 4847708 4867033 4846749 5150626 5246457 5084187 5220173 5116444 5295023 5523059 5554258
13241E554258m5930K20103j10807P4620R5869j4063J30456R0493M4692L65708
$$ 5554258 5508328 5728431 5617624 5692244 5788113 5774050 5904506 5994999 6039691 6405399
13231F405399O581N25102M003j51743K77961L83816j53188R3260M1886J61646
$$ 6405399 6411980 6937082 6941085 6789342 7067303 7451119 7297931 7391191 7433077 7594723
13221G594723l6598J12311j47121l3189j66457q80j9042K32776n23938J62597
$$ 7594723 7558125 7670436 7523315 7490126 7323669 7322789 7303747 7536523 7012585 7175182
13211G175182R7868l17388K37503j74681J43282l14911J93745J1027j54907R9475
$$ 7175182 7273050 6955662 7193165 7018484 7161766 6846855 7040600 7051627 6896720 6996195
13201F996195j48315Q547k4718J08768m4891k78697O56L7632M4864j44301k57049
$$ 6996195 6847880 6856427 6831709 6940477 6895586 6616889 6617545 6655177 6700041 6555740 6298691
13190F298691J62756l11231r3237k5574j10363p0995l30569K82044j76938O8431
$$ 6298691 6461447 6150216 6056979 6031405 5921042 5850047 5519478 5801522 5624584 5693015
13180E693015j50591l04273j1581K78098m89236O8276J79620K5593N2221k05733
$$ 5693015 5542424 5238151 5226570 5504668 5015432 5083708 5263328 5288921 5341142 5135409
13170E135409O8756k99757K40973k2274L85613r3757J59409J83891l1547K41812
$$ 5135409 5204165 4904408 5145381 5123107 5508720 5414963 5574372 5758263 5726716 5968528
13160E968528L73469k5855K94996L35116O0573o432J44351j62428l2856Q5759
$$ 5968528 6341997 6316142 6611138 6946254 7006827 7000395 7144746 6982318 6949462 7035221
13150G035221j78904j54923n6945j11694L84280l43798j69141M5219k34948P8423
$$ 7035221 6856317 6701394 6644449 6532755 6917035 6573237 6404096 6449315 6214367 6292790
13140F292790k24267j66614m52064L8591j02190l16700m11620j32316R0146j41844
$$ 6292790 6068523 5901909 5449845 5488436 5386246 5069546 4657926 4525610 4615756 4473912
13130D473912p1618k47213R3497R1899P2208m4659j56748J7483j66257j0252N6571
$$ 4473912 4402294 4155081 4248578 4340477 4412685 4368026 4211278 4228761 4062504 4052252 4108823
13119D108823j86543k1601m16036m1052j65070K11719j32220J44946p2379K6743
$$ 4108823 3922280 3900679 3484643 3443591 3278521 3490240 3358020 3502966 3430587 3457330
13109C457330k05523q2246J55047k7167j2137R4497J66145J9494J24991K81001
$$ 3457330 3251807 3169561 3324608 3297441 3285304 3379801 3545946 3565440 3690431 3971432
13099C971432L0046L87440J72686N43469J66719L04713J34106M89343j04791L716
$$ 3971432 4001478 4388918 4561604 5105073 5271792 5576505 5710611 6199954 6095163 6098879
13089F098879J66317n95l44334L80895j41843o9777j21892p2903k16581Q3830
$$ 6098879 6265196 6264601 5920267 6301162 6159319 6089542 5967650 5894747 5678166 5761996
13079E761996m79732R9183j46849n02833n3677k37812m72800k08470k04404K4598
$$ 5761996 5282264 5381447 5234598 4731765 4678088 4440276 3967476 3759006 3554602 3579200
13069C579200l45967p6545k37333J29173k20836k03185M40617l3330Q6232Q3333
$$ 3579200 3233233 3156688 2919355 3048528 2827692 2624507 3065124 3031794 3118026 3201359
13059C201359o5296Q2933k1014j41326L62637j80517j4876L9171q2721J01556
$$ 3201359 3136063 3218996 3197982 3056656 3419293 3238776 3223900 3263071 3180350 3281906
13049C281906j56115j32352K56827j76016j8011L45316k10602o5172R4973r1760
$$ 3281906 3125791 2993439 3250266 3074250 3056239 3401555 3190953 3125781 3220754 3128994
13039C128994R2356j41155K84348j11095J95555P1054J00482o1155O0848K07366
$$ 3128994 3221350 3080195 3364543 3253448 3449003 3520057 3620539 3559384 3620232 3827598
13029C827598o0033K07199l44914K27707J68409k32580M36834j53521J50571m1787
$$ 3827598 3767565 3974764 3629850 3857557 4025966 3793386 4230220 4076699 4227270 4185483
13019D185483j88702K32873J28749L0587J43999o5550L89925l1046P3064R462
$$ 4185483 3996781 4229654 4358403 4388990 4532989 4467439 4857364 4826318 4899382 4908844
13009D908844N880K78671k2245N1788J45933L90120j58171L10747j85499K65302
$$ 4908844 4914724 5193395 5171150 5222938 5368871 5758991 5600820 5911567 5726068 5991370
12999E991370k15389J29428K22054j92385M62426K41955l4940Q7512J36613N6068
$$ 5991370 5775981 5905409 6127463 5935078 6397504 6639459 6604519 6692031 6828644 6884712
12989F884712l38695L92656j61763R8041m0860J9107L236J67413k70082J9751
$$ 6884712 6546017 6938673 6776910 6874951 6834091 6853198 6856434 7023847 6753765 6773516
12979F773516J07087j08403j92074p4440K10379k69582k70018L70542l96695j69785
$$ 6773516 6880603 6772200 6580126 6505686 6716065 6446483 6176465 6547007 6150312 5980527
12969E980527J68081j74185K29669p24091J285L95892j98819J20956k63649j45909
$$ 5980527 6148608 5974423 6204092 5480001 5481286 5877178 5678359 5799315 5535666 5389757
12959E389757J20857Q5842J33698k84640J97038N3153k37751m684J76175q6753
$$ 5389757 5510614 5596456 5730154 5445514 5642552 5695705 5457954 5453270 5629445 5542692
12949E542692K98L11R8633n1204m3762K3743N1139o0358K12211k66046O1177K46662
$$ 5542692 5542990 5543301 5641934 5590730 5546968 5570711 5621850 5561492 5773703 5507657 5568834 5815496
12937E815496j59969L35810k33271J84255j64449M28621n0659j38519J39395j75299
$$ 5815496 5655527 5991337 5758066 5942321 5777872 6206493 6155834 6017315 6156710 5981411
12927E981411K433j44167J76237r6286j12958j57972j71144K07940k0468J38242
$$ 5981411 5983844 5839677 6015914 5919628 5806670 5648698 5477554 5685494 5665026 5803268
12917E803268l32703N8630j33796q1981k66848j13312j54593j54890P6720p7910
$$ 5803268 5470565 5529195 5395399 5313418 5046570 4933258 4778665 4623775 4700495 4622585
12907D622585p4841r5433j87102l6926j26885n3443J05298k78475N1107k06811
$$ 4622585 4547744 4452311 4265209 4228283 4101398 4047955 4153253 3874778 3925885 3719074
12897C719074N1822J14234j88567j44713j02289o1475J95781k65539J90194k94489
$$ 3719074 3770896 3885130 3696563 3551850 3449561 3388086 3583867 3318328 3508522 3214033
12887C214033J92339r7039Q1451J24936j51652n816Q7382l38175K73352k51390
$$ 3214033 3406372 3309333 3390784 3515720 3364068 3358252 3445634 3107459 3380811 3129421
12877C129421j6271k75085J83390j33031L89480l9816m36184K63467k70259J55311
$$ 3129421 3113150 2838065 3021455 2888424 3277904 3238088 2801904 3065371 2795112 2950423
12867B950423J96344k10007L6948j8528o3789k57702J97030O677m9646L81368
$$ 2950423 3146767 2936760 2973708 2955180 2891391 2633689 2830719 2837396 2787750 3169118
12857C169118m04999p3761J62706M4292j78002J00667m3725J48603o6665J05403
$$ 3169118 2764119 2690358 2853064 2897356 2719354 2820021 2776296 2924899 2858234 2963637
12847B963637j68525k42301q765K18935p3980J83386J4003L3562k11528r7564
$$ 2963637 2795112 2552811 2544046 2762981 2689001 2872387 2886390 2919952 2708424 2610860
12837B610860j7766J35285r6072J11880j1677k9121J84986j13361n2922L0357
$$ 2610860 2593094 2728379 2632307 2744187 2732510 2703389 2888375 2775014 2722092 2752449
12827B752449m4127j22503q9827K08048Q6873o0110M8573l4214L1856p7321k60143
$$ 2752449 2708322 2585819 2495992 2704040 2790913 2730803 2779376 2745162 2777018 2699697 2439554
12816B439554M44180l22469Q6621J66270j01003Q4227m93655J84920K18797P3696
$$ 2439554 2883734 2561265 2647886 2814156 2713153 2797380 2303725 2488645 2707442 2781138
12806B781138l6712Q3969j02363M0645p448J88483j97564P2134p2042J19630o5429
$$ 2781138 2744426 2828395 2726032 2766677 2759229 2947712 2750148 2822282 2750240 2869870 2804441
12795B804441j39569m2015k1799K60878j71627J73934k10616q5270L07455q2937
$$ 2804441 2664872 2622857 2601058 2861936 2690309 2864243 2653627 2568357 2875812 2792875
12785B792875n3798p227L2018k8588L04779k47118m8651p022O3229o4613j70075
$$ 2792875 2739077 2731850 2763868 2735280 3040059 2792941 2744290 2737268 2800497 2735884 2565809
12774B565809M62488j41952J0728J98873l52378J97606p547O2584j84185p108
$$ 2565809 3028297 2886345 2897073 3095946 2743568 2941174 2933627 2996211 2812026 2804918
12764B804918K11382O9960k79899n4189J94240j32839L8514n5550J03441J18073
$$ 2804918 3016300 3086260 2806361 2752172 2946412 2813573 2852087 2796537 2899978 3018051
12754C018051J15188j07355K0174j50860K95733m49631O4788J21107K41027j24585
$$ 3018051 3133239 3025884 3046058 2895198 3190931 2741300 2806088 2927195 3168222 3043637
12744C043637l1482M2603j53528J37647L309O9535L7933j42274Q8203Q1635j02646
$$ 3043637 3012155 3054758 2901230 3038877 3042186 3111721 3149654 3007380 3095583 3177218 3074572
12733C074572N8829j54417m5820J80330j49360J27126k0134j86322j23662L01160
$$ 3074572 3133401 2978984 2933164 3113494 2964134 3091260 3071126 2884804 2761142 3062302
12723C062302J02986K4679k42678l2974J39186Q6564n6336j28194N91J98192j24740
$$ 3062302 3165288 3189967 2947289 2914315 3053501 3140065 3083729 2955535 2956126 3154318 3029578
12712C029578K40282j12678n1129K53662K36184l35963K34544l8969j3439K34591
$$ 3029578 3269860 3157182 3106053 3359715 3595899 3259936 3494480 3455511 3442072 3676663
12702C676663J15507J83821j06547J26058j9954O61657n99523L72126j21450L70717
$$ 3676663 3792170 3975991 3869444 3995502 3975548 4637205 4037682 4409808 4288358 4659075
12692D659075L09330N50940O28022M39488P4753M09301J08272k25729K80447j94730
$$ 4659075 4968405 5519345 6147367 6586855 6661608 7070909 7179181 6953452 7233899 7039169
12682G039169m61790m35001J8256k96201o38944l73994j90902k46036R5756J09459
$$ 7039169 6577379 6142378 6160634 5864433 5225489 4851495 4660593 4414557 4510313 4619772
12672D619772k40368J39344J26666R6399j72038K62458O2135P6762k16708J99858
$$ 4619772 4379404 4518748 4645414 4741813 4569775 4832233 4894368 4971130 4754422 4954280
12662D954280q8622j8278N218k07639n8903P1923K56513p284p5873J40430L69127
$$ 4954280 4865658 4847380 4852598 4644959 4586056 4657979 4914492 4907208 4831335 4971765 5340892
12651E340892K16364J93912K36287r0395J98054o1295J76203J24022J8977R6045
$$ 5340892 5557256 5751168 5987455 5897060 6095114 6033819 6210022 6334044 6353021 6449066
12641F449066j28919J08280p2683n5125R7838M5115R8506P9493k26817K48976
$$ 6449066 6320147 6428427 6355744 6300619 6398457 6443572 6542078 6621571 6394754 6643730
12631F643730k14541K59708R9384J86041P4997J769j07661j95057j66160j00594
$$ 6643730 6429189 6688897 6788281 6974322 7049319 7051088 6943427 6748370 6582210 6481616
12621F481616J32616q58012R6052q2800k38326j27592n2594J21935M4072L64843
$$ 6481616 6614232 5756220 5852272 5769472 5531146 5403554 5350960 5472895 5516967 5881810
12611E881810K15509O64074K95190N52583L50316K31532J3014K04733k44842k17602
$$ 5881810 6097319 6761393 7056583 7609166 7959482 8191014 8204028 8408761 8163919 7946317
12601G946317o6941m10211l04640o37927k52479n07277l71702j50941M6745o6607
$$ 7946317 7879376 7469165 7164525 6526598 6274119 5766842 5395140 5244199 5290944 5224337
12591E224337M1002J07349K66473r5250M24336j48650J95481N0297p1478K34052
$$ 5224337 5265339 5372688 5639161 5543911 5968247 5819597 6015078 6065375 5993897 6227949
12581F227949J54137M58109j71088K05993K04157N6523k83059K51023l03271j66674
$$ 6227949 6382086 6840195 6669107 6875100 7079257 7135780 6852721 7103744 6800473 6633799
12571F633799m03955k13868k99927m05602l8093l46882q435r0218J9053K62653
$$ 6633799 6229844 6015976 5716049 5310447 5272354 4925472 4917037 4826819 4845872 5108525
12561E108525j79415l9072n7156P2476j61923l1868K65615j00464j69086j32402
$$ 5108525 4929110 4890038 4832882 4905358 4743435 4711567 4977182 4876718 4707632 4575230
12551D575230K39157m2415j59944j0745K09802P9439j13050J10998L36234q8212
$$ 4575230 4814387 4771972 4612028 4601283 4811085 4890524 4777474 4888472 5224706 5136494
12541E136494J92146K30275j23648L16781m1441P4049r8279o6465j85545J4798
$$ 5136494 5328640 5558915 5435267 5752048 5710607 5784656 5686377 5619912 5434367 5449165
12531E449165k77162k14185l5274j43828o0584O5266k88193K07610j80054N49945
$$ 5449165 5172003 4957818 4922544 4778716 4718132 4783398 4495205 4702815 4522761 5072706
12521E072706r6795j53608J81252p7391M9352J73423K04514J60456M89118L98710
$$ 5072706 4975911 4822303 5003555 4926164 4975516 5148939 5353453 5513909 6003027 6401737
12511F401737K89806J30836K79689K66708m59839J85849j66483J9864m16445l80923
$$ 6401737 6691543 6822379 7102068 7368776 6908937 7094786 6928303 6948167 6531722 6150799
12501F150799p5373n48576k75917j0631R0587n5003O2494k70792K03130k8456
$$ 6150799 6075426 5526850 5250933 5240302 5330889 5275886 5338380 5067588 5270718 5242262
12491E242262m9662k00231P5291J92295n3848L00477p4137M41307j1683J60569
$$ 5242262 5192600 4992369 5067660 5259955 5206107 5506584 5432447 5873754 5862071 6022640
12481F022640N45994l18412J97924k01235K09096l29915R5861k39722k92711p0799
$$ 6022640 6568634 6250222 6448146 6246911 6456007 6126092 6221953 5982231 5689520 5618721
12471E618721k28839r9386J66122k27924m3240J00746J37659r8154J59472j23665
$$ 5618721 5389882 5290496 5456618 5228694 5185454 5286200 5423859 5325705 5485177 5361512
12461E361512J77506j33522J70301J92929J43821q4198o8068K84422j57962L3423
$$ 5361512 5539018 5405496 5575797 5768726 5912547 5828349 5760281 6044703 5886741 5920164
12451E920164M79699m1725L08979j67659K34038J19142L46458K17556k64314R0289
$$ 5920164 6399863 6358138 6667117 6499458 6733496 6852638 7199096 7416652 7152338 7242627
12441G242627J84526J83900K74189p5947N9099j25290J50569P8086m8089J77535
$$ 7242627 7427153 7611053 7885242 7809295 7868394 7743104 7893673 7971759 7923670 8101205
12431H101205J63141q4134K74571R2006J98688M6064J89593J2886L55309J64718
$$ 8101205 8264346 8180212 8454783 8546789 8745477 8791541 8981134 8994020 9349329 9514047
12421I514047J16862M9595J28239L11764K75378J01613N16899r4277M88197K8446
$$ 9514047 9630909 9680504 9808743 10120507 10395885 10497498 11014397 10920120 11408317 11436763
12411A1436763L97056l963o1166P1535K7561m07873k0520N541L0347k42861K46802
$$ 11436763 11833819 11829856 11768690 11840225 11867786 11459913 11439393 11444934 11475281 11232420 11479222
12400A1479222r1318k36159R8484K53753K4728K02943j18352L51917K45766M79546
$$ 11479222 11387904 11151745 11250229 11503982 11528710 11731653 11613301 11965218 12210984 12690530
12390A2690530J62655L38866N01532K21876N87315K79508K99380L12909J33801
$$ 12690530 12853185 13192051 13693583 13915459 14502774 14782282 15081662 15394571 15528372
12381A5528372K70257L35843R056K20513p0720P4197P942M7468L01628l12492
$$ 15528372 15798629 16134472 16143528 16364041 16293321 16367518 16375460 16422928 16724556 16412064
12371A6412064n6163L6890R4441J74061l1493l82351J77192J31721m8922j42158
$$ 16412064 16355901 16392791 16487232 16661293 16629800 16247449 16424641 16556362 16507440 16365282
12361A6365282j39007j32103j22027J59492j42643p8733j51451J16542j88120
$$ 16365282 16226275 16094172 15972145 16131637 15988994 15910261 15758810 15875352 15687232
12352A5687232k93115l8216n5160k79639j6888m76573J25010k11108K30160M7144
$$ 15687232 15394117 15355901 15300741 15021102 15004214 14527641 14652651 14441543 14671703 14718847
12342A4718847K16110J72495Q3734K31863N39801L23166L00673M25597N25671
$$ 14718847 14934957 15107452 15191186 15423049 15962850 16286016 16586689 17012286 17537957
12333A7537957L26658K01958Q03654K63913L13555K19191N21750J76069L4270
$$ 17537957 17864615 18066573 18870227 19134140 19447695 19666886 20188636 20364705 20398975
12324B0398975J51049R9642R2590J50975r7470Q9543j08170K16568Q5563Q8146
$$ 20398975 20550024 20649666 20742256 20893231 20795761 20885304 20777134 20993702 21079265 21167411
12314B1167411k04617K78071L4114j1928N51935m914P15753l1588P41605K90219
$$ 21167411 20962794 21240865 21274979 21263051 21814986 21810072 22525825 22494237 23235842 23526061
12304B3526061K68864J00953J71653n6217l96553j66677k71861l73404q36754
$$ 23526061 23794925 23895878 24067531 24011314 23614761 23448084 23176223 22802819 21966065
12295B1966065j96608n82242m55902k30952l86047l64450m57668l54252j40400
$$ 21966065 21769457 21187215 20731313 20500361 20114314 19749864 19292196 18937944 18797544
12286A8797544o66966m31022o86999m63818m54024q18916l02569n36569n65589
$$ 18797544 18130578 17699556 17012557 16548739 16094715 15275799 14973230 14436661 13871072
12277A3871072l6719m69060k54533l38201J86419p5971l88165L08259j96912k25194
$$ 13871072 13834353 13365293 13110760 12772559 12958978 12883007 12494842 12803101 12606189 12380995
12267A2380995l8765j88045J32680M2766j37379j9796J13349k5644j0807M11344
$$ 12380995 12342230 12154185 12286865 12329631 12192252 12172456 12285805 12260161 12249354 12660698
12257A2660698J62999J88906L62512P94945L23015M64645J177025P72041Q99749
$$ 12660698 12823697 13012603 13375115 14170060 14493075 14957720 16134745 16906786 17806535
12248A7806535J212213J167401J230807J265741Q79076Q20552P32405M04656J87420
$$ 17806535 19018748 20186149 21416956 22682697 23561773 24382325 25114730 25519386 25706806
12239B5706806L05964K37297l30103l04908J04260j23373m47872k13013l39555
$$ 25706806 26012770 26250067 25919964 25615056 25719316 25595943 25148071 24935058 24595503
12230B4595503m48117m89062p16239o49880j075775r30923j094212j349860r30947
$$ 24595503 24147386 23658324 22942085 22292205 21216430 20285507 19191295 17841435 16910488
12221A6910488r18015j113828m78691j121557j45719n18018n66865q7373o59668
$$ 16910488 15992473 14878645 14399954 13278397 13132678 12614660 12047795 11960422 11300754
12212A1300754k59081l12495k98303j01535l08754j76259k7126q4747l01667N1265
$$ 11300754 11041673 10729178 10430875 10329340 10020586 9844327 9817201 9732454 9430787 9482052
12202I482052o6944k31740J32809p3090J03757r4457M41222L2274n6801L87381
$$ 9482052 9415108 9183368 9316177 9243087 9346844 9252387 9693609 9725883 9669082 10056463
12192A0056463k68622K93930N30999k23683K95519M9354K99323J25085J55244
$$ 10056463 9787841 10081771 10612770 10389087 10684606 10733960 11033283 11158368 11313612
12183A1313612K50072P4026R407N763m012N2678j04220j20700j8166k24873M0146
$$ 11313612 11563684 11637710 11647117 11652880 11648868 11701546 11597326 11476626 11458460 11233587 11273733
12172A1273733K3829L10202q9906q8310J80870p6947M46156J74647M42223J88649
$$ 11273733 11297562 11607764 11517858 11429548 11610418 11533471 11979627 12154274 12596497 12785146
12162A2785146Q10962J57277K74851K73453K91965J96642M1276k96514M08384
$$ 12785146 13596108 13753385 14028236 14301689 14593654 14790296 14831572 14535058 14943442
12153A4943442l87513j77566M1845O7182J86924K94940L42758N38945O30598L86986
$$ 14943442 14555929 14378363 14420208 14487390 14674314 14969254 15312012 15850957 16481555 16868541
12143A6868541N54390O11209N55571M84030M85855O23302P26156R49482Q81738
$$ 16868541 17422931 18034140 18589711 19073741 19559596 20182898 20909054 21858536 22740274
12134B2740274J331924J198489J694013J621416J833137K062278K160801J502265
$$ 22740274 24072198 25270687 26964700 28586116 30419253 32481531 34642332 36144597
12126C6144597K004945J357913J021899J231869L09146L36936j54695j29957o02552
$$ 36144597 38149542 39507455 40529354 41761223 42070369 42407305 42252610 42122653 41520101
12117D1520101l68551r30624r68643j209515p16746p84808p49974n49565q78783
$$ 41520101 41151550 40220926 39252283 38042768 37326022 36541214 35791240 35241675 34362892
12108C4362892o60370p14141l10944m44712p1758J01870P6273N2307o9889M08993
$$ 34362892 33702522 32988381 32677437 32232725 32160967 32262837 32339110 32391417 32321528 32730521
12098C2730521l71766l87203k87451n48336k97463p05759l36725o44407J16163
$$ 32730521 32358755 31971552 31684101 31135765 30838302 30132543 29795818 29151411 29267574
12089B9267574N27438j1115M35489O50977P56534R66163N26767R42322Q8371O03058
$$ 29267574 29795012 29783897 30219386 30870363 31626897 32593060 33119827 34062149 34150520 34753578
12079C4753578N0893k53571J40650L14227q9476P8113p565m83285n85107o16696
$$ 34753578 34804471 34550900 34691550 35005777 34916301 34994414 34986849 34503564 33918457 33301761
12069C3301761o58978j156394o37268j083124j062110r29994j030660p79286q00529
$$ 33301761 32642783 31486389 30849121 29765997 28703887 27773893 26743233 25963947 25163418
12060B5163418m55919n38513l98234n50467l75393k21664p42093m32337l89818
$$ 25163418 24707499 24168986 23770752 23220285 22844892 22623228 21881135 21448798 21058980
12051B1058980m21264m62359k69400m46862k88715m24246l19385k79049n07349
$$ 21058980 20637716 20175357 19905957 19459095 19170380 18746134 18426749 18147700 17640351
12042A7640351k23722l69410k72440l37497r26177J12305m66274k82839M83319
$$ 17640351 17416629 17047219 16774779 16437282 15511105 15623410 15157136 14874297 15357616
12033A5357616j43244M03061K26652L92315L35269M58075J50692M6515j0006j54754
$$ 15357616 15214372 15617433 15844085 16236400 16571669 17029744 17180436 17226951 17216945 17062191
12023A7062191l67352n61304p58468l88848p48715k03817o44155n04587j0079
$$ 17062191 16694839 16133535 15375067 14986219 14237504 14033687 13389532 12884945 12874866
12014A2874866k95769p93815r8894l42984n076n47227R9167k44010j84265j01235
$$ 12874866 12579097 11785282 11686388 11343404 11338328 10791101 10890268 10646258 10461993 10360758
12004A0360758P2714K97104K7060K34054K28001L3388l00070l2320l19057q7244
$$ 10360758 10433472 10730576 10757636 10991690 11219691 11253079 10953009 10920689 10601632 10514388
11994A0514388l74428L1813l04046r2091j11473l64449n5730R855l60951O8143
$$ 10514388 10139960 10171773 9867727 9775636 9664163 9299714 9243984 9253839 8892888 8961031
11984H961031l12804O2614k31506l74801l88227p3086j77788m5172J11221l70806
$$ 8961031 8648227 8710841 8479335 8104534 7716307 7643221 7465433 7420261 7531482 7160676
11974G160676r9385K02896m26812m0667j60724j73351k90147k0277m58917Q2642
$$ 7160676 7061291 7264187 6837375 6796708 6635984 6462633 6172486 6152209 5693292 5775934
11964E775934k90538M5295k8709R5825J3339l4993J24181M58827r3026q6555K42581
$$ 5775934 5485396 5530691 5501982 5597807 5611146 5576153 5700334 6159161 6066135 5979580 6222161
11953F222161l6963K57569j94651K8799K6295M2515L09479k71628m999K17454
$$ 6222161 6185198 6442767 6248116 6276915 6303210 6345725 6655204 6383576 6378577 6596031
11943F596031L78363L2130L60670J5534K89589N7421j4018R6988M13832l3313
$$ 6596031 6974394 7006524 7367194 7382728 7672317 7729738 7715720 7812708 8226540 8193227
11933H193227k44685m7110K61553J52035m37487p0735l44263K08783k78292k6092
$$ 8193227 7948542 7901432 8162985 8315020 7877533 7806798 7462535 7671318 7393026 7366934
11923G366934j06939k87487j84088p5064k22865r0280k16302K8131L2294M0589
$$ 7366934 7259995 6972508 6788420 6713356 6490491 6400211 6183909 6212040 6244334 6284923
11913F284923m50802O93337J292165L421639L447744J755706J111633J048085
$$ 6284923 5834121 6527458 7819623 11241262 14689006 16444712 17556345 18604430
11905A8604430L36196L22270l84015m09522j128889k319861k025661l141578k234044
$$ 18604430 18940626 19262896 18878881 18469359 17340470 15020609 12994948 9853370 7619326
11896G619326j218288o07783l14445o5113j01155k25579N27050q8747N91410N57505
$$ 7619326 6401038 5793255 5478810 5413697 5312542 5086963 5614013 5525266 6116676 6674181
11886F674181N05727O75188M77400M79979K25257N04716O3367J56300k93223P653
$$ 6674181 7179908 7855096 8332496 8812475 9037732 9542448 9605815 9762115 9468892 9476545
11876I476545n98268m28796p43894o51951k36153l71204n27229k20310l25776
$$ 9476545 8878277 8449481 7705587 7053636 6817483 6446279 5919050 5698740 5372964
11867E372964j79570j79489o01795L86647m46687Q4721Q2089k60676L0070J00986
$$ 5372964 5193394 5013905 4412110 4798757 4352070 4436791 4518880 4258204 4288274 4389260
11857D389260k11265M4382M52099j32496J54321r0159J71322K83599K32965k5336
$$ 4389260 4177995 4222377 4674476 4541980 4696301 4606142 4777464 5061063 5294028 5268692
11847E268692J01646L06753M02233O98648L62876O00222n4921K63618k84123K26196
$$ 5268692 5370338 5677091 6079324 6777972 7140848 7741070 7686149 7949767 7665644 7891840
11837G891840M072l75565K26723k94412q8860j05378K31517m97363l2506k75392
$$ 7891840 7895912 7520347 7747070 7452658 7363798 7258420 7489937 6992574 6960068 6684676
11827F684676l5306k48555k79012j13195m67906k80313l72112l92705m817n34732
$$ 6684676 6649370 6400815 6121803 6008608 5540702 5260389 4888277 4495572 4490755 3956023
11817C956023o5615R4722k36970k7697p574j35619p8662R9315k44141o864p4359
$$ 3956023 3890408 3985130 3748160 3720463 3712889 3577270 3498608 3597923 3353782 3346918 3272559
11806C272559J15966o885p0888k2892P145J7456p6606K32175q0478n2796J7133
$$ 3272559 3388525 3381640 3310752 3287860 3295005 3312461 3235855 3468030 3387552 3334756 3351889
11795C351889J38656j2945L27222J65885L20897K84766L43630J31491L7518L45746
$$ 3351889 3490545 3477600 3804822 3970707 4291604 4576370 4920000 5051491 5089009 5434755
11785E434755L03772J48737l73907m12642J48967k73400m55243k97463n38524
$$ 5434755 5738527 5887264 5513357 5100715 5249682 4976282 4521039 4223576 3685052
11776C685052j43875l34857J80570k87690J77112j75465J01618l35280J46029
$$ 3685052 3541177 3206320 3386890 3099200 3276312 3100847 3202465 2867185 3013214
11767C013214l04392J89912K2861k39203L09523J63307m07700J66232k09654K45439
$$ 3013214 2708822 2898734 2921595 2682392 2991915 3155222 2747522 2913754 2704100 2949539
11757B949539k64417Q7824k41185j02186L31908P103j44584R4042k38187m6060
$$ 2949539 2685122 2772946 2531761 2429575 2761483 2768586 2624002 2718044 2479857 2433797
11747B433797K54174q2752J13621j59334J96781j89001n035j1938J45638k41817
$$ 2433797 2687971 2605219 2718840 2559506 2756287 2567286 2562251 2550313 2695951 2454134
11737B454134n4460Q6277N5372j58387J35791K66005j94033l196q7993J61696
$$ 2454134 2399674 2485951 2541323 2382936 2518727 2784732 2590699 2587503 2499510 2661206
11727B661206j405j02233l49998J85390p3955Q3043n1228o9283J01122J43747
$$ 2661206 2659801 2557568 2207570 2392960 2319005 2402048 2350820 2281537 2382659 2526406
11717B526406j30527r5188J98035l10763K89497j21770o9309j4054Q7137L34573
$$ 2526406 2395879 2300691 2498726 2187963 2477460 2355690 2286381 2272327 2359464 2694037
11707B694037m4629p1518N0910l179j21126j7307J8127J46176k44226K8063J43218
$$ 2694037 2649408 2577890 2628800 2625621 2504495 2487188 2505315 2651491 2407265 2435328 2578546
11696B578546L0659q2971J26077k09045K01679K15642l75090p6096K86537k21317
$$ 2578546 2609205 2526234 2652311 2443266 2644945 2860587 2485497 2409401 2695938 2474621
11686B474621L9047P7827J17294k24058K18902j28781L4123M08597m30273K51072
$$ 2474621 2513668 2591495 2708789 2484731 2703633 2574852 2608975 3017572 2587299 2838371
11676B838371l3934j05740J29304K9640M4782l5505j3980J0197K65960k01092
$$ 2838371 2804437 2698697 2828001 2857641 2902423 2866918 2852938 2863135 3129095 2928003
11666B928003R5791l49685Q8828K64392j20234J41602k09723K14646k13460m7211
$$ 2928003 3023794 2674109 2762937 3027329 2907095 3048697 2838974 3053620 2840160 2792949
11656B792949j29234K82740p1744q6172J54061j80275Q8081o0149J96241j70881
$$ 2792949 2663715 2946455 2874711 2788539 2942600 2762325 2850406 2790257 2986498 2815617
11646B815617n2536p3177K10759j58475J46816k00927K06427j18204k41414K04507
$$ 2815617 2763081 2689904 2900663 2742188 2889004 2688077 2894504 2776300 2534886 2739393
11636B739393k091k0504J40209p5818l2789r9089O7362L2530j14942J54183J02560
$$ 2739393 2737302 2716798 2857007 2781189 2748400 2649311 2716673 2749203 2634261 2788444 2891004
11625B891004k13985r8715J05634j77663K57396j19937J87194k48788M6293J26448
$$ 2891004 2677019 2578304 2683938 2506275 2763671 2643734 2830928 2582140 2628433 2754881
11615B754881r8823p5321K74824l29853J36130O3320J29536l15687L82323K1359
$$ 2754881 2656058 2580737 2855561 2525708 2661838 2725158 2854694 2539007 2921330 2942689
11605B942689k46115J72448Q5186k83225K20670k0769J64335j42206J78719j50397
$$ 2942689 2696574 2869022 2954208 2670983 2891653 2870884 3035219 2893013 3071732 2921335
11595B921335j06470K69210j52169J29861k89775J75545k8296m4300j03992J36516
$$ 2921335 2814865 3084075 2931906 3061767 2771992 2947537 2919241 2874941 2770949 2907465
11585B907465j88044K27732j88159J86814j68620M77985k77938j13252J75760
$$ 2907465 2719421 2947153 2758994 2945808 2777188 3255173 2977235 2863983 3039743
11576C039743j12094K72705j07171Q6259p2811M1682J6339K8081r112J58770l4191
$$ 3039743 2927649 3200354 3093183 3179442 3106631 3148313 3164652 3192733 3183621 3342391 3308200
11565C308200j20059j97503J02931J11131j07590K03946k52010J55586j26493
$$ 3308200 3188141 2990638 3093569 3204700 3097110 3301056 3049046 3204632 3078139
11556C078139k2613K69984r2490L5140j22840j38434N0614L1574J15390q1521
$$ 3078139 3055526 3325510 3233020 3268160 3145320 3006886 3057500 3089074 3204464 3122943
11546C122943N9131r3823N741J5477k38630J90863O1229j78774O3588m8832N8637
$$ 3122943 3182074 3088251 3093992 3109469 2870839 3061702 3122931 2944157 3007745 2958913 3017550
11535C017550k12464J92461L11950j53495j77919P2359p536q4129K31825k14582
$$ 3017550 2805086 2997547 3309497 3156002 2978083 3050442 3042906 2958777 3190602 2976020
11525B976020j61195K88399l3032j88413K74539k39319R2129J59387j04493j45614
$$ 2976020 2814825 3103224 3070192 2881779 3156318 2916999 3009128 3168515 3064022 2918408
11515B918408L60128j81231l334L71339l67127j68651J92093j02107K39924j79919
$$ 2918408 3278536 3097305 3093971 3465310 3098183 2929532 3121625 3019518 3259442 3079523
11505C079523n5099L23741o0840q5339J17018j14389R4482j49965J02618q3684
$$ 3079523 3024424 3348165 3287325 3201986 3319004 3204615 3299097 3149132 3251750 3168066
11495C168066J10542n6106j01184j12298O5856K23599j37156l6106M0270M3366
$$ 3168066 3278608 3222502 3121318 3009020 3074876 3298475 3161319 3125213 3165483 3208849
11485C208849q4737Q6980p339P5775J47514j77044j29961K02231l6729p6845J63528
$$ 3208849 3124112 3211092 3203753 3279528 3427042 3249998 3120037 3322268 3285539 3208694 3372222
11474C372222J77234m22768J06320n2072K19650k85120K69135j22722k56414M11321
$$ 3372222 3549456 3126688 3233008 3180936 3400586 3115466 3384601 3261879 3005465 3416786
11464C416786j81492j45576J75522M7002j69548P587j355R4423J04092j98631
$$ 3416786 3235294 3089718 3265240 3312242 3142694 3150281 3148926 3243349 3347441 3148810
11454C148810q9665k7052J20277m0909J90619j78518N5302N2560k11450J80482
$$ 3148810 3059145 3032093 3152370 3111461 3302080 3123562 3178864 3231424 3019974 3200456
11444C200456j98133N0259Q1580k01633M53912j32311l2087P9865Q6155P2322
$$ 3200456 3002323 3052582 3134162 2932529 3386441 3254130 3222043 3301908 3388063 3460385
11434C460385l54437J89272J76222p765J20472J76571r1949j00167J06835J15408
$$ 3460385 3105948 3295220 3471442 3463677 3584149 3760720 3668771 3568604 3675439 3790847
11424C790847R2005q9982n8848K86965n4398j78214K13628K0920q0394K94323
$$ 3790847 3882852 3792870 3734022 4020987 3966589 3788375 4002003 4022923 3942529 4236852
11414D236852o4334o1088J22815j90700Q8779Q8693M9805n819n1000j19240L73643
$$ 4236852 4172518 4111430 4234245 4043545 4132324 4221017 4270822 4265003 4214003 4094763 4468406
11403D468406k20677K33738j60740K44111j50789K78648j91155J28235j9264K57007
$$ 4468406 4247729 4481467 4320727 4564838 4414049 4692697 4501542 4629777 4610513 4867520
11393D867520R413J9343n5475J83454J11772J67749j31877R0984j7373K78381
$$ 4867520 4876933 4896276 4840801 5024255 5136027 5303776 5171899 5262883 5245510 5523891
11383E523891j87081J35480K38529p2514J42895P0309k2752J99473j45835Q4742
$$ 5523891 5336810 5472290 5710819 5638305 5781200 5851509 5828757 6028230 5882395 5967137
11373E967137L2611K6590J33062k81201J04407j22679J49644J86243j44117m3076
$$ 5967137 5999748 6026338 6159400 5878199 5982606 5859927 6009571 6195814 6051697 6008621
11363F008621J56911M3049j12899j40681L33789j43483R699M1238K62987k6374
$$ 6008621 6165532 6208581 6095682 5955001 6288790 6145307 6155006 6196244 6459231 6432857
11353F432857k22396K10333l06275J6371O01982n05150M3123l12938K58625l19692
$$ 6432857 6210461 6420794 6114519 6130890 6732872 6227722 6270845 5957907 6216532 5896840
11343E896840K0188K18388k16262K21621j46333r2215j55136J4375M3943j52565
$$ 5896840 5917028 6135416 5919154 6140775 5994442 5902227 5747091 5761466 5805409 5652844
11333E652844L2212O360o1636n2242K02337k66181n6847j39819P2138k18780L00151
$$ 5652844 5685056 5691416 5629780 5577538 5779875 5513694 5456847 5317028 5389166 5170386 5470537
11322E470537l30276m4016n8138m6908j33911j68098L4556o6316m6966j8163k63356
$$ 5470537 5140261 5096245 5038107 4991199 4857288 4689190 4723746 4657430 4610464 4592301 4328945
11311D328945Q4588n2801j64231J09363k37543j2752l1390r2111l7834J1723n4428
$$ 4328945 4413533 4360732 4196501 4305864 4068321 4055569 4024179 3932068 3894234 3905957 3851529
11300C851529j81229j54108J49044l290k01889k332J88427m9557k58316q0303
$$ 3851529 3670300 3516192 3665236 3661946 3460057 3457725 3646152 3596595 3338279 3257976
11290C257976m0829R7216k33204K06966j30441j72024J31620p9786J69161J2761
$$ 3257976 3217147 3314363 3081159 3288125 3157684 2985660 3117280 3037494 3206655 3219416
11280C219416j78006j35302L1451j41680R8873j72489j8913m4613o683R9868K5419
$$ 3219416 3041410 2906108 2937559 2795879 2894752 2722263 2703350 2658737 2652054 2751922 2777341
11269B777341j60568R7713j0019J08433m04758J89181L45848m86673o0941K03926
$$ 2777341 2616773 2714486 2704467 2812900 2408142 2597323 2943171 2456498 2395557 2599483
11259B599483o9820J7900o2043P3135J29009j8724k46678J32283k05447K14994
$$ 2599483 2529663 2547563 2485520 2558655 2687664 2668940 2422262 2554545 2349098 2564092
11249B564092K68960k13489k25753K02107j80596L7716J57363Q0080n3538j49637
$$ 2564092 2833052 2619563 2393810 2595917 2415321 2453037 2610400 2690480 2636942 2487305
11239B487305r1062J51863J7327n5661k8651M9285j6175n8209Q9821J22500J5297
$$ 2487305 2396243 2548106 2565433 2509772 2481121 2530406 2514231 2456022 2545843 2668343 2683640
11228B683640K51131r6788N19599P45827Q40711M97265K33735J15316K90812m7483
$$ 2683640 2934771 2837983 3357582 4103409 4944120 5441385 5675120 5790436 6081248 6033765
11218F033765K17282p4160j03949p58015m30828n49564o16666l66086m29936l2863
$$ 6033765 6251047 6176887 6072938 5314923 4884095 4334531 3717865 3351779 2921843 2888980
11208B888980K05998m31648K2656l9492q9414J2886M19392m94736K89967M16710
$$ 2888980 3094978 2663330 2685986 2646494 2557080 2569966 2989358 2494622 2784589 3201299
11198C201299j57835M26785P37567J011043K88562L91642J04482K14404M09929
$$ 3201299 3043464 3470249 4207816 5218859 5507421 5899063 6003545 6217949 6627878
11189F627878l70878j69363l051p33022p37129l26815o79382k30919q0311k00478
$$ 6627878 6257000 6087637 6084586 5351564 4614435 4287620 3608238 3377319 3297008 3096530
11179C096530l59434L5154N6062M9278k10001M4982L6390j37344L77909l41485
$$ 3096530 2737096 2772250 2828312 2877590 2667589 2712571 2748961 2611617 2989526 2648041
11169B648041l6212K48511m03391M20570j73445J2708L21998Q951N8579k46462
$$ 2648041 2611829 2860340 2456949 2877519 2704074 2716782 3038780 3047731 3106310 2859848
11159B859848q9027j24761L81207r6808q8126K77508j62334K06872l19229Q7108
$$ 2859848 2770821 2646060 3027267 2930459 2842333 3119841 2957507 3164379 2845150 2932258
11149B932258L3671k4021M3055J25719p5624j1454R27P2154q6220l9483J47185
$$ 2932258 2965929 2941908 2984963 3110682 3035058 3023604 3024531 3096685 3010465 2970982 3118167
11138C118167p2115J37759j69119K50179j1256l8305l5148K1347J91739n7551
$$ 3118167 3046052 3183811 3014692 3264871 3253615 3215310 3180162 3201509 3393248 3335697
11128C335697m9031O1469l2335K10761l84488J43836j20664J07756K16585k9861
$$ 3335697 3286666 3348135 3315800 3526561 3142073 3285909 3165245 3273001 3489586 3459725
11118C459725O7003j03275M0580J33803j03206j6740j77817K25302J51701m10999
$$ 3459725 3526728 3423453 3464033 3597836 3494630 3477890 3300073 3525375 3677076 3266077
11108C266077N14606l03422r8590P353J49046k13874J23137J04198P6877j18908
$$ 3266077 3780683 3477261 3378671 3386024 3535070 3321196 3444333 3548531 3625408 3506500
11098C506500j32675K84808j36657j77257l5033j61086J09983K05639j81151j2094
$$ 3506500 3373825 3658633 3521976 3344719 3309686 3148600 3258583 3464222 3283071 3270977
11088C270977P4420l53058J42487r8598K93250j36938q220J87219n9417R3626
$$ 3270977 3345397 2992339 3134826 3036228 3329478 3192540 3184320 3371539 3312122 3405748
11078C405748l07565n8673J61921K14729j98588J60861l377o4444K11713j64144
$$ 3405748 3098183 3039510 3201431 3416160 3217572 3378433 3375056 3310612 3522325 3358181
11068C358181R2751j08027J14666K4492J68037m4195n7214P3626J80478N2234
$$ 3358181 3450932 3342905 3457571 3482063 3650100 3605905 3548691 3622317 3802795 3855029
11058C855029J73090k37676l9075M60116l91525J41949J02337O42r5908j59639
$$ 3855029 4028119 3790443 3751368 4211484 3819959 3961908 4064245 4064887 3968979 3809340
11048C809340K41283j19712K15206k93302L80405k91485K21938l14338M20403
$$ 3809340 4050623 3930911 4146117 3852815 4233220 3941735 4163673 3849335 4269738
11039D269738j97924k3089K38322J39549m3482P4688K32280M8079O6306l7159
$$ 4269738 4071814 4048725 4287047 4426596 4383114 4457802 4690082 4738161 4804467 4767308
11029D767308J40212n2485L32826j18337J95363j42577L58348J70284q6332q8488
$$ 4767308 4907520 4855035 5187861 5069524 5264887 5122310 5480658 5650942 5564610 5476122
11019E476122K49908L6549l7740K44297K6889j09683L34287L4648j54324K24993
$$ 5476122 5726030 5762579 5724839 5969136 5996025 5886342 6220629 6255277 6100953 6325946
11009F325946P0373M9217J73173J17434J46221K31155j07651K85835K1642L82625
$$ 6325946 6396319 6445536 6618709 6736143 6882364 7113519 7005868 7291703 7313345 7695970
10999G695970j33830K13639K2304n7944M16946j00232Q3163K73238N0735k4750
$$ 7695970 7562140 7775779 7798083 7740139 8157085 8056853 8140016 8413254 8463989 8439239
10989H439239j86584K31970K29028j41010J75283N06655K48244L84556M99521
$$ 8439239 8252655 8484625 8713653 8572643 8747926 9254581 9502825 9887381 10386902
10980A0386902j18113J40407J22528M10037K81271j63517K42109O7249j41997
$$ 10386902 10268789 10409196 10531724 10941761 11223032 11059515 11301624 11368873 11226876
10971A1226876L32487P4439j04693N60642J09092Q3169O58739K1587M23380K23946
$$ 11226876 11559363 11633802 11529109 12089751 12198843 12282012 12940751 12962338 13385718 13609664
10961A3609664L12983L03727N36345K26273L30248N87272L10907M48977J39964
$$ 13609664 13922647 14226374 14762719 14988992 15319240 15906512 16217419 16666396 16806360
10952A6806360L16050K11903K64568L65561K31016j07122L70613n6089M01185
$$ 16806360 17122410 17334313 17598881 17964442 18195458 18088336 18458949 18402860 18804045
10943A8804045j17288M12905N427O18105L50302K07253L60173M24847L23693L23841
$$ 18804045 18686757 19099662 19105089 19723194 20073496 20280749 20640922 21065769 21389462 21713303
10933B1713303K74368K58329N73517n9341K18810L18934L10153M37713J72440
$$ 21713303 21987671 22246000 22819517 22760176 22978986 23297920 23608073 24045786 24218226
10924B4218226K59994K10973N63443k72792O08134j58109M6334K39340N3657p6207
$$ 24218226 24478220 24689193 25252636 24979844 25587978 25429869 25476203 25715543 25769200 25692993
10914B5692993o9817k70539j89521J30584j32761N763J12016k38370K71116k35020
$$ 25692993 25623176 25352637 25163116 25293700 25160939 25166702 25278718 25040348 25311464 25076444
10904B5076444N1755K31210o271K26646L23561L7305j7736N70745K65859O42818
$$ 25076444 25128199 25359409 25353138 25579784 25903345 25940650 25922914 26493659 26759518 27402336
10894B7402336J90766K71978L50079P25073J017985L54730J087172J173383Q31984
$$ 27402336 27593102 27865080 28215159 28940232 29958217 30312947 31400119 32573502 33405486
10885C3405486J271244J434093J446550J610775J858329J749813J995615K165994
$$ 33405486 34676730 36110823 37557373 39168148 41026477 42776290 44771905 46937899
10877D6937899K051505J785360K002516J507043J362839Q55243P58606R2453r2702
$$ 46937899 48989404 50774764 52777280 54284323 55647162 56502405 57261011 57353464 57260762
10868E7260762p07551j115392j214129j448193j777015j883720j890720k152143
$$ 57260762 56553211 55437819 54223690 52775497 50998482 49114762 47224042 45071899
10860D5071899k014068k290530j952033k079719k009371j844414j901590j721433
$$ 45071899 43057831 40767301 38815268 36735549 34726178 32881764 30980174 29258741
10852B9258741j473338j498280j805427j064236j369566j035118j173585j210960
$$ 29258741 27785403 26287123 24481696 23417460 22047894 21012776 19839191 18628231
10844A8628231r13252q44290q78363n05107r19926q44405n95242p27389n96664
$$ 18628231 17714979 16870689 15992326 15487219 14567293 13722888 13127646 12400257 11803593
10835A1803593l48104n06067m06447n26168k62030l41839l35073l80025k50106
$$ 11803593 11455489 10949422 10542975 10016807 9754777 9412938 9077865 8697840 8447734
10826H447734n05193j04488m55226j45755k41353J23147k67913l79322q7935k0005
$$ 8447734 7942541 7838053 7382827 7237072 6995719 7118866 6850953 6471631 6383696 6363691
10816F363691l75518K1348r9739Q4274j99809k02664J05028j81640J16727j86106
$$ 6363691 5988173 6009521 5909782 5994056 5794247 5591583 5696611 5514971 5631698 5445592
10806E445592K82185m24689n6812k38971j03284o8090j64348j82886k15004N568
$$ 5445592 5727777 5303088 5246276 5007305 4904021 4835931 4671583 4488697 4273693 4279261
10796D279261K7900k03883k58030J24885R5595j98724j36515p3946m2196j40277
$$ 4279261 4307161 4103278 3845248 3970133 4065728 3867004 3730489 3656543 3614347 3474070
10786C474070J23750J80553k75864J66125q4005k85007Q9743j41694K38258k00236
$$ 3474070 3597820 3778373 3502509 3668634 3584629 3299622 3389365 3247671 3485929 3285693
10776C285693l465l17646j31434J52732R379r6494j24716K43580l54153J96756
$$ 3285693 3282228 2964582 2833148 2985880 2995259 2898765 2774049 3017629 2663476 2860232
10766B860232M9984l4052l7656o6709j26790J65152j50745j6925j24274K20713
$$ 2860232 2910216 2876164 2838508 2771799 2645009 2810161 2659416 2642491 2518217 2738930
10756B738930k2043K67102k87001J37945L2594O9156k85711J46099K9394j02969
$$ 2738930 2716887 2983989 2696988 2834933 2867527 2936683 2650972 2797071 2826465 2723496
10746B723496M0345m7322J386j35976j23382o9015K0719j42674N4758N2588K1699
$$ 2723496 2763841 2716519 2717905 2581929 2458547 2389532 2410251 2267577 2322335 2374923 2396622
10735B396622j26556K1432J46377k3207r2284j13P8045L32798l41652l2505R1373
$$ 2396622 2270066 2291498 2437875 2414668 2322384 2322271 2400316 2733114 2391462 2358957 2450330
10724B450330O4265k1525J25745k02703o6583J76498o5543j06010j05873L42714
$$ 2450330 2514595 2493070 2618815 2416112 2349529 2526027 2460484 2354474 2248601 2591315
10714B591315l33065J64310j4501r5540L89494j89154l693j52348L07170j61070
$$ 2591315 2258250 2422560 2408059 2312519 2702013 2512859 2509166 2356818 2663988 2502918
10704B502918R6432O2177o7764k87j47790l4971k3112K10851j48396J63430j51915
$$ 2502918 2599350 2661527 2593763 2593476 2445686 2410715 2387603 2598454 2450058 2613488 2461573
10693B461573K09825k14354K25268N0537l2922j55605R7926j84116k51566K55149
$$ 2461573 2671398 2457044 2682312 2732849 2699927 2544322 2642248 2458132 2206566 2461715
10683B461715q0550k1135j44975J52717K22403k55575K8846R2375M6478m8558
$$ 2461715 2381165 2360030 2215055 2367772 2590175 2334600 2363446 2455821 2502299 2453741
10673B453741j14314L16230k57754j13532J95066r0602m9425j52699K89474k88647
$$ 2453741 2339427 2655657 2397903 2284371 2479437 2388835 2339410 2186711 2476185 2187538
10663B187538K66227j17242j20691k74125L05385l14371M200L7701L72925j7526
$$ 2187538 2453765 2336523 2215832 1941707 2247092 1932721 1936921 1974622 2347547 2330021
10653B330021q0064J7040m4221j74448K22912k83354J71314J17893k19925M975
$$ 2330021 2249957 2266997 2222776 2048328 2271240 1987886 2159200 2277093 2057168 2062143
10643B062143l18841J39387L9k33870P9270k26127K00433j59734J13433N7762
$$ 2062143 1743302 1882689 1882728 1648858 1728128 1502001 1702434 1542700 1656133 1713895
10633A713895k66820K21457M4134r819L3119j68296J00375j85993K88967r6215
$$ 1713895 1447075 1668532 1712666 1702847 1735966 1567670 1668045 1482052 1771019 1674804
10623A674804j95766K39864j62402M6120m8389r0820l7462N02K26890m0611j85239
$$ 1674804 1479038 1718902 1556500 1602620 1554231 1463411 1425949 1426451 1653341 1612730 1427491
10612A427491P8719k5099J28820j36646L0150J52257M4406j63065K81912j13311
$$ 1427491 1506210 1481111 1609931 1473285 1503435 1655692 1700098 1537033 1818945 1705634
10602A705634k63246J97046m8572J59451j89136J53022M5273j42170J33506k29293
$$ 1705634 1442388 1639434 1590862 1750313 1561177 1714199 1759472 1617302 1750808 1521515
10592A521515J33749Q5445j35558K69931m94497M44259k65328Q6363p6850j58020
$$ 1521515 1655264 1740709 1605151 1875082 1380585 1824844 1559516 1645879 1569029 1411009
10582A411009J12844K80147l07j37455Q5857o9081j39694L88594k88888k079O7526
$$ 1411009 1523853 1804000 1803693 1666238 1752095 1683014 1543320 1931914 1643026 1640947 1708473
10571A708473q1932O7028k29557J45196j7009P4380k40791P9757q7221J13381
$$ 1708473 1626541 1693569 1464012 1609208 1592199 1666579 1425788 1505545 1418324 1531705
10561A531705k42671K81498m934j25408M2088j94372P3456j13019O1673o6218
$$ 1531705 1289034 1570532 1565598 1440190 1482278 1287906 1361362 1248343 1310016 1243798
10551A243798j0357J0292K01515r4364J03047J48282o7699p2517j70953P6487
$$ 1243798 1233441 1243733 1445248 1350884 1453931 1602213 1534514 1461997 1291044 1367531
10541A367531o5509r4898k7987O0913L47858l17898O2267j6659L6192q6940J4553
$$ 1367531 1302022 1207124 1179137 1240050 1587908 1270010 1332277 1315618 1351810 1264870 1279423
10530A279423J23456O3455N3651l3757J0056L377K76655l02992L24481R3952j45391
$$ 1279423 1402879 1466334 1519985 1486228 1496284 1499661 1776316 1473324 1797805 1891757 1746366
10519A746366J23220J60656p3787L85947k20955j07448O9716Q3545k01363o2814
$$ 1746366 1869586 2030242 1956455 2342402 2121447 2013999 2083715 2167260 1965897 1903083
10509A903083l4040j56528q6809o3604K0704M506r7587J79382O831J29884j82628
$$ 1903083 1869043 1712515 1625706 1562102 1582806 1587312 1489725 1669107 1675938 1805822 1623194
10498A623194o961J19408q4587K26043o5987J19430J39193J37597J62329J1996
$$ 1623194 1616233 1735641 1651054 1877097 1811110 1930540 2069733 2207330 2369659 2381655
10488B381655M5122k0346o8040k0002O5684l30632K74945l87433J72018j40652
$$ 2381655 2426777 2406431 2338391 2318389 2384073 2053441 2328386 1940953 2112971 1972319
10478A972319q0815J56149k63774r0689K88802j61280Q7719O5547j37941J7188
$$ 1972319 1891504 2047653 1783879 1693190 1981992 1820712 1908431 1973978 1836037 1853225
10468A853225L22684Q93K37746j57729J18169J62697k77738L9452M4736J09533
$$ 1853225 2175909 2176802 2414548 2256819 2374988 2537685 2259947 2299399 2344135 2453668
10458B453668j91050N8262l38376J04205K05005r0822n4444r3385N5480R5580
$$ 2453668 2262618 2320880 1982504 2086709 2291714 2200892 2146448 2053063 2108543 2204123
10448B204123J49372p3904K20760k42058J32366j58133K78669K82198K64835k7548
$$ 2204123 2353495 2279591 2500351 2258293 2390659 2232526 2511195 2793393 3058228 3030680
10438C030680K12516K6505J82569K03256k90519r1908j01441n5973j89667j64976
$$ 3030680 3243196 3269701 3452270 3655526 3365007 3273099 3171658 3115685 2926018 2761042
10428B761042k10226r8905k87036J68650n8200P9342k9830l70931j4723j969L07202
$$ 2761042 2550816 2451911 2164875 2333525 2275325 2354667 2324837 1953906 1939183 1937214 2244416
10417B244416o8856j97417J82815K5708l9967L55161J13694J84516k50877L06528
$$ 2244416 2175560 1978143 2160958 2186666 2146699 2501860 2615554 2800070 2549193 2855721
10407B855721R0554J92077k19901J58957j43728M2405n1411m8909o7340k3642
$$ 2855721 2946275 3138352 2918451 3077408 2933680 2976085 2924674 2875765 2808425 2784783
10397B784783O6972K76951R7794K39506J6033P6889K76609K205K58991K03890
$$ 2784783 2851755 3128706 3226500 3466006 3482039 3558928 3835537 3837742 4096733 4300623
10387D300623J84103J57910P5192M17786k3061M36527M1742k37806L7982O9430
$$ 4300623 4484726 4642636 4717828 5135614 5112553 5549080 5590822 5353016 5390998 5460428
10377E460428l76185R6259l26323J18833k63001p1875J77291l47995p8720K36100
$$ 5460428 5084243 5180502 4854179 4973012 4710011 4638136 4815427 4467432 4388712 4624812
10367D624812l2916K8051l7766N0432j94186Q1885k48821m737j04482J52709j13787
$$ 4624812 4591896 4619947 4582181 4632613 4438427 4520312 4271491 4266754 4162272 4314981 4201194
10356D201194k86106J03630M8278Q3734l24917N2642J94400j38743R1487k34262
$$ 4201194 3915088 4018718 4066996 4150730 3825813 3878455 4072855 3934112 4025599 3791337
10346C791337K55547k69188o0974K1533o5510k4808J16510M1158L67216j52449
$$ 3791337 4046884 3777696 3716722 3738255 3672745 3647937 3764447 3805605 4172821 4020372
10336D020372J25079J46351j00314K14346n35244L99648o9495q7600j45980j45479
$$ 4020372 4145451 4291802 4191488 4405834 3870590 4270238 4200743 4113143 3967163 3821684
10326C821684L20446m0286k4596o1664M1891K7087M4916j37203J55684L8869k96346
$$ 3821684 4142130 4101844 4077248 4015584 4057475 4084562 4129478 3992275 4147959 4186828 3890482
10315C890482q422L76296k11693L77323j61645L08472L6751J87725J0434K78246
$$ 3890482 3882060 4258356 4046663 4423986 4262341 4570813 4607564 4795289 4805723 5083969
10305E083969n2856J46204j24538K856L3867p8413j9882j73160J11828k39990
$$ 5083969 5031113 5177317 5052779 5055635 5089502 5011089 4991207 4818047 4929875 4689885
$$ [...]
##END NTUPLES=NMR SPECTRUM
##END=
