##TITLE=Coffee green (M2-ROVE80 + 1.5mL buffer 50/50,  450uL extracto + 50uL (D2O+TMS))
without heating, vortex and centrifuged, temperature 0oC.
##JCAMPDX= 6.0         $$ Bruker NMR JCAMP-DX V2.0
##DATA TYPE= NMR SPECTRUM
##DATA CLASS= NTUPLES
##ORIGIN= Bruker BioSpin GmbH
##OWNER= Administrator
$$ 1.72 TOPSPIN		Version 2.1
$$ 2012-05-22 16:15:31.153 -0700  Administrator@X
$$ Compression mode = diff/dup
##.OBSERVE FREQUENCY= 400.13188198
##.OBSERVE NUCLEUS= ^1H
##.ACQUISITION MODE= SIMULTANEOUS (DQD)
##.ACQUISITION SCHEME= undefined
##.AVERAGES= 64
##.DIGITISER RES= 22
##SPECTROMETER/DATA SYSTEM= spect
##.PULSE SEQUENCE= noesygppr1d
##.SOLVENT NAME= H2O+D2O
##.SHIFT REFERENCE= INTERNAL, H2O+D2O, 1, 14.97969
##AUDIT TRAIL= $$ (NUMBER, WHEN, WHO, WHERE, PROCESS, VERSION, WHAT)
$$ ##TITLE= Audit trail, TOPSPIN		Version 2.1
$$ ##JCAMPDX= 5.01
$$ ##ORIGIN= Bruker BioSpin GmbH
$$ ##OWNER= Administrator
$$ $$ C:/Bruker/TOPSPIN/data/jwist/nmr/11-coffee-green-quantification-2/271/pdata/1/auditp.txt
$$ ##AUDIT TRAIL=  $$ (NUMBER, WHEN, WHO, WHERE, PROCESS, VERSION, WHAT)
(   1,<2011-11-18 14:31:54.310 -0500>,<Administrator>,<TOPSPIN>,<go>,<TOPSPIN 2.1>,
      <created by zg
	started at 2011-11-18 14:22:59.607 -0500,
	POWCHK enabled, PULCHK disabled,
       configuration hash MD5:
       DA 63 81 1B EF 4C B5 72 B4 DF EA D9 B4 DB 4C 08
       data hash MD5: 64K
       36 4B CE D6 72 01 DC 99 C9 8F DD 6F C0 57 6C EB>)
(   2,<2011-11-18 15:25:57.341 -0500>,<Administrator>,<TOPSPIN>,<proc1d>,<TOPSPIN 2.1>,
      <Start of raw data processing
       efp LB = 0 FT_mod = 6 PKNL = 1 PHC0 = 0 PHC1 = 0 SI = 32K 
       data hash MD5: 32K
       C2 49 A6 DD 5E FB AF AF C9 14 BB CE 24 34 1C 8F>)
(   3,<2011-11-18 15:25:57.732 -0500>,<Administrator>,<TOPSPIN>,<proc1d>,<TOPSPIN 2.1>,
      <pk PHC0 = 23.17017 PHC1 = 0 
       data hash MD5: 32K
       30 79 42 B5 66 99 61 CB C5 C8 32 B0 9A 83 D5 08>)
$$ ##END=
$$ 
$$ $$ hash MD5
$$ $$ 9D 4F F7 8C A6 58 7E E9 6C BB C0 4D 70 46 94 1A
##$RELAX= 
##$RELAX= 
##$RELAX= 
##$RELAX= 
##$RELAX= 
$$ Bruker specific parameters
$$ --------------------------
##$DU= <Z:>
##$EXPNO= 271
##$NAME= <11-coffee-green-quantification-2>
##$PROCNO= 1
##$TYPE= <nmr>
##$USER= <jwist>
##$ACQT0= -8.18511563644234
##$AMP= (0..31)
100 100 100 100 100 100 100 100 100 100 100 100 100 100 100 100 100 100
100 100 100 100 100 100 100 100 100 100 100 100 100 100
##$ANAVPT= -1
##$AQSEQ= 0
##$AQ_mod= 3
##$AUNM= <au_prof>
##$AUTOPOS= <>
##$BF1= 400.13
##$BF2= 400.13
##$BF3= 400.13
##$BF4= 400.13
##$BF5= 400.13
##$BF6= 400.13
##$BF7= 400.13
##$BF8= 400.13
##$BYTORDA= 0
##$CFDGTYP= 0
##$CFRGTYP= 9
##$CHEMSTR= <none>
##$CNST= (0..63)
1 1 145 1 1 1 1 1 1 1 1 1 1 1 1 1 1 1 1 1 1 1 1 1 1 1 1 1 1 1 1 1 1 1 1
1 1 1 1 1 1 1 1 1 1 1 1 1 1 1 1 1 1 1 1 1 1 1 1 1 1 1 1 1
##$CPDPRG= <>
##$CPDPRG1= <>
##$CPDPRG2= <>
##$CPDPRG3= <>
##$CPDPRG4= <mlev>
##$CPDPRG5= <mlev>
##$CPDPRG6= <mlev>
##$CPDPRG7= <mlev>
##$CPDPRG8= <mlev>
##$CPDPRGB= <>
##$CPDPRGT= <>
##$D= (0..63)
$$ [...]
##$TP= (0..7)
150 150 150 150 150 150 150 150
##$TP07= 0
##$TPNAME0= <>
##$TPNAME1= <>
##$TPNAME2= <>
##$TPNAME3= <>
##$TPNAME4= <>
##$TPNAME5= <>
##$TPNAME6= <>
##$TPNAME7= <>
##$TPOAL= (0..7)
0.5 0.5 0.5 0.5 0.5 0.5 0.5 0.5
##$TPOFFS= (0..7)
0 0 0 0 0 0 0 0
##$TUNHIN= 0
##$TUNHOUT= 0
##$TUNXOUT= 0
##$USERA1= <user>
##$USERA2= <user>
##$USERA3= <user>
##$USERA4= <user>
##$USERA5= <user>
##$V9= 5
##$VALIST= <valist>
##$VCLIST= <CCCCCCCCCCCCCCC>
##$VD= 0
##$VDLIST= <DDDDDDDDDDDDDDD>
##$VPLIST= <PPPPPPPPPPPPPPP>
##$VTLIST= <TTTTTTTTTTTTTTT>
##$WBST= 2048
##$WBSW= 25
##$XGAIN= (0..3)
0 0 0 0
##$XL= 0
##$YL= 0
##$YMAX_a= 4961512
##$YMIN_a= -1739926
##$ZGOPTNS= <>
##$ZL1= 120
##$ZL2= 120
##$ZL3= 120
##$ZL4= 120
##$ABSF1= 0
##$ABSF2= 0
##$ABSG= 0
##$ABSL= 0
##$ALPHA= 0
##$AQORDER= 0
##$ASSFAC= 0
##$ASSFACI= 0
##$ASSFACX= 0
##$ASSWID= 0
##$AUNMP= <proc_prof1d>
##$AXLEFT= 0
##$AXNAME= <>
##$AXNUC= <1H>
##$AXRIGHT= 0
##$AXTYPE= 0
##$AXUNIT= <>
##$AZFE= 0.1
##$AZFW= 0.1
##$BCFW= 0
##$BC_mod= 0
##$BYTORDP= 0
##$COROFFS= 0
##$CY= 15
##$DATMOD= 1
##$DC= 0
##$DFILT= <>
##$DTYPP= 0
##$F1P= 0
##$F2P= 0
##$FCOR= 0.5
##$FTSIZE= 32768
##$FT_mod= 6
##$GAMMA= 0
##$GB= 0
##$INTBC= 1
##$INTSCL= 1
##$ISEN= 128
##$LB= 0
##$LEV0= 0
##$LPBIN= 0
##$MAXI= 10000
##$MC2= 0
##$MEAN= 0
##$ME_mod= 0
##$MI= 0
##$NCOEF= 0
##$NC_proc= -6
##$NLEV= 6
##$NOISF1= 0
##$NOISF2= 0
##$NSP= 0
##$NTH_PI= 0
##$NZP= 0
##$OFFSET= 14.97969
##$PC= 1
##$PHC0= 23.17017
##$PHC1= 0
##$PH_mod= 1
##$PKNL= yes
##$PPARMOD= 0
##$PPDIAG= 0
##$PPIPTYP= 0
##$PPMPNUM= 2147483647
##$PPRESOL= 1
##$PSCAL= 4
##$PSIGN= 0
##$PYNMP= <proc.py>
##$REVERSE= no
##$SF= 400.13
##$SI= 32768
##$SIGF1= 0
##$SIGF2= 0
##$SINO= 400
##$SIOLD= 32768
##$SPECTYP= <>
##$SREGLST= <1H.CDCl3>
##$SSB= 0
##$STSI= 32768
##$STSR= 0
##$SW_p= 8223.68421052631
##$SYMM= 0
##$S_DEV= 0
##$TDeff= 65536
##$TDoff= 0
##$TI= <>
##$TILT= no
##$TM1= 0
##$TM2= 0
##$TOPLEV= 0
##$USERP1= <user>
##$USERP2= <user>
##$USERP3= <user>
##$USERP4= <user>
##$USERP5= <user>
##$WDW= 1
##$XDIM= 32768
##$YMAX_p= 291202113
##$YMIN_p= -67932115
##$CURPLOT= <Network HP LaserJet P1505>
##$CURPRIN= <$Network HP LaserJet P1505>
##$DFORMAT= <normdp>
##$LAYOUT= <+/1D_H.xwp>
##$LFORMAT= <normlp>
##$PFORMAT= <normpl>
##$SURQMSG= 1
$$ End of Bruker specific parameters
$$ ---------------------------------
##NTUPLES= NMR SPECTRUM
##VAR_NAME=  FREQUENCY,     SPECTRUM/REAL,   SPECTRUM/IMAG
##SYMBOL=    X,             R,               I
##VAR_TYPE=  INDEPENDENT,   DEPENDENT,       DEPENDENT
##VAR_FORM=  AFFN,          ASDF,            ASDF
##VAR_DIM=   32768,         32768,           32768
##UNITS=     HZ,            ARBITRARY UNITS, ARBITRARY UNITS
##FACTOR=    0.250966925370066, 1,           1
##FIRST=     8223.43324360094, 110140,       -82253
##LAST=      0,             86089,           -209631
##MIN=       0,             -67932115,       0
##MAX=       8223.43324360094, 291202113,    0
$$ Real data points
##PAGE= N=1
##DATA TABLE= (X++(R..R)), XYDATA
$$ [...]
23402 505830 243790 284438 376445 439971 518583 328030 372433 312112 272060 394008 619259
23391 619259 188019 291959 508657 553389 398319 596927 332509 391213 346702 455317
23381 455317 717587 374208 812219 691218 735971 907142 742069 554119 1256133 1041001
23371 1041001 1278583 1824097 2034604 2930550 3659099 4797395 6049444 7445323 9241178
23362 9241178 11292104 13046855 15285828 17518308 19191543 20812539 22121017 23286483
23354 23286483 23453131 23680248 23077527 22207544 20718686 19260587 17452106 15100778 13130508
23345 13130508 10983024 9134526 7394490 5910094 4580616 3411306 2661180 1979055
23337 1979055 1759943 1281215 946375 969855 689717 668321 441414 508938 173889 294189
23327 294189 444576 236687 379039 406641 597316 435146 112464 335183 432998 211914
23316 156444 326636 318470 400657 172911 450592 368714 407650 193123 113860 286717 366556
23305 366556 15463 306238 202735 418355 331770 111813 110503 401999 247271 127548
23295 127548 96938 -13552 208074 134484 99496 471443 272965 26117 154618 380805
23285 380805 222176 434869 287172 452481 186604 266416 229434 430823 482154 294216
23275 294216 318267 233868 355075 416343 316212 312253 322040 267964 178079 213431 222582 374860
23263 374860 307528 294041 328954 93162 213900 339270 149371 329889 268271 76588 286327
23252 286327 593200 443890 270244 223550 125207 504109 462160 471818 261058 115939
23241 322135 298880 221107 440202 357408 219327 235816 352887 282426 206308 352878 249064
23230 249064 440969 202122 82338 261479 328493 -104150 93664 423651 352240 55700
23219 363987 251672 366754 368278 3481 148053 109810 371172 280638 167885 223683 216949
23208 216949 118824 364122 -12985 194422 104692 115853 244658 174375 192487 445612 436026
23197 436026 65523 127819 288019 315409 234335 269190 350375 132017 279690 346419 192350
23186 192350 42327 346585 242616 257972 452567 284496 158910 339909 128509 67454
23176 67454 330289 100339 89767 272167 457793 208259 172882 218043 246935 174103 331545
23165 331545 312775 130553 233217 79709 159948 352028 281071 35857 326484 374756 169360
23153 175023 212850 232741 129085 209439 152084 320292 286967 168041 189954 160350 186074
23142 186074 296746 314030 292448 473085 287958 236164 337549 295618 244375 61459 281366
23131 281366 232561 437337 374913 144065 315357 336350 399497 384252 35284 481003 240560
23120 240560 167395 346134 61159 218001 365765 95391 160511 234518 338433 126564
23109 217879 409079 113727 181655 293350 280985 466396 195644 224094 199056 355830
23099 355830 285754 277915 307055 422572 289911 376871 393697 363397 133232 157408 389447
23088 389447 151110 265409 425115 186350 229413 34539 351867 273440 486072 444844
23078 444844 547269 321984 119851 342169 372836 426192 312419 294797 193278 320666
23068 320666 273397 161034 217803 288747 284656 327837 354801 313640 254144 290603 489089
23057 489089 146349 500348 276683 388426 319189 490499 520806 237993 124396 484466
23047 484466 77829 425233 434895 271223 317379 396016 39466 166114 404299 338359 189205
23036 189205 275036 279573 232322 434584 238582 364326 488891 184829 89747 315607
23026 315607 218129 485393 296869 444411 260568 423277 442256 291783 316884 387878
23016 387878 393036 272517 315900 370686 250324 424575 181074 285827 247223 214401 268024
23005 268024 325190 399349 244994 393654 379627 393423 177346 389228 316180 290648 296351
22994 296351 401776 351607 455082 479794 240996 396667 300837 544167 600971 670453
22984 670453 388596 238005 210253 344983 529291 458468 553563 265567 577494 485568
22974 485568 339441 279169 300776 694667 326605 475307 353351 653619 810583 440904
22964 440904 637153 356998 678606 531807 596459 436659 669108 743802 661888 812623
22954 812623 599421 778741 734530 835664 1047460 1277942 1277320 1550219 2099157 2866182
22944 2866182 3742394 4539548 5487156 6857716 8025369 9126084 10297684 11329250 12019382
22935 12019382 12480467 12457626 12682964 12585129 12259259 11300453 10178153 9203432 8109946
22926 8109946 6950488 5991280 4730711 3882612 3199049 2770906 2229071 2161617 2274398
22917 2274398 2133556 2668036 3019697 3765925 4345399 5206236 6496107 7892423 9398294
22908 9398294 11265851 13582758 15421234 17045346 18754067 19993489 20835604 21957986
22900 21957986 22307074 22350317 21504573 20590514 19537185 17874643 16379192 14747808 12863740
22891 12863740 11093070 9688972 8648059 7405019 6771199 6272729 6135119 5936173 5995746
22882 5995746 6575100 7028054 7660563 8576238 9207524 9659139 9966082 10633552 10657240 10982004
22872 10982004 10856919 10296093 10011687 9135330 8656123 7691260 6913453 6066862 5223930
22863 5223930 4426459 3734807 3251375 2579597 2228905 1775587 1678034 1473618 1309155 1082911
22853 1082911 866887 959184 952416 778225 849583 794393 395454 768641 515177 590644
22843 590644 601146 342741 742396 668948 329950 509296 503869 484362 512510 446941 581046
22832 581046 473463 496243 334248 252416 555644 524901 471637 210989 520681 338415
22822 338415 553618 445532 437587 416645 546261 504354 238343 445053 372488 291412 589491
22811 589491 385272 456442 295236 446861 415595 444283 468885 172529 581784 397179
22801 397179 290110 276096 505587 592072 441489 485646 450192 268667 437644 358643
22791 358643 220834 307552 369671 359438 535756 473616 335981 363307 178824 235046 285970
22780 285970 208654 264230 495205 404210 263227 473222 458404 397801 304149 321870 458755
22769 458755 333242 349089 294184 415579 322582 359246 70020 231381 421177 642917
22759 642917 173843 276835 220294 498903 272169 202740 158928 355486 229240 251492
22749 251492 150443 -10502 479691 643406 205356 459194 486986 406532 270380 386652
22739 386652 309848 209903 474459 385083 79796 268588 360378 276899 127658 364968 536414
22728 536414 -9011 396686 380455 194676 534179 302601 291463 76516 364490 572315
22718 572315 142447 405427 424542 454702 320535 369505 454968 252369 581218 355231
22708 355231 355588 70008 233465 277577 188625 524061 258732 113982 353080 415918 268988
22697 268988 392770 314605 404442 133945 255601 235734 368463 134029 130194 198415 342081
22686 342081 538054 349186 279912 337574 58167 345115 267681 372218 286475 484900
22676 484900 512275 388441 175383 1180 290340 321399 557064 481781 475876 328930 74760
22664 337860 348077 211855 279783 470072 326814 286387 276771 466686 258353 368037
22654 368037 513334 363968 133997 390725 404623 276147 369976 546124 299625 248113
22644 248113 322763 328975 172525 138293 396625 418185 342150 135952 355114 270032 510048
22633 510048 360060 518876 381197 188373 410158 242689 450093 392681 549908 361672
22623 361672 532623 515025 473967 388200 478435 277472 517190 581770 413046 423013 452460
22612 452460 463390 501764 474986 663858 460212 699388 419258 497820 304348 571970
22602 571970 517342 528644 219817 546095 625400 441396 515652 295184 712403 509709
22592 509709 659583 519393 274552 585768 352523 505370 386717 603435 347471 548843
22582 548843 405598 339047 673029 410807 361835 593057 448498 472026 751132 239117
22571 525123 284306 660967 524416 429115 382145 430316 511883 384435 505882 279325
22561 279325 574510 519715 509871 396170 554215 515427 821415 833203 542616 765032
22551 765032 534356 515339 470876 436154 281441 300489 523181 542296 508796 683864 463397
22540 463397 461608 502826 675197 585957 125605 563467 325285 572557 462955 477952
22530 477952 341928 315425 558230 448668 163503 404365 427681 406617 476215 556471
22520 556471 225977 380889 720277 482963 612201 440911 485119 606791 469230 330147
22510 330147 398099 589315 366915 413795 210008 271154 330173 573487 504192 437419 694207
22499 694207 659691 247258 551516 257101 423056 340420 519611 635291 530838 714746
22489 714746 328654 516696 444963 270865 455649 597094 413333 561296 628001 404169
22479 404169 511538 411241 589380 442767 569389 361044 486675 563713 417655 596826
22469 596826 543653 349223 570128 496017 393148 436801 459260 689025 363521 476955
22459 476955 453437 532084 263406 469643 395335 581142 287421 455431 714629 445250
22449 445250 290528 620511 448769 441756 226453 409383 460235 331255 491109 366776
22439 366776 509367 674970 399584 465627 310994 342175 405928 704122 470036 711945
22429 711945 164340 201037 189144 552853 405865 425948 444803 452734 591443 647888 522708
22418 522708 504394 288940 292684 390089 433587 486680 467289 565988 390494 589423 440259
22407 440259 671784 431379 530122 535208 511591 598321 680166 447218 378889 694954 543179
22396 543179 663647 480498 493485 315596 344360 260516 422529 621648 404851 340055
22386 340055 406270 429295 557319 468256 462009 393478 377203 565040 685196 569680 711064
22375 711064 844778 414565 668737 523143 581917 469014 601071 262521 467424 553818
22365 553818 351123 491494 420278 542687 592699 463262 426409 453105 295975 322379
22355 322379 477468 464573 409127 596787 604482 319056 398993 712933 763217 575963 457405
22344 457405 552986 583232 510474 556588 688230 517820 552269 669786 880324 591197
22334 591197 660726 1017059 1283476 1206049 1158798 1370042 1394187 1323948 1195490 1358108
22324 1358108 1419562 999889 1031782 725651 584761 560173 519576 570163 562316 732521 711935
22313 711935 678386 643898 751243 428722 612175 490309 574700 590191 632547 468378
22303 468378 771153 440451 741150 817737 740022 958849 426150 612742 937365 679390
22293 679390 546049 657879 693271 849104 510861 861782 645104 847133 706081 761345
22283 761345 666003 698122 594339 758903 574266 792660 745604 850470 634308 705430
22273 705430 806797 607116 701968 702547 833295 680854 732605 797909 699459 799638 920924
22262 920924 807599 738424 635563 786515 827972 1043243 700349 920284 823929 781966
22252 781966 798864 666423 816471 760114 603681 707364 731047 717946 826829 786893
22242 786893 659266 611359 682540 883970 663409 697191 790633 870148 867361 878459 664468
22231 664468 845256 932604 766406 806780 978965 854936 895845 632393 667433 723892
22221 723892 528828 885828 771343 960125 643287 721883 739633 735422 731088 780004 771606
22210 771606 952327 933221 760336 868376 743243 790378 745245 902672 798687 825615
22200 825615 738982 888016 799694 628498 801330 730869 912205 782336 870684 917271
22190 917271 734573 677524 952965 743415 638371 768780 724305 592573 964367 815778
22180 815778 723260 853185 672592 535404 1007342 1047308 560039 726972 682627 798369
22170 798369 649305 699704 758124 617305 791457 692049 574687 915842 717977 638401
22160 638401 685355 372975 792716 761513 602027 630656 547023 832715 751992 615398
22150 615398 759813 734085 483374 617987 622484 521005 540546 895169 813799 760563 654507
22139 654507 732222 839026 516708 726009 727017 516584 687640 736962 783679 569281
22129 569281 598843 749131 673696 660813 744017 869753 603234 649120 847351 631084
22119 631084 829436 676118 687740 583371 721450 451597 757538 742253 603790 719554
22109 719554 693440 653096 712229 864300 551116 789456 839082 424572 719503 720270 602592
22098 602592 764775 552773 689327 609389 544841 502689 865176 600472 601048 654365 662413
22087 662413 840230 609636 839329 914187 624902 804371 738396 800254 809852 940088
22077 940088 859805 793782 963382 716408 720545 778115 684010 822987 713189 756193 775858
22066 775858 672574 626640 686698 690571 887697 729375 863766 768822 820122 1011023 854335
22055 854335 919672 1078224 729972 1046318 841214 1032498 793552 1124235 1087462 841245
22045 841245 699063 802062 739219 943300 781112 983997 842273 710638 964945 819994
22035 819994 751569 661885 766979 635469 718977 758481 837306 715979 965213 644238
22025 644238 822858 907828 752508 802223 816518 841772 743033 818963 792666 956427 925787
22014 925787 886631 1015879 971964 837862 790261 983478 972534 730637 1100760 827644
22004 827644 617992 963087 1065018 1010231 670324 865821 1058720 719253 698904 720404
21994 720404 807685 695491 866631 861142 935983 1068919 783646 678678 847047 668539
21984 668539 815458 1046854 960917 752250 930260 1111581 799519 1065477 834924 780918
21974 780918 882323 1024882 732295 914788 1075504 1009471 988752 855764 831472 787523
21964 787523 710475 903406 873232 792234 833849 842690 1102392 787055 759192 706511 1041873
21953 1041873 821578 905053 717757 848483 1054901 1031563 924939 799146 835887 745970
21943 745970 991822 927052 813769 983478 819624 978680 903632 889128 732902 967176
21933 967176 859673 852602 747422 672629 829294 873393 894673 882446 673399 892819 720415
21922 720415 999564 995989 951451 1094018 748264 818254 803821 950244 899485 645497 919068
21911 919068 998186 795816 819167 1229097 772351 899350 967713 979602 736236 858156
21901 858156 964032 630844 929308 762270 926143 793392 732556 749907 738922 774035
21891 774035 893777 926251 951188 1113153 934465 923018 823896 784053 878060 857815 847653
21880 847653 643172 918822 916610 1116604 717458 839645 1006935 1072996 692840 943910
21870 943910 939966 921688 855019 768339 937860 988790 824596 897091 993355 744016 810533
21859 810533 931391 911782 878282 990058 931760 905590 910514 907877 688473 1085414 747329
21848 747329 720134 746171 786725 910965 968204 838613 748003 419638 825570 709627
21838 709627 599312 700338 906841 1027068 814242 827907 713744 935364 839467 890389
21828 890389 1005428 835758 802377 791294 841410 790553 932488 942273 814806 955602 779774
21817 779774 889839 800734 855451 874523 520308 787984 835838 925110 824347 826407 723621
21806 723621 999043 1024874 813803 806345 755573 849434 902888 676832 789549 709618 885113
21795 885113 737151 820245 982166 762763 695431 777349 812023 819567 755143 905073 1005768
21784 1005768 570775 724298 701957 1020513 812201 699380 870022 1026276 748517 1018892
21774 1018892 906506 987625 685529 764710 659204 995344 594016 763019 689103 550412
21764 550412 580186 1068398 1089506 907375 1075006 1020530 961150 1039476 992701 1038044 1059907
21753 1059907 1417601 1284832 1028671 1398956 1314180 1404252 1512425 1654702 2007000 1902455
21743 1902455 2021810 2853474 2945756 3348062 4044324 4415669 5232865 5893043 6427762 6909390
21733 6909390 7329052 7035195 7154062 6936141 6563841 6017679 5623289 5174576 4751135
21724 4751135 4305903 4103063 3568743 3472306 3462110 3680871 3615598 4043909 4519002 4954914
21714 4954914 5518972 6186595 6849276 7524150 8203149 8716262 9329536 9612601 9720087
21705 9720087 10175024 10195468 10251363 10252705 9726535 9412715 8759314 8507103 7690853 6888942
21695 6888942 6224756 5672084 5056707 4868095 4308782 3786316 3715613 3522633 3568119 3814853
21685 3814853 3810875 3969340 4237630 4727093 5432351 5815089 6156696 6668351 6666353 6688093
21675 6688093 6801932 6379252 6048162 5349176 4950367 4449466 3980542 3253877 3051942
21666 3051942 2760718 2312303 2201917 1982720 1679740 1403528 1614704 1275735 1461007
21657 1461007 1402972 1374411 1343848 1360477 1043116 1111282 1150251 987573 791106 1025785
21647 1025785 956052 1202822 943968 1333072 1000543 774929 538137 1013648 626028 1073389
21637 1073389 738824 1057470 750118 1051753 887802 906585 1090421 861218 837302 837030
21627 837030 840818 616048 797298 604022 863257 980819 789596 895374 469188 661297
21617 661297 1092075 810788 615133 628295 871676 880399 866931 541158 696859 612174
21607 612174 952838 760198 631268 851147 759776 843797 546888 611430 800628 940710
21597 940710 706247 926126 477887 906332 901779 787531 782739 758264 909953 665684
21587 665684 778614 876750 699126 869816 861396 800569 945744 850479 868307 760921 837772
21576 837772 723755 699157 787050 991499 809135 722087 746257 1029720 788324 629121
21566 629121 574245 836031 609272 706066 846540 716088 826346 831263 785636 609979
21556 609979 805044 874896 713280 742765 977833 614539 899193 543963 945141 847527
21546 847527 710950 851521 848666 795950 794484 548041 584887 522592 617976 734246 845013
21535 845013 765277 609230 773474 587309 753252 1035814 866478 652921 854667 816156
21525 816156 822772 826183 1045168 839532 867909 846601 825462 963568 828744 973389 814094
21514 814094 750622 974704 795522 1122555 779215 773237 849112 781787 1084909 1011337 795814
21503 795814 1074053 885918 910935 1130585 1057994 959006 1061013 857709 985548 804575
21493 804575 985693 990653 680534 876176 777403 829709 791461 1056493 1039937 1225923 930668
21482 930668 933785 1040639 1028584 992229 980631 1013260 773343 1102043 948001 977181 899830
21471 899830 1041399 1171196 909650 798240 828156 1049242 812695 1012185 980539 885041
21461 885041 1112740 921850 938135 1045164 1030361 1134278 1014976 1218074 1143098 925378
21451 925378 833592 988195 843787 770517 900213 948015 1050768 1078648 891129 1008461
21441 1008461 910599 953888 973777 684871 973811 1083892 991487 1007478 952405 922813 1032584
21430 1032584 899146 838126 820287 1047101 864714 905326 1011951 804369 893442 752421
21420 752421 847043 1049407 954276 901366 1147088 951476 1083573 834587 967806 746448
21410 746448 687231 961958 834434 813535 832183 990958 856225 959747 910860 905397 837110
21399 837110 667572 880373 776913 878975 657532 913095 762727 1039145 879859 804245
21389 804245 823682 933674 775389 775884 1018105 917068 1080798 955377 1028152 909480
21379 909480 905728 1079864 790929 815066 903539 927234 1056330 1144486 878116 1032512 1104881
21368 1104881 864183 893859 834483 1001346 923663 1121188 1012588 829620 1142433 840829
21358 840829 826669 1088832 924157 974989 941714 1021842 1090502 991559 902949 1067664 1054586
21347 1054586 1010434 1010411 1208793 953681 1315164 1076072 1138366 1326878 1228763 1097989 1233022
21336 1233022 1038192 1323872 1308885 1218253 947006 1421839 1380636 1175539 1263655 1161037
21326 1161037 1088773 1016658 1361747 1200029 1214460 1141671 1459850 1383859 1481666 1393761 1344368
21315 1344368 1218419 1536134 1535514 1575195 1310429 1520671 1757338 1729970 1838761 1699192
21305 1699192 1802824 1648045 1811750 2123682 1997956 2067354 1786138 1933380 2061612 2385100
21295 2385100 2065345 2563458 2438244 2600193 2442736 2646833 3053240 3283099 3210016 3414054
21285 3414054 3580603 3739814 3847167 4299168 4203537 4761534 5348731 5672340 6008392 6722582
21275 6722582 7250850 7924694 8851230 10192118 11334677 12874655 14598446 16434088 18650283
21266 18650283 21044274 23302227 25837176 27858033 29560215 30681723 31528243 31694746
21258 31694746 31229440 30280531 28578200 26713638 24434722 22122303 19696904 17541482
21250 17541482 15779582 13811754 12402382 10875271 9389870 8346347 7687269 6914187
21242 6914187 6243339 5663081 5204827 4827323 4633896 4278359 3900644 3614854 3680770 3429170
21232 3429170 3160082 2948535 2954215 2724829 2600980 2558560 2375106 2446423 2366588 1956594
21222 1956594 1929462 2066328 1975334 1785899 2047089 1804701 1744993 1717968 1504667 1508559
21212 1508559 1513543 1544916 1514560 1667288 1525141 1512558 1452820 1382989 1371077 1493782 1393444
21201 1393444 1371701 1239283 1249850 1353483 1188443 1492492 906735 1280389 1324984 1121508
21191 1121508 1168888 1219401 1123167 1111355 1350318 1328321 1400751 995257 1358865 1159914
21181 1159914 1187530 1362202 1229656 1255670 1194407 1277164 1067430 1197718 1280937 1202138
21171 1202138 939131 1299420 1223032 1247569 1124786 1177401 1250505 1147877 1290714 1347494
21161 1347494 929473 1184229 1196608 1201244 960288 1144472 1161239 1148406 966920 1299973
21151 1299973 1181124 1181481 1005897 1163081 1097951 1166466 1131031 1176207 1331086 1239550 1079001
21140 1079001 1030329 1433727 1005319 1045760 1299923 1128694 1253136 1362242 1235011 1256901
21130 1256901 1179736 1265428 1309285 1280378 997453 960334 1176054 1064337 1092152 1038690 1065673
21119 1065673 843003 1140500 1178068 1177714 1245388 716429 1146905 1266532 947154 996036
21109 996036 1060733 1188650 932404 926293 1106376 1446483 1190819 1185724 1245575 1398401 1240369
21098 1240369 1364878 1315273 1506608 1342152 1151599 1392912 1316751 1350156 1246456 1207081
21088 1207081 1289113 1370407 1329174 1426253 1208438 1385907 1332213 1692906 1225668 1683088
21078 1683088 1887467 1756834 1868644 1973125 1905199 1943814 2116354 2124358 2113629 1663725
21068 1663725 1848928 1841746 1899833 1933709 1789657 1777224 1599915 1887432 1777861 1991877
21058 1991877 1462009 1650364 1724784 1563413 1537441 1453927 1394361 1407063 1261755 1274884
21048 1274884 1266282 1180040 1453331 1310555 1489625 1534121 1596971 1289450 1293489 1483495 1483746
21037 1483746 1561319 1702981 1317945 1484714 1416299 1534601 1769679 1446380 2041600 1789327
21027 1789327 2218190 2010147 2011804 2234302 2877991 3323893 3947071 4248100 4801258 4989905
21017 4989905 5415299 5652960 5593861 5588935 5185013 4978143 4432292 3975507 3754227 3375296
21007 3375296 3261351 3028281 2806044 2662909 2562002 2415491 2424733 2514456 2535941 2779996
20997 2779996 2373389 2419785 2472250 2822517 2696149 3087149 3370371 3895964 4472953 5136176
20987 5136176 5543657 6149433 6578500 7123521 7502082 7251720 7038192 6347502 6168868
20978 6168868 5543921 4924644 4221288 3719209 3404432 3291705 3068677 2793397 2635086
20969 2635086 2319430 2397719 2440554 2517787 2582320 2401578 2683661 2901994 3032052 3380680
20959 3380680 3989762 4349252 5222987 5574471 6044867 6292524 6381442 6856845 7036299 7029671
20949 7029671 6942743 6943952 7013253 7002530 7205261 7349834 7564798 7491751 7392020 7537877 7958841
20938 7958841 7804480 8065379 8586733 9254660 10599638 12218490 14452564 16991921 19644298
20929 19644298 22118904 24166568 25847838 27176705 27506289 27522178 26696764 25456298 23437876
20920 23437876 21258027 18814640 16710103 14493559 12543368 10872056 9451444 8161742
20912 8161742 6774911 5574636 5179019 4848693 4080413 3885532 3630758 3336131 3251293
20903 3251293 2797172 2981713 2837417 2779431 2808060 2830395 2750059 2701521 2763782 2521238
20893 2521238 2699860 2625794 2568238 3071993 2920448 3086171 3379222 3795811 4333386 4635591
20883 4635591 5493175 5700608 6445414 6478283 6816330 6903061 7099265 7219489 7317876 7398726
20873 7398726 7784194 8610379 9697493 11318405 13382354 15834257 18446584 21016459
20865 21016459 23162956 24831096 25651193 26107828 25167018 24190318 22024905 19721855 17310017
20856 17310017 14510944 12111790 9954255 8359420 7060412 5998462 5221033 4598940
20848 4598940 4037849 3821039 3258868 3173323 3077254 2879459 2623424 2377007 2104946 2106900
20838 2106900 2370970 2140348 2129456 2283658 2144215 2136681 1925572 2022587 2147334 1965463
20828 1965463 2099106 1789015 1842204 1873409 1904589 1859507 2058999 1865370 1635240 1967377
20818 1967377 2059232 2024783 1808964 1707044 1928525 1732047 1835960 1806526 1688426 1809004
20808 1809004 1782392 2022628 1917839 1982059 2226717 1939733 2070719 1921730 1805648 2054866
20798 2054866 2090646 1875947 1879016 1777090 1961065 1704274 1442415 1807350 1639618 1634682
20788 1634682 1884396 1694796 1608021 1449048 1499930 1447674 1537966 1472288 1687673 1737359
20778 1737359 1599808 1750421 1584558 1732402 1561628 1595730 1702031 1723018 1595157 1745297
20768 1745297 1512559 1403339 1636845 1791053 1652272 1713819 1721622 1752571 1720919 1530606
20758 1530606 1479844 1672923 1509947 1460649 1397309 1507003 1301922 1393997 1621844 1233625
20748 1233625 1356133 1423222 1366694 1472488 1431954 1165365 1463183 1436525 1242184 1525633
20738 1525633 1281540 1371895 1452839 1505550 1448234 1329672 1516570 1462297 1523668 1376417
20728 1376417 1623725 1586098 1645560 1346944 1613174 1324982 1570633 1453243 1652142 1657688
20718 1657688 1898011 1601231 1657467 1554636 1796969 1703253 1794106 1958579 1879015 1754657
20708 1754657 2055563 1946211 1894239 1989918 1739839 2056799 1826469 1992088 2130989 1901005
20698 1901005 1707353 1924162 1991717 1963136 1995138 1813114 1943770 1775194 1667463 1709973
20688 1709973 1695144 1621599 1968809 1620502 1958723 1879695 1694754 1914783 1935900 2131720
20678 2131720 2149058 2503176 2193070 2148025 2575804 2562448 2342271 2412458 2354210 2431979
20668 2431979 2361150 2132131 2269962 2216942 2139368 1989659 1895069 2107144 1727655 1877748
20658 1877748 1817422 1645592 1731895 1788613 1974324 1883216 1690682 1964084 2142975 2076998
20648 2076998 2376185 2268134 2578789 2412076 2336246 2318068 2661151 2402614 2378309 2509799
20638 2509799 2062555 2105296 2195808 1936499 1827086 1821756 1705306 1865399 1898579 1971386
20628 1971386 1433117 1686063 1609025 1725751 1653433 1751293 1885610 1998846 1812043 1863490
20618 1863490 1864486 1948177 1897610 1916904 1885516 1849911 2242139 2114640 2038602 2042214 2048428 2207938
20606 2207938 1817939 1653379 1755639 1794784 1682465 1419935 1400169 1620604 1383083 1710729
20596 1710729 1495709 1583012 1506618 1547273 1615891 1318876 1536859 1784586 1427540 1605363
20586 1605363 1709234 1635625 1749114 1788013 1483299 1731905 1768792 1783061 1660146 1271831
20576 1271831 1401443 1307432 1427059 1571486 1377945 1556698 1547548 1641714 1612573 1534949
20566 1534949 1486044 1337971 1474698 1560729 1544136 1439091 1332259 1586171 1532669 1290967
20556 1290967 1519086 1688874 1598234 1803288 1682230 1561804 1489403 1792078 1546860 1791605
20546 1791605 1668219 1708821 1496379 1700861 1497396 1701595 1545858 1474187 1602214 1662273
20536 1662273 1954399 1870978 1731477 1976852 1959046 1941734 2005941 2108192 1794582 2010450
20526 2010450 2169815 1971630 2174618 1982830 2006004 2118708 1985260 1768086 1429793 1481513
20516 1481513 1560329 1379557 1597351 1493446 1523975 1501758 1620403 1472443 1246867 1680005
20506 1680005 1485060 1545796 1690648 1648081 1678436 1764137 1888838 1974552 2067833 1776052
20496 1776052 1958150 1890642 1815880 1795122 1678644 1712672 1673811 1495745 1556398 1474125 1503151
20485 1503151 1437210 1617263 1449706 1339373 1592359 1387416 1623464 1342805 1648779 1566084
20475 1566084 1489019 1692985 1542246 1648124 1613898 1910438 1685607 1907913 1822377 1884183
20465 1884183 2047034 1630216 1894855 1925897 1769789 1577941 1709713 1693406 1712315 1710963
20455 1710963 1789289 1687265 1871224 1576379 1777050 1889658 1608018 1941853 1810629 1766093
20445 1766093 1828022 1742078 1667863 1920892 1673708 1706858 1668443 1654279 1540770 1862678
20435 1862678 1291020 1644171 1647602 1635028 1438439 1630100 1589288 1419155 1582283 1477468
20425 1477468 1413312 1448174 1388869 1617248 1628102 1657628 1448744 1540142 1655177 1444385
20415 1444385 1695227 1743352 1586219 1766112 1765050 1740983 1751934 1935499 1763468 1832052
20405 1832052 1698359 1868729 1505842 1766005 1735519 1584799 1711471 1741238 1705793 1630506
20395 1630506 1835980 1627577 1761708 1693145 1890513 1711072 1552544 1949830 1751378 2148961
20385 2148961 1998367 1791058 1786778 1886253 2079839 2094071 2011187 1931276 2033862 1982874 1909659
20374 1909659 1804862 1897277 1711930 1639378 1756440 1613572 1519074 1672212 1651664 1576343
20364 1576343 1644820 1477371 1660298 1718103 1648752 1724394 1667610 1710837 1671995 1749126 1827720
20353 1827720 1833413 2061655 2110039 2102777 1989827 1844945 1876938 1741580 1895029 1710388
20343 1710388 2013923 2044377 2166699 2045076 1851955 1862000 1946161 1910451 1849721 1876122
20333 1876122 1955651 1942208 1784954 1664440 1755140 1819295 1430037 1598578 1776482 1721044
20323 1721044 1784217 1800275 1525498 2095520 1829499 1754962 1841507 1964508 1890331 2019576
20313 2019576 1703836 1962807 2257795 2046203 2357074 2558203 2297224 2764593 2793216 2683866
20303 2683866 2617760 2627649 2841583 2867844 2865514 2965257 3049786 2895930 2729811 3052753 2813740
20292 2813740 2878416 2623065 2701387 2767121 2676367 2817743 2214715 2468995 2354290 2392599
20282 2392599 2323194 2189894 2231646 1819224 2353266 2414333 2269546 2356594 2202554 2124766
20272 2124766 2407892 2366483 2410328 2432504 2657911 2450434 2559540 2546430 2699536 2653014
20262 2653014 2893083 2914527 2864836 2911682 3073467 3298706 3788026 4176599 4650824 5132102
20252 5132102 5822698 6494749 7352153 8123997 8503536 9038044 9466513 10133051 10347070
20243 10347070 10429711 10513407 10230798 9875458 9422358 9072927 8444962 7606118 6959388 6381834
20233 6381834 5436198 4925108 4315118 3905938 3586645 3300174 3095470 3034523 3226174 2788481
20223 2788481 2812018 2769572 2764689 2473622 2493448 2643628 2802751 2581384 2601122 2526635 2653404
20212 2653404 2877351 2752736 2644106 2881699 2733551 2634563 2772189 2682842 2830096 2803646
20202 2803646 2986386 2954598 3182218 3044233 3385993 3347649 3676057 3995519 4615573 5140062
20192 5140062 5984315 6566195 7542467 8635091 9209557 10030359 10668055 11258799 11611823
20183 11611823 12104007 12781628 12497595 12748086 12468734 12113397 11763138 11103772 10318564
20174 10318564 9510629 8773908 7939844 7027352 6369634 5914833 5525846 4954707 5027237
20165 5027237 4922279 4857804 4927837 5261766 5205191 5607104 5867414 6306139 6752828 7189380
20155 7189380 7941235 8700420 9466805 10522190 11853259 13762066 15773778 17620161 19696768
20146 19696768 22024050 24541623 27006200 29020207 31189635 32839768 34685556 36130934
20138 36130934 36705554 37417567 37074923 36740144 35709500 34400158 32451854 30438344 28182744
20129 28182744 25694368 22912206 20354536 17894276 15823954 13767285 12474470 10806212
20121 10806212 9613838 8866241 8138400 7792672 7079083 6862413 6739651 6440050 6535460
20112 6535460 6621836 6579156 6928459 7188439 7314388 7841479 8074850 8091343 8724405 9017902
20102 9017902 9692642 10035968 10303539 10145313 10612585 10519961 10602618 10503015 10269680 9895146
20092 9895146 9808422 9135961 8762678 8227255 8068275 7494594 6806870 6650776 6289978 5676257
20082 5676257 5549818 5025756 4892048 4684649 4633790 4355152 4758860 4610723 4960475 5031487
20072 5031487 5345600 5794236 6203698 6659746 7339049 8202943 9023956 9334056 10342119
20063 10342119 11086437 11970698 13242644 14247155 15258525 16533483 17351356 18381217
20055 18381217 19275392 20093129 20526443 20663193 20893423 20462880 20243577 19503655 18634065
20046 18634065 17862249 16836739 16180565 15239750 14099391 12836148 11626406 10872401 9724061
20037 9724061 9155912 8514995 8273088 7895917 8164587 8074859 8337266 8636316 9411845 10258149
20027 10258149 11357423 12564646 14135770 15711921 17047606 18542584 19622114 20397646
20019 20397646 21395994 21834859 22026294 21782174 21628860 20982254 19877188 19136074 18019075
20010 18019075 16695162 15064131 13600407 12014969 10594880 9146303 7910360 7200486
20002 7200486 6225009 5461136 4987785 4510111 4420222 3975690 3700325 3673064 3393404 3228724
19992 3228724 3097023 3153649 3070854 2678021 2763689 2509098 2702136 2540614 2229188 2473932
19982 2473932 2252409 2312757 2291994 2410072 2140845 2272138 2486691 2332774 2175819 2135075
19972 2135075 2154970 2356409 2219315 2130753 2239716 2101614 2159902 2068368 2184921 2011236
19962 2011236 2267012 2047389 2070369 2058676 2062903 1969325 2306205 2003484 2006810 2011075 2130220
19951 2130220 2325142 1944576 1885186 2033797 2269049 1884308 2056958 2067828 2318115 2242819
19941 2242819 2143177 2136345 2082906 2116002 2169758 2298443 2163680 2039121 2133406 2296809 2191181
19930 2191181 2287983 2486923 2227311 1998432 2168665 2291394 2320296 2166540 2223776 2245816
19920 2245816 2339851 2485647 2316874 2084834 2093890 2161994 1971996 2276307 2095209 2190260
19910 2190260 2029802 2236939 2307475 2008026 2516885 2277535 2135081 2405489 2217559 2500227
19900 2500227 2242782 2479336 2370623 2505131 2742225 2615674 2458625 2601656 2532209 2490335
19890 2490335 2533836 2617481 2495015 2481254 2680214 2736847 2689945 2394214 2882743 2666725
19880 2666725 2683921 2811230 3048601 2817383 2988712 2920807 3134144 3031122 3344345 3193264
19870 3193264 3426045 3291434 3334732 3279518 3114015 3415672 3339327 3430418 3390022 3377092
19860 3377092 3265867 3653288 3498862 3442388 3600227 3675346 3669966 3565374 3585328 3868982
19850 3868982 3768301 3916925 3954904 3911370 4370976 4196656 4597898 4795392 4934190 5175426
19840 5175426 5565195 5738119 6007393 6495282 6869848 7508702 8508446 9245124 10425057
19831 10425057 11546161 12278597 13359907 14050388 14857996 15566793 16159016 16601225 17243457
19822 17243457 18130358 19036969 20238436 21761741 23399594 25314281 26905568 28236124
19814 28236124 29143684 29941440 30213292 29937548 29304762 27915035 26464798 24320850 23061300
19805 23061300 21084460 19411656 18279419 17102996 16247225 15946336 15589616 15753181 15557119
19796 15557119 15849470 16188038 16072825 16139122 15904627 15891871 16101764 16403588 17139814 17906793
19786 17906793 19044603 20065110 21436158 22548716 23100578 23618765 24209328 23881765 23659964
19777 23659964 22673003 21464311 19708308 18270093 16749552 14941068 13537132 12101175
19769 12101175 10724398 9665787 8506699 7690125 7152161 6503071 6103816 5637298 5365334
19760 5365334 4961829 4797149 4689497 4493854 4318915 4396612 4239574 4088029 4056512 3838770
19750 3838770 3888429 3697492 3568587 3677167 3477264 3512884 3503794 3441979 3388526 3423751 3105056
19739 3105056 3033317 3210783 2927367 3256882 3143089 3119354 3052048 3333676 3271975 3114739
19729 3114739 3419604 3236209 3016886 3160400 3078516 3425483 3366895 3006297 3321619 2914698
19719 2914698 3136809 2964965 3110285 3132014 2971100 3097663 3184110 2873592 3193193 3020739
19709 3020739 3108067 2851644 3106558 2920769 2850217 2836180 2737937 3089379 3062435 2961230
19699 2961230 2923250 2744158 3006049 2861681 2887538 3051211 2804987 2743131 3003998 2953217
19689 2953217 2887632 2858422 2777323 2703317 2675594 2744149 2670051 2752194 2711478 2563815 2581723
19678 2581723 2677523 2665754 2573825 2546829 2605515 2327173 2406289 2685092 2608445 2314499 2423954
19667 2423954 2314275 2367977 2517661 2483289 2252269 2295512 2350080 2355412 2295785 2200541 2432057
19656 2432057 2382250 2083541 2277535 2158599 2282991 2275761 2341568 2346185 2139259 2267397
19646 2267397 2224312 2228162 2301840 2348114 2266577 2199841 2139781 2292011 2007815 2395925 2221500
19635 2221500 2314931 2048334 2374671 2342219 2348460 2210421 2186717 2189646 2140520 2202604 2098650
19624 2098650 2139537 2086301 2005898 1953687 2070922 1990467 2127479 1958843 1865408 2085015
19614 2085015 2063649 1918248 1946715 2099271 2027827 2045329 1966116 2084638 1763969 1961537
19604 1961537 1844857 1929979 1989654 1893365 2000239 2061331 1735095 1847624 1861222 2113326
19594 2113326 2017176 2079336 2013552 1854416 2032086 1959122 1974408 2003253 2151695 1931324
19584 1931324 2101631 1987454 2314983 2229768 2120087 1912840 2066246 2198374 2073492 2117669
19574 2117669 2117765 2339828 2256081 1979330 2369079 2117905 2204069 1982255 2194342 2033751
19564 2033751 2089402 2060710 2288900 2273722 2134931 2140451 2103944 2242448 2233152 1993295 2297241
19553 2297241 2012790 2000120 2079913 1871273 2084732 2086118 1826278 1881416 1921283 1935806 1868840
19542 1868840 1655962 1795483 2017231 1849222 1827229 1960745 1662140 1890019 1647036 1946904
19532 1946904 1660944 1876258 1741809 1598088 1668614 1651963 1667651 1819185 1687895 1578592
19522 1578592 1775417 1686665 1527868 1571518 1828338 1763776 1777242 1673006 1825016 1714518
19512 1714518 1731821 1677811 1844634 1613367 1671694 1810098 1833895 1915834 1785702 1829203
19502 1829203 1923177 1823642 1865470 1665676 1760989 1847878 1726655 1849098 1758103 1919730
19492 1919730 1838093 1918388 1811578 1580841 1408732 1738952 1437141 1732256 1746560 1408996
19482 1408996 1644359 1618975 1482442 1568059 1402998 1521986 1337647 1416022 1432516 1376590
19472 1376590 1389763 1339821 1157250 1413904 1474919 1396842 1088186 1414273 1488860 1346695
19462 1346695 1220021 1453797 1346051 1332474 1398821 1547450 1249151 988699 1194746 1277856
19452 1277856 1232864 1313471 1178753 1097963 1223837 1014562 1248568 1191050 1138954 955721
19442 955721 1121294 1033426 951797 1058035 1111775 960274 1331318 1095517 1100744 1184198 1037037
19431 1037037 1379359 892743 992837 701638 1097898 980641 1140855 817739 1200351
19422 1200351 1104753 1017903 1116515 1055280 890331 1085501 965605 1069903 857243 910523
19412 910523 872067 1131276 1154292 933182 1073427 910173 918446 889458 846097 905793 847580
19401 847580 974623 1064872 889495 854714 1032230 978798 969560 940791 916097 1158912 584619
19390 584619 906037 941808 803225 834532 836398 658772 960806 835283 999940 901810
19380 901810 837437 751580 904916 891824 1114210 1015039 901598 831594 960948 1000180 885904
19369 885904 1003618 818616 909443 903659 960091 869796 1020549 776886 745968 734498 1095390
19358 1095390 948698 921363 1089156 941358 868146 551630 908572 887924 770857 869355
19348 869355 713202 927269 859978 756303 552930 724657 891728 1036850 664040 860963
19338 860963 841761 932481 767574 991160 813808 924809 820686 708246 857222 1017173
19328 1017173 689326 742584 731294 996790 730361 876381 699554 967478 912608 971981
19318 971981 664524 819892 957999 986058 781251 733339 726648 793882 842063 767308 804061
19307 804061 859448 975691 963364 897479 833395 822401 992449 678805 937730 876612 964422
19296 964422 822040 1082051 677860 886563 871530 792121 798094 832688 629628 843880
19286 843880 767021 903502 983711 878774 856172 996831 869092 902500 1005901 851438
19276 851438 912406 780626 891908 1032244 858102 763995 755503 891113 1025705 794939
19266 794939 817981 868406 937573 830028 798520 807008 723347 759929 946828 998129 828513
19255 828513 774579 665910 795952 864592 731567 786242 752308 769101 803559 751070 907439
19244 907439 834054 1065307 1260669 1476102 1513628 1407287 1521554 1327281 1367255 1328619
19234 1328619 1275491 1229666 742224 884741 744974 608982 633729 691508 694187 908780
19224 908780 845400 802175 602717 830202 663818 625331 630046 697240 722244 798284 631780
19213 631780 969339 705653 795314 910339 926938 754811 668459 789558 576779 598004
19203 598004 871970 985646 718514 598483 596221 680187 578430 626274 760780 596583
19193 596583 535149 661194 846779 651893 917275 891530 780775 423823 726862 670018
19183 670018 722988 679174 767079 566791 627269 957979 569107 773138 860541 720756
19173 720756 552480 852694 867161 674270 780706 1047819 817846 636122 644793 785164
19163 785164 835830 745610 819593 803325 716782 846077 667961 769403 483997 484354 620511
19152 620511 944842 800743 1053807 743406 815969 741999 695566 997317 1177368 1018889
19142 1018889 1142430 900395 951261 1135040 1561232 1487773 1564101 1612601 1709607 1621572
19132 1621572 1619196 1418586 1439750 1500939 1093741 1327800 1435756 1419524 1338661 1422482 1243048
19121 1243048 1368461 1221027 1364952 1130516 967344 1078690 1199941 966992 1117514
19112 1117514 1062911 1208164 1065591 886469 1024541 1163144 1284171 1151043 1055631 1084194
19102 1084194 941078 1041250 1340094 1183263 1382674 1325487 1449431 1257330 1336316 1328562
19092 1328562 1416857 1113146 1438710 1363270 1326621 1259384 1254127 1421201 1214375 1354916
19082 1354916 1178064 1396400 1429036 1530478 1712200 2040319 2357181 2226915 2784296 3019090
19072 3019090 3623476 4238176 4711270 5283138 5605318 5790257 5894705 5560730 5713224
19063 5713224 5315368 4788223 4469458 3699671 3168309 2796806 2659509 2320177 2006803
19054 2006803 2010977 2151202 2546294 2862956 3251426 3805581 4199874 4762255 4876739 4949351
19044 4949351 5039312 4519954 4657722 4273952 3808571 3351941 2874588 2860946 2545767 2489361
19034 2489361 2247466 2410931 2513336 2687135 2710328 3249499 3547202 4484341 5050627 6110281
19024 6110281 6423131 7063329 7205081 7289852 7052921 6732248 6215315 5618740 4982780 4190062
19014 4190062 3671988 3355262 2999358 2956333 2836827 2994005 3583755 4244995 4544621 5013477
19004 5013477 5474036 5428759 5407181 5102072 5151362 4694606 4193532 3726222 3098400 2577065
18994 2577065 2451636 2230426 2218688 2321151 2376610 2419260 2704148 3073449 3844929 4045401
18984 4045401 4705078 5053449 5141463 5023280 5474475 5040226 4854411 4512203 4072618 3716504
18974 3716504 3697742 3301892 3358763 3320949 3576386 3748858 3995244 4642872 5222974 5815347
18964 5815347 6592718 7790021 9290685 10627935 12159819 14031538 15797333 17985948
18956 17985948 20362514 22585058 24549492 25775091 26681130 26768701 26309163 25355215 23846116
18947 23846116 21528537 18881817 16356723 13817456 11535329 9587859 8238978 6699254
18939 6699254 5826984 5121259 4598687 3980365 3614592 3341490 3319644 2847787 2511847 2407785
18929 2407785 2404464 2113603 2055379 2165164 2163203 1972499 2229456 1900477 2162927 2172720 1935843
18918 1935843 1978421 1931110 2025488 1942701 2202797 2271456 1995273 2451654 2358455 2183574
18908 2183574 2398076 2642277 2506709 2846012 2858003 3287059 3519336 3733761 4292542 4730725
18898 4730725 5400192 6571672 7181729 8956456 10632893 12834174 15368950 17679031
18890 17679031 19834567 21478626 22607320 23393043 22806692 22009893 20493821 18436902
18882 18436902 16277723 13558445 11505367 9557197 7939359 6355358 5586363 4926983
18874 4926983 3988437 3499758 3035304 2832080 2475217 2193905 2356082 1783332 1651182
18865 1651182 1582095 1778449 1279155 1665071 1434445 1091016 1101523 1243766 1253418 1195244
18855 1195244 1080950 1159017 1230875 1115736 1068098 1144984 925046 1112715 1098405 1032144
18845 1032144 860817 1062321 1091995 950483 930239 1026741 1055810 1160185 972803 905293
18835 905293 789557 803517 814955 606282 713048 815927 880661 858588 865082 967092 1088113
18824 1088113 679982 727147 584935 640265 867930 960727 614701 745505 856144 698354
18814 698354 790463 925823 738769 931351 671241 747611 1095173 734396 795202 755348
18804 755348 737478 767967 557827 896739 749071 807295 744407 714751 1072384 834458
18794 834458 866186 789997 1141626 747034 852482 911809 712338 889654 767860 1087335
18784 1087335 875395 791631 1086628 1230612 928172 1057004 852979 852314 937351 980384
18774 980384 832458 802208 815280 1227737 828187 977979 988052 989100 1011074 856167 1054445
18763 1054445 1203586 849209 852982 1013324 739163 1028755 789378 945851 873724 716161
18753 716161 580754 655861 665628 810250 566059 801168 573293 1063550 966546 586314
18743 586314 624369 672617 732593 532824 991961 495356 666249 625135 578413 531350 594253
18732 594253 753817 810437 791334 749112 724806 535577 869202 870246 625405 855266 812806
18721 812806 546864 740634 640028 851927 787212 906595 631380 851420 960840 848303
18711 848303 975629 814829 924944 972446 947113 916196 965020 1085186 789940 1184074
18701 1184074 973886 761128 723043 691551 986137 794092 1123998 561785 825482 840742
18691 840742 932634 892595 508809 646940 690044 759649 498135 645016 550156 540566 825591
18680 825591 580116 597918 553875 590034 723018 766330 707591 632750 632619 862290 523140
18669 523140 432559 615856 806024 451103 564018 759072 539154 663129 444287 620847
18659 620847 559928 788143 770598 675328 625721 480030 696751 498734 486797 619517
18649 619517 704002 540464 789431 730211 594467 637770 570075 645059 326186 858288
18639 858288 622130 558525 621724 761069 713431 775726 624722 806148 730381 447771
18629 447771 811955 918240 773356 748926 876828 688775 724849 501630 638518 983709
18619 983709 486828 708810 550790 847183 402826 697277 536210 399617 704566 603787
18609 603787 658566 575922 631588 503852 439452 539891 840842 1034462 964053 842780
18599 842780 656331 662817 625335 639117 810367 811848 755727 408240 627752 726932 547189
18588 547189 645405 694540 650081 803030 627264 427247 735080 656891 684312 725260 764242
18577 764242 637051 536705 762535 630700 755617 827498 697183 534378 824364 824559
18567 824559 654573 630171 770763 645413 567963 489021 697905 781776 591939 786127
18557 786127 711371 734397 680042 768947 582468 604957 816954 476637 743793 283322
18546 411947 855978 403366 474537 405870 342346 580848 538358 502533 506610 545702 373231
18535 373231 638967 639230 563750 429882 573286 436712 587946 731216 597903 616381
18525 616381 416920 386987 375286 596914 439472 317135 664683 410330 408267 488042
18515 488042 352888 698429 761718 782295 589184 752813 642012 577989 443915 646407
18505 646407 381679 494160 481586 408494 521152 427422 434366 338149 113741 631181 366372
18494 366372 409812 475694 532950 669643 679420 582308 579633 500453 440307 695198 649996
18483 649996 456958 516398 448891 595337 441679 505217 515394 202838 432970 621356
18473 621356 485492 648468 582950 545818 487606 451159 339665 479637 562333 400651
18463 400651 347730 517023 679737 489758 546421 694856 556033 491884 690553 735287
18453 735287 588596 616166 433747 606366 612941 645301 628321 532741 613283 524119 617387
18442 617387 175216 699657 422979 575642 425022 416993 526269 807233 556698 734415
18432 734415 737800 683112 628344 548153 589528 462288 385246 732097 777899 568090 759407
18421 759407 505293 553490 619254 487601 560636 750199 486144 394526 748279 502786
18411 502786 471893 601914 509845 659783 622445 378269 474477 413483 693934 479566
18401 479566 634679 648653 772126 805384 647361 411479 600910 363938 437452 491123
18391 491123 320378 876317 476040 361237 434924 198563 411457 356962 438650 532706
18381 532706 514530 512204 654357 513732 464390 338239 479000 526316 721049 382831
18371 382831 690373 525902 388893 550099 375260 637140 484578 539802 557251 922642
18361 922642 715120 471584 541365 334834 391959 587415 452378 557747 694620 399292
18351 399292 363247 628605 602092 302787 407951 524613 351875 893188 666892 585174
18341 585174 575543 554030 449162 466806 437714 541724 501420 372789 573584 531054 240324
18329 371008 383939 380660 708935 433429 574390 471488 538777 624144 608410 619584 450558
18318 450558 488957 697838 692157 391742 390220 679029 525152 390110 384427 520300 517300
18307 517300 548432 515995 796898 606468 706641 683608 470605 562827 377519 655112
18297 655112 522056 634868 594651 638927 867133 620214 763434 520767 706666 616643
18287 616643 729745 791678 482291 624517 255867 428511 640163 486868 431283 313565
18277 313565 564158 385092 381282 294933 629930 591938 487031 531129 443992 605151 453005
18266 453005 697834 490738 447704 621108 492469 550644 288614 413545 561275 516586
18256 516586 592046 507135 591131 720245 548852 770627 346594 473595 706821 695135
18246 695135 607672 878634 583028 620403 330147 522990 616636 542892 527099 344989
18236 344989 560590 433167 649333 460215 296073 560882 434850 489290 566854 308932
18226 308932 299721 513660 638112 645428 431972 463745 523723 342721 415631 341374 476875
18215 476875 650095 578468 540021 749899 657861 643632 414358 496305 411442 381925 625148
18204 625148 623776 468066 318873 423258 603243 662395 443362 587820 596474 434583
18194 434583 325756 459101 387302 245092 713408 459688 501138 582643 658022 672559
18184 672559 488636 428409 520591 334887 430695 639195 234167 389697 640990 456605
18174 456605 455201 485013 707302 539618 747749 595731 510615 622219 543241 463637 321032
18163 321032 525215 587133 397980 509944 567316 538607 445690 695043 378122 487933
18153 487933 556281 357027 460637 341336 569648 509870 433447 380515 567370 392691
18143 392691 281543 503362 342129 484429 368268 547077 338506 312232 520540 575428
18133 575428 353082 362233 573157 475147 394190 244632 353505 265227 546362 555257 439982
18122 439982 480548 507261 668721 375966 569326 536963 537957 423280 459473 463100 583736
18111 583736 431001 301635 518763 591901 545805 938325 563873 540804 612238 491467
18101 491467 535876 445042 646591 738774 652726 547330 601355 659242 382097 589403 524628
18090 524628 213495 626838 617500 457011 639629 358559 434279 664676 350565 378912
18080 378912 541885 662437 608620 382143 632743 315457 600781 340855 363852 417311
18070 417311 446119 583603 568475 429340 337758 452954 234102 254912 262685 438670 548152
18059 548152 433059 433888 542160 594142 408522 698032 453423 327865 598074 748823
18049 748823 494086 653775 489945 480656 247433 670314 454344 477171 469735 351118
18039 351118 386032 347586 391802 328491 447299 559462 372623 328314 716760 402448
18029 402448 620645 684653 375592 531216 385515 494992 560646 705630 470269 435555
18019 435555 535604 468343 475396 615630 390913 460516 335891 214503 570589 628787
18009 628787 510458 450104 585345 379985 516031 657739 330098 512816 624238 464322
17999 464322 613192 419086 539048 746729 337739 338186 443821 491623 568012 561935 533887
17988 533887 359329 484130 553744 462655 426410 498580 460160 359280 456091 565761 651019
17977 651019 571785 547128 394649 420943 450110 352080 441189 521680 520105 396132 426198
17966 426198 516046 436689 561546 576203 248500 454584 356915 709969 512604 300030
17956 300030 593008 552560 642045 456895 614293 233032 618648 664846 551536 460864
17946 460864 633252 652149 648735 463492 518587 464565 838370 565783 568058 661318 585045
17935 585045 595643 704467 595413 839290 621650 547399 590877 547992 787431 775019
17925 775019 828026 747616 794850 473122 335661 648895 468051 786035 661095 644169
17915 644169 837158 763088 968360 530540 798710 563322 1002419 745761 622462 1071643
17905 1071643 691517 768104 752455 744125 1007833 914444 993920 987552 929015 983064 845688
17894 845688 1046290 860634 1161309 761850 935564 740719 1029431 880893 832807 804037
17884 804037 1013782 832355 1085125 1025415 989107 1266702 973444 1034855 871328 1073956
17874 1073956 1066086 1005848 876075 831402 929456 986509 916372 1088559 812095 1008931 952281
17863 952281 896826 608594 1005453 1194792 943574 884832 753758 707296 661730 705145
17853 705145 874273 791642 985535 940299 697170 631526 723959 850644 569260 876866
17843 876866 803145 749167 797458 656711 811465 560621 708354 813949 694267 596106
17833 596106 999100 781468 841564 742973 634788 652740 635353 894998 837458 680909
17823 680909 713220 664004 615867 641355 1057732 763738 682133 699482 1004951 954747 1009908
17812 1009908 946178 1189028 858107 1107521 712423 1082078 800692 771845 841064 468530
17802 468530 745102 825147 832090 809613 1144201 784322 1127249 747299 882721 804248
17792 804248 1039717 899716 665709 813493 494546 674700 727195 778238 763769 722648
17782 722648 663108 496077 561749 648413 442480 666273 736486 503555 568861 461411
17772 461411 753471 881955 641214 747094 836639 753416 706521 656382 568674 488669 617796
17761 617796 605848 792519 627194 474618 743623 708927 649981 417988 525376 573191
17751 573191 441849 659327 684489 586343 645553 589846 484163 606703 647550 618214 747601
17740 747601 634077 619070 696031 774660 538827 765836 566840 672918 443975 623879
17730 623879 775080 759185 776052 454222 555555 518484 477872 520545 680635 696789 492122
17719 492122 436127 694444 737069 754595 451375 549850 622510 686148 633489 425820 859783
17708 859783 552110 576175 506517 825569 715960 458434 625068 793534 537316 566009
17698 566009 510336 659063 490179 630494 611101 688397 643581 597958 535943 477342 741233
17687 741233 502741 636080 619985 526091 597049 550989 662053 816023 764286 694527 731572
17676 731572 683905 592121 726144 693590 592516 721009 690767 917464 755428 723889
17666 723889 615785 714066 537489 857121 591836 851787 794665 675374 700550 780532
17656 780532 739769 771801 753391 678179 564015 756245 822353 866842 805657 686528 977652
17645 977652 803542 805240 1029700 897159 856203 1001232 748311 896421 1121185 926546
17635 926546 1054432 1101163 929371 1130372 1088468 918895 1120834 886441 1176719 1056904
17625 1056904 1139280 846425 982750 1177294 1376938 1211284 1359702 1374633 1059539 1131596
17615 1131596 1300379 1153066 1330476 1392701 1374281 1485549 1337677 1424592 1373268 1541402
17605 1541402 1235916 1410593 1589553 1107632 1361802 1449196 1449743 1374973 1387810 1852521
17595 1852521 1421936 1384415 1372235 1606080 1605030 1400070 1390279 1436880 1392431 1487672 1387207
17584 1387207 1331573 1382237 1365965 1349821 1148667 1342061 1420764 1367231 1384121 1298016 1157431
17573 1157431 1195285 1190116 1279975 1232401 1129573 1245037 1178403 1227834 1260882 1104663 1084478
17562 1084478 1209774 1256704 1392704 1209109 1045340 1276511 1184100 1099320 1036079 988963
17552 988963 1087986 1086552 1215006 1255447 1135543 924952 1254918 1119376 1095658 1051747 1224984
17541 1224984 1265203 1287024 1063192 1327561 1125856 1201748 1189124 1157725 963591 1250355
17531 1250355 1086135 1215308 1298358 1358268 1179041 1332106 1259169 1248357 1183387 1347853
17521 1347853 1211030 1381839 1495243 1266432 1647152 1336472 1490177 1397092 1598126 1550373
17511 1550373 1447526 1991636 1804544 1799869 1903806 2254099 1972755 1907962 2207540 2055819
17501 2055819 2222172 2028576 2101698 2476083 2157984 2571196 2722644 2927223 3203651 3632583
17491 3632583 3938056 4479413 4924791 6183107 8081848 11445262 16461597 24189887 33585783
17482 33585783 43208179 51110960 56441380 59796469 60806723 59466242 56266896 50492550
17474 50492550 43309775 35253638 28625870 24782313 24485124 28699251 35811148 44082098
17466 44082098 51832103 57608539 60594053 61660596 60822612 57427445 51822351 44082756
17458 44082756 35440510 26451273 18994831 13233913 9683810 7438385 6219339 5221565
17450 5221565 4537284 4169522 3871282 3440963 3271042 3467567 3738055 3778294 4048322 3916398
17440 3916398 3869503 3988591 3701266 3607837 3540543 3173363 3195245 3114657 3185286 2890658
17430 2890658 3174071 3176739 3524564 3396930 3639167 3606083 3245755 2954516 2862333 2761587
17420 2761587 2610123 2482131 2320201 2426288 2225849 2332202 2379609 2448850 2224601 2527304
17410 2527304 2202752 2199448 2270603 2638875 2313820 2448431 2634915 2876049 3340830 3403640
17400 3403640 3158481 3331950 3384454 3564576 3810385 3704675 4011638 4082897 4534253 4858761
17390 4858761 5243016 5815242 6143539 6874026 7172937 7304633 7850640 8159337 7765080
17381 7765080 7648962 7588431 7123574 7028300 6336269 6441576 6167478 6227411 6423966 6699912
17371 6699912 6849293 7500589 7652988 8383789 8432303 9126873 9236677 9068555 9266589 9344795
17361 9344795 9116426 8768401 8740043 8633427 8777407 8535097 8561422 8566347 8653331 9057504
17351 9057504 9423226 9884207 10710171 11261167 12110231 12877601 13468511 14080807 14645640
17342 14645640 14797266 14756210 15070490 14945637 14730540 14074547 13460641 13240236 12659130
17333 12659130 12462395 12408041 12727350 12979188 13106973 13831815 14238317 14381989 14984590
17324 14984590 15552236 15704048 15735427 15450292 15252316 15143940 14440184 13980422 13582242
17315 13582242 12849375 12500543 11548629 10990006 10649727 10428261 10272806 10221525 10264380 10778192
17305 10778192 10855945 11402221 12040620 12432146 12939739 13023408 12796553 12987386 12742224 12360348
17295 12360348 11945879 11473112 11206787 10409215 9782292 9682679 9281794 9128827 8924822
17286 8924822 9186911 9497995 9175987 9066552 9301830 8965137 8849615 8361716 8061077
17277 8061077 7375130 6897008 6558550 5864686 5277140 4965640 4755705 4386309 4030168
17268 4030168 4129043 3813460 3892807 3370521 3324823 3390883 3063444 3158566 3160452 2977050 2878156
17257 2878156 3049687 2642066 2774748 2606155 2546775 2751873 2644459 2477407 2552261 2487587
17247 2487587 2481376 2429118 2314658 2533720 2298013 2344411 2341578 2332998 2197298 2228109 2181437
17236 2181437 2214795 2124729 2230821 2154907 2219494 2146085 2268677 2146655 2176465 2289520
17226 2289520 2359920 2381770 2502337 2417286 2420991 2522116 2713084 2466947 2595825 2372694
17216 2372694 2372878 2606346 2202232 2764947 2704525 2526926 2491603 2261464 2272491 2541610
17206 2541610 2498203 2703712 2694625 2902933 2965556 2733692 2588058 2629050 2336061 2295676
17196 2295676 2149240 2415117 1975392 2092522 1999935 1936581 1907275 1847959 1864666 1826439
17186 1826439 1833529 1738183 1719536 1870949 1710673 1783023 1300063 1643472 1489053 1642210
17176 1642210 1626178 1458961 1622444 1410995 1609193 1634233 1600429 1537078 1576130 1709304
17166 1709304 1643720 1604457 1706105 1684025 1659854 1714046 1818604 1849429 1622684 1875758
17156 1875758 2147337 1893003 1943203 1942657 2081660 1986206 2127156 1851670 1956497 1789744
17146 1789744 1830870 1617506 1645530 1906670 1986185 1845504 1942192 1986134 2020940 2157676
17136 2157676 2210788 1895691 1877508 2068136 1947795 2029968 2166002 1886717 1821722 1797568
17126 1797568 1897114 1716200 1973562 1966962 2169086 1926955 1937044 1984793 1842045 1878391
17116 1878391 1790407 1620056 1586967 1822772 1929260 1785231 1561683 1538628 1686619 1866453
17106 1866453 1512629 1723503 1524139 1677304 1648719 1800185 1657731 1622019 1595749 1625580
17096 1625580 1699013 1538542 1428459 1371136 1383075 1144492 1162619 1479182 1197949 942357
17086 942357 1116918 1121387 1031200 1154340 1194915 1187156 1089772 1174191 1199172 1221736 1110203
17075 1110203 1054545 1292099 1296058 1074484 1262718 1148971 1286289 978458 1041779 1096229
17065 1096229 1055687 1244015 846487 1234102 1111498 1139157 1120170 1031382 1102128 1091274
17055 1091274 1164812 1257712 1191035 1364079 1377972 1284497 1374388 1477971 1285768 1346205 1568942
17044 1568942 1336225 1762259 1502092 1774277 1592321 1948016 1863595 1796758 1786593 1636160
17034 1636160 1764756 1661613 1616346 1552741 1498012 1618899 1555565 1559829 1499135 1236309 1235808
17023 1235808 1097563 1198284 1311843 1224569 1176128 1013755 1167328 1223687 1016574 1211228
17013 1211228 1138072 1159557 1281279 1057917 1016936 1078358 1166787 975638 1232550 1000032
17003 1000032 864050 1050972 1039362 1074714 772656 1081209 1203648 1048658 1148430 1058075
16993 1058075 1169648 982422 1058440 902719 988359 1131577 1283804 1071997 1250726 1218893
16983 1218893 1221008 1054858 1139016 991692 1400572 1442714 1144244 1219687 1270678 1539626
16973 1539626 1414794 1393861 1375272 1782879 1720514 1774446 1744225 1745596 2166588 2136538 2086201
16962 2086201 2379089 2308710 2168148 2221669 2630523 2675206 2454269 2964026 2650941 2617376
16952 2617376 2366394 2602889 2573562 2194902 2302097 2067318 2452863 2026563 2007552 1888369
16942 1888369 2050165 1632658 1583924 1467330 1268437 1609004 1747700 1445069 1341160 1391023
16932 1391023 995463 1239738 1245730 1178641 1040145 1273629 1156017 1195181 1153390 1326261
16922 1326261 1177702 1160401 1004052 892634 1276751 787287 1185332 950704 1132472 1170671
16912 1170671 1195447 1073936 879053 964471 900362 932266 944350 922152 945371 890985 825574
16901 825574 774503 918122 844048 876390 919138 1027544 712842 782121 832150 1158969 607693
16890 607693 870922 634291 883414 899361 1005202 571261 1016770 913352 754373 1042373
16880 1042373 910602 910907 821427 853845 873454 1082448 934920 754721 1026888 742539
16870 742539 1006999 832701 842102 862501 886149 836308 1073021 935672 793796 947376
16860 947376 895238 924425 982581 1166054 886473 1035705 886411 1099912 981943 1100215
16850 1100215 943126 824391 939776 936577 740239 1125977 859691 1073454 1008751 919148
16840 919148 932069 1149414 902446 1099770 1134723 854881 1149869 902838 1100776 1067455
16830 1067455 1106409 889796 1014455 1060041 1081032 979461 1036000 1276309 1111036 1140788
16820 1140788 988862 1355021 1291066 1038420 1464769 1589078 1491739 1417911 1112263 1303851
16810 1303851 1157877 1127531 1249336 1530988 1235144 1205794 1435089 1536861 1149494 1436204
16800 1436204 1448500 1282759 1427691 1084903 1315290 1333422 1165780 1114892 1286827 837819
16790 837819 726273 995328 1015391 1002815 783813 896000 752902 831086 782666 882122
16780 882122 943951 855031 709400 652623 831133 621489 800098 982244 715952 897073
16770 897073 976206 795087 874207 666342 873277 1041051 673626 843225 690257 940357
16760 940357 605706 755141 567050 1144400 743263 859566 823344 901546 778506 686101
16750 686101 531865 854577 778191 570954 787578 786409 862766 618424 597721 763043
16740 763043 695060 852578 737814 586889 596482 1005928 1015931 1013639 866784 953279 912023
16729 912023 872929 800109 1047708 1010506 847206 1146802 613984 932164 1120996 1075318
16719 1075318 1008978 1168020 956553 1059450 894545 974434 1095311 1106193 1282381 1093907
16709 1093907 1085213 1170858 1329532 1495463 1595897 1600640 1660869 1873102 1961798 2034007 1933636
16698 1933636 1964354 1754506 1673556 1690438 1790897 1727707 1915816 2125100 1836135 1928226
16688 1928226 1999353 2314034 1964307 1993088 2032162 1783716 1526034 1596565 1277688 1309223
16678 1309223 1650852 1380724 1091167 1417810 1218680 1242594 1212826 1551237 1415290 1698776
16668 1698776 1849044 1848437 2013285 1877897 2128231 1996120 2017706 2052780 1914252 1974850
16658 1974850 1897740 1950909 1697961 1897712 2009903 1915426 1917693 1796790 1868666 1653908
16648 1653908 1543209 1456351 1159619 1096238 1111713 881846 961832 864911 995093 638953
16638 638953 705721 800571 826737 667809 974309 922883 423012 686318 901475 747382
16628 747382 862545 941320 871466 719875 811704 962190 754188 1039614 1112840 911079
16618 911079 1022301 999131 761872 944501 812450 998613 1138474 851379 1054766 941761
16608 941761 961241 818674 820157 994572 1167630 877163 1005536 895042 1088679 851995
16598 851995 1011458 988419 993878 1065992 831872 976250 834391 1203280 1143205 938683
16588 938683 730470 1036685 887979 1250968 1078076 638713 937668 959574 939842 729266
16578 729266 696374 686624 763718 1008283 1001868 874067 919792 683146 1028445 924843 803771
16567 803771 949881 732505 948352 827059 1131087 932406 1038139 1208605 846578 1141776
16557 1141776 817439 909435 1173088 859443 766105 961511 857115 849745 1013727 882672
16547 882672 1055336 983991 920402 928447 872355 1123443 1082153 1031756 923410 846169 877723
16536 877723 950462 896669 881521 883078 1039987 786028 1046194 834130 982803 1012363 821485
16525 821485 969252 910380 856430 833311 741552 964555 820192 854240 941221 875746 998113
16514 998113 1059695 975331 1004479 957053 1129095 830487 904444 964438 1028730 981483 937428
16503 937428 1085464 1042100 927547 1005373 1183052 1155417 1026546 1495685 1395456 1566332
16493 1566332 1703802 1900257 1731255 1642948 1775467 1743115 1887822 1942791 1634702 1525340
16483 1525340 1377072 1371170 1284636 1307633 1199603 1328952 1202164 1392603 1546843 1526088
16473 1526088 1622944 1709581 1616669 1548924 1658708 1706104 1775955 1871988 1567636 1660904 1731952
16462 1731952 2123573 2022218 2027038 1896045 2161313 2327641 2449728 2675996 2703109 2867364
16452 2867364 2898599 3142166 3229293 3698441 3576528 3605599 3793136 3909886 3998172 4268738
16442 4268738 4298380 4644542 5027232 5529421 6044099 6598422 6948095 7784361 8163964 8770256
16432 8770256 9906628 10674235 11533223 12655565 13858754 15336736 16829844 18489433
16424 18489433 20431609 22499711 24284498 26425894 28596437 31183584 33949546 37068269
16416 37068269 40604750 44243259 48093194 51868761 56236455 60617656 65280403 69861651
16408 69861651 75258707 80780547 85509194 89887319 92642549 94219911 95018416 95378569
16400 95378569 94922225 93903128 91934549 89188422 85145612 80347301 74718668 70345580
16392 70345580 68005320 69699024 77202800 90428432 104814811 114559962 115686617 109178607
16384 109178607 98025112 84320385 70467515 56188571 37603286 12946841 -16740061
16376 -45528153 -63910421 -67932115 -60275280 -46539343 -33338978 -22847187 -15389144
16369 -15389144 -10164584 -6864970 -4651099 -2937587 -2194615 -1312882 -710435 -185959 406310
16359 783060 409784 615298 582947 602898 544859 275490 215952 258375 -114928 -213495 -228752
16348 -228752 -241868 -423431 -492825 -364406 -368853 -255120 -282321 -177054 -37090 17616 12548
16337 12548 391204 242243 245981 414475 261227 366636 161043 304073 134922 22485
16326 190618 44289 39995 -21286 -83170 -99105 -37799 -78457 3548 -20141 109259 -226823
16314 -38864 11793 45825 131566 109353 142396 68372 169611 537091 200265 522382 445015
16303 445015 626461 515846 402058 429940 411814 399781 271558 1559 19043 179889 50932
16291 215048 149445 122411 -50812 216998 98528 149732 260899 63450 351946 350823 203626
16280 203626 372335 224978 184041 339885 204701 202387 295992 461879 567079 677848
16270 677848 734153 705436 476469 416381 469031 360692 332384 328615 290436 216088 111459
16259 111459 46518 255506 285987 162978 118106 114190 191411 266601 333122 259079 426403
16248 426403 222511 332486 463312 248053 391916 348088 346499 340971 564274 604455 780530
16237 780530 812682 800914 273564 462567 441230 462766 689885 512032 436743 506871 561748
16226 561748 353256 336270 458800 377849 178276 380610 353869 500346 562998 443043
16216 443043 645203 331704 518759 583611 731238 666383 566194 588678 549062 664674
16206 664674 479881 612016 502682 468236 624974 487773 600111 625374 594421 663845
16196 663845 487703 474763 740221 528113 626041 713243 559199 504372 629404 744718
16186 744718 532127 632173 707317 652690 617494 674352 676537 753424 610266 674962 835140
16175 835140 658731 319264 588093 640105 728762 564406 545968 538456 860479 484172
16165 484172 672340 708748 714655 575293 787567 510589 719785 643739 618160 686658 780442
16154 780442 487140 738264 488775 505720 454691 994896 761423 666533 689987 784516
16144 784516 753910 902744 767942 793839 700794 756118 1208904 835273 1011748 798140
16134 798140 893780 758660 778447 844553 714913 981353 963467 738543 830935 828075 784140
16123 784140 876985 719266 913097 830152 817097 717056 1147767 1140101 808583 1034137
16113 1034137 1120361 826424 879300 762825 962740 862930 971479 819975 1041940 902912
16103 902912 848661 779264 939020 991360 1037614 789535 698786 919900 916556 1069543 987319
16092 987319 1052294 948767 915771 988544 1063189 877617 1089936 997563 918285 1093283 1064474
16081 1064474 954756 1230876 937583 1182212 1159277 863182 944293 1015851 1012705 819236
16071 819236 911342 1059082 1296500 1204562 1281654 1099266 1283422 1282755 1621410 1387187 1209452
16060 1209452 1002785 1317424 1376916 1498078 1370289 1241262 1352185 1401024 1380499 1186297
16050 1186297 1261473 1367337 1477846 1527256 1166322 1298172 1440781 1555495 1586970 1372587
16040 1372587 1643590 1704232 1431293 1617300 1544055 1598133 1661448 1719087 1552717 1829811
16030 1829811 1769444 1828971 1884485 1634365 1772140 1717559 1826864 1856024 1811790 1829616 1911177
16019 1911177 1843557 1764523 1843408 1820174 1947574 2091462 2143499 1980658 2005631 1694553
16009 1694553 1899857 2025567 2067655 1804370 1977686 1801915 1987964 2179797 2095016 1977791
15999 1977791 1992102 2185156 1944838 2042325 1924847 2047754 1870758 2033685 1758881 2011483
15989 2011483 2176144 1770647 1947696 2039656 1867269 2114493 2164879 2297997 2073946 2278071
15979 2278071 2303566 2115373 2391163 2239158 2123665 2053549 2132998 2307956 2273707 2224395
15969 2224395 2113405 2280394 2203154 1974676 2128720 2026819 1847430 2073949 2356886 2165385
15959 2165385 1952181 2193007 2089154 2296932 2122797 1981311 2232545 1994899 1905440 2027995
15949 2027995 1927683 1875903 2157984 2144411 2140294 2195457 2020026 2211249 2045712 2294778
15939 2294778 2204295 2432330 2247237 2154864 2214232 2404824 2210628 2336553 2584806 2691224
15929 2691224 2515010 2617060 2606861 2505899 2803150 2791254 2864512 2763177 3096943 3203244
15919 3203244 3175424 3370293 3617754 3522631 3902629 4131678 4330739 4571674 5091837 5365303
15909 5365303 6567669 7746364 9192833 11594370 15021972 19758414 26615079 34581276
15901 34581276 43436090 52015798 58601497 64135399 66629095 66503527 64041901 59244190
15893 59244190 52601835 44818855 36093639 28406158 21680669 16500102 12792537 10283194
15885 10283194 8103470 7023208 5703561 4867453 4420485 3859539 3775096 3354546 3017360
15876 3017360 3021755 2979621 2876758 2968997 2855984 2991313 2694396 2710291 2728858 2458749
15866 2458749 2432867 2392838 2549373 2381286 2391794 2205206 2293991 2182404 1971474 2348788
15856 2348788 2014231 2043608 2270315 2139328 2103369 1995187 1863694 2048322 2354560 1930846
15846 1930846 1906045 1835566 1831565 2038458 2211884 1939999 2016988 2178778 2291238 2273177
15836 2273177 2230249 2477776 2351402 2254359 2224348 2333288 2436799 2288858 2167905 2275329
15826 2275329 2250615 2339211 2169504 2223867 2080092 2181267 2122723 2110371 2184681 1999898
15816 1999898 1893974 2243314 2103136 2268553 2252994 2359601 2398386 2293944 2598721 2355426
15806 2355426 2530555 2222455 2420641 2522822 2435780 2400200 2642046 2672650 2904616 2839374
15796 2839374 3157559 3204513 3424184 3507882 3674682 3655873 3541636 3765036 3703003 3813498
15786 3813498 3672011 3961872 4104725 4125088 4289874 4580374 4990213 4871211 5278018 4963725
15776 4963725 4972247 5127061 5217089 5120388 4857047 5024033 5150162 4974355 5102258 5192729
15766 5192729 5181717 5199866 5357166 5446395 5261967 5452482 5457950 5311046 5320851 5035401 5187246
15755 5187246 5164293 4998862 4833695 4924649 4903731 5013409 4932021 5001860 5188472 4964057
15745 4964057 5239016 5786451 5838798 5885846 6224713 6607107 6610875 6905255 6875878 7044045
15735 7044045 6729658 6901838 6934925 6666738 6971642 7348715 7291415 7150209 7448471 7263934
15725 7263934 7463920 7366493 6992462 6857786 6414948 6560519 6646152 6293268 6480490 6640104
15715 6640104 6355389 6498108 6391709 6176248 5918022 5893653 5809421 5887565 5936255 5718718
15705 5718718 6192222 6286841 6707363 6631359 7025332 7157430 7254257 7183810 7109012 7251645
15695 7251645 7396169 7390400 7015642 7226980 6614541 6752641 7016276 6633668 6610236 6591892
15685 6591892 6379680 6448607 6199195 6182358 6073238 6160260 5807541 5821779 5734016 5587104
15675 5587104 5338047 5519928 5567533 5475816 5519891 5492848 5723069 5558133 5830181 6072108
15665 6072108 6361643 6930374 7071783 7623387 7944029 8372642 8718222 9416379 9698000
15656 9698000 10499142 11188425 11798739 12523763 13199866 13984026 14421385 15459561 15833149
15647 15833149 16617557 17433615 17592061 18463793 19061997 20029264 21218768 22322015 23412607
15638 23412607 24524975 24782795 25300624 26030609 25984695 25849010 25637320 25205370 25006394
15629 25006394 24764522 24789044 24703055 24741504 24667611 24622434 24322112 23768263 23098984 21972718
15619 21972718 21066698 19481339 18392896 17361003 16379349 15390209 14928459 14192401 13474178
15610 13474178 13204568 13024274 12166030 11626972 11478445 10953256 10697998 10397607 9986952
15601 9986952 9545943 9425777 9262191 9058855 9058074 9075698 9593412 9948738 10651605 12434981
15591 12434981 16089141 23287125 34646679 45918643 53967166 58986441 61949320 62595273
15583 62595273 61398351 58156736 52630408 43837983 33369318 23710435 17320195 13408446
15575 13408446 10936699 9538120 8743961 8124771 7662747 7555394 7441541 7564180 7485316
15566 7485316 7397363 7725581 7853076 7853968 8005553 8489131 8551044 9531649 10854049 13420830
15556 13420830 19577321 30412078 46544567 60205530 69385147 75845044 78930681 79007331
15548 79007331 76349441 71317766 62764259 50747821 36492864 24957993 17248024 13219949
15540 13219949 10311645 8243690 7426507 6404944 6118705 5696012 5575985 5484478 5213134
15531 5213134 5368925 5294940 5095461 5179940 5087624 4683061 4501528 4575813 4686482 4299921
15521 4299921 4226309 4257762 4277939 4318630 4215949 4186902 4377289 4271336 4597750 4425414
15511 4425414 4547082 4724704 4902793 4757427 4946633 5055560 5134578 4951084 4934367 4719433
15501 4719433 4802099 4804330 4787639 4483620 4429843 4574969 4635478 4775158 4713484 4857835 5005496
15490 5005496 4879169 4926278 5179609 5406319 5360047 5355002 5484612 5675480 6039333 6043466
15480 6043466 6157866 6149946 6174723 6141937 6279734 6290727 6475327 6500265 7066411 7657319
15470 7657319 8259724 8747534 9203687 9916328 10338213 10340780 10115893 10064266 9695936 9394188
15460 9394188 8708113 8714676 8664293 8710440 9439457 9899284 10264181 11041313 11076893 11494172
15450 11494172 11281347 11159811 11044370 10754533 10377623 10050050 9434015 9156392 9175014
15441 9175014 9157132 9514155 9300968 9528564 9492998 9574722 9381891 9199036 9158507 8690238
15431 8690238 8300276 8330713 7699155 7558841 7526296 7186964 7379074 6713289 6779302 6566000
15421 6566000 6437707 6224711 6292260 5978009 5794275 5813403 5507257 5451373 5549103 5349171
15411 5349171 5372820 5450098 5306581 5593067 5296228 5561678 5396476 5314714 5593821 5548935
15401 5548935 5569192 5703259 6118994 6118162 6070919 6277331 6025039 6143848 6114295 6250132
15391 6250132 5939366 5911510 5908969 5982415 5875715 5819690 5893136 5743612 5833218 5870238 5560096
15380 5560096 5827962 5740610 5684828 5793515 5650699 5683661 5729154 5320839 5614228 5353556
15370 5353556 5660381 5756358 5935101 5907166 5911518 6232939 6013296 6187716 6480620 6342007
15360 6342007 6342492 6541964 6646677 6617457 6641692 7038847 7194135 7509411 8046107 8522754
15350 8522754 9511275 11532321 14802323 20484114 27040006 32486772 36545726 39024241
15342 39024241 40554757 40557223 39645749 37374909 33872840 28951861 23805587 20137475 17209577
15333 17209577 16070631 15249575 14756406 14192750 13739208 13253974 12662816 12369931 12026527
15324 12026527 12051891 12153404 12194604 12616365 12613509 13089456 13754508 14885955 17170614 21359916
15314 21359916 29093881 39700557 50515842 59564654 65998103 69780330 71252894 69791281
15306 69791281 66589157 60496305 51816590 41705893 31873880 24247477 19067719 15807617
15298 15807617 13701639 12523109 12127312 11194919 11253615 11326062 11368202 11441531 11437710 11705911
15288 11705911 11614904 11649582 11567363 11468303 11561837 12057730 12341907 14446953 17596340 22870428
15278 22870428 29137270 33594721 36626152 38740451 39440026 39051954 37901566 35118341
15270 35118341 31061355 26052343 21135401 17005321 14506211 12761495 12027896 11081516
15262 11081516 10260104 9644665 9242601 8998423 8974352 9052737 8866898 9087114 9112634 9466421
15252 9466421 9609953 9710518 10170408 10238549 10027977 10082161 9848272 9849447 9700690 9266786
15242 9266786 9248656 9322316 9076039 8914074 9356827 9662076 10380354 10683385 11121352 11434173
15232 11434173 11781793 12127859 11656642 11712541 11207929 11046222 10736783 10425356 10224103
15223 10224103 9784620 9410477 9689277 9427745 9747174 9969019 10068438 10614175 10505052
15214 10505052 11067920 11191364 11309586 10838114 10821655 9993579 9796008 9151001 8340300
15205 8340300 7965179 7744826 7109219 6768121 6607665 6369993 6281656 6093236 6088975 5935109
15195 5935109 6139528 6057437 6076826 6687888 6698931 6908895 6817226 7043425 7232317 6739616
15185 6739616 7156531 7181443 7327464 7150577 7450225 7695284 7671325 7987584 8172637 8312709
15175 8312709 8318677 8405717 8322773 8529699 8294573 8239329 8271098 8095827 8097092 7952737 7995719
15164 7995719 7946945 8002927 7771348 7787333 7767400 7655756 8153287 8029267 8268270 8100089
15154 8100089 7902433 8004067 7960769 8124495 7684672 7754078 7923117 7628240 7634514 7657122
15144 7657122 7622298 7625639 7875321 7979268 7783839 8154818 7982281 8053501 8208679 8178704
15134 8178704 8181858 8188168 7919348 8106790 7833377 7813627 7747132 8018108 7822229 7837135 7931898
15123 7931898 7765669 7586847 7686714 7628084 7547076 7597715 7220650 7325540 7097604 7240375
15113 7240375 7179369 7082280 7209579 7397511 7317724 7475986 7283424 7390546 7537956 7780649
15103 7780649 7940326 8068180 8124576 8455362 8633810 8663814 8950322 9180170 9777126 10156923
15093 10156923 10512556 11198964 12712137 14668360 17187801 19540628 21285265 22653872
15085 22653872 23309083 23645783 23404392 22950829 21979877 20634517 19091731 18068312 18323519
15076 18323519 19616349 21906732 24589944 26280514 27972587 28768837 29405579 29411331 29161629
15067 29161629 27976244 27179116 27163299 28502844 31687866 34423769 36583771 38720247
15059 38720247 40542278 42219732 43760694 45295786 46113224 45358484 43929558 43228475
15051 43228475 44056326 45477707 47945314 50185210 51033070 51126179 51302635 51696909 51956857
15042 51956857 52234132 51645239 50103747 47631370 44570834 42384939 39960725 37568766
15034 37568766 35411575 32688742 30893651 30562367 31491271 33625489 34463298 35231306 35915324
15025 35915324 36022011 36285210 35830804 35438769 34769797 34040006 34139548 36246627 40269442
15016 40269442 45628770 50814074 55359468 58838038 62161844 64542358 66629413 67721491
15008 67721491 68957896 70129314 71476843 73023896 75421829 77402258 79983950 82027250
15000 82027250 83535600 85327907 86624948 87132895 87289708 87823273 89772446 92329938
14992 92329938 96269149 101567957 108190038 115920479 124844600 133779792 142121167 147560354
14984 147560354 150859478 151033238 148192530 142534517 134003817 123045310 110611007 97620509
14976 97620509 85244606 74705931 65443050 57673784 51194000 46477354 42408419 39394810
14968 39394810 37356439 35530183 34202292 33688484 32561161 32312006 32158973 32289743 33364910
14959 33364910 34891384 37918115 42746131 49230996 58517443 71558124 88873996 108925682
14951 108925682 131160721 156853154 183748531 209969402 235733391 260160739 279989796
14944 279989796 290583738 291202113 284169840 271676470 255524990 237496533 218782039
14937 218782039 199041905 177973728 158578413 143537936 133292353 125368881 118030572
14930 118030572 109873692 100875953 91742700 83433305 76578376 71577211 69089956 67466715
14922 67466715 66063183 64141755 61593811 58403180 55207706 51393629 46664027 41132181
14914 41132181 34964709 28669157 23295844 19704848 17347140 15608743 14624034 13921804
14906 13921804 13828602 13833064 14107723 14654050 15155031 16233035 17175590 18541611 20444537
14897 20444537 23491318 27823992 32642343 36307706 38901508 40606248 40641011 40332606
14889 40332606 39223576 37117412 33568341 29357530 25092590 21648594 19371633 18355751
14881 18355751 17387060 16685545 16301579 16257496 16594941 17013201 17836210 18709965 18986680
14872 18986680 19571706 19586727 20119729 20006418 20636395 20372251 20424843 20167635 20563388 21238260
14862 21238260 23114175 26168908 31452691 38421213 45807956 54306451 62589489 69675794
14854 69675794 74431108 76361041 76042733 73374720 67857398 60433140 52599665 44719244
14846 44719244 36937015 29935653 25315789 21724191 19888274 18363306 17370236 16765627
14838 16765627 16026715 15550414 14756413 14563252 14481608 13957475 13619871 13718491 13626299 13679746
14828 13679746 14010477 14509864 14901892 15791311 16548967 18140008 21033760 25502922 31916127
14819 31916127 38769963 44961867 49413538 51434446 52428611 51508444 49307468 45507543
14811 45507543 39740647 33196737 26294177 20652638 16730704 14255673 12833919 11999732
14803 11999732 11362693 10770765 10639941 10573224 10271214 10388262 10314716 10180318 10221195 10079484
14793 10079484 9679843 9630388 9593233 9341930 9334478 9241033 9058055 9046010 9077759 9247668
14783 9247668 9134697 9595769 10011926 10448187 10966068 11813256 12259706 13007120 13046321 13196807
14773 13196807 13257818 12810195 12339884 11763721 10935579 10124626 9914635 9550729 9110292
14764 9110292 9201414 8904326 8811753 8830670 9141846 9131653 9055071 9355662 9371777 9477678
14754 9477678 9839461 9981766 10334171 10889003 11049687 11493278 11522213 11994523 11904729 12220450
14744 12220450 12192986 12301509 12384716 12776864 13227409 13931510 15063152 16436068 18301091
14735 18301091 20881711 24842405 30209504 39010564 53308545 74303519 100300427 128321117
14727 128321117 156267170 180393947 197442527 206779910 208808300 202743471 189222174
14720 189222174 168271293 142364792 115128578 89199144 66872151 49818884 38256245
14713 38256245 30549732 25169362 21523070 18741844 16823743 15199113 14661942 13109590
14705 13109590 12567530 11935179 11330188 10419742 9974106 9420352 9014849 9002099 8816034
14696 8816034 8703074 8512343 8984890 8936916 9165291 8974115 8712274 8747525 8925463 8610756
14686 8610756 8481182 8285923 8018226 8058027 8428850 8913560 8990337 9525317 10195590 11168995
14676 11168995 11937341 12723027 13158657 13379401 13303358 12817849 12390664 11467254 11003277
14667 11003277 10076022 9516371 9727276 9552375 9653092 9607367 9594569 9495921 9444409 8882599
14657 8882599 8304261 7818337 7266885 6771867 6269690 6612523 6553793 6507021 7000004 7767371
14647 7767371 8088577 8527335 9073780 9102970 9561036 9659509 9987389 10218862 10742638 11480202
14637 11480202 11896879 12728635 13439106 13726453 13982581 13729454 13081325 12007148 10714006
14628 10714006 9662076 8392295 7041991 6035243 5499316 4682483 4360812 4404255 4099594
14619 4099594 4173549 4183796 4051605 4257010 3927721 3853332 4242571 3922019 3714683 3788236
14609 3788236 3865688 3869902 3543016 3570489 3663081 3639740 3874340 4282220 5363445 6263778
14599 6263778 7299028 8549969 9213313 10060938 10053817 10195509 9945906 9279173 8555995
14590 8555995 7449059 6447055 5165114 4697437 4631889 4400913 4251485 4196030 4224961
14581 4224961 4469552 4503154 4599476 4639597 4652478 4603833 4796112 4775003 4760508 4581074 5100341
14570 5100341 5127695 5446498 5990420 6911176 7865621 8519745 9128332 10151235 11232136
14561 11232136 13393196 17656041 23873733 30382730 35300353 38484309 40564832 41428092
14553 41428092 41044256 39384935 36582667 31947727 26294589 20472582 16964579 16174012
14545 16174012 18039541 22861621 30048813 36831000 41518797 45069376 47007650 47149314
14537 47149314 45862282 43080657 38607286 32511158 25708352 19834371 16043566 13908919
14529 13908919 12811810 11977585 11617255 11293852 11354397 11049836 10979159 11396958 13025710
14520 13025710 16580638 21223516 26144723 29870408 32369121 33946556 34661789 34481502
14512 34481502 33558158 32128972 29005108 25299600 22377628 20914361 21261987 23022522
14504 23022522 26750042 31023637 34016655 36161673 37446140 38047830 37718253 36659055
14496 36659055 34362597 31102067 27476433 22965196 19341405 16796890 14709079 12712922
14488 12712922 11304650 9697330 8783541 7478334 6363459 5502145 4779264 4247500 3830084
14479 3830084 3880414 3856687 3703435 3772632 3684310 3892710 3797512 4551114 5529857 5997934
14469 5997934 6702516 6875660 7319722 7613124 7515547 7405498 7218613 6947637 6777097 7359508
14459 7359508 7860551 8464325 9145455 9708945 9742026 9923355 9799082 9233717 8533402 7665912
14449 7665912 6690972 6374907 5956883 6070092 5964324 5992007 6295765 6317008 6737527 6974062
14439 6974062 7334003 7316189 7713062 8037718 7931441 8461393 8737228 9525798 10885037
14430 10885037 12521020 15866156 20411756 25355166 30160787 34033874 36692911 38175311
14422 38175311 38515280 37801274 35975802 32894193 28730419 24310936 20096507 17046266
14414 17046266 14392833 12621962 10932356 9782820 8790736 8173491 7573392 7187194 6845435
14405 6845435 6933772 6753555 6672875 6565336 6450670 6801170 6986249 7505673 8021094 8984463
14395 8984463 10818437 13070992 17860383 24117567 31974253 40459085 48540395 54637369
14387 54637369 58807754 60840152 60519926 58218795 53804728 47458190 39538525 31712806
14379 31712806 24551628 19069891 15381120 12476546 10503556 9356128 8392381 7738869
14371 7738869 7553683 6930329 7106345 6914549 6310934 6330082 6252012 6093745 5983860 6089716
14361 6089716 6371827 6439103 7230595 7982428 9224612 11222173 13697438 17178167 20845473
14352 20845473 24130661 26537515 27781418 28610363 28163196 26455269 24717902 21794089
14344 21794089 18695914 15242247 12133855 10454628 8903824 8199078 8696181 10191353
14336 10191353 13033146 15732629 17561971 18497000 19337697 19392905 19242850 18212401 16872543
14327 16872543 14747628 11922850 9475174 8656411 7756799 7505778 7585113 7717975 7852370
14318 7852370 8246968 8791440 9233010 10280616 11327511 12835758 14122692 16209107 18707669
14309 18707669 21628363 25603822 31035999 38318497 47843465 61335645 77948935 97371203
14301 97371203 115436236 130898813 142376198 148901424 151161931 148160305 140259771 127996102
14293 127996102 111516914 92319229 73871593 58362156 46123597 36688605 29537970
14286 29537970 24176718 20125193 16931711 14507461 12402353 10815673 9936222 8894066
14278 8894066 8174158 7435797 7117052 6638357 6241304 5672984 5509346 5294708 4845557
14269 4845557 4610649 4540871 4194419 4181364 3787241 3680065 3649828 3424038 3264746 3371083
14259 3371083 3229379 3056762 2734283 3184954 2973704 2998826 3057755 2904462 2763500 2644012
14249 2644012 2889826 2680484 2656215 2628842 2799463 2497968 2308363 2278096 2494743 2270831
14239 2270831 2367550 2525672 2380138 2342741 2388213 2277679 2069508 2126585 2015140 2141778
14229 2141778 2187640 2026769 1829426 2199066 2027319 2027339 2116276 2206191 2066574 2258848 2380074
14218 2380074 2371405 2299626 2303517 2326649 2335806 2148921 2270834 2417537 2418521 2856862 3704585
14207 3704585 3808642 4109657 4357802 4410874 4432169 4187249 4115353 3701961 3261900 2704372
14197 2704372 2185224 2092724 2069542 1964815 2296892 1805585 2011867 2025980 1748055 2033866
14187 2033866 2044082 2092543 2198890 2182913 1924530 1770370 1942805 1658821 1951320 1929314
14177 1929314 1936394 1919211 2057601 2397458 2126755 2015078 2078061 1895863 1972164 2072759
14167 2072759 1986076 1851933 2124172 1869880 1809353 1647495 1885006 2026065 1827934 2080466
14157 2080466 2074065 2082674 2275711 2036870 2419474 2073313 1984994 2093233 2099772 2171324 2239586
14146 2239586 2011621 2493930 2589672 2885630 3492610 4354133 5620127 6970837 8231305
14137 8231305 8887987 9426011 9875243 9929390 9822747 9016417 8067210 6972285 5713966
14128 5713966 4762017 4059960 3615546 3235816 2861422 3078566 3264207 3835983 4214126
14119 4214126 4111919 4564341 4424258 4618428 4403990 4575691 3981521 3511601 3198148
14110 3198148 3019623 2741380 2800073 2660436 2355211 2582167 2493538 2656327 2560871 2718403
14100 2718403 2919441 3440477 3760907 4307513 4488998 4950385 5040696 4890293 4835375 4771481
14090 4771481 4653205 4359038 4005105 3676973 4220910 4481278 5146046 5771051 6036011
14081 6036011 6425834 6646665 6330569 6360999 5981632 5512489 4692152 4190650 4128411 3577389
14071 3577389 3474463 3421388 3571952 3095409 3246164 3473505 3266430 3587409 3560444 3613590
14061 3613590 4187655 4636414 4887921 5355031 5691744 5960892 5812787 5793782 5975737 6052519
14051 6052519 6129184 6152325 6249271 6989813 7291749 8172858 8693216 9553857 10487418 11279736
14041 11279736 12073542 13033316 13716459 14938425 15971161 17086562 19009204 21574761
14033 21574761 24876710 29304798 35552638 44936711 58087335 74962803 94971803 115002767
14025 115002767 132312626 145135531 153066644 155827513 153518054 146554473 134268460
14018 134268460 117786442 97836437 78366294 61694472 48477481 38432200 30968607
14011 30968607 25370952 20899091 17543904 15112349 13102943 11410696 10180689 8707598
14003 8707598 8122905 7211786 6747369 6116270 5725111 5373066 5052263 4979750 4686950 4523134
13993 4523134 4300582 4149760 4271510 4369190 4591479 4720756 4958273 5301541 5308963 6019757
13983 6019757 6292776 6730619 6814993 6988536 6892108 6922291 6809469 6558817 6031720 5374108
13973 5374108 5009815 4526101 4264854 3890948 3829751 3311643 3114427 2973714 2942343 2916010
13963 2916010 3098292 2781767 2552591 2655974 2520401 2358098 2347588 2324027 2046704 2167913
13953 2167913 2323719 2180382 2556954 2666318 2895565 3061533 3506781 3628160 3809539
13944 3809539 4073982 4274484 4673552 5377820 7020343 9743791 13145991 17514493 22287356
13935 22287356 26543016 30244906 33032321 34226548 33526183 32098129 28851139 25009888
13927 25009888 20547466 16150735 12394037 8782774 6455579 5032384 3796264 3179827
13919 3179827 2735391 2633205 2119963 2114918 2004147 2126154 1750688 1968940 2031740 1844183
13909 1844183 1781509 1722353 1681487 1572060 1757033 1659960 1761247 1657001 1915460 1663620
13899 1663620 1861731 1777075 1440404 1582340 1811646 1775843 1689168 1669767 1709799 1620252
13889 1620252 1706993 1782652 1673211 1714544 1678522 1995122 1742830 1849775 1618298 1598725
13879 1598725 1604605 1349910 1567235 1593045 1647770 1594051 1543809 1759781 1670112 1587378 1757520
13868 1757520 1716726 1923566 1677206 1803845 1779479 1922953 1895289 1562726 1772246 1659111
13858 1659111 1651349 1919646 1751686 1992697 1856999 1680150 1921539 1834586 1939558 1850828
13848 1850828 1798175 1805921 1805085 1915591 1860747 1828463 1850635 1804024 1819294 1897129 1831972 1643270
13836 1643270 1689983 1459399 1606366 1595439 1569915 1511993 1417320 1539494 1617781 1442388
13826 1442388 1501068 1636659 1877912 1447403 1327489 1663715 1771858 1564377 1290241 1445141
13816 1445141 1417229 1381507 1115438 1567655 1591198 1413970 1376699 1448825 1343410 1655438
13806 1655438 1502213 1306762 1445603 1354241 1369182 1693053 1547971 1399016 1492481 1780579
13796 1780579 1428060 1516273 1525030 1640397 1636469 1695192 1559024 1457257 1358991 1273686 1416872
13785 1416872 1193491 1633504 1480863 1307879 1492502 1423989 1223176 1354627 1402155 1252285
13775 1252285 1175941 1419425 1529103 1478053 1365941 1552069 1439627 1396371 1445971 1522734
13765 1522734 1650494 1346321 1464151 1415086 1450247 1530569 1233108 1677981 1343738 1576426
13755 1576426 1333042 1095505 1419429 1432549 1320046 1330529 1453827 1230915 1638830 1511463
13745 1511463 1496274 1555631 1810111 1495782 1914308 1739392 1869132 1942550 2029320 2064363
13735 2064363 2151662 2097108 2334806 2018538 2173499 2009084 1970881 1848386 1497046 1677903
13725 1677903 1357744 1654078 1742740 1407093 1293976 1523552 1569776 1477659 1636713 1672115
13715 1672115 1457693 1464743 1716691 1583292 1504022 1657244 1560484 1607125 1678078 1585847 1875447
13704 1875447 1645495 1683395 1605221 1650271 1675037 1542871 1601470 1877525 1875639 2191275 2382913
13693 2382913 2496905 2656104 2477410 2546572 2719502 2387916 2559286 2103974 2102988 1737521
13683 1737521 1875104 1613801 1538861 1856945 1718302 1954226 1945569 1842855 2012264 1950558
13673 1950558 1945312 2190594 1841672 2177964 2188012 2245035 2453966 2760579 2783014 2982634
13663 2982634 3114128 3330946 3323610 3365709 3178457 3016914 2821705 2831835 2261191 2416035
13653 2416035 2278759 2228281 2124228 2201249 1816752 2040410 1674138 1683925 1944524 1988563
13643 1988563 2006260 1949722 2037702 1982235 2111133 1805250 2207778 2477718 2523783 2630897
13633 2630897 2727579 2917863 2947079 3183184 2805351 2748621 2703525 2529508 2276848 1845735
13623 1845735 1974702 1733286 1650927 1743492 1764309 1724623 1771851 1838030 1921756 1695644 1656519
13612 1656519 2016634 2075395 2058599 2078652 2107135 2162759 2144742 2289486 2092077 2256909
13602 2256909 2172828 2129808 1925347 1922922 2132875 2020451 1811040 2101666 2383552 2139892
13592 2139892 2160105 2385224 2160889 2339502 2037074 1948822 1983376 1924025 1831674 1770414
13582 1770414 1735530 1871137 1587529 1548034 1484166 1754243 1706945 1766495 1668390 1547544
13572 1547544 1504039 1786017 1401970 1551349 1576673 1500505 1592748 1507754 1494606 1847946
13562 1847946 1673603 1578856 1386797 1681515 1700431 1466501 1587584 1641454 1446031 1760267
13552 1760267 1643907 1615615 1570772 1473786 1658258 1620338 1843337 2066990 2055548 2474113
13542 2474113 2520604 2760535 2620279 2802706 2521049 2707175 2785850 2504538 2165242 2062826
13532 2062826 1887207 1535914 1984407 2094750 1859569 2192686 2566957 2512399 2655694 2577479
13522 2577479 2703907 2541743 2610721 2507699 2256767 2046590 1682530 1605323 1372817 1508574
13512 1508574 1215334 1378006 1315606 1398933 1105859 1464982 1449526 1221120 1296418 1251457
13502 1251457 1324223 1332683 1338841 1261684 1097102 1249982 1168122 1344220 1322836 1250022 1130616
13491 1130616 1452489 1320481 1490546 1186908 1329184 1195023 1310496 1322999 1411804 1244216
13481 1244216 1271418 1382027 1328921 1203888 1086668 1257625 1314000 1249741 1431637 1147299
13471 1147299 1274125 1360208 1190778 1333107 1393713 986872 1469773 1102141 1145714 1356567
13461 1356567 1177175 1294238 1380272 1563629 1428234 1402001 1624477 2089472 2207593 2065383
13451 2065383 2559547 2450128 2784732 2522406 2547750 2391874 2099127 2126489 1835945 1707754
13441 1707754 1538630 1609826 1522371 1493463 1286519 1432213 1480065 1405855 1436469 1530761 1485320
13430 1485320 1301322 1367908 1645129 1305183 1443361 1658238 2013146 1961621 2196465 2507005
13420 2507005 2400900 2649123 2704231 2834477 2719708 2410446 2092964 1817117 1980015 1688115
13410 1688115 1609370 1451504 1415287 1513894 1498148 1272167 1454175 1402201 1468765 1418525 1770959
13399 1770959 1312766 1461752 1306561 1516498 1722961 1582975 1639066 1860052 1745990 1677199
13389 1677199 2059186 1937296 1938986 2306753 2413925 2659291 2792415 2696050 2733913 2438041
13379 2438041 2598400 2761443 2525556 2064388 2074498 1978105 1941985 1973034 1832327 1986663
13369 1986663 2066216 2090998 1945063 1966133 1983053 2164678 2129640 2016943 2091648 1986564
13359 1986564 1870183 2099802 1973671 2276216 1845658 2216106 2273760 2095688 2039305 2112394
13349 2112394 2105938 2065782 2148961 2014780 1855339 1823406 1752914 1900707 1784599 1781074 1966656
13338 1966656 1764623 1737426 1842047 1825969 1825243 2058799 1981415 1907757 2050005 1976915 2126652
13327 2126652 1603645 1975603 2070941 2055200 1855773 2033168 2030960 1955853 2109768 2263400
13317 2263400 2276969 2296588 2589910 2828522 2936818 3149811 2866532 2968943 3066221 2763291
13307 2763291 2830983 2539806 2711842 2495783 2611895 2562167 2713451 2872721 3191280 3243387
13297 3243387 3102348 3365976 3481816 3018682 3058799 3062001 3048469 2948511 2886653 2694916
13287 2694916 2684969 2733313 2871865 2774763 2979048 3069143 2949647 2896834 2977908 2943318 2920031
13276 2920031 3216765 2998804 3074627 3171467 3211907 3241579 3210641 3372013 3485952 3352971
13266 3352971 3533412 3679368 3587977 3777244 3902207 3757541 4135124 4182613 4249140 4396636
13256 4396636 4606084 4522928 4818695 4968997 4818698 5158147 5327537 5136381 5249134 5247269
13246 5247269 5356777 5365988 5384683 5355078 5414339 5522464 5656198 5689282 5583940 5868434
13236 5868434 6073891 6259082 6259809 6256691 6610432 6725989 6973997 7307006 7138306 7370146
13226 7370146 7564565 7370391 7300196 7630738 7489783 7031240 7178652 7070723 6870697 7175346
13216 7175346 6817650 6817839 6834216 6645812 6794211 6713256 6648205 6726240 6541109 6766428 6675017
13205 6675017 6768704 6798152 6970052 6840171 6468370 6499828 6693562 6453089 6436907 6482098
13195 6482098 6165447 5976845 5935081 5773471 6002747 5900571 5696154 5822117 5673168 5965165
13185 5965165 5708122 5482474 5459544 5381991 5505310 5366899 5387295 5419151 5127807 5081180
13175 5081180 5387874 5077360 5321524 5085428 5015118 5143649 5198671 4938903 5263050 5166510
13165 5166510 5427300 5366947 5823766 6225423 6349876 6244674 6462185 6801880 6983984 7246923
13155 7246923 7057972 7193794 7125289 7092217 6790170 6676412 6523988 6503090 6375942 6200866
13145 6200866 6506421 6493038 6531405 6355881 6288968 6497783 5724823 5657042 5219417 5023334
13135 5023334 4877499 4527438 4274008 4192829 4129300 4215973 4011541 4159759 4492600 4313022
13125 4313022 4353234 4202537 4175242 4172620 4004018 3766303 3644411 3494163 3457517 3297390
13115 3297390 3256388 3183848 3456107 3092626 3222596 3310846 3167079 3191302 3290855 3205942
13105 3205942 3395674 3299359 3526536 3485297 3575347 3601130 4155385 4313172 4583332 4887596
13095 4887596 5195969 5558724 5782599 6220867 6287216 6016123 5994654 5896518 5906767 5661193
13085 5661193 5653806 5875131 5851848 5862914 5646822 5520924 5334598 5183020 5144714 4910338
13075 4910338 4333629 4153126 3600297 3533930 3204592 3259098 2979121 2796095 3029907 2622521
13065 2622521 2609783 2750306 2751557 2843361 2944301 3140744 3185750 2855171 3091963 3137555
13055 3137555 3112582 3258215 3126958 3045878 3094906 3011841 3049379 3066251 2952610 2943619 2769272
13044 2769272 2755076 2707255 3225594 3094703 3069016 2753468 3029434 3001729 3063910 3124441
13034 3124441 3207603 3157289 3536409 3476693 3520352 3375282 3421447 3710256 3587846 3439100
13024 3439100 3561103 3529318 3835073 3809445 3808137 3948367 4031877 4063158 3900257 4188833
13014 4188833 4361307 4307334 4463923 4638455 4654351 4463955 4655338 4947207 5088703 5264187
13004 5264187 5163669 5387673 5225818 5481974 5400740 5716556 5603243 5579646 5902168 6016231
12994 6016231 6313054 6248238 6449356 6584571 6583009 6499084 6418814 6489382 6483367 6654003 6768711
12983 6768711 6766162 6677088 6440297 6819857 6616613 6528106 6605148 6358341 6353138 6355517 5935699
12972 5935699 6139991 6272199 5882165 5841230 5820253 5790138 5804214 6006584 5588722 5340772
12962 5340772 5556927 5528173 5445786 5499804 5265217 5317393 5326052 5282704 5106097 5126104 5243844
12951 5243844 5260612 5384615 5306663 5293448 5102462 5416999 5253564 5246212 5418972 5487611
12941 5487611 5441300 5455521 5256353 5331678 5167553 5629076 5572888 5720876 5692561 5711289
12931 5711289 5924701 5724171 5905195 5746485 5797296 5812085 5593140 5489004 5297531 5432278
12921 5432278 5682017 5290569 5524596 5547266 5421303 5613961 4992986 5086180 5028669 4704006
12911 4704006 4568530 4718696 4378256 4231606 4351918 4312791 4457799 4055850 4043353 4217542
12901 4217542 3937622 3942709 3705319 3662285 3929580 3840741 3585648 3440333 3517406 3311989
12891 3311989 3496863 3375192 3270345 3318358 3102303 3382540 3312562 3357948 3067558 3160021
12881 3160021 3387960 3320624 3054666 3192001 3186216 3051994 2885648 3143076 2888333 2877269
12871 2877269 2913730 2987727 3015244 2979545 2875682 3081898 2905017 2847957 2679284 2718074
12861 2718074 2664154 2848102 2758951 2574289 2523597 2817784 2990391 2667116 2918211 2654801
12851 2654801 2874423 2608785 2577340 2884682 2739054 2630354 2748646 2559685 2616107 2666778
12841 2666778 2835622 2496531 2477887 2521454 2660875 2664967 2715205 2515581 2699655 2788270
12831 2788270 2638264 2686580 2601308 2544402 2574137 2586332 2743614 2777726 2349815 2825533
12821 2825533 2605545 2615343 2551822 2720208 2427581 2773347 2538888 2707967 2413113 2617172
12811 2617172 2640994 2511740 2491938 2602690 2431405 2630017 2578550 2519323 2586662 2657553
12801 2657553 2769594 2638973 2494487 2951072 2757928 2877393 3030163 2697776 2579014
12792 2579014 2708871 2818148 2977059 2873765 2631898 2731672 2913457 2853994 2983180 2816171
12782 2816171 2814341 2633513 2809431 2748266 2889082 2907766 2666781 2654618 2840709 2848618 2912326
12771 2912326 2812619 2780774 2897127 2963923 2768123 2913357 3041399 2863694 3123305 3055724
12761 3055724 2797560 3151469 3046954 2944765 2910293 2783351 2903089 3037190 2849787 3066897
12751 3066897 2974672 2883028 3117185 3077946 3008009 3087667 3041611 3066451 2988776 3019619 2951034
12740 2951034 2839224 2863532 2943838 2765053 2981249 2965644 2883469 2932839 3050587 2936856
12730 2936856 3219782 3113496 3124486 2999168 2912071 2848820 3197973 2945460 2963480 3221946
12720 3221946 3156752 3021595 3362297 3096345 3086899 3269281 3155524 3136175 3002805 3196443
12710 3196443 3323291 3467692 3169066 3516982 3451900 3621206 3565789 3750666 3674718 3998293
12700 3998293 3942188 3804246 4021548 4241206 4042157 4063384 4437268 4425974 4791811 5292048
12690 5292048 6031128 6604567 6817238 7305586 7264977 7383076 7473568 7114926 6855094 6636085
12680 6636085 5763382 5422846 4777118 4809571 4738275 4488603 4344478 4378877 4385232 4522017
12670 4522017 4646681 4760978 4659738 4813040 4893507 5164789 4768538 5001189 4880141 4980853
12660 4980853 4515003 4524208 4584887 4509520 4459578 4763777 4638009 4848558 5212493 5350216
12650 5350216 5696857 5775337 6324463 6160043 6341628 6229220 6215460 6446268 6392209 6163593
12640 6163593 6491243 6414085 6181162 6384603 6561945 6491439 6730781 6534641 6580885 6445554
12630 6445554 6796908 6584790 7100595 7030871 6983535 7097337 7143275 7071076 6528359 6258923
12620 6258923 6171550 5893657 5561600 5180557 5231026 5074280 5090345 5456778 5896672 6321572
12610 6321572 6591083 7200077 7549535 8085569 8308762 8801882 8487808 8458007 8089012 7533558
12600 7533558 7339646 6857311 6254907 5585516 5328922 5141835 4932625 5019958 4878727 5154301
12590 5154301 5460968 5438948 5543253 5833725 5944199 6029216 6051535 6244602 5998681 6238618
12580 6238618 6343797 6755898 7031311 7252448 7026935 7382141 6883643 6738452 6762110 6204865
12570 6204865 5909704 5501003 5130005 4790134 4752696 4700882 4864956 4781299 4873970 4921325
12560 4921325 4885561 4924310 4512270 4636595 4890335 4992532 4512644 4726327 4734908 4551340
12550 4551340 4447599 4689458 4601384 4596798 4763878 4518187 4822560 5119876 5071333 5344424
12540 5344424 5628216 5988341 5977508 5853580 5820138 5858651 5510637 5236286 5116357 5242123
12530 5242123 4775688 4622444 4889698 4815473 4651253 4922184 4892394 4765985 4904786 4899708
12520 4899708 4644797 4999141 5003559 5000404 5036433 5067469 5693117 5989804 6438445 6874846
12510 6874846 6822323 7372168 7316402 7321794 7370592 6878359 6782627 6586179 6031256 5702329
12500 5702329 5478258 5314100 5343318 5155431 5134479 5321870 5240502 5356749 5019500 5279392
12490 5279392 5470925 5245160 5373779 5401579 5382939 5630216 5649448 5926333 6289585 6651011
12480 6651011 6672129 6853538 6633542 6503290 6396729 6110686 6122569 5767142 5750112 5610355
12470 5610355 5596246 5420923 5573864 5455059 5417839 5503128 5486569 5600289 5504953 5688657
12460 5688657 5825560 5900015 6047745 5991086 6169613 6283320 6254425 6553496 6755299 6976079
12450 6976079 7054083 7269107 7276364 7423623 7767057 7776092 7839494 8168633 7965553 8107041
12440 8107041 8371020 8330805 8054695 8333965 8111381 8429063 8306053 8266944 8410760 8495925
12430 8495925 8701502 8855313 9286529 9549175 9558610 9556724 10175431 10361521 10595415 10679971
12420 10679971 11193051 10911599 11366922 11600075 11872945 11855659 12377333 12431116 12414021 12521554
12410 12521554 12446421 12408607 12223083 12096008 11834194 11749270 11783436 11395884 11427783 11273218
12400 11273218 11407426 11269340 11434883 11516048 11679288 12059777 12089006 12565055 12732628 13448683
12390 13448683 13824662 14309930 14790343 15039118 15360419 15711763 16267445 16065924 16354766
12381 16354766 16385804 16429505 16784136 16699667 16615020 16494123 16922398 16909138 16916254 16873275 16950668
12370 16950668 16843220 16521942 16918606 16751387 16982799 16813956 16593483 17032911 16674918
12361 16674918 16550284 16604397 16560855 16345343 16475900 16535184 16231284 16256389 16259569 16081630
12351 16081630 15992172 15603486 15647696 15443342 15115419 14948878 14991368 14999702 15032021 15198242
12341 15198242 15549013 15971795 16053646 16735326 16969534 17280282 17745869 18314032 18600036
12332 18600036 19317129 19746329 20056617 20502716 20529056 20765113 21069176 21440125 21690712
12323 21690712 21758648 21854731 21845666 21841306 21768630 21903702 21859055 21940908 21763054 21842609 21845208
12312 21845208 22201471 22345544 22580408 22919474 23187822 23613039 24191131 24606124 24728318
12303 24728318 25286586 25210517 25132537 25072377 24806968 24026989 23508034 22700693 22055146 21379612
12293 21379612 21208897 20990426 20610787 20365629 19988617 19498311 19072749 18759141 17986327
12284 17986327 17328534 16521849 16035622 15331878 14924210 14609329 13963791 13700164 13422603
12275 13422603 13173495 13107137 13006510 12894941 12897469 12857162 12907708 12569777 12769512 12684916
12265 12684916 12408701 12458582 12425933 12196976 12386988 12555089 12703744 12585154 13031298 13338712
12255 13338712 13889815 14581075 15203033 16065477 17005872 17889130 19159647 20308115 21473264
12246 21473264 22908548 24067858 25221901 26003401 26756404 27417593 27569441 27443309 27215347
12237 27215347 26977186 26775393 26550999 26118105 26021788 25875555 25513422 25065508 24571249
12228 24571249 23690378 22600736 21558765 20406824 19409016 18181770 16875943 15788330
12220 15788330 14827103 13760983 13111668 12582111 12173405 11968247 11632673 11131069 10834020
12211 10834020 10517939 10269774 10056538 9768802 9570395 9392733 9446194 9276779 9354975 9311862
12201 9311862 9015594 9403904 9235200 9332308 9461815 9341585 9458264 9717896 9823604 10057005
12191 10057005 10118354 10352462 10553303 10928679 10892058 10858279 11295849 11346864 11602711 11727657
12181 11727657 11682248 11696049 11675964 11643532 11541111 11451882 11440838 11158046 11449902 11323783
12171 11323783 11284232 11398844 11369195 11561135 11399404 11315095 11648432 11875847 12464364 13065988
12161 13065988 13145820 13849326 14019708 14458759 14553067 14728724 14484332 14387404 14168570 14016935
12151 14016935 14189778 14543628 14223959 15240825 15477255 16281995 17089811 17611424 18351907
12142 18351907 18750420 19556637 20091091 20675338 21339827 21890097 23039841 23956589 25269065
12133 25269065 26468293 28327945 29625957 31903638 34160428 36315136 38339672 40132905
12125 40132905 42076855 43207536 43970312 44467528 44425549 44450322 43969179 43376474 42571233
12116 42571233 41622042 40777256 39648229 38492957 37552681 36809950 35986098 35207620 34427003
12107 34427003 33500538 32899289 32116874 32103670 31987950 31932950 32267967 32425512 32408384 32215067
12097 32215067 32133992 31884732 31307412 30903397 30141105 29496113 29366327 29294202 29341045 30043250
12087 30043250 31009636 31531295 32429515 33363469 34160007 34592690 35428817 35597103 35686545
12078 35686545 35749604 35807774 35759521 35855775 35972899 36020739 35431482 34901023 34367197 33466668
12068 33466668 32543510 31687388 30662389 29321030 28311978 27012312 26466058 25902877 25255809
12059 25255809 24716477 24216803 24069941 23428627 23186521 22441007 22121247 21296954 20749347
12050 20749347 20355266 20117564 19601957 19295041 19153647 18854068 18283041 18102566 17861795
12041 17861795 17200315 16783719 16276092 15609299 15547534 15054918 14709394 14893110 15193955
12032 15193955 15438700 15857582 16449742 17100632 17257646 17555179 17680212 17805903 17411918
12023 17411918 16561095 16277478 15467223 14330411 13875789 13451463 12913007 12417943 12179650
12014 12179650 11918002 11550849 11160260 10954174 10587661 10149018 9719410 9898751 10005607
12005 10005607 9746430 9612634 9819122 10048571 10383487 10327529 10431322 10457566 10268850 9818373
11995 9818373 9726622 9672529 9390133 9053346 8829523 9089785 9271730 9078805 9080768 9027598
11985 9027598 8738931 8690589 8606619 8282904 7687138 7470282 7491726 7382804 7356983 7124586
11975 7124586 7104724 7032383 6773366 6788561 6570811 6322216 6135376 5989509 5877116 5806216
11965 5806216 5618180 5332024 5356848 5359172 5330385 5206381 5455837 5667856 5761655 5762651 5662666
11954 5662666 5936795 6079945 6136693 5908559 5654905 6205943 5887845 6075583 6174002 6050228
11944 6050228 6374355 6641399 6888729 7187356 7264631 7481260 7396589 7671396 7730803 8084039
11934 8084039 7730574 7957458 7975625 8032654 7809689 7948613 7711610 7546187 7444282 7332575
11924 7332575 6979835 6940102 6715840 6515318 6486000 6231978 6181191 6073347 5972055 5579772
11914 5579772 5712963 6071106 5936529 7054938 9864320 15659169 19495080 21951265 23842109
11905 23842109 24344614 24030272 23455706 22316019 20275991 16695895 12053504 8451574
11897 8451574 6766419 6145774 5282349 5239135 4942483 4906140 4933900 5177509 5271651 5607308
11887 5607308 6024335 6798466 7375401 7834926 8450242 8944730 9222681 9254983 9361827 9219107
11877 9219107 8808203 8468877 7861311 7149584 6835776 6560988 6100973 5558345 5011270
11868 5011270 5093089 4705577 4565926 4346843 4364602 4201114 4211540 3799806 4117219 4104628
11858 4104628 4072348 3941397 3961024 4279713 4111952 4327587 4438903 4436170 4657083 4610372
11848 4610372 4802129 5079031 5595146 5984107 6005223 6435462 6928527 7151004 7434164 7583356
11838 7583356 7499098 7390772 7113715 6802602 6672273 6576483 6551486 6359907 6247792 6246198
11828 6246198 6352784 6120354 5788325 5853960 5579529 4935108 4519403 4363621 3991598 3832673
11818 3832673 3691797 3551082 3763819 3658354 3584188 3141204 3350036 3353116 3272467 3092236
11808 3092236 2941060 3339341 3152163 3115826 2982001 3062065 2947199 2865865 3032389 2782884
11798 2782884 2980781 3164636 3033117 2940551 3140404 3363328 3350326 3659898 3922905 4526029
11788 4526029 4871105 5081096 5345273 5247285 5232840 5131183 4765254 4753051 4200532 4023396
11778 4023396 3563162 3374089 3261888 2974023 2762994 2899763 2997980 2811035 2648504 2770918
11768 2770918 2824984 2755432 2440279 2680386 2562424 2610989 2775081 2653049 2388810 2638378
11758 2638378 2623253 2550219 2622705 2533434 2520646 2408256 2464062 2392246 2408216 2359686 2102554
11747 2102554 2584718 2328430 2377503 2176193 2398642 2429402 2595736 2332119 2450685 2555325
11737 2555325 2430271 2256192 2549079 2363201 2468985 2271898 2094149 2433926 2140834
11728 2140834 2233535 2101458 2358861 2243853 2332907 2435379 2173086 2238558 2332385 2134837
11718 2134837 2295636 2367446 2223040 2120790 2381262 2392289 2367169 2317929 2199165 2175088
11708 2175088 2268851 2419544 2484616 2239229 2411772 2542293 2629120 2345925 2520280 2495160
11698 2495160 2541610 2395033 2381043 2326884 2462284 2482285 2500032 2372611 2355538 2539092
11688 2539092 2425441 2416190 2287253 2363078 2420040 2413228 2346335 2548778 2285107 2318104 2540409
11677 2540409 2588387 2669098 2507888 2780388 2655371 2646906 2600799 2651217 2854872 2651288
11667 2651288 2662409 2670752 2582642 2593010 2594458 2683840 2430069 2827835 2360710 2578256 2363114
11656 2363114 2787809 2661682 2522218 2457236 2670654 2637095 2478462 2773747 2409309 2592589
11646 2592589 2494538 2624274 2381524 2670294 2656208 2628696 2503964 2660105 2590359 2591514
11636 2591514 2627683 2611928 2541262 2658217 2488759 2782687 2818247 2641509 2591459 2630275
11626 2630275 2616729 2644942 2675432 2590961 2480061 2575443 2435645 2462499 2600688 2702299
11616 2702299 2428668 2654568 2352493 2603378 2524558 2785109 2609450 2543111 2486499 2656190
11606 2656190 2701649 2756451 2878544 2776015 2567201 2807874 2846802 2685134 2724793 2705107
11596 2705107 2802173 2704281 3074234 2887510 2814395 2938347 2768011 2876497 2795694 2816323
11586 2816323 2817406 2822582 2643606 2668657 2788291 2686456 2776139 2825888 2719677 2857775 2732912
11575 2732912 3078828 2881467 2986302 3020925 3186037 2937448 3003406 2949460 2914683 2959094
11565 2959094 2929250 2943304 2996730 2893711 2900145 2977296 2758973 2697761 2898132 2867741 2712627
11554 2712627 3043137 2986808 2950093 3016507 2984907 2913724 2840716 2708192 2847327 2672214
11544 2672214 2848893 2705347 2849736 2872464 2559002 2939448 2819324 2869701 2855083 2903629
11534 2903629 2530740 3041218 2777439 2783874 2828103 2899662 2852201 2826211 2728522 2674342 2890751
11523 2890751 2709472 2561407 2846591 2771559 2851112 2636820 2820889 2769914 2628811 2895288
11513 2895288 2999802 2936518 2798789 2722212 2826932 3098461 2839911 2958770 2852053 3107880
11503 3107880 3060233 3053409 2932987 2772558 3036043 2917572 2864914 3118442 3021097 2968788
11493 2968788 3176489 2751956 2765674 2812299 3015150 2672703 3189141 2982245 2963917 2806412
11483 2806412 2909596 2904055 3034704 3218598 2955809 3125741 2963903 2968514 3057561 3370870
11473 3370870 3003347 3017110 3027067 3177774 3065407 2996684 2696807 2893505 2915987 2976635
11463 2976635 2916429 2803982 3016465 2931942 2858544 2913039 2932844 2802975 2905084 2947405
11453 2947405 2910206 2918119 2952697 2868427 2842359 2825104 2842703 3027189 2958437 2989858 2829786
11442 2829786 3021792 2905505 2964717 2863201 2940802 3003198 3244226 3003855 2986248 2914624
11432 2914624 3225831 3070226 3102467 3420643 3310988 3411493 3319167 3433909 3343973 3533658
11422 3533658 3479352 3438533 3459533 3708875 3794380 3658057 3949026 3917316 4042186 4152177
11412 4152177 4017770 4170758 3976219 3918819 4053635 4000951 4211433 4216490 4613259 4512537
11402 4512537 4403728 4387329 4507603 4652620 4793061 4901002 4648753 5010375 5220057 4990515
11392 4990515 5179149 5012306 5156822 5340877 5486821 5187718 5388592 5271324 5522824
11383 5522824 5355030 5677267 5453557 5916378 5513372 5732916 5776966 5901964 6148567 6021940
11373 6021940 6074229 6104719 6288323 6252580 6082059 6229637 6315307 6511857 6400795 6365644
11363 6365644 6472219 6256560 6395888 6299740 6266653 6238751 6541063 6381960 6236058 6425213
11353 6425213 6362243 6217591 6447699 6391720 6288498 6282143 6275796 6105008 6225767 5998635
11343 5998635 6044564 5729099 5801596 6050876 5935225 5936705 6029972 5759613 5630309 5660208
11333 5660208 5853126 5726280 5736455 5437370 5699577 5385649 5389991 5483835 5314150 5063172
11323 5063172 5303210 4972078 4983934 4817336 4773471 4787100 4559399 4735605 4429276 4633028
11313 4633028 4317691 4066301 4389724 4215361 4066383 3935079 3973856 3806633 3993170 4070547
11303 4070547 3769211 3894236 3528713 3511005 3370745 3486673 3316557 3552951 3320812 3535348
11293 3535348 3368555 3190310 3233720 3333287 3216807 3132472 2970082 3034293 2883673 2922023
11283 2922023 3148546 2806748 2676099 2810635 2621108 2815596 2791415 2788112 2774730 2931888
11273 2931888 2941780 2836481 2783828 2653194 2622384 2775681 2766441 2589155 2642668 2680080 2621566
11262 2621566 2738346 2620798 2356289 2615549 2503644 2443912 2494265 2619207 2531977 2260241
11252 2260241 2616400 2405493 2548096 2550561 2433097 2386759 2491412 2611936 2547860 2242344
11242 2242344 2613214 2538425 2540496 2246717 2351435 2247885 2442040 2277233 2679816 2429724
11232 2429724 2552931 2476831 2546493 2812797 2798645 2888581 3193876 3757361 4734813 5615648
11222 5615648 6314494 6647734 7187380 6838612 6804041 6746183 5964384 5562320 4515214 3946319
11212 3946319 3519596 3087560 2891391 2765633 2838490 2866966 2726190 2541857 2573140 2713431
11202 2713431 2572892 2879919 2730845 2955267 3073019 3483998 4276717 5126102 5858640
11193 5858640 6430519 6831999 6922448 6721754 6896011 6652629 6010249 5309490 4484946 3983063
11183 3983063 3300308 3160751 3051765 2895577 2690471 2843995 2732576 2569150 2408157
11174 2408157 2600752 2842139 2570822 2544009 2726150 2730521 2758439 2759006 2619178 2650662 2704341
11163 2704341 2570247 2604411 2755368 2842544 2657856 2713621 3076023 2806569 2870882 2951961
11153 2951961 2928136 2775971 2668443 2766733 2850006 2760847 2716195 2835155 2739637 3053963
11143 3053963 2819222 3127084 2937876 2949736 2971567 2954155 2885767 2974433 3071979 2900560
11133 2900560 3128239 3218838 3307953 3279193 2922709 2965942 3106295 3146954 3037652 3151297
11123 3151297 3010122 3264893 3516735 3054613 3360656 3181211 3239015 3057141 3129468 3249833
11113 3249833 3359120 3315921 3448099 3143386 3194799 3338123 3243522 3213435 3165360 3457837
11103 3457837 3277580 3320157 3500277 3366069 3085124 3297789 3392292 3329975 3235134 3222781
11093 3222781 3051147 3267831 3231922 3217621 3230602 2993392 3171510 3264088 3189038 3357206
11083 3357206 3208063 3323527 3087073 3310681 3114692 3252425 3201441 3214830 3244457 3216145
11073 3216145 3308716 3312109 3295916 3285108 3521653 3480244 3593652 3385759 3527188 3627892
11063 3627892 3691764 3753180 3627880 3670350 3766160 3963150 4097532 4041813 3885392 3830141
11053 3830141 3857420 4024303 3864817 4187032 4022156 4338892 4129395 4319188 4186850 4150064
11043 4150064 4243902 4557340 4359536 4438308 4409632 4690109 4652716 4736399 4942027 4982256
11033 4982256 5094158 5256242 5045342 5290759 5510480 5447626 5448779 5566982 5408621 5715668
11023 5715668 5643354 6191935 5968168 5794309 5992807 6217597 6211628 6065187 6054443 6440519
11013 6440519 6595024 7017541 6822739 6764391 7083109 7139788 7264986 7726390 7786552 7693751
11003 7693751 7996548 7985204 8156083 8355355 8405031 8302369 8622452 8565913 8383194 8644651
10993 8644651 8703663 8743784 8786452 8748536 8948279 9139407 9436036 9423409 9500782 9902154
10983 9902154 9996436 10837166 10869475 11499965 11718424 11729652 12112584 12187666 12326887 12501834
10973 12501834 12400644 12269946 12031599 12655940 12799407 13152209 12943377 13599610 14028110
10964 14028110 14367187 14876356 15450075 15480388 16092197 16510395 16634453 17227876 17621443
10955 17621443 18235082 18748928 19054942 19209633 19811735 19933574 20177769 20328825 20422924
10946 20422924 20673848 20720131 20722793 21089711 21501689 21781120 22285614 22761938 23237562 23663919
10936 23663919 24077136 24678291 25006602 25743547 26003726 26307917 26733134 26594321 27106766
10927 27106766 27037177 27291624 27495725 27888541 27647583 28036372 27934471 27959947 27829186 27816778
10917 27816778 27788107 27662138 27436567 27513033 27270346 27230920 27261176 27181838 27156622 27279541
10907 27279541 27239727 27454842 27444304 27664694 27882379 27913900 28361238 28851669 29122862 29751859
10897 29751859 30183115 30697192 31195221 31943908 33127219 34184799 35005331 36076813 37503162
10888 37503162 39265451 41117711 43131059 45295060 47570986 50184741 52693690 55359114
10880 55359114 57796423 59958321 62067171 63560755 64487841 64984596 64733064 64173514 63257641
10871 63257641 61507303 59825624 57575996 55098097 52841990 50392511 47998693 45422610
10863 45422610 42949839 40931124 38461242 36613502 34275443 32300425 30764947 28734544
10855 28734544 26908364 25480213 24153553 22503802 21299854 20222705 19393598 18050221
10847 18050221 17218128 16200444 15487686 14650259 13967847 13491955 12967778 12195395 11675840
10838 11675840 11401257 10585726 10300500 10201691 9589895 9408687 8870525 8550217 8581579 7812545
10828 7812545 7892969 7541189 7528590 7273938 6725940 6786101 6533978 6223951 6193909 6309341
10818 6309341 5989090 5945054 5871621 5614652 5338031 5443456 5354762 5462206 5341816 4928419
10808 4928419 5131671 4983852 5153023 4842170 4831968 4638801 4561534 4701005 4429791 4389301
10798 4389301 4193066 4227609 4240261 3879330 3996216 3736011 3730648 3771716 3803219 3794233 3808923
10787 3808923 3680650 3558214 3725491 3617280 3459826 3449899 3552674 3312265 3434888 3310592
10777 3310592 3282755 3056957 3360719 3128037 2781619 2886875 2945972 2754329 3001153 2958050
10767 2958050 2888952 2937385 2696542 2752171 2645903 2843312 2668615 2600550 2775006 2703046
10757 2703046 2838899 2843044 2746118 2703177 3066151 2801508 2998616 2980722 2731969 2743894
10747 2743894 2767464 2592360 2447889 2462385 2565521 2375595 2210324 2187776 2563754 2440641
10737 2440641 2416661 2373224 2370639 2222320 2319919 2426672 2618133 2290179 2419757 2468763
10727 2468763 2369571 2512696 2247320 2542255 2562097 2283981 2398421 2356428 2453603 2392756
10717 2392756 2189961 2247797 2274881 2218443 2144406 2308608 2283418 2379356 2100890 2227286
10707 2227286 2392620 2218764 2448874 2396630 2219332 2352781 2234558 2081350 2183229 2312514
10697 2312514 2243778 2410384 2349572 2397899 2399815 2256574 2237008 2295020 2313068 2526022 2302205
10686 2302205 2366223 2342768 2323445 2507438 2078155 2137525 2192935 2350769 2253400 2304641 2514221
10675 2514221 2417071 2276426 2367039 2263119 2457161 2345015 2343161 2310882 2070439 2161628
10665 2161628 2026291 1930135 2159216 2152427 2080530 2007327 2084938 2133204 1961991 1839941 2253301
10654 2253301 2351940 2187647 2177653 2148986 2217779 2258353 2389706 2141346 2297841 2022898
10644 2022898 1936794 1672557 1640477 1837925 1715537 1678973 1627624 1452001 1668947 1578580
10634 1578580 1553351 1741567 1622739 1446067 1774559 1673815 1609419 1679555 1427818 1703612
10624 1703612 1464136 1580861 1605742 1413416 1412008 1527772 1682421 1575249 1529830 1544815
10614 1544815 1561338 1367917 1195142 1456242 1598601 1595364 1634719 1709610 1321902 1795648
10604 1795648 1649335 1674872 1733778 1680690 1511828 1653119 1790102 1605626 1666884 1428154
10594 1428154 1500854 1611962 1612137 1628586 1579185 1550180 1676667 1667521 1228573 1405111 1375902
10583 1375902 1455548 1695389 1526058 1495192 1527894 1722673 1793616 1704720 1706739 1750015 1627658
10572 1627658 1751900 1390584 1691193 1602347 1800239 1703843 1741125 1671347 1296268 1681758
10562 1681758 1315549 1307916 1506419 1310126 1536636 1259660 1263008 1311577 1367855 1235933
10552 1235933 1484154 1187004 1427062 1382298 1471988 1229803 1222262 1187148 1508878 1312434
10542 1312434 1139024 1315511 1432872 1475724 1517391 1325330 1437468 1313028 1339659 1392521
10532 1392521 1433953 1085698 1416782 1280810 1532334 1544954 1480102 1434305 1372535 1353281
10522 1353281 1503440 1553550 1737298 2183172 2011227 2125548 2179031 2340985 2371159 2158061
10512 2158061 2282322 2137546 1742319 1466745 1413067 1695898 1653562 1478634 1403623 1540052
10502 1540052 1601294 1676148 1455759 1681262 1489701 1736555 1790949 1641543 1854133 2057801
10492 2057801 2020166 2225637 2490616 2387912 2372341 2280726 2353057 2520687 2301861 2247290
10482 2247290 2063685 2049316 1704277 1839252 1952088 1820817 1887149 1807316 1863166 1942785
10472 1942785 2051861 1875534 2117277 2099817 2342508 2065466 2455239 2086744 2341807 2332902
10462 2332902 2428848 2322204 2259809 2450533 2239224 2139730 2307700 2486836 2187149 2094074
10452 2094074 2130166 2060513 2244821 2417096 2016421 2000695 2206751 2078897 2328052 2172842
10442 2172842 2098019 2376311 2448458 2861222 2927190 3287892 3240067 3389971 2987287 3308883
10432 3308883 3376124 3110156 2848207 2288936 2452549 2189983 2299482 2004271 2099277 2016010
10422 2016010 2222863 2230160 2126703 2206300 2046365 2016863 1955141 2099398 2083398 2188885
10412 2188885 2233289 2388132 2714652 2776619 2988165 3102657 3031989 2939401 3030087 2874259
10402 2874259 2870668 2798126 2607283 2778939 2579376 2700437 2838795 2852724 2955013 3175149
10392 3175149 3183285 3247761 3046075 3188554 3229298 3167469 3616248 3710427 3875977 3761079
10382 3761079 3953408 3979924 4387358 4221575 4321228 4493039 4228857 4180467 4277643 4242568
10372 4242568 4067302 4339727 4236279 4298410 4148115 4320271 4198415 4349881 4473766 4474520
10362 4474520 4354402 4015672 3985725 4091677 4010878 3646032 3782079 3610979 3660539 3805976
10352 3805976 3747290 3821444 3846302 3779591 3760758 3579348 3782600 3702903 3794431 3713018 3530780
10341 3530780 3840517 3842560 3610729 4040511 4182973 3809325 4113408 4198242 4216873 3963070
10331 3963070 3845887 3945895 3806303 4022787 4010721 4025827 3961446 3890111 3699456 3939110
10321 3939110 3988442 4086987 3856732 4117457 3885130 3855111 4124173 4266406 4349225 4109653
10311 4109653 4289904 4550771 4822020 5001029 4858118 5027117 5367777 5399853 5244258 5406150
10301 5406150 5399011 5040670 5256390 5415600 5011394 5278381 5256630 5360941 5528884 5866379
10291 5866379 5851634 6143230 6385763 6757692 7070281 7317212 7368214 7651271 7958134 8513555
10281 8513555 8349964 8549118 8932980 8996306 9483693 9575777 9613347 9945808 9981529 10101962
10271 10101962 10445919 10360872 10736822 11083147 11573028 11646293 12142136 12371103 12600787 13142731
10261 13142731 13363758 13480420 13584099 13619980 13818963 13584883 13638155 13686459 13647120 13997947
10251 13997947 14153024 14398897 14488729 14441201 14462970 14638347 14262673 13992219 13691866 13407422
10241 13407422 13145525 12770973 12429448 12311030 11854622 11615762 11415034 11159076 11287783
10232 11287783 10906356 10681838 10655405 10276861 10092521 9878207 9527858 9505190 9874849 9701372
10222 9701372 9648172 9472512 9396987 9193303 9114977 8849326 8600227 8268044 8052303 7993423
10212 7993423 7666353 7309806 7004948 6842589 6587538 6295651 5969462 5793390 5653051
10203 5653051 5321473 5274667 5306749 4935522 4748924 4752109 4361097 4502729 4393595 4403363
10193 4403363 4171246 4480162 4124477 3989691 3967098 3989049 3759814 3672123 4030721 3861559
10183 3861559 3898862 3935914 3820149 3779074 3802057 3686978 3650136 3693904 3659250 3575524 3479262
10172 3479262 3611910 3213391 3292475 3411132 3170890 3255996 3240357 3214191 3139342 3084099
10162 3084099 3278747 2861546 3090254 3336015 3191247 3180315 3257043 3179168 2939370 2953368
10152 2953368 3113504 3146364 3081785 3236117 2849694 3230352 2879912 3051673 2769826 2926839
10142 2926839 2859149 2756515 2651450 2629067 2994761 2651829 2590952 2760450 2623571 2659612
10132 2659612 2817765 2574044 2613667 2843443 2410601 2559726 2338063 2531661 2292589 2294344
10122 2294344 2370917 2289770 2509412 2264898 2397234 2660938 2376936 1979946 2272108 2306792
10112 2306792 2272862 2176494 2175204 2320262 2052789 2214021 2273254 2178192 2151324 2270986 2177881
10101 2177881 2160726 2148637 1836414 2165789 2129273 2237321 2236306 2224018 2146037 2208248 2282383
10090 2282383 2288292 2132165 2233138 2018431 2224487 2184281 2162347 2225221 2195080 2020212
10080 2020212 2147002 2441174 2265719 2246121 2439132 2168034 2359985 2302104 1941589 2290809
10070 2290809 2336299 2508446 2408429 2280981 2272653 2314635 2472153 2422748 2540871 2438691
10060 2438691 2392032 2528890 2494271 2439912 2816746 2598920 2426776 2448272 2392817 2224424
10050 2224424 2345053 2530987 2614918 2434301 2614932 2781353 2330976 2252985 2529364 2519246
10040 2519246 2279488 2348849 2420515 2452408 2356295 2737713 2471225 2667672 2696965 2467545
10030 2467545 2691669 2572008 2703261 2546536 2382165 2600517 2489104 2738262 2426919
10021 2426919 2479899 2170755 2275621 2313667 2382361 2503388 2232092 2155269 2140149 2306168
10011 2306168 2211928 2374441 2406271 2186869 2321685 2160223 2132014 2062497 2176988 1898328
10001 1898328 2291971 2288762 2149492 2054263 2107661 2130990 2115683 1903696 2480723 1835171
9991 1835171 1916876 1957159 1770838 2134928 1948297 1832352 1894452 1945063 1764446 1764693 1717422
9980 1717422 1697706 1694948 1726928 1606244 1623391 1549052 1599104 1639316 1546956 1557542 1717045
9969 1717045 1626531 1622482 1246450 1560081 1379009 1481129 1406379 1437412 1198043 1401673
9959 1401673 1207464 1448313 1299866 1366404 1305251 1218724 1361090 1348357 1133753 1190738
9949 1190738 1031722 1035199 891855 1116488 1069537 1004503 1054952 1212935 1143679 945323 993371
9938 993371 1117695 1175177 1015778 854066 1130628 834558 1073055 1001067 847638 1253344
9928 1253344 1119511 776776 962921 1058599 902601 867404 985224 1114806 751114 804920
9918 804920 810483 1135040 824680 1158646 855693 814607 909495 667712 1231853 893277
9908 893277 918432 713596 1050627 1049235 972289 805104 770966 986447 984815 785489 845749
9897 845749 1113018 855327 803115 958865 672160 947319 917431 865543 821871 946614
9887 946614 1014641 661222 898796 821256 829182 979124 524276 891743 839458 1037131 834456
9876 834456 862113 876618 846635 718608 677232 1099194 782948 815405 1063239 793225 999591
9865 999591 759789 892293 846765 746842 663553 644441 855863 1051784 1111921 777609 939200
9854 939200 718676 955409 996268 866193 675509 922340 940585 912990 770747 807417
9844 807417 1056959 826527 919901 750066 855401 814986 823374 727867 975886 818710 740257
9833 740257 915582 1034873 765564 733573 758675 949346 857956 718949 1035315 1164259
9823 1164259 854810 750364 757750 685601 690399 1019263 702800 673559 730448 801694 725614
9812 725614 711525 836093 774498 849262 973794 807696 528624 792101 799922 569518 662935
9801 662935 827748 793595 764539 964787 823085 756633 618902 939595 878077 836005 750678
9790 750678 631381 651349 889153 657367 831401 944801 740677 712605 679334 936070
9780 936070 826750 878631 715417 559877 935265 779387 587288 596236 859420 541426
9770 541426 592808 701159 818403 631491 885241 772631 654370 854198 788072 855125
9760 855125 844661 707394 537924 742935 555850 798341 698279 601919 666504 775048
9750 775048 650445 599314 523395 632763 449064 637355 622267 762313 572245 727229
9740 727229 741874 628371 703991 832675 574545 584045 608254 551283 702672 723024 586493
9729 586493 511386 498039 419277 473373 292356 374247 525359 437609 408228 491691 426158
9718 426158 486349 319196 294591 721143 604346 487439 320340 568420 402966 488775
9708 488775 580133 706372 544813 615482 542782 331333 475314 329599 439061 276900
9698 276900 320027 400906 433756 165067 389481 677974 529007 455634 348320 565639
9688 565639 617325 396862 474720 464787 576295 209972 314248 481963 78703 337694 690828
9677 690828 444825 549141 535783 360700 239860 384185 489006 678020 480992 463257
9667 463257 589179 255638 226399 673783 478117 494970 377196 419933 396884 404674 430171
9656 430171 382259 421481 455539 384051 445152 244923 275211 242579 356206 449957 558690
9645 558690 489153 337209 377402 510015 520456 631887 490670 448988 613073 460753
9635 460753 285305 352590 385827 340259 377636 352369 405177 609352 182528 388984 480734
9624 480734 304327 510569 325508 358419 393780 338517 356206 297881 503452 424613 225109
9613 225109 451594 375266 137580 535952 291865 370182 386033 379536 419409 394687 403038
9602 403038 406593 430922 421917 505996 346803 445908 543595 630116 271722 493665 253372
9591 253372 276013 93779 357814 390807 413283 506307 558617 364310 546683 337353 322084
9580 322084 463138 529797 448219 278410 518158 397152 417643 366192 446107 260803 519157
9569 519157 417677 419199 276297 481308 398371 225257 447579 611524 449788 344750
9559 344750 615015 460950 357732 162095 379462 465599 202459 252008 461048 493133
9549 493133 639316 335181 315666 480810 265745 302544 513105 301693 537237 346417
9539 346417 470185 328993 481027 422572 398568 349649 270791 635167 403159 250273
9529 250273 237435 315886 304391 379847 446543 174172 360593 307416 490367 22364 383937
9518 383937 445357 312871 542155 357528 175803 382927 387084 430264 381259 408905 250118
9507 250118 280311 418399 343037 209643 305209 114162 415690 210220 304488 410509
9497 410509 384742 428166 146253 405223 165803 198050 243629 280359 297538 194963 452637
9486 452637 432702 127345 403612 447570 383338 321426 269488 300379 299291 407725 234359
9475 234359 135150 113299 170787 412145 201290 549462 329260 365086 308755 233830 92220
9463 405979 281533 282866 286111 171589 311448 211428 357921 535734 325610 197211
9453 197211 214580 162053 289380 84433 491753 255991 401601 196699 367149 381308
9443 381308 315061 223778 260280 293847 169896 468432 403892 452553 315115 393193 54285
9431 438867 243676 269624 163165 260476 118413 384154 402523 326324 400478 404635 279620
9420 279620 214112 62769 463450 73250 511071 81679 363073 86281 335415 -36831 347698
9408 51515 198799 303771 337006 158773 297581 64182 156214 70895 14583 171160 71475
9396 259020 155848 135051 541097 248314 80605 294936 292475 194221 270573 220170 298278
9385 298278 188125 87340 236682 342861 372984 258621 165128 248125 258912 81056 63919
9374 63919 188174 133120 202156 373565 184359 105483 -81400 218248 360132 76661 283030
9363 283030 200644 476695 216801 233299 193108 363633 387256 407891 87710 194835 375271
9352 375271 8350 194148 229855 286123 260241 67154 148378 203510 157109 183540 9642 99022
9340 99022 336372 231322 113040 228953 72176 166823 114806 357400 76235 10449 205548
9329 205548 218117 394562 267432 89824 240567 64622 67875 503614 251782 119653 295924
9318 295924 270319 71862 203349 130482 444909 144466 322063 164555 170812 -5502 248538
9306 111295 247179 283453 299299 232184 218740 477034 293063 248599 173577 54284 289184
9295 289184 277314 524433 304354 305793 279160 252395 482975 137884 59498 285180 218067
9284 218067 185375 281424 182793 -18342 52750 152976 76393 271643 228830 140685 75734
9273 75734 107334 11464 186156 349586 259891 155010 -87563 194703 181898 120028 221312
9262 221312 182025 207883 17492 183666 246472 286225 92474 72000 219190 434905 54330
9250 188101 184190 11871 195701 70790 163107 197919 238156 293734 114000 -94160 182191
9238 -43154 240141 10481 275427 130805 221523 160228 120119 105653 108900 81750 271744
9227 271744 191568 238983 314089 327854 198243 185107 104020 247185 58286 181001 186339
9216 186339 255452 209755 205437 50701 18577 166384 40614 11808 292147 420361 190833
9204 312243 224810 379436 -40288 221795 299121 322510 157446 40072 69731 57038 514526
9193 514526 152693 160628 63980 -2575 244383 378493 150260 224756 115715 98898 274012
9182 274012 82971 166987 66809 42092 258171 66338 9722 355075 160426 380556 207152
9171 207152 -22752 160781 -45366 228367 240813 346468 161311 63396 -19192 295382 399675
9160 399675 236819 -36777 153965 125292 317450 427660 259337 287965 246010 257440 399231
9149 399231 477939 318891 72441 235592 117119 193698 113927 199877 362643 376414 308607
9138 308607 262939 310755 203875 166046 230658 221289 170907 -68683 356073 -97162 110741
9126 233472 386793 141743 254773 250659 310405 144129 159639 190788 147839 133056 67425
9115 67425 203995 128843 268301 58778 198441 361764 213381 24786 185024 210420 168178
9104 168178 202286 35492 255092 452261 385230 284633 248543 406399 248202 136711
9094 136711 366649 286202 -163281 240858 253358 83200 174293 200151 205852 268590 14346
9082 205112 212837 175684 284255 190559 146493 159541 228622 207558 268821 142487 226818
9071 226818 226819 285278 445679 -75398 131759 304119 23009 519162 226090 280007 284686 302387
9059 302387 207240 266588 264856 149114 -997 28342 267716 207446 81429 65798 -41882 420671
9046 19612 373820 166468 -59387 105545 124828 146433 245595 405578 371934 -29812 132866
9034 17027 211153 129803 212367 302695 166820 70055 -69093 -49670 19428 210149 306860
9023 306860 -39819 187983 172600 126612 219941 214822 107307 296292 105322 107360 304153
9012 304153 191665 132337 89265 59557 94750 240833 178865 111725 1551 186328 87479
9000 131365 -97992 103738 281471 383044 101584 289326 292672 -81605 151579 450590
8990 450590 192634 139057 -86932 120015 162919 -3018 -1410 60540 208176 40648 326216
8979 326216 143305 257278 152833 2049 43621 143639 178955 222651 6940 374252 150020
8967 220957 92840 170903 57406 269723 120819 140475 75701 414937 333501 118475 125472
8956 125472 -101356 110370 372997 207300 230111 75930 296026 89853 264984 60071
8945 100753 284532 211203 296175 138643 232019 119714 180109 -38899 227478 -32325 246667
8933 167791 331852 71917 254433 373482 249926 417487 264644 235408 258128 272139
8923 272139 134947 401971 204721 249125 357844 381045 62317 314787 243001 127721
8913 127721 414082 398533 352054 245899 145771 167147 201306 431738 478174 155355 380783
8902 380783 239851 383173 451739 230476 512311 372117 471412 277284 427057 473268
8892 473268 307901 233705 565022 392366 680857 535988 301322 614003 359648 754008
8882 754008 394999 617632 566333 442583 518183 693233 460214 665352 473590 488991
8872 488991 548064 788466 551806 457211 319227 300915 379787 446271 507628 449386 375222
8861 375222 543333 442557 519207 475762 456181 295784 392373 401306 742516 476809 251086
8850 251086 460245 217679 440477 326335 497169 246840 318838 373321 470802 412626
8840 412626 230959 163701 293161 388876 255477 474783 455496 209939 161578 155809 258614
8829 258614 320186 160921 318779 438157 324383 280361 199017 225987 350322 -29570 269670
8817 198791 190467 310368 55056 225229 142640 120547 479991 181983 219383 241496 -21651
8805 122902 405494 70926 -78156 335532 240404 325518 99365 75352 214934 254659 285133
8794 285133 247022 99312 196619 230852 107569 272817 230877 93183 73950 98155 65345
8783 65345 -60544 179038 -38112 326183 109167 110012 432342 8882 -61027 148070 417231
8772 417231 271486 318644 70138 273044 170180 386905 402430 310957 118759 -9263 228601
8760 118121 184256 320342 300962 -19638 208328 225120 9056 442045 248069 133123 182518
8749 182518 78727 139152 203249 340573 72715 127091 58476 -67525 17452 41004 221612
8738 221612 -48830 218583 287491 167806 62269 174287 279410 113121 135280 160943 131380
8727 131380 -548 44826 -111124 223721 -146193 145584 -21086 84680 -83166 38885 -117621
8715 103167 30162 433903 240219 -15416 212962 1000 184635 59726 71875 81726 137711
8704 137711 176320 473753 100153 197375 126019 -2362 -37640 -17808 398000 6210 294869
8693 294869 -118356 67002 244003 314492 307415 193169 279624 -60246 114994 164066 188932
8682 188932 32318 144416 -42640 253215 96606 242350 76458 391401 198002 150660 68586
8670 312421 59643 213764 -34660 132798 26187 35321 326291 141134 399706 127351 -11653
8658 -144794 -78733 53739 112786 310120 -3507 321336 28943 68131 127923 -58330 165048
8646 164400 35248 162257 24184 377072 241670 261763 -15103 62509 189549 214147 15600
8634 167773 18151 321622 -7077 -11564 265654 227090 18931 305846 106590 31847 226116
8623 226116 282049 114950 3421 140772 -14783 45243 137385 135823 -27446 230014 94265
8611 80309 225589 129093 223036 220625 143876 94340 221557 143224 66430 85479 385717
8600 385717 327675 86633 24898 211871 150409 110379 258599 24698 105758 68458 196747
8589 196747 223334 268431 208435 142595 45810 131128 271475 65290 -122670 212129 295855
8578 295855 107720 -27079 -3880 205632 249296 269198 -86564 491364 326593 255478 187910
8567 187910 99223 166363 220930 148729 151897 13004 74031 111305 67510 98546 64482 21752
8554 204939 331503 163095 294730 147152 107098 36689 129044 27880 358673 -70497 -15656
8542 -53522 36270 297555 5894 143936 184932 123022 121758 34933 226420 191954 -19628 86183
8529 100318 45000 215866 168882 54 75481 154961 36232 44327 166464 199401 91314 94248
8517 94248 60954 42862 211035 377397 -151297 -116853 95174 249150 -141952 23914 -20275
8505 11856 -110310 -29081 -87869 -96585 37269 66941 31502 -2100 86709 262408 -190884 18727
8492 100678 141059 247394 277733 199724 101932 391691 288353 271803 101393 167386 202984
8481 202984 80535 171698 138887 -201353 117460 85995 252666 7801 -136719 187575 -56425
8469 191940 237985 36560 119101 92983 23927 -34928 69380 78507 -78233 3545 -96077 -28967
8456 55543 13730 -33911 85989 298956 18740 20097 248602 355968 139904 -147642 -34996
8444 195174 82680 114333 268948 6440 44509 123616 124741 180080 9236 78151 220374 8478
8431 -181960 168768 130224 -41013 68240 211190 149317 15608 159414 202630 117293 208472
8420 208472 51083 155181 -86211 127624 136578 -29660 215949 238776 174263 293452 136585
8408 -79254 131776 -17378 -124406 77556 -4102 91405 185748 159566 -121991 313189 312823 32892
8395 -11328 169809 81773 249948 162925 169591 100872 85158 208093 -9826 120000 193394
8384 193394 246301 -45720 240918 215612 234891 -15887 247111 171424 127313 295687 55747
8372 14527 172005 196057 115322 363096 129175 310418 82868 60238 164453 273572 239457
8361 239457 358224 141604 92965 -2930 -64496 224041 189910 148163 -87009 365863 89528
8349 172135 192779 181022 158162 -130365 98760 -32734 200053 150006 11190 -74942 52907
8337 112320 190503 286469 328867 290100 247558 194178 138171 -56288 189258 342953 260793
8326 260793 81258 26035 376180 147822 238250 170636 -136571 -81213 -198530 203845 110402
8315 110402 145061 7723 362077 -71589 257208 97015 37191 61273 193649 292727 157306
8304 157306 15110 -56290 144558 104949 267822 244421 122512 256447 137154 22174 -50032
8292 -34491 176928 126135 -15360 25997 -81044 168979 26889 176709 128150 -40163 237783
8280 -31542 283525 88670 -12246 240092 78096 238300 29003 245120 135041 341619 278399
8269 278399 72640 -26424 44799 250696 86379 169535 55415 206999 -155114 -59110 321353
8257 -27666 143138 144451 103116 179873 244710 343551 -77666 16799 -96992 292335 20815 55456
8245 55456 73300 105540 134536 130925 9022 83473 123034 257418 227176 -59767 98962 -75561
8232 101982 132037 2069 244139 172069 115944 158092 -177025 212188 105043 -20048 162242
8220 -58887 -76812 31369 227811 312543 218157 168064 76941 380536 84712 93310 -37346 240295
8207 29096 164552 117842 21250 99358 297685 157861 182418 281768 73318 -70963 -132360
8196 -132360 90642 95664 20732 366259 -39073 302113 224447 -139237 139075 229664 -25181
8184 314428 139099 185014 64384 -12823 51254 274355 -161013 -109524 114908 58958 389
8172 46126 -7276 99175 196604 -72067 -20301 89171 209558 206016 279538 245147 193805 -14269
8159 87694 8091 181987 104579 272681 94710 108324 -49461 254340 98243 237881 149743
8148 149743 109747 59071 138780 15452 175978 110842 258262 138438 90593 137096 58843
8136 67224 312642 196320 203903 -81089 265767 -26348 -107016 85980 -104809 164224 155499
8125 155499 290411 179641 80441 -55953 85908 353500 2320 399947 130951 187026 116942
8114 116942 120224 88083 89422 265713 -96211 -1107 117367 175112 108894 195970 10150 204303
8102 204303 152694 -39610 89608 195859 110862 153620 4243 214999 146627 61820 -69371
8090 156278 175991 82334 234784 188968 195761 -72069 17952 -1873 194137 19947 106576 188852
8078 188852 143461 72065 -41293 115317 245802 107276 7682 65602 93702 -4652 35042
8066 56461 116519 115823 91412 118057 192632 19114 310336 303954 115124 -38912 125959 123990
8054 123990 195698 195991 396552 126431 402610 75244 -72657 115210 149184 205603 277533
8043 277533 -189670 170387 155926 -20109 117307 320072 187013 99838 60907 98284 139148
8032 139148 215028 -2458 -86037 72438 52512 137693 234381 191044 33850 31256 -32481 -201716
8020 -201716 49520 287504 274275 -98967 -78763 -107789 46732 80881 84157 169942 281888
8009 281888 152292 235686 177264 13631 66644 66684 82566 84407 65548 285091 65108 187290
7997 187290 236749 175856 50564 51705 66401 -42997 177237 214161 3107 144812 53133 -16683
7984 353813 287621 222197 166683 352398 286013 103229 36546 -146316 -265919 57834 111773
7973 111773 91073 160701 56122 47955 94092 138458 146181 -2705 110367 59671 97346 96121
7961 96121 118456 34359 -3920 -48490 260455 162515 178543 103211 -16822 58815 93044 134742
7949 134742 66205 -201092 181008 100031 81981 -141137 50944 -152448 112893 33863 487641
7938 487641 155714 105041 -10982 -120384 -126770 210357 71214 31692 139081 359658 -150524
7926 368852 154819 419858 159551 38472 349404 69605 27938 137115 26272 112673 175463
7915 175463 9844 44101 75057 245313 241363 87989 196648 227875 -99979 120447 68022
7904 68022 29185 98117 108895 100209 266282 221476 67064 223252 76529 56952 140217 -130848
7891 -2337 314766 65156 50483 83789 182115 109889 80410 117204 -34222 2928 249605 2814
7878 272735 -207208 17279 -207857 -150735 -44595 144347 258966 149221 106307 278982
7868 278982 194310 361276 139951 -60172 274781 -8947 125157 -175015 12895 70343 73412
7857 73412 -15385 113954 63008 74154 -26337 176848 50228 263035 154036 29270 82433
7846 82433 95404 37817 2438 223139 302958 32225 -56064 195750 79631 122213 79224 126448
7834 126448 349975 -36747 39150 121990 155657 31839 251093 88330 202812 -31969 284491
7822 285401 -113647 141415 220382 75300 214565 90255 -8875 13538 438441 -22990 -141856
7811 -141856 -28802 186275 151521 90894 120560 8373 41436 2300 287790 95187 145694 -53920
7798 -22131 9995 182362 303689 149644 7437 118342 197006 121936 115125 10089 -29615 -100661
7786 -100661 9555 40965 28074 158714 304600 135178 -13435 225361 142681 191102 124449
7775 124449 122063 -26735 -216665 186098 73495 12726 -98561 32396 313169 3880 -11233
7763 131762 134593 131441 109554 -62073 64715 245716 149989 -88026 -63695 78286 -86504 -123979
7751 -123979 -47146 123600 356570 8454 -205877 99957 183847 45272 117858 120951 159186
7740 159186 322424 80926 -220270 56068 297335 55982 231100 177966 108389 -33588 203160
7728 177887 70723 18858 209372 13103 218714 27095 51726 -17793 -65870 252837 65066
7716 131301 -7424 -46404 -98536 192600 122950 157585 271053 -123022 287525 142609 83308
7705 83308 117212 209309 173714 -90868 59257 -26380 108019 -126581 170296 209710 -62507
7693 -74447 78696 248042 171273 -46661 137400 -364860 -162303 112627 105427 117415 63431
7682 63431 -73509 2859 14561 -97229 -9647 32921 123640 82103 7852 110216 64677 204585
7670 204585 45202 319462 -18894 153765 -104819 162317 178508 -55162 43876 -112504 -40851
7658 61065 -1713 47684 59339 -39883 60196 11545 61415 78634 -11093 219818 76199 -148859
7645 127845 -100812 118803 98411 90436 126311 86312 -106709 71890 54252 151891 -10272
7633 21456 313585 11728 77917 108464 134877 149161 94504 77109 -43944 44371 47183 27420
7621 27420 34599 -136442 152439 109311 9918 -78673 197773 225895 158805 106648 83890 237143
7609 237143 253207 -202050 -226123 19 155345 70634 -44137 42068 -106938 52073 5105 -155279
7596 34092 177360 247427 262984 -122758 107821 -103337 145301 -2515 296865 -37795 31958
7584 64844 123196 140652 -37474 145529 88220 387 29472 38865 64534 183932 269943 -154121
7571 -140623 317161 67257 76084 -158526 231218 66080 -69419 -1867 23749 147474 -9025
7559 -127964 80628 115532 64363 92845 55956 -4067 -212919 39012 42785 91381 117021 166461
7547 166461 -75862 281205 1225 -31256 -112441 211036 -70503 -58681 77862 141003 78099
7536 78099 191750 239415 -50583 160294 10657 171479 188231 219174 32198 67211 4932
7524 131748 45672 123732 -80126 112664 -75906 183939 104882 123394 143968 158813 -130119
7512 155818 3668 -122943 306037 -74701 76793 -29433 32897 127197 -50115 -77598 -88360
7501 -88360 123723 248293 45577 197848 -85679 33438 102800 -23047 191492 241734 62469
7489 -20844 52379 36029 -19346 -22237 -134076 -84175 138094 120784 -35429 18396 239733
7478 239733 182707 255393 -18461 162820 227899 -155208 -50685 108393 88675 -16223 269857
7466 54781 -161931 406231 173072 7746 111079 -76139 193086 108001 35484 -36931 226155
7454 -41040 286762 85905 9965 228398 -43897 700 125548 302214 274672 4358 274772 43339
7441 13245 -21752 -179486 284923 -17494 31241 -3814 122719 237494 -108430 244377 -11625
7429 304969 309442 48675 242345 -108542 -42555 -124522 449441 109770 -440 84130 71544
7418 71544 53604 -20582 -23180 66805 -1971 15400 -8901 27554 -12597 -822 122497 -46124 195702
7404 46553 42557 -58445 308322 -21480 -14299 196358 176223 119182 -180164 26273 -1450 117364
7391 380410 88130 213136 -89002 -71325 -62483 -121639 221135 10134 86700 170190 195410
7380 195410 -53902 -159596 90521 88449 -25694 40694 -96442 -120228 -16276 189345 137060
7369 137060 -234186 31594 30754 69404 -50941 70380 13721 152470 62581 -77775 187865
7357 180573 254284 75014 158311 7402 302540 -106959 118677 68032 183272 893 244704
7346 244704 227226 -7267 68699 164332 151993 180599 3808 192699 125819 34931 160798 77901
7333 6657 187504 75389 -60142 -85686 -98187 61336 152291 -2921 54943 87622 69057 202666
7321 202666 14200 135915 -382456 -41406 -76287 56760 -65442 111984 290448 159970 189300
7310 189300 102241 112134 -90847 8915 70498 -124592 246602 165817 152114 32076 -3343 -86664
7298 -86664 193990 135996 -104585 -11755 137500 198946 -311050 10277 83844 175235 78183
7286 30924 394468 86204 -111851 39315 37877 167816 -17718 156880 245973 -87035 98235
7274 133707 47501 302304 149187 193967 71923 4411 -34963 90228 276331 46389 139801
7263 139801 98132 -41082 208379 -225665 -117670 -91088 147036 63456 72141 -98709 94064
7251 87076 147978 -54518 269162 -237371 -34377 105388 165763 -10207 -9526 272832 320296
7240 320296 -105230 191974 165095 114438 135120 -27116 200098 53031 116668 -36623 262562
7228 286883 41848 40494 197857 277294 108185 -30119 212610 157456 33107 17705 71901
7217 71901 31473 -50549 156500 -188768 110837 100672 211869 128135 203727 55376 -42297
7205 -96411 121073 72449 -42408 65609 134920 202143 -33831 230999 73527 83012 -18361 188159
7192 -36004 46061 37206 64117 -116672 10279 68470 21774 134673 63889 -5243 56546 272235
7180 272235 126520 55646 -67486 218820 -97130 -43352 -20677 -7561 21276 112414 -152508
7168 -199431 -55078 -81908 164167 -65047 113067 -116905 1066 161765 270898 -167549 170240
7156 159095 -109646 257191 31751 205173 -184371 -14562 159761 105223 161421 184585 101830
7145 101830 -160465 51200 -203341 -12456 235238 57879 27315 84669 117981 318782 -90753
7133 -221655 -88979 21191 52677 50106 -48475 147379 163180 -107684 96750 108971 33515
7121 174921 209623 -105277 -122487 -42484 258934 134868 -4060 -20434 -47204 118806 -164428
7109 97176 -184349 40875 -173961 92696 275026 28441 15811 -68534 -61490 85951 -180016
7097 -60723 30738 74876 140657 105786 29880 225237 235717 5477 -48865 -63583 61939 149486
7085 149486 24007 -28954 -27485 7560 115795 -221269 73476 -152511 28 244520 -19450 140532
7072 93746 158237 214293 27939 153406 188759 328604 96228 176664 154668 -172623 130067
7060 46596 147674 181229 37664 275366 -29009 -49984 -184567 216810 47769 -77577 -3011
7048 175679 187048 134609 -18433 -22491 21218 71661 -49926 44589 4923 183407 -8967 75037
7035 118686 189611 83512 167884 -10679 113117 147890 204885 53949 -116569 -85437 179228
7023 84739 174083 -53828 -46068 217612 150530 -176950 61035 33747 -21871 51213 -22524 210454
7010 90241 62071 121563 286014 194683 -81245 88477 33308 126357 29495 -136636 -247727
6999 -247727 108545 120659 -18497 -30391 79961 211928 171989 50783 102164 160352 50224
6987 12532 -12022 -15885 65277 68098 15390 -25997 142838 -171503 -19802 148666 203388 -52434
6974 29535 262720 -35132 45678 19062 350714 -84876 147140 227625 58948 -80545 72720
6962 125750 236436 119388 117003 76958 -23616 217776 99102 -123049 65407 -4791 296299
6950 -64096 10547 -63934 138299 181505 97989 27627 -236935 -27470 -40997 36467 -205618
6938 -28380 -51542 91169 52183 -19669 135009 -26307 100201 -41130 44223 40251 123416 102088
6926 102088 -181951 162378 -19141 -28234 -432401 -56174 60637 -264809 214478 730 103014
6915 103014 105388 200777 -28406 -6639 91532 155791 216450 39697 133635 184314 -40696 83323
6902 46386 167856 210725 34586 50940 27261 71524 193646 14977 20785 -12229 36489 -37740
6889 -121767 179950 191432 19440 138994 53970 62795 -69407 51284 -56774 45097 -164914
6877 -20110 62606 -137549 -52840 226645 -152336 71529 -2294 130372 -126105 87869 -36018
6865 -146596 64341 155439 38483 -125650 -71430 12662 93264 -119603 134124 172547 223965
6854 223965 142661 77820 -33633 99941 53481 -42023 95904 54772 130223 339290 100884
6842 195261 89372 126048 61619 -191980 154225 6709 -74151 84113 36385 -92880 -134560
6831 -134560 4608 15988 -52593 125344 -88713 152618 -37239 57166 153388 151572 200450 199295
6819 199295 -9243 1309 9895 232349 -24075 242254 -83192 382868 182300 75242 36890
6807 124494 -16501 -11208 199428 -38892 142954 100739 24167 -68954 170416 218509 -141355
6795 115807 245299 -20762 -58314 26124 6531 247646 -61485 -53544 68537 139842 -64324 -81850
6783 -81850 -19965 206226 -151734 -53175 235950 27491 132853 172392 110349 -26529 -131448
6772 -131448 -164098 42309 226831 42615 -78185 -47502 232993 57097 190433 362703 176019
6760 201361 78050 110424 162727 206435 -98324 -33598 245292 -41245 102146 129353 46997
6748 9109 84113 -82421 43747 111138 -23424 32458 236295 219629 73541 197733 167008 13657
6735 3983 223942 -221395 96103 291208 184282 85431 66410 140315 113548 1256 83211
6724 83211 61601 121401 150477 104252 196668 -48692 -4797 227692 -116567 30182 -106760
6712 285476 -14054 -61976 48124 91982 -18910 -39226 -61600 30203 198055 107578 -19022
6700 18740 170875 -60032 212713 182244 -74166 -66045 224141 -61310 -113019 22973 161870
6689 161870 5884 12245 -101182 -10780 87413 156343 247504 38382 -67428 -12151 -48009 -98389
6677 -98389 66083 -26728 41422 3174 90007 -22416 148248 21752 73195 155212 -4116 86037
6664 194137 50940 87201 152800 186920 17440 99779 53927 19856 -44938 135743 164441
6653 164441 -163779 -60702 23566 53306 110870 17629 -25452 -75843 75856 182929 81571
6641 -50571 246724 -24237 58372 183422 -25607 198817 -25004 -25582 -16375 126613 183535 -131318
6628 -114068 125343 123672 114862 -143625 -147499 156707 74347 10063 -120496 -65848 111796
6616 84208 57852 138632 226514 -103046 108747 263566 8671 -46321 5761 201391 165193
6605 165193 146776 96556 -67351 -119713 -130311 189653 -7618 -13037 62284 -198052 120867
6593 -71218 38181 -60915 -36617 144267 -43502 -18007 -149357 -106826 -54408 -177265 18241
6581 10809 -109498 68902 283342 26658 174597 -17003 85641 90693 69273 -15961 176075
6569 -63147 236593 142149 47191 65261 46664 6383 -10371 16877 110887 -43666 108638 189642
6557 189642 203597 113842 118318 142760 -16042 -72570 120494 142502 199301 -88777 94742 98111
6545 98111 108735 -253520 -19897 260362 -79588 52216 -142053 131655 -40604 -4784 -125944
6534 -125944 60199 -90720 -139396 128085 219649 88973 28948 36863 98854 7645 -8911 35825
6521 141943 -52939 150120 35052 121879 57975 -95997 132329 -101032 205516 -105609 60141
6509 318 148196 132784 -38219 144349 84083 -68315 -28566 39268 -40390 54858 149866 164238
6497 164238 -280500 47611 -3501 -16232 4328 193285 69285 14978 41177 -11253 120526
6485 5052 -36044 -80908 343044 86237 65013 66361 62488 -19665 -54151 -127596 69907 66970
6473 66970 314678 122193 -2488 105706 96615 22665 -78947 111390 -1470 -80872 35641 -103315
6460 30640 48275 -53686 189952 -134273 23645 158810 98558 122871 -92222 11467 -12336
6448 296260 105997 212048 41295 218210 47482 -234106 5234 110808 122819 -27982 -33441
6437 -33441 53217 37967 60291 198306 -19016 128779 213525 22260 166157 -232615 -142296
6426 -142296 156976 -141176 114771 86630 260156 49780 266432 29938 -15366 106543
6415 -130285 327582 321132 94553 -22524 -13166 64773 64420 17056 17042 210775 69663 -37638 137006
6401 -130702 -174549 165934 34143 153331 242722 -45764 110716 292640 -105963 -70929 -217221
6390 -217221 165231 195562 -107894 73170 -29987 118974 -62467 -60034 254303 73677 -46555
6378 63164 124870 -127593 562440 130607 253921 171585 -25438 -89801 -6716 312823 108273
6366 -97027 -101946 41338 -157304 -192626 8321 -103920 367020 -15870 86192 -230575 -256286
6355 -256286 242790 -64483 72821 133176 -18750 -88286 -167006 7938 -75492 54929 124194 -173478
6342 -54501 -65117 80638 -71007 133853 -24036 -41076 28748 152211 43245 -43196 -98511
6331 -98511 9188 41285 48353 69239 -34931 26917 185504 68890 -33020 108531 94106 -113377
6318 211653 255471 -8441 -159471 116267 -36377 -182183 198511 -52596 181675 -76269 60223
6306 27411 -196587 153340 -173819 -23080 -220443 -1260 322496 -65804 -162732 71252 -216769
6294 116452 -143624 -80114 -124242 62545 83124 200633 -73875 -1492 -51320 -76627 74118
6282 -126323 -14271 -233497 -125347 101955 -25373 -72436 87676 70923 -10474 41159 -97083
6270 -101236 76707 -60907 -17920 -107260 10963 -63624 68790 73553 -134120 119444 -103166
6258 6217 -130094 -34539 -125033 -96564 -95579 -13285 173413 79666 -144923 59833 -137537 24488
6245 162305 5282 137812 205422 189599 101948 168388 37224 13837 152419 85526 -17831
6233 9319 192316 -21812 42814 283026 48850 -88801 203777 117578 -259598 2392 41224
6222 41224 158676 151378 162104 116844 278268 104435 -96944 243609 -241228 -21578 164045
6210 172724 136931 141902 -24116 46624 -224947 -23671 -83726 -61944 35199 156366 141538
6199 141538 71733 -119207 344511 -124165 180876 119246 162717 -52 205320 -43325 84120
6187 -68276 -107750 125969 72965 68253 44195 -50027 12828 -9124 -163504 93812 301993 209836
6175 209836 -48389 -91388 48368 -181995 116215 -142471 -174686 9874 70541 -49027 -29283
6164 -29283 71262 -59895 96983 48393 108566 -222201 320313 157785 89599 -111326 222304
6152 -91535 263024 256667 101898 51474 -119580 45557 21290 87110 93162 130091 89874 108258
6140 108258 -9836 -55094 177659 -164179 77967 245654 -18624 -19542 4794 208176 62252 -61454
6127 138456 127749 -124349 -9122 66027 -1916 80365 79677 139571 4072 72648 -30639 -107856
6115 -107856 305533 87260 9960 66001 193084 14236 -34817 -87745 158399 -58 126894 -115969
6102 101156 -197434 56454 235531 222142 51187 -65130 95759 71907 94517 139453 111737
6091 111737 131663 120467 78562 103778 -1027 -130601 -4218 72701 -15965 -82705 -7098 112222
$$ [...]
##END NTUPLES=NMR SPECTRUM
##END=
