##TITLE=Coffee green (M2-ROVE90 + 1.5mL buffer 50/50,  450uL extracto + 50uL (D2O+TMS))
without heating, vortex and centrifuged, temperature 0oC.
##JCAMPDX= 6.0         $$ Bruker NMR JCAMP-DX V2.0
##DATA TYPE= NMR SPECTRUM
##DATA CLASS= NTUPLES
##ORIGIN= Bruker BioSpin GmbH
##OWNER= Administrator
$$ 1.72 TOPSPIN		Version 2.1
$$ 2012-05-22 16:16:58.278 -0700  Administrator@X
$$ Compression mode = diff/dup
##.OBSERVE FREQUENCY= 400.131882
##.OBSERVE NUCLEUS= ^1H
##.ACQUISITION MODE= SIMULTANEOUS (DQD)
##.ACQUISITION SCHEME= undefined
##.AVERAGES= 64
##.DIGITISER RES= 22
##SPECTROMETER/DATA SYSTEM= spect
##.PULSE SEQUENCE= noesygppr1d
##.SOLVENT NAME= H2O+D2O
##.SHIFT REFERENCE= INTERNAL, H2O+D2O, 1, 14.97974
##AUDIT TRAIL= $$ (NUMBER, WHEN, WHO, WHERE, PROCESS, VERSION, WHAT)
$$ ##TITLE= Audit trail, TOPSPIN		Version 2.1
$$ ##JCAMPDX= 5.01
$$ ##ORIGIN= Bruker BioSpin GmbH
$$ ##OWNER= Administrator
$$ $$ C:\Bruker\TOPSPIN/data/jwist/nmr/11-coffee-green-quantification-2/331/pdata/1/auditp.txt
$$ ##AUDIT TRAIL=  $$ (NUMBER, WHEN, WHO, WHERE, PROCESS, VERSION, WHAT)
(   1,<2011-11-18 16:13:21.044 -0500>,<Administrator>,<TOPSPIN>,<go>,<TOPSPIN 2.1>,
      <created by zg
	started at 2011-11-18 16:04:26.513 -0500,
	POWCHK enabled, PULCHK disabled,
       configuration hash MD5:
       DA 63 81 1B EF 4C B5 72 B4 DF EA D9 B4 DB 4C 08
       data hash MD5: 64K
       EC D2 6F EC 98 49 62 7A 82 79 4A FD 6A 1C CA 4F>)
(   2,<2011-11-18 16:14:04.247 -0500>,<Administrator>,<TOPSPIN>,<proc1d>,<TOPSPIN 2.1>,
      <Start of raw data processing
       efp LB = 0 FT_mod = 6 PKNL = 1 PHC0 = 0 PHC1 = 0 SI = 32K 
       data hash MD5: 32K
       6F ED F9 39 CF 07 0C DF BA A9 81 51 94 E4 92 76>)
(   3,<2011-11-18 16:14:04.622 -0500>,<Administrator>,<TOPSPIN>,<proc1d>,<TOPSPIN 2.1>,
      <pk PHC0 = 24.79614 PHC1 = 0 
       data hash MD5: 32K
       09 96 77 6F 7C 96 DD B0 70 19 CF B0 82 DE 78 C0>)
$$ ##END=
$$ 
$$ $$ hash MD5
$$ $$ 09 83 72 4E C9 8A E4 75 09 A3 E9 B7 49 49 F1 7C
##$RELAX= 
##$RELAX= 
##$RELAX= 
##$RELAX= 
##$RELAX= 
$$ Bruker specific parameters
$$ --------------------------
##$DU= <Z:>
##$EXPNO= 331
##$NAME= <11-coffee-green-quantification-2>
##$PROCNO= 1
##$TYPE= <nmr>
##$USER= <jwist>
##$ACQT0= -8.18377267260997
##$AMP= (0..31)
100 100 100 100 100 100 100 100 100 100 100 100 100 100 100 100 100 100
100 100 100 100 100 100 100 100 100 100 100 100 100 100
##$ANAVPT= -1
##$AQSEQ= 0
##$AQ_mod= 3
##$AUNM= <au_prof>
##$AUTOPOS= <>
##$BF1= 400.13
##$BF2= 400.13
##$BF3= 400.13
##$BF4= 400.13
##$BF5= 400.13
##$BF6= 400.13
##$BF7= 400.13
##$BF8= 400.13
##$BYTORDA= 0
##$CFDGTYP= 0
##$CFRGTYP= 9
##$CHEMSTR= <none>
##$CNST= (0..63)
1 1 145 1 1 1 1 1 1 1 1 1 1 1 1 1 1 1 1 1 1 1 1 1 1 1 1 1 1 1 1 1 1 1 1
1 1 1 1 1 1 1 1 1 1 1 1 1 1 1 1 1 1 1 1 1 1 1 1 1 1 1 1 1
##$CPDPRG= <>
##$CPDPRG1= <>
##$CPDPRG2= <>
##$CPDPRG3= <>
##$CPDPRG4= <mlev>
##$CPDPRG5= <mlev>
##$CPDPRG6= <mlev>
##$CPDPRG7= <mlev>
##$CPDPRG8= <mlev>
##$CPDPRGB= <>
##$CPDPRGT= <>
##$D= (0..63)
$$ [...]
##$TP= (0..7)
150 150 150 150 150 150 150 150
##$TP07= 0
##$TPNAME0= <>
##$TPNAME1= <>
##$TPNAME2= <>
##$TPNAME3= <>
##$TPNAME4= <>
##$TPNAME5= <>
##$TPNAME6= <>
##$TPNAME7= <>
##$TPOAL= (0..7)
0.5 0.5 0.5 0.5 0.5 0.5 0.5 0.5
##$TPOFFS= (0..7)
0 0 0 0 0 0 0 0
##$TUNHIN= 0
##$TUNHOUT= 0
##$TUNXOUT= 0
##$USERA1= <user>
##$USERA2= <user>
##$USERA3= <user>
##$USERA4= <user>
##$USERA5= <user>
##$V9= 5
##$VALIST= <valist>
##$VCLIST= <CCCCCCCCCCCCCCC>
##$VD= 0
##$VDLIST= <DDDDDDDDDDDDDDD>
##$VPLIST= <PPPPPPPPPPPPPPP>
##$VTLIST= <TTTTTTTTTTTTTTT>
##$WBST= 2048
##$WBSW= 25
##$XGAIN= (0..3)
0 0 0 0
##$XL= 0
##$YL= 0
##$YMAX_a= 4743914
##$YMIN_a= -1684953
##$ZGOPTNS= <>
##$ZL1= 120
##$ZL2= 120
##$ZL3= 120
##$ZL4= 120
##$ABSF1= 0
##$ABSF2= 0
##$ABSG= 0
##$ABSL= 0
##$ALPHA= 0
##$AQORDER= 0
##$ASSFAC= 0
##$ASSFACI= 0
##$ASSFACX= 0
##$ASSWID= 0
##$AUNMP= <proc_prof1d>
##$AXLEFT= 0
##$AXNAME= <>
##$AXNUC= <1H>
##$AXRIGHT= 0
##$AXTYPE= 0
##$AXUNIT= <>
##$AZFE= 0.1
##$AZFW= 0.1
##$BCFW= 0
##$BC_mod= 0
##$BYTORDP= 0
##$COROFFS= 0
##$CY= 15
##$DATMOD= 1
##$DC= 0
##$DFILT= <>
##$DTYPP= 0
##$F1P= 0
##$F2P= 0
##$FCOR= 0.5
##$FTSIZE= 32768
##$FT_mod= 6
##$GAMMA= 0
##$GB= 0
##$INTBC= 1
##$INTSCL= 1
##$ISEN= 128
##$LB= 0
##$LEV0= 0
##$LPBIN= 0
##$MAXI= 10000
##$MC2= 0
##$MEAN= 0
##$ME_mod= 0
##$MI= 0
##$NCOEF= 0
##$NC_proc= -7
##$NLEV= 6
##$NOISF1= 0
##$NOISF2= 0
##$NSP= 0
##$NTH_PI= 0
##$NZP= 0
##$OFFSET= 14.97974
##$PC= 1
##$PHC0= 24.79614
##$PHC1= 0
##$PH_mod= 1
##$PKNL= yes
##$PPARMOD= 0
##$PPDIAG= 0
##$PPIPTYP= 0
##$PPMPNUM= 2147483647
##$PPRESOL= 1
##$PSCAL= 4
##$PSIGN= 0
##$PYNMP= <proc.py>
##$REVERSE= no
##$SF= 400.13
##$SI= 32768
##$SIGF1= 0
##$SIGF2= 0
##$SINO= 400
##$SIOLD= 32768
##$SPECTYP= <>
##$SREGLST= <1H.CDCl3>
##$SSB= 0
##$STSI= 32768
##$STSR= 0
##$SW_p= 8223.6842105263
##$SYMM= 0
##$S_DEV= 0
##$TDeff= 65536
##$TDoff= 0
##$TI= <>
##$TILT= no
##$TM1= 0
##$TM2= 0
##$TOPLEV= 0
##$USERP1= <user>
##$USERP2= <user>
##$USERP3= <user>
##$USERP4= <user>
##$USERP5= <user>
##$WDW= 1
##$XDIM= 32768
##$YMAX_p= 540894780
##$YMIN_p= -111630787
##$CURPLOT= <Network HP LaserJet P1505>
##$CURPRIN= <$Network HP LaserJet P1505>
##$DFORMAT= <normdp>
##$LAYOUT= <+/1D_H.xwp>
##$LFORMAT= <normlp>
##$PFORMAT= <normpl>
##$SURQMSG= 1
$$ End of Bruker specific parameters
$$ ---------------------------------
##NTUPLES= NMR SPECTRUM
##VAR_NAME=  FREQUENCY,     SPECTRUM/REAL,   SPECTRUM/IMAG
##SYMBOL=    X,             R,               I
##VAR_TYPE=  INDEPENDENT,   DEPENDENT,       DEPENDENT
##VAR_FORM=  AFFN,          ASDF,            ASDF
##VAR_DIM=   32768,         32768,           32768
##UNITS=     HZ,            ARBITRARY UNITS, ARBITRARY UNITS
##FACTOR=    0.250966925370065, 1,           1
##FIRST=     8223.43324360093, -281033,      10820
##LAST=      0,             51787,           -192255
##MIN=       0,             -111630787,      0
##MAX=       8223.43324360093, 540894780,    0
$$ Real data points
##PAGE= N=1
##DATA TABLE= (X++(R..R)), XYDATA
$$ [...]
23016 759151 570111 334753 364270 531586 616903 554470 654777 715584 670638 487607
23006 487607 450362 634248 407603 1060645 826109 970414 505349 856934 763544 687716
22996 687716 665506 961029 1000779 1000134 201999 695883 923698 698418 899617 583270
22986 583270 576710 349363 994112 567260 597065 471938 237394 513977 827139 828584
22976 828584 641337 1454710 932986 309501 970351 1200901 820502 1579542 1107807 950348
22966 950348 1037035 568559 1078475 1110305 877062 1315599 730883 1061963 1177839 1329414
22956 1329414 1078433 1418657 1210051 1858860 1615581 1809220 1793270 2434030 2905395 3585353
22946 3585353 4124339 6069261 6973333 8662273 10419893 12845989 15623887 18536233
22938 18536233 20344056 21698318 22939832 23959591 24063686 24177198 23732115 22396752
22930 22396752 21157056 19276220 17120075 15246264 12785613 10968706 8616619 7596634
22922 7596634 6001265 5061162 4640557 4064170 4013525 4624887 4609323 5690306 6500853
22913 6500853 8489122 10551452 12713295 14698918 17966969 21764106 25202450 29392457
22905 29392457 33223384 35223264 38193455 40149835 42002070 42387997 42385739 41388777 39289190
22896 39289190 37336456 34643999 31292725 28410567 24674552 21662316 19280699 16974758
22888 16974758 14768826 12725194 11795781 11151480 11209280 11742436 12877188 12950253 14556721
22879 14556721 15956134 17580029 18286685 19715766 20979367 21597271 21316393 21241827 20304168
22870 20304168 19348776 18850609 17131744 15146090 13431786 11554976 10457140 8471934
22862 8471934 7262664 6278837 5274549 4793147 3844642 2958512 2664903 2437940 2246197
22853 2246197 2291183 1532139 1509655 1175970 892813 713753 1324233 576219 979168 678005
22843 678005 746355 953934 1288721 633702 1126641 348453 744520 1242422 605121 1184875
22833 1184875 634121 761082 505482 858285 395554 649408 1060869 605238 722322
22824 722322 538228 822383 997973 779280 901643 835631 757013 152145 799518 1150714
22814 1150714 914623 361111 566675 843021 727144 468335 680808 721451 411832 848128
22804 848128 800695 1081840 401932 1020550 356412 487557 930779 722448 780937 568264
22794 568264 375662 1147807 943895 416031 988968 397807 319956 787621 564292 342047
22784 342047 524519 550887 320185 528387 454205 793333 492645 805981 200981 760619
22774 760619 406380 726642 806237 600524 687179 657058 997984 704536 219360 799739
22764 799739 588825 446959 814855 713555 573592 944006 832332 519710 331557 367076
22754 367076 630008 148539 356597 320787 502918 590386 525885 767958 830676 683280
22744 683280 471433 225253 747775 592682 438433 372771 976173 243656 459652 379616
22734 379616 559777 428010 713838 240036 419370 590578 487870 233532 663520 346070
22724 346070 392495 734196 530991 841898 493873 590221 896115 443367 196693 553818
22714 553818 326780 865380 505586 817435 328050 984283 844821 604467 752509 532839
22704 532839 515134 271753 89316 1000055 283531 638489 507108 627552 310808 496696
22694 496696 773780 622132 892662 664526 1011981 644695 901801 355329 834892 798621
22684 798621 787989 954812 543813 955475 855993 816119 822211 655595 823216 542782
22674 542782 1141180 530105 870983 459866 541967 778809 415188 610387 1023721 893957
22664 893957 483397 640577 725595 801854 547018 682162 797503 757480 669059 546766
22654 546766 1018434 496416 895168 812455 734177 509319 302478 580343 952762 1110854
22644 1110854 799477 835388 1232058 759228 726050 656551 702281 542216 944823 594288
22634 594288 587473 670746 709266 895850 1110976 873272 1177909 938348 913683 457801
22624 457801 643344 697450 385102 730514 888528 766317 751497 1228843 1045155 1054207
22614 1054207 854868 699521 535275 817578 642517 944781 924312 741657 710425 1176576
22604 1176576 780566 876484 1014150 1034792 1079399 912895 847223 1192775 762723 1044819
22594 1044819 747156 779688 1027652 1162269 829497 1113943 903230 1023343 830188 546507
22584 546507 1327240 1021240 1062469 480461 1102449 1018261 993184 452852 1111106 560498
22574 560498 1131706 669292 753195 755764 854224 1583768 863382 826380 1079971 1246318
22564 1246318 1226839 1096626 1029798 980546 662906 820910 692712 1486550 737627 1038647
22554 1038647 1076039 1064982 1197008 1101623 994650 924342 516428 784508 1051353 741218
22544 741218 630757 977828 1096197 441421 513659 387483 1494429 1048884 754473 973201
22534 973201 986774 939137 994581 914838 614848 1214605 961616 938997 1565388 811531
22524 811531 1005940 906153 740761 660234 601408 893635 905520 957824 1000876 543502 1212441
22513 1212441 723532 895937 745476 579890 832156 1034306 1221477 618638 798585
22504 798585 1066821 965555 437719 1009344 1036737 681129 941978 1179444 692646 958874
22494 958874 815279 1063379 934661 1084848 1305814 1169267 1009010 1264683 1288300 993059
22484 993059 1215265 922154 1143507 1634095 850056 922905 750472 917707 927874 1031628
22474 1031628 804664 782132 1073946 828603 1096310 962400 946727 840779 942179 900916
22464 900916 922138 782506 699813 928239 821929 981194 905916 557913 1291465 932893
22454 932893 835236 876454 1007095 808992 755770 1529301 727973 1126035 1078223 1126602
22444 1126602 883995 922320 1283588 1297816 741340 635972 996331 1204912 1125878 874799
22434 874799 937952 625736 971498 874902 588921 1018980 793592 916399 1031373 1007293
22424 1007293 655844 1084899 756343 1140332 873020 892708 931584 926725 467064 1250098
22414 1250098 594010 860346 705417 1129631 773301 1178432 1219960 994588 767575 1165345
22404 1165345 804164 596263 1379844 1030198 1156495 770766 1014572 1176213 936003
22395 936003 906603 750970 839369 1087508 1328145 1030727 921561 1265943 983488 1293111
22385 1293111 761074 1585600 -36038 573027 999604 737512 1314007 926959 662025 870593
22375 870593 733311 1069289 848879 1035180 724247 770621 565727 951074 715817 789289
22365 789289 744209 356496 1151828 985267 760709 1219361 399316 1191243 696244 1493105
22355 1493105 1032472 1319153 1212855 1321585 910451 1044224 887728 954566 873700 1107201
22345 1107201 1356875 1390407 900382 953295 662907 958618 1155732 1831922 866376 906372
22335 906372 1042943 1949063 2245014 2362372 2567749 2199221 2288809 3048766 2745900 2170170
22325 2170170 2145032 2324954 1408301 1720266 1103203 1481574 1491082 1289962 1300080 1449323
22315 1449323 1416658 1152923 1515805 1014182 872383 1172483 968462 1431282 1118377 1015395
22305 1015395 1486881 1224513 1667259 1260143 1096681 1242570 1101152 1087024 1146169 1372252
22295 1372252 1224192 1454842 1326286 1271140 960467 973065 1378307 1027444 1210382 1092882
22285 1092882 1620158 1285641 1227835 1317387 1201891 1447582 1218571 1432581 1094886 1715078
22275 1715078 1298209 1761003 1420654 1585161 1476641 1033892 1445363 803145 1347658
22266 1347658 1373705 1695759 1280763 1462605 1288801 1613791 1610506 1368295 1282061 1311951
22256 1311951 1807131 1413231 1740860 1547307 1185868 1191009 912846 1751557 1593788 1443274
22246 1443274 1611664 1405082 1589308 1838951 1446743 1571471 1475419 1720620 1846652 1696094
22236 1696094 1539629 1404332 1334742 1123277 1597488 1620686 1702598 1449262 1071925 1832342
22226 1832342 1268952 1493883 1936772 1407102 1551944 1191266 1682045 1812070 1684412
22217 1684412 1211323 1110781 1656234 1659876 1314027 1521233 1770444 1498549 1638827 1228589
22207 1228589 1567454 1838270 1445630 1705615 1700878 1741685 1539387 1235895 1296836 1466095
22197 1466095 1754903 988791 1331719 1314194 1138574 849427 1288142 1671787 1296538 1754258
22187 1754258 1558059 1452836 1462363 1266543 1619548 1664391 1676241 1462782 1181023 1885586
22177 1885586 1374085 1348021 1555071 1562292 1249885 1381736 1152860 1364615 1069103 1384996
22167 1384996 1662021 1875520 1437771 1511364 1611881 950574 1009160 1436077 1637919 1567192
22157 1567192 1095782 1456988 822622 1084751 1811769 1511866 1348171 1611201 1011879
22148 1011879 1219957 1556891 1402329 1657282 1018046 1591327 1035099 1087154 1148891 1532071
22138 1532071 1476916 1383758 1608070 1397375 1570937 1614827 1419305 1538968 1426864 1810968
22128 1810968 1562018 1336472 1099234 1298123 1139318 1173484 1160316 1339703 912672 1647920
22118 1647920 986801 1061960 1351830 1144434 1056873 1373586 1118716 1319844 1408411 1700796
22108 1700796 1238973 1133606 1652001 1394120 900910 1381075 2168089 1802214 1203460
22099 1203460 1694812 995285 1386328 1681659 1039424 1146818 1344980 1323838 1320887 1505657
22089 1505657 1727365 1172604 1408812 1376838 1551678 1073453 1440012 1352189 1331997 1992562
22079 1992562 1472809 1268033 1723370 1676333 1381783 1338895 1597994 1729107 1533870 1213463
22069 1213463 1584483 1345457 1108343 1560972 2011900 1636526 1208983 1592629 1475444
22060 1475444 1916738 1406747 1366743 1353629 1389912 1697849 1617097 1515844 1966023 1650666
22050 1650666 1525261 1685088 1945316 2081821 1757867 1661542 1652843 1462428 1468929 1525062
22040 1525062 1568008 1363740 1382039 1636847 1618845 1030043 1845332 1811281 1119581 1592759
22030 1592759 1923078 2166003 1633813 1614074 1717995 1855316 1521103 1705113 1849327 2034276
22020 2034276 1637192 1243022 1499848 1661406 1286406 1484872 1733783 1253470 1806197
22011 1806197 2076445 1969358 1354456 1537947 1691978 1465353 1668265 1758582 1987025 1638729
22001 1638729 1427131 1667894 1265318 1260111 1110666 1500153 1426885 1334439 1804345 1955525
21991 1955525 1461319 1593363 1621549 1201752 1738701 1884643 1684117 1432364 1926242 1460016
21981 1460016 1590887 1825555 1485924 1411106 1613249 1325663 1598122 1709310 1568437 2071421
21971 2071421 1755246 1431106 1681312 1511409 1873244 1902234 1019445 1545369 1904002 2022291
21961 2022291 1573616 1862776 1809277 1542661 1701192 1821517 1814802 1353335 1311884 2044450
21951 2044450 1801544 1428159 2172298 1366780 1672269 1788242 1646887 1338668 2019431
21942 2019431 1456837 2120664 1599605 1620414 2105185 1880124 2104958 2038815 1887950 2083871
21932 2083871 1230795 1749135 1678756 1659417 1607574 1642546 1668250 2313896 1590166 2021855
21922 2021855 1891968 1550661 1546524 1922264 1328910 2140757 1633668 1698179 1955120 1726562
21912 1726562 1740871 1660923 1835211 1673975 1518539 1916293 1610129 1688857 1633182 1115719
21902 1115719 1819107 1568755 2016213 1382059 1663216 1507297 1496382 1635095 1793168 1781698
21892 1781698 1611989 1399500 1922933 1213047 1670412 1624967 1436901 1801817 2162296 1631606
21882 1631606 1558920 1445396 1498645 1982085 2332887 1752656 1557543 2010894 2019249 1582516
21872 1582516 1850155 1743674 2052107 1687192 2096590 1549150 1839934 2038226 1489714
21863 1489714 1784240 1249287 2088341 1477386 1566055 1428940 1323739 1732272 1949703 1509748
21853 1509748 1666970 1650663 1703902 1987707 1866909 1416088 1506356 1533164 1593280 1705118
21843 1705118 1514199 1714003 1330053 1576359 2056835 1552930 1484292 1595892 1546773 1651107
21833 1651107 1832759 1777038 1174957 1739429 1823473 1562093 1667893 1791345 1745040 1792113
21823 1792113 1635560 1809586 1700398 1349149 1284722 1924129 1794538 1657009 2043066 1514008
21813 1514008 1220148 1612119 1291403 1522125 1436529 1684010 1525480 1180445 1245097 1542234
21803 1542234 1871455 1372681 997904 1334086 1496667 1223276 1767572 2085215 1706952
21794 1706952 1681372 1893840 1183618 1696260 1252990 1519609 1747430 1786207 1625027 1503995
21784 1503995 1389012 1737653 1496407 1781076 1583485 1204259 1406485 1572421 1396826
21775 1396826 1698422 1684037 1583237 1632329 1719896 1787178 1694322 1644373 1490325 1563320 1816276
21764 1816276 1976045 1496733 1903365 1433471 1795504 1740098 2027927 1687758 1998088 2086182
21754 2086182 1728266 2188178 2405912 2467794 2602311 2274647 2641336 2274322 2913629 3637086
21744 3637086 3859276 4171724 5053581 5103762 6315960 7727166 8491673 9515115 10907431
21735 10907431 12218149 12919634 13591673 13422282 13472784 13036527 12009411 11373304 10409204
21726 10409204 9960509 8997925 8474385 7710355 7308448 6573472 7075282 7095391 7359759
21717 7359759 7493284 8570398 9489717 10352871 11918172 13999189 14441914 15593000 17428317
21708 17428317 17714033 18746938 19040643 19821887 20102746 19869127 19514087 19001837 18118233
21699 18118233 17117087 15854107 14739178 13078535 11735808 10712324 9910329 9005086
21691 9005086 8116244 7170036 6803113 6616312 6869622 7230875 7149552 7722204 8332879 8817134
21681 8817134 10149202 10725901 11832551 12796759 12982301 13452368 12977897 12286315 11846712
21672 11846712 10611865 9455030 8843230 7510160 6654143 5634001 5351846 4378797 4597704
21663 4597704 4074441 3418159 3569879 2864395 3078875 2955280 2224889 2694355 2680107 2316712
21653 2316712 1967344 2713276 2450747 1902926 1766455 2410315 1764850 2213813 1449934
21644 1449934 1941483 1964286 1722350 1835596 2033688 1995646 1801710 1292197 1548593 1494391
21634 1494391 1418670 1647546 1798625 1977134 1752667 929828 1700139 1318991 1857141 1874670
21624 1874670 1286922 1911147 1407455 1565794 1155123 1600241 1145133 1720659 1474910
21615 1474910 1224370 1669848 1378083 1749315 1489442 1373625 1854291 1644044 1318895
21606 1318895 1500783 1077530 1233062 817051 1349139 970683 1225404 1220418 1409356 1584204
21596 1584204 1141054 1623599 1702312 1487235 1083563 1699547 1582283 1721117 1420790 1593165
21586 1593165 1466877 1269661 1619576 1715815 1523691 1508698 1725388 2218313 1601795 1950617
21576 1950617 1610427 1351846 1731245 1684894 1568268 1310744 1859548 1647175 1660246 1078006
21566 1078006 1348953 1746829 922759 1326543 1493507 1347205 1647323 1096981 1870225
21557 1870225 1236627 1147580 1621039 1743206 1664982 1377298 1848164 1530330 1618054 1184430
21547 1184430 1575440 1419148 1319086 1252472 1101898 1544819 1680633 1607684 1751248 1482624
21537 1482624 1442328 1403582 961016 1586237 1497089 1244660 1716590 1653116 1739531 1794907
21527 1794907 1614154 1806062 1472823 1691443 1392463 1565723 1333897 2069303 1979188 1645039
21517 1645039 1707082 2033792 1353108 1708235 1623235 1775036 1871814 1249492 1634297 2106430
21507 2106430 1771603 1526556 1813616 1755241 2009579 1830750 1670552 1729133 1426345 1906382
21497 1906382 1823104 1548950 1415561 1966854 1852828 1733626 1951346 2240925 2169565 1961701
21487 1961701 1365833 2002274 1958619 2312393 1488167 1798112 2043456 1894815 1576023 1768328
21477 1768328 1715367 1785234 1282373 1655661 1989314 1557757 2199966 2231466 1551035 1413950
21467 1413950 1908410 1169888 1666184 1929091 1592720 1718402 1713760 1880675 1771227 1793046
21457 1793046 1884230 1614901 1667485 1512529 1888106 1755798 1681672 1933155 1965860 2282180
21447 2282180 2107976 2252599 1745825 1971648 1802951 1768431 2044671 2071612 2128203 2096440
21437 2096440 1642754 1580634 2002911 1764525 1843639 1578715 1840121 1654413 2144021 1975740
21427 1975740 1397501 1339120 1859433 1507155 1683723 1582551 1253260 1929531 1672373 1832987
21417 1832987 1573841 1991968 1992024 1487263 1457772 1822010 1309204 2184150 1649005 2077487
21407 2077487 1574577 1683747 1783057 1923771 1795255 1811387 1797755 2012808 1350809 1611642
21397 1611642 2043721 1682287 1828951 2097526 2086630 1767461 2117642 1846679 1298974 1672246
21387 1672246 1710916 1584746 1687552 1561152 1677845 1696971 2165948 1840866 2136817 1604582
21377 1604582 2125362 1697739 1785040 1827864 1985509 2178853 2257886 1428504 2115432 1809155
21367 1809155 1893972 1758567 1786637 2062155 1757509 2047882 1720514 1693828 1723954 2570371
21357 2570371 1388616 1871581 1497445 1964077 2307289 1841868 2120778 2039234 2026920 1807922
21347 1807922 1881426 2057115 2161544 1586533 1741769 2269542 1851016 2053726 1892797 2565131
21337 2565131 1940655 1884653 2453527 2002028 2193129 2284387 2468960 1935523 2155254 2353043
21327 2353043 2320499 2862248 2327064 2466935 2405036 2397421 2196104 2473646 2808320 2695885
21317 2695885 2006138 2384709 2173958 2948243 3219865 2704329 2749390 2777568 2964476 3020860
21307 3020860 3604967 2824713 2987457 3298344 3724309 3030141 3568317 3089112 3000251 3743637
21297 3743637 3883040 3938059 3679331 3954037 3857508 4047783 4162814 4475862 4739541 4987491
21287 4987491 4687741 5040082 5828408 5952175 5703850 6847427 6582036 7652226 8008879
21278 8008879 8294969 8345973 9419380 10438763 11109971 12094723 13289445 15035709 16316839
21269 16316839 17558938 20425396 23340892 26499868 31060489 34926596 39779316 44564115
21261 44564115 50185765 55527519 59842564 64317598 65799123 67287061 67372298 65695041
21253 65695041 63034767 58861554 54922073 49595007 44485259 39546202 34538314 31054215
21245 31054215 27183724 23903694 20891198 19064988 16433422 14673059 13430115 12171453
21237 12171453 11167974 10196258 9548811 8921270 7830784 7520048 7236707 7040656 6095576
21228 6095576 6184718 5942083 5179126 5221621 4825231 4631149 4218983 4289084 3728574 3815815
21218 3815815 3834368 3363052 3410037 3345358 3347391 3587220 3587938 2865938 3126705 2977459 3335264
21207 3335264 2713221 2537608 2627808 2728020 2845686 2730435 2182409 2665575 2793101 2509714
21197 2509714 2788342 2318803 2345034 2457945 2775803 2594318 2325794 2837789 2584118 2363755
21187 2363755 2202854 2069196 2312676 2161068 2457784 2400044 2207865 2493639 2359510 1838370
21177 1838370 2308826 2345080 2017753 1931444 2643394 1962463 1999739 2570101 2404021 2112074
21167 2112074 2545144 2696110 2333667 2626721 2243348 2376343 2356717 2042652 2625292 1741612
21157 1741612 2027345 2119598 1719611 2553220 2021044 2445775 1593290 2237906 2103787 2068284
21147 2068284 2361606 2338311 1900906 2290394 2115715 2412642 1929076 1876365 1681319 2009722
21137 2009722 2379811 1906658 2192477 2382116 1833716 2102057 2139681 2277338 2447231 2570869
21127 2570869 2102648 2189133 2353408 1854196 2527425 2049765 2252244 2056700 1889236 2397305
21117 2397305 1987626 2097859 2295267 2283687 1706177 1949536 1832409 1550286 2424163 1885780
21107 1885780 1610373 1951348 1981367 2641893 2360555 2225584 2327912 2359111 2665932 2432588
21097 2432588 2624912 2770209 2411291 2547315 2376121 2676990 2810038 2184357 2248879 2571235
21087 2571235 2983838 2460553 2343416 2532645 2807941 2431234 2414524 2705254 2467509 2596014
21077 2596014 2688268 3136074 3725128 3098923 3419089 3854605 3961265 4213500 3997677 4451750
21067 4451750 3532466 3906496 3711929 3979679 3318446 3083294 3520312 3240067 3758493
21058 3758493 3264858 2797903 3213398 2831250 3103051 2788973 2688722 2632659 2649973 2086388
21048 2086388 2901063 2808068 2752858 2633974 2810354 2935815 2699151 2470346 2692046 3097134
21038 3097134 2469974 2714239 2649530 2868100 2675088 3336910 2867708 3160186 3058149 3716593
21028 3716593 3298821 3247599 3279551 3427529 3531330 3740861 4060348 4668818 5383151 6520259
21018 6520259 7688934 8596468 9814826 10544394 11427037 11636882 11199474 11285483 11066590
21009 11066590 9853688 8796119 7940526 7586318 6668117 6126610 6013026 5998984 5378687
21000 5378687 5421579 5051741 5058562 4719856 4439681 5285057 5231414 4815140 4946147 4962747
20990 4962747 5276530 5668278 6369739 6891462 7756224 8792980 10437139 11992935 12811257
20981 12811257 14233862 15324253 15315442 15272519 14666589 13151533 12227043 10722445 9385480
20972 9385480 7991101 7980961 6052896 5900336 5326379 5069425 5475181 5393731 5144689
20963 5144689 4884566 4906215 5195947 5063257 5433680 6283276 6491268 7220305 8839885
20954 8839885 9556468 10708328 12170609 12926060 13769630 14035162 13707044 14352518 13819208
20945 13819208 14165220 13631441 14401555 15064309 14855452 14702784 15238542 14651679 15060796
20936 15060796 14779729 14732501 15298826 15577325 17329374 19298053 22442368 26504570 32192057
20927 32192057 37505441 42774892 47542835 50940104 54022337 55451117 55359313 54091790
20919 54091790 52508930 47737686 43761029 39731300 36105835 31347812 27678202 24107357
20911 24107357 20655910 18087451 15272926 12972688 11538402 10594256 8775993 8261018
20903 8261018 7695713 7081106 6376074 6566521 5973838 6181536 5333370 5234875 5290854 5122537
20893 5122537 5586480 5314734 5000150 5911489 5503576 5842372 5740717 5952394 6051710 6527855
20883 6527855 7013024 8612686 9385768 10770239 11414293 12673519 13252368 13416524 13616854
20874 13616854 13434709 13985087 13624224 14191714 13984269 15389993 17490415 20999353 24473107
20865 24473107 29156700 34438349 40742935 45218438 49412119 51915833 52942101 52336359
20857 52336359 49857752 46157818 41072116 35560628 30493123 26035155 21322705 18382291
20849 18382291 15113126 13176514 11536822 10012169 8506079 7607637 7592145 7038289 6151796
20840 6151796 5838159 5316360 4602032 4646613 4093362 4587343 4571274 4373122 4438974 4432943
20830 4432943 4130115 3763910 3513484 4213085 3589563 3896105 3523011 3997625 3698127
20821 3698127 3745666 4061868 3497959 4231964 3301159 4145954 3562360 3892389 3533018 3107685
20811 3107685 3786497 3496921 3897218 3720562 3818988 3152203 3726503 3861244 3441246 3693347
20801 3693347 3673465 4068019 3765445 3454348 3691517 3821407 3496284 3354330 3322997 3638495
20791 3638495 3656491 3189037 3238728 3617340 3552690 3299104 3031774 3001749 3392074 2942693
20781 2942693 2670756 2911190 3375385 2635089 3014352 2817275 2627737 3007815 2934750 3057092
20771 3057092 2757414 2773817 2830961 3317617 3215195 2813026 3360898 3069247 3291046 3468120
20761 3468120 3367590 3336568 3596655 2389172 2952959 2762467 2981344 2621441 3077333
20752 3077333 3233419 2753279 2444627 3180275 2448697 2802207 2362078 2837304 2995582
20743 2995582 2511053 2660167 2206698 3196477 2535890 2708480 2799525 2602493 2824651 2784837
20733 2784837 2743659 2792785 2877506 2736696 3405825 3142901 2828797 2765509 2734420 2653289
20723 2653289 2517747 2948048 2901488 2884271 3199956 3117231 3115074 3451992 2799229 3531758
20713 3531758 3580003 3582979 3775037 3477970 3798419 3741401 3321709 3851769 4009682 3651580
20703 3651580 4204217 3933974 3913042 4069938 4065179 3829121 4047462 4021038 4050219 3949906
20693 3949906 3534093 3656418 3476769 3754466 3670808 3705394 3563685 3903431 3380522 3573419
20683 3573419 3395040 4128546 3742084 3987536 4818323 4533596 4812064 4757440 5015656 5124902
20673 5124902 5112514 4759633 5356372 5071052 5044759 4831897 4662300 4747384 4496724 3743848
20663 3743848 4121322 3871101 3797966 3609383 3310179 3753200 3949283 3559245 3516306 3362054
20653 3362054 3762505 4078254 4333385 4258364 4282974 4501969 5097747 4426209 4833601 5038425
20643 5038425 5289820 4655430 5271630 4781223 4616996 4910784 4133862 4115421 4322353 3948831
20633 3948831 4072299 3816356 3775847 3713065 3460908 3439990 3636555 3966596 3429942 3107278
20623 3107278 3460135 3365994 3706250 3375898 3895066 3585970 4067465 3789169 4244311 3917392
20613 3917392 3947705 3926305 4316664 4577107 4201025 4054317 4197205 4159586 3713628 3826136
20603 3826136 3506251 3658421 3626871 3438245 3372522 3387815 3092437 2876108 2973924 3078349
20593 3078349 3001592 3466789 3292621 2877410 2903013 3205368 3231441 3225656 3167402 3616329
20583 3616329 3492534 3778710 3758424 3108029 3037932 3387115 3124511 3047609 3143554 2831408
20573 2831408 2877770 3160664 2689912 2740453 3118505 2511498 2580173 2739382 2548823 2859264
20563 2859264 3135341 3154630 2873449 3167998 2617433 3269519 2918720 2744212 3421905 3628331
20553 3628331 3110622 3060829 3624985 3429768 3485017 2903159 3224995 3216806 3115618 3269312
20543 3269312 3164827 3346449 2971379 3190297 3365210 3460644 3430306 3593258 3649586 3674683
20533 3674683 4158082 3980930 4202551 4086072 4067770 4187185 4386850 4405952 4649456 3866174
20523 3866174 4017887 3634875 4131754 3725243 3354402 3833046 3227985 3045447 3164122
20514 3164122 3414385 2721951 3383005 3222778 3243055 3228603 3095128 3154925 3363970 3287435
20504 3287435 3143911 3638621 3613181 3394659 3543214 3528817 3855528 3713343 2827908 3445100
20494 3445100 3109340 3502010 3332833 3256698 2967866 3053670 2844478 3015863 2688322 2878482
20484 2878482 2703948 3134808 2859178 2786405 2262640 2435281 3303806 2985480 2917130 2925715
20474 2925715 3238000 3121781 3280976 3797594 3474007 3690998 3778106 3762127 4022337 3824344
20464 3824344 3326068 4276755 3369978 3895490 3849856 3643006 3048010 3345610 3196653 3273890
20454 3273890 3197265 3513947 3579637 3210020 3486817 3468719 3413920 3494824 3681896 3325492
20444 3325492 3904552 3065133 3210032 3554297 3397110 3230127 3236798 3725649 3197405 3261592
20434 3261592 3077114 3458447 3362015 3133040 2843948 2744152 2782095 2980901 3036280 3085932
20424 3085932 2930576 3155005 3457210 2932529 2866193 3214107 2920616 2964534 3230624 2306618
20414 2306618 3601255 2962226 3372275 3439918 3034787 3418973 3220480 3566269 3283616
20405 3283616 3368724 3661237 3390064 2795441 3369411 3198472 3104382 3261691 3797149 3423657
20395 3423657 2910005 2919982 2809241 2880585 3278375 3568480 3064150 3513789 3502314 2994293
20385 2994293 3848740 4099837 3674992 3792608 3837089 3912010 3808840 3405038 3481741 3603670
20375 3603670 3258601 3293549 3712605 3593243 3342434 3680856 2964930 3179802 3651594 2745775
20365 2745775 3286145 3054498 3151988 2900620 3227043 3223256 3092074 2805957 2890356 3084819
20355 3084819 3387131 3478949 3459647 3707050 3785050 3579913 3812450 3924170 3887894 3809268
20345 3809268 3744866 4244963 3843695 3573325 3716340 3707676 3560288 3879706 3813694 3479057
20335 3479057 4023829 3582679 3425352 3891135 3393489 3465154 3481578 3162479 3653739 3534653
20325 3534653 3373831 3690197 3279567 3628408 3158736 3362686 3010278 3288934 3184501
20316 3184501 3533402 3991634 4041356 3729702 3337772 3839206 3828621 3841296 4557812 4103562
20306 4103562 4433720 4723806 5083927 4853837 5197898 5124571 4810452 5193821 5132959 5227172
20296 5227172 5873520 5323334 5937411 5798758 5572627 5687622 5339375 5488890 5690579
20287 5690579 5842436 5211503 5453217 5514506 5091596 5604142 5227275 5048734 5222944 5159275
20277 5159275 5008553 4778193 4634344 4338284 4458955 4815643 4495870 4606050 5063413
20268 5063413 4629914 4481973 4731522 4464782 4712844 4773852 4759984 5174412 4922171 4881510
20258 4881510 4992070 5252749 5563223 6093682 5973134 6765421 7242694 7566081 8398377
20249 8398377 9835438 10482199 12240366 13588296 15031684 16461972 17424681 18520388
20241 18520388 19336190 19975101 20779129 21015250 21489654 20739603 19684267 19436125 18651520
20232 18651520 17391486 16009254 14585202 12779016 10850505 9719102 8448714 7877225
20224 7877225 7465079 7026841 6548048 6145119 5897885 5957473 5836837 5898702 5492080 5572604
20214 5572604 5270593 5215755 5104621 4825140 5365967 4941178 4984530 4720996 5301627 5253093
20204 5253093 4989947 5315599 5472163 5281397 5345039 5435444 5965903 5501328 6149734 6536550
20194 6536550 6475647 6855666 7064835 8375465 9669238 9982958 11691600 13387551 15928511
20185 15928511 17397512 19165226 20642813 21868991 23121520 24321739 25284969 25711957
20177 25711957 25832475 25833578 25092559 24103609 23354625 22609111 20514738 18929100 17008903
20168 17008903 15087131 13090501 12245983 11481718 10821310 9964400 9945310 9314583 9836998
20159 9836998 9385299 9973974 10307318 10718604 11281032 12857286 13019928 14376743 15518493
20150 15518493 17629194 19059011 21593729 23587430 26565723 30623488 34635746 39694818
20142 39694818 44309353 49395649 54128592 58587813 62510529 66726004 70279925 72471560
20134 72471560 74001450 74964555 75225013 74156959 72886639 69685468 65628174 61301784
20126 61301784 56307525 51140772 45628054 40530341 35657978 31499815 27781817 24510869
20118 24510869 21879035 19826937 18192902 16115725 15573101 14770312 13731755 13532463
20110 13532463 13002124 12723808 13309342 13400102 13681535 14417391 14982691 15585704 16866656
20101 16866656 16916447 17685762 18703878 19919410 20476206 21560175 21873054 22234274 21898838
20092 21898838 22371603 21904458 21275762 20900177 19705415 18320004 17600677 16502358 15785647
20083 15785647 14423943 13751924 13078223 11754940 11055388 10190183 10359976 9575875 9109490
20074 9109490 8903261 9401494 9015734 9227565 9774366 10053716 11052069 11647049 12644892
20065 12644892 13817028 15262848 16408455 18228408 19526216 21242256 22967786 24305222
20057 24305222 26651885 28521419 31115271 33253223 35279775 37702898 39256578 40861104
20049 40861104 40914363 41392542 40748866 40545362 39799822 38393715 36865515 35211866 33585573
20040 33585573 31869022 29592861 27334335 25098836 23032174 20644124 18961494 17455961
20032 17455961 16811397 16084516 15377648 15493709 16035742 16282304 17441899 18655241 20815952
20023 20815952 23567587 25947049 28893683 32062925 34899822 37639104 39841691 41263680
20015 41263680 42579653 44041331 44113424 44317615 43272283 41897694 40363110 38221372
20007 38221372 35778158 33107302 29212224 26105729 22774353 20496831 17591397 15300122
19999 15300122 13419547 11787615 11095077 10073596 9085971 8258154 7922703 7815808 7256192
19990 7256192 6598346 6871979 5732662 6063304 6123491 5764561 5136033 5652935 5034803
19981 5034803 5329150 5035483 5032807 4496814 4647582 4661690 4962772 4614181 4711212 4852544
19971 4852544 4496230 4768312 4402188 4929777 4705080 4368901 4399344 3705506 4333125 4045814
19961 4045814 3889586 3927813 3867925 4531457 3969162 4246451 3987212 3926990 3834560 4323979
19951 4323979 4013727 4566033 4769745 3943230 4041283 4333126 4491335 4092142 4213266 4076707
19941 4076707 4001662 3768220 4349063 4328843 3890073 4148456 4020065 3948668 3826736 4560293
19931 4560293 4097094 3984087 4512183 4180465 4314579 4309412 4289694 4184843 4710382 4305699
19921 4305699 4470338 3880121 3987230 4267838 3992700 4280088 4436901 3794127 4277966
19912 4277966 4431934 4095865 4030414 4429759 4304374 4325697 4312631 4393681 4374705 4761367
19902 4761367 4450062 4393204 5019565 5148608 4916381 4899023 5070967 5067694 5200494 4940336
19892 4940336 5083565 5324699 5203387 4941440 5121181 4869459 5187593 5295797 5842306
19883 5842306 5443153 5889419 5298354 5262503 5872266 5010163 5637038 5729297 5223592 5583446
19873 5583446 6094132 5883257 6677524 6337204 6674007 6652523 6446077 6514168 6360950 6206148
19863 6206148 6521244 6564195 6756931 6392867 7116489 6513605 7158764 6777841 6539070 6859020
19853 6859020 6712018 6983043 6930760 7533101 7233046 7585734 7497311 7341269 8347966 8534255
19843 8534255 8548349 8772086 8874402 9467917 9792493 10426403 10626217 11694765 12501852
19834 12501852 13497524 14991634 16586679 18282454 20611486 22327395 24242017 26700557
19826 26700557 27919716 29677575 30712726 31709785 33028637 33754754 34904953 36868150
19818 36868150 39484402 42878168 46167221 50257373 53479864 56924329 59114570 61085116
19810 61085116 61382376 61052380 59359847 57016974 53636326 50765435 46917864 43979311
19802 43979311 40377591 37975280 35548221 33921336 33058160 32051417 31994239 32160480 32097107
19793 32097107 31907470 32028260 32044033 31713312 31550166 32150558 32992357 33665760 35659868
19784 35659868 37459413 40189918 42657041 44661358 46681802 48247590 49017919 48940672
19776 48940672 48224167 46350786 43777842 41491233 37675187 35309964 31867406 28294546
19768 28294546 25687274 22715549 20097905 18475212 16067644 14882133 13646469 12651424
19760 12651424 12068811 11133827 10564277 10107291 9650140 9362320 8986272 8132025 8450923
19751 8450923 8079194 7999074 7615086 7479650 7444929 6870170 7201745 7156315 7285880 6592711
19741 6592711 7424582 6887164 6716143 6777956 6452583 6660893 6460235 6060467 6601788 6454291
19731 6454291 6516688 6843906 6193671 6388128 6299676 6214318 6386201 6068307 6324059 6326237
19721 6326237 6602804 6425187 6480562 6148502 6464246 6429632 6689341 6415672 6364871 6032980
19711 6032980 5857144 5978216 6097895 6124348 5715171 6092050 6071783 5773174 5559950 6210059
19701 6210059 6097933 6130820 5874502 5815129 5912318 5457249 5481495 6113984 6065783 6304904
19691 6304904 5200597 5894545 5651898 5463011 5456587 5565604 5657533 5697714 5847207 5335979
19681 5335979 5196549 5532536 5635550 5017791 5635737 5298001 5043509 5143934 5189430 4756863
19671 4756863 5033403 4836734 4811771 4708903 4778209 4936620 4868628 4959743 4779760 4145208
19661 4145208 4508677 4510202 4711312 4769086 4316217 4658185 4500918 4759736 4497291 4568236
19651 4568236 5132768 4451883 4210169 4546805 4724510 4776281 4781506 4484491 4222474 4900330
19641 4900330 4377953 4437357 4711441 4194975 4496540 4781327 4664647 4460878 4937214 4447422
19631 4447422 4241412 4606428 4073077 4258789 4728862 4409422 3991057 4269123 4269156 4325130
19621 4325130 3887912 4141998 4300245 4389861 3983621 4056355 4112923 3860015 3399835 3593633
19611 3593633 4168208 3675251 3879166 4010433 3466296 3535024 3751435 3733752 3425245 3974242
19601 3974242 4139860 3455601 4110579 4046644 3726830 4225295 4124838 4112338 4307477 4022883
19591 4022883 4388693 4167904 4213463 3608264 3996378 4193257 4592677 4143455 3983669 4248215
19581 4248215 4175907 4004862 4702094 4378871 4410652 4191817 4138439 4602995 4510608 4337353
19571 4337353 4370668 4242538 4360027 4289615 3953176 4299749 4250805 4619607 4529963 4632411
19561 4632411 4243652 4543807 4516670 4618894 4748946 4637945 4131758 3992731 4375487 4683532
19551 4683532 4464585 4410619 4331352 3969297 4090531 3931017 4244154 4288386 3459400 3899693
19541 3899693 4080694 4459135 3901031 3888372 3876145 3464292 3893663 3497989 3203149 3388086
19531 3388086 3399266 3628677 3559576 3468829 3788172 3326583 3485138 3784991 3377846 3378650
19521 3378650 3045541 3297433 3461533 3571582 3393242 3468981 3453934 3524690 3328416 3666841
19511 3666841 3401366 3484664 3788084 3426529 3491852 3419191 3653661 3610190 3146511 3252222
19501 3252222 3376801 3628256 3556284 3436793 3705517 3504432 3557665 3148967 3170031 3748479
19491 3748479 3348980 3236412 3369871 2962332 3504233 3286985 3241839 3456502 3141697 2962076
19481 2962076 3512114 3543711 3652102 3332288 3198655 3501874 2839248 2790595 3211900 2811607
19471 2811607 2593975 2598745 2666018 2657918 2655680 2957843 2916124 2958694 2422357 2883086 2820451
19460 2820451 2652311 2653449 2823144 2804376 2299364 3121598 2984043 2476668 2691037 2409491
19450 2409491 2232964 2303467 2290387 2086580 2335411 2149234 2422318 1719850 1738240 2134824
19440 2134824 1943983 2230735 2276963 2002448 1974719 2304173 2001409 2362155 1990264 2164134
19430 2164134 1865341 2213245 2081887 2274582 1972703 1781099 1758482 2349092 1634449 2161347
19420 2161347 1817641 2301190 2040165 2233462 1820199 1988454 2158958 1442531 2004553
19411 2004553 2095232 1413355 1713639 2054871 1469868 1374533 1427190 1866779 1739802 2271113
19401 2271113 1608381 1916553 2074672 2055811 1814406 1957112 1456851 1919519 1697608 1807963
19391 1807963 1692249 1918827 2046627 1638578 1318645 1934265 1760267 1557149 1801072
19382 1801072 1820758 1701017 1873083 1457905 1622329 2102518 1669545 1660120 1476721 1750701
19372 1750701 1549543 1766727 1860438 1137212 1535388 2047035 1805062 1633639 1784147 1367712
19362 1367712 1813418 1967687 1619445 1611101 1826070 1709441 1789662 1761376 1965165 1939104
19352 1939104 1491258 1736179 1331838 1416814 2029345 1498177 1616015 1410646 1604561 1716998
19342 1716998 1294935 1541639 1675789 1088818 1296058 1551946 2008119 1497709 1780542
19333 1780542 1789346 1644887 1648151 1558113 1752522 1920426 1669015 1454945 1673684 1724382
19323 1724382 1292384 1655801 2161671 1739704 1792325 1352903 1823135 1682274 2188512 957046
19312 1723785 1644841 1443780 1110803 1821436 1710792 1348305 1773463 1738164 1888200 1825081
19302 1825081 1776886 1859833 1628089 1274486 1508014 1655039 1903057 1542505 1380701 1595059
19292 1595059 2163984 2292636 1308089 1486425 1631761 1804213 1661434 1570480 1657754 1544245
19282 1544245 1421236 2233303 1631652 1704273 1683783 1587575 1858416 1917044 1507612 1608690
19272 1608690 1860978 1590890 1301214 1918602 1949547 1539074 1295819 2080414 1762970 1688088
19262 1688088 1796378 1904182 1343708 1503613 1216595 1717396 1618416 1867275 1911516 1748383
19252 1748383 1081491 1549132 1607014 1738494 1479613 1689268 1278428 1808056 2133705 2664090
19242 2664090 2465971 2526148 2817528 3154697 2409745 2893221 2577075 2141175 1981303 1589271
19232 1589271 1107326 1662519 1477884 1409857 1525982 1418981 1502351 1601983 1868305 1261450
19222 1261450 1078114 1110992 1666372 1517930 1966162 1098294 1555111 1020903 1455408 1656548
19212 1656548 1092507 1419443 1690769 1816373 1491838 1590651 1584552 1167286 1748152 1605387
19202 1605387 1302476 1056414 1618258 1494201 1246691 1634974 1330049 1087917 1203370
19193 1203370 1017065 1542622 1538796 1330349 1376406 1258905 1208919 1154919 1230939 1400054
19183 1400054 1693170 1305975 1335414 1582742 1956855 1456081 1155447 1354649 1258509 1804337
19173 1804337 1253783 1505340 1255829 1801618 1170504 1444900 1611719 1296184 1578174
19164 1578174 1248951 1522264 1277227 1346235 1102310 1549740 1173095 1586130 1259112 1341935
19154 1341935 1447036 1071104 1048859 1777906 1554523 1593061 1250261 1784553 1295793 1042127
19144 1042127 1781954 1254437 1653850 1304170 1845786 2209068 1988640 2399776 2238879
19135 2238879 2944762 2786877 3069732 3083809 2512431 2503193 2625973 2837811 2653985 3178703
19125 3178703 2713669 3232992 2761498 2972882 2735436 2637854 2974329 2608375 2253110 2419210
19115 2419210 1710583 2601736 1798961 2103313 2312982 2199913 2442551 2081075 2001469 2392037
19105 2392037 2153112 2203632 2159465 2525701 1874813 2856828 2368577 2783122 2644410 2677589
19095 2677589 2875568 2505859 2824726 2712798 2337100 2419243 2496670 2568359 3008491 2243337
19085 2243337 2376705 2545526 2499643 2307424 2852697 2466814 2465023 2803141 3429771 3711917
19075 3711917 3333068 3620534 4187465 5210932 5623585 6707527 7742440 9314997 10572024
19066 10572024 11099484 11314492 12301779 12169498 11368470 10701579 9817120 8993327 7255455
19057 7255455 7085669 5621440 4912362 4496450 4560003 3959471 4382667 5114086 5970089
19048 5970089 6676958 8160658 8533885 9695550 10181974 10059450 9551381 9511971 8422874
19039 8422874 8284883 7266948 6423974 5714376 4946440 4927360 4605628 5053168 5012780 5259761
19029 5259761 5032802 5405337 5666741 6217980 7091315 8630451 10463150 12261982 13720790
19020 13720790 14535959 15126781 15095597 14745819 13407069 12570842 11333460 9295755 8423946
19011 8423946 7622787 6799431 6287412 6084292 6280912 6903728 8095931 9525199 10025178
19002 10025178 10898570 10903444 11247432 10745047 10646268 8987784 8155009 7463583 6141459
18993 6141459 5197855 5237175 4485802 4542701 4739879 4973685 5236463 4952566 6650128 7461048
18983 7461048 8598508 10035771 10011448 10587508 10184691 10091405 10097139 9230909 8429759 7874556
18973 7874556 7404082 6994501 6792832 6299240 6641719 7224862 7339602 7919264 7899438 9037900
18963 9037900 10609091 11317136 13516451 16038391 18976655 21831502 25245782 29122728
18955 29122728 33880248 38068073 42907939 47043162 51004575 53684017 54916555 54609569
18947 54609569 53012542 50270075 46288020 41434167 36159519 30885940 25679940 21714805
18939 21714805 18443940 15669132 13121777 11121784 9799891 8685918 7708724 7449907
18931 7449907 6081955 6113707 5302801 5165836 4798142 4942533 4690421 4226358 3838628
18922 3838628 4167956 4030562 3949632 4005734 3785752 3528731 3754953 4205929 4069150 3935766
18912 3935766 4239932 4451705 4199968 4315170 4581392 4070544 4652090 5166132 4907338
18903 4907338 5081089 5954382 6497003 6620827 7220772 8300566 7987093 9849670 11173341
18894 11173341 13231065 15797157 18548680 22301798 27333359 32141736 37445579 41306038
18886 41306038 44615218 46821149 47211875 45953227 43032006 39568342 34924882 30204480
18878 30204480 24922280 21286284 17820722 14639291 12518379 10633993 9068371 7554279
18870 7554279 6850101 6420613 5350902 4637260 4334281 3941372 3434553 3756972 3409460
18861 3409460 3186359 3276418 3013569 2573010 3096585 2671244 2332181 2369052 2689062 2297426
18851 2297426 2149423 2476056 2008037 3029319 2513486 2367929 2234145 1777309 2352023
18842 2352023 2102500 1752084 1923611 1750379 1478792 1972448 1532847 2334211 2086161
18833 2086161 1576642 1443513 1615795 1627963 919625 1598313 1604617 1803791 1932774 1488198
18823 1488198 1549425 1700116 1555773 1806924 1847973 1426099 1940978 1361361 1754376 1521896
18813 1521896 1722228 1110018 1718166 1765668 1348815 1541527 2117787 1586560 1688836 1481417
18803 1481417 1679416 1714533 1565178 2123723 1946241 1430024 1550698 1849223 1637068 1197590
18793 1197590 1643735 1821437 1544432 1573366 2085479 1473073 1607458 1803635 1954177 1809837
18783 1809837 1493514 1883413 1711479 1778149 1962023 1539392 2106837 1344689 1922499 2022872
18773 2022872 1783780 1982680 1982877 1470887 1931143 1865284 1770222 1738367 2044521 2140531 1851303
18762 1851303 1971378 1912557 1720820 1479056 1722921 1985750 1237390 1830856 1876711 1461545
18752 1461545 1581420 1334864 1635756 1716211 1919597 1717859 1202554 1703806 1465913 1423497
18742 1423497 1754944 1285730 1663364 980895 2047342 1191226 1250802 1526128 1553239 1597601
18732 1597601 1911539 1784262 1244783 953047 1321821 1261164 1292259 1622339 1369562 1442071
18722 1442071 1561874 1329296 1307434 1639431 1991635 1725194 1644490 1439668 1510880 1879900
18712 1879900 1531625 1734208 1406256 1334440 1814210 2089514 1246949 2497558 1901348
18703 1901348 2234705 1651079 2101621 1761978 1909738 2289425 1691856 1995125 1787074
18694 1787074 1826856 1426509 1930518 1781122 1829261 1288155 1589188 1822618 1249298 1397784
18684 1397784 1662004 1361888 1656239 718958 770829 1429960 1510933 1238906 927523 1136452
18674 1136452 1110697 1269255 1280973 747314 1491280 1438454 1374940 1232698 1057787 1049358
18664 1049358 1260185 838481 1220786 921256 1352545 1254481 1157075 1085128 885514 1262181
18654 1262181 1093451 1442760 1552597 1252011 1472699 1497404 1204394 1462346 1064600 1318845
18644 1318845 1191677 1549304 1417571 1297716 947300 978556 1194237 877385 1246793 1491883
18634 1491883 1311860 1298284 1315085 993243 1241796 1059550 1097731 1107634 807724 1020016
18624 1020016 1768156 1455307 1836933 1456760 1787848 1557700 1409681 1625774 1576945 1554518
18614 1554518 1361726 1252194 1751938 1446785 1423886 1572721 930714 1504132 1264422 1301016
18604 1301016 963463 1506428 1134682 1611605 1389593 1462829 1453643 1479573 1480050 1117789 965693
18593 965693 877842 1251867 1119330 1294062 1105917 1288042 1608144 1612219 1621933 1289409
18583 1289409 986137 1304728 1181403 1544123 1546758 1212080 1295012 1158014 872457 1083707
18573 1083707 1360188 1338786 1169822 1520824 1402399 1316166 918998 1072098 1146749 919201
18563 919201 1456753 913033 770755 1089194 1336782 1360781 1176288 1002615 1247640 1270798
18553 1270798 1039235 1128167 1281386 1184376 932867 1177170 1013299 1058277 1158326 1210043
18543 1210043 1661081 996613 820254 1251162 1110434 866004 1012704 685542 1337256
18534 1337256 894928 810759 831686 1220601 1521936 793711 902121 1331937 1142212 1510482
18524 1510482 797625 693026 714780 891946 1379854 565602 1067603 1167325 838826 975655
18514 975655 1079167 1035205 1347790 1053839 1145720 1412064 1214846 1020095 992567 855271
18504 855271 1149749 961247 874793 676924 1027937 1129683 705028 739754 1238823 711835
18494 711835 569802 1095155 869136 886518 1306729 1025845 860343 811960 794864 1089040
18484 1089040 1388542 1395074 807425 1147335 729168 707548 854189 977936 613451 951259
18474 951259 936297 820307 872338 823221 1121412 950800 931495 1271391 675305 819617
18464 819617 758904 1119696 629007 1203004 1373833 991264 1286570 1555976 903729 1049292
18454 1049292 735798 1081232 691198 887688 1176033 976024 883940 684459 488346 646748
18444 646748 728934 1196672 1053449 852167 1021140 953776 1179027 1016942 1390273 1125737
18434 1125737 1330941 1042406 1140486 1041038 1191537 1101061 1430084 711400 1440307 1288447
18424 1288447 1328264 1189683 1164275 1156839 1308013 1401919 1385417 1260741 1275239 575675 936601
18413 936601 486934 720510 985559 978383 567306 1018114 1409449 1175427 771056 1169061
18403 1169061 1106122 804937 1166520 1121512 555884 1198633 746497 1318386 1213445 1117615
18393 1117615 1446271 971421 962335 1518597 743386 1041066 474316 607899 1463594 650152
18382 783895 435790 802656 935032 367522 605253 957400 667901 972425 952778 895510
18372 895510 624896 984968 776135 662326 868200 924302 650253 558955 723587 1384995
18362 1384995 935609 1053894 688140 1074772 1131913 678801 845536 1258381 854921 629038
18352 629038 1018702 933524 868422 755401 960429 801732 1088316 977799 819542 411032
18342 411032 1166966 1360254 1249911 1349781 960710 1399850 872284 989560 909416 1229819
18332 1229819 1262504 1173896 774013 665556 807392 636299 871222 1083435 860568 726372
18322 726372 818650 879635 1293692 898838 1127455 1228130 1164790 1008070 978023 1083331
18312 1083331 1035271 890827 885226 1067114 1104328 929557 1216927 704530 434860 1049833
18302 1049833 595057 1108824 1363075 1435141 1074878 930273 1294228 1066568 1437892 1216805
18292 1216805 757504 1343311 1151950 485900 775577 804763 1006972 1105214 1099177 1515311
18282 1515311 1525727 759139 529213 828250 1097754 812608 922034 849835 613618 689303
18272 689303 1142486 1250144 930388 1021148 1400523 749228 693133 690495 554174 682679
18262 682679 1256035 848930 932508 817787 1256602 711841 935348 1021704 1063374 844830
18252 844830 1023877 1223118 1133879 680902 1261276 1266092 985346 1214916 688316 815148
18242 815148 1005520 1129161 1035481 1018750 887950 1177773 869547 881964 985549 1210553
18232 1210553 921732 910814 1190556 761837 490234 881996 736687 627855 1268060 1135265
18222 1135265 898180 1010483 824999 1118980 729201 1133414 1030706 1061641 551120 1017876
18212 1017876 745214 972032 1187337 1329126 647301 1244538 873366 1190165 460060
18202 723643 1113958 831641 1013716 515805 1120212 844678 1136656 1740228 1094025 1063248
18192 1063248 816974 760455 1044762 989558 881554 1244262 1128548 766055 1353162 1077794
18182 1077794 1140245 1033135 891032 1027395 1138691 576366 1226428 837004 969859 657964
18172 657964 703943 943980 786754 1484990 1053240 1065063 782269 503935 777442 900915
18162 900915 669405 1099317 1094966 761518 724959 947891 1039141 921803 852185 855140 701186
18151 701186 923846 1236454 986473 594511 1395601 968726 1145206 940045 809100 688077
18141 688077 923867 831486 1051751 943091 805339 849371 1171408 1150960 864739 824365
18131 824365 1034028 819770 890035 934823 747902 1013101 1149055 1186725 901373 596129
18121 596129 828498 1104355 708235 568619 1001603 1122071 1022238 1054939 580703 1024857
18111 1024857 812831 1213802 1358237 1499721 1146218 375217 1278286 685187 698152 1016203
18101 1016203 653672 1107205 904611 962420 1454903 967132 728453 1308580 1056579 463344
18090 1136860 854652 927745 972984 837052 1036478 1279577 759762 1372990 718635 853157
18080 853157 1163691 595548 750394 874777 682806 1011324 1208583 740094 1178502 893561
18070 893561 969076 970049 658132 776295 626478 896481 759557 1087793 896355 970136
18060 970136 644944 1004136 1326656 613301 930270 1218456 1051148 933560 692763 504735
18050 504735 650282 476877 448682 916005 778296 633006 1267912 737451 664725 971372
18040 971372 885632 843879 642736 879813 940167 856349 958638 750870 541032 1211260
18030 1211260 643713 850202 728561 990885 1121888 1110326 978044 678672 1235415 1067737
18020 1067737 957215 607644 662749 704827 560681 731128 807904 1003095 623949 486980
18010 486980 965089 1263341 1277679 1156134 949146 703174 1076206 926708 1145153 745013
18000 745013 722605 872531 787466 712918 869500 475511 901964 1004059 968469 905205
17990 905205 228517 358302 718403 666782 1104452 1271089 912819 1205290 1211424 911812
17980 911812 1023232 793721 982755 1255240 1041785 1042956 840737 721385 1017862 773114
17970 773114 1283101 1014615 958458 1073813 846438 1027633 1170757 624224 1050554 1105401
17960 1105401 539066 616768 1309698 1208824 982394 973443 1143838 1111972 1281567 786567
17950 786567 1566995 1084242 1050781 1075286 870132 1036329 1109052 1130180 1206788 929181
17940 929181 1000380 1137801 1203265 1267234 1457762 1172580 1143677 869299 1217501 1703799
17930 1703799 985629 1453408 969833 922155 1277474 1118269 1492130 1374882 1596865 1460585
17920 1460585 1195419 1526345 1259153 1270482 1338364 1462452 1716057 1288619 1200569 1268855
17910 1268855 1548828 1752545 1512930 1549305 1317388 970468 1468363 1340444 1742722 1626249
17900 1626249 1674745 1556162 1627273 1643047 1750153 2004649 1466716 1965531 2192663 1904850
17890 1904850 1820062 1905279 1672170 1842651 1953502 1901091 1786333 1506206 1861379 1562573
17880 1562573 2076184 1767657 2146075 2006069 1884113 1863359 2272131 2320162 2398392 1957974
17870 1957974 2146350 2005321 2196787 1875066 1887894 2039121 1661139 1782387 1934129 2116646
17860 2116646 1464996 1742224 1885912 1444718 2060308 1863355 1055830 1756066 1800236 1091568
17850 1091568 1326756 1527639 1789103 1716153 1278963 1432745 1539095 1202463 1241013 1150699
17840 1150699 1361695 1711295 1439199 1503607 1351973 1406791 1347326 1388681 1572256 1399662
17830 1399662 1086866 1711395 1231075 1433769 2053583 1191413 1329791 1186464 1579259
17821 1579259 1595540 1606482 1551976 1209980 1839314 1817523 1948047 2218580 1640413 1804607
17811 1804607 1537005 1515729 1717535 1542094 1804202 1666222 1550820 1500651 2051132 1552190
17801 1552190 2013020 1732340 1613381 2177584 1442223 1578500 1992201 1665632 1308463
17792 1308463 1379442 881120 1288829 1313106 1358643 904442 1157046 1196738 1073734 1349089
17782 1349089 1437844 1238826 1481057 1274540 512799 1521059 1514581 1403885 1085894 1099673
17772 1099673 1050233 1195988 1828471 1524873 1326504 850333 1032477 1038200 1299446 1277268
17762 1277268 1215792 1539251 1208589 1321840 1147452 779605 1166018 1152361 1012827 1055756
17752 1055756 1051415 1189741 1255682 1261308 1333532 1295532 970262 1262907 1296145 1007734 1188440
17741 1188440 1166937 1180678 797023 1715321 1106718 1269831 1235224 1500962 1247944 931450
17731 931450 658474 946539 1001760 1094044 1332636 1362014 1465828 1016481 1233371 634094
17721 634094 1072482 1701537 682064 1222896 1628152 762590 1294557 1511276 1006436 990210
17711 990210 1062114 1141874 1174254 1262753 1371187 914137 679813 1286919 1016411 1333774
17701 1333774 1446439 1281893 1532054 1320428 1109813 800299 1093396 1166305 1005807 1610287
17691 1610287 1280839 1382039 993994 1244012 1212702 1220291 1509617 1408122 1476088 1662532
17681 1662532 1708551 1175295 1222636 1183138 1480136 1364252 1039046 1112616 997215 1455023
17671 1455023 1631959 1243559 1003578 1521264 1511916 1308892 1984878 1256008 1136753 1451455
17661 1451455 1689327 1053951 1268113 1419149 1558456 1352940 1239161 1875292 1156221
17652 1156221 1457415 1642225 1385277 1732308 1703098 1366045 1487135 1429389 1745536 1804428
17642 1804428 2147547 1847579 1871127 2062718 1765456 2087932 1724915 1599191 1904638 1488075
17632 1488075 1629015 2220125 1843689 2207105 1987894 1901964 2681403 2223237 2238046 2422005
17622 2422005 2314021 2526274 2049468 2719071 2642270 2417342 2439191 2512994 2537684 2491167
17612 2491167 2847883 2741524 2502034 2734359 3123255 2575920 2940490 2727010 2737821 3006665
17602 3006665 3131415 3090522 2979267 2773574 2501860 2410883 2748633 2858802 2796878 3152920
17592 3152920 3329274 3100620 2881946 2773153 2672729 2865886 2979577 3161202 2837553
17583 2837553 2436224 2422665 2131278 3008346 2369812 2622328 2577693 2510896 2632895 2685798
17573 2685798 2483932 2526253 2249072 2287511 1947361 2310149 2496484 2222896 2490115 2561996
17563 2561996 2264227 1967280 2263882 2713175 2153801 2200383 2283883 2438228 2147581 2151706
17553 2151706 2091401 1285233 2061584 1778252 2319026 2051734 1928065 1970252 2477425 2274958
17543 2274958 2225467 2697862 2104145 2292253 2189598 2091736 2434532 2298933 2326525 2027434
17533 2027434 2454180 2457597 2365813 2417641 1904195 1627385 2700274 2488832 2344853 2723278
17523 2723278 2534576 2193615 2386004 2430240 2528057 2734354 2406934 2381520 2921830 2789158
17513 2789158 3163346 2798464 2935916 3001001 3661755 3647141 3063391 3124234 4096319 3571379
17503 3571379 3289715 3869066 4055329 4091218 4590720 4408349 4627053 4963823 5212649 5961552
17493 5961552 6277830 6884149 8105535 9215195 10543920 13410186 18402227 25837311
17485 25837311 39684665 56450711 74862274 91319546 102664424 109666134 112862394
17478 112862394 111442803 105379237 94583343 81232679 67576503 55013607 47315369
17471 47315369 45828792 51235353 62907333 78354071 94066789 105673998 113241929
17464 113241929 115590853 113969287 108445634 98137863 83820671 67656682 52038173
17457 52038173 39157427 28995992 21975575 17307331 14413646 11229616 9638753 8589306
17449 8589306 7521054 7121135 6891751 7167700 7154434 7401751 7195465 7415736 7922383
17440 7922383 7388174 7248955 7398748 6389406 6015378 6120962 5992094 6291832 6247384
17431 6247384 6669726 7060182 7018446 7280563 6547890 6855517 6361472 6336181 5970128 5493813
17421 5493813 5028160 5064961 4818093 4680514 4046435 4023904 3930346 4661777 4441703 4221375
17411 4221375 4302558 4729387 4633829 4849039 4550588 5108592 5221666 5611845 5786010 6153272
17401 6153272 5798704 6824561 6572643 6649353 7227317 6984353 7381722 7817591 8613262
17392 8613262 8774528 10188188 10845198 11935540 13216644 13663618 14802528 14960242 15375188
17383 15375188 15651879 15985706 14741907 14647040 13923520 13161550 12762534 12270879 12655159
17374 12655159 12664982 13121479 13740703 14408926 14759526 15993988 16652287 17346113 18057667
17365 18057667 18430889 18331241 18035077 18785713 18195347 17607423 17880967 17143110 16898398
17356 16898398 16779241 17486658 17362635 17597791 18485477 19116524 20845371 21902099 23326600
17347 23326600 24891829 26030569 27221110 29023226 29276601 30085812 30090452 29255231 28755968
17338 28755968 28482798 27609690 26871688 25638600 25690810 25433521 25307788 26194928 26133541
17329 26133541 27329406 28302252 29118017 29998869 31191592 31799693 30980126 31738940 30824702
17320 30824702 29961771 29218262 27799990 27216769 25532294 24245099 23065700 22144487 21150407
17311 21150407 20117789 20333324 20071800 20112833 20477072 21091899 21960065 23151080 24373011
17302 24373011 24942032 25303923 25751730 25405309 25664889 24609205 23842459 22885220 21664425
17293 21664425 19968792 19816788 17952056 17990517 17543111 17627269 17521200 17013613 17154290
17284 17154290 17325574 17418890 16892724 17182537 16308456 15489315 15162773 13386684 12610478
17275 12610478 11642339 11017275 9699965 9515459 8817809 8524017 8112180 7157248 6575599
17266 6575599 6782469 6462012 6078561 5447938 5596557 5711158 5298893 5883442 4756233
17257 4756233 5501816 5147219 4969342 5011246 4986110 4919050 5173265 4812382 4659129 4618060
17247 4618060 4661446 4450790 4490462 4849006 4253824 4006940 4528131 4196653 4105021 3951841
17237 3951841 3749854 3875079 3864538 3844689 3967142 4238326 4126554 3891234 4214940 4202584
17227 4202584 4752055 4652943 4346792 4317067 4771415 4499838 4675584 4458249 4812680 4482621
17217 4482621 4458927 4034952 4789259 4339766 4663541 4161542 4591418 4442375 4920083 4834885
17207 4834885 5136540 5210979 5557170 5617499 5581296 5699223 5465505 4858682 5129723 4959387
17197 4959387 4383112 4105668 4371345 3922359 3706840 4059422 3841490 3403750 3753158
17188 3753158 3564585 3727010 3229111 3461176 3173338 3401225 2909188 3511848 2779660
17179 2779660 2722877 2679556 2634588 3308405 2701494 2688026 3238934 3112657 3004343 2736809
17169 2736809 3067738 3387104 2890629 2746548 2986270 3337583 3380734 3525859 3606265 3511120
17159 3511120 3346115 3551701 3377824 3447153 3439036 4028896 3395719 3741195 3722484 3471557
17149 3471557 3716130 3859858 3406770 3805162 3173075 3547107 3608556 3474757 4189893 3991914
17139 3991914 3571619 4045530 4024917 3479204 3741453 3660604 3371834 3221351 3465809 3589723
17129 3589723 3371891 3581763 3413782 3459826 3457066 3092126 3303802 3338579 3296552 3647136
17119 3647136 3217053 3480057 3341759 3095666 3310113 3276774 3197690 2898181 3182703 2683839
17109 2683839 3355986 2670231 2650117 2746969 2796197 2667355 2925456 2790340 2616203 2228398
17099 2228398 2694083 2469727 2876217 2645437 2452440 2726502 2097940 2111382 2136595 2520900
17089 2520900 2141349 1652749 2066329 2214056 2364934 1609984 2346375 2033013 2275637
17080 2275637 2121132 2155276 2202482 2335259 2436614 2285317 1620338 2090709 2143806 1893053
17070 1893053 1910080 2010593 2425147 1962299 2056794 2266724 2068927 1592735 2551876 1863332
17060 1863332 1999549 2198704 1843983 2179240 2078300 2536257 2088165 2129149 2076488 2778174
17050 2778174 2029235 2223264 1896495 1974733 2605189 2276910 2221278 2580920 2554878 2407730
17040 2407730 2572551 2819443 2589861 2682733 3224794 2772592 2887158 2240328 2494184 2228077
17030 2228077 2177980 1811381 2308975 2203055 2537225 2413475 2062172 2187299 1975765 1909307
17020 1909307 1936846 1886636 1563166 1949899 2263738 2324977 2003682 2045015 2205446 2126341
17010 2126341 2067849 2018956 2189848 1808999 1622464 1985341 2086464 1872017 1574633 1869931
17000 1869931 2346442 2027079 1691663 1910266 1864771 2055641 1666971 2053365 1971252 1935134
16990 1935134 2183327 2171616 2370714 2178563 1896692 1651938 1968459 1853030 2260576 2155246
16980 2155246 1976701 1971867 2199309 2447960 2169479 2437125 2559614 2697455 2526837 3454220
16970 3454220 2935947 2845389 3275151 3107506 3623632 3591940 3789696 4208204 4657421 4465204
16960 4465204 4976688 5018084 5003331 4486554 4923611 4520264 5426979 4611063 4880776 4702280
16950 4702280 4725324 4903696 4120846 4574250 4103300 3780417 3669280 3418099 3277237 3462227
16940 3462227 2884546 3115927 2922977 2681999 2839597 2281610 2363691 1910773 2261573 2720644
16930 2720644 2488705 2190293 2018189 2497910 2439505 2566007 2399418 1836713 2153756 1677148
16920 1677148 1638195 2220333 2099035 1984095 1451027 1796656 1929942 1879545 1850726 1671309
16910 1671309 1472315 1626793 1676252 1138174 2001497 1898810 1569233 1874642 1199237 1260376
16900 1260376 1698257 1531807 1703129 1586841 1276843 1726570 1382696 1124159 1522147
16891 1522147 1514674 1379066 1838288 1464743 1769235 1617514 1545311 874526 1414216 1552595
16881 1552595 1330692 1403763 1554642 1779676 1748680 1792377 1828618 1569822 2081895 1678440
16871 1678440 2411779 2068316 1658605 2090873 1797865 1487326 2069783 1828059 1968800
16862 1968800 1655769 1372390 2109709 1634770 2192357 1744016 1307553 1888244 1621085
16853 1621085 1928694 1903827 1917503 1432856 1843764 2051319 1566200 1878161 1372356 1605881
16843 1605881 1411007 1680861 1474746 1477413 1681987 1791513 1565829 1818792 1393647 1755477
16833 1755477 1611861 1885306 1770820 1826759 2231180 1758900 1780726 1844759 1769198 2040915
16823 2040915 2035476 2468059 1924955 2478516 2241059 2307478 2322023 2234255 2612488 2773280
16813 2773280 2326726 2790879 2578389 2711251 2837583 2099326 1857643 1771783 2618010 2299774
16803 2299774 2610805 2645395 2422629 2426525 2167755 1942987 1880445 2249715 2060490 2198079
16793 2198079 1543502 1824260 2143511 1484363 1601137 1886506 1223357 1523971 1357080
16784 1357080 1651191 1117507 1592970 903595 1144751 1417539 1808852 1185431 1137073 1444908
16774 1444908 957454 1131476 829930 1305553 1540978 1478354 1201637 1109963 1598729 989489
16764 989489 1265913 1412323 1091505 1723881 1237493 1398034 1576325 1600790 1045022 1274399
16754 1274399 1474700 1617559 1954635 1340060 1423923 1421706 1352981 1324716 948286 1271251
16744 1271251 1461326 1814922 1672770 1396474 1103491 1311541 1444047 1752269 1149509
16735 1149509 1239042 1275537 1803642 1517739 1125136 1384432 1317035 1695860 1485806 1828977
16725 1828977 1792674 1709204 1914434 2005522 1966368 2166304 2089478 1667756 2133511 1904440
16715 1904440 2539692 1977838 2097057 1668539 2535887 2147029 2159336 1999634 2760033 2733156
16705 2733156 3134162 3172088 3276448 3610579 3783468 3485038 3540279 3551397 3136349 3266386
16695 3266386 3041662 3569492 3355714 3230086 4049643 3650439 3718192 4012670 3759739 3425333
16685 3425333 3328016 3292373 2558920 2783336 2344763 2773554 2270596 2354790 2186096 2158632
16675 2158632 1887606 1958673 2605770 2725939 2875164 2800319 3103186 3552175 3758640 3843674
16665 3843674 3590645 3703379 3477287 3557229 3399364 3381902 3015170 3134782 3599403 3447858
16655 3447858 4080982 3583924 3916762 3646679 4237636 3952713 3356351 3117132 2853860
16646 2853860 2781309 2161518 2053370 1602434 1347998 1313768 1261489 1148199 1334642 1260496
16636 1260496 1062188 1642566 1125155 1182598 1195981 767585 1060502 1660104 1059438 1196089
16626 1196089 973845 815425 775427 744122 796107 1497454 1378352 1096254 1314371 1497275
16616 1497275 1514143 1515187 1730329 1135006 987899 1166334 1090343 1300582 1358157 978582
16606 978582 1362039 1563379 1450120 1839981 1717829 1233998 1694549 1479468 1142182 1470012
16596 1470012 1565111 1334458 1649367 1325259 1823617 1371845 1854482 1575846 955071 1568484
16586 1568484 1200222 1197364 1435207 1273601 1390725 1573352 1318374 1238033 1974264 1184174
16576 1184174 1590021 1583034 987169 1451718 1439542 1485255 1183525 1056961 1176877 1455090
16566 1455090 1083834 750924 1256085 995468 1250218 974230 1254739 1218002 488519 1122991
16556 1122991 739782 871681 571302 1110460 1226384 720717 708467 757986 1041299 329544
16545 693965 632429 252905 895839 257790 727200 -10336 719687 932286 417727 335225
16535 335225 497688 443715 295523 -69385 469921 692659 280410 615689 601793 237630
16524 901500 801836 624911 977488 819762 1193821 583733 912603 810163 1326086 1538812
16514 1538812 1102017 1038180 1161099 942047 1488385 1477094 1142488 1131486 1058069 1157465
16504 1157465 926257 1384703 1957529 1021451 1830680 1413657 1490569 1482024 1265549 1207218
16494 1207218 721370 1323529 1390114 859439 1099598 1648909 1867058 1509795 1495725 2309178
16484 2309178 2118094 2362762 1471418 1968108 1939048 1910610 2075645 1465628 1663307 1916818
16474 1916818 1939790 1402080 1910626 2115078 2567590 2464226 2487016 2076473 2778539 2590267
16464 2590267 2553799 2112109 2620724 1868179 2350044 1775363 1720825 1265019 1392667 1291449
16454 1291449 1057262 858624 1505869 1587803 2280698 1904981 2336462 3045527 3642579 3798387
16444 3798387 4078107 4487624 4995182 4856934 5032276 5376092 5356203 5236982 5897263 5989337
16434 5989337 6104301 6462783 7222313 7513937 7805095 8393881 8815654 10313108 10874586
16425 10874586 12248863 14120498 15731009 17591738 20181543 22330696 25193879 28207720
16417 28207720 31324063 34902491 39658545 44406957 50014600 56118950 62095282 67642826
16409 67642826 73811981 79517657 85281780 91584628 97631016 103907632 109840019 114195173
16401 114195173 116371195 117062400 115652217 112623123 108310992 103560945 98274385 93436242
16393 93436242 90852843 92688053 102934221 123722457 150173139 172001344 185257083
16386 185257083 188741125 183072178 168275552 149536680 135335005 123292855 106753550
16379 106753550 77329753 32373541 -22223006 -74846090 -107206055 -111630787 -93626238
16372 -93626238 -64702941 -33681222 -4506815 17971048 35116188 46114444 51893496
16365 51893496 51868552 48685245 43730623 37630632 31233112 25760806 21614956 18074115
16357 18074115 15516948 12996405 10921567 9328593 8563644 7585988 6572746 6081336
16349 6081336 5019816 4319783 4419614 3280378 2985028 2698629 1923195 1553841 1561175 1644398
16339 1644398 849337 735453 871413 906346 315280 597511 593896 197296 175476 429909
16329 429909 86268 488198 870264 307443 741594 965367 1047670 1134543 1620434 1802987
16319 1802987 1330348 1937708 2265524 1826029 2388156 2657153 2114664 2221622 2394120
16310 2394120 1998334 2222987 1692261 1489531 1286138 1240634 1028890 513494 525909 104684
16299 641489 986514 883301 569685 1092717 1548333 1094508 944993 858118 1550764 1147070
16289 1147070 1319041 817919 962781 905804 1270567 1124116 1113603 1212400 949167 1604796
16279 1604796 1582910 1508402 1846696 1871580 2057928 1984763 2292169 2250154 2312099 2416055
16269 2416055 2355605 1893111 1924151 1956223 1346572 1927740 1634616 1757117 1824429 1065457
16259 1065457 1846517 1474877 1491648 1690092 1638921 1644752 983993 1416866 1161394 1525625
16249 1525625 1594477 1612497 1762035 1167211 1645938 1864886 2001490 1965774 2008761 2000443
16239 2000443 2112225 2581594 2455306 2335962 2468706 2538312 2264540 1561143 2080389 1585504
16229 1585504 1495643 1769823 1876260 1618486 2045227 1221171 1121988 1392432 1685992 1466215
16219 1466215 1218315 1931040 1164091 1297376 1436668 1343764 1404622 1577060 1290194 1494693
16209 1494693 1553246 1850475 1680819 1923799 2094710 1530846 1926898 1967331 1811861 2099675
16199 2099675 1603604 1902980 1742181 1830384 1553148 1836057 1989712 2090712 1552722 1421045
16189 1421045 1702741 1996060 1966994 2040288 2073184 1616408 1798645 2052824 1832549 1749068
16179 1749068 2241233 2057351 2093209 2179432 2045620 2231218 2421897 2099965 1947731 2074685
16169 2074685 2008397 1886455 2063378 1852868 1925557 1946498 1569477 1644693 2092316 1466150
16159 1466150 1610888 1939636 1533652 1488000 1407962 1794442 1929151 1743427 2055080 1622717
16149 1622717 1631478 1952087 1723298 1861952 2289278 2096457 2249140 2002121 2483356 2538036
16139 2538036 1977806 2234387 1936353 2181034 1742078 1859022 2268967 1863519 1349379
16130 1349379 1702366 1732016 1405701 1482540 1375373 1935640 2042558 1978274 1696496 1680971
16120 1680971 1306821 1616708 1707861 1571218 1643469 1432880 1685222 1603211 1404578 1715471
16110 1715471 1447397 2335755 1808789 1447033 2213844 1922445 2493586 2399405 1898035 1815135
16100 1815135 2019758 1970255 2284914 2180165 2056025 2240305 2137141 2290660 2099844 1721668
16090 1721668 2109268 2001712 1941943 2047916 1832285 2005146 1802161 2308945 2497103 2220774
16080 2220774 2414201 2088573 2189867 2225703 2145718 2455898 2240786 2009135 2150335 2545411
16070 2545411 2248576 2085831 2869046 3067841 2790742 3026973 2870549 2853848 2814683 3078736
16060 3078736 2912159 2797157 2872025 2664219 3228762 2660878 2694916 2885166 2974652 3014522
16050 3014522 3073290 2821332 2854230 3063576 3057518 3378743 3217012 2859857 3212261 2654048
16040 2654048 2983599 2999240 3180149 3246656 3273406 3389087 3248955 3088793 3326270 3819182
16030 3819182 3631262 3612143 3693791 3312965 3493521 4025175 3523626 3402773 3701884 3628516
16020 3628516 3621668 3156187 3647863 3413040 3831902 3669135 4075488 4084480 4081179 3984920 4203075
16009 4203075 3783427 4164739 4424850 4018968 4617837 4064740 4004013 4518160 4510104 3879580
15999 3879580 4595914 4093193 4584282 3904585 4040349 3845504 4427801 3968137 3944157 4593716
15989 4593716 4207695 3983380 4599640 4326989 4266607 4379184 3962564 4366385 4532001 3937084
15979 3937084 4388756 4332040 4776626 4535539 4297428 4456800 4640519 4303395 4336651 4401905
15969 4401905 4850035 4860284 4366112 4652441 4511127 4514303 4347523 4225145 4088245 4214878
15959 4214878 4564153 4268961 4315309 4527583 4418480 4296974 4531739 4207586 4717552 4723093
15949 4723093 4571688 4412307 4079582 4418771 4603987 4271566 4467366 4360519 4432631 4771972
15939 4771972 4867136 4733323 4602821 4891330 4903210 5144232 5189017 5181774 4876482 4784274
15929 4784274 5147314 5251162 5524651 5636606 5650001 5596399 5495290 6113835 6222938 5938613
15919 5938613 6275473 6595079 7369221 7424814 7627976 8155886 8842795 9366104 10198636 11045561
15909 11045561 12689247 14772040 17588857 22164948 29828470 39816322 52897722 69581807
15901 69581807 86958834 102840883 117005913 125988989 130082290 129207550 123271283 112729842
15893 112729842 99227817 83405556 68140091 53703244 41850122 32927449 25771856
15886 25771856 21195958 17320070 14176944 12478248 10539968 9044010 8339002 7571858
15878 7571858 7140423 6429391 5838227 6210904 6022529 5708574 5514597 5482891 5274050 5609797
15868 5609797 5165401 5174179 5037031 4580670 4964184 4405795 4170438 4540158 4388546 4293542
15858 4293542 4068621 4133413 4319064 4099800 4233049 4652352 4524829 3995530 4158246 3785750
15848 3785750 4087712 4231316 3966492 4095260 4445344 4300006 3690443 4106809 4305272
15839 4305272 4927348 4699155 4681398 4604109 4790531 5151695 4493660 4559400 4819502 4709574
15829 4709574 4724468 4561613 4170490 4400606 4486314 4208823 4064706 4498428 4601474 3820747
15819 3820747 4244449 4597593 4232806 4230769 4201926 4158472 4767935 4662309 4415685 4773192
15809 4773192 4914128 4942379 5089130 4522516 4890903 5075626 5029221 5093906 5297804 5639230
15799 5639230 5802714 5498021 6283668 6022518 6929767 6995161 6682534 7370217 7429126 7457837
15789 7457837 7817972 7171874 7814168 7855451 8264365 8533523 8593809 9088401 9524327 9718037
15779 9718037 10072886 10433969 10801841 10343816 10730843 9367771 10315199 10023004 10004958
15770 10004958 9751170 9806482 10458651 10440778 10671596 10861476 10719374 11147216 11479708 10481100
15760 10481100 10209338 10719683 10408778 10155258 9928816 10246911 10175874 10065082 9411152
15751 9411152 9677546 9761252 10268587 9833411 10096174 10794281 10671887 11325913 11123955 12123445
15741 12123445 12662974 13180440 13836801 12883344 13291784 13719777 13021859 13343379 13762075
15732 13762075 13479337 14132704 14843090 14307674 15002264 15008888 14660514 14144043 14093052 13557368
15722 13557368 13172261 13019544 12880259 12370034 12534012 12912272 12507602 12696262 12572947
15713 12572947 12277408 12282650 11484446 11233940 11150297 11146765 11238648 11594622 12361405 12974231
15703 12974231 13347784 13496166 13920896 14427392 14397481 14163052 14491772 14347084 14107507
15694 14107507 13658474 13736981 13879101 13410271 13084222 13316319 12995652 12453989 12715461
15685 12715461 12072243 12539704 12461628 11935432 11816875 12055030 11359703 10775126 11211249
15676 11211249 11351839 10900072 10570825 10332308 10449731 10595124 10724142 10768352 11312064
15667 11312064 12018207 12104554 13026149 13851097 15021236 15727332 16107977 17631060 18486225
15658 18486225 19601398 20358005 21848288 23325253 24632454 25829192 27427040 28607554
15650 28607554 30250053 31401614 32486472 33525990 34741932 36574491 37326069 39191700
15642 39191700 41070202 43532032 45628892 48180056 49032589 50821967 51719121 51386927
15634 51386927 51308608 50625720 49749204 49081447 48418625 48961646 49519005 49184626 49107549 49040194
15624 49040194 48579237 47610905 45813677 44084884 41553385 39464420 37252978 34836607
15616 34836607 33093893 31064698 29927861 28815793 27530704 26439139 25279608 24727921
15608 24727921 22733438 22335125 21803807 20895230 19997599 19410621 18758476 18542814 18225740
15599 18225740 17857978 17389973 17656700 18039601 18752971 19928387 22215659 27336018 38787555
15590 38787555 58917399 81154619 97219039 108194547 114456702 117209485 116347258 110821671
15582 110821671 98398385 81449096 64936664 49452848 37509497 29701013 24015034
15575 24015034 20659142 18711581 16471192 15184022 14352972 14719016 14528739 14520839 14477440
15566 14477440 14744725 14289905 14316321 15464607 15468308 16053314 17338503 19345567 23329124
15557 23329124 31826606 50068276 78776253 106482630 125488197 137687303 145101074
15550 145101074 147518057 144921631 135438353 116510875 94854950 72735077 52861190
15543 52861190 38553800 29524511 23852521 19258480 16743403 14595704 12860110 12079895
15535 12079895 11285408 11016177 10474083 10149990 10458889 9910452 10487334 9677185 9741559
15526 9741559 9475440 9399516 8518452 8833176 8727627 8590861 8411376 8433872 8382778 8686061
15516 8686061 8549327 8715616 8736300 8938033 9228943 8947985 9617802 9747853 9638611 9782405
15506 9782405 9731972 9636702 9749365 9307428 9125707 9606668 9548889 9456549 9326635 8634160
15496 8634160 9388975 9504529 9433165 9733688 9454964 9788729 9821127 10052998 10550319 10395080
15486 10395080 10467216 10445827 10722548 11227884 11734441 11678265 11703445 12081210 11919180 12135721
15476 12135721 12323486 11724846 13054326 13226004 14735374 15291507 16776659 17809333 18814641
15467 18814641 19533402 19432556 19348285 19571318 18607846 18314591 17462057 16630498 16756201
15458 16756201 17156958 17826723 18454465 19758166 20436964 21467439 21752398 21652298 22210641
15449 22210641 21387345 20550559 20013228 19439107 18438550 18458537 17691442 18370832 17828999
15440 17828999 18303440 18540477 19014950 18486105 18571259 18374370 17753620 17244818 16844446
15431 16844446 16256937 15824837 15571276 14786738 14520656 14074817 13830105 13248429 13741217
15422 13741217 13089023 13086309 12626062 12452089 11715770 11418541 11015469 11465505 10774129 11010716
15412 11010716 10759931 10440848 10728950 10289485 10781496 10880744 10926195 10689218 10906903 11593396
15402 11593396 11615552 11400365 11791922 11834124 11811437 12183711 12103805 12648600 12243514 12491730
15392 12491730 12208181 11986207 11682708 11621234 12334948 11202223 11492217 11427194 11622080
15383 11622080 11291911 11560146 11044830 11691047 11142163 10985122 11520301 11027120 11286779
15374 11286779 10963810 10885423 10932149 11524661 11329527 11597576 11720799 11629292 12105580 12136971
15364 12136971 12478938 12743234 12878224 12702363 12346100 13187435 13086620 13371058 13562042
15355 13562042 13488008 14674714 15278882 16245705 17947582 20593260 26119417 35854126 47687144
15346 47687144 59689257 67560497 73101298 76010242 76918659 75286362 71315247 63271056
15338 63271056 54210281 46501432 39881615 35857683 32796555 31261690 29752381 29074862
15330 29074862 27513864 26202661 25207715 24067584 23805049 23394655 24060831 23823654 24487397
15321 24487397 25056967 25003020 26049639 27809657 31162155 37855120 50767422 69453799
15313 69453799 89956239 108958842 121401846 130003403 133463277 131923559 125102089 112967602
15305 112967602 97017261 79184687 62466709 49345816 39446666 32757775 28662858
15298 28662858 26226195 23981850 23193308 21844111 21820862 22120472 22475009 22245141 22583704
15289 22583704 22177432 22583941 22027123 22253146 22043692 22274568 23464040 25766634 31150551
15280 31150551 40819741 52159704 61231588 68129864 72163564 73682104 74049515 71568069
15272 71568069 65922363 57340149 48716926 40446320 33523071 28389693 25745810 23548875
15264 23548875 22192585 20687599 19552715 18686347 18331041 18062392 18017579 18049308 17616931
15255 17616931 17810361 17939967 18240931 19230482 19495790 19264018 19794972 19724284 19287054
15246 19287054 18970942 19009076 18142596 18376521 17875407 17700250 17524468 18078101 18478225
15237 18478225 19413605 20924073 21741496 22321913 22278920 23012348 23129957 22769664 22009390
15228 22009390 21588204 20732653 20650467 19936759 19141085 19027507 18723471 18891121 18742250
15219 18742250 19180227 19446469 19844382 20828842 21695134 21503919 21588507 21269875 20662805
15210 20662805 19981986 19055601 17866452 16661585 15362776 15074780 14021393 13055453 13041401
15201 13041401 12168365 11726106 11904072 11824592 11981133 12121381 12150080 11990831 13274320
15192 13274320 13040273 13598091 13610329 13999758 13753069 14411164 14022276 13874662 14085799
15183 14085799 14115003 14168303 14834556 15526385 15666414 15743591 15902605 16155328 16528847 16438654
15173 16438654 16599518 16422455 16418452 15891839 16028748 14947913 15800099 15823609 15270810 15036602
15163 15036602 14959723 14963871 14355083 15403740 15225656 15925843 15561731 15168787 15633684 15540282
15153 15540282 15461434 15236918 15625542 15354508 15056249 15026872 14821167 14770621 14435469 14372452
15143 14372452 14790273 15236269 15205066 15597845 15543562 16378353 15917222 15391890 15875139 15953690
15133 15953690 15912176 15459250 14906433 15580217 15662003 15359603 15821970 15838500 15261911 14807608
15123 14807608 15051242 14890486 14844674 15063798 14296852 14365338 14181128 14665759 13899643 14320515
15113 14320515 14134867 13510735 14170800 14077396 14433783 14725041 14325158 14458334 14397621 14924660
15103 14924660 15608096 15924096 15972455 16804748 17114238 17311730 17700231 18329137 18852817
15094 18852817 19919522 21219534 23553652 26974902 31583475 35937454 40155990 42660232
15086 42660232 43897476 44799673 45020154 43602036 41492716 38501196 36261329 34772735
15078 34772735 35008129 36430053 40870518 45177993 49322633 52665369 54326979 55258615
15070 55258615 55427050 54677779 53087872 50926277 50647212 52611648 57998726 64184921
15062 64184921 68380352 72531922 75878072 79722071 82474754 85170623 85915446 84473130
15054 84473130 83906689 83512981 84360105 87029894 91126371 94841555 96801180 97482982 97561394
15045 97561394 98240150 99238165 99144143 98120151 95858733 91790132 87887720 82761902 78385977
15036 78385977 74231386 69162417 64588343 60158205 57981535 59932358 63197671 65822104
15028 65822104 67479363 67710338 67529289 68121321 67410370 66028679 63046329 62432398 62380665
15019 62380665 64969324 71327361 80697362 90568416 100262032 107559736 113997385 118911023
15011 118911023 122037290 123715234 123808455 123280333 123437197 126048719 131145581 138144263
15003 138144263 145752132 153124228 159422168 164204558 168422019 169889571 168656402 165319664
14995 165319664 161141534 157878624 155641246 154899248 157655697 163804174 175373575 193170560
14987 193170560 213392554 235941992 258586462 278988265 296728648 307790888 310915033
14980 310915033 305978954 293607029 275486464 252918198 227617355 202547776 178288150
14973 178288150 156251524 137286744 121949887 108856252 98538027 90101278 83717419
14966 83717419 78981603 75169767 72090038 70061810 68954753 68668877 70454411 74905883
14958 74905883 81415554 92507817 107403981 129778746 159064974 194536290 235843241
14951 235843241 281452866 330738357 379155977 425943662 471895137 510992934 534711525
14944 534711525 540894780 529859253 508517939 480545671 449940584 415391390 376899428
14937 376899428 339557404 306531710 279979301 259390594 243535152 227803092 211368554
14930 211368554 195023120 178032614 162331319 148187435 138148949 131621543 129386221
14923 129386221 126107543 123179077 117861352 113002794 106527025 99387783 90490755 79512080
14915 79512080 67774602 56766335 48052020 40685489 35500427 32191727 29537977 27972678
14907 27972678 26924728 26513368 27267048 27491550 28250079 30166511 32195047 33873168 37593662
14898 37593662 42316380 50121655 59010585 66962353 72270226 75234752 76937012 76810068
14890 76810068 74707914 70322719 63904663 56567487 48964530 42823370 38836129 36237408
14882 36237408 34484371 33101862 31989341 31787767 32489414 33189903 34532807 35883379
14874 35883379 36661886 37000708 37537139 38152481 38761338 39365259 39105914 38678095 38511263
14865 38511263 39061746 40651677 43086427 47974333 56470471 68959873 83225476 98022410
14857 98022410 113648990 127666120 138222668 143206498 142607468 137373019 128066765 115482370
14849 115482370 101150442 85886046 72331761 60283077 51217954 44492238 40208390
14842 40208390 37396285 35326469 32978389 32000291 30620005 29456650 28293208 27854029
14834 27854029 27075383 26465220 25973066 25484317 26708806 26746585 27696334 27918795 29776566
14825 29776566 30525412 33340217 37271938 45368845 56247302 69371795 82182017 90742323
14817 90742323 96414461 98396998 97310732 93718883 85342824 74501786 62560386 51607657
14809 51607657 41258464 34220355 29396883 25977713 23957757 22498514 21781290 20700395
14801 20700395 20145600 20022488 19801678 20111350 19483663 19815846 19062602 19228633 18200912
14792 18200912 18695025 18215409 18181337 18226798 18397619 17836540 17871283 18384706 18049515 18731602
14782 18731602 18814390 19756130 21122370 22227722 23422569 24518517 25333620 25793978 25669325
14773 25669325 24996019 23977153 23195845 21557953 20764195 19426827 18893013 17998598 17650199
14764 17650199 17645577 17163928 17374573 17366782 17687194 17413077 17845231 18138023 17985278 18280678
14754 18280678 19055921 19508645 20617260 21156068 22183721 22507307 22793103 23306698 23528229
14745 23528229 23870296 23561051 24183882 24248661 25303962 26567980 28514511 30466225 33953770
14736 33953770 38020669 44312392 53021274 67284885 90491123 126255541 173454848
14729 173454848 225781398 279629000 327901857 364713973 385543486 391318609 380885647
14722 380885647 354577246 316266167 268988364 219343495 172756874 133357465 102561309
14715 102561309 79499637 63251510 52787265 45023096 38761432 34447387 30504858
14708 30504858 28247959 26359423 24908884 23137543 21894351 20283149 18913044 17833847
14700 17833847 17762803 17038375 16729245 16162616 16517974 17082684 17257836 17799473 18039534
14691 18039534 17982376 17303834 17303016 17270492 16210245 15692415 15619653 15577060 16425018 16889895
14681 16889895 17369845 17794251 19167154 20605351 23722705 24665685 25832602 26183872 25682198
14672 25682198 25518702 24887150 23158786 21076242 19554245 18773266 18632514 18980015 19231716
14663 19231716 19363221 18981090 18930984 18557095 17767230 16524918 15218345 14128767 13002159
14654 13002159 12626971 12560596 12451714 12835356 13433453 14722783 15635908 17153767 17908895
14645 17908895 18729340 18904069 19850139 19804666 19950289 21224279 21666969 23066476 25096529
14636 25096529 26688738 27547239 27951809 27843104 26791498 24768323 21951798 19980606
14628 19980606 16714720 14216872 11584628 10412732 10038039 9172814 8414699 8210999 8145081
14619 8145081 7727118 7735215 7814943 7652615 7809301 7290204 7568870 7395067 7144169 7546661
14609 7546661 6873556 7219680 6936963 7142154 6930727 7217215 8536740 9673465 11234751
14600 11234751 14181740 16605291 18102348 19801553 20338692 20489041 19637640 18373679
14592 18373679 16713753 14908917 12403711 10182291 9315068 8750071 8238276 7845147 7517623
14583 7517623 7966589 8075475 7634868 8241960 8273562 8593263 9232337 9028657 9387565 9401136
14573 9401136 10102594 10529089 10365382 10915094 11812745 12996435 15484754 16312607 18374468
14564 18374468 19480127 21569399 25033786 30940373 40844484 54126538 64598378 70947642
14556 70947642 75460731 78055418 78256974 74715692 69382455 59479184 49082012 40236663
14548 40236663 33222435 31217894 32907999 39974768 52658366 65965626 76994639 83759145
14540 83759145 87898677 89072323 86826180 82062075 72958673 61063757 49831459 39788408
14532 39788408 33010015 28214346 25592906 24074417 23051290 21971101 21391119 21048589
14524 21048589 20709790 21099499 22988515 28757511 37661681 47507307 55000814 60076459
14516 60076459 64196350 65524227 66192954 64268128 60285183 55285226 49259985 44500338
14508 44500338 40992292 41093023 43349973 48714439 56685932 63005430 67387885 70347070
14500 70347070 71236346 71693379 70191926 65190914 59218896 52000412 45678534 39457899
14492 39457899 34003800 29461306 26256167 22725667 20811208 17302801 15031356 12806168
14484 12806168 11006098 9597496 8657518 7639188 7154029 7270515 7233774 6910344 6755109
14475 6755109 7042379 7370176 8400500 9852234 11291703 12696639 13798403 14759733 15038198
14466 15038198 14729159 14533047 14103436 13565671 13236513 13621743 14995429 16704199 18116852
14457 18116852 18667954 19238903 19516000 19313342 17842165 17105488 15098644 13580867 12842739
14448 12842739 11702722 10957408 11345969 11738967 12073525 12055862 12544841 12821185 13568277
14439 13568277 14012057 14530383 14890270 15130230 15789918 16640115 17769835 19392854 22548440
14430 22548440 27659512 35805461 44943858 54527130 61774650 67443448 71107082 71911556
14422 71911556 71098188 67912199 61208131 54643767 46573728 39733547 33840958 28856483
14414 28856483 25855368 22452007 20208438 17928685 15959710 15039349 14081267 13011285
14406 13011285 12699056 12385168 12314781 12272907 12020604 12645849 12522819 13702838 14238439
14397 14238439 15893458 18463524 23038379 30019438 40597231 54647743 71227519 86123051
14389 86123051 98920711 107397402 112601060 112892082 108924076 101034346 88439909 74748363
14381 74748363 61652095 49059788 39038196 31735489 26149012 21927082 19086227 17395674
14373 17395674 15306910 14748791 14119788 13225801 13452782 12759856 12284063 11904704 11959766
14364 11959766 11364759 11222307 11971947 12489526 12987642 14721538 16553513 20002729 24731360
14355 24731360 30684768 36944548 42872577 48611930 51670193 52506843 52180972 49673879
14347 49673879 45855422 41025625 35043367 29688683 24748992 20382117 17814396 16487034
14339 16487034 15562212 18374558 23904957 30298387 33491471 35881805 37324261 38346853
14331 38346853 37753358 36231750 31884782 27235613 22502276 18295768 15463093 14260567
14323 14260567 12995142 12695120 12507290 12390699 12834749 12996845 14130085 14664331 15945127
14314 15945127 17729591 18531231 20692225 22489586 25607611 28705242 32186589 36852224
14306 36852224 43210889 51083585 61793228 76490106 96958976 126231636 163495463
14299 163495463 205289654 245741811 278761004 302168338 315512892 317514851 308700059
14292 308700059 288172336 256250397 218412327 179269610 143827148 114528285 91292404
14285 91292404 73457496 60061704 48490782 40693999 34132099 29308866 25041488 22335374
14277 22335374 19853833 17999196 16558277 14905127 14192675 12769923 11979698 10425534
14269 10425534 10254017 9578180 9377642 8572213 8234528 7973493 7871866 7524984 7198163
14260 7198163 6866881 6598000 6488244 6589630 5879610 5944792 5637363 5606168 6004950 5668909
14250 5668909 6247014 5612854 5399751 5155501 4912636 5459763 4805807 4748571 4665564 4554176
14240 4554176 4191162 4224185 4564441 4688027 4263722 4158227 4031143 3990762 4356511 4096968
14230 4096968 3889163 3997355 4159092 4146454 3971104 3628108 3917788 4265650 3905901 3919290
14220 3919290 4353727 4629346 4085571 4281387 4234166 4492749 4400336 4341044 4433743 4118642
14210 4118642 4652017 6403479 8024204 8201760 8431457 8698147 8542658 8176167 8050383
14201 8050383 7243562 6552848 5155685 4321545 3876002 4038861 4189996 3893356 3800911
14192 3800911 4174206 4222232 3939910 3784187 4097622 4088646 4487432 4361123 3514649 3893047
14182 3893047 3617160 3646912 3729635 3947668 3440515 4077591 4084129 3993598 3893992 3952739 3900387
14171 3900387 4323802 3750663 3703904 3641436 3972188 3494001 3389811 3826535 3958818 3381718
14161 3381718 3530053 3199954 4116981 3856126 4229927 4380268 4623318 4421396 4431473 4089717
14151 4089717 4158943 4423420 4297270 4585548 4640874 4853525 5317598 5746431 6284500 7699921
14141 7699921 10116902 12540415 15376108 16840399 18370828 18825653 19329766 19044198 17406554
14132 17406554 16256393 14219807 11918854 9648841 8563470 7446311 6464812 6233598
14124 6233598 5726890 6774877 7509347 8203930 8789676 9172974 9197511 9067222 8458607
14115 8458607 7833869 7954813 7069902 6872948 5707406 5248435 4927447 5539029 4952323
14106 4952323 4900214 5304957 4647301 5203840 5535677 5747835 6018575 6820080 8103296
14097 8103296 9023148 8552445 9810759 9557689 9503243 9926724 8855267 8583613 7880988
14088 7880988 7855640 8268989 8789863 10019569 11309598 12292193 12954104 12974270 12989845 12910081
14078 12910081 12473927 10857587 9546411 8528989 7527556 6903998 6733691 5979990 6055931
14069 6055931 6072169 6149507 5740939 6183770 6009212 6759762 7105489 7683255 8500524 9183257
14059 9183257 10357143 10151341 10657467 10613762 10324000 10587127 10769691 10663227 10677342 10914390
14049 10914390 11174111 12298284 13432629 14791914 15876037 17263568 18642265 20232237
14041 20232237 21040578 22178560 22543188 23756820 24180190 25359458 26930076 29177444
14033 29177444 32022511 36129026 41614313 49818386 59716402 73338658 94015219 122124000
14025 122124000 159897983 204746196 248027852 283549003 307989726 323200458 326852395
14018 326852395 318325973 298554894 266535448 227890946 186982895 148741445 118881961
14011 118881961 94350452 76184808 61611590 50491446 42090878 35568148 30410223
14004 30410223 26198065 22733100 20230526 17875346 15715664 14716661 13650663 11967242
13996 11967242 11412459 10219429 9913758 10146669 9292440 9931266 10070757 10069710 10157076 11050364
13986 11050364 10857390 11466057 12020178 12255152 12432999 12429966 12095443 12949663 12172768 11799424
13976 11799424 11442186 10626911 9739796 9101341 8280550 7713150 7425627 7155992 6431476
13967 6431476 6159031 5980285 5633394 5416774 5112902 5409232 4614799 4412647 4501633 4248180
13957 4248180 4583789 4353194 4457372 4491320 4187297 4853533 5123603 5622990 6246518 6755940
13947 6755940 6892320 6811524 7532079 8427092 8490627 9456664 12382967 16680482 23543182
13938 23543182 32017265 41379836 50421560 59004367 65535552 68721012 69254621 65897172
13930 65897172 60990388 53048779 44159911 36246865 27566661 20829461 15819970 11903973
13922 11903973 9838437 7639904 6787182 5639889 5097751 4583136 4330953 4111348 3642335
13913 3642335 3817068 3989626 3792372 3879985 3455122 3699467 3560223 3664019 3879508 3697412
13903 3697412 3615407 3475327 3785638 3180304 3377685 3507949 3387849 3556591 3139655 3501566
13893 3501566 3468730 3254458 3803964 3368298 3377249 3314139 3408943 4004611 3707113 3287416
13883 3287416 3384149 3639663 3245893 3027683 3601850 2914359 3280995 3292161 3354292 3281163
13873 3281163 3418820 3468105 3185176 3493012 3744624 3198578 3987211 3414175 3555809 3609520
13863 3609520 3735419 3896404 3437782 3429897 3557823 3487868 3873233 3338576 3227581 3569349
13853 3569349 3866949 3344739 3125543 3761881 3652278 4177026 4004116 3734228 4165235
13844 4165235 3671758 3420714 3855711 3628741 3564645 3463350 3013650 2688316 2812063 3052968
13834 3052968 3203839 2728425 3344620 2892657 3464559 2762183 2728601 3355505 3238198 3166548
13824 3166548 3177236 3418576 3503641 3375402 3061524 2972653 3259044 2809114 2997745 2892163
13814 2892163 2646016 2626962 3071322 2735924 2998343 3196617 2975700 3382808 2702481 3009340
13804 3009340 2931765 2799163 2582042 3371061 3027418 2951904 3219392 3267364 3530726 3226093
13794 3226093 3131135 3123273 3179644 3035942 3403469 2877400 2833714 2850614 2601081 2779217
13784 2779217 2357628 2472814 2453127 2568108 2848230 2533628 2684595 2928681 2566228 2994303
13774 2994303 2853817 2952762 3145297 3287436 3219169 2729320 3025254 3191269 3140561 2683018
13764 2683018 3342282 3062951 2890788 2892062 3069770 2469251 2604294 2848959 2723048 2945980
13754 2945980 2855522 2618827 2808999 2748645 2625102 2611202 2941280 2487546 2529720 2989579
13744 2989579 3124719 2676744 2881780 2329989 2468659 2934521 3117314 3579695 4287550
13735 4287550 3943961 3688505 4670824 3715192 3749446 4028890 4245630 4297802 3567627 3501149
13725 3501149 3392591 3118971 3286712 3032025 2524688 2520014 2331875 2898732 3347928 2976401
13715 2976401 2438065 3026604 2978998 2986691 3214831 3205301 2682041 3132835 2966903 2760417
13705 2760417 3223366 3181394 3140602 3346504 3318713 2718329 3556094 3069166 3715967 4321462
13695 4321462 4453372 4891491 4961282 4680691 5295330 5203679 4815532 4382169 4442386 3987984
13685 3987984 3456436 3359744 3649283 3366825 3198205 3636415 3513615 3225594 3734355 3533502
13675 3533502 3561376 3905792 3853551 3918020 4208090 4161663 4184392 5047936 4762600 5704871
13665 5704871 5721550 6068094 5898996 6853989 6531381 6201394 6259076 5503527 5384778 4972439
13655 4972439 4895194 4894052 4114534 3859429 4124281 3547220 4000227 3518239 3533770 3975842
13645 3975842 3591977 3730811 3430618 3495041 3683769 4201954 4020253 4182940 4660427 4980489
13635 4980489 5413637 6012673 5809176 5742179 5706762 5768914 5335686 4944019 4608912 4354866
13625 4354866 3797911 3678274 3313978 3529563 3461013 3159518 3269958 3108220 3775529 3501232
13615 3501232 3305313 3398309 3726140 3705488 3715818 4371817 4264608 4245036 4169043 4297685
13605 4297685 4438246 4027148 4215040 3951421 3545627 3526412 3911893 3531692 3930724 4214598
13595 4214598 3453125 3999246 4471926 4421919 4890246 4196029 4384688 4720903 4234027 4313020
13585 4313020 3857928 3504077 3700843 3560351 2929773 3127562 3554004 3202784 3217176 3183848
13575 3183848 2820556 3643921 3299076 2802293 3103788 3230758 3400498 3357765 3286717 3199534
13565 3199534 2951268 2682128 2995601 3133086 3307423 2621399 2979300 2860829 3332149
13556 3332149 2721469 3275470 3057425 2949483 2997381 3161316 2775588 3298662 3344783 3561684
13546 3561684 3994242 4062331 5212268 5288019 5305208 5673329 5173192 5213329 5388166 4786994
13536 4786994 4891173 4425325 3722208 4008924 3384622 3577857 3351008 3906367 4821351
13527 4821351 5086608 4687322 5529445 5099115 5338177 5699562 4709468 4837262 4447207
13518 4447207 4041997 3717156 3283942 3124200 2954210 2976050 2280691 2824254 2697302 2824107
13508 2824107 2681246 2436083 2227817 2272493 1756461 2778562 2549877 2297461 2952159
13499 2952159 2347680 2538001 2501908 2196857 2876520 2568466 2424155 2890152 2477984 2596421
13489 2596421 2593950 2656971 2955625 2611036 2441296 2605131 2730568 2498276 2345002 2345617
13479 2345617 2186008 2699372 2594421 2879618 2180414 2612228 2460321 2659460 2444861
13470 2444861 2469057 2376173 2570935 2703325 2451764 3025267 2837832 2572142 2572492 2809971
13460 2809971 2924579 2501302 2763701 3101268 3447745 3614187 4741180 4320099 5223520
13451 5223520 5021357 4821177 5115570 5211010 4764466 4749890 4395848 4083530 3527000 3236709
13441 3236709 2875453 3129447 2886553 2644365 2968217 2832490 2900540 2483131 2824144 2590742
13431 2590742 2674627 2796338 2681611 2936921 2761456 3062855 3766547 3776781 4578517 4697334
13421 4697334 4817150 5328585 5376114 5088740 5054671 4776537 4146381 3977497 3697580 3355945
13411 3355945 2777299 3440136 2686007 2985850 3322252 2903930 2861606 2658810 2954844 2550534
13401 2550534 3349915 2642740 2396233 2625292 3090397 3012101 2854059 2917484 2634768 3576821
13391 3576821 3154543 3876550 3493659 3957822 4566516 5126936 4911097 5193071 5321997
13382 5321997 5260277 5580911 4827942 4857280 4587411 4160445 4010713 3673647 3190289 3946987
13372 3946987 4007297 3824516 3972876 4023481 4079189 4129568 4054051 3972236 3713782 4057217
13362 4057217 4028874 3717121 3174527 4171165 3650805 3750997 3966196 3917327 3710665 4711432
13352 4711432 4410471 4366459 4433200 4360460 4384746 3861053 3987313 3772520 3997228 3729375
13342 3729375 3632346 3400016 3567052 3522038 3498143 3624412 3510731 3588393 4259610 3544916
13332 3544916 3620606 3436475 3621595 4036240 3677267 3412190 4221775 3956607 4169812 3290604
13322 3290604 3875347 3785429 3811532 4099915 3889625 4886265 4896915 5369639 5605898 5268959
13312 5268959 5819660 5773038 6139690 5409862 5442599 5305315 4958007 5016801 4999730 5003560
13302 5003560 5507695 5641960 5848614 5932589 5870306 6420679 6046290 6035286 6347539 6159021
13292 6159021 5926866 5779261 5379400 5011988 5574046 5540245 5640361 5690892 4877595 5248606
13282 5248606 5529179 5754020 5371204 6065478 5778405 5866324 5693265 6047001 6466286 6431751
13272 6431751 5928968 6022132 6183126 6246779 7578879 6612026 7075873 7691906 7477202 7354545
13262 7354545 8072548 7656263 8118000 8397916 8618568 8634659 8849152 9465108 9607098 9539445
13252 9539445 9531045 10248376 9956146 9782198 9880174 9833269 9930457 10130672 10286780 10470924
13242 10470924 10508877 10352244 10856552 10795825 11394822 11890317 12075416 12441815 12858028 12809279
13232 12809279 13166623 13633201 13708246 14282504 13733038 14255804 14320694 14571836 14295043 13783890
13222 13783890 14015697 13499789 13657373 12776420 12862690 12578225 12797538 12796616 12631033 12716772
13212 12716772 12792468 12388430 12866203 12929550 12950515 12484506 13011507 12819330 12768587 12437949
13202 12437949 12646294 12071311 12045482 11737472 11703970 11785762 11802175 11581473 11517049 11125742
13192 11125742 11122614 10604109 10611901 10766912 11010413 10390828 10844393 10543668 10278049 10129701
13182 10129701 10148899 10061046 9956132 10011228 9645556 9800892 9888209 9857073 9436170 9762599
13172 9762599 10075028 10619537 10382870 10162579 9820585 10104230 10730844 10657379 10930375 11495329
13162 11495329 11956936 12210944 12988005 13214898 13786849 13890660 14236932 13924198 13800960
13153 13800960 13554799 13220221 13028833 13224810 13575678 13021567 12013394 12461934 12520829
13144 12520829 12759995 12375564 12675278 12254200 11749964 12108819 10703988 10071019 9769879
13135 9769879 9205515 8881288 8782717 8328674 8098200 7878603 8486554 8042839 8833979 8375535
13125 8375535 8246929 8551274 8553786 7780095 7511520 7480505 7069734 6784041 6976859 6749238
13115 6749238 6689480 6217832 6383590 6323350 6152304 5878192 6258346 5961776 6260553 6251055
13105 6251055 5757331 6326896 6542590 6070901 6387205 7278328 7848337 8374920 9055948
13096 9055948 9714139 10481665 11424734 11741215 12084682 12020021 11963892 11593976 11796418 10948485
13086 10948485 11069392 11041985 10968578 11025543 11176597 11200409 10733055 10839923 9806427 8911737
13076 8911737 8491395 8079963 7496305 6006232 6458198 6083530 5902847 6251990 5699693
13067 5699693 5676406 4824881 5497534 5698550 5784259 5493584 5545599 5819621 5760291 5857234
13057 5857234 6016581 6184679 6261638 6261269 6298596 5667722 5876915 5083041 5824059 6010657
13047 6010657 4949180 5125603 5337625 5803276 5233489 5364566 5437192 4931018 5245383
13038 5245383 5804549 5902380 5491628 5887791 5843979 6050118 5943510 6195397 6581476 6543509
13028 6543509 6574671 6572304 6472366 6684938 6892990 7095589 6965122 7128024 7168450 7643207
13018 7643207 7050061 7416346 7718036 7784785 8267191 8194588 8398760 8333041 8580748 8732031
13008 8732031 9429146 8786702 9429008 9405008 10069388 10023624 9612133 10646563 10599185 10561184
12998 10561184 10511120 11117908 11754183 12180572 11599751 12332219 12257627 12824628 12809286 12913306
12988 12913306 12554819 12352864 13354504 12592463 12287469 13136164 12616577 13425342 13025395
12979 13025395 12548728 12871599 12889491 12296754 11955285 12501552 12076729 12053226 11200361 11145807
12969 11145807 11467495 11181361 11058991 10717928 11062214 10405139 10926140 10366598 10809491
12960 10809491 10147352 10361652 10439147 10318713 10138583 9654355 10277077 10248178 10375228 9927185
12950 9927185 9769928 10187836 10057036 10056733 10262007 9976296 10165266 10056858 10417136 10079984
12940 10079984 10006023 9673613 10259687 9919417 10510670 10951905 10748700 11118325 11529290
12931 11529290 11827217 11545275 11825552 10939290 10857573 11023377 11049699 10783985 10699217 11055420
12921 11055420 10930007 10739469 11121333 10979378 10593975 10859258 9927955 10105576 9714985
12912 9714985 9558527 9445576 9119922 8982009 8428212 8357874 8380439 8210483 7761802 7769567
12902 7769567 7976954 7249114 7255221 7490389 7631139 7161473 6923300 6607269 6570000 6534862
12892 6534862 6275011 6777620 6264178 6688614 6404836 6411978 6447120 6063150 6120248 6359806
12882 6359806 6284856 6046573 6203206 6079408 6002841 6012961 5909244 5629647 5429911 5441989
12872 5441989 5900369 5727618 5424055 5365278 5131060 5351951 5454343 5516647 5302250 5530655
12862 5530655 5457406 4941826 5315609 5296034 5067999 4869906 5632318 5370167 5391856 4886190
12852 4886190 5239603 4857702 4852325 4692821 4939620 5286099 5220034 5063211 4892739 5276125
12842 5276125 5150883 4543715 5210571 5060445 5308650 5495541 5130169 5019240 5463089
12833 5463089 5219915 5303263 5368223 5199343 5267136 5003089 5286525 5101188 5363048 5283226
12823 5283226 4877167 4752769 5605207 5131521 5019677 5434716 4828619 5182861 5163598 5529698
12813 5529698 4723541 4869637 5447860 4878716 5029335 5150294 5458983 5099412 5036799 5058407
12803 5058407 5398030 5239481 5445266 5410824 5363263 5433072 5238197 5335564 5026523 5379001
12793 5379001 5402404 5669816 5172237 5590163 5467014 5172654 5232886 5395323 5431609 5153517
12783 5153517 5330325 5350928 5514684 5621567 4789593 5494959 5735848 5081267 5063655 5278305
12773 5278305 5306692 5540362 5111377 5644782 5288681 5706902 5320273 5620316 5750780 5554642
12763 5554642 5925770 5746056 5637034 6044163 5258170 5650526 5514526 5845533 5710983
12754 5710983 5552594 5772300 5630617 5385234 5641424 5743122 5441939 5964700 5372953
12745 5372953 5579130 5376158 5271456 5840262 5604802 5504381 6029241 6061040 6093661 5778893
12735 5778893 6018183 5661754 5734310 5634581 5839040 5782612 5927552 5926435 5540142 5834052
12725 5834052 5489481 5463284 5780157 5734649 5658604 5754478 6183404 5670907 6013666 5862265
12715 5862265 6120396 5930156 6016833 6465272 6394789 6162163 6178332 6750611 6483453 6936738
12705 6936738 6833854 6765651 6955989 7589929 7298420 7038862 8022094 8188225 7495741 8214310
12695 8214310 7768714 8599917 8780927 9682582 10995033 11993985 13445964 13945326 14519157
12686 14519157 14663510 14072836 14224731 13497739 12802718 12131230 10588169 10117094 9447942
12677 9447942 9464030 8798224 9056925 8465567 8870353 8876979 8847581 8887300 9417161 9291574
12667 9291574 9190808 9564731 9379779 10058065 9440554 9194289 9130363 8902189 8843190 8778815
12657 8778815 8640415 8758793 8626596 9539862 9477021 10034282 10010014 11142817 11512716 11842159
12647 11842159 11952368 12225295 12498187 12476972 13052983 12685810 12478607 12332095 12060956
12638 12060956 12310245 12385128 12336837 12901295 12584536 12615794 12777186 12541518 13100144 13805387
12628 13805387 13238681 13513398 13715973 13802760 13855681 13707734 13042217 11902654 11694720
12619 11694720 11189678 10392253 10488806 10161291 9950160 10708011 11312989 11902687 12761227
12610 12761227 13373192 14699596 15424680 16605055 17063637 17083969 16392263 15858266 15612650
12601 15612650 14651701 13847967 12359672 11092547 10950340 10299238 9768694 9976876 9734823
12592 9734823 9701781 10894109 11020202 10873581 10948003 11829819 12221610 11755549 11935676 11860216
12582 11860216 12085063 12537148 13001760 13455141 14139309 14081923 13632029 13785588 13260770
12573 13260770 12691754 12534511 11514406 10521934 10547857 9662523 9546871 9095327 9192566
12564 9192566 9014628 9477951 9594768 9510676 9431666 9569683 9552330 9268990 9208201 8852738
12554 8852738 8890852 8768739 9004362 8563728 8946921 8640179 9361946 9331870 9106058 9048196
12544 9048196 9669472 9805500 10267144 10825082 11082208 10989333 11336590 11456171 11032228 10865325
12534 10865325 11183991 10559042 9394635 9832643 9302969 9065510 9242043 9298062 9288841 9366187
12524 9366187 9513217 8873936 9049004 9342549 9424033 9740914 9723821 9865654 10157801 10481334
12514 10481334 11441528 12280027 13066523 13522567 13854105 14827666 14496007 14320954 14105191
12505 14105191 13342425 11978416 12263970 11287447 11039720 10923948 10253915 10332638 10390843
12496 10390843 10299909 10064052 9611946 10016751 10205008 10382128 10104356 10531457 10458096 10524322
12486 10524322 10258768 11211418 11683398 12311821 12523917 12910465 12497506 13234690 12713462
12477 12713462 13231140 12383651 11872678 11564279 11652673 10809351 10611267 10680966 10905420 10475566
12467 10475566 10756674 11259810 10802471 11002776 11143779 11330815 12376094 11925738 11744986
12458 11744986 12232396 12583008 13389955 12820810 13759237 13882918 13600527 14697051 14554345
12449 14554345 14449619 15137163 15608368 15418414 15732942 16024982 16279630 15939809 15555204
12440 15555204 15659458 16282610 15844181 15840372 15437730 16079066 16617811 16031860 16895024 17670441
12430 17670441 17903577 18202881 18895668 19537466 20140706 20176259 20942376 21242446 21981286
12421 21981286 22308833 22892347 23243705 23033114 24422257 24161836 24606990 24169554 24375911
12412 24375911 24123983 23693151 23563428 23621203 23031468 22955661 22702314 22056726 22294319 21863075
12402 21863075 21661648 21981494 21945923 22565015 22169073 23100782 23429119 24020156 24924339
12393 24924339 25783944 26612235 27234422 27989594 28658132 29506953 30363920 30876201 31250704
12384 31250704 31701860 31826324 31916069 32061395 32737975 32506738 32574183 32607945 32788982 33348713
12374 33348713 33246035 33395681 33364479 33105942 32817797 33504173 33143120 32898669 32780648
12365 32780648 32962326 33046951 32622716 32850540 32478770 32491662 32640640 32575982 32389344 32165274
12355 32165274 32349225 32755731 31760170 31604882 31357759 30826026 30458582 29833322 29387447
12346 29387447 29712190 29710018 29276327 30120623 30823833 30959149 31398034 32469970 33315938
12337 33315938 34779657 35093228 35938943 36937521 38304553 38615462 39447888 40289234 40912447
12328 40912447 40924861 41543118 42065272 42399329 43192033 43364021 43143803 42907561 43340230
12319 43340230 43632698 43187178 43474018 43582839 43605356 43610084 43939921 43935230 44603992 45235317
12309 45235317 45750688 47309951 47837337 48871097 49667816 49916304 50181404 49900679 49897954
12300 49897954 49377494 48065995 46336289 44792465 44192562 43182249 42471106 41509754 41037119
12291 41037119 40026916 40279033 39196846 38162909 37026698 35928445 34337517 33304082
12283 33304082 32241814 30713401 29592653 28561493 28132085 27306750 26676236 26110432 25503742
12274 25503742 25695182 25662726 24646549 25358371 25162538 24950733 24760681 25042025 24717270
12265 24717270 24630230 25201183 24773743 24235796 24404845 24741320 25111386 25776962 26444280
12256 26444280 27562021 28085672 29512745 31067965 33186841 34769154 37055435 39271485
12248 39271485 42116095 44822075 47318349 49494045 51345656 52645708 54072597 54597141
12240 54597141 54646335 54722360 53675194 53143975 52308183 51858561 52095707 51527636 50635030
12231 50635030 50096527 49143424 47780819 44935118 43414329 40942017 38445935 35764618
12223 35764618 33309349 31027599 29501981 27275790 26846886 25687259 24612683 23563901
12215 23563901 23325615 22498341 21345595 21155391 19942925 19784581 19467861 18623740 18113994
12206 18113994 18440184 18309097 17798229 18103064 17629880 17920273 17804175 18026575 18432212
12197 18432212 18206270 18382648 18595905 18860847 19528183 19874024 19972096 20303418 20917750
12188 20917750 21190594 21259249 22160038 22037511 21957319 22210443 22647426 22603589 22430222 22219542
12178 22219542 22268238 22339300 22342573 21802837 21553633 21472880 21868521 21433961 21950493 21994834
12168 21994834 22080421 22283312 22558826 23092341 23772570 24384252 25323161 26240087 26940209
12159 26940209 27164579 27856875 28478432 27817202 27424457 27207982 27119094 27246855 27032787
12150 27032787 27709326 28773923 29933724 31233984 32623002 34220921 35728797 36880313
12142 36880313 37960651 39048372 40909355 41856606 42981809 44829557 46801780 49127545
12134 49127545 51628590 54579566 57703353 61962980 66601158 70858799 75210051 78800060
12126 78800060 81745856 85142961 86839985 88167212 88216142 88327057 87279870 85977752
12118 85977752 84506471 82455385 80601701 78774953 76308727 74399323 72846736 70329257
12110 70329257 69279294 66576526 65502489 64044131 62889814 62878132 62345526 61798255 61769927
12101 61769927 62057817 62400661 61698298 62343046 61925693 61047760 60045069 58955415 57786541
12092 57786541 56829273 56930801 57422560 58299632 59635528 61076588 62534332 64807111 65864833
12083 65864833 67015437 68079594 68781861 69217538 69643318 69691968 70278340 70123796 70281720
12074 70281720 70186872 70050768 69144976 67858834 66856244 64402480 62617505 60849977 58266636
12065 58266636 55760718 53865201 52528799 50548679 49519497 48642505 47523290 46813500
12057 46813500 46287201 45294784 44190081 42836898 42020465 40661336 39746240 39933930 38278326
12048 38278326 37783663 36849056 36699707 35906953 35875994 34734756 33505988 32878589 31627804
12039 31627804 31024577 29989297 29316113 28968742 29147404 29297781 29411067 30209632 31385640
12030 31385640 32648548 33630133 34628927 34863840 34824769 34230090 33348323 31568426 30414230
12021 30414230 28582924 26646543 26347569 24996799 24212881 22717404 22374152 22221689 21802449
12012 21802449 20956652 20258572 19249010 19041338 18301031 18329537 17947704 18158783 18554393
12003 18554393 18740314 19425263 19479229 19550278 19261525 19271068 19063345 18119118 18046481 17392243
11993 17392243 17746579 17132946 16971588 17254433 17243763 17258232 16979003 17135259 16710109 16528007
11983 16528007 15683667 15395465 14874972 14388953 14444217 14288510 13873280 13605819 13824882
11974 13824882 13252512 13111715 12280444 11867613 11719393 11214930 11170045 10308322 10499013
11965 10499013 10316976 10237291 9938224 10130311 10325652 9707941 10207078 10645566 11077148
11956 11077148 11061396 11302783 11365009 11206489 11436775 10992446 11049804 11224125 11493861 11147801
11946 11147801 11721183 12076010 12722418 13045267 13620921 14077500 14693489 14105795 14605715
11937 14605715 15374550 15302442 15291277 15283071 15288380 14618808 15099764 14448403 14526607 14091882
11927 14091882 14153502 13925737 13766107 13414355 13468705 12855905 12306055 12361114 11917952 11656130
11917 11656130 11356964 10825892 11218415 11425055 11319394 13216433 17919317 29563076 38999196
11908 38999196 44093630 47534562 49892499 49676333 49174456 46668018 39617014 32406842
11900 32406842 25221440 18735679 14638555 12514542 11465964 10708737 10191218 10064526
11892 10064526 9905056 9565156 9979677 9995087 10760867 12378857 12995561 14845529 15542070
11883 15542070 16758650 17344460 17586758 17288480 17268036 16752282 15830448 15120915 14127539
11874 14127539 13250003 12360102 11825196 10856313 9792547 9558120 9125868 8369587 8278507
11865 8278507 8513951 8189401 8285680 7664687 7747584 7809920 7599944 7826177 7697205 7858708
11855 7858708 7754550 8239674 8141349 8667107 9166665 9119479 9129270 9932671 9975871 10690597
11845 10690597 11517539 12114889 13323222 13662157 13739165 13916231 14101527 13891761 13500019
11836 13500019 12360786 11913885 11761076 12237757 11923124 12082377 11877320 11247035 11713705
11827 11713705 11416743 11153294 10271382 9384188 8549554 8274777 7663050 7230874 7089522
11818 7089522 7079381 7043736 7178805 6692216 6692852 7085831 6072268 6252791 6194287 5423711
11808 5423711 5809435 6166842 5944256 5789035 6321871 5651211 5127133 5620161 5440384
11799 5440384 5835482 5554993 5858751 5336510 5455712 6490842 6365258 7004898 7180885
11790 7180885 8051803 8708447 9297185 9769453 10172839 9948681 9797442 9037780 8143751
11781 8143751 8316963 7529779 6807634 6126016 6084560 5307580 5545475 5413486 5612219 5231272
11771 5231272 5525832 5350842 5083505 4872653 4689803 5062652 4992808 5009728 4920127 4712142
11761 4712142 4979036 4269574 4892477 4854181 4602393 5004774 4907185 4727269 4674559 5122102
11751 5122102 4429004 4763902 4612878 4808664 4630070 4480627 4650990 4877523 4501275
11742 4501275 4325930 4409232 4288680 4375338 3994310 4815949 4254976 4095236 4701609 4408695
11732 4408695 4080804 4414272 4374544 4231575 4126121 4462868 3990591 4244757 4057972 4208563
11722 4208563 4275105 4252295 4159586 4359240 3952621 4528519 4328721 4449392 4120826 4152791
11712 4152791 4078353 4211949 4259746 4578139 4452371 4364167 4549972 4237063 4731963 4231275
11702 4231275 4183269 4707362 4026123 4185047 4681128 4432878 4722395 4528259 4531419 4315327
11692 4315327 4617768 4455785 4765720 4686693 4437467 4046034 4580420 4283237 4595331 3930018
11682 3930018 4408261 4517042 4643130 4389336 4535379 4529832 4775631 4752790 4971589 5004107
11672 5004107 4949238 5043251 4608832 4945875 4836970 5000998 4845977 5018262 4678017 5097698
11662 5097698 4780805 4525127 4895437 4790681 4870868 5000691 4868072 4879348 4667172 5117914
11652 5117914 5110989 4784194 5156892 4938532 4608167 5261203 4839875 4973096 4524148 4888391
11642 4888391 4588696 4919921 4746527 4601077 4511735 4349658 4663244 5089831 4921395 4771811
11632 4771811 5234010 4855505 4643451 4802129 4778902 4757606 5127140 5264099 4879079 4887328
11622 4887328 4679982 4938744 4741749 5073544 4584083 4864951 4519823 4684995 4622558 4472825
11612 4472825 5009607 4830302 4772983 5115934 4560892 5543125 4915050 5506452 4889588 5512783
11602 5512783 5164291 5158494 5350651 5877239 5298359 5023986 4857860 5485902 5321655 5688821
11592 5688821 5644037 5166904 5316962 5303129 5281959 4561754 5191614 5722176 4831837 5216368
11582 5216368 5324860 5080400 5012634 5075936 5978731 5377612 5381173 5536830 5144370 5725367
11572 5725367 5297409 5097048 5707253 5016481 6039168 5986873 5628100 5904784 5418436
11563 5418436 5497639 5361106 5706480 5278454 5514919 5083417 5376080 4845196 5450443 5262620
11553 5262620 5583475 5873025 5089780 5800636 4887123 5456719 5519549 5141922 5494572 4742126
11543 4742126 5554128 4913683 5152546 5303289 5050104 5399719 5537536 4939720 5139702
11534 5139702 5068844 5057590 5171108 5324028 5331187 5120270 5089780 5460766 4851933 4853552 5458216
11523 5458216 4767404 4923921 5352044 5263500 5226314 5271472 5707090 5028465 5381885 5155201
11513 5155201 5029381 5726054 5149027 5345601 5347530 5322181 5150158 5752870 5370184 6055385
11503 6055385 5682354 5259389 5409669 5284981 5381174 5543449 5614586 5359751 5479917 5162866
11493 5162866 5438405 5086483 5505662 5534866 5172930 5474948 5736188 5701103 6102981 5461783
11483 5461783 5311760 5271138 5516139 5359292 5956893 5353256 5837945 5624616 5433836 5910419
11473 5910419 5286511 5475523 5358932 5456134 5428698 5783320 5456418 5485896 5127446 5255597
11463 5255597 5264633 5095686 5402091 5567185 5213368 5069102 5252361 5415781 5090771 5362283
11453 5362283 5288232 5250218 5472531 5343195 5235042 5273097 5079064 5523609 6031495 5581293
11443 5581293 5916200 5233840 5506115 5495594 5751127 5744086 5494189 5610025 5458478 5501463
11433 5501463 5599347 6152172 6328132 5442115 6410537 5957403 6214670 6183233 6320973 6323542
11423 6323542 6793336 6983853 6998026 7126715 7104323 6463234 6964303 7025765 7621231 7009291
11413 7009291 7579201 7363139 7742760 7438671 7626988 7635775 7820468 8231903 8078049 8416233
11403 8416233 8669615 8667542 8891036 8557109 8636059 9570012 9380597 9136209 9369432 9635555
11393 9635555 9782266 9186829 10318656 10157036 9812473 10508571 10507473 10441802 10833051 10806567
11383 10806567 10565370 11008383 10345952 11376054 10880161 10642346 11717535 11324897 11613831
11374 11613831 10813237 11592552 11864519 12094339 12142310 12179615 12079054 12070016 12204229 12433039
11364 12433039 11910868 12438204 11934848 12251462 12167441 12295864 12218676 12513967 12286487 12257867
11354 12257867 12254333 12243724 11960405 11996251 11859978 11785713 12356292 11988234 11530467 11731392
11344 11731392 11860310 11783086 11594716 11489470 11658635 11381488 10986930 11473235 11057865
11335 11057865 10865539 10723981 10672495 10530857 9913080 10220224 10212181 9747858 10208502 9992815
11325 9992815 9386927 9232401 9128881 9458567 9427525 9366795 9039714 8618141 8403663 8347146
11315 8347146 8606697 8186572 7851331 8064413 7964183 7917677 7758905 7289702 7688558 7238285
11305 7238285 7487871 6823768 7131832 6237389 6743408 6520477 6670253 6432914 6831279
11296 6831279 6655007 6774545 5892071 6108177 6178174 5987723 6180567 5796571 5840313 6036364
11286 6036364 5410365 5989786 5825801 5450753 5624698 5413439 5171715 5478634 5639128
11277 5639128 5063432 5172654 5221094 5392022 5045970 4973029 5243487 5350130 4759531 5285653
11267 5285653 4886838 5112039 5592599 5057875 4444533 5133471 5177784 5116812 4727843 4485449
11257 4485449 5168266 4896678 5006774 4806069 4716843 4794417 5002790 5193227 4890525 4530226
11247 4530226 5089581 4822430 4828104 4572763 4301340 4656895 4791464 5032967 5205746 4883495
11237 4883495 5006085 4947535 4492230 4744648 5165499 5033449 5031211 5479957 4991913 5696125
11227 5696125 5891033 7086312 9348665 11045020 11956209 13086958 13889737 13966030 13660440
11218 13660440 12960435 12114335 10374254 8945496 8067487 7156930 5696515 5734468 5459905
11209 5459905 5467076 4865921 4938555 5234263 4678355 5296411 5365683 5509202 4807845 5641420
11199 5641420 5996624 6590814 7670283 9187142 11044115 12351590 13269187 13755564 13682259
11190 13682259 13663553 12819296 11875221 10273616 9030821 7598946 6867116 6218961 5980146
11181 5980146 5369117 5607233 5699066 5285875 5286959 5378649 4598665 5287585 5444233 4775355
11171 4775355 5151545 4757786 5253551 4561044 4628192 4756446 5276313 4686009 5339861 4952935
11161 4952935 5108630 5410330 5277434 4864254 4978199 5271076 5612079 5643253 5007130 5225072
11151 5225072 5366674 5685295 5549330 5789396 5817366 5550565 5302923 5713326 4782822 5279808
11141 5279808 5876611 5434280 6019378 6070055 5657873 5741400 5876891 5894352 6065929 5744625
11131 5744625 6070901 6112668 6221760 5438530 5716452 6179952 6056314 5886419 6274652 5995699
11121 5995699 6011046 6135838 6506767 5792093 5807832 6454992 6048567 6443558 6576715 5959862
11111 5959862 5740660 6138915 6535125 5954231 6161453 6529661 6420209 6141702 6162636 6344827
11101 6344827 6087816 6642694 6638220 6434149 6141153 6352493 6296254 6094283 6018691 6565431
11091 6565431 6063792 6110496 6245142 6326684 5886248 6085521 5886443 5451075 6168318 6397792
11081 6397792 6332310 6099749 6108415 6227192 5882372 6257399 6185899 6601434 6234569 6785016
11071 6785016 6614814 6519652 6737080 6655260 6944242 6688703 6914042 7386336 6876352 7234852
11061 7234852 7825728 7726534 7763049 7747311 7767568 7614057 7464433 8092911 8526740 8198191
11051 8198191 8071139 8170705 8398556 8309951 8540940 8868284 8641752 8462640 8727033 8777209
11041 8777209 9027605 9184730 9031840 9382914 9928889 10179569 10341124 9798931 10312264
11032 10312264 10963905 10607009 10934544 11333917 10960499 11180867 10823176 11554968 11897391
11023 11897391 11730823 11913450 11916288 11993524 12523376 12173346 12527092 12830370 12909382 13409399
11013 13409399 13274272 13697026 13922468 14704096 14680394 14713497 15249269 15829707 15247609 15671934
11003 15671934 15940012 16023343 16371799 16627717 16492590 16977049 17247285 16724953 17264751
10994 17264751 17290244 17054281 17465962 17192716 17829264 17947301 18233289 18651300 18544856
10985 18544856 19656340 20320267 21148497 22636833 22829911 23357798 24121991 24981773 24470526
10976 24470526 25303113 24969853 24930017 24675093 24916039 24773031 25311947 25617232 26321892
10967 26321892 26784879 27780835 28844521 29400411 30395373 31241910 31442830 32833921 33524391
10958 33524391 34758642 35404193 36811643 37703092 38880921 39627434 40261372 40895298 41076372
10949 41076372 41166187 41389073 41250273 41386569 42210590 42372182 43440163 44311158 44941105
10940 44941105 46313808 47423647 48091019 49256107 50404145 50579305 51298330 52444740
10932 52444740 52825868 53614911 53806449 54306146 54702290 55229147 55170025 55085033 54920454 55432270
10922 55432270 55119428 54651623 54824233 54728465 54295029 54026129 53543023 53599116 53557469 53674852
10912 53674852 53282288 53747564 53687929 53070618 54115861 54395995 54206529 54916996 55228096
10903 55228096 55737257 56875799 57590238 58504976 59858130 60941825 62142027 63839153
10895 63839153 65661011 67893766 70031628 73155426 75671718 78986439 83542038 87422064
10887 87422064 92808132 97643157 103325808 108881317 114507621 119372130 123015676 126800112
10879 126800112 128946008 129838430 130366252 128643639 126280592 122657226 118342181 114631776
10871 114631776 109188366 104033520 99107187 94224134 88700554 84066835 79111966 75100117
10863 75100117 71081735 66542582 62405054 58922799 55172328 52150772 48436026 46174772
10855 46174772 43609398 40845106 38550745 36334986 34719910 33056959 31081406 29840701
10847 29840701 28292779 27255520 25902149 24627855 23910598 22494400 21912518 20978785
10839 20978785 20070282 19139127 18763681 17343048 17338816 16356017 16362822 15722112 15068883 14513272
10829 14513272 13897442 13843508 13482849 13213088 12662123 12402623 12044425 11714694 11447294
10820 11447294 11442815 11177731 10816611 10637868 10299228 10332823 10174058 10074704 9651559 9955124
10810 9955124 9440635 9455552 8978638 9496993 8742992 9072429 8556988 8703623 7942281 8213361
10800 8213361 7979554 7699648 7684982 7326714 7138301 7477325 7515880 7172494 7443868 6787027
10790 6787027 7175074 6967443 7386455 6424390 7168396 6906180 6931139 6854606 6192382 7016381
10780 7016381 6472313 6224730 6152549 5917643 6256377 5768110 5990696 5885447 5749938 5365471
10770 5365471 5404313 5415506 5422735 5450929 5014884 5588292 5255251 5010315 5711144 5307374
10760 5307374 4854414 4714879 5491650 5422562 5071402 5005972 5208359 5422493 5529875 5325220
10750 5325220 5520983 5222543 4841115 5240210 4944562 4971463 5038908 4643289 4473778 4662484
10740 4662484 4136413 4111583 4362233 4306180 4586696 4721126 3990248 4811214 4382998 4676442
10730 4676442 5028594 4413872 4950575 4800884 4549073 4621351 4374284 4723683 4793120 4291059
10720 4291059 4138284 4261101 4530774 3937433 4079502 4169472 4665341 4041822 4487600 4168595
10710 4168595 4216439 4143519 4544275 4570196 4408635 3370777 4210310 4599239 4174914 4443621
10700 4443621 4302527 4196430 3843052 4290294 3998953 4577867 3509474 4201189 3922864
10691 3922864 4007063 4156357 4068654 3643605 4755803 4179132 4292280 4040989 4069050 3653668
10681 3653668 4044283 4337068 4342481 4180905 4176554 4558106 4608016 4544878 4441157 4472850 4491214
10670 4491214 4128103 4146881 4411266 3862414 3776648 4119108 3743929 3255690 3372844 4041988
10660 4041988 3821231 4069477 3865746 3983676 4015306 4230920 4065203 4341713 4243844 4507026
10650 4507026 4655602 4115446 4112691 3929826 4181033 4054691 3420837 3242610 2876514 3447729
10640 3447729 3592351 2988739 2614315 2947062 2859927 3032966 3007966 3117663 2915842 2897512
10630 2897512 3151918 3116962 3298129 3532480 2728559 3298922 2805133 2935970 3311913 2930185
10620 2930185 3375828 2686324 2814849 3542183 2945090 2801231 3006918 2819967 3324045
10611 3324045 3356660 3240383 3448853 2828991 2750264 3110711 2652816 3253631 3378325 2615986
10601 2615986 2662999 3369205 2792653 2681227 2857186 2958088 2383369 3206130 2788443 3269450
10591 3269450 2794469 2950870 3040858 3107475 2992085 2781052 2700790 3226134 3318145 3012906
10581 3012906 2970030 3484882 2947742 3022566 3300744 3462987 3419759 3224564 3233527 3481832
10571 3481832 3098242 2921605 2907650 3267868 3080557 3028497 2758103 2597445 3145171 2727403
10561 2727403 2763389 2510146 2715991 2459397 2633460 2647070 2626827 2579008 2773604 2488024
10551 2488024 2831194 2682812 2482888 2550344 2532961 2609207 2760559 2622149 2711106 2258304
10541 2258304 2285412 2516286 2208734 2701739 2612040 2596192 2258752 2130176 3118168 2681206
10531 2681206 2683097 2734673 2750147 2758255 2571207 2601421 2855609 2812101 3000140 3278871 3287191
10520 3287191 3427172 4033225 4150665 3911016 4190213 4055494 4558398 4189415 3983756
10511 3983756 3386985 3286438 3193980 3047294 3277032 3061652 2800431 3113834 3148844 3286153
10501 3286153 3072885 2950289 3240654 3186236 3225579 2791078 3090740 3449293 4006807 4164485
10491 4164485 4556991 4520078 4725954 4928723 4637596 4687745 4484818 4337243 3854524 3632790
10481 3632790 4004805 3710974 4124289 3790070 3813295 4227908 3915399 4179142 4178328 3720905
10471 3720905 4152958 3839221 3713673 4210850 3738855 4671401 4663491 4849138 4960819 4661135
10461 4661135 4685308 4605247 4395208 4244344 4013819 3626610 3834072 3856374 3912745 3885890
10451 3885890 4152260 4419975 4106671 4143504 3867947 4260795 4062954 4216406 4132071 4247322
10441 4247322 4452651 5050108 6011003 6414137 6052613 6031671 5948859 6207877 5799580 5945558
10431 5945558 5085599 5241316 4847585 4841861 4462544 4325427 4438610 4192035 3847465 4102658
10421 4102658 4367570 3783992 3990523 4100047 3629465 4296150 4387913 4357587 4248186 4912708
10411 4912708 4858275 4979185 4996239 5433387 5788051 5581949 5491292 5549382 5464911 5374881
10401 5374881 5346066 5285996 4945013 4831802 5038364 5206803 5282072 5607165 6201495 5894528
10391 5894528 6127345 5913774 5939372 6307743 6173738 6399685 6128911 6370242 6537853 6313462
10381 6313462 6809709 7101509 6705042 7262458 8169190 7378152 7700185 7333268 7688742
10372 7688742 7314234 7637700 7754621 7856277 7899451 7638626 8159077 7856211 8053026 7830285
10362 7830285 7609890 7508840 7767632 6634052 6955552 6460396 6784866 6597477 6946177
10353 6946177 7078385 6910345 7187439 6923057 7122056 6861197 7110781 7269339 6670023
10344 6670023 7227135 7064073 7429393 6782369 6985761 7611521 7532173 7942267 7977761 7766268
10334 7766268 7668867 7973068 7973301 7899255 7740136 7457050 7597161 7196848 7647227 7712149
10324 7712149 8187732 7717506 7646438 7775247 8126184 7499497 7790436 7739699 7854408 7643523
10314 7643523 7883779 8083357 8602533 9051129 9514124 9636202 10192083 10234219 10444386 10320093
10304 10320093 10444156 9905074 10058808 10011435 10404404 10195743 10328888 10605270 10857417
10295 10857417 11043752 11238975 11534206 12088126 12952656 13490046 13489946 13827898 14532725 15113407
10285 15113407 15944104 16020651 16807683 17365332 17925117 18581997 19043255 19198761 19629392
10276 19629392 19762610 20039901 20393522 20625705 20820667 21268732 21931894 22619741 23362030
10267 23362030 24070049 24626930 25039615 25797791 26242110 25908972 26386988 26530438 26282027
10258 26282027 26584286 26299826 26287380 27033309 26916703 27648873 28090593 28127989 28835913 28822324
10248 28822324 28246981 28102079 27098752 26496376 25948679 25148002 24543829 23716708 23347821
10239 23347821 22114085 21844808 22058985 21579669 21245212 20909054 20083059 19831490 19727243
10230 19727243 19169397 19040184 19036367 18398430 18549173 18121519 18229383 17643147 18136369 17962908
10220 17962908 17139803 16952013 16446818 15906243 15735261 14994607 14440493 13827606 12680532
10211 12680532 12801218 12181129 12144558 11386745 11300770 10771409 10140770 10541549 9840342 9601532
10201 9601532 9546481 9353439 8792461 8706642 8622500 8464374 8681550 8068889 7614116 7840017
10191 7840017 7480862 7827467 7613791 7245441 7395305 7297079 7117182 7400106 7431590 7279030
10181 7279030 6798682 7083838 6707061 6914636 7541415 7583694 6656887 6944167 6681642 6253354
10171 6253354 6036260 6937313 6385899 5790879 6244170 6294972 5677544 6090246 6004857 6037128
10161 6037128 6335164 6197423 6214211 5805667 5715233 6410534 5848242 6490248 5979585 5810227
10151 5810227 5901039 5672162 5812759 5857574 5563361 5999708 5845211 5881905 5572665 5253455
10141 5253455 5569624 5360396 5266409 5166661 5526354 5441570 5569479 5038909 5369417 4933163
10131 4933163 4620875 5072522 4829387 4734681 4838229 5344828 4573521 4562908 5005380 4850425
10121 4850425 4331093 4427758 4620638 4429618 4757291 4368226 3823481 4344911 4007929 4833754
10111 4833754 4198675 4293693 4225131 3957964 4118089 4100697 3954707 4128276 4407062 3887866
10101 3887866 3979222 3877955 4120331 4146027 4027192 3830786 4614328 4075558 4423771 3925142
10091 3925142 3821520 4185705 3874145 4304382 3846089 4455392 3928769 4145602 4128853 3971448
10081 3971448 4005629 4043796 3874088 4381877 4640328 4496260 4211248 4119401 4720756 4010481
10071 4010481 4173370 4355551 4818760 4082000 4314125 4140547 4764989 4670284 4860178 4329897
10061 4329897 4399475 4399832 4563354 4842745 4634018 4688909 5117014 5076350 4710275 4725396 4956463
10050 4956463 5061003 4662639 4322101 4869145 4990443 4596552 4907620 4782565 4750795 4755851
10040 4755851 4383525 4550811 4699232 5073447 4729675 4673042 4861477 5209316 5300407 4942082
10030 4942082 5092147 5128066 4280902 4736913 4783241 4340519 5249364 4711182 4403745 4695877
10020 4695877 4958353 4969907 4408331 4263214 4099212 4791461 4458915 4706253 4544729 4395453
10010 4395453 4820289 4423310 4555938 4172657 4180235 4232095 3850281 3918892 4259643 4212169
10000 4212169 4006408 4044145 4325464 4066215 4465012 3630841 3894459 3777838 3680033 3443596
9990 3443596 3414827 3489126 3484175 3803153 3726913 3121274 3527761 3549565 3289633 3277706 2852341
9979 2852341 3272151 3131140 3188754 3461172 3046511 2851228 2952761 2926861 3256312 2900571
9969 2900571 2774834 2743700 3202527 2539372 3005040 2682746 2253856 2820245 2838126 2310791
9959 2310791 2902333 2527462 2781818 2516226 2399747 2326388 2434747 2536509 2339066 1852568
9949 1852568 2441845 2626562 2179624 2338058 2283222 2815204 2166523 1721898 1762027 1807308
9939 1807308 1630352 2102485 2229109 1911115 1701085 1933821 1959290 1897572 1628174 2311890
9929 2311890 1868247 1988570 2083687 1666791 1709665 1043622 1928473 1710371 2483213 1559602
9919 1559602 1654344 2082247 2037350 1577137 1840015 2024855 1638207 2122520 1885250 1728629
9909 1728629 1905352 1999658 1914150 1828974 1516400 1834169 1966599 1876963 1323594 1928992
9899 1928992 1819051 1683426 1731228 1529852 1887739 1293360 1792016 1557726 1418191 1782351
9889 1782351 1848307 1481299 2081970 1583194 1591212 1595114 1400454 1509757 1567300 1533603 1376642
9878 1376642 1580121 1725396 1439034 1505840 2120566 1466423 1697930 1175919 1407391 1889615
9868 1889615 1637886 1586221 1621536 2068827 1424086 1531287 1918516 1581054 1550052 1249992
9858 1249992 1764732 1321133 1568750 1628103 1598305 1557705 1442486 1857525 1832423 1739674
9848 1739674 1397021 1896958 1739884 2041196 2078429 1497753 2150435 1355855 1388547 1544488
9838 1544488 1410491 1516933 1574348 1360469 1893515 1782929 1503878 1743917 1499119 1201860
9828 1201860 1647409 1321013 1921500 1266586 1421793 1345260 1765552 1521726 1269365 1601021
9818 1601021 1870747 1476986 1845488 1976668 1623882 1209519 1408544 1580699 1242428 1476489
9808 1476489 2072481 1406976 1423291 1840534 1426824 1328805 1369003 1175307 1955032 1348107
9798 1348107 1774980 1339690 1467790 1665932 1415476 1573540 1301628 2076308 1579605 1726313
9788 1726313 1717638 1591908 1319844 1367321 1277225 1811634 1398194 1277483 1552069 1562603
9778 1562603 1429782 1964679 1255278 1562987 1546207 1176231 1472692 1564501 1715166 849322
9767 1223661 1233572 1416730 1618839 1667605 1608601 1585744 1193033 1644222 1575844 1009789 719020
9756 719020 1067730 1352443 1576011 1476463 1326848 1159802 993940 1541274 1194779 950819
9746 950819 1265477 1299498 862227 1166286 1227607 950140 1299437 1193848 1128257 954780
9736 954780 1425137 1564208 1401376 1310057 1589228 1142253 1819318 1076321 1738480 954614
9726 954614 1229386 1048496 823351 1092613 1231737 829846 1202173 1108319 965684 1040508
9716 1040508 1129743 1014731 1113884 1038753 915461 946964 819528 921228 713310 936071
9706 936071 753154 989496 978328 975358 977333 924957 1069579 1081510 802132 1164563 1075794
9695 1075794 600844 1174380 571505 1004837 551959 639432 966946 1211257 920799 708705
9685 708705 917708 624518 1337966 584957 748908 811618 774684 1089703 990478 772958
9675 772958 1011223 908221 707897 864619 700063 641518 420439 960930 995535 332168
9664 391756 1351344 919256 1354183 752917 722094 894634 509248 855992 759210 354993
9653 933141 956522 771337 1098546 586750 617142 991614 778588 852227 883937 794484 739897
9642 739897 860526 662616 775012 602500 824680 775968 678218 799232 1052368 814274
9632 814274 707498 809181 388261 1060284 892113 884574 864614 655197 590702 725891
9622 725891 618118 566641 787051 628895 913156 1234813 759120 1040738 379246 630528
9612 630528 1210301 674486 597336 1083067 887584 370441 745654 667969 713833 788759
9602 788759 958203 518669 1069104 764749 650442 307708 594817 1005172 1172540 717204
9592 717204 806894 685112 1110805 787371 904371 692683 800723 706498 704670 1266536
9582 1266536 706645 779073 967768 352816 721731 777401 803218 833211 824012 959093 853599
9571 853599 892049 870024 623877 889240 839987 657465 1132577 375184 613674 861067
9561 861067 464256 653630 882805 81016 787392 929233 508687 892783 909610 746020
9551 746020 692024 728608 560724 678477 967265 925423 556692 419873 1011990 811996
9541 811996 511354 452973 755766 647163 1203708 726319 715435 1174810 664291 906994
9531 906994 743812 618814 1077602 270746 613056 1038397 489001 504651 529309 934849
9521 934849 526191 1077815 586745 764893 342251 670459 825313 626294 742231 668042
9511 668042 636035 562352 712815 1115851 973532 818393 776306 752301 589986 1052318
9501 1052318 351982 474295 582281 364745 106950 660956 297268 719702 244518 828805
9491 828805 610456 508345 613300 322148 385023 232088 743731 515829 83690 871609
9481 871609 362623 659889 342283 76261 360043 719771 868458 457819 422903 628521
9471 628521 583018 1026099 546321 747946 -184308 706301 683234 503207 445931 583581
9461 583581 194487 926350 511684 599247 471488 560708 372457 808922 506014 -77018
9450 489425 505122 512515 728570 429555 295222 117316 301281 609999 120801 121199 735725
9439 735725 515611 860177 511726 367104 439566 451526 509878 523451 681960 710970 624734
9428 624734 507310 571957 549297 611836 733540 198493 500759 441083 592139 504665 478509
9417 478509 702913 665667 159165 298493 186161 84040 452518 827001 681349 253061
9406 515047 226634 206410 -60126 644915 762329 493207 733006 653813 893651 457027
9396 457027 222704 486833 536685 620811 403703 364083 534791 676814 379583 511789
9386 511789 -137196 775791 118252 -159907 420190 323509 572985 1004955 273803 668245
9376 668245 594003 367216 410398 781913 726398 377965 316056 493676 260854 275485 85677
9364 283063 614239 253497 354695 -132490 702793 508090 464346 644215 957706 518401
9354 518401 191472 526192 121039 236785 600265 437423 65365 -115444 417867 716246
9344 716246 82492 161394 213721 447054 130129 159894 582005 349758 723491 387284
9334 387284 778606 89767 208759 427556 462070 746483 251000 283200 577520 352477
9324 352477 276545 526537 480517 709506 505144 745940 649962 381715 671182 207885
9313 356449 782430 262436 315110 432770 365009 306235 552516 336405 432687 57802 449490
9302 449490 192583 390415 282000 244995 909339 332150 196900 333925 577977 289722
9292 289722 655754 502217 433312 509693 -39723 -192297 417854 286604 896672 410522
9281 369128 375002 535948 352129 599708 585727 221435 723686 200591 425392 894137
9271 894137 471292 133807 711377 520732 469408 699820 734865 472078 458858 420691
9261 420691 281694 462387 443416 208746 359763 -135244 421419 173435 388562 241158
9251 241158 460500 334974 142349 292976 313693 638592 473197 89959 488213 448910
9241 448910 396588 220969 375922 493812 362288 259877 570023 152753 151428 102031
9231 102031 166940 475860 716937 422973 95429 87993 94087 446347 372390 -346163 503726
9219 382747 -3876 677294 236565 299057 641574 277357 593850 699775 834970 680296
9209 680296 311088 387518 625202 202440 530042 244984 371413 289460 36678 302807
9199 302807 485780 337490 -312658 165621 471567 198276 728289 -177481 100601 789249
9189 789249 454467 214518 301456 559338 413728 846142 606267 484212 351877 231708
9179 231708 525936 341300 343778 317680 632585 -107421 312141 236343 357198 1032885
9169 1032885 302143 168771 353903 493166 154846 21614 48717 445410 474938 620757
9159 620757 119897 407948 226123 785568 381478 486907 331000 333288 239908 493346
9149 493346 490661 444944 271705 439341 845874 224647 527749 585776 500943 682069 490728
9138 490728 572396 -7588 785769 313286 578752 549311 196275 169804 813845 641228 687914
9127 687914 610687 343789 242693 358359 408797 67272 530208 229135 19163 -73936 663543
9115 299484 508183 39348 33953 442423 -177179 54287 388104 157579 204473 215214 332808
9104 332808 318009 558641 628587 748451 682914 462914 553582 567209 294588 13517 672042
9093 672042 489259 -140820 523903 17458 490745 354722 373140 520410 288866 176496
9083 176496 108813 695943 568852 330024 276183 470996 270179 231152 490500 281059
9073 281059 414745 304944 401301 283077 474284 364509 721084 771375 131782 562643
9063 562643 716137 359414 -66276 501108 33633 518889 469881 313067 659458 138652
9052 481449 635045 145548 173621 417081 481011 271578 -55280 -82060 478971 272261
9042 272261 606296 638930 283791 1575 238099 225411 326501 173133 343477 24186 168940
9031 168940 510011 94348 184797 159394 212155 545677 491136 218443 540494 352333 494849
9020 494849 318666 -7761 281557 18709 147261 79719 47500 316143 613876 559605 398048
9009 398048 312794 -169088 196726 478815 388545 970669 642262 445630 128498 23602
8998 368105 575033 117390 379031 -117137 779199 721896 453871 592281 600745 756070
8988 756070 793603 236817 224373 502550 869366 310934 619214 499160 235556 11523
8977 -124440 476982 574869 -49770 287682 374272 317752 412864 802071 522462 89893 290766
8966 290766 401814 -86736 869065 489136 591422 256872 528612 46124 333513 -152837
8955 557899 502051 582008 233063 190669 321751 554857 431646 551943 571154 218798
8944 57554 -87761 394956 252875 426350 669569 589750 693087 383958 256220 181174
8934 181174 183263 147368 629132 182697 117261 149590 1140376 576527 567253 -22445 204869
8922 149156 477894 247962 994287 712823 456591 648713 1032874 807668 1109204 256565
8911 490767 570350 682269 715389 420393 770736 937257 555863 277003 399962 693917
8901 693917 471716 875092 996355 763782 443600 239676 1019241 970744 607765 1206812
8891 1206812 741773 651164 914953 965167 970600 809208 755188 1732408 1011743 621163
8881 621163 1121873 1280178 699210 956328 946303 1762184 1613508 1120960 830633 1308502
8871 1308502 979524 1389185 1323937 751325 828364 1220352 952768 1345494 741419 857084
8861 857084 1262629 701584 1079663 851849 898797 649887 824483 679699 1256813 1055573
8851 1055573 843575 642271 412824 833127 900299 703907 713696 750037 887536 459392
8841 459392 713606 507087 744654 642125 453058 484490 283676 494784 377855 518581
8831 518581 430722 769664 548592 282750 620512 394673 399804 149073 275264 87819
8820 284038 228292 647306 781055 263559 358877 416916 877686 390641 453298 407677 -37201
8808 562032 349799 602863 188149 -19727 814914 523515 357930 655942 816493 963949
8798 963949 1000461 -2024 358245 424516 751969 131500 456967 348962 251732 267128 222729
8787 222729 783532 351629 209797 580445 138245 -86427 435941 52559 225971 410599
8777 410599 654342 135642 256975 206750 413997 682519 566634 858847 478053 86499
8766 808045 89383 238643 106777 -73218 68859 385438 405580 332716 493422 214026 435864
8755 435864 554515 482068 115006 328696 496663 322409 423705 88289 347113 32440
8744 298849 155576 242802 -84380 550580 104549 -13439 61865 340586 -124207 598638
8733 -59366 61359 -115733 780506 390554 430625 109196 146874 462782 511118 -271571 342674
8721 222019 174903 297108 -40635 597920 424976 317497 173560 716244 338472 192921
8711 192921 432119 493715 66245 493387 50783 -22674 760364 544109 295065 682226
8701 682226 194780 277590 763611 638509 79214 485804 132165 539957 311869 263808
8691 263808 268424 227496 425619 93331 348423 251081 398423 109516 672088 379387 377597
8680 377597 -210975 348208 -68038 695162 45666 98339 270617 388022 142741 482477
8670 482477 171590 152095 -17714 238039 267804 38282 302527 393929 601514 -11841 227266
8658 629815 260073 628154 82115 -72105 364439 -33609 -164186 57405 387117 645189
8648 645189 224111 -17749 600872 221734 330073 -9815 487505 -139796 361835 582724
8638 582724 113805 147052 263814 69784 371103 -46707 248063 79056 5594 505219 736416
8627 736416 474043 318567 687293 456718 117119 377078 65588 -30852 399299 839771
8617 839771 187432 -14950 -28238 257396 610787 220555 149179 398050 440461 646478
8607 646478 335887 206287 166368 251983 200155 447012 518237 427501 76942 853403 -118130
8595 -37571 232636 486601 563325 629189 -349800 81871 271105 477864 287255 -76495 139973
8583 -110609 721329 350553 359813 590012 940 386268 337154 257509 203965 103768 267416
8572 267416 -96182 161453 299356 257933 215966 107827 270417 576798 206846 159925
8562 159925 741117 244161 448192 393552 75613 215501 255573 193709 -9930 -1480 405182
8550 659909 530268 -59266 574154 582146 387616 332004 -243323 306003 -116525 314060
8539 276326 373134 160466 229483 616266 738834 104767 504638 -128993 600332 484780
8529 484780 191296 344393 372416 211005 282548 158713 512543 419351 55986 416825
8519 416825 364080 97070 357267 466417 -5348 302462 652273 385732 -34841 733493 436988
8508 436988 400202 54228 87724 377447 36162 33286 189745 204512 459041 641485 415641
8497 415641 256526 268189 186605 -18706 -57570 246281 326861 471569 361896 582074 200153
8485 218743 79765 541300 132319 290445 772485 345209 478598 -44949 112284 70144
8475 70144 149420 138351 309040 201799 -4191 -308802 361854 119948 214772 582062 254053
8463 645418 216658 414082 236685 413609 573447 -191564 257076 370889 364926 -262921
8452 274584 131911 625199 189299 329691 -53757 117377 304449 149475 227631 269453
8442 269453 153553 415493 -76354 254055 451156 597463 414366 227616 -91544 579378
8431 621325 509924 537847 357665 215024 -32122 5041 -57442 286690 -50286 195470 438181
8420 438181 -237996 408233 339145 453202 186489 85669 131116 521363 68526 419374
8410 419374 107991 445053 -150347 -25117 180944 -8612 196726 -289694 398529 244323
8400 244323 279946 100520 -82041 134984 -56771 466388 231791 35382 243182 656158
8390 656158 81652 236713 612202 259849 333449 309005 649162 218884 705917 -363039
8379 184624 494464 654178 60078 167262 285121 -245141 109721 53884 -114320 234275
8368 113102 373893 297873 554605 570978 336650 -107371 22693 239842 -64554 130223
8357 494326 416131 154597 314288 322649 446297 295441 216228 229603 -127874 340989 644260
8346 644260 314357 191893 215618 306953 414291 328931 -273767 211846 134637 358687
8336 358687 491929 709588 174447 294466 323186 355838 101328 165963 353002 6315 421169
8325 421169 -44056 320613 7521 39739 12645 212376 509515 217303 -292680 -38796 465313
8313 204389 -162643 822082 838114 551366 216834 -92066 759576 325217 132248 -17861
8302 337352 -236302 -37743 304041 31794 441372 483337 257460 209006 386346 575244
8292 575244 361440 595777 551122 223647 247194 399861 5213 292096 363478 308685 197896
8281 197896 375748 268963 604056 211749 73281 461520 596172 296328 22380 -58082
8270 -205262 535638 429975 30256 726431 -53763 148528 -227878 109694 -134775 430005
8259 424319 602505 668684 -337386 179299 212414 542026 -7239 -943 610196 323872 1565
8247 501999 213169 514861 380171 -273310 77669 231888 -245432 312248 393565 198580
8237 198580 -284133 105577 301611 -5030 534177 447611 617137 498346 344448 737862
8227 737862 259293 49777 -141766 292439 41255 343989 133678 428454 -341183 226577
8216 434391 -80834 -228267 263713 447754 774039 266306 22227 61601 312963 215999
8206 215999 452480 681688 -171675 -272758 118879 -1849 -81336 449392 611443 74455
8195 226345 43761 69371 55261 128379 138671 103148 -166437 -199961 308474 61904 557182
8184 557182 314431 468193 -143310 151047 -212042 -177104 212822 242654 329310 226928
8174 226928 432368 465265 28642 580842 -192089 412750 259929 69094 355039 269373
8164 269373 212973 271623 -40796 302767 482629 169677 443888 -148959 -58609 183902
8153 216852 -82114 588342 -195105 336106 203091 97320 403291 -322417 -126136 400182
8142 -48634 572708 244634 -32912 4023 274250 417957 -272985 1299 443673 476581 267720
8131 267720 -36371 28398 167312 433897 -262737 78910 127521 153182 365789 -194370 -107083
8120 -107083 140573 434247 86969 422237 194675 536103 154148 85251 428527 -218825
8109 233109 -260576 483179 541622 255435 139520 223205 -200171 648338 338706 330694
8099 330694 -89154 -218221 104795 7547 -101196 481694 407342 170064 289620 -148664
8088 40879 -696126 257462 584600 135517 435311 141886 26685 185518 490728 146966
8077 70110 331910 382939 -127875 57716 361582 299391 191100 -42514 -179192 197065 354594
8066 354594 305681 513278 -215363 -153372 -387923 92467 149918 657398 432623 405716 380669
8055 380669 24887 95755 -5894 386523 343799 43324 301836 -235862 436115 301972 133724
8043 -156011 288996 122875 197318 51139 283737 77522 110169 105849 434696 647342 110970
8031 237036 287887 -62455 -79636 296029 268708 178379 338237 -35207 -269314 510133 154504
8019 220796 209068 356560 374234 141362 297152 400701 236668 235226 -124048 166382
8008 35693 52390 200404 103819 511313 230307 176984 307684 368300 180593 227471 237682
7997 237682 325855 448811 253845 -10111 99616 250066 364696 49622 -60763 194309 410013
7986 410013 -98480 266713 135948 140946 -67059 65711 77101 242309 -75247 371572 474330
7975 474330 289667 -130563 405831 617100 215653 -52427 305717 308508 -227710 336591
7964 141941 250517 -167946 214793 -93425 554696 70400 253527 194924 -251210 29768
7953 116871 407869 619383 34217 498316 286303 -235353 258289 -189536 285505 201377
7943 201377 211269 85214 199896 85785 727109 121102 -30732 443426 442395 661803 107621
7931 -444734 269970 364286 345155 29424 -384300 490555 -193871 49334 -78336 38863 236764
7920 236764 498541 179592 -217932 -46822 -84046 264041 152548 -29261 -20619 434796 19351
7908 -139382 50929 218071 -88928 193202 406395 -148394 215007 64388 559476 273403
7897 53099 256577 290550 229684 -1104 -65702 88901 210007 109315 16736 274415 472538
7886 472538 351530 276938 2748 348007 -107112 113367 -86 72620 164095 361911 221023
7875 221023 -61611 -102420 485340 219781 143690 487984 190332 241754 -93781 -18970 412241
7863 -90342 474614 66483 237024 87958 506954 248412 120478 360540 13393 13764 194007
7852 194007 296606 805166 167401 158400 372401 -70509 -377801 26081 -168851 748504
7841 246252 289147 425520 118172 340490 222376 426066 646638 781902 -22437 372537
7830 315312 19780 270717 444172 131959 143026 617801 7308 225706 -113529 -198281 352514
7818 -9897 159378 444543 130642 -103852 471801 -48913 394263 547180 232731 514355
7808 514355 192472 310540 26451 119265 -10606 2091 -21280 373623 27082 -415759 224854
7796 44969 -315351 96918 223580 449837 49360 376788 152190 57759 364972 41385 26973
7785 26973 289184 196055 214526 357033 164560 -483155 15813 -35560 399478 207568 535648
7774 535648 -45742 -49974 -89181 93840 180195 363436 215540 305388 512602 82894 416681
7763 416681 114637 -189700 67861 736915 199034 -466884 148256 47730 11261 172020
7753 172020 -73445 -309251 333353 380600 422315 -66513 -141713 76140 -88144 103272 91825
7742 91825 -543388 284478 186991 -363205 91847 222601 797777 -125972 -227580 -130105
7732 -130105 265343 147518 579542 53587 242576 414568 253085 167286 -112685 738316
7721 310524 389987 181302 252722 421305 295456 213484 333442 133550 207036 60051 24666
7709 -342809 334982 -32425 529524 286623 -5657 731595 158501 161811 194229 -20046 92403
7697 -62052 218079 -154173 -127179 169428 -577803 -109849 142080 359686 79092 363094
7687 363094 -90021 -382881 68378 309075 196695 52044 199491 191191 412528 377762 -194279
7675 312841 328147 807345 -322241 435276 213545 467045 304833 9176 494179 201592
7664 93228 235289 588101 144886 308396 501322 57518 581492 438987 40484 -91544
7653 364208 -200799 386978 -128233 239074 14848 -129197 198894 191097 234599 224021 410700
7642 410700 994 298540 -498773 273421 258290 637249 -83094 261148 3357 -352890 477370
7630 280979 -90832 215405 406734 222439 -187449 202332 861151 190759 -256880 114286
7619 357732 201456 -60813 15849 381808 226229 95406 232511 -21366 -91977 87778 -115718
7607 653250 -30823 404542 446631 17640 208171 -29494 128064 686584 372184 -183041
7596 512389 222108 -242521 -18799 275618 186324 297540 183956 41462 650481 155549
7585 215170 114706 321795 -17484 168716 49578 201431 491147 38851 356960 -121720
7574 -27588 -26022 53079 179682 289431 -96269 -399947 306190 515631 10033 68602 31214
7562 178638 408969 -268655 -136853 567306 367612 84298 195919 30671 67848 -195593
7551 294608 412115 244488 -138655 -5476 38877 556338 -142662 275308 -319443 476421
7540 -110850 -128294 351224 90110 358733 152261 335712 -480945 125440 18716 147011
7530 147011 14532 -26440 186066 -275796 208453 133614 -51504 139041 73990 -232629 224592
7518 -304531 -187837 549745 39706 135870 642380 62678 535377 75756 631158 312517
7507 56718 395907 613245 114768 -68878 33343 182814 -221521 -412529 156797 366002
7497 366002 122648 -293110 451418 155863 30024 175763 -64992 65799 154426 175301 34081
7485 -13516 398536 172856 -57561 430245 95384 179666 416189 426775 -42260 -35433 376673
7473 164306 -203684 642241 250240 -330139 339071 138771 -46621 256009 494226 387392
7463 387392 -124701 -65406 258391 58761 -240274 8183 105503 -111493 159978 620745 -182221
7451 -65266 65400 247351 536214 248274 -65267 75339 247581 539868 335417 -260616
7440 -44854 474869 -99309 223231 -132701 107142 63549 138901 196002 287220 236455 165028
7429 165028 -77581 -186397 13562 351266 164156 273763 -77827 187316 200867 103033 -260990
7417 183259 172986 -313148 460255 227271 213580 472505 -54118 413297 -10710 226825
7406 124814 327447 -189037 103899 -32336 64772 353598 222817 180288 245478 12320 -262913
7394 147602 25982 -251655 496428 115898 319872 -245553 140877 189279 8498 114476
7384 114476 -68804 -178245 214997 12684 372088 -384155 132667 377605 378818 17334 89562
7373 89562 200706 299903 54609 191896 110923 -104623 -163060 23433 156997 604471 216299
7361 32118 193572 -86306 -61295 202208 -363787 -84806 180549 -111031 116834 741842
7351 741842 -291585 -113637 -35713 -236479 35080 -50711 285374 58818 -174443 168618
7340 -4789 54369 98959 -147025 -85422 307368 158369 486852 -165434 -79964 435015 -203620
7328 104863 129415 268081 62050 234599 683761 56580 119446 -65218 188913 385928 263292
7317 263292 -34713 455357 62352 417776 118309 -315816 81733 337640 17789 -366184
7306 447901 255313 -214987 111342 424730 39956 -266185 159022 -324806 344491 224084
7296 224084 286851 -12072 194478 332877 353086 57354 -284686 462093 68411 232071 344792
7285 344792 -101751 241258 496281 -181225 75818 -237846 350248 558393 108063 918775
7275 918775 408387 -24606 1950 -36673 480564 111943 772263 -188491 142496 287449
7265 287449 556829 -380939 -46337 276677 -24412 248478 93819 -70640 443637 541205 -64366
7253 539973 275501 158599 83747 282300 -134653 186092 401938 -22601 227707 -162006
7242 1027 -273839 362502 -27712 -322859 40263 185385 632295 92381 288484 138630 105759
7231 105759 -275303 274470 1780 347111 205192 62881 1644 -108815 15620 -283047 -281364
7220 -281364 341650 -454148 -221802 -28909 -44066 246803 159034 -45535 -202689 215153
7209 120523 75301 370144 38921 253795 -5682 -84872 34693 148606 298505 65488 -353899
7197 8979 -35131 478399 115921 257435 311933 -257400 -357515 54388 234957 109832 193247
7186 193247 232368 -46622 -141065 68606 241427 -182923 363526 542751 -189901 145883
7175 -700 183316 127316 376642 312113 149907 246051 422461 -404372 477476 103430 231342
7164 231342 175011 325486 -84797 30551 91618 -178588 -13180 54761 414317 30251 534559
7153 534559 116830 257652 25179 -75809 232165 82419 322093 347427 -251502 288253
7142 24354 -189421 138268 324305 91570 -24467 107906 136997 458481 -379401 220144
7131 -21239 81570 138792 -102095 282616 -300069 74837 94286 -60176 532466 98676 56675
7120 56675 -147975 175168 -29693 36051 467484 78961 28968 469875 329933 78622 292990
7109 292990 326350 -405706 311234 106957 71256 205637 269284 437817 498186 241776
7098 -222380 151833 164957 186884 -105800 529987 377267 -183963 235796 257361 57392
7087 -139688 427878 -336679 294767 357059 216433 6775 71279 132842 -352467 -180710 -138227
7076 -138227 -194212 110791 177650 -320489 515809 459505 151546 1061 553213 387432 129164
7064 135134 -160285 13999 9625 -101236 213981 396646 -336032 524518 15929 109606 174214
7053 174214 96850 300384 338302 66261 120309 508 87799 138811 493817 92799 231439
7042 231439 579820 159726 427451 381963 163613 214206 400076 -210018 -216024 270037
7031 571425 117249 334817 366787 294535 391388 64518 215787 196193 765442 -53538 133994
7019 -219879 -318574 -54188 52139 -38833 -140403 276666 -13786 13808 382832 216705 -138826
7007 251578 -180486 141108 -51955 -123710 63445 -77761 167076 339185 -153601 407740
6996 -172029 134099 268906 -48681 -88904 61246 -49010 506418 397120 -29980 225188 -74508
6984 370234 339539 191482 -22484 45930 -31694 265821 -69918 -139830 14144 -430513 382551
6972 560271 -124067 -18347 147038 -65898 -1596 -80329 283687 -88688 402049 63669 179230
6961 179230 44178 -26496 -195118 140578 108444 142952 134476 397575 47674 92775 -268334
6949 214103 52147 -123623 180498 331120 334292 399242 -201255 -144019 806830 -263775 95412
6937 190260 -169708 370222 252076 173550 453514 258418 -77064 72047 -144100 275158
6926 -329429 221604 181826 -192539 -199432 211129 472118 -202123 92244 -96337 356627 281833
6915 281833 -140940 134482 -157348 -352285 24392 261740 31316 188073 331311 577763
6905 577763 -460982 508542 148692 52650 208853 -93018 249226 186467 -228161 256654
6894 400978 243838 214750 67001 -104806 108902 87588 400 550016 -31920 141719 247183
6883 247183 258575 123444 -146909 -235216 276770 -390597 -176412 318213 56403 378129
6873 378129 72054 31207 -345115 22456 108410 -36975 -295639 456396 -100735 210798 -195308
6861 245618 -377561 74681 663072 132198 132462 698418 208960 350724 -106829 -34368 220799
6849 -182953 23260 -98521 -59467 -199485 428999 -25194 63767 132190 9859 78239 498969
6838 498969 -27196 37634 223892 -73077 291867 -194160 233670 -96098 271401 -52632 -54658
6827 -54658 288138 -233436 -325979 230137 -122983 -244802 352421 31672 -30514 -241669
6817 -241669 494821 -84553 173027 -95578 -359544 446487 -224808 33595 -179443 -153649
6807 -153649 12585 -6524 -106924 56371 285757 -38769 170815 -42808 -201619 -65100 430746
6795 56682 34316 400995 241198 -74928 427934 262223 -227249 174419 162803 436423
6785 436423 207010 6620 91903 -123688 51446 209826 -160425 18984 -31390 6896 436722
6774 436722 358091 -190869 164717 301697 204790 240119 345530 -268727 49283 537596
6764 537596 118409 30105 24543 361807 160667 89882 -356158 254126 532537 94076 519254
6753 519254 179443 30399 -239719 277930 504425 86727 39284 361433 -9798 725731 -63364
6741 -162413 145704 -280384 -95482 86283 327562 402766 -276796 -261946 309193 152311
6730 70043 257855 -220457 20716 -33657 116914 5615 502182 -204348 -278202 -49737 379558
6718 -378722 45007 6072 160974 400021 70229 -252480 -386017 140835 142183 281711 675817
6707 675817 198421 427380 351726 611112 296782 5472 -484501 -123751 -393791 -53180
6696 45788 450701 197376 233003 62818 -92663 -15147 271219 -121549 178030 87175 336991
6685 336991 643556 10791 462997 256613 151974 621422 -228670 -238573 -234054 117101 -100
6673 15116 -366543 -335183 108400 -190786 22453 65883 164103 79137 -197107 -164802 -66090
6661 145038 417431 -210936 -81993 -1592 94877 316822 -350782 231530 138185 36779 115932
6650 115932 156533 663854 615395 140515 -144703 433064 517446 66685 -145405 10860 46945
6639 46945 -3365 -143613 -52483 27064 9197 426568 405530 363456 24727 -225893 274760
6627 -192203 450232 468318 409011 -116334 -6195 164339 334423 -523091 -42848 -146101 44549
6615 -140031 361445 -161931 28846 149492 104816 -157410 -74513 83045 -234248 18242 -3205
6603 254257 83617 132345 150236 295876 -39053 -31460 -72578 -205620 115655 149904 197758
6592 197758 75734 10735 255995 -151552 -213962 179961 210036 71607 -31657 409212 244362
6581 244362 251651 -42452 -47541 455479 -77802 -134141 33985 457847 287739 100912 38614
6569 305311 -14901 -133347 172001 66497 426575 -37010 182025 -366227 101869 174153
$$ [...]
##END NTUPLES=NMR SPECTRUM
##END=
