##TITLE=Coffee green (M3-ROVE10 + 1.5mL buffer 50/50,  450uL extracto + 50uL (D2O+TMS))
without heating, vortex and centrifuged, temperature 0oC.
##JCAMPDX= 6.0         $$ Bruker NMR JCAMP-DX V2.0
##DATA TYPE= NMR SPECTRUM
##DATA CLASS= NTUPLES
##ORIGIN= Bruker BioSpin GmbH
##OWNER= Administrator
$$ 1.72 TOPSPIN		Version 2.1
$$ 2012-05-22 16:11:17.215 -0700  Administrator@X
$$ Compression mode = diff/dup
##.OBSERVE FREQUENCY= 400.13188195
##.OBSERVE NUCLEUS= ^1H
##.ACQUISITION MODE= SIMULTANEOUS (DQD)
##.ACQUISITION SCHEME= undefined
##.AVERAGES= 64
##.DIGITISER RES= 22
##SPECTROMETER/DATA SYSTEM= spect
##.PULSE SEQUENCE= noesygppr1d
##.SOLVENT NAME= H2O+D2O
##.SHIFT REFERENCE= INTERNAL, H2O+D2O, 1, 14.97961
##AUDIT TRAIL= $$ (NUMBER, WHEN, WHO, WHERE, PROCESS, VERSION, WHAT)
$$ ##TITLE= Audit trail, TOPSPIN		Version 2.1
$$ ##JCAMPDX= 5.01
$$ ##ORIGIN= Bruker BioSpin GmbH
$$ ##OWNER= Administrator
$$ $$ c:\Bruker\TOPSPIN/data/jwist/nmr/11-coffee-green-quantification-2/41/pdata/1/auditp.txt
$$ ##AUDIT TRAIL=  $$ (NUMBER, WHEN, WHO, WHERE, PROCESS, VERSION, WHAT)
(   1,<2011-11-17 14:02:16.825 -0500>,<Administrator>,<TOPSPIN>,<go>,<TOPSPIN 2.1>,
      <created by zg
	started at 2011-11-17 13:53:22.325 -0500,
	POWCHK enabled, PULCHK disabled,
       configuration hash MD5:
       DA 63 81 1B EF 4C B5 72 B4 DF EA D9 B4 DB 4C 08
       data hash MD5: 64K
       B0 40 86 3D CD FE 0C C1 70 20 36 BD 38 A8 68 AB>)
(   2,<2011-11-17 18:14:38.279 -0500>,<Administrator>,<TOPSPIN>,<proc1d>,<TOPSPIN 2.1>,
      <Start of raw data processing
       efp LB = 0 FT_mod = 6 PKNL = 1 PHC0 = 0 PHC1 = 0 SI = 32K 
       data hash MD5: 32K
       9D E4 D4 D7 FC DE 0A 33 86 BC F8 57 70 54 55 F3>)
(   3,<2011-11-17 18:14:38.669 -0500>,<Administrator>,<TOPSPIN>,<proc1d>,<TOPSPIN 2.1>,
      <pk PHC0 = 22.8186 PHC1 = 0 
       data hash MD5: 32K
       89 50 36 2D EE 86 BA 94 96 49 03 BD 67 1E E4 36>)
$$ ##END=
$$ 
$$ $$ hash MD5
$$ $$ F2 29 69 34 C6 E8 44 F2 8F 7B 71 03 CE C6 DB 49
##$RELAX= 
##$RELAX= 
##$RELAX= 
##$RELAX= 
##$RELAX= 
##$RELAX= 
$$ Bruker specific parameters
$$ --------------------------
##$DU= <Z:>
##$EXPNO= 41
##$NAME= <11-coffee-green-quantification-2>
##$PROCNO= 1
##$TYPE= <nmr>
##$USER= <jwist>
##$ACQT0= -8.18042376280013
##$AMP= (0..31)
100 100 100 100 100 100 100 100 100 100 100 100 100 100 100 100 100 100
100 100 100 100 100 100 100 100 100 100 100 100 100 100
##$ANAVPT= -1
##$AQSEQ= 0
##$AQ_mod= 3
##$AUNM= <au_prof>
##$AUTOPOS= <>
##$BF1= 400.13
##$BF2= 400.13
##$BF3= 400.13
##$BF4= 400.13
##$BF5= 400.13
##$BF6= 400.13
##$BF7= 400.13
##$BF8= 400.13
##$BYTORDA= 0
##$CFDGTYP= 0
##$CFRGTYP= 9
##$CHEMSTR= <none>
##$CNST= (0..63)
1 1 145 1 1 1 1 1 1 1 1 1 1 1 1 1 1 1 1 1 1 1 1 1 1 1 1 1 1 1 1 1 1 1 1
1 1 1 1 1 1 1 1 1 1 1 1 1 1 1 1 1 1 1 1 1 1 1 1 1 1 1 1 1
##$CPDPRG= <>
##$CPDPRG1= <>
##$CPDPRG2= <>
##$CPDPRG3= <>
##$CPDPRG4= <mlev>
##$CPDPRG5= <mlev>
##$CPDPRG6= <mlev>
##$CPDPRG7= <mlev>
##$CPDPRG8= <mlev>
##$CPDPRGB= <>
##$CPDPRGT= <>
$$ [...]
150 150 150 150 150 150 150 150
##$TP07= 0
##$TPNAME0= <>
##$TPNAME1= <>
##$TPNAME2= <>
##$TPNAME3= <>
##$TPNAME4= <>
##$TPNAME5= <>
##$TPNAME6= <>
##$TPNAME7= <>
##$TPOAL= (0..7)
0.5 0.5 0.5 0.5 0.5 0.5 0.5 0.5
##$TPOFFS= (0..7)
0 0 0 0 0 0 0 0
##$TUNHIN= 0
##$TUNHOUT= 0
##$TUNXOUT= 0
##$USERA1= <user>
##$USERA2= <user>
##$USERA3= <user>
##$USERA4= <user>
##$USERA5= <user>
##$V9= 5
##$VALIST= <valist>
##$VCLIST= <CCCCCCCCCCCCCCC>
##$VD= 0
##$VDLIST= <DDDDDDDDDDDDDDD>
##$VPLIST= <PPPPPPPPPPPPPPP>
##$VTLIST= <TTTTTTTTTTTTTTT>
##$WBST= 2048
##$WBSW= 25
##$XGAIN= (0..3)
0 0 0 0
##$XL= 0
##$YL= 0
##$YMAX_a= 5624016
##$YMIN_a= -2377724
##$ZGOPTNS= <>
##$ZL1= 120
##$ZL2= 120
##$ZL3= 120
##$ZL4= 120
##$ABSF1= 0
##$ABSF2= 0
##$ABSG= 0
##$ABSL= 0
##$ALPHA= 0
##$AQORDER= 0
##$ASSFAC= 0
##$ASSFACI= 0
##$ASSFACX= 0
##$ASSWID= 0
##$AUNMP= <proc_prof1d>
##$AXLEFT= 0
##$AXNAME= <>
##$AXNUC= <1H>
##$AXRIGHT= 0
##$AXTYPE= 0
##$AXUNIT= <>
##$AZFE= 0.1
##$AZFW= 0.1
##$BCFW= 0
##$BC_mod= 0
##$BYTORDP= 0
##$COROFFS= 0
##$CY= 15
##$DATMOD= 1
##$DC= 0
##$DFILT= <>
##$DTYPP= 0
##$F1P= 14.9796104431152
##$F2P= -5.57292051064055
##$FCOR= 0.5
##$FTSIZE= 32768
##$FT_mod= 6
##$GAMMA= 0
##$GB= 0
##$INTBC= 1
##$INTSCL= 1
##$ISEN= 128
##$LB= 0
##$LEV0= 0
##$LPBIN= 0
##$MAXI= 10000
##$MC2= 0
##$MEAN= 0
##$ME_mod= 0
##$MI= 0
##$NCOEF= 0
##$NC_proc= -6
##$NLEV= 6
##$NOISF1= 0
##$NOISF2= 0
##$NSP= 0
##$NTH_PI= 0
##$NZP= 0
##$OFFSET= 14.97961
##$PC= 1
##$PHC0= 22.8186
##$PHC1= 0
##$PH_mod= 1
##$PKNL= yes
##$PPARMOD= 0
##$PPDIAG= 0
##$PPIPTYP= 0
##$PPMPNUM= 2147483647
##$PPRESOL= 1
##$PSCAL= 4
##$PSIGN= 0
##$PYNMP= <proc.py>
##$REVERSE= no
##$SF= 400.13
##$SI= 32768
##$SIGF1= 0
##$SIGF2= 0
##$SINO= 400
##$SIOLD= 32768
##$SPECTYP= <>
##$SREGLST= <1H.H2O+D2O>
##$SSB= 0
##$STSI= 32768
##$STSR= 0
##$SW_p= 8223.6842105263
##$SYMM= 0
##$S_DEV= 0
##$TDeff= 65536
##$TDoff= 0
##$TI= <>
##$TILT= no
##$TM1= 0
##$TM2= 0
##$TOPLEV= 0
##$USERP1= <user>
##$USERP2= <user>
##$USERP3= <user>
##$USERP4= <user>
##$USERP5= <user>
##$WDW= 1
##$XDIM= 32768
##$YMAX_p= 430037532
##$YMIN_p= -372118
##$CURPLOT= <Network HP LaserJet P1505>
##$CURPRIN= <$Network HP LaserJet P1505>
##$DFORMAT= <normdp>
##$LAYOUT= <+/1D_H.xwp>
##$LFORMAT= <normlp>
##$PFORMAT= <normpl>
##$SURQMSG= 1
$$ End of Bruker specific parameters
$$ ---------------------------------
##NTUPLES= NMR SPECTRUM
##VAR_NAME=  FREQUENCY,     SPECTRUM/REAL,   SPECTRUM/IMAG
##SYMBOL=    X,             R,               I
##VAR_TYPE=  INDEPENDENT,   DEPENDENT,       DEPENDENT
##VAR_FORM=  AFFN,          ASDF,            ASDF
##VAR_DIM=   32768,         32768,           32768
##UNITS=     HZ,            ARBITRARY UNITS, ARBITRARY UNITS
##FACTOR=    0.250966925370065, 1,           1
##FIRST=     8223.43324360093, -820,         -163475
##LAST=      0,             204098,          -269442
##MIN=       0,             -372118,         0
##MAX=       8223.43324360093, 430037532,    0
$$ Real data points
##PAGE= N=1
##DATA TABLE= (X++(R..R)), XYDATA
$$ [...]
$$ plain form
19662 1574603 1614845 1829586 1571990 1910145 1780712 1580343 1849999 1733753 1530972 1703328
19652 1703328 1536852 1664651 1353317 1639285 1833682 1823481 1694365 1669599 1884185 1775060
19642 1775060 1655052 1669754 1732017 1665310 1683510 1626032 1931138 1706349 1607579 1649997 1555617
19631 1555617 1709394 1614832 1626482 1610050 1628457 1743587 1356055 1749111 1339026 1555884
19621 1555884 1454483 1491081 1461219 1416058 1261457 1502857 1421948 1346832 1301156 1233936 1317568
19610 1317568 1422792 1354922 1431873 1441195 1358676 1162732 1203387 1337878 1295670 1186207 1316444
19599 1316444 1411398 1323596 1205507 1390109 1345692 1299269 1384067 1405943 1247439 1309341 1315853
19588 1315853 1200831 1540643 1381826 992783 1499147 1433158 1235072 1240826 1212060 1171287
$$ packed form
19662A574603M0242K14741k57596L38155j29433k00369K69656j16246k02781J72356
19652A703328j66476J27799l11334K85968J94397j0201j29116k4766K14586j09125
19642A775060j20008J4702O2263o6707J8200n7478L05106k24789r8770M2418r4380
19631A555617J53777r4562J1650j6432J8407J15130l87532L93056m10085K16858
19621A555884j01401L6598k9862m5161j54601K41400q0909p5116m5676o7220Q3632
19610A317568J05224o7870P6951R322q2519j95944M0655J34491m2208j09463J30237
19599A316444R4954q7802j18089J84602m4417m6423Q4798K1876j58504O1902O512
19588A315853j15022L39812j58817l89043N06364o5989j98086N754k8766m0773
$$ plain form
19578 1171287 1179557 1231661 1292029 1156781 1165086 1028389 1171052 1347211 1271073 1354900 1100152
19567 1100152 1233315 1413609 1471751 1101687 1312992 1212663 1295734 1430814 1213963 1086152
19557 1086152 1047122 1171455 1344424 1307121 1068865 1248940 1164224 1134077 1093543 1314188
19547 1314188 1256393 1111269 1268689 1219280 1269341 1328309 985482 1121778 1132640 1273678
19537 1273678 1138347 1343986 1234220 1318798 1450357 1271379 1263425 1533399 1275342 1130917
19527 1130917 952912 1422656 1190821 1148965 1257620 1096917 1188476 1353292 1039381 1122651
19517 1122651 1031102 1135326 1194776 1338581 1297562 1188853 1197840 1533425 1116015 1080903
19507 1080903 1144395 1195258 1186307 1196317 1314555 1262598 1074049 1028601 1203735 1080026 882641
$$ packed form
19578A171287Q270N2104O0368j35248Q305j36697J42663J76159p6138Q3827k54748
19567A100152J33163J80294N8142l70064K11305j00329Q3071J35080k16851j27811
19557A086152l9030J24333J72969l7303k38256J80075q4716l0147m0534K20645
19547A314188n7795j45124J57420m9409N0061N8968l42827J36296J0862J41038
19537A273678j35331K05639j09766Q4578J31559j78978p954K69974k58057j44425
19527A130917j78005M69744k31835m1856J08655j60703R1559J64816l13911Q3270
19517A122651r1549J04224N9450J43805m1019j08709Q987L35585m17410l5112
19507A080903O3492N0863q951J0010J18238n1957j88549m5448J75134j23709j97385
$$ plain form
19496 882641 1039837 1122555 1221223 1134372 917634 1088196 1001387 1014737 1159139 1034039
19486 1034039 1167438 920021 1103829 954587 1224869 1081563 1268927 1137959 1259226
19477 1259226 1040885 965051 999013 864682 936818 1020696 898625 894324 780680 745539 744667
19466 744667 912622 1072148 863509 662316 925036 822522 649825 971721 1007366 735033
19456 735033 627591 702015 841495 1001993 789605 944574 677005 792104 691982 761275
19446 761275 803606 811567 943403 749164 657301 762055 1006849 839495 823818 798960 584964
19435 584964 936363 862334 817066 798929 850439 871085 861896 833607 765491 849681 1029377
19424 1029377 759866 688440 753666 835361 900370 746020 873031 620087 926868 670814
$$ packed form
19496H82641J57196Q2718R8668q6851k16738J70562q6809J3350J44402j25100
19486A034039J33399k47417J83808j49242K70282j43306J87364j30968J21267
19477A259226k18341p5834L3962j34331P2136Q3878j22071m301j13644l5141q72
19466G44667J67955J59526k08639k01193K62720j02514j72697L21896L5645k72333
19456G35033j07442P4424J39480J60498k12388J54969k67569J15099j00122O9293
19446G61275M2331P961J31836j94239r1863J04754K44794j67354j5677k4858k13996
19435E84964L51399p4029m5268j8137N1510K0646r189k8289o8116Q4190J79696
19424A029377k69511p1426O5226Q1695O5009j54350J27011k52944L06781k56054
$$ plain form
19414 670814 765225 749116 954969 801164 767920 951694 790621 691944 802627 694403
19404 694403 744939 851831 832835 809302 855330 612105 730365 931967 768887 821642
19394 821642 698783 687307 642097 494288 839484 707153 824578 848523 836962 779197
19384 779197 988780 745332 935440 883806 912689 947818 976762 654590 868324 744059
19374 744059 773208 700458 713474 738477 678600 702034 776357 836156 720976 867697 877953
19363 877953 618804 923624 864743 821513 655882 1015294 644813 787152 698797 568391
19353 568391 543931 684167 600810 1057250 808168 883870 975475 690833 677338 763813 706789
19342 706789 939474 1084765 965723 1014259 1143087 896285 980196 1040527 847733 1186450
$$ packed form
19414F70814R4411j6109K05853j53805l3244J83774j61073r8677J10683j08224
19404F94403N0536J06892j8996k3533M6028k43225J18260K01602j63080N2755
19394H21642j22859j1476m5210j47809L45196j32331J17425K3945j1561n7765
19384G79197K09583k43448J90108n1634K8883L5129K8944l22172K13734j24265
19374G44059K9149p2750J3016K5003n9877K3434P4323N9799j15180J46721J0256
19363H77953k59149L04820n8881m3230j65631L59412l70481J42339q8355j30406
19353E68391k4460J40236q3357M56440k49082P5702R1605k84642j3495Q6475n7024
19342G06789K32685J45291j19042M8536J28828k46802Q3911O0331j92794L38717
$$ plain form
19332 1186450 824104 1015827 957535 1032833 1021899 787149 994563 701851 785829 1069131
19322 1069131 1019661 1017993 747820 894383 830688 945662 716809 752521 1045515 717938
19312 717938 913398 903540 752529 665026 919246 686095 708579 529947 796766 626651
19302 626651 710103 684620 666803 670770 800307 891267 625420 766888 541723 531350 484726
19291 484726 763290 691366 838580 622077 464090 795551 595312 762191 592669 583131
19281 583131 620765 683565 829949 564479 722631 593514 655283 520969 817370 595954
19271 595954 813884 727904 602197 571007 735873 592826 954823 810032 879910 752644
19261 752644 775425 670549 722472 759078 876951 893049 652983 608884 824802 852430 934395
$$ packed form
19332A186450l62346J91723n8292P5298j0934k34750K07414k92712Q3978K83302
19322A069131m9470j668k70173J46563o3695J14974k28853L5712K92994l27577
19312G17938J95460r858j51011q7503K54220k33151K2484j78632K66819j70115
19302F26651Q3452k5483j7817L967J29537R0960k65847J41468k25165j0373m6624
19291D84726K78564p1924J47214k16503j57987L31461k00239J66879j69522r538
19281E83131L7634O2800J46384k65470J58152j29117O1769j34314K96401k21416
19271E95954K17930q5980j25707l1190J64866j43047L61997j44791O9878j27266
19261G52644K2781j04876N1923L6606J17873J6098k40066m4099K15918K7628Q1965
$$ plain form
19250 934395 726231 639398 765281 635315 641711 890128 810660 804142 1068440 1331156 1062035
19239 1062035 1245618 1521478 1446007 1436784 1428929 1258318 934052 776124 918948 680730
19229 680730 519661 873890 678334 694714 842268 802648 767972 922494 662336 791886
19219 791886 841760 782777 545635 598503 641305 720307 691589 618014 597975 664025 658923
19208 658923 805524 700758 710035 571952 718400 689370 742052 476987 760278 451209
19198 451209 637449 542503 524712 681104 880132 741250 648380 486009 857108 733617
19188 733617 719813 542304 655970 638625 702022 824906 1053543 570143 1028888 990820
19178 990820 1087722 1023156 1116982 872098 1070315 1045703 1024048 891902 774440 1121228
$$ packed form
19250I34395k08164q6833J25883j29966O396K48417p9468o518K64298K62716k69121
19239A062035J83583K75860p5471r223p855j70611l24266j57928J42824k38218
19229F80730j61069L54229j95556J6380J47554l9620l4676J54522k60158J29550
19219G91886M9874n8983k37142N2868M2802P9002k8718p3575k0039O6050n102
19208F58923J46601j04766R277j38083J46448k9030N2682k65065K83291l09069
19198D51209J86240r4946j7791J56392J99028j38882r2870j62371L71099j23491
19188G33617j3804j77509J13666j7345O3397J22884K28637m83400M58745l8068
19178I90820R6902o4566R3826k44884J98217k4612k1655j32146j17462L46788
$$ plain form
19168 1121228 701941 817175 868599 1010913 854569 944557 935281 956620 1117180 1019659
19158 1019659 1321172 864423 847738 960166 805102 883775 916425 935331 1050755 847765
19148 847765 766415 904992 1154168 891942 674730 822237 1067762 916035 987968 1032706
19138 1032706 688089 903159 842293 971739 1011055 837454 1013682 995850 816063 955013
19128 955013 900677 763552 1021217 1004097 701800 1209290 993579 1346408 1141462 1118086
19118 1118086 1237253 1383362 1787691 1463251 1684542 2015439 1941033 2443716 2579612 3139215
19108 3139215 3517772 3578252 4139016 4611461 4414320 4468618 4753479 4541241 3692867 3376515
19098 3376515 3016707 2178341 1867058 1829093 1570788 1643278 1625303 1596104 1475391 1433565
$$ packed form
19168A121228m19287J15234N1424J42314j56344Q9988r276K1339J60560r7521
19158A019659L01513m56749j6685J12428j55064P8673L2650J8906J15424k02990
19148H47765q1350J38577K49176k62226k17212J47507K45525j51727P1933M4738
19138A032706l44617K15070o0866J29446L9316j73601J76228j7832j79787J38950
19128I55013n4336j37125K57665j7120l02297N07490k15711L52829k04946k3376
19118A118086J19167J46109M04329l24440K21291L30897p4406N02683J35896N59603
19108C139215L78557O0480N60764M72445j97141N4298K84861k12238q48374l16352
19098C376515l59808q38366l11283l7965k58305P2490j7975k9199j20713m1826
$$ plain form
19088 1433565 1579086 1332385 1483440 1823449 1722862 2056877 2436965 2769836 3265222
19079 3265222 3611101 3571726 4099511 4600285 4389909 4546736 4581207 4452910 4447117 4284142
19069 4284142 4114321 4314265 4537952 4323621 4239701 3914929 3359290 2967673 2683933 2379771
19059 2379771 2154955 1995692 1735113 1595554 1788253 1706304 1842979 1735782 1590245 1771138
19049 1771138 2066549 2105661 2560275 2640220 3213257 3487014 4077909 4334549 4639675 4792033
19039 4792033 4676993 4509129 4095780 3430964 2820648 2481367 2037322 2010565 1800454 1781248
19029 1781248 1799465 1654932 1769659 1864784 1963967 1842362 2114525 2179752 2131980 2251463
19019 2251463 2792550 3239928 3571660 4225353 4129635 4473850 4935239 5361771 5601791 5804851
$$ packed form
19088A433565J45521k46701J51055L40009j00587L34015L80088L32871M95386
19079C265222L45879l9375N27785N00774k10376J56827L4471j28297n793j62975
19069D284142j69821J99944K23687k14331q3920l24772n55639l91617k83740l04162
19059B379771k24816j59263k60579j39559J92699q1949J36675j07197j45537J80893
19049A771138K95411L9112M54614P9945N73037K73757N90895K56640L05126J52358
19039D792033j15040j67864m13349o64816o10316l39281m44045k6757k10111j9206
19029A781248J8217j44533J14727R5125R9183j21605K72163O5227m7772J19483
19019B251463N41087M47378L31732O53693r5718L44215M61389M26532K40020K03060
$$ plain form
19009 5804851 5906922 5937213 6059685 6421327 6991150 7290805 7933060 9297793 9968976
19000 9968976 11076440 12840252 14070814 16224566 17785527 19785337 21084852 21679464
18992 21679464 22282128 21596831 20316677 18204371 15579251 13065505 11157039 8812398
18984 8812398 7396042 6033759 5195203 4405296 3922354 3641096 3267376 2851448 2566699
18975 2566699 2717221 2309111 2251355 2256503 2036318 1870681 1928201 1863821 1809264 1822320 1319529
18964 1319529 1775933 1599905 1584376 1642545 1516090 1659004 1680892 1715436 1746847 1723049
18954 1723049 1745811 1985733 2106059 2182542 2187887 2415062 2158494 2497555 2353373 2579741
18944 2579741 2980356 3242941 3521080 3643228 4558029 5144786 6131438 7424367 9067776
$$ packed form
19009E804851J02071L0291J22472L61642N69823K99655O42255J364733O71183
19000I968976J107464J763812J230562K153752J560961J999810J299515N94612
18992B1679464O02664o85297j280154k112306k625120k513746j908466k344641
18984H812398j416356j362283q38556p89907m82942k81258l73720m15928k84749
18975B566699J50522m08110n7756N148k20185j65637N7520o4380n4557J3056n02791
18964A319529M56404j76028j5529N8169j26455J42914K1888L4544L1411k3798
18954A723049K2762K39922J20326P6483N345K27175k56568L39061j44182K26368
18944B579741M00615K62585K78139J22148R14801N86757R86652J292929J643409
$$ plain form
18935 9067776 10926150 12867371 14913329 16754421 18300683 19205167 19846935 20109617 19490306
18926 19490306 17866736 15974255 13336169 10712399 8885815 7283838 5716745 4902846
18918 4902846 4007381 3546362 2953719 2862434 2342231 2310170 2019169 1770654 1735723 1696611
18908 1696611 1475147 1533822 1189483 1249570 1246751 1198361 892894 1065245 1093825 835426
18898 835426 995656 951716 818759 891096 669722 991339 685932 762370 636432 812754
18888 812754 726241 593782 720693 526124 728947 719663 794892 683865 615740 612262 810529
18877 810529 700759 735350 607014 826205 667398 737150 645268 609087 668229 709928 616252
18866 616252 460035 698169 537562 595005 585625 646651 571884 603630 580716 519289 657333
$$ packed form
18935I067776J858374J941221K045958J841092J546262R04484O41768K62682o19311
18926A9490306j623570j892481k638086k623770j826584j601977j567093q13899
18918D902846q95465m61019n92643r1285n20203l2061k91001k48515l4931l9112
18908A696611k21464N8675l44339O0087k819m8390l05467J72351K8580k58399
18898H35426J60230m3940j32957P2337k21374L21617l05407P6438j25938J76322
18888H12754q6513j32459J26911j94569K02823r284P5229j11027o8125l478J98267
18877H10529j09770L4591j28336K19191j58807O9752r1882l6181N9142M1699r3676
18866F16252j56217K38134j60607N7443r380O1026p4767L1746k2914o1427J38044
$$ plain form
18855 657333 639703 403217 696174 720132 427643 702182 788341 747224 675984 836308
18845 836308 821264 508087 738603 601012 808465 487000 556334 807772 601905 617499
18835 617499 542957 596956 717111 646975 580089 671945 648331 607651 672884 448433 539453
18824 539453 643127 578883 423774 492716 754161 650442 468041 412575 818912 795264
18814 795264 557064 630647 713399 455122 616051 504128 346371 658429 415155 611797
18804 611797 637942 841926 913629 775628 549627 601224 658204 739788 1033389 782457
18794 782457 686264 815175 775111 794375 546123 899240 699364 767502 978432 742228
18784 742228 968376 877538 856224 921647 857077 973138 900841 804061 955951 801734 636506
$$ packed form
18855F57333j7630k36486K92957K3958k92489K74539Q6159m1117p1240J60324
18845H36308j5044l13177K30516j37591K07453l21465O9334K51438k05867J5594
18835F17499p4542N3999J20155p0136o6886R1856k3614m0680O5233k24451R1020
18824E39453J03674o4244j55109O8942K61445j03719j82401n5466M06337k3648
18814G95264k38200P3583Q2752k58277J60929j11923j57757L12058k43274J96642
18804F11797K6145K03984P1703j38001k26001N1597N6980Q1584K93601k50932
18794G82457r6193J28911m0064J9264k48252L53117j99876O8138K10930k36204
18784G42228K26148r0838k1314O5423o4570J16061p2297r6780J51890j54217j65228
$$ plain form
18773 636506 961957 547795 868588 638163 754966 803037 928036 563663 752949 603810
18763 603810 664411 547667 597507 476389 747187 661992 457548 544175 477359 426034 430840
18752 430840 398592 796551 750416 905949 496583 808585 687640 292796 610791 731374
18742 731374 807681 538256 518313 708180 647424 643639 641419 655124 405268 637520 783045
18731 783045 383452 680978 880357 599942 800135 457589 768667 593648 445906 537931
18721 537931 607574 672109 805440 711092 703769 781245 638241 831656 540152 591235 715838
18710 715838 598349 516091 694883 480319 569530 549885 782770 597318 786378 690113
18700 690113 422329 633914 617120 380337 540883 613126 721999 714446 858944 671510
$$ packed form
18773F36506L25451m14162L20793k30425J16803M8071J24999l64373J89286j49139
18763F03810O0601j16744M9840j21118K70798q5195k04444Q6627o6816n1325M806
18752D30840l2248L97959m6135J55533m09366L12002j20945B92796L17995J20583
18742G31374P6307k69425j9943J89867o0756l785k220J3705k49856K32252J45525
18731G83045C83452K97526J99379k80415K00193l42546L11078j75019j47742R2025
18721E37931O9643O4535J33331r4348p323P7476j43004J93415k91504N1083J24603
18710G15838j17489q2258J78792k14564Q9211j9645K32885j85452J89060r6265
18700F90113k67784K11585j6794k36783J60546P2243J08873p553J44498j87434
$$ plain form
18690 671510 834086 345330 815637 728910 636849 789139 609463 558153 834751 759698
18680 759698 761834 599012 660819 723004 765208 533745 791896 819830 709089 779344 614888
18669 614888 765938 818996 668358 655352 850452 569957 761665 782037 644463 714130
18659 714130 593240 664188 667288 447246 697446 551136 657443 516187 692797 507442
18649 507442 485876 474194 343374 482092 374511 643815 558793 441008 510592 645602
18639 645602 99506 357034 506742 641757 536049 495033 692713 471212 620622 548420
18629 548420 259458 526584 479804 775123 441999 547168 545933 454814 561843 631297
18619 631297 508477 509181 716946 585494 577427 520848 625145 578188 600570 581483 820725
$$ packed form
18690F71510J62576C45330M70307q6727r2061J52290j79676n1310K76598p5053
18680G59698K136j62822O1807O2185M2204k31463K58151K7934j10741P0255j64456
18669F14888J51050N3058j50638j3006J95100k80495J91708K0372j37574O9667
18659G14130j20890P0948L100k20042K50200j46310J06307j41256J76610j85355
18649E07442k1566j1682j30820J38718j07581K69304q5022j17785O9584J35010
18639F45602I9506K57528J49708J35015j05708m1016J97680k21501J49410p2202
18629E48420B59458K67126m6780K95319l33124J05169j235r1119J07029O9454
18619F31297j22820P04K07765j31452q067n6579J04297m6957K2382j9087K39242
$$ plain form
18608 820725 720159 908482 510621 840639 626020 686126 671605 744025 665594 732489
18598 732489 486117 623166 837552 817847 711110 931694 1012768 978321 653560 812449
18588 812449 737110 709133 727883 760197 546086 951077 758089 673277 611911 694088 755932
18577 755932 659488 662194 558155 684266 773537 602491 800426 348957 795835 698349
18567 698349 654300 631575 677541 551447 502720 668673 583737 566754 462170 653816 592269
18556 592269 630304 530326 369824 684779 586062 692443 398017 532654 806867 515586
18546 515586 471453 548320 509423 407611 535160 601709 450359 486392 559555 569263 784232
18535 784232 626657 563433 382752 458801 420726 497660 448497 490677 327256 607409 474021
$$ packed form
18608H20725j00566J88323l97861L30018k14619O0106j4521P2420p8431O6895
18598G32489k46372J37049K14386j9705j06737K20584Q1074l4447l24761J58889
18588H12449p5339k7977J8750L2314k14111M04991j92988q4812o1366Q2177O1844
18577G55932r6444K706j04039J26111Q9271j71046J97935C48957M46878r7486
18567F98349m4049k2725M5966j26094m8727J65953q4936j6983j04584J91646o1547
18556E92269L8035r9978j60502L14955r8717J06381k94426J34637K74213k91281
18546E15586m4133P6867l8897j01812J27549O6549j51350L6033P3163R708K14969
18535G84232j57575o3224j80681P6049l8075P6934m9163M2180j63421K80153j33388
$$ plain form
18524 474021 696185 496911 385142 482649 208903 776544 307313 511121 544978 480551
18514 480551 400353 548528 260417 502487 652264 434675 758487 639246 504714 591454
18504 591454 204482 674212 435424 579812 631399 559624 630818 592822 527890 476580 680085
18493 680085 588030 620273 563481 412940 478133 531588 363098 566657 602629 443412 733455
18482 733455 620454 683827 468283 642598 652445 433169 519022 549007 609849 577183 434850
18471 434850 551442 463790 622378 707056 526184 519917 607413 513906 786786 572482 646001
18460 646001 850786 737739 593036 726696 728743 687325 775195 786981 687809 724119 718620
18449 718620 721802 699923 653818 529743 497298 536744 468379 360540 701872 481604 497778
$$ packed form
18524D74021K22164j99274j11769R7507B08903N67641C07313K03808L3857o4427
18514D80551q0198J48175B60417K42070J49777k17589L23812j19241j34532Q6740
18504E91454B04482M69730k38788J44388N1587p1775P1194l7996o4932n1310K03505
18493F80085r2055L2243n6792j50541O5193N3455j68490K03559L5972j59217K90043
18482G33455j13001O3373k15544J74315R847k19276Q5853K9985O0842l2666j42333
18471D34850J16592q7652J58588Q4678j80872o267Q7496r3507K72880k14304P3519
18460F46001K04785j13047j44703J33660K047m1418Q7870J1786r9172L6310n499
18449G18620L182k1879m6105j24075l2445L9446o8365j07839L41332k20268J6174
$$ plain form
18438 497778 550583 497848 712726 478567 717653 650754 525208 805024 587348 893995
18428 893995 772917 665034 482530 763291 764874 679145 696969 612734 622068 674926 423788
18417 423788 435342 396311 579782 606898 421120 505568 451990 438067 578249 385605 515502
18406 515502 447135 446100 512298 531654 497589 419158 635347 582584 601784 346999 681528
18395 681528 478562 495980 234030 573459 421392 361365 622402 552173 204571 648602
18385 648602 477780 367817 335773 278406 289627 454279 215393 304553 487667 604736
18375 604736 501088 458074 407200 535199 365187 564627 621109 606379 460706 655895
18365 655895 501035 332701 397769 619764 376047 421173 680597 580272 739602 495382
$$ packed form
18438D97778N2805n2735K14878k34159K39086o6899j25546K79816k17676L06647
18428H93995j21078j07883j82504K80761J583q5729J7824q4235R334N2858k51138
18417D23788J1554l9031J83471K7116j85778Q4448n3578j3923J40182j92644J29897
18406E15502o8367j035O6198J9356l4065p8431K16189n2763J9200k54785L34529
18395F81528k02966J7418B34030L39429j52067o0027K61037p0229B04571M44031
18385F48602j70822j09963l2044n7367J1221J64652B15393Q9160J83114J17069
18375F04736j03648m3014n0874J27999j70012J99440N6482j4730j45673J95189
18365F55895j54860j68334O5068K21995k43717M5126K59424j00325J59330k44220
$$ plain form
18355 495382 597235 407037 635512 375687 784056 460094 655615 888949 734378 983782
18345 983782 598023 797653 749336 742828 638262 468394 660237 453450 498609 649597
18335 649597 346309 278849 667787 492969 674481 723240 585812 299629 429790 428895
18325 428895 673156 453944 412055 636979 647311 535170 610954 538296 732374 547272
18315 547272 597721 646552 467563 687633 730767 517620 636987 557444 530172 481490 421927
18304 421927 329623 370504 413782 560251 368334 455067 359561 370992 441774 419732 406892
18293 406892 621757 317428 568185 582960 510246 430813 518023 493477 284120 362785 417854
18282 417854 462995 531759 433809 491633 571322 439358 446648 636916 515988 588075 559813
$$ packed form
18355D95382J01853j90198K28475k59825M08369l23962J95521K33334j54571K49404
18345I83782l85759J99630m8317o508j04566j69868J91843k06787M5159J50988
18335F49597l03288o7460L88938j74818J81512M8759j37428k86183J30161q95
18325D28895K44261k19212m1889K24924J0332j12141P5784p2658J94078j85102
18315E47272N0449M8831j78989K20070M3134k13147J19367p9543k7272m8682n9563
18304D21927r2304M0881M3278J46469j91917Q6733r5506J1431P0782k2042j2840
18293D06892K14865l04329K50757J4775p2714p9433Q7210k4546k09357P8665N5069
18282D17854M5141O8764r7950N7824P9689j31964P290J90268j20928P2087k8262
$$ plain form
18271 559813 569082 688928 658333 457358 361158 401487 605046 728099 733767 553219 468534
18260 468534 402954 654144 471630 430883 577257 509901 755331 554425 511265 614671
18250 614671 577442 733570 582954 462483 474069 438561 473399 495697 673837 376010
18240 376010 758383 221973 656192 507228 530864 620293 554478 492257 627554 293093
18229 525405 434876 328621 453975 351928 376773 555703 542653 318249 502510 497604
18219 497604 491019 648302 408061 511214 530125 688134 593670 723651 243484 563672
18209 563672 464803 500474 579574 626448 662748 509970 686128 720835 461153 921496 433412
18197 766117 805525 849565 727785 800509 605072 787025 725544 628101 565680 587536 569889
$$ packed form
18271E59813R269J19846l0595k00975r6200M0329K03559J23053N668j80548q4685
18260D68534o5580K51190j82514m0747J46374o7356K45430k00906m3160J03406
18250F14671l7229J56128j50616j20471J1586l5508L4838K2298J78140k97827
18240C76010L82373B21973M34219j48964K3636Q9429o5815o2221J35297B93093
18229E25405r0529j06255J25354j02047K4845J78930j3050k24404J84261m906
18219D97604o585J57283k40241J03153J8911J58009r4464J29981B43484L20188
18209E63672r8869L5671P9100M6874L6300j52778J76158L4707k59682M60343D33412
18197G66117L9408M4040j21780P2724j95437J81953o1481r7443o2421K1856j7647
$$ plain form
18186 569889 590719 671336 406590 566716 729678 581196 701924 422127 644205 730878
18176 730878 676842 453693 589187 406596 505998 671371 561335 600829 665265 685757
18166 685757 576241 670167 608320 678598 574838 554003 616295 734371 631477 674761 564184
18155 564184 668392 645253 616814 657374 517553 445071 643841 581816 767759 476226
18145 476226 635345 497693 934575 324193 602691 456994 478303 507200 643780 510728
18135 510728 586090 514187 794647 546783 757627 472330 360858 766103 816299 756839
18125 756839 740841 471504 499842 570895 552054 796320 711984 709375 476892 557747 579434
18114 579434 433024 432019 622498 502027 573624 621383 363593 604742 757421 354663
$$ packed form
18186E69889K0830Q0617k64746J60126J62962j48482J20728k79797K22078Q6673
18176G30878n4036k23149J35494j82591R9402J65373j10036L9494O4436K0492
18166F85757j09516R3926o1847P0278j03760k0835O2292J18076j02894M3284j10577
18155E64184J04208k3139k8439M0560j39821p2482J98770o2025J85943k91533
18145D76226J59119j37652M36882C24193K78498j45697K1309K8897J36580j33052
18135E10728P5362p1903K80460k47864K10844k85297j11472M05245N0196n9460
18125G56839j5998k69337K8338P1053j8841K44266q4336k609k32483Q0855K1687
18114E79434j46410j005J90479j20471P1597M7759k57790K41149J52679C54663
$$ plain form
18103 544077 662836 698660 590934 437507 566325 675656 472537 533428 618622 698454
18093 698454 472008 598700 462030 569143 762096 486073 572287 768842 562973 626026
18083 626026 466525 559001 453369 545554 509035 507489 564353 378559 602855 321315 539297
18072 539297 709028 481550 411833 760697 437457 564904 405526 446976 591798 474792
18062 474792 598604 428171 310502 468282 581846 517266 787152 291951 342394 332284
18052 332284 407545 499773 408565 335988 569289 480460 547816 337919 599826 571495 366749
18041 366749 571206 427751 508567 207266 632275 457378 496950 361651 459694 454934
18031 454934 418887 585643 435172 525518 546081 357657 399546 558816 432532 546371
$$ packed form
18103E44077J18759L5824j07726j53427J28818J09331k03119O0891Q5194P9832
18093F98454k26446J26692j36670J07113J92953k76023Q6214J96555k05869O3053
18083F26026j59501R2476j05632R2185l6519j546N6864j85794K24296k81540K17982
18072E39297J69731k27478o9717L48864l23240J27447j59378M1450J44822j17006
18062D74792J23812j70433j17669J57780J13564o4580K69886B91951N0443j0110
18052C32284P5261R2228r1208p2577K33301q8829O7356k09897K61907k8331k04746
18041C66749K04457j43455Q0816B07266M25009j74897L9572j35299R8043m760
18031D54934l6047J66756j50471R0346K0563j88424M1889J59270j26284J13839
$$ plain form
18021 546371 318947 317598 280037 469549 391295 399692 511477 323417 587529 377523 521064
18010 521064 531286 632273 490343 608268 213348 451684 456828 341518 448038 443122
18000 443122 503218 230639 539025 529431 536358 616954 446210 453439 277004 361713 486509
17989 486509 257015 597544 483775 531453 514587 484937 358884 446192 277690 520328
17979 520328 543923 307810 379355 515744 539795 408246 540510 459101 334322 511167
17969 511167 527242 516030 563753 419544 606332 462819 524870 537147 489136 533893 483764
17958 483764 288021 428366 731448 576564 445324 663138 455557 511616 530437 429564
17948 429564 587837 267656 580617 444071 399599 656266 404857 445119 519659 683470
$$ packed form
18021E46371k27424j349l7561J89512p8254Q397J11785j88060K64112k10006J43541
18010E21064J0222J00987j41930J17925B13348K38336N144j15310J06520m916
18000D43122O0096B30639L08386r594O927Q0596j70744P229j76435Q4709J24796
17989D86509k29494L40529j13769M7678j6866k9650j26053Q7308j68502K42638
17979E20328K3595k36113P1545J36389K4051j31549J32264q1409j24779J76845
17969E11167J6075j1212M7723j44209J86788j43513O2051J2277m8011M4757n0129
17958D83764j95743J40345L03082j54884j31240K17814k07581N6059J8821j00873
17948D29564J58273B67656L12961j36546m4472K56667k51409M0262P4540J63811
$$ plain form
17938 683470 680339 387720 429118 580725 391256 338966 399009 553683 503821 637879 597604
17927 597604 554032 654782 543510 662964 482028 623226 419923 487217 598811 664212
17917 664212 668248 531836 508925 508539 433394 759140 298714 530951 414379 903472 630765
17906 630765 732765 593434 719776 606569 881793 635860 668755 733832 479958 674115
17896 674115 377015 587200 554070 805096 549177 714697 636443 466326 677118 696909
17886 696909 611550 450162 677257 683930 599236 539595 443351 566564 707331 662490 665344
17875 665344 715986 666540 569027 709687 491142 525289 698807 615424 633857 592679 656928
17864 656928 526594 577720 604674 589755 572848 431765 687922 357043 492812 617488
$$ packed form
17938F83470l131k92619M1398J51607j89469n2290O0043J54674m9862J34058m0275
17927E97604m3572J00750j11272J19454j80936J41198k03303O7294J11594O5401
17917F64212M036j36412k2911l86p5145L25746B98714K32237j16572M89093k72707
17906F30765J02000j39331J26342j13207K75224k45933L2895O5077k53874J94157
17896F74115k97100K10185l3130K51026k55919J65520p8254j70117K10792J9791
17886F96909q5359j61388K27095O673q4694n9641r6244J23213J40767m4841K854
17875F65344N0642m9446r7513J40660k18545L4147J73518q3383J8433m1178O4249
17864F56928j30334N1126K6954j4919j6907j41083K56157l30879J35769J24676
$$ plain form
17854 617488 585950 624295 584601 561003 507470 582933 630463 562224 718727 640812 551077
17843 551077 657927 862868 587236 544672 744805 547737 485289 842324 503935 538248
17833 538248 610699 835027 521064 530223 533161 872288 523563 771211 693566 531551 666271
17822 666271 682543 720855 815786 756318 694581 1014587 625666 849731 912663 1073696 1166480
17811 1166480 1022976 1076006 945553 1056744 980370 849443 956778 817735 657019 859274
17801 859274 636725 940235 1025550 992135 918106 1163630 1083389 704905 1035603 797927
17791 797927 683921 757399 420535 655312 790112 503287 615707 411385 619651 566428
17781 566428 792972 731164 606572 578916 613409 579104 382012 653287 587944 891561
$$ packed form
17854F17488l1538L8345l9694k3598n3533P5463M7530o8239J56503p7915q9735
17843E51077J06850K04941k75632m2564K00133j97068o2448L57035l38389L4313
17833E38248P2451K24328l13963R159K938L39127l48725K47648p7645j62015J34720
17822F66271J6272L8312R4931n9468o1737L20006l88921K24065O2932J61033R2784
17811A166480j43504N3030j30453J11191p6374j30927J07335j39043j60716K02255
17801H59274k22549L03510Q5315l3415p4029K45524q0241l78484L30698k37676
17791G97927j14006P3478l36864K34777J34800k86825J12420k04322K08266n3223
17781E66428K26544o1808j24592k7656L4493l4305j97092K71275o5343L03617
$$ plain form
17771 891561 673995 550161 630881 516626 626331 675032 614896 293099 647895 703989
17761 703989 488765 288295 625952 795643 631563 663694 558666 667527 739355 700346
17751 700346 643867 617744 632053 599648 976758 641109 761879 636075 760044 1010770
17741 1010770 735806 657618 576844 831658 772566 553481 538176 609213 649683 592856 660067
17730 660067 635668 802682 568427 864237 449754 683419 600616 594728 511386 641663
17720 641663 622624 678720 541917 768126 521417 536240 801971 734004 580976 642926
17710 642926 639862 737744 768016 717252 573848 600459 586159 588272 571291 492365 614811
17699 614811 644545 489375 587366 366039 624243 659091 571274 702432 594615 716303
$$ packed form
17771H91561k17566j23834Q0720j14255J09705M8701o0136B93099L54796N6094
17761G03989k15224k00470L37657J69691j64080L2131j05028J08861P1828l9009
17751G00346n6479k6123J4309l2405L77110l35649J20770j25804J23969K50726
17741A010770k74964p8188q0774K54814n9092k19085j5305P1037M0470n6827O7211
17730F60067k4399J67014k34255K95810m14483K33665q2803n888q3342J30277
17720F41663j9039N6096j36803K26209k46709J4823K65731o7967j53028O1950
17710F42926l064R7882L0272n0764j43404K6611j4300K113j6981p8926J22446
17699F14811K9734j55170R7991k21327K58204L4848q7817J31158j07817J21688
$$ plain form
17689 716303 728580 523374 771746 483185 736614 556902 648819 605431 585166 597153
17679 597153 802349 695121 305382 665151 511684 748403 646287 790056 660504 699324
17669 699324 463193 709620 816235 614149 577492 807017 765561 670899 560869 648432
17659 648432 664919 694674 614146 735601 845768 546430 782105 758203 722124 919978
17649 919978 749541 841150 703774 925828 774412 907376 887613 685710 1122556 810657
17639 810657 952341 804724 739222 883834 1013634 852746 900904 1008657 948547 857969
17629 857969 667539 887899 854006 695024 1069991 1131936 943667 1194665 1122092 1047872
17619 1047872 925520 989161 1090671 1159162 1099740 1184485 891690 1061211 1077612 865767
$$ packed form
17689G16303J2277k05206K48372k88561K53429j79712R1917m3388k0265J1987
17679E97153K05196j07228C05382L59769j53467K36719j02116J43769j29552L8820
17669F99324k36131K46427J06615k02086l6657K29525m1456r4662j10030Q7563
17659F48432J6487K9755q0528J21455J10167k99338K35675k3902l6079J97854
17649I19978j70437R1609j37376K22054j51416J32964j9763k01903M36846l11899
17639H10657J41684j47617o5502J44612J29800j60888M8158J07753o0110r0578
17629H57969j90430K20360l3893j58982L74967O1945j88269K50998p2573p4220
17619A047872j22352O3641J01510O8491n9422Q4745k92795J69521J6401k11845
$$ plain form
17609 865767 1013389 1341350 1222142 1104041 1231430 1349710 1364209 1087757 1185250 1302127
17599 1302127 1007153 954830 1444020 1155226 1125501 1152703 1383425 1381086 1263959 1033618
17589 1033618 959422 1121862 991132 1055538 1020163 1105555 922672 1212988 1034577 1213743
17579 1213743 1173991 1247457 1570067 1178315 1307175 1526824 1275185 1404116 1498225 1426033
17569 1426033 1390763 1268071 1034863 1076477 1302670 1220625 1102791 1220287 1126042 1137811
17559 1137811 1121447 1147349 978066 1267459 1137544 1116396 1301569 1173551 1289405 1291974
17549 1291974 1165113 1195057 1305075 1462698 1237001 1289474 1339739 1411210 1544556 1548316
17539 1548316 1389895 1739769 1252253 1457489 1301806 1358208 1361937 1185475 1184536 1419482
$$ packed form
17609H65767J47622L27961j19208j18101J27389J18280J4499k76452R7493J16877
17599A302127k94974n2323M89190k88794k9725K7202K30722k339j17127k30341
17589A033618p4196J62440j30730O4406l5375Q5392j82883K90316j78411J79166
17579A213743l9752P3466L22610l91752J28860K19649k51639J28931R4109p2192
17569A426033l5270j22692k33208M1614K26193q2045j17834J17496r4245J1769
17559A137811j6364K5902j69283K89393j29915k1148J85173j28018J15854K569
17549A291974j26861K9944J10018J57623k25697N2473N0265P1471J33346L760
17539A548316j58421L49874m87516K05236j55683N6402L729j76462r39K34946
$$ plain form
17529 1419482 1345076 1521527 1566202 1533092 1646244 1464550 1454132 1204070 1362294 1447702
17519 1447702 1316580 1406046 1542099 1519850 1489505 1498401 1914314 1994579 2002210 2264297 2097088
17508 2097088 2373154 2515632 2566433 2689730 2763779 2320219 2543586 2518826 2720433 2767224
17498 2767224 2693038 2935113 3297735 3483428 4062520 4351083 4779688 5444338 6210500 6684306
17488 6684306 7999841 9868855 14187893 20540361 30868748 44148276 58375508 71825277
17480 71825277 82050568 89326418 93660237 94188322 90585214 81168772 66937166 51263316
17472 51263316 37870777 30900512 30394324 35573289 45798161 58768978 71716659 82422023
17464 82422023 89829508 93910400 94998176 91932998 83768686 69708302 52379831 35485258
$$ packed form
17529A419482p4406J76451M4675l3110J13152j81694j0418k50062J58224Q5408
17519A447702j31122Q9466J36053k2249l0345Q896M15913Q0265P631K62087j67209
17508B097088K76066J42478N0801J23297P4049m43560K23367k4760K01607M6791
17498B767224p4186K42075L62622J85693N79092K88563M28605O64650P66162M73806
17488F684306J315535J869014M319038O352468J0328387J3279528J4227232J3449769
17480G1825277J0225291P275850M333819N28085l603108r416442j4231606j5673850
17472E1263316j3392539o970265n06188N178965J0224872J2970817J2947681J0705364
17464H2422023P407485M080892J087776l065178q164312j4060384j7328471j6894573
$$ plain form
17456 35485258 22805139 14761971 10252418 7827056 6380654 5570553 4664473 4263265
17448 4263265 3936471 3842395 3685523 3718183 3597879 3678697 3665666 3654598 3529973 3401786
17438 3401786 3443892 3226141 3081295 2844874 2908859 2602336 2546904 2960936 2890585 3067261
17428 3067261 2969023 2933325 3178744 2888978 2956680 2616192 2627836 2551646 2063859 2292650
17418 2292650 2205006 2169291 2166725 2035145 2106869 2136589 2490209 2397973 2171277 2296397 2259945
17407 2259945 2059706 1906830 2256656 2558299 2746285 2895668 2925286 2945832 3179273 3260855
17397 3260855 3194603 3422262 3653332 4002805 4192652 4690729 5143624 5896119 6108342 6604492
17387 6604492 6740759 7043180 7255422 7452991 7400266 7282989 7116402 6952975 6316220 6162021
$$ packed form
17456C5485258j2680119q043168m509553k425362j446402q10101r06080m01208
17448D263265l26794r4076j56872L2660j20304Q0818j3031j1068j24625j28187
17438C401786M2106k17751j44846k36421O3985l06523n5432M14032p0351J76676
17428C067261r8238l5698K45419k89766O7702l40488J1644p6190m87787K28791
17418B292650q7644l5715k566j31580P1724K9720L53620r2236k26696J25120l6452
17407B259945k00239j52876L49826L01643J87986J49383K9618K0546K33441Q1582
17397C260855o6252K27659K31070L49473J89847M98077M52895P52495K12223M96150
17387F604492J36267L02421K12242J97569n2725j17277j66587j63427o36755j54199
$$ plain form
17377 6162021 6043970 5895208 5998174 5993413 6309924 6706075 6969489 7253020 7315551 8212697
17367 8212697 8266438 8727837 8755134 8742171 8679076 8576192 8651434 8457447 8283059 8349826
17357 8349826 8495297 8346437 8605702 8698408 8989075 9378002 10317705 10617218 11481916 12003470
17347 12003470 12802242 13337799 13901215 14485461 14462382 14752055 14584681 14492351 14257733 14118078
17337 14118078 13301259 13340923 12860687 12707848 12621690 12564510 12921786 13026784 13511003 13956627
17327 13956627 14524160 14764928 15168776 15728149 15848669 16243581 16264656 16227735 16250011 16160692
17317 16160692 16174198 15902809 15621652 15587028 15205819 15371928 15219233 15220095 15256270 15448353
17307 15448353 15896188 15632286 16241396 16731812 16640940 16826677 16867717 16752693 16791709 16465120
$$ packed form
17377F162021j18051j48762J02966m761L16511L96151K63414K83531O2531Q97146
17367H212697N3741M61399K7297j2963o3095j02884P5242j93987j74388O6767
17357H349826J45471j48860K59265R2706K90667L88927R39703K99513Q64698N21554
17347A2003470P98772N35557N63416N84246k3079K89673j67374r2330k34618j39655
17337A4118078q16819L9664m80236j52839q6158n7180L57276J04998M84219M45624
17327A3956627N67533K40768M03848N59373J20520L94912K1075l6921K2276q9319
17317A6160692J3506k71389k81157l4624l81209J66109j52695Q62L6175J92083
17307A5448353M47835k63902O09110M90416r0872J85737M1040j15024L9016l26589
$$ plain form
17297 16465120 16194706 16028005 15386793 15451247 15289473 15200450 15393662 15513748 15806703 15797331
17287 15797331 15890772 16132130 16002739 15799602 15393448 14723586 14503327 13752806 12819341
17278 12819341 12097598 11041895 10220035 9235349 8870733 8071266 7445560 7030272 6935792
17269 6935792 6674415 6477902 6360932 6072598 5953931 6152726 5836233 5841188 5822866 5360198
17259 5360198 5444088 5356420 5351062 5254630 4996581 4844684 4895591 4679782 4529496 4530766 4538005
17248 4538005 4295375 4280241 4305997 4459559 4060989 4179575 3984296 4266146 4377258 3991433
17238 3991433 3888668 3820601 3540692 3500329 3591644 3538055 3242699 3225742 3143291 3117913 3029475
17227 3029475 3090698 3076340 2933676 3116493 3275357 3175327 3095310 3335589 3220321 3179377
$$ packed form
17297A6465120k70414j66701o41212O4454j61774q9023J93212J20086K92955r372
17287A5797331R3441K41358j29391k03137m06154o69862k20259p50521r33465
17278A2819341p21743j055703q21860r84686l64616p99467o25706m15288r4480
17269F935792k61377j96513j16970k88334j18667J98795l16493M955j8322m62668
17259E360198Q3890q7668n358r6432k58049j51897N0907k15809j50286J270P239
17248D538005k42630j5134K5756J53562l98570J18586j95279K81850J11112l85825
17238C991433j02765o8067k79909m0363R1315n3589k95356j6957q2451k5378q8438
17227C029475O1223j4358j42664J82817J58864j00030q0017K40279j15268m0944
$$ plain form
17217 3179377 3225410 3151371 3114880 3439488 3243897 3203004 3158612 3033363 2997248 3247666
17207 3247666 2820945 2890104 3050844 2952825 2926672 2853995 2909930 2968387 2642801 2529223
17197 2529223 2610294 2432090 2377972 2338631 2145777 2110688 2166217 2287831 1924991 1968560
17187 1968560 1948428 2009648 1939268 1977503 2101795 2053886 2221849 2029979 2187211 2026798
17177 2026798 1838566 2260261 2422247 2226964 2498661 2263660 2249512 2398029 2667896 2557475
17167 2557475 2536228 2506472 2537768 2453247 2564297 2539755 2409767 2527824 2587754 2811780
17157 2811780 2743764 2967901 2856325 2737512 2853687 2787506 2727732 2870994 3028938 2755556
17147 2755556 2792621 2713772 2824493 2531575 2554447 2796128 2626071 2992569 2845433 2780648
$$ packed form
17217C179377M6033p4039l6491L24608j95591m0893m4392j25249l6115K50418
17207C247666m26721O9159J60740r8019k6153p2677N5935N8457l25586j13578
17197B529223Q1071j78204n4118l9341j92854l5089N5529J21614l62840M3569
17187A968560k0132O1220p0380L8235J24292m7909J67963j91870J57232j60413
17177B026798j88232M21695J61986j95283K71697k35001j4148J48517K69867j10421
17167B557475k1247k9756L1296q4521J11050k4542j29988J18057N9930K24026
17157B811780o8016K24137j11576j18813J16175o6181n9774J43262J57944k73382
17147B755556L7065p8849J10721k92918K2872K41681j70057L66498j47136o4785
$$ plain form
17137 2780648 2994647 2842105 2857094 2985304 2849078 2476883 2619671 2542205 2405459 2594662
17127 2594662 2605810 2379907 2352766 2493480 2557667 2568440 2631063 2351991 2455569 2778869
17117 2778869 2505638 2672845 2577089 2486147 2413359 2460481 2534598 2514553 2662264 2670831 2576506
17106 2576506 2620294 2752328 2677163 2550397 2655113 2507451 2459956 2304119 2140453 1917020
17096 1917020 2035202 1755677 1964878 1619541 1697089 1673275 1277004 1471749 1378207 1098396
17086 1098396 1446033 1071377 1109798 1186147 1140232 1185333 1149884 1020289 926909 1310404
17076 1310404 1322290 1116599 919572 1258729 1160202 1182368 1369783 974090 1197931 1041060
17066 1041060 1057973 1105861 1218811 1441532 1156303 1245148 977649 1213964 1496647 1463124
$$ packed form
17137B780648K13999j52542J4989J28210j36226l72195J42788p7466j36746J89203
17127B594662J1148k25903k7141J40714O4187J0773O2623k79072J03578L23300
17117B778869k73231J67207r5756r0942p2788M7122P4117k0045J47711Q567r4325
17106B576506M3788J32034p5165j26766J04716j47662m7495j55837j63666k23433
17096A917020J18182k79525K09201l45337P7548k3814l96271J94745r3542k79811
17086A098396L47637l74656L8421P6349m5915M5101l5449j29595r3380L83495
17076A310404J1886k05691j97027L39157r8527K2166J87415l95693K23841j56871
17066A041060J6913M7888J12950K22721k85229Q8845k67499K36315K82683l3523
$$ plain form
17056 1463124 1668941 1903961 2234690 2186945 2572056 2264410 2621839 2860252 2761563 2582933
17046 2582933 2762455 2775687 2719197 2993793 3025760 3105570 3049140 3382708 3165193 3337609
17036 3337609 3359515 3077199 3143433 2699074 2706549 2617560 2282611 2054143 1856691 1783732
17026 1783732 1766273 1554104 1635797 1495129 1432179 1364732 1433939 1326030 1318109 1086552 1045197
17015 1045197 1307822 1151018 1132947 1238549 1425312 1016451 1054005 1191684 1153892 1065333
17005 1065333 1146160 953583 908940 1203709 1028734 1013406 969991 1169647 1254494 1208974
16995 1208974 1059966 1037565 1162156 1173380 1016418 1122691 1208863 1237350 1185499 1185045 1239607
16984 1239607 1125393 1176618 1429028 1435406 1220951 1272205 1125814 1595553 1094302 1304868
$$ packed form
17056A463124K05817K35020L30729m7745L85111l07646L57429K38413r8689j78630
17046B582933J79522J3232n6490K74596L1967P9810n6430L33568k17515J72416
17036C337609K1906k82316O6234m44359P475q8989l34949k28468j97452p2959
17026A783732j7459k12169Q1693j40668o2950o7447O9207j07909p921k31557m1355
17015A045197K62625j56804j8071J05602J86763m08861L7554J37679l7792q8559
17005A065333Q0827j92577m4643K94769j74975j5328m3415J99656Q4847m5520
16995A208974j49008k2401J24591J1224j56962J06273Q6172K8487n1851m54N4562
16984A239607j14214N1225K52410O378k14455N1254j46391M69739n01251K10566
$$ plain form
16974 1304868 1338715 1505446 1320612 1554284 1476470 1560224 1777042 1722952 1944551 1892072
16964 1892072 1895299 2117478 2168443 2038267 2404144 2158942 2235134 2534202 2558601 2581810
16954 2581810 2443040 2379123 2427981 2506752 2402216 2363150 2038182 2124957 1891978 2013135
16944 2013135 1962788 1792686 1628600 1689728 1670179 1404230 1152912 1204263 1294373 1091086
16934 1091086 1374001 1047258 1407963 700492 1357494 1170022 1062587 1319766 1095006
16925 1095006 897524 990294 1029460 1035809 818738 1008712 920361 875557 1013801 950330 743113
16914 743113 1034045 898599 1054997 899211 651009 947441 884257 856084 770234 786861
16904 786861 902807 856818 948822 862984 741177 828450 642325 1112872 837337 990841
$$ packed form
16974A304868L3847J66731j84834K33672p7814Q3754K16818n4090K21599n2479
16964A892072L227K22179N0965j30176L65877k45202P6192K99068K4399K3209
16954B581810j38770o3917M8858P8771j04536l9066l24968Q6775k32979J21157
16944B013135n0347j70102j64086O1128j9549k65949k51318N1351R0110k03287
16934A091086K82915l26743L60705G00492O57002j87472j07435K57179k24760
16925A095006j97482R2770L9166O349k17071J89974q8351m4804J38244o3471k07217
16914G43113K90932j35446J56398j55786k48202K96432o3184k8173q5850J6627
16904G86861J15946m5989R2004q5838j21807Q7273j86125M70547k75535J53504
$$ plain form
16894 990841 885642 754599 806470 779853 945881 424981 772381 872693 834965 806361
16884 806361 607596 647767 563841 531838 656916 775150 650143 841819 748489 831718
16874 831718 928106 937217 752788 780591 1052788 786793 813305 559550 1033229 684707
16864 684707 601558 637989 618581 660883 859560 659880 785547 706034 731924 863578 884833
16853 884833 625419 950591 927214 788663 851685 831846 719830 599560 802495 607147
16843 607147 879323 607710 857061 962502 530724 830970 854339 635064 1184162 746931
16833 746931 817002 941143 1017987 1085457 1129338 1058371 1075335 1052390 1114562 974788 1237333
16822 1237333 1214954 1320639 1317871 1437987 1406833 1679668 1586151 1734550 1777125 1772354 1927037
$$ packed form
16894I90841j05199j31043N1871k6617J66028D24981L47400J00312l7728k8604
16884H06361j98765M0171q3926l2003J25078J18234j25007J91676r3330Q3229
16874H31718R6388R111j84429K7803K72197k65995K6512k53755M73679l48522
16864F84707q3149L6431j9408M2302J98677j99680J25667p9513K5890J31654K1255
16853H84833k59414L25172k3377j38551O3022j9839j12016j20270K02935j95348
16843F07147K72176k71613K49351J05441m31778L00246K3369k19275N49098m37231
16833G46931P0071J24141P6844O7470M3881p0967J6964k2945O2172j39774K62545
16822A237333k2379J05685k768J20116l1154K72835r3517J48399M2575m771J54683
$$ plain form
16811 1927037 1592434 1353320 1401086 1553985 1626945 1627252 1405117 1452867 1750536 1657438 1630636
16800 1630636 1485025 1694537 1674089 1522689 1220725 1355690 1258500 1151064 1302620 986857
16790 986857 1120477 1083288 1041366 896606 573356 789248 939967 527855 660695 728558
16780 728558 524869 739622 927283 562019 698938 762902 840445 612114 817964 681384
16770 681384 810157 796354 728469 571612 655578 787214 441679 810829 556983 660780
16760 660780 943055 708807 837118 857305 655779 756924 645490 616199 781434 876890
16750 876890 630267 747416 637696 664605 647945 453538 520751 621066 810287 776986
16740 776986 659013 746296 649847 681041 664518 737061 662509 855858 634177 581771 830858
$$ packed form
16811A927037l34603k39114M7766J52899P2960L07k22135M7750K97669r3098k6802
16800A630636j45611K09512k0448j51400l01964J34965r7190j07436J51556l15763
16790I86857J33620l7189m1922j44760l23250K15892J50719m12112J32840O7863
16780G28558k03689K14753J87661l65264J36919O3964P7543k28331K05850j36580
16770F81384J28773j3803o7885j56857Q3966J31636l45535L69150k53846J03797
16760F60780K82275k34248J28311K0187k01526J01145j11434k9291J65235R5456
16750H76890k46623J17149j09720K6909j6660j94407O7213J00315J89221l3301
16740G76986j17973Q7283r6449L1194j6523P2543p4552J93349k21681n2406K49087
$$ plain form
16729 830858 662365 706939 774647 718941 906975 922609 715876 802872 760324 957420 998106
16718 998106 978413 934091 1082608 1058255 910290 890644 842908 1132211 895385 1089995
16708 1089995 874690 1364456 1285949 1238898 1532808 1388192 1480634 1670373 1587818 1604887
16698 1604887 1356040 1576984 1320393 1456888 1397166 1380229 1522231 1474510 1400236 1546817
16688 1546817 1535343 1584040 1733472 1505614 1609045 1471982 1591780 1299175 1341232 949500
16678 949500 1033020 1271364 1068094 1057608 1139437 1077646 1387958 1290503 1298549 1359771 1510080
16667 1510080 1618730 1695176 1535126 1564044 1795819 2009666 1652612 1514861 1540192 1564062
16657 1564062 1506064 1729249 1737610 1690372 1496338 1650002 1603369 1598400 1446180 1341912 1214964
$$ packed form
16729H30858j68493M4574O7708n5706J88034J5634k06733Q6996m2548J97096M0686
16718I98106j9693m4322J48517k4353j47965j9646m7736K89303k36826J94610
16708A089995k15305M89766p8507m7051K93910j44616R2442J89739q2555J7069
16698A604887k48847K20944k56591J36495n9722j6937J42002m7721p4274J46581
16688A546817j1474M8697J49432k27858J03431j37063J19798k92605M2057l91732
16678I49500Q3520K38344k03270j0486Q1829o1791L10312r7455Q046O1222J50309
16667A510080J08650P6446j60050K8918K31775K13847l57054j37751K5331K3870
16657A564062n7998K23185Q361m7238j94034J53664m6633m969j52220j04268j26948
$$ plain form
16646 1214964 937132 975721 834211 646333 667381 776206 484922 557510 723412 678507
16636 678507 599235 712939 773726 548401 656703 756383 562402 769181 808507 781004
16626 781004 500560 910145 682218 636003 755288 695339 782247 992090 670076 714985
16616 714985 966919 977442 737575 744547 635275 507833 866643 941171 945233 930965 689094
16605 689094 674721 882347 904845 779593 949300 882571 938880 715517 986710 833044
16595 833044 1055584 1028054 848138 1014064 992551 830517 864865 774578 902456 930152
16585 930152 804661 867699 806575 712224 736685 585053 650028 713241 397228 710053 628276
16574 628276 679652 615391 548858 737915 844996 525934 505577 721385 574439 538809
$$ packed form
16646A214964k77832L8589j41510j87878K1048J08825k91284P2588J65902m4905
16636F78507p9272J13704O0787k25325J08302R9680j93981K06779L9326k7503
16626G81004k80444M09585k27927m6215J19285n9949Q6908K09843l22014M4909
16616G14985K51934J0523k39867O972j09272j27442L58810P4528M062j4268k41871
16605F89094j4373K07626K2498j25252J69707o6729N6309k23363K71193j53666
16595H33044K22540k7530j79916J65926k1513j62034L4348r0287J27878K7696
16585I30152j25491O3038o1124r4351K4461j51632O4975O3213l16013L12825q1777
16574F28276N1376o4261o6533J89057J07081l19062k0357K15808j46946l5630
$$ plain form
16564 538809 652107 556931 496800 793180 712114 445475 755316 799449 659347 662827 755392
16553 755392 556744 684681 558812 584340 620524 595098 693719 574905 443739 607964
16543 607964 399242 534005 707209 542332 584603 573319 487701 779557 529691 512960
16533 512960 699003 537948 638552 697199 508006 504178 503124 394641 392266 465873 672239
16522 672239 325564 572941 749542 557833 539467 787147 681916 531257 735752 929187
16512 929187 767184 908536 644665 752685 919899 839055 659335 882399 625895 866772
16502 866772 958495 747425 889829 1059297 1101600 774460 947148 1130031 967680 1283536
16492 1283536 1251543 1279041 1156561 1301439 1271654 1208521 1093393 990500 1202608 1148456
$$ packed form
16564E38809J13298r5176o0131K96380q1066k66639L09841M4133j40102L480R2565
16553G55392j98648J27937j25869K5528L6184k5426R8621j18814j31166J64225
16543F07964k08722J34763J73204j64877M2271j1284q5618K91856k49866j6731
16533E12960J86043j61055J00604N8647j89193l828j054j08483k375P3607K06366
16522F72239C25564K47377J76601j91709j8366K47680j05231j50659K04495J93435
16512I29187j62003J41352k63871J08020J67214q0844j79720K23064k56504K40877
16502H66772R1723k11070J42404J69468M2303l27140J72688J82883j62351L15856
16492A283536l1993K7498j22480J44878k9785o3133j15128j02893K12108n4152
$$ plain form
16482 1148456 1140757 1137416 1150830 1307018 1191291 1212060 1117744 1335003 1324826 1374697 1287525
16471 1287525 1466589 1476972 1345670 1483719 1395337 1630484 1810407 1688873 1930873 1769475
16461 1769475 1951590 1937979 1994629 1794321 1969184 1892405 1591035 1625295 1660825 1909034
16451 1909034 1808445 1845760 1624007 1556942 1854979 1906184 2205237 2210430 2604975 2832701
16441 2832701 2837018 2987118 3190907 3486359 3721950 4186927 4541534 5179427 5843384 6392123
16431 6392123 7431807 8641975 9473666 10526313 11533514 12660343 14164245 15551130
16423 15551130 17266807 19010158 20987917 23026480 25217416 27585442 30294191 32798628
16415 32798628 35759603 38735812 41931903 45097895 48472030 52128849 55988575 59678182
$$ packed form
16482A148456p699l341J3414J56188j15727K0769r4316K17259j0177M9871q7172
16471A287525J79064J0383j31302J38049q8382K35147J79923j21534K42000j61398
16461A769475J82115j3611N6650k00308J74863p6779l01370L4260L5530K48209
16451A909034j00589L7315k21753o7065K98037N1205K99053N193L94545K27726
16441B832701M317J50100K03789K95452K35591M64977L54607O37893O63957N48739
16431F392123J039684J210168Q31691J052647J007201J126829J503902J386885
16423A5551130J715677J743351J977759K038563K190936K368026K708749K504437
16415C2798628K960975K976209L196091L165992L374135L656819L859726L689607
$$ plain form
16407 59678182 62817279 65247755 66491518 66940224 67171651 67247430 66360822 64535168 62191163
16398 62191163 59522694 56276050 52646349 49010467 45512782 43902917 45292170 50817534
16390 50817534 60730894 73863579 85835109 91718741 90951441 86095840 77939898 68246273
16382 68246273 57232788 45860944 35365833 25711946 19722126 18655887 20453366 22787662
16374 22787662 24494707 25183185 24849309 23719263 22134349 20926873 19323254 17743883
16366 17743883 16159875 14434435 13009383 11200410 9842874 8480571 7051122 5915763
16358 5915763 5146053 4134437 3776254 3291221 2498716 2646554 1955435 1702724 1527428
16349 1527428 1332473 1110043 1362070 769743 968303 843353 982932 1193529 1177910 1079123
$$ packed form
16407E9678182L139097K430476J243763M48706K31427P5779q86608j825654k344005
16398F2191163k668469l246644l629701l635882l497685j609865J389253N525364
16390E0817534R913360J3132685J1971530N883632p67300m855601q155942r693625
16382F8246273j1013485j1371844j0495111r653887n989820j066239J797479K334296
16374B2787662J707045O88478l33876j130046j584914j207476j603619j579371
16366A7743883j584008j725440j425052j808973j357536j362303j429449j135359
16358E915763p69710j011616l58183m85033p92505J47838o91119k52711j75296
16349A527428j94955k22430K52027n92327J98560j24950J39579K10597j5619r8787
$$ plain form
16339 1079123 1184792 1472716 1445784 1364385 1589511 1522813 1385303 1379069 1209663 1203367 924211
16328 924211 1114026 1243314 1279337 1353238 1275371 1287157 1383675 1603607 1493958 1455220 1386054
16317 1386054 1424513 1298649 1062702 966446 774716 981782 1035023 1004489 728769 821856
16307 821856 1055678 858968 979228 1149570 1236395 1260219 1249754 1282230 1417585 1389355
16297 1389355 1299855 1254662 1336762 1255697 1525617 1289091 1568869 1469450 1504001 1162144
16287 1162144 1236522 1249822 1113607 1163024 953823 843780 924283 389336 526705 851793
16277 851793 598541 802302 756881 545440 880899 832852 829724 710502 959182 981788
16267 981788 1088073 860698 1036629 1044050 1141409 987951 879386 965607 716098 957239
$$ packed form
16339A079123J05669K87924k6932q1399K25126o6698j37510o234j69406o296k79156
16328I24211J89815J29288L6023P3901p7867J1786R6518K19932j09649l8738o9166
16317A386054L8459j25864k35947r6256j91730K07066N3241l0534k75720R3087
16307H21856K33822j96710J20260J70342Q6825K3824j0465L2476J35355k8230
16297A389355q9500m5193Q2100q1065K69920k36526K79778r9419L4551l41857
16287A162144P4378J3300j36215M9417k09201j10043Q0503C89336J37369L25088
16277H51793k53252K03761m5421k11441L35459m8047l128j19222K48680K2606
16267I81788J06285k27375J75931P421R7359j53458j08565Q6221k49509K41141
$$ plain form
16257 957239 763815 815551 883299 950394 681773 1158596 899673 897974 855355 837641 902243
16246 902243 973654 806852 864941 664231 838696 888210 983514 1031712 837927 774035 852192
16235 852192 855149 873761 662368 917496 861288 915745 618301 711875 835131 583046 693374
16224 693374 881620 724877 766415 756540 767997 716569 560936 792165 670909 911680
16214 911680 383021 967022 713371 719900 717065 886274 716774 765110 770661 832512 935790
16203 935790 700370 791658 852793 882866 882135 859318 850598 940541 934433 778828 824808 719836
16191 719836 882685 718608 1087293 883867 888062 927087 753390 934384 783533 859709
16181 859709 862504 901774 1247920 1079572 916244 1177787 923657 968402 1050963 813657
$$ packed form
16257I57239j93424N1736O7748O7095k68621M76823k58923j699m2619j7714O4602
16246I02243P1411j66802N8089k00710J74465M9514R5304M8198j93785o3892P8157
16235H52192K957J8612k11393K55128n6208N4457k97444R3574J23256k52085J10328
16224F93374J88246j56743M1538r875J1457n1428j55633K31229j21256K40771
16214I11680C83021N84001k53651O529k835J69209j69500M8336N551O1851J03278
16203I35790k35420R1288O1135L0073p31k2817q720Q9943o108j55605M5980j04972
16191G19836J62849j64077L68685k03426M195L9025j73697J80994j50851P6176
16181H59709K795L9270L46146j68348j63328K61543k54130M4745Q2561k37306
$$ plain form
16171 813657 675552 969037 1026426 940807 1035698 904563 820541 800094 978903 876921
16161 876921 1176670 761785 849312 776942 830303 901582 782555 785159 922789 665513 806556
16150 806556 696210 1059582 872577 572226 798316 795976 797310 769390 982917 978900 948255
16139 948255 907742 887069 911870 1023281 863685 593033 853325 855512 754220 811746 800555
16128 800555 804570 889078 881242 952234 927272 1008243 933024 755466 898354 888337 920297
16117 920297 1101659 894719 852212 675953 804145 911725 907966 867043 844508 1116808
16107 1116808 726276 845406 1113498 1209645 994805 1182978 806433 1058462 1019275 955125
16097 955125 1089458 1148550 1096792 1043991 984065 1206511 1382866 1160861 1193869 921269
$$ packed form
16171H13657j38105K93485N7389q5619R4891j31135q4022k0447J78809j01982
16161H76921K99749m14885Q7527p2370N3361P1279j19027K604J37630k57276J41043
16150H06556j10346L63372j87005l00351K26090k340J334k7920K13527m017l0645
16139I48255m0513k0673K4801J11411j59596k70652K60292K187j01292N7526j1191
16128H00555M015Q4508p836P0992k4962Q0971p5219j77558J42888j0017L1960
16117I20297J81362k06940m2507j76259J28192J07580l759m0923k2535K72300
16107A116808l90532J19130K68092R6147k14840J88173l76545K52029l9187o4150
16097I55125J34333N9092n1758n2801n9926K22446J76355k22005L3008k72600
$$ plain form
16087 921269 1163037 983024 1091692 1129393 1059434 1175814 1356760 1413528 1299561 1194508
16077 1194508 1286341 1368259 1187784 1257021 1482489 1234044 1261729 1358303 1461245 998775
16067 998775 1348448 1468190 1248961 1317189 1557644 1409654 1420039 1746026 1522633 1501290
16057 1501290 1470216 1365445 1587479 1458904 1674168 1606651 1874381 1884769 1812048 1762339
16047 1762339 1805579 1834612 1840245 1701061 1949226 1811130 1924379 1910163 1687900 1586518
16037 1586518 1601864 2104699 1647399 1862256 1632345 1876824 1792393 1868241 1758712 1665104
16027 1665104 1710086 1790419 1757660 1867009 1772560 1958558 2014952 1868656 1814801 1922727
16017 1922727 2008224 2018646 2279385 2081920 2225577 2100280 1944215 1833223 2095978 2230702
$$ packed form
16087I21269K41768j80013J08668L7701o9959J16380J80946N6768j13967j05053
16077A194508R1833Q1918j80475O9237K25468k48445K7685R6574J02942m62470
16067I98775L49673J19742k19229O8228K40455j47990J0385L25987k23393k1343
16057A501290l1074j04771K22034j28575K15264o7517K67730J0388p2721m9709
16047A762339M3240K9033N633j39184K48165j38096J13249j4216k22263j01382
16037A586518J5346N02835m57300K14857k29911K44479q4431P5848j09529r3608
16027A665104M4982Q0333l2759J09349r4449J85998N6394j46296n3855J07926
16017A922727Q5497J0422K60739j97465J43657j25297j56065j10992K62755J34724
$$ plain form
16007 2230702 2028860 1797964 2097852 1926450 2095952 2001893 2199501 1928884 2149792 2013793
15997 2013793 2057871 1814013 1844488 2026118 1808398 2156369 1924247 2288709 2031105 1975307
15987 1975307 2283478 2191202 1861689 2139511 2231714 2369419 2210969 2273888 2194896 2252961
15977 2252961 2281520 2399524 2379704 2451569 2098758 2395838 2510926 2335742 2103372 2013301
15967 2013301 2160749 2342224 2195346 2048785 2307193 1958183 2156151 2383465 2047877
15958 2047877 2112856 2155931 2373314 2239519 2042515 2246812 2235364 2286155 2219725 2268856
15948 2268856 2226921 2038088 2327333 2108980 2248903 2257637 2432958 2404251 2281399 2406390
15938 2406390 2271150 2369098 2648826 2525694 2534735 2551945 2505336 2619278 2587121 2812944
$$ packed form
16007B230702k01842k30896K99888j71402J69502r4059J97608k70617K20908j35999
15997B013793M4078k43858L0475J81630k17720L47971k32122L64462k57604n5798
15987A975307L08171r2276l29513K77822R2203J37705j58450O2919p8992N8065
15977B252961K8559J18004j9820P1865l52811K97080J15088j75184k32370r0071
15967B013301J47448J81475j46878j46561K58408l49010J97968K27314l35588
15958B047877O4979M3075K17383j33795j97004K04297j1448N0791o6430M9131
15948B268856m1935j88833K89245k18353J39923Q734J75321k8707j22852J24991
15938B406390j35240R7948K79728j23132R041J7210m6609J13942l2157K25823
$$ plain form
15928 2812944 2765362 3038658 2791218 3174058 3193480 3098965 3258840 3663225 3662299 4082976
15918 4082976 4200747 4504014 5192956 5611152 6280438 7245149 8469256 10678793 13437269
15909 13437269 17504013 23258628 30413410 38873528 47341180 54950282 61533643 65621625
15901 65621625 67625645 66597000 63013311 56334828 47355471 37616515 28594743 21526545
15893 21526545 15817007 12353248 9551759 8162704 6673098 5773003 4876437 4281717
15885 4281717 4136385 3549557 3488451 3148580 2972623 3077880 2873465 2584013 2611004 2346585
15875 2346585 2705329 2340730 2758620 2704778 2586184 2419927 2594509 2681720 2276528 2363364
15865 2363364 2584499 2300662 2485060 2255323 2126575 2262904 2225736 2287593 1947305 2186388
$$ packed form
15928B812944m7582K73296k47440L82840J9422r4515J59875M04385r26M20677
15918D082976J17771L03267O88942M18196O69286R64711J224107K209537K758476
15909A3437269M066744N754615P154782Q460118Q467652P609102O583361M087982
15901F5621625K004020j028645l583689o678483q979357r738956r021772p068198
15893B1526545n709538l463759k801489j389055j489606r00095q96566n94720
15885D281717j45332n86828o1106l39871j75957J05257k04415k89452K6991k64419
15875B346585L58744l64599M17890n3842j18594j66257J74582Q7211m05192Q6836
15865B363364K21135k83837J84398k29737j28748J36329l7168O1857l40288K39083
$$ plain form
15855 2186388 2208333 2187488 2295896 2269232 2169031 2245523 2235251 2207232 2034095 2154165
15845 2154165 1904877 2146848 2345023 2032154 2164307 2127609 2150656 2237321 2500382 2680514
15835 2680514 2528305 2562810 2650264 2573435 2717992 2513777 2544316 2336854 2470226 2219233
15825 2219233 2192291 2061495 2223226 2127504 1906132 2210592 2192385 2121840 2215512 2065986
15815 2065986 2360406 2104779 2256708 2433097 2309273 2399632 2523355 2414989 2576636 2438712
15805 2438712 2329565 2281270 2401164 2240307 2481408 2582597 2511556 2652463 2627112 3029826
15795 3029826 2911824 2972177 3105113 3230435 3212414 3410101 3459666 3387844 3465918 3493498
15785 3493498 3524865 3641954 3711988 4000556 3868474 4118821 4679121 4318542 4642035 4719906
$$ packed form
15855B186388K1945k0845J08408k6664j00201P6492j0272k8019j73137J20070
15845B154165k49288K41971J98175l12869J32153l6698K3047Q6665K63061J80132
15835B680514j52209L4505Q7454p6829J44557k04215L0539k07462J33372k50993
15825B219233k6942j30796J61731r5722k21372L04460j8207p0545R3672j49526
15815B065986K94420k55627J51929J76389j23824R0359J23723j08366J61647j37924
15805B438712j09147m8295J19894j60857K41101J01189p1041J40907k5351M02714
15795C029826j18002O0353J32936J25322j8021J97687M9565p1822P8074K7580
15785C493498L1367J17089P0034K88568j32082K50347N60300l60579L23493P7871
$$ plain form
15775 4719906 4684643 4650198 4574853 4601013 4739019 4687476 4757388 4635456 4843191 4624284
15765 4624284 4780803 4817165 4769215 4890304 5163563 4989311 5032725 5167844 5276586 5052337
15755 5052337 4950368 4908602 5014051 5242749 5076820 5265699 5368862 5480632 5499904 5818805
15745 5818805 5952200 6330173 6224167 6726681 6824567 6958359 7209925 7165599 7488606 7583365
15735 7583365 7684408 7614877 7469139 7406181 7808584 7679800 7846345 8104087 8078607 7885761
15725 7885761 7899183 7785288 7517617 7234561 6885034 6726808 6705584 6740956 6715833 6750149
15715 6750149 6934715 6713585 6816297 6703470 6860740 6754749 6491000 6634327 6740789
15706 6740789 6992355 7192515 7371490 7764908 8106861 8224907 8624180 8659307 8887231 8903108
$$ packed form
15775D719906l5263l4445p5345K6160J38006n1543O9912j21932K07735k18907
15765D624284J56519L6362m7950J21089K73259j74252M3414J35119J08742k24249
15755E052337j01969m1766J05449K28698j65929J88879J03163J11770J9272L18901
15745E818805J33395L77973j06006N02514R7886J33792K51566m4326L23007R4759
15735G583365J01043o9531j45738o2958M02403j28784J66545K57742k5480j92846
15725G885761J3422j13895k67671k83056l49527j58226k1224L5372k5123L4316
15715F750149J84566k21130J02712j12827J57270j05991k63749J43327J06462
15706F740789K51566K00160J78975L93418L41953J18046L99273L5127K27924J5877
$$ plain form
15696 8903108 9154527 8989480 9208260 9217627 9343746 8989460 9015706 9019517 8782996 8656452
15686 8656452 8340855 8467230 8391114 8379556 8252127 8297127 8421594 8160314 8356676 8003493
15676 8003493 7925390 7735965 7446299 7091708 7028818 6854304 6907221 6918755 6758285 6979098
15666 6979098 7030542 6964890 7141826 7101884 7456284 7479898 7907699 8495843 8816977 8896455
15656 8896455 9473580 9941129 10745227 11230166 11757980 12555941 13145744 13681795 14617484
15647 14617484 14775719 15499680 16352015 16336512 16912917 17739001 18652144 19360136 20094233
15638 20094233 21168803 22064387 22831678 23413186 23978734 23989071 23935910 23562993 23106748
15629 23106748 22733484 22546907 22361014 22422279 22634448 22673940 22813470 22517200 22172690 21642285
$$ packed form
15696H903108K51419j65047K18780R367J26119l54286K6246L811k36521j26544
15686H656452l15597J26375p6116j1558j27429M5000J24467k61280J96362l53183
15676H003493p8103j89425k89666l54591o2890j74514N2917J1534j60470K20813
15666F979098N1444o5652J76936l9942L54400K3614M27801N88144L21134P9478
15656H896455N77125M67549Q04098M84939N27814P97961N89803N36051R35689
15647A4617484J58235P23961Q52335j5503N76405Q26084R13143P07992P34097
15638B0094233J074570Q95584P67291N81508N65548J0337n3161l72917m56245
15629B3106748l73264j86577j85893O1265K12169L9492J39530k96270l44510n30405
$$ plain form
15619 21642285 20792879 19538435 18786899 17354988 16245945 15554541 14807818 14333028 13640461
15610 13640461 13558359 13140915 12932960 12333875 12023380 12076468 11627386 11300790 10740329 10636720
15600 10636720 10392103 10320309 10192294 10493800 10431182 10609256 10929491 11694701 13296060
15591 13296060 16311055 22867967 34615770 51181088 67477426 78759171 86236887
15584 86236887 91650161 94547533 95457318 91317440 77386373 55189444 34004857 21384812
15576 21384812 15527654 12398469 10667938 9658717 9071212 8608859 8843762 8736044 8864002
15567 8864002 8968310 9146665 9492659 9485781 9807032 9975385 9941505 10578168 11218240 12556326
15557 12556326 14642343 19402332 29888921 47327255 69620064 89253300 102852622
$$ packed form
15619B1642285q49406j254444p51536j431911j109043o91404p46723m74790o92567
15610A3640461q2102m17444k07955n99085l10495N3088m49082l26596n60461j03609
15600A0636720k44617p1794j28015L01506o2618J78074L20235P65210J601359
15591A3296060L014995O556912J1747803J6565318J6296338J1281745P477716
15584H6236887N413274K897372R09785m139878j3931067k2196929k1184587j2620045
15576B1384812n857158l129185j730531j009221n87505m62353K34903j07718J27958
15567H864002J04308J78355L45994o878L21251J68353l3880O36663O40072J338086
15557A2556326K086017M759989J0486589J7438334K2292809J9633236J3599322
$$ plain form
15550 102852622 111619675 117804005 121198936 120293747 111983551 90623888 60433875 34734607
15542 34734607 21370256 15114993 11633869 9157327 8237193 7324924 6993197 6513292
15534 6513292 6477338 6277209 6043234 5845973 5755477 5525640 5499673 5192042 5099732 4795961
15524 4795961 4853504 4578893 4322833 4209193 4240883 4081850 4104363 4129462 4238939 4227921
15514 4227921 4352704 4488828 4524348 4611860 4789492 4718742 4854555 4911493 4767528 4879033
15504 4879033 4817310 4748367 4354888 4577476 4438724 4301227 4395664 4205109 4217054 4342984
15494 4342984 4368761 4478333 4301097 4663699 4582506 4652065 4691464 4684180 5023551 5096967 5146561
15483 5146561 5665170 5921044 5947291 6241305 6114738 6474153 6292254 6528367 6339716 6320210
$$ packed form
15550A02852622Q767053O184330L394931r05189q310196k1359663l0190013k5699268
15542C4734607j3364351o255263l481124k476542r20134r12269l31727m79905
15534F513292l5954k00129k33975j97261r0496k29837k5967l07631r2310l03771
15524D795961N7543k74611k56060j13640L1690j59033K2513K5099J09477j1018
15514D227921J24783J36124L5520Q7512J77632p0750J35813N6938j43965J11505
15504D879033o1723o8943l93479K22588j38752j37497R4437j90555J1945J25930
15494D342984K5777J09572j77236L62602q1193O9559L9399p284L39371P3416M9594
15483E146561N18609K55874K6247K94014j26567L59415j81899K36113j88651j9506
$$ plain form
15473 6320210 6349763 6637759 7148033 7766505 8767853 9208452 9914739 10791585 10920835
15464 10920835 11214067 11023198 10685712 10276408 9627122 9281941 8874754 9001370 9322511
15455 9322511 9910379 10297042 11100622 11664911 12058835 12248950 12130270 11945538 11510932
15446 11510932 10647870 9790735 9219467 9025441 8970139 8935523 9128327 9390540 9532114 9833213
15436 9833213 9956814 9576700 9589857 9356066 8818096 8332558 8225831 7668244 7571948 7195613
15426 7195613 7171238 6705720 6818686 6612618 6814856 6357900 6001940 5967289 5500108 5464273
15416 5464273 5202928 5333678 4852247 5248041 5048445 4808662 4978524 5055887 4901070 4845531
15406 4845531 5081620 4901066 5203293 5116550 5399230 5515682 5627095 5759946 5521469 5691837
$$ packed form
15473F320210K9553K87996N10274O18472J001348M40599P06287Q76846J29250
15464A0920835K93232j90869l37486m09304o49286l45181m07187J26616L21141
15455I322511N87868L86663Q03580N64289L93924J90115j18680j84732m34606
15446A1510932q63062q57135n71268j94026n5302l4616J92804K62213J41574L01099
15436I833213J23601l80114J3157k33791n37970m85538j06727n57587r6296l76335
15426G195613k4375m65518J12966k06068K02238m56956l55960l4651m67181l5835
15416E464273k61345J30750m81431L95794j99596k39783J69862P7363j54817n5539
15406D845531K36089j80554L02227q6743K82680J16452J11413J32851k38477J70368
$$ plain form
15396 5691837 5866140 5784386 5997773 5661887 5838276 5702097 5978685 5637451 5992695 5949995
15386 5949995 6118858 6361417 6418916 6437853 6627470 6721834 6703070 6771226 6526270 6646605
15376 6646605 6501845 6426744 6237049 6294407 6508882 6334568 6449704 6487737 6439641 6694321
15366 6694321 6627634 7050599 7016008 7302917 7187036 7641035 7577734 7900471 7710626 8045974
15356 8045974 8125946 8450753 8509789 8625512 9292887 9763767 10363278 11405424 14059086
15347 14059086 18121857 25854174 34777986 43388231 49695335 54409722 57508495 58918030
15339 58918030 59585086 56470205 48224805 36943766 26800155 21042681 17867168 16393289
15331 16393289 15525866 15177814 14717350 14606623 14195549 13362442 12990453 13016772 12742282
$$ packed form
15396E691837J74303q1754K13387l35886J76389j36179K76588l41234L55244m2700
15386E949995J68863K42559N7499J8937J89617R4364j8764O8156k44956J20335
15376F646605j44760p5101j89695N7358K14475j74314J15136L8033m8096K54680
15366F694321o6687M22965l4591K86909j15881M53999o3301L22737j89845L35348
15356H045974P9972L24807N9036J15723O67375M70880N99511J042146K653662
15347A4059086M062771P732317Q923812Q610245O307104M714387L098773J409535
15339E8918030O67056l114881q245400j1281039j0143611n757474l175513j473879
15331A6393289q67423l48052m60464j10727m11074q33107l71989K6319k74490
$$ plain form
15322 12742282 13167423 13276403 13469718 13953288 14615298 15647833 17625209 20683743 27241006
15313 27241006 37990878 52666611 68651087 83281073 94233109 101594772 106047662
15306 106047662 107181155 103328907 92591203 74713366 54595700 37186703 26080926
15299 26080926 19902294 16675664 14870895 13813525 13215362 12746620 12788262 12930933 12697027
15290 12697027 12391155 12774331 12607757 12288056 12110107 12094641 11953457 12332496 13054118
15281 13054118 14209955 16948636 21939087 29423496 37956005 45862360 51327206 54916756
15273 54916756 57304315 58145296 57179498 52797496 43820814 32722762 23306351 17781534
15265 17781534 14761872 13561772 12360326 11350160 10767072 9852696 9257242 8790772 8919571
$$ packed form
15322A2742282M25141J08980J93315M83570O62010J032535J977376L058534O557263
15313B7241006J0749872J4675733J5984476J4629986J0952036P361663M452890
15306A06047662J133493l852248j0737704j7877837k0117666j7408997j1105777
15299B6080926o178632l226630j804769j057370n98163m68742M1642J42671k33906
15290A2697027l05872L83176j66574l19701j77949j5466j41184L79039P21622
15281A3054118J155837K738681M990451P484409Q532509P906355N464846L589550
15273E4916756K387559Q40981r65798m382002q976682j1098052r416411n524817
15265A7781534l019662j200100j201446j010166n83088r14376n95454m66470J28799
$$ plain form
15256 8919571 8930733 8934351 8988316 9393424 9562575 9812940 10048678 10489113 10323613 9986522
15246 9986522 9814480 9854483 9418542 9383224 9159003 8728646 8510782 8071323 8199649 8080296
15236 8080296 8222878 8891431 9319362 9844857 10330919 10709922 10884593 11072172 11192575
15227 11192575 10852438 10829085 10380071 9890968 9183015 9038087 8613036 8670928 8654228 8931112
15217 8931112 9117071 9315176 9800364 10229310 10450903 10991709 10867330 10939849 10900510 10195327
15207 10195327 9662367 9273960 8732076 7793001 7373586 7147484 6882397 6914752 6680291
15198 6680291 6374911 6228540 6271549 6154936 6062284 6097548 6390316 6356631 6498229 6821405
15188 6821405 6838561 7076971 7102128 7020987 7169730 6955233 7180158 7206079 7179859 7556897
$$ packed form
15256H919571J1162L618N3965M05108J69151K50365K35738M40435j65500l37091
15246I986522j72042M0003m35941l5318k24221m30357k17864m39459J28326j19353
15236H080296J42582O68553M27931N25495M86062L79003J74671J87579J20403
15227A1192575l40137k3353m49014m89103p07953j44928m25051N7892j6700K76884
15217H931112J85959J98105M85188M28946K21593N40806j24379P2519l9339p05183
15207A0195327n32960l88407n41884r39075m19415k26102k65087L2355k34461
15198F680291l05380j46371M3009j16613r2652L5264K92768l3685J41598L23176
15188F821405J7156K38410K5157q1141J48743k14497K24925K5921k6220L77038
$$ plain form
15178 7556897 7570678 7684097 7841966 7759613 7991948 8149954 8014632 8077668 7868150 7862953
15168 7862953 7884173 7742762 7732969 7749099 7809924 7801703 7765704 7898363 8140619 8353289 8532813
15157 8532813 8715466 8887268 8759982 8956168 8911777 8878800 8872299 8755205 8759621 8438006
15147 8438006 8500988 8836438 8497210 8522894 8571846 8629550 8557727 8333401 8542459 8599178
15137 8599178 8593220 8565839 8715966 8395787 8460667 8211235 8578835 8356121 8396774 8359118
15127 8359118 8386343 8353693 8368885 8265800 8505707 8356091 8388150 8253005 8335844 8378910
15117 8378910 8136699 7934833 7966515 8036884 7724574 8057844 7904735 8178395 7876357 8014200
15107 8014200 7872451 8220076 8573642 8416751 8889957 8933647 9356093 9516799 9679786 10088298
$$ packed form
15178G556897J3781J13419J57869q2353K32335J58006j35322O3036k09518n197
15168G862953K1220j41411r793J6130O0825q221l5999J32659K42256K12670J79524
15157H532813J82653J71802j27286J96186m4391l2977o501j17094M416l21615
15147H438006O2982L35450l39228K5684M8952N7704p1823k24326K09058N6719
15137H599178n958k7381J50127l20179O4880k49432L67600k22714M0653l7656
15127H359118K7225l2650J5192j03085K39907j49616L2059j35145Q2839M3066
15117H378910k42211k01866L1682P0369l12310L33270j53109K73660l02038J37843
15107H014200j41749L47625L53566j56891M73206M3690M22446J60706J62987M08512
$$ plain form
15097 10088298 10272388 10624887 10869416 11072693 11731453 12258689 13937597 16045298 19246394
15088 19246394 22917057 26129199 28444334 30335536 31559064 32239979 32367226 30819191
15080 30819191 28200405 24674764 22638204 21534470 22173385 24270608 27740127 31028352
15072 31028352 33676974 35701413 37150123 37944939 38196892 37316338 35502865 33512573
15064 33512573 32720805 35644825 40424776 44966690 48590179 51992697 54826357 57766383
15056 57766383 60140960 60551955 57468680 52674081 49840997 50282559 52343865 55859357
15048 55859357 59555639 62524077 63857849 64890920 66574142 68328713 70495909 71074993
15040 71074993 68713921 65280486 61285343 58724355 57231339 56143896 54728053 52854391
$$ packed form
15097A0088298J84090L52499K44529K03277O58760N27236J678908K107701L201096
15088A9246394L670663L212142K315135J891202J223528O80915J27247j548035
15080C0819191k618786l525641k036560j103734O38915K097223L469519L288225
15072C1028352K648622K024439J448710P94816K51953q80554j813473j990292
15064C3512573p91768K924020M779951M541914L623489L402518K833660K940026
15056E7766383K374577M10995l083275m794599k833084M41562K061306L515492
15048E5859357L696282K968438J333772J033071J683222J754571K167196N79084
15040G1074993k361072l433435l995143k560988j493016j087443j415843j873662
$$ plain form
15032 52854391 52112578 53088723 57101624 63555070 71081590 77638505 84038260 90095343
15024 90095343 95894339 100710951 103518756 103308153 100441911 97502411 96694368 97686917
15016 97686917 99204955 100300683 99610502 97956423 95342197 92140634 88707975 85093612
15008 85093612 80230202 73606616 66432510 60478976 55784390 53311093 51249288 49615616
15000 49615616 49260210 49682736 51597138 53646902 55858928 57181089 58517150 59348201
14992 59348201 59116756 57612874 55382796 52691412 50197866 49461989 50102504 51107695
14984 51107695 51299859 51750123 52966392 54644445 55219914 53822159 50301829 45604566
14976 45604566 40852868 37630810 34484304 31612335 28787335 27208142 26299518 26079729
$$ packed form
15032E2854391p41813R76145M012901O453446P526520O556915O399755O057083
15024I0095343N798996M816612K807805k10603k866242k939500q08043R92549
15016I7686917J518038J095728o90181j654079k614226l201563l432659l614363
15008H5093612m863410o623586p174106n953534m694586k473297k061805j633672
15000D9615616l55406M22526J914402K049764K212026J322161J336061Q31051
14992E9348201k31445j503882k230078k691384k493546p35877O40515J005191
14984E1107695J92164M50264J216269J678053N75469j397755l520330m697263
14976D5604566m751698l222058l146506k871969k825000j579193r08624k19789
$$ plain form
14968 26079729 26364262 26898799 27750323 28641058 29255047 29791512 30805022 32172846 33927422
14959 33927422 36209295 39695634 44591305 52225719 63553279 79445553 100972569 128084686
14951 128084686 160111249 195768641 235716885 277455572 318444095 358364996 393457850
14944 393457850 419211937 430037532 427315042 414140294 391930194 364756816 335912710
14937 335912710 302853482 264646764 227809125 201150328 186404687 178357060 170589669
14930 170589669 159764766 145360908 130122684 116679957 105692090 97150501 91006568
14923 91006568 87916091 86561768 84706575 82889955 80616516 77789646 75037205 70360353
14915 70360353 62067157 50994793 38198044 28708697 22601475 18968193 16568594 15082334
$$ packed form
14968B6079729K84533N34537Q51524Q90735O13989N36465J013510J367824J754576
14959C3927422K281873L486339M895671P634414J1327560J5892274K1527016K7112117
14951A28084686L2026563L5657392L9948244M1738687M0988523L9920901L5092854
14944C93457850K5754087J0825595k722490j3174748k2210100k7173378k8844106
14937C35912710l3059228l8206718l6837639k6658797j4745641q047627p767391
14930A70589669j0824903j4403858j5238224j3442727j0987867q541589o143933
14923I1006568l090477j354323j855193j816620k273439k826870k752441m676852
14915G0360353q293196j1072364j2796749r489347o107222l633282k399599j486260
$$ plain form
14907 15082334 14302218 13867046 14109263 14539192 15324435 16121912 17303145 18950135 20396628
14898 20396628 22309053 24574138 28491693 33590629 40010107 45836597 50244964 52580915
14890 52580915 54020595 54609596 53948231 50519723 43716163 35050688 27068147 21522425
14882 21522425 18296398 16632005 15895777 15365485 15253376 15535776 16201992 17366750 18742095
14873 18742095 19634040 20259079 20712153 21101269 21292138 21962291 21962330 21288353 20351111 20023138
14863 20023138 20741906 21900981 24729199 29011989 35944348 45492878 56737077 69221143
14855 69221143 81835657 93776557 103582884 109420097 111043060 106926058 98180081 86603977
14847 86603977 73104680 59309562 45667503 34490737 26988968 22956325 20410920
$$ packed form
14907A5082334p80116m35172K42217M29929P85243P97477J181233J646990J446493
14898B0396628J912425K265085L917555N098936O419478N826490M408367K335951
14890E2580915J439680N89001o61365l428508o803560q665475p982541n545722
14882B1522425l226027j664393p36228n30292j12109K82400O66216J164758J375345
14873A8742095Q91945O25039M53074L89116J90869O70153L9o73977r37242l27973
14863B0023138P18768J159075K828218M282790O932359R548530J1244199J2484066
14855F9221143J2614514J1940900R806327N837213J622963m117002q745977j1576104
14847H6603977j3499297j3795118j3642059j1176766p501769m032643k545405
$$ plain form
14840 20410920 18506128 17407321 16842428 16328340 15755881 15625585 15588525 15511959 15277764
14831 15277764 15163091 15333746 15309022 15975490 16913678 17350764 18124042 19245905 20320524
14822 20320524 22532858 26017226 31549108 39983315 49672049 59024342 66747873 71644007
14814 71644007 74282360 75301971 73892626 68360150 58195210 44970033 32272981 23544416
14806 23544416 18246722 15454301 13742056 12813508 12239246 11702489 11308280 10884480 10687781
14797 10687781 10502684 10102017 10042758 9436863 9003445 8955174 8649426 8317841 8370869 7993946
14787 7993946 7857378 8183596 8020088 8113474 8487331 8584610 8666452 9514894 10373788 11362354
14777 11362354 12385239 12946499 13172156 13467473 13447665 13344410 12740632 11752781 10706588
$$ packed form
14840B0410920j904792j098807n64893n14088n72459j30296l7060p6566k34195
14831A5277764j14673J70655k4724O66468R38188M37086P73278J121863J074619
14822B0320524K212334L484368N531882Q434207R688734R352293P723531M896134
14814G1644007K638353J019611j409345n532476j0164940j3225177j2697052q728565
14806B3544416n297694k792421j712245r28548n74262n36757l94209m23800j96699
14797A0687781j85097m00667n9259o05895m33418m8271l05748l31585N3028l76923
14787G993946j36568L26218j63508R3386L73857R7279Q1842Q48442Q58894R88566
14777A1362354J022885N61260K25657K95317j9808j03255o03778r87851j046193
$$ plain form
14768 10706588 9518419 8856021 8747498 8691437 8225511 8608837 8752565 8922485 9155247
14759 9155247 9516584 9767928 9963493 10236302 10759491 10848229 10856895 10745413 10995022 11205383
14749 11205383 10851160 10861361 10904703 10936554 10980620 11558263 11671890 12468930 12921781 13505399
14739 13505399 14607710 15914646 17831303 19723215 22793844 27317387 33414646 42476232
14731 42476232 56810093 79409380 110964791 150382431 193315152 235229168 271900100
14724 271900100 299117843 315642002 320139686 309346273 281676817 240234675 191512232
14717 191512232 143020535 101092221 70664950 50821103 38743862 30932998 25960249
14710 25960249 22212394 19511059 17273947 16004268 14592525 13922922 12967717 12008959
$$ packed form
14768A0706588j188169o62398j08523n6061m65926L83326J43728J69920K32762
14759I155247L61337K51344J95565K72809N23189Q8738Q666j11482K49609K10361
14749A1205383l54223J0201M3342L1851M4066N77643J13627P97040M52851N83618
14739A3505399J102311J306936J916657J891912L070629M523543O097259R061586
14731D2476232J4333861K2599287L1555411L9417640M2932721M1914016L6670932
14724B71900100K7217743J6524159M497684j0793413k7669456m1442142m8722443
14717A91512232m8491697m1928314l0427271j9843847j2077241p810864m972749
14710B5960249l747855k701335k237112j269679j411743o69603r55205r58758
$$ plain form
14702 12008959 10756865 9757732 9161236 8552808 8233621 8176710 7727039 7345973 7240798
14693 7240798 7215572 7549850 7497449 7523741 7661266 7669249 7974229 7866303 7755163 7629015
14683 7629015 7830092 7907154 8155901 8174967 8430639 8637591 9142440 10081513 11226461 11910247
14673 11910247 12345174 12409558 12364763 12471855 12092095 11164672 9553761 8515020 7705295
14664 7705295 7505789 7622183 7541144 7764264 7701255 7686888 7770653 7477985 7232952 6268280
14654 6268280 5929879 5917857 5764585 5847572 5930075 6147694 6322577 6761343 6798487 6819687
14644 6819687 6912299 7213731 7443757 7399919 7713038 7628850 7793110 7932099 8559420 9134497
14634 9134497 9390759 9847738 10221569 10071399 9884411 9170657 8291893 7227981 6507293
$$ packed form
14702A2008959j252094r99133n96496o08428l19187n6911m49671l81066j05175
14693G240798k5226L34278n2401K6292J37525P983L04980j07926j11140j26148
14683G629015K01077P7062K48747J9066K55672K06952N04849R39073J144948O83786
14673A1910247M34927O4384m4795J07092l79760r27423j610911j038741q09725
14664G705295j99506J16394q1039K23120o3009j4367Q3765k92668k45033r64672
14654F268280l38401j2022j53272Q2987Q2503K17619J74883M38766L7144K1200
14644F819687R2612L01432K30026m3838L13119q4188J64260J38989O27321N75077
14634I134497K56262M56979L73831j50170j86988p13754q78764j063912p20688
$$ plain form
14625 6507293 5881447 5341646 4787621 4521445 4382358 4536565 4303870 4519260 4420006 4457770
14615 4457770 4399543 4339952 4230370 4128973 4359017 4053248 3864083 3758062 3772170 3550655
14605 3550655 3625601 3219250 3507742 3372436 3822869 4310711 4680519 5318064 6456470
14596 6456470 6803517 7371834 7727424 7720584 7636375 7200540 6542993 5815730 5015587 4229400
14586 4229400 3763509 3742628 3624573 3748354 4057150 3796857 4096610 4186315 3936536 4067173
14576 4067173 4111782 4231957 4319281 4435852 4420214 4715587 4855690 4914208 5414065 5850866
14566 5850866 6504035 7092600 7888448 8839494 10041669 12588939 16670870 23578034 33103846
14557 33103846 42386699 49914117 55109576 58607950 60973677 61617104 59423276 52262344
$$ packed form
14625F507293o25846n39801n54025k66176j39087J54207k32695K15390r9254L7764
14615D457770n8227n9591j09582j01397K30044l05769j89165j06021J4108k21515
14605C550655P4946m06351K88492j35306M50433M87842L69808O37545J138406
14596F456470L47047N68317L55590o840q4209m35835o57547p27263q00143p86187
14586D229400m65891k0881j18055J23781L08796k60293K99753Q9705k49779J30637
14576D067173M4609J20175Q7324J16571j5638K95373J40103N8518M99857M36801
14566E850866O53169N88565P95848R51046J202175K547270M081931O907164R525812
14557C3103846R282853P527418N195459L498374K365727O43427k193828p160932
$$ plain form
14549 52262344 40567231 29070716 21582644 19166480 20544831 25260333 33586343 43647460
14541 43647460 52830603 59390133 64078522 66461332 67423344 65723224 59772503 48659636
14533 48659636 35282587 24180007 18157294 15029942 13816563 13432965 13287339 13540307
14525 13540307 13608127 13910756 13983111 14221908 15489038 18076400 23691520 30529844 37363031
14516 37363031 42410975 45703635 47838881 49460617 49550791 46979605 40766027 32074999
14508 32074999 25165044 21674196 21429880 23364969 28296516 34693807 41536997 46612543
14500 46612543 49733918 51747893 52810615 52277992 49895709 44649684 36047676 26939919
14492 26939919 20451111 16729348 14617493 12795906 11400554 10354274 9646149 8586432
$$ packed form
14549E2262344j1695113j1496515p488072k416164J378351M715502Q326010J0061117
14541D3647460R183143O559530M688389K382810R62012j700120n950721j1112867
14533D8659636j3377049j1102580o022713l127352j213379l83598j45626K52968
14525A3540307O7820L02629P2355K38797J267130K587362N615120O838324O833187
14516C7363031N047944L292660K135246J621736R0174k571186o213578q691028
14508C2074999o909955l490848k44316J935089M931547O397291O843190N075546
14500D6612543L121375K013975J062722n32623k382283n246025q602008r107757
14492B6939919o488808l721763k111855j821587j395352j046280p08125j059717
$$ plain form
14484 8586432 7017583 5893429 5174154 4519252 4188606 4035242 3917536 4127256 3892345
14475 3892345 3956256 3966339 4076615 4236324 4687668 4987676 5518356 5811874 6372982 6262102
14465 6262102 6615186 6471314 6552929 6489709 5953282 6172673 6011327 6898018 7245218 7546449
14455 7546449 7651903 7925514 7981377 7899830 7451414 7018186 6148679 5734245 5958029 5821883
14445 5821883 6165929 6405672 6906585 7208869 7571920 7824485 7830278 8209205 8568369 8410448
14435 8410448 8608084 8951582 9760056 9903224 11021115 13020952 16184080 21179268 27947171
14426 27947171 35438571 42557271 48294282 52734355 55414617 56705350 55517250 51052267
14418 51052267 43928709 35040696 26914642 21239529 17026752 14200584 12416363 11043063
$$ packed form
14484H586432j568849j124154p19275o54902l30646j53364j17706K09720k34911
14475C892345O3911J0083J10276J59709M51344L00008N30680K93518N61108j10880
14465F262102L53084j43872Q1615o3220n36427K19391j61346Q86691L47200L01231
14455G546449J05454K73611N5863q1547m48416m33228q69507m14434K23784j36146
14445E821883L44046K39743N00913L02284L63051K52565N793L78927L59164j57921
14435H410448J97636L43498Q08474J43168J117891J999837L163128M995188O767903
14426B7947171P491400P118700N737011M440073K680262J290733j188100m464983
14418E1052267p123558q888013q126054n675113m212777k826168j784221j373300
$$ plain form
14410 11043063 9856519 9152123 8606268 8341670 8159396 8240256 8342429 8393761 8576940
14401 8576940 8511930 8726362 8638420 9320949 10085906 10819695 12487163 15658363 19861834
14392 19861834 26884399 36597046 48846648 61109150 72737101 81805491 88480244 92068913
14384 92068913 91980873 87460710 78058118 64839937 50122619 37410276 27628569 20774960
14376 20774960 16349687 13244815 11545152 10452326 9707123 9249180 8804533 8449584 8481505
14367 8481505 8458229 8301517 8222649 8200389 8047982 8036670 8559982 8888967 9583215 10697828
14357 10697828 12720778 15088543 18448248 22834912 28337454 33753002 39045992 43117742
14349 43117742 46184475 48068969 48585137 47880613 45932809 42957369 40547943 40111309
$$ packed form
14410A1043063j186544p04396n45855k64598j82274Q0860J02173N1332J83179
14401H576940o5010K14432q7942O82529P64957P33789J667468L171200M203471
14392A9861834P022565R712647J2249602J2262502J1627951R068390O674753L588669
14384I2068913q8040m520163r402592j3218181j4717318j2712343r781707o853609
14376B0774960m425273l104872j699663j092826p45203m57943m44647l54949L1921
14367H481505k3276j56712p8868k2260j52407j1312N23312L28985O94248J114613
14357A0697828K022950K367765L359705M386664N502542N415548N292990M071750
14349D3117742L066733J884494N16168p04524j947804k975440k409426m36634
$$ plain form
14341 40111309 42763104 48807949 57682538 67986602 78667059 88564565 96514011 101918045
14333 101918045 103029946 100844757 94184894 83713485 70532432 56959681 44412531
14326 44412531 33183032 25002886 19788900 16258762 13545411 11759702 9913245 8873708
14318 8873708 7914573 7106124 6603310 5750714 5346416 5087181 4692716 4619555 4503004 3955483
14308 3955483 4159155 3756794 3580538 3638485 3808264 3432737 3223902 3214961 3139160 2778929
14298 2778929 3049846 2819747 2827359 2988494 2710147 2917606 2706199 2558930 2406148 2156839
14288 2156839 2228109 2222861 2394208 2427821 2262999 2588006 2528573 2776304 2675042 2844674
14278 2844674 2487505 2788670 2579629 2523011 2489504 2584446 2567983 2511374 2927416 2855459
$$ packed form
14341D0111309K651795O044845Q874589J0304064J0680457R897506P949446N404034
14333A01918045J111901k185189o659863j0471409j3181053j3572751j2547150
14326D4412531j1229499q180146n213986l530138k713351j785709j846457j039537
14318H873708r59135q08449n02814q52596m04298k59235l94465p3161j16551n47521
14308C955483K03672m02361j76256N7947J69779l75527k08835q941p5801l60231
14298B778929K70917k30099P612J61135k78347K07459k11407j47269j52782k49309
14288B156839P1270n248J71347L3613j64822L25007n9433K47731j01262J69632
14278B844674l57169L01165k09041n6618l3507R4942j6463n6609M16042p1957
$$ plain form
14268 2855459 2810757 2654965 2569447 2581018 2453038 2298589 2358160 2279058 2247330 2399339
14258 2399339 2042984 2077489 2031916 1880607 2011157 1923201 2348186 2129214 1929984 2260281
14248 2260281 1694850 2087163 1924145 1859098 1939973 1798935 1746584 1897409 2020334 1837576
14238 1837576 1704882 2003775 1973685 2129591 2115731 2210726 2126025 1872532 1913145 2014626
14228 2014626 1791709 1876377 1684204 1620901 1908495 1758372 1932873 1835354 1872056 2022766
14218 2022766 2086293 2310413 2309882 2199613 2443276 2281133 2450203 2407549 2617871 2867101
14208 2867101 2890898 3513800 4216225 4369089 4365293 4577052 4549851 4783978 4543637 3946984
14198 3946984 2856988 1978124 1979216 1609916 1858776 1854694 1863253 1865724 1817370 2138612 1981991
$$ packed form
14268B855459m4702j55792q5518J1571j27980j54449N9571p9102l1728J52009
14258B399339l56355L4505m5573j51309J30550q7956M24985k18972j99230L30297
14248B260281n65431L92313j63018o5047Q0875j41038n2351J50825J22925j82758
14238A837576j32694K98893l0090J55906j3860R4995q4701k53493M0613J01481
14228B014626k22917Q4668j92173o3303K87594j50123J74501r7519L6702J50710
14218B022766O3527K24120n31j10269K43663j62143J69070m2654K10322K49230
14208B867101K3797O22902P02425J52864l796K11759k7201K34127k40341n96653
14198C946984j089996q78864J092l69300K48860m082Q559K471m8354L21242j56621
$$ plain form
14187 1981991 1946553 1917179 1923423 2122395 1960524 1936588 1788839 1849282 2213146 2429322
14177 2429322 2658011 2525904 2689974 2691999 2991101 2597137 2896131 2573411 2133126 1963968
14167 1963968 2089274 1657480 1706705 1792632 1873019 1849755 1930733 1797783 1957602 1995546
14157 1995546 1906328 1993916 2036848 2194714 2247895 1996839 2067614 2231388 2242574 2200213 2207195
14146 2207195 2131467 2309087 2543922 2493296 3110205 3459669 4210402 5126139 5949822 6882281
14136 6882281 7792103 8213737 8626847 8634626 8517209 7739594 6919778 5597703 4688181 4168301
14126 4168301 3508025 3313718 2738183 2679027 2789928 2789278 3054193 3456657 3304653 3907934
14116 3907934 3680856 3855290 4063799 3722962 3385358 3137124 2588896 2470782 2420279 2308490
$$ packed form
14187A981991l5438k9374O244J98972j61871k3936j47749O0443L63864K16176
14177B429322K28689j32107J64070K025K99102l93964K98994l22720m40285j69158
14167A963968J25306m31794M9225Q5927Q0387k3264Q0978j32950J59819L7944
14157A995546q9218Q7588M2932J57866N3181k51056P0775J63774J1186m2361O982
14146B207195p5728J77620K34835n0626O16909L49464P50733R15737Q23683R32459
14136F882281R09822M21634M13110P779j17417p77615q19816j322075r09522n19880
14126D168301o60276j94307n75535n9156J10901o50K64915M02464j52004O03281
14116C907934k27078J74434K08509l40837l37604k48234n48228j18114n0503j11789
$$ plain form
14106 2308490 2449751 2387480 2338095 2620865 2667860 2624976 2969032 2983827 3320243 3812786
14096 3812786 4073284 4501267 4923115 4961528 5026073 5193458 5044859 4661628 4630823 4147063
14086 4147063 3893943 4181353 4718175 5154299 5869609 6374673 6722555 6840935 7259486
14077 7259486 7675433 7788861 7812815 7550393 7845014 8407628 9271424 10160895 11970033
14068 11970033 14052360 16441616 20534752 25866443 32940637 42382061 53402121 65172862
14060 65172862 75887623 84928136 91296518 94526239 94991132 91679906 83650349 71851162
14052 71851162 58061833 44846282 34307218 26469623 21342683 17446802 15068581 13023778
14044 13023778 11494838 10629824 9728494 9053550 8594863 7845928 7148524 6508038 5944009
$$ packed form
14106B308490J41261o2271m9385K82770M6995m2884L44056J4795L36416M92543
14096C812786K60498M27983M21848L8413O4545J67385j48599l83231l0805m83760
14086D147063k53120K87410N36822M36124P15310N05064L47882J18380M18551
14077G259486M15947J13428K3954k62422K94621N62614Q63796Q89471J809138
14068A1970033K082327K389256M093136N331691P074194R441424J1020060J1770741
14060F5172862J0714761R040513O368382L229721M64893l311226q029557j1799187
14052G1851162j3789329j3215551j0539064p837595n126940l895881k378221k044803
14044A3023778j528940q65014r01330o74944m58687p48935o97404o40486n64029
$$ plain form
14035 5944009 5158241 4466722 4229763 3896277 3586463 3445748 3401008 3076779 3106333 2904298
14025 2904298 2810702 2790610 2572662 2678485 2547959 2370315 2299862 2331135 2438302 2274032
14015 2274032 2011104 2441593 2414638 2190020 2159370 2458996 2192811 2296442 2196633 2425723
14005 2425723 1971863 1892612 1967670 1935269 2007411 1871562 1772945 1790930 2069741 2206422
13995 2206422 2129223 2081581 2174397 2424173 2303381 2794524 2832464 3429611 3920711 5000787
13985 5000787 6150630 7769610 9104143 10050176 10718207 11469075 11344423 11360855 10879813
13976 10879813 9406791 7645248 6484731 5072279 4750839 4182229 3978880 3577900 3644445
13967 3644445 3417149 3481462 3213026 3331344 2977922 2890421 2556874 2441321 2353546 2049272
$$ packed form
14035E944009p85768o91519k36959l33486l09814j40715m4740l24229K9554k02035
14025B904298r3596k0092k17948J05823j30526j77644p0453L1273J07167j64270
14015B274032k62928M30489k6955k24618l0650K99626k66185J03631r9809K29090
14005B425723m53860p9251P5058l2401P2142j35849r8617J7985K78811J36681
13995B206422p7199m7642R2816K49776j20792M91143L7940N97147M91100J080076
13985E000787J149843J618980J334533R46033O68031P50868j24652J6432m81042
13976A0879813j473022j761543j160517j412452l21440n68610k03349m00980O6545
13967C644445k27296O4313k68436J18318l53422q7501l33547j15553q7775l04274
$$ plain form
13957 2049272 2021291 2065738 2039056 2093069 1791362 1685159 1705000 2070312 2195783 2394200
13947 2394200 2622988 2626156 2740577 2730648 3218029 3601738 4337322 5886581 7767926 9675124
13937 9675124 12247762 14678151 16454594 17947319 18940328 18909487 17797435 15505884 13004102
13928 13004102 10350984 7820336 5577724 3810365 3109129 2768891 2507885 2289285 1864239
13919 1864239 1918917 1843660 1448081 1771384 1529540 1696806 1597746 1371257 1606573 1593581
13909 1593581 1337852 1470763 1254452 1318863 1682842 1371131 1265051 1424871 1271542 1326620
13899 1326620 1473218 1473980 1442529 1436614 1396877 1136833 1507592 1345823 1321100 1219794 1199719
13888 1199719 1257363 1438101 1435806 1396174 1430275 1463178 1587040 1315737 1349276 1418365 1376258
$$ packed form
13957B049272k7981M4447k6682N4013l01707j06203J9841L65312J25471J98417
13947B394200K28788L168J14421r929M87381L83709P35584J549259J881345J907198
13937I675124K572638K430389J776443J492725R93009l0841j112052k291551k501782
13928A3004102k653118k530648k242612j767359p01236l40238k61006k18600m25046
13919A864239N4678p5257l95579L23303k41844J67266r9060k26489K35316j2992
13909A593581k55729J32911k16311O4411L63979l11711j06080J59820j53329N5078
13899A326620J46598P62l1451n915l9737k60044L70759j61769k4723j01306k0075
13888A199719N7644J80738k295l9632L4101L2903J23862k71303L3539O9089m2107
$$ plain form
13877 1376258 1187259 1340438 1593615 1525453 1376370 1539166 1570901 1230168 1336938 1394474
13867 1394474 1610268 1429549 1362844 1452355 1517096 1452117 1515858 1538051 1406538 1506506 1338355
13856 1338355 1358956 1508376 1441974 1407828 1468675 1428827 1294154 1664461 1600787 1536222 1519234
13845 1519234 1397315 1401138 1358710 1368914 1243409 1278826 1343765 1295044 1068618 1186543 1354450
13834 1354450 1224754 1295897 1411951 1398570 1300029 1502777 1391809 1454242 1513402 1550087
13824 1550087 1213351 1379773 1447788 1239221 1194257 1036151 1389548 1145109 1248052 966543
13814 966543 1118991 994192 1284574 1270010 1317638 1195487 1393586 1463963 1298406 1246546
13804 1246546 1488928 1166142 1296337 1185061 1413704 1719160 1443822 1360783 1477720 1461881
$$ packed form
13877A376258j88999J53179K53177o8162j49083J62796L1735l40733J06770N7536
13867A394474K15794j80719o6705Q9511O4741o4979O3741K2193j31513R9968j68151
13856A338355K0601J49420o6402l4146O0847l9848j34673L70307o3674o4565j6988
13845A519234j21919L823m2428J0204j25505L5417O4939m8721k26426J17925J67907
13834A354450j29696P1143J16054j3381r8541K02748j10968O2433N9160L6685
13824A550087l36736J66422O8015k08567m4964j58106L53397k44439J02943k81509
13814I66543J52448j24799K90382j4564M7628j22151J98099P0377j65557n1860
13804A246546K42382l22786J30195j11276K28643L05456k75338q3039J16937j5839
$$ plain form
13794 1461881 1433429 1256938 1157375 1299750 1244334 1304401 1067316 1194730 1327071 1064396
13784 1064396 1263147 1332762 1136445 1290697 1044008 1431068 1162497 1275797 1507934 1409694
13774 1409694 1651716 1634088 1518298 1796111 1619960 1591938 1944771 1598983 1592244 1590522
13764 1590522 1575412 1353081 1227341 1371083 1442888 1370737 1132442 1395498 1190122 1275888
13754 1275888 1301239 1431999 1327198 1179706 1215903 1448674 1276994 1308388 1567348 1578753
13744 1578753 1332189 1361236 1453353 1562986 1733901 1522808 1707711 1722121 1583463 1606724
13734 1606724 1559674 1459506 1741719 1373476 1702290 1577621 1805518 1702059 1729653 1764299
13724 1764299 1931811 1878155 1899750 1805064 1789235 1822489 2148864 2005818 2014791 1942114 1973074
$$ packed form
13794A461881k8452j76491r9563J42375n5416O0067k37085J27414J32341k62675
13784A064396J98751O9615j96317J54252k46689L87060k68571J13300K32137r8240
13774A409694K42022j7628j15790K77813j76151k8022L52833l45788o739j722
13764A590522j5110k22331j25740J43742P1805p2151k38295K63056k05376Q5766
13754A275888K5351J30760j04801j47492L6197K32771j71680L1394K58960J1405
13744A578753k46564K9047R2117J09633J70915k11093J84903J4410j38658K3261
13734A606724m7050j00168K82213l68243L28814j24669K27897j03459K7594L4646
13724A764299J67512n3656K1595r4686j5829L3254L26375j43046Q973p2677L0960
$$ plain form
13713 1973074 2167109 2012965 2035159 2044458 2094368 2222348 2208954 2058797 1986625 1954622 2265828
13702 2265828 2302487 1970470 1925740 2074445 1893851 1995898 2069583 2166738 2119084 2515416
13692 2515416 2630475 2510000 2537877 2827278 2604393 2735172 2355925 2056307 1940804 1883094
13682 1883094 2055033 1785687 1970637 1965596 1830750 1747797 1837732 1771642 1671122 1578413
13672 1578413 1840411 1792383 1922357 1771423 2190035 1907183 2233004 2439642 2288922 2586919
13662 2586919 2690711 2722721 2899846 2932676 2640683 2787700 2564617 2469395 2280052 2271616
13652 2271616 2049898 2217026 1979028 2114272 1819663 1863969 2120795 1781559 1750973 1790434
13642 1790434 2062873 2153071 1884587 1990063 1915996 1748010 2015685 2029741 2244914 2463302
$$ packed form
13713A973074J94035j54144K2194R299M9910J27980j3394j50157p2172l2003L11206
13702B265828L6659l32017m4730J48705j80594J02047P3685R7155m7654L96332
13692B515416J15059j20475K7877K89401k22885J30779l79247k99618j15503n7710
13682A883094J71939k69346J84950n041j34846q2953Q9935o6090j00520r2709
13672A578413K61998m8028J29974j50934M18612k82852L25821K06638j50720K97997
13662B586919J03792L2010J77125L2830k91993J47017k23083r5222j89343q436
13652B271616k21718J67128k37998J35244k94609M4306K56826l39236l0586L9461
13642A790434K72439R0198k68484J05476p4067j67986K67675J4056K15173K18388
$$ plain form
13632 2463302 2707841 2466737 2565396 2786569 2605251 2606250 2131941 2142996 1756325 1867863
13622 1867863 1865402 1885811 1694720 1685647 1721282 1556413 1848596 1720809 1607473 1594450 1804418
13611 1804418 1594593 1869493 2017839 2089815 1885855 2220133 2090398 2009758 2057061 2175584
13601 2175584 1985614 1913779 1635949 1761687 1772549 1767733 1983218 1957887 2003884 1866679
13591 1866679 1844610 2200010 1943675 2097609 1919942 1900076 1911431 1706277 1844150 1523952
13581 1523952 1535211 1693471 1560917 1713411 1545006 1403646 1733016 1447272 1643070 1733363
13571 1733363 1538508 1597364 1347301 1557337 1625954 1445744 1686342 1533338 1795673 1732018
13561 1732018 1547165 1550544 1359570 1767980 1448179 1497748 1567610 1604782 1455875 1500921
$$ packed form
13632B463302K44539k41104R8659K21173j81318R99m74309J1055l86671J11538
13622A867863k461K0409j91091r073L5635j64869K92183j27787j13336j3023K09968
13611A804418k09825K74900J48346P1976k03960L34278j29735q0640M7303J18523
13601B175584j89970p1835k77830J25738J0862m816K15485k5331M5997j37205
13591A866679k2069L55400k56335J53934j77667j9866J1355k05154J37873l20198
13581A523952J1259J58260j32554J52494j68405j41360L29370k85744J95798R0293
13571A733363j94855N8856k50063K10036O8617j80210K40598j53004K62335o3655
13561A732018j84853L379j90974M08410l19801M9569O9862L7172j48907M5046
$$ plain form
13551 1500921 1534496 1328417 1382910 1694388 1565351 1730801 1643477 1996046 1715674 2129926
13541 2129926 2242853 2482249 2311087 2514176 2387644 2261144 2399336 1897437 1915785 1519684
13531 1519684 1564417 1545572 1712264 1773527 1950332 2009817 2138476 2440775 2084996 2425017
13521 2425017 2481129 2398257 2338778 2135536 1854982 1754072 1506874 1660552 1503121 1191941
13511 1191941 1426386 1378960 1334627 1343939 1256670 1252378 1488463 1424954 1325694 1555007 1265906
13500 1265906 1531184 1393577 1204101 1365853 1307156 1058637 1113442 1188252 1304772 1512066
13490 1512066 1403229 1218689 1416483 1273051 1360682 1358806 1137313 1533692 1343497 1156481
13480 1156481 1292954 1320037 1418986 1329268 1432760 1037791 1311857 1091261 1268363 1475276
$$ packed form
13551A500921L3575k06079N4493L11478j29037J65450q7324L52569k80372M14252
13541B129926J12927K39396j71162K03089j26532j26500J38192n01899J8348l96101
13531A519684M4733j8845J66692O1263J76805N9485J28659L02299l55779L40021
13521B425017N6112q2872n9479k03242k80554j00910k47198J53678j57431l11180
13511A191941K34445m7426m4333R312q7269m292K36085o3509r9260K29313k89101
13500A265906K65278j37607j89476J61752n8697k48519N4805P4810J16520K07294
13490A512066j08837j84540J97794j43432Q7631j876k21493L96379j90195j87016
13480A156481J36473K7083R8949q9718J03492l94969K74066k20596J77102K06913
$$ plain form
13470 1475276 1176341 1214162 1295930 1398823 1174544 1273732 1349644 1402833 1213655 1466877
13460 1466877 1478949 1472138 1407695 1480018 1533297 1636806 1693286 1851052 1978274 2183827 2153840
13449 2153840 2302555 2435741 2483880 2359899 2538929 2270063 2083120 1756895 1541725 1477964
13439 1477964 1483658 1579860 1447312 1614228 1208306 1621863 1370178 1296762 1349488 1269725
13429 1269725 1529065 1530495 1587361 1494844 1516874 1449488 2040146 2094271 2308385 2255631 2363317
13418 2363317 2569751 2620896 2507358 2538473 2283363 2182873 1851178 1684200 1565540 1567471
13408 1567471 1365178 1614910 1390700 1881680 1399508 1731983 1564187 1756788 1436767
13399 1436767 1665779 1597934 1518843 1696752 1773733 1588616 1631192 1667892 1921583 1832301
$$ packed form
13470A475276k98935L7821Q1768J02893k24279R9188P5912N3189j89178K53222
13460A466877J2072o811o4443P2323N3279J03509N6480J57766J27222K05553k9987
13449B153840J48715J33186M8139j23981J79030k68866j86943l26225k15170o3761
13439A477964N694R6202j32548J66916m05922M13557k51685p3416N2726p9763
13429A269725K59340J430N6866r2517K2030o7386N90658N4125K14114n2754J07686
13418B363317K06434N1145j13538L1115k55110j00490l31695j66978j18660J931
13408A567471k02293K49732k24210M90980m82172L32475j67796J92601l20021
13399A436767K29012o7845p9091J77909P6981j85117M2576L6700K53691q9282
$$ plain form
13389 1832301 1838262 2122168 2144047 2321622 2316885 2269369 2242553 2424677 2481640 2482139 2582561
13378 2582561 2557947 2489380 2221174 2209095 2060435 2169857 1906723 1777620 1900595 2124847
13368 2124847 1819425 2099262 2106292 2344673 2109579 2080513 2252230 1876629 2093179 2128234
13358 2128234 2035886 2076540 2159660 2030196 2298980 2363589 2400779 2337103 2361006 2611186 2625710
13347 2625710 2465618 2354191 1734882 1961658 1989614 2049772 2134772 1768664 2133554 1982161
13337 1982161 2014803 1959567 2145455 2042862 1894264 2120264 2109095 1989851 2235001 2159176
13327 2159176 2276738 2329486 2294261 2298810 2262978 2291798 2205584 2232155 2233042 2230316 2530894 2414441
13315 2414441 2558866 2650924 2812624 2961113 2878885 2951036 3003869 3123010 3050734 2954816
$$ packed form
13389A832301N961K83906K1879J77575m737m7516k6816J82124N6963M99J00422
13378B582561k4614o8567k68206j2079j48660J09422k63134j29103J22975K24252
13368B124847l05422K79837P030K38381k35094k9066J71717l75601K16550L5055
13358B128234r2348M0654Q3120j29464K68784O4609L7190o3676K3903K50180J4524
13347B625710j60092j11427o19309K26776K7956O0158Q5000l66108L64890j51393
13337A982161L2642n5236J85888j02593j48598K26000j1169j19244K45150p5825
13327B159176J17562N2748l5225M549l5832K8820q6214K6571Q87k726L00578j16453
13315B414441J44425R2058J61700J48489q2228P2151N2833J19141p2276r5918
$$ plain form
13305 2954816 2942113 2895844 2746103 2854557 2712311 3002259 3181819 3175961 3519320 3303088
13295 3303088 3352756 3636202 3559581 3296984 3616162 3430145 3435396 3194457 3357644 3360934
13285 3360934 3263175 3309527 3308697 3218764 3391825 3496586 3442623 3473839 3722571 3842902 3623609
13274 3623609 3744131 3745447 3909749 3983368 4108574 4021289 4100326 4192239 3973746 4193891
13264 4193891 4297335 4434358 4618775 4680112 4800236 4618001 4867183 5003369 5023888 4970644
13254 4970644 5334894 5777018 5934477 5989564 6101623 6490905 6510146 6932716 7052009 7151496
13244 7151496 7383724 7537206 7458165 7453323 7838940 7930128 8068144 7881668 7996174 8265601
13234 8265601 8050209 8260977 8323415 8609475 8690582 9056099 9262984 9537443 9781337 10086802
$$ packed form
13305B954816j2703m6269j49741J08454j42246K89948J79560n858L43359k16232
13295C303088M9668K83446p6621k62597L19178j86017N251k40939J63187L290
13285C360934r7759M6352q30q9933J73061J04761n3963L1216K48732J20331k19293
13274C623609J20522J316J64302P3619J25206q7285P9037R1913k18493K20145
13264D193891J03444J37023J84417O1337J20124j82235K49182J36186K0519n3244
13254D970644L64250M42124J57459N5087J12059L89282J9241M22570J19293R9487
13244G151496K32228J53482p9041m842L85617R1188J38016j86476J14506K69427
13234H265601k15392K10768O2438K86060Q1107L65517K06885K74459K43894L05465
$$ plain form
13224 10086802 10431903 10610935 11198647 11279968 11707664 11603285 11780303 11695057 11629583 11862260
13214 11862260 11561697 11272688 10943634 10917099 10501718 10587988 10504656 10060613 9868494 9813394
13204 9813394 9619362 9515469 9525431 9447033 9276584 9270211 9419319 9419739 9282727 9170619 8899117
13193 8899117 8952393 8727420 8845103 8274675 8224929 8232766 7771172 7434890 7188893 6988626
13183 6988626 6994396 6814083 6538594 6161508 6166084 6082585 5634742 5695257 5541971 5322669
13173 5322669 5260756 5191651 5022750 5201338 5148190 5239926 5123417 5092107 5017734 5137740
13163 5137740 5608161 5728279 5845709 6306851 6390545 6430681 6833080 7089544 7385467 7312684
13153 7312684 7528002 7217496 7444850 7416995 6973567 7102279 6866438 6819952 6867561 6936558
$$ packed form
13224A0086802L45101J79032N87712Q1321M27696j04379J77018q5246o5474K32677
13214A1862260l00563k89009l29054k6535m15381Q6270q3332m44043j92119n5100
13204I813394j94032j03893R962p8398j70449o373J49108M20j37012j12108k71502
13193H899117N3276k24973J17683n70428m9746P837m61594l36282k45997k00267
13183F988626N770j80313k75489l77086M576q3499m47843O0515j53286k19302
13173E322669o1913o9105j68901J78588n3148R1736j16509l1310p4373J20006
13163E137740M70421J20118J17430M61142Q3694M0136M02399K56464K95923p2783
13153G312684K15318l10506K27354k7855m43428J28712k35841m6486M7609O8997
$$ plain form
13143 6936558 6840978 6954389 6752620 6341486 6075289 5950617 5781331 5109376 5091834 4604965
13133 4604965 4338398 4168154 3968894 3832327 3937745 3879601 3942350 3873492 3860737 3756099
13123 3756099 3889491 3927464 3945882 3767564 3709489 3530534 3331505 3249966 3280292 3161907
13113 3161907 3105467 3070455 3196949 3452357 3201827 3280482 3356418 3367330 3405782 3465092 3493194
13102 3493194 3524053 3888572 3904156 4229337 4761767 5323690 5539952 5946931 6219379 6665942
13092 6665942 7088838 7141286 7355054 7431115 7393185 7322783 7215468 7162489 6829288 7043997
13082 7043997 7015161 7033080 6876152 6576939 6532477 6028455 5715031 5069152 4832732 4352555
13072 4352555 3914110 3957302 3497233 3333532 3372973 3379957 3118983 3222442 3052364 2969763
$$ packed form
13143F936558r5580J13411k01769m11134k66197j24672j69286o71955j7542m86869
13133D604965k66567j70244j99260j36567J05418n8144O2749o8858j2755j04638
13123C756099J33392L7973J8418j78318n8075j78955j99029q1539L0326j18385
13113C161907n6440l5012J26494K55408k50530P8655P5936J0912L8452N9310K8102
13102C493194L0859L64519J5584L25181N32430N61923K16262M06979K72448M46563
13092F665942M22896N2448K13768P6061l7930p0402j07315n2979l33201K14709
13082G043997k8836J7919j56928k99213m4462n04022l13424o45879k36420m80177
13072D352555m38445M3192m60069j63701L9441O984k60974J03459j70078q2601
$$ plain form
13062 2969763 3297303 3172466 3182465 2841757 3195134 3275974 3381131 3214342 3096514 3461191
13052 3461191 3299059 3528627 3133602 3479474 3239537 3257512 3152144 3238082 3032112 3323186
13042 3323186 3331082 3529600 3443993 3349155 3495249 3549553 3417653 3496741 3349189 3628213
13032 3628213 3608936 3892132 3747955 3575448 3792805 3877511 3962914 3847078 3967515 4180943
13022 4180943 4065669 4306744 3998288 3958400 4291154 4492628 4406278 4340207 4537119 4467605
13012 4467605 4506108 4492392 4736219 4781088 4956444 4841794 4902611 4841692 5223280 5101931
13002 5101931 5175840 5027478 5186765 5374279 5124477 5393176 5561265 5445277 5685606 5730624
12992 5730624 5429129 5900771 5671702 5571661 5703440 5794842 5832846 5655452 5609020 5477835
$$ packed form
13062B969763L27540j24837R999l40708L53377Q0840J05157j66789j17828L64677
13052C461191j62132K29568l95025L45872k39937J7975j05368Q5938k05970K91074
13042C323186P896J98518q5607r4838J46094N4304j31900P9088j47552K79024
13032C628213j9277K83196j44177j72507K17357Q4706Q5403j15836J20437K13428
13022D180943j15274K41075l08456l9888L32754K01474q6350o6071J96912o9514
13012D467605L8503j3716K43827M4869J75356j14650O0817o0919L81588j21349
13002E101931P3909j48362J59287J87514k49802K68699J68089j15988K40329M5018
12992E730624l01495M71642k29069j00041J31779R1402L8004j77394m6432j31185
$$ plain form
12982 5477835 5582082 5686218 5719749 5609688 5706021 5627982 5395110 5396928 5533008 5381973
12972 5381973 5100018 5339655 5047248 5365979 5103105 5093266 5177386 5101615 5076441 5041471
12962 5041471 5015563 5001271 5050521 4932354 5038726 4894239 5246755 4972517 4855255 4931702
12952 4931702 5140090 5128504 5108723 5237330 4957465 5091753 5111929 5017175 4969258 5207976
12942 5207976 4989099 5208033 4993427 5114062 5067614 5007687 4965732 5010917 5226737 5168384
12932 5168384 5489071 5212217 5249327 5248236 5097064 5157973 5128392 5350482 4916651 4747187
12922 4747187 4636497 4893278 4945908 4733772 4877605 4871575 4689194 4568479 4521057 4548421
12912 4548421 4521270 4239191 4086621 3976972 4108208 3825384 3971783 4011890 3747820 3860848
$$ packed form
12982E477835J04247J04136L3531j10061R6333p8039k32872J818J36080j51035
12972E381973k81955K39637k92407L18731k62874r839Q4120p5771k5174l4970
12962E041471k5908j4292M9250j18167J06372j44487L52516k74238j17262P6447
12952D931702K08388j1586j9781J28607k79865J34288K0176r4754m7917K38718
12942E207976k18877K18934k14606J20635m6448n9927m1955M5185K15820n8353
12932E168384L20687k76854L7110j091j51172O0909k9581K22090m33831j69464
12922D747187j10690K56781N2630k12136J43833o030j82381j20715m7422K7364
12912D548421k7151k82079j52570j09649J31236k82824J46399M0107k64070J13028
$$ plain form
12902 3860848 3825240 3534383 3693538 3339930 3614783 3212425 3380601 3145837 3401676 3149079
12892 3149079 3386855 3328520 3105348 3123363 3163218 3307973 3231830 3391184 3346337 3393203
12882 3393203 3296052 3274578 3137313 3265214 3128906 3291126 2917129 2963548 2975544 2954829
12872 2954829 2796687 2914722 2799381 2875021 2651153 2868569 2685540 3098019 2488263 2846442
12862 2846442 2907798 2647629 2813862 2470783 2525561 2518524 2721449 2872212 2664004 2801133
12852 2801133 2559803 2752703 2309668 2481259 2565156 2316326 2498664 2734419 2535137 2804493
12842 2804493 2772750 2772816 2583138 2616784 2737320 2772567 2507734 2752375 2749879 2633835 2327847
12831 2327847 2754151 2823400 2687575 2444945 2656670 2750226 2634594 2657547 2423689 2737686
$$ packed form
12902C860848l5608k90857J59155l53608K74853m02358J68176k34764K55839k52597
12892C149079K37776n8335k23172J8015L9855J44755p6143J59354m4847M6866
12882C393203r7151k1474j37265J27901j36308J62220l73997M6419J1996k0715
12872B954829j58142J18035j15341P5640k23868K17416j83029M12479o09756L58179
12862B846442O1356k60169J66233l43079N4778p037K02925J50763k08208J37129
12852B801133k41330J92900m43035J71591Q3897k48830J82338K35755j99282K69356
12842B804493l1743O6j89678L3646J20536L5247k64833K44641k496j16044l05988
12831B327847M26304O9249j35825k42630K11725R3556j15632K2953k33858L13997
$$ plain form
12821 2737686 2609412 2672611 2556425 2789722 2628888 2891522 2539164 2829731 2330636 2636339
12811 2636339 2527660 2517697 2678911 2706636 2590706 2724400 2449277 2830373 2603080 2583629
12801 2583629 2564994 2699266 2702209 2661398 2959029 2850401 2565834 3007431 2857848 2582708
12791 2582708 2919064 2756364 2741586 2715254 2660761 2768321 2777305 2830417 2620741 2891751
12781 2891751 2606440 2728586 2793720 2966087 2878468 2726384 2767321 2707518 2734061 2912736
12771 2912736 2763044 2990477 2825603 2740895 2613625 2867331 2787813 2737615 2907010 3022615
12761 3022615 3102257 3211477 2837393 2769445 2797481 2805830 3077115 2647736 2874650 2979695
12751 2979695 2831122 2879087 3017927 2732731 2733682 2848429 2927620 2803675 2846084 3000302
$$ packed form
12821B737686j28274O3199j16186K33297j60834K62634l52358K90567m99095L05703
12811B636339j08679r963J61214K7725j15930J33694k75123L81096k27293j9451
12801B583629j8635J34272K943m0811K97631j08628k84567M41597j49583k75140
12791B582708L36356j62700j4778k6332n4493J07560Q984N3112k09676K71010
12781B891751k85311J22146O5134J72367q7619j52084M0937n9803K6543J78675
12771B912736j49692K27433j64874q4708j27270K53706p9518n0198J69395J15605
12761C022615P9642J09220l74084o7948K8036Q349K71285m29379K26914J05045
12751B979695j48573M7965J38840k85196R51J14747P9191j23945M2409J54218
$$ plain form
12741 3000302 2908169 3023571 2932855 3085023 3011365 2828462 2786018 3071282 3076810 3024167 2961006
12730 2961006 2935333 2921780 2977123 3139800 2982711 2990971 3092236 2972622 3015220 2767047
12720 2767047 3140353 3000923 3132077 2990408 3124878 3412057 3066996 3135771 3231670 3355348
12710 3355348 3061397 3274503 3248864 3299144 3486949 3543828 3472964 3548840 3732422 3847394
12700 3847394 4074798 4116051 4119108 4217604 4501308 4442290 4790073 5054042 5383304 5649236
12690 5649236 6057591 6670961 7028685 7473064 7411268 7772384 7531735 7528829 7342434 7045658
12680 7045658 6252278 5660555 5022066 4704639 4404880 4405028 4436132 4190234 4180031 4346688
12670 4346688 4240275 4329276 4761640 4465434 4684012 4634991 4834611 4893362 4812625 4936686
$$ packed form
12741C000302r2133J15402r0716J52168p3658j82903m2444K85264N528n2643o3161
12730B961006k5673j3553N5343J62677j57089Q260J01265j19614M2598k48173
12720B767047L73306j39430J31154j41669J34470K87179l45061O8775R5899J23678
12710C355348k93951K13106k5639N0280J87805N6879p0864P5876J83582J14972
12700C847394K27404M1253L057R8496K83704n9018L47783K63969L29262K65932
12690E649236M08355O13370L57724M44379o1796L61116k40649k906j86395k96776
12680G045658p93380n91723o38489l17427k99759J48L1104k45898j0203J66657
12670D346688j06413Q9001M32364k96206K18578m9021J99620N8751q0737J24061
$$ plain form
12660 4936686 5070534 4958012 4867998 4697994 5083255 5147811 5128516 5736031 5987104 6025652
12650 6025652 6412805 6656938 6788866 6779971 6606319 6932562 6718107 6822868 6580098 6454719
12640 6454719 6506921 6554603 6463001 6627254 6764285 6938998 6841175 6983961 7082861 7122570
12630 7122570 7266908 7346994 7263057 7389307 7396241 7213638 7040563 6976876 6645854 6334139
12620 6334139 6288753 5709498 5633411 5060289 5062807 4837044 5129985 5077384 5408990 5459132
12610 5459132 6232294 6778742 7210176 7633735 8126908 8682524 9016790 8923254 8558923 8407119
12600 8407119 8041308 7649770 7298295 6661794 5961471 5904006 5485263 5404068 5427079 5539609
12590 5539609 5783053 6195884 6025163 6482786 6289947 6526291 6276783 6274884 6388780 6391432
$$ packed form
12660D936686J33848j12522r0014j70004L85261O4556j9295O07515K51073L8548
12650F025652L87153K44133J31928q895j73652L26243k14455J04761k42770j25379
12640F454719N2202M7682r1602J64253J37031J74713r7823J42786R8900L9709
12630G122570J44338Q0086q3937J26250O934j82603j73075o3687l31022l11715
12620F334139m5386n79255p6087n73122K518k25763K92941n2601L31606N0142
12610E459132P73162N46448M31434M23559M93173N55616L34266r3536l64331j51804
12600H407119l65811l91538l51475o36501p00323n7465m18743q1195K3011J12530
12590E539609K43444M12831j70721M57623j92839K36344k49508j899J13896K652
$$ plain form
12580 6391432 6146256 6322079 6545402 7044815 7268055 7467514 7221677 7134247 7131314 6986309
12570 6986309 6349773 5954415 5395550 5271209 4674488 4862091 4641544 4562564 4729326 4661120
12560 4661120 4663829 4589655 4709189 4615295 4808021 4982004 4838277 4558168 4830149 4707574
12550 4707574 4761260 5036037 5075272 4880130 4893444 4852928 4981918 5198320 5101194 5211205
12540 5211205 5520007 5510313 5518267 5474227 5351007 5527308 5276624 5305351 5184160 4773800
12530 4773800 4940882 4758237 4855049 4700171 4784246 4775916 4954201 4839800 5024494 5178485
12520 5178485 5185492 5200182 5078433 5180489 5229201 5637915 5433650 5694147 5951663 6352028
12510 6352028 6387875 6648317 6901095 7068638 6847299 6927035 6622220 6467643 6152147 5997447
$$ packed form
12580F391432k45176J75823K23323M99413K23240J99459k45837q7430k933j45005
12570F986309o36536l95358n58865j24341n96721J87603k20547p8980J66762o8206
12560D661120K709p4174J19534r3894J92726J73983j43727k80109K71981j22575
12550D707574N3686K74777L9235j95142J3314m0516J28990K16402r7126J10011
12540E211205L08802r694P954m4040j23220J76301k50684K8727j21191m10360
12530D773800J67082j82645R6812j54878Q4075q330J78285j14401J84694J53991
12520E178485P007J4690j21749J02056M8712M08714k04265K60497K57516M00365
12510F352028L5847K60442K52778J67543k21339P9736l04815j54577l15496j54700
$$ plain form
12500 5997447 5637159 5361137 5496646 5539249 5469383 5584086 5407895 5542583 5594788 5486237
12490 5486237 5740166 5673295 5494936 5732142 5800027 5764784 5781126 6034244 6151451 6343864
12480 6343864 6465279 6748219 6655200 6597585 6625052 6544626 6250733 6432177 6099767 5980207
12470 5980207 6068877 6027238 5919709 5797440 6059886 6053949 6354510 6265256 6270515 6397791 6380649
12459 6380649 6535684 6513839 6833394 6929538 6886771 7138260 7470153 7209751 7509920 7980022
12449 7980022 8017804 8322501 8728605 8815408 9093453 9691460 10077066 10302348 10737983 10718818
12439 10718818 11131671 11278895 11519544 11534552 11648995 11691363 11548767 11569046 11582424 11729221
12429 11729221 11609020 11674948 11845827 11961374 12033628 12197414 12447378 12574222 12842445 13106962
$$ packed form
12500E997447l60288k76022J35509M2603o9866J14703j76191J34688N2205j08551
12490E486237K53929o6871j78359K37206O7885l5243J6342K53118J17207J92413
12480F343864J21415K82940r3019n7615K7467q0426k93893J81444l32410j19560
12470E980207Q8670m1639j07529j22269K62446n937L00561q9254N259J27276j7142
12459F380649J55035k1845L19555R6144m2767K51489L31893k60402L00169M70102
12449G980022L7782L04697M06104Q6803K78045N98007L85606K25282M35635j9165
12439A0718818M12853J47224K40649J5008J14443M2368j42596K0279J3378J46797
12429A1729221j20201O5928J70879J15547P2254J63786K49964J26844K68223K64517
$$ plain form
12419 13106962 13515948 13658071 14445881 14753506 15657678 16334510 16968801 17259562 17870061
12410 17870061 18209220 18760731 18659397 18699904 18495982 18307019 17653406 17778907 17095986
12401 17095986 16768676 16308501 16116186 15734079 15608911 15427672 15063397 14945145 14885070
12392 14885070 15028337 15074219 15142264 15590016 15662370 16259414 16666763 17162285 17273477 17929528
12382 17929528 18473293 18597341 19068061 18828493 19041770 19011973 19021883 18745744 18756402 18436395
12372 18436395 18604661 18206840 18132319 18009072 17574242 17397017 17132158 16808138 17086434
12363 17086434 16700820 16636519 16503801 16340967 16062683 15937600 15444367 15518830 15149554 15077452
12353 15077452 15223191 15078681 14745046 14548716 14285344 13857714 14098356 13694156 13379606
$$ packed form
12419A3106962M08986J42123P87810L07625R04172O76832O34291K90761O10499
12410A7870061L39159N51511j01334M0507k03922j88963o53613J25501o82921
12401A7095986l27310m60175j92315l82107j25168j81239l64275j18252o0075
12392A4885070J43267M5882O8045M47752P2354N97044M07349M95522J11192O56051
12382A7929528N43765J24048M70720k39568K13277k9797R910k76139J0658l20007
12372A8436395J68266l97821p4521j23247m34830j77225k64859l24020K78296
12363A7086434l85614o4301j32718j62834k78284j25083m93233P4463l69276p2102
12353A5077452J45739j44510l33635j96330k63372m27630K40642m04200l14550
$$ plain form
12344 13379606 13233482 13442283 13312402 13335603 13709319 13753647 14239747 14181892 14706168 15049737
12334 15049737 15375478 15716058 16249175 16424301 16704231 17110097 17404069 17809756 17882792
12325 17882792 18110103 18071700 18360980 18468822 18646696 18719881 18929486 19026092 18795556 18769325
12315 18769325 18646478 18671797 18751829 18797519 18777304 18877039 18861060 19257653 19674656 20158893
12305 20158893 20432339 20677409 21146626 21522873 21688476 21661564 21420598 21324587 20867652 20448758
12295 20448758 19799715 19183349 18739648 18640601 18245900 17969228 17751980 17753264 17521345 17117971
12285 17117971 16667071 16268186 15777668 15326529 14650482 14270830 13581288 13171955 12738152
12276 12738152 12527867 12360270 12197978 12058007 11757356 11763707 11487616 11500372 11492752 11780816
$$ packed form
12344A3379606j46124K08801j29881K3201L73716M4328M86100n7855N24276L43569
12334A5049737L25741L40580N33117J75126K79930M05866K93972M05687P3036
12325A7882792K27311l8403K89280J07842J77874P3185K09605R6606k30536k6231
12315A8769325j22847K5319Q0032M5690k0215R9735j5979L96593M17003M84237
12305B0158893K73446K45070M69217L76247J65603k6912k40966r6011m56935m18894
12295B0448758o49043o16366m43701r9047l94701k76672k17248J284k31919m03374
12285A7117971m50900l98885m90518m51139o76047l79652o89542m09333m33803
12276A2738152k10285j67597j62292j39971l00651O351k76091J2756p620K88064
$$ plain form
12266 11780816 11265445 11434798 11354415 11388176 11435100 11518945 11226770 11368205 11198519 11459793
12256 11459793 11628838 11944366 12008272 12270164 12834952 13205894 13934760 14474912 15457092
12247 15457092 16306870 17577996 18552877 19649988 20543330 21553158 22101495 23015999 23181390
12238 23181390 23489599 23649987 23370515 23099933 22959442 22672514 22107467 22316914 22389724
12229 22389724 22117064 21515490 21183270 20991236 19857003 18846601 17851754 16718240 15920764
12220 15920764 14768549 14035526 12921368 12806820 12013643 11748959 11605787 11342507 11021032
12211 11021032 10869764 10703739 10283908 10287294 9724776 9447688 9527094 9089438 9405826 9366827
12201 9366827 9331178 9264924 9330006 9485468 9505870 9281092 9171055 9346079 9393902 9492455
$$ packed form
12266A1780816n15371J69353q0383L3761M6924Q3845k92175J41435j69686K61274
12256A1459793J69045L15528O3906K61892N64788L70942P28866N40152R82180
12247A5457092Q49778J271126R74881J097111Q93342J009828N48337R14504J65391
12238B3181390L08209J60388k79472k70582j40491k86928n65047K09447P2810
12229B2389724k72660o01574l32220j92034j134233j010402r94847j133514p97476
12220A5920764j152215p33023j114158j14548p93177k64684j43172k63280l21475
12211A1021032j51268j66025m19831L386n62518k77088P9406m37656L16388l8999
12201I366827l5649o6254O5082J55462K0402k24778j10037J75024M7823R8553
$$ plain form
12191 9492455 9420129 9797593 9841012 10075965 10034164 10600056 10736381 10871005 11017290 11212953
12181 11212953 11114355 11276628 11648421 11565820 11408439 11640409 11475673 11262186 11191990 10795467
12171 10795467 11110558 11045433 11403766 11413946 11749466 11690768 11914333 12273531 12660842 12944278
12161 12944278 13302949 13927099 14472858 15048601 15382779 15621111 15625794 15536911 15342650 14897489
12151 14897489 14497960 14375635 14470482 14385516 14992888 15386962 16151912 16530107 16987083 16989886
12141 16989886 17624015 17483737 18238089 18709464 19146111 19968394 20624960 21784478 23230158
12132 23230158 24469794 25958189 27604827 29517435 31468419 33508854 35655187 37111811
12124 37111811 38939418 40051290 41012121 41856376 41852322 41985602 41775143 41554496 41154577
$$ packed form
12191I492455p2326L77464M3419K34953m1801N65892J36325J34624J46285J95663
12181A1212953r8598J62273L71793q2601j57381K31970j64736k13487p0196l96523
12171A0795467L15091o5125L58333J0180L35520n8698K23565L59198L87311K83436
12161A2944278L58671O24150N45759N75743L34178K38332M683q8883j94261m45161
12151A4897489l99529j22325R4847q4966O07372L94074P64950L78195M56976K803
12141A6989886O34129j40278P54352M71375M36647Q22283O56566J159518J445680
12132B3230158J239636J488395J646638J912608J950984K040435K146333J456624
12124C7111811J827607J111872R60831Q44255m054J33280k10459k20647l99919
$$ plain form
12115 41154577 40432031 40211223 39678560 39103184 38532147 38351274 37697224 37202478 36853426
12106 36853426 36822122 36778921 36805885 37147396 37505791 37945270 38436722 38366866 38730611 38766925
12096 38766925 38447747 37796615 37363440 35898820 34817965 34120647 33610696 33303693 33350458
12087 33350458 34012228 34589082 35335589 36253067 37230952 37873536 38339193 38644349 38554890
12078 38554890 38424436 38580756 38611020 38696049 38773061 38727486 38836322 38485395 37987231 37647791
12068 37647791 36635419 36011843 34808093 33743767 32444405 30968636 30146525 28933689
12060 28933689 28447734 27611967 27191288 26478759 26238057 25852027 25650119 25213072 24680417
12051 24680417 24298114 23784411 23416656 22994597 22716855 22235004 21730428 21479000 21193233
$$ packed form
12115D1154577p22546k20808n32663n75376n71037j80873o54050m94746l49052
12106C6853426l1304m3201K6964L41511L58395M39479M91452o9856L63745L6314
12096C8766925l19178o51132m33175j464620j080855o97318n09951l07003M6765
12087C3350458O61770N76854P46507R17478R77885O42584M65657L05156q9459
12078C8554890j30454J56320L0264Q5029P7012m5575J08836l50927m98164l39440
12068C7647791j012372o23576j203750j064326j299362j475769q22111j212836
12060B8933689m85955q35767m20679p12529k40702l86030k01908m37047n32655
12051B4680417l82303n13703l67755m22059k77742m81851n04576k51428k85767
$$ plain form
12042 21193233 20833481 20347806 19716988 19215446 18910352 18317628 17953643 17416198 17083328
12033 17083328 17068352 16914244 17207689 17319640 17526373 18031029 18298872 18524015 18951585
12024 18951585 18789603 18649661 18229248 17522065 17114924 15900624 15653592 15203797 14653794
12015 14653794 14192247 14109634 13757600 13657180 13387976 12836227 12477640 11934770 11578061
12006 11578061 11546744 11692040 11697774 11404830 12203219 12533326 12454952 12759404 12666994 12159392
11996 12159392 11879570 11466593 11347410 10802997 10024674 9951782 10056071 10017949 9607144 9706020
11986 9706020 9644230 9416030 9490948 9190728 8921833 8306746 8093781 7718215 7854787 7782502
11976 7782502 7522866 7340730 7393550 7131786 7242392 7130959 6813667 6463923 6487618 6275267
$$ packed form
12042B1193233l59752m85675o30818n01542l05094n92724l63985n37445l32870
12033A7083328j4976j54108K93445J11951K06733N04656K67843K25143M27570
12024A8951585j61982j39942m20413p07183m07141j214300k47032m49795n50003
12015A4653794m61547q2613l52034j00420k69204n51749l58587n42870l56709
12006A1578061l1317J45296N734k92944P98389L30107p8374L04452r2410n07602
11996A2159392k79822m12977j19183n44413p78323p2892J04289l8122m10805R8876
11986I706020o1790k28200P4918l00220k68895o15087k12965l75566J36572p2285
11976G782502k59636j82136N2820k61764J10606j11433l17292l49744K3695k12351
$$ plain form
11966 6275267 5829736 5910576 5765753 5543788 5520259 5677459 5299661 5591010 5699575 5960158
11956 5960158 6313923 6321869 6511834 6516985 6475539 6753778 6254837 6590960 6354240 6433869
11946 6433869 6538146 6489476 6461723 6718595 6821040 7079868 7166056 7464678 7699212 7652304
11936 7652304 7648061 7467901 7921189 8014943 7908466 7657940 7976180 7751161 7943053 7885215
11926 7885215 7711204 7535823 7174702 7255176 6894322 6709605 6566317 6322180 6357347 6208078
11916 6208078 6207963 5999038 6029839 5906490 5791374 5949687 6157073 7295892 8889337 10513445
11906 10513445 11266875 11817067 12094502 12249481 12186971 12285079 10822388 8630260 6378189
11897 6378189 5434411 5293387 5070649 5041621 5062762 5010552 5086907 5214257 5799570 5947446
$$ packed form
11966F275267m45531Q0840j44823k21965k3529J57200l77798K91349J08565K60583
11956E960158L53765P946J89965N151m1446K78239m98941L36123k36720P9629
11946F433869J04277m8670k7753K56872J02445K58828Q6188K98622K34534m6908
11936G652304m243j80160M53288R3754j06477k50526L18240k25019J91892n7838
11926G885215j74011j75381l61121Q0474l60854j84717j43288k44137L5167j49269
11916F208078j15k08925L0801j23349j15116J58313K07386J138819J593445J624108
11906A0513445P53430N50192K77435J54979o2510R8108j462691k192128k252071
11897F378189r43778j41024k22738k9028K1141n2210P6355J27350N85313J47876
$$ plain form
11887 5947446 6235052 6896105 7393769 8420467 8969130 9585495 9911724 9909763 9922689 9803549
11877 9803549 9699997 9153098 8282682 7700770 7233794 6727150 6192612 5856826 5448819
11868 5448819 5372842 5298490 4854096 4885302 5000761 4721434 4954697 4704043 4630732 4537529
11858 4537529 4443034 4547883 4655182 4548482 4553707 4705352 4693525 4906095 4928724 4773895
11848 4773895 5084999 5067066 5543638 5773318 6059180 6856667 7370859 7757032 8272613 8576313
11838 8576313 8596362 8669646 8656363 8458899 8405437 7677819 7449644 7209837 7243299 7593699
11828 7593699 7290732 7520746 7201063 7165416 6694632 6179422 5424962 5020773 4479416 4394256
11818 4394256 4228416 4059537 4201714 4149249 3972512 4021443 3972843 3979894 3737611 4122175
$$ packed form
11887E947446K87606O61053M97664J026698N48663O16365L26229j961J2926j19140
11877I803549j03552n46899q70416n81912m66976n06644n34538l35786m08007
11868E448819p5977p4352m44394L1206J15459k79327K33263k50654p3311r3203
11858D537529r4495J04849J07299j06700N225J51645j1827K12570K2629j54829
11848D773895L11104j7933M76572K29680K85862P97487N14192L86173N15581L03700
11838H576313K0049P3284j3283j97464n3462p27618k28175k39807L3462L50400
11828G593699l02967K30014l19683l5647m70784n15210p54460m04189n41357q5160
11818D394256j65840j68879J42177n2465j76737M8931m8600P051k42283L84564
$$ plain form
11808 4122175 3831645 3809108 3532994 3567668 3521430 3723794 3800242 3522174 3599678 3574000
11798 3574000 3646678 3697156 3772337 3718412 3603656 4061022 4090201 4208239 4597105 5236356
11788 5236356 5706915 6024806 6280310 6257298 6606374 6395187 6422712 6090980 5648260 4883257
11778 4883257 4507290 4277049 3895296 3837579 3669252 3440854 3415182 3415322 3502295 3193087
11768 3193087 3286371 3074033 3150985 3203601 3151982 3066492 3350874 3381415 3039254 3166962
11758 3166962 3100861 2851511 3101499 3100996 3056780 2935321 2935896 3205691 3065953 2921504 2914964
11747 2914964 2934753 3139563 3110563 3215831 3006271 3051177 3107022 2776800 2982265 2866679
11737 2866679 2747073 2742720 2725725 2940394 2533444 2694276 2777018 2647077 2928675 2834601
$$ packed form
11808D122175k90530k2537k76114L4674m6238K02364P6448k78068P7504k5678
11798C574000P2678N0478P5181n3925j14756M57366K9179J18038L88866O39251
11788E236356M70559L17891K55504k3012L49076k11187K7525l31732m42720p65003
11778D883257l75967k30241l81753n7717j68327k28398k5672J40Q6973l09208
11768C193087R3284k12338P6952N2616n1619q5490K84382L0541l42161J27708
11758C166962o6101k49350K49988n03m4216j21459N75K69795j39738j44449o540
11747B914964J9789K04810k9000J05268k09560M4906N5845l30222K05465j15586
11737B866679j19606m353j6995K14669m06950J60832Q2742j29941K81598r4074
$$ plain form
11727 2834601 2882837 2792488 2576305 2725171 2603505 2502515 2573199 2877692 2591696 2667105
11717 2667105 2861346 2647855 2688094 2769597 2774518 2832929 2732658 2780238 2978817 2606886
11707 2606886 2786099 2867076 2701526 2918233 2772523 2912401 2878503 2735185 2885028 2837558
11697 2837558 2951775 3207278 3098699 3111904 2891867 3097322 3021555 3025343 3157802 3336704
11687 3336704 3126288 3149001 3333315 3236301 3222492 3356494 3224477 3543586 3519092 3719403
11677 3719403 3210212 3643420 3696958 3815289 3708433 3632527 3752863 3647049 3677545 3626786
11667 3626786 3751581 3678882 3584418 3674279 3872260 3599341 3297696 3426049 3615326 3653613
11657 3653613 3527710 3396193 3607015 3339143 3359536 3477916 3403013 3559120 3368067 3446451
$$ packed form
11727B834601M8236r0349k16183J48866j21666j00990P0684L04493k85996P5409
11717B667105J94241k13491M0239Q1503M921N8411j00271M7580J98579l71931
11707B606886J79213Q0977j65550K16707j45710J39878l3898j43318J49843m7470
11697B837558J14217K55503j08579J3205k20037K05455p5767L788J32459J78902
11687C336704k10416K2713J84314r7014j3809J34002j32017L19109k4494K00311
11677C719403n09191M33208N3538J18331j06856p5906J20336j05814L0496n0759
11667C626786J24795p2699r4464Q9861J97981k72919l01645J28353J89277L8287
11657C653613j25903j31517K10822k67872K0393J18380p4903J56107j91053P8384
$$ plain form
11647 3446451 3490306 3448941 3390429 3521621 3217454 3249027 3362481 3321793 3315169 3324228 3239491
11636 3239491 3248910 3384412 3407816 3348228 3228180 3296762 3261256 3051781 3053267 3189231 3289280
11625 3289280 3268906 3031748 3164492 3311846 3087410 3065558 3271256 2890981 3098559 3064335
11615 3064335 3106046 3221850 3104348 3157946 3153796 3112248 3289159 3169615 3338176 3077238
11605 3077238 3294919 3231600 3474778 3336827 3315831 3567121 3535581 3507148 3525771 3372886
11595 3372886 3427526 3710331 3478001 3311760 3747062 3577977 3492957 3355483 3381275 3502924
11585 3502924 3418205 3562738 3346673 3560235 3485543 3614580 3694536 3760669 3591044 3863087
11575 3863087 3757372 3489834 3448330 3674517 3820350 3789782 3574923 3775874 3605032 3636334
$$ packed form
11647C446451M3855m1365n8512J31192l04167L1573J13454m0688o624R059q4737
11636C239491R419J35502K3404n9588j20048O8582l5506k09475J486J35964J00049
11625C289280k0374k37158J32744J47354k24436k1852K05698l80275K07578l4224
11615C064335M1711J15804j17502N3598m150m1548J76911j19544J68561k60938
11605C077238K17681o3319K43178j37951k0996K51290l1540k8433J8623j52885
11595C372886N4640K82805k32330j66241M35302j69085q5020j37474K5792J21649
11585C502924q4719J44533k16065K13562p4692J29037P9956O6133j69625K72043
11575C863087j05715k67538m1504K26187J45833l0568k14859K00951j70842L1302
$$ plain form
11565 3636334 3575272 3565483 3597134 3608793 3792289 3871959 3654321 3618512 3895509 3717293 3863151
11554 3863151 3944317 3900749 4025460 3757436 3865783 3757269 3469274 3801435 3416444 3779060
11544 3779060 3673100 3615404 3679589 3526194 3556012 3408291 3560701 3516044 3818486 3434739
11534 3434739 3663035 3581981 3434028 3721020 3675868 3501165 3498819 3543271 3786219 3524245
11524 3524245 3366518 3434930 3751019 3543330 3763200 3866979 3871766 3623962 3596284 3962382
11514 3962382 3417049 3795755 3759783 3722913 4005238 3844357 3899255 4081402 3762241 4057863
11504 4057863 3699034 3934213 3947826 4003782 3912081 3757581 3872489 4046204 3892113 4019037
11494 4019037 4005625 4021569 4171612 4030864 4172217 4200561 4163424 4063238 4256975 4056905
$$ packed form
11565C636334o1062r789L1651J1659J83496P9670k17638l5809K76997j78216J45858
11554C863151Q1166m3568J24711k68024J08347j08514k87995L32161l84991L62616
11544C779060j05960n7696O4185j53395K9818j47721J52410m4657L02442l83747
11534C434739K28296q1054j47953K86992m5152j74703k346M4452K42948k61974
11524C524245j57727O8412L16089k07689K19870J03779M787k47804k7678L66098
11514C962382n45333L78706l5972l6870K82325j60881N4898J82147l19161K95622
11504D057863l58829K35179J3613N5956r1701j54500J14908J73715j54091J26924
11494D019037j3412J5944J50043j40748J41353K8344l7137j00186J93737k00070
$$ plain form
11484 4056905 4194692 4397510 4311305 4403812 4463400 4322113 4749543 4593132 4376818 4392916
11474 4392916 4385593 4442172 4438281 4274690 4399134 4449718 4313043 4292352 4161648 4408579 4199734
11463 4199734 4350649 4152819 4328990 4079976 4179810 4310871 4174552 4126813 4264910 4290092
11453 4290092 4139450 4053726 4431102 4266765 4258527 4425695 4454264 4560653 4627688 4486672
11443 4486672 4560297 4583657 4630997 4688771 4891191 5005257 4841244 4821103 5127730 4869821
11433 4869821 5216623 5092486 5160299 5389466 5259561 5548021 5404829 5466628 5793661 5678356
11423 5678356 5794467 5373950 5564931 5709929 5640195 5848895 6086097 5781089 5902238 5940217
11413 5940217 6164475 6003466 6407065 6365147 6479839 6575317 6591495 6589399 6809295 6853187
$$ packed form
11484D056905J37787K02818q6205R2507N9588j41287M27430j56411k16314J6098
11474D392916p323N6579l891j63591J24444N0584j36675k0691j30704K46931k08845
11463D199734J50915j97830J76171k49014R9834J31061j36319m7739J38097K5182
11453D290092j50642q5724L77376j64337q238J67168K8569J06389O7035j41016
11443D486672P3625K3360M7340N7774K02420J14066j64013k0141L06627k57909
11433D869821L46802j24137O7813K29167j29905K88460j43192O1799L27033j15305
11423E678356J16111m20517J90981J44998o9734K08700K37202l05008J21149L7979
11413E940217K24258j61009M03599m1918J14692R5478J6178k096K19896M3892
$$ plain form
11403 6853187 6967339 7232919 7245715 7482166 7449329 7611236 7805323 7536140 8126911 8025710
11393 8025710 8167310 8494657 8554195 8755570 8892462 8905197 9241689 9335186 9314756 9536373
11383 9536373 9659422 9788292 9980117 10019532 10047967 10502501 10336954 10638918 10728012 10690431
11373 10690431 10839595 10842360 11002427 11163928 11156372 11146424 11404935 11359647 11142085 11441862
11363 11441862 11523540 11677172 11480927 11792018 11750476 11803679 11640463 11970791 12010417 12055897
11353 12055897 11847817 11953962 12166678 11983787 12022415 11874293 12111988 12027532 12034726 12070388
11343 12070388 11924769 11979392 11869324 11798733 11516437 11587948 11461897 11378875 11296110 11289368
11333 11289368 11171149 11040839 10965890 10767330 10730921 10560713 10387236 10448803 10143078 10016800
$$ packed form
11403F853187J14152K65580J2796K36451l2837J61907J94087k69183N90771j01201
11393H025710J41600L27347N9538K01375J36892J2735L36492R3497k0430K21617
11383I536373J23049J28870J91825L9415K8435M54534j65547L01964Q9094l7581
11373A0690431J49164K765J60067J61501p556r948K58511m5288k17562K99777
11363A1441862Q1678J53632j96245L11091m1542N3203j63216L30328L9626M5480
11353A2055897k08080J06145K12716j82891L8628j48122K37695q4456P194L5662
11343A2070388j45619N4623j10068p0591k82296P1511j26051q3022q2765o742
11333A1289368j18219j30310p4949j98560l6409j70208j73477O1567l05725j26278
$$ plain form
11323 10016800 9654082 9707402 9725928 9502841 9312607 9323217 9182329 8940821 8945108 8657947
11313 8657947 8556197 8252013 8150998 7978278 7882112 7682663 7487197 7290542 7047044 6870160
11303 6870160 6834367 6688169 6544978 6440409 6104422 6202616 5815217 6140466 6009959 5762178
11293 5762178 5434847 5506114 5062057 5291077 5339425 5297738 4915925 4883622 4758137 4744451
11283 4744451 4527016 4622496 4483268 4435152 4272391 4137426 4196626 4189385 4103546 4214203
11273 4214203 3879527 4169174 3953085 3834830 3863477 3808881 3774437 3599716 3471566 3502382
11263 3502382 3751948 3715372 3546106 3519119 3444178 3303629 3307814 3148806 3238554 3352035
11253 3352035 3488678 3241889 3062532 3134807 3394163 3059046 3285741 3186531 3092177 3267524
$$ packed form
11323A0016800l62718N3320J8526k23087j90234J0610j40888k41508M287k87161
11313H657947j01750l04184j01015j72720r6166j99449j95466j96655k43498j76884
11303F870160l5793j46198j43191j04569l35987R8194l87399L25249j30507k47781
11293E762178l27331P1267m44057K29020M8348m1687l81813l2303j25485j3686
11283D744451k17435R5480j39228m8116j62761j34965N9200p241q5839J10657
11273D214203l34676K89647k16089j18255K8647n4596l4444j74721j28150L0816
11263C502382K49566l6576j69266k6987p4941j40549M185j59008Q9748J13481
11253C352035J36643k46789j79357P2275K59356l35117K26695r9210r4354J75347
$$ plain form
11243 3267524 3474367 3187382 3280902 3209794 3151204 3426523 3278399 3486438 3401722 3251141
11233 3251141 3275793 3227599 3325584 3181661 3306411 3271484 3533509 3632818 3455119 4271710
11223 4271710 4781250 5676504 6116021 6492791 6668049 6800400 6882149 6939138 6337719 5768204
11213 5768204 4812786 4073502 3527071 3588609 3374097 3469977 3196402 2892876 3063792 3186394
11203 3186394 3210648 3214774 3161521 3158835 3280706 3411048 3495027 3833412 4345804 5088221 5708595
11192 5708595 5850323 6628731 7056105 7026476 7184420 7022542 6542132 5760116 4788291 3968719
11182 3968719 3692263 3789409 3398450 3807540 3451356 3472847 3565386 3565331 3425039 3595066 3527474
11171 3527474 3752443 3505088 3627666 3498635 3594201 3719105 3822777 3712721 3646153 3528958
$$ packed form
11243C267524K06843k86985R3520p1108n8590K75319j48124K08039q4716j50581
11233C251141K4652m8194R7985j43923J24750l4927K62025R9309j77699Q16591
11223D271710N09540Q95254M39517L76770J75258J32351Q1749N6989o01419n69515
11213E768204r55418p39284n46431O1538k14512R5880k73575l03526J70916J22602
11203C186394K4254M126n3253k686J21871J30342Q3979L38385N12392P42417O20374
11192E708595J41728P78408M27374k9629J57944j61878m80410p82016r71825q19572
11182C968719k76456R7146l90959M09090l56184K1491R2539n5j40292J70027o7592
11171C527474K24969k47355J22578j29031R5566J24904J03672j10056o6568j17195
$$ plain form
11161 3528958 3824516 3754072 3806156 3650686 3592233 3554861 3781460 4035561 3740090 3528351
11151 3528351 3929448 3857475 3861645 3715324 3865347 3723808 4124166 3926787 3818882 3917683
11141 3917683 3938838 4080787 4055576 4091051 3946091 4043902 4107976 4043942 4210523 4310520 4431622
11130 4431622 4362184 4395666 4194474 4482075 4261494 4402627 4466012 4250944 4513268 4539226
11120 4539226 4412718 4614669 4696549 4432327 4486163 4514310 4402870 4729678 4676704 4672254
11110 4672254 4632307 4670348 4626550 4803159 4535771 4759134 4777429 4742664 4622255 4584664
11100 4584664 4593573 4284136 4582238 4338066 4460972 4490362 4204703 4476988 4286427 4525261
11090 4525261 4479292 4480330 4350842 4442175 4319240 4386842 4303327 4301177 4418211 4566506 4421281
$$ packed form
11161C528958K95558p0444N2084j55470n8453l7372K26599K54101k95471k11739
11151C528351M01097p1973M170j46321J50023j41539M00358j97379j07905R8801
11141C917683K1155J41949k5211L5475j44960R7811O4074o4034J66581R9997J21102
11130D431622o9438L3482k01192K87601k20581J41133O3385k15068K62324K5958
11120D539226j26508K01951Q1880k64222N3836K8147j11440L26808n2974m450
11110D672254l9947L8041m3798J76609k67388K23363J8295l4765j20409l7591
11100D584664Q909l09437K98102k44172J22906K9390k85659K72285j90561K38834
11090D525261m5969J038j29488R1333j22935O7602q3515k150J17034J48295j45225
$$ plain form
11079 4421281 4308422 4623323 4836191 4541958 4459987 4637945 4550362 4719843 4483053 4566762
11069 4566762 4541553 4642579 4732753 4863557 5143730 4842205 4927415 4958936 5285333 5376252
11059 5376252 5440139 5723091 5604448 5451878 5807897 5770044 5919133 5721999 6051423 5746905
11049 5746905 5795135 5781612 5937130 5947059 6029549 5808839 6287256 6221726 6397521 6298936 6478775
11038 6478775 6498330 6491418 6865833 7060089 6939359 7258165 7481323 7608845 8035665 8080755
11028 8080755 8314203 8300261 8903264 8969461 9287187 9446306 9669252 9814186 10053957 10246224
11018 10246224 10429183 10484322 10516280 10777387 10892366 11182685 11108332 11424832 11252041 11619477
11008 11619477 11718968 11635908 12164851 12182434 12437388 12440212 13046111 13396760 13571736 13923245
$$ packed form
11079D421281j12859L14901K12868k94233q1971J77958q7583J69481k36790Q3709
11069D566762k5209J01026R0174J30804K80173l01525Q5210L1521L26397R0919
11059E376252O3887K82952j18643j52570L56019l7853J49089j97134L29424l04518
11049E746905M8230j3523J55518R929Q2490k20710M78417o5530J75795r8585J79839
11038F478775J9555o912L74415J94256j20730L18806K23158J27522M26820M5090
11028H080755K33448j3942O03003O6197L17726J59119K22946J44934K39771J92267
11018A0246224J82959N5139L1958K61107J14979K90319p4353L16500j72791L67436
11008A1619477R9491q3060N28943J7583K54954K824O05899L50649J74976L51509
$$ plain form
10998 13923245 14078805 14486658 14865561 15378386 15251686 15686209 16029106 15990787 16460742
10989 16460742 16480419 16696112 16658597 17033317 16964094 17353496 17656231 17948625 18215396 18830987
10979 18830987 18897955 19225827 19461428 19708522 20324020 20369581 20625886 20654365 20694580 21166047
10969 21166047 21611775 21919493 22248701 22679996 23036420 23500839 24003426 24489213 24881402
10960 24881402 25245010 25622333 25917586 26430876 26918150 27415599 28065476 28492808 29441595
10951 29441595 29997822 30345346 31301820 31641146 32326964 32813451 33091515 33687651 34355606
10942 34355606 34981854 35717619 36644073 37203409 37835418 38534279 39298321 40070598 40485953
10933 40485953 41524642 42546585 43049972 43941878 45151571 45687290 46848355 47600112 48944934
$$ packed form
10998A3923245J55560M07853L78903N12825j26700M34523L42897l8319M69955
10989A6460742J9677K15693l7515L74720o9223L89402L02735K92394K66771O15591
10979A8830987O6968L27872K35601K47094O15498M5561K56305K8479M0215M71467
10969B1166047M45728L07718L29208M31295L56424M64419N02587M85787L92189
10960B4881402L63608L77323K95253N13290M87274M97449O49877M27332R48787
10951B9441595N56227L47524R56474L39326O85818M86487K78064N96136O67955
10942C4355606O26248P35765R26454N59336O32009O98861P64042P72277M15355
10933D0485953J038689J021943N03387Q91906J209693N35719J161065P51757J344822
$$ plain form
10924 48944934 49850407 51036946 52011046 52795097 53734662 54440540 55185106 55833274 56419733
10915 56419733 56450256 56620375 56809483 57097242 57116933 57431320 57302792 57337229 57211108 57258557
10905 57258557 57156238 57405282 57475339 57336833 57362962 57772504 57910162 58031364 58299836 58668279
10895 58668279 59124075 59440525 60114415 60911021 61275533 62235656 63168108 64005208 65190017
10886 65190017 66616407 67959151 69964264 71728486 74107097 76618303 79441316 82789209
10878 82789209 86286540 90236045 94645039 99386221 104545377 109799193 114902201 119623738
10870 119623738 124669202 128578964 131394817 133883355 135151893 135336302 134464295 132764192
10862 132764192 129954678 126481465 122644877 118122777 113170918 108200466 103028752 97686214
$$ packed form
10924D8944934R05473J186539R74100P84051R39565P05878P44566O48168N86459
10915E6419733L0523J70119J89108K87759J9691L14387j28528L4437j26121M7449
10905E7258557j02319K49044P0057j38506K6129M09542J37658J21202K68472L68443
10895E8668279M55796L16450O73890P96606L64512R60123R32452Q37100J184809
10886F5190017J426390J342744K005113J764222K378611K511206K823013L347893
10878H2789209L497331L949505M408994M741182N159156N253816N103008M721537
10870A19623738N045464L909762K815853K488538J268538J84409q72007j700103
10862A32764192k809514l473213l836588m522100m951859m970452n171714n342538
$$ plain form
10854 97686214 92763832 87518891 82618313 77711062 73191700 68828803 64686926 60710857
10846 60710857 56985013 53404493 50066044 47148414 44176502 41581159 39084649 36841847
10838 36841847 34934660 33041866 30981629 29330684 27624022 26124177 25024875 23889259
10830 23889259 22686615 21595280 20686542 19643575 18872771 17979776 17096953 16376055 15641229
10821 15641229 15401150 14693110 14313333 13695627 13398115 12996174 12758557 12493339 12054782
10812 12054782 11873819 11584131 11406744 11132366 10827059 10581988 10219158 9687812 9315700
10803 9315700 8750185 8790405 8398382 8155097 7867650 7631193 7423352 7129711 7268242 6977066
10793 6977066 6716127 6770148 6452853 6563554 6227438 6324049 5931964 6010210 6094869 5524553
$$ packed form
10854I7686214m922382n244941m900578m907251m519362m362897m141877l976069
10846F0710857l725844l580520l338449k917630k971912k595343k496510k242802
10838C6841847j907187j892794k060237j650945j706662j499845j099302j135616
10830B3889259j202644j091335r08738j042967p70804q92995q82823p20898p34826
10821A5641229k40079p08040l79777o17706k97512m01941k37617k65218m38557
10812A2054782j80963k89688j77387k74378l05307k45071l62830n31346l72112
10803I315700n65515M0220l92023k43285k87447k36457k07841k93641J38531k91176
10793F977066k60939N4021l17295J10701l36116R6611l92085P8246Q4659n70316
$$ plain form
10783 5524553 5568436 5625933 5494941 5420464 5402500 5161081 5080909 4878793 4966510 4749722
10773 4749722 4658315 4687301 4528888 4453210 4261367 4207009 4198713 4114306 4242008 4381168 4095605
10762 4095605 4160793 3983934 4054439 3898996 4120164 3847494 4088510 3731657 3919544 3944712
10752 3944712 4080375 3968013 3942100 4076159 3999251 3743690 3732227 3606777 3529864 3510655
10742 3510655 3419749 3423050 3165274 3350551 3202459 3197202 3081186 3374147 3060200 3328521
10732 3328521 3499495 3379782 3247672 3405577 3422016 3207259 3591973 3458463 3571357 3271124
10722 3271124 3460126 3360417 3229133 3482112 3184400 3307878 3178179 3189219 3206038 3062675
10712 3062675 3317549 3371172 3198210 3339634 3326507 3327448 3428609 3041371 3415508 3034073
$$ packed form
10783E524553M3883N7497j30992p4477j7964k41419q0172k02116Q7717k16788
10773D749722r1407K8986j58413p5678j91843n4358q296q4407J27702J39160k85563
10762D095605O5188j76859P0505j55443K21168k72670K41016l56853J87887K5168
10752C944712J35663j12362k5913J34059p6908k55561j1463j25450p6913j9209
10742C510655r0906L301k57776J85277j48092n257j16016K92961l13947K68321
10732C328521J70974j19713j32110J57905J6439k14757L84714j33510J12894l00233
10722C271124J89002r9709j31284K52979k97712J23478j29699J1040J6819j43363
10712C062675K54874N3623j72962J41424j3127R41J01161l87238L74137l81435
$$ plain form
10702 3034073 3492940 3223510 3209954 3521922 3088371 3227196 3065510 2994141 3047234 2851628
10692 2851628 2846413 2952295 2859667 3241765 2969737 3230533 2928989 2939770 2951556 2825266
10682 2825266 2999912 2945031 2865720 2727269 2631353 2873908 2736582 2920151 2806695 2832784
10672 2832784 2901740 2729766 2832940 2719492 2756319 2506814 2484019 2515604 2459838 2508413
10662 2508413 2465895 2591482 2339112 2240479 2335228 2242948 2446248 2307610 2517428 2451348
10652 2451348 2216759 2406188 2299845 2503081 2522074 2450792 2585136 2551822 2230178 2260371
10642 2260371 2326067 1994336 2261782 2092265 2201878 2291411 2139799 2100949 2056319 2037006
10632 2037006 2085869 2006222 1966382 2067124 1957456 2176476 1993923 2075486 2007709 2086197
$$ packed form
10702C034073M58867k69430j3556L11968m33551J38825j61686p1369N3093j95606
10692B851628n215J05882r2628L82098k72028K60796l01544J0781J1786j26290
10682B825266J74646n4881p9311j38451r5916K42555j37326J83569j13456K6089
10672B832784O8956j71974J03174j13448L6827k49505k2795L1585n5766M8575
10662B508413m2518J25587k52370r8633R4749r2280K03300j38638K09818o6080
10652B451348k34589J89429j06343K03236J8993p1282J34344l3314l21644L0193
10642B260371O5696l31731K67446j69517J09613Q9533j51612l8850m4630j9313
10632B037006M8863p9647l9840J00742j09668K19020j82553Q1563o7777P8488
$$ plain form
10622 2086197 2187376 2126386 2121113 2215579 2067418 1889870 1970867 1989528 1778977 1945348
10612 1945348 2174783 2084712 2048755 2198166 2075595 2017589 1914513 2037099 2125742 2208332
10602 2208332 1836695 2107147 2203213 1969924 2017203 2131303 2047113 1950667 2093436 1877081
10592 1877081 1867557 1996698 1976597 1829640 2089827 1860132 2015777 2093342 2042663 2059131
10582 2059131 1970489 2047902 2050256 1966042 2235165 1935153 1805302 1963129 1951296 2122589
10572 2122589 1991226 1873985 1902068 2032792 1767866 1600225 1857974 1743632 1493668 1300257
10562 1300257 1825414 1546488 1648805 1599897 1657440 1689537 1581968 1556132 1424863 1536015
10552 1536015 1442982 1362519 1490753 1621900 1816425 1587365 1470956 1564867 1215854 1420890
$$ packed form
10622B086197J01179o0990n273R4466j48161j77548Q0997J8661k10551J66371
10612A945348K29435r0071l5957J49411j22571n8006j03076J22586Q8643Q2590
10602B208332l71637K70452R6066k33289M7279J14100q4190r6446J42769k16355
10592A877081r524J29141k0101j46957K60187k29695J55645P7565n0679J6468
10582B059131q8642P7413K354q4214K69123l00012j29851J57827j1833J71293
10572B122589j31363j17241K8083J30724k64926j67641K57749j14342k49964j93411
10562A300257N25157k78926J02317m8908N7543L2097j07569k5836j31269J11152
10552A536015r3033q0463J28234J31147J94525k29060j16409R3911l49013K05036
$$ plain form
10542 1420890 1485952 1497753 1531736 1402535 1546903 1432983 1518168 1524667 1659947 1509369
10532 1509369 1549570 1566733 1739564 1555591 1683667 1486870 1733125 1712612 1744038 1825702
10522 1825702 1943463 2005656 1953896 2089776 2322905 2440990 2352276 2539630 2706485 2464844
10512 2464844 2449869 2506242 2303706 2056699 1991735 1842203 1869512 1970690 1941738 1900220
10502 1900220 1648126 1948390 1951803 2002880 1914270 1973676 2026344 1757091 2067570 2037001 2316634
10491 2316634 2242446 2472645 2498206 2379023 2427946 2843260 2739229 2521118 2599117 2276789
10481 2276789 2205323 2016790 1992971 2128483 1952575 2108258 1971564 1972103 2131793 2149619
10471 2149619 2147560 2049695 2063255 2208302 2247133 2289715 2620272 2655199 2716554 2563371 2872912
$$ packed form
10542A420890O5062J1801L3983j29201J44368j13920Q5185O499J35280j50578
10532A509369M0201J7163J72831j83973J28076j96797K46255k0513L1426Q1664
10522A825702J17761O2193n1760J35880K33129J18085q8714J87354J66855k41641
10512B464844j4975N6373k02536k47007o4964j49532K7309J01178k8952m1518
10502A900220k52094L00264L413N1077q8610N9406N2668k69253L10479l0569K79633
10491B316634p4188K30199K5561j19183M8923M15314j04031k18111P7999l22328
10481B276789p1466j88533k3819J35512j75908J55683j36694N39J59690J7826
10471B149619k059r7865J3560J45047L8831M2582L30557L4927O1355j53183L09541
$$ plain form
10460 2872912 2887833 2543791 2651532 2701815 2615623 2705534 2782725 2817202 3118485 2911669
10450 2911669 2990614 3031738 3063212 2993895 2627562 2476776 2645042 2528208 2654043 2359727
10440 2359727 2821828 2815107 2911655 3130344 3238406 3169969 3402779 3441747 3372649 3362102 3169260
10429 3169260 2705563 2379083 2166104 2273376 2275585 2388834 2171867 2199720 2410148 2251100
10419 2251100 2120384 2212375 2379484 2298306 2405954 2555415 2501501 2843311 2645195 3064230
10409 3064230 3376215 3684050 3703375 4078212 4411014 4541234 4619126 4350731 4680725 4606824
10399 4606824 4759866 4867377 4877664 5132203 5243243 5769477 5987424 6296808 6659342 6991556
10389 6991556 6889936 7007783 7163757 7162105 7150743 7200025 6837212 6594649 6726431 6605876
$$ packed form
10460B872912J4921l44042J07741N0283q6192Q9911P7191L4477L01283k06816
10450B911669P8945M1124L1474o9317l66333j50786J68266j16834J25835k94316
10440B359727M62101o721R6548K18689J08062o8437K32810L8968o9098j0547j92842
10429C169260m63697l26480k12979J07272K209J13249k16967K7853K10428j59048
10419B251100j30716R1991J67109q1178J07648J49461n3914L41810j98116M19035
10409C064230L11985L07835J9325L74837L32802J30220P7892k68395L29994p3901
10399D606824J53042J07511J0287K54539J11040N26234K17947L09384L62534L32214
10389F991556j01620J17847J55974j652j1362M9282l62813k42563J31782j20555
$$ plain form
10379 6605876 6482483 6403730 6357218 6434685 6283603 6432335 6607361 6723385 6619795 6702391
10369 6702391 6644747 6696856 6839962 7065859 7215601 7556977 7287330 6983444 6858911 6778475
10359 6778475 6735511 6644758 6395447 6417894 6283296 6284896 5724927 5830836 5866282 5682818
10349 5682818 5243892 5243400 4997698 4825749 4838604 4566950 4366820 4198818 4673550 4349300
10339 4349300 4616169 4328113 4580224 4816244 4828072 4656219 4866662 4746814 4862715 4601999
10329 4601999 4702289 4520986 4514944 4692453 4480192 4581553 4723386 4640839 4709795 4583339
10319 4583339 4720110 4746422 4643085 4859243 4672492 4605761 4691553 4618882 4747037 5048747
10309 5048747 5052807 5131105 5216233 5480070 5491114 5520698 5378862 5380658 5486179 5206054 5267616
$$ packed form
10379F605876j23393p8753m6512P7467j51082J48732J75026J16024j03590Q2596
10369F702391n7644N2109J43106K25897J49742L41376k69647l03886j24533q0436
10359F778475m2964r0753k49311K2447j34598J600n59969J05909L5446j83464
10349E682818m38926m92k45702j71949J2855k71654k00130j68002M74732l24250
10339D349300K66869k88056K52111K36020J1828j71853K10443j19848J15901k60716
10329D601999J00290j81303o042J77509k12261J01361J41833q2547O8956j26456
10319D583339J36771K6312j03337K16158j86751o6731Q5792p2671J28155L01710
10309E048747M060P8298Q5128K63837J1044K9584j41836J796J05521k80125O1562
$$ [...]
##END NTUPLES=NMR SPECTRUM
##END=
