##TITLE=Coffee green (M3-ROVE20 + 1.5mL buffer 50/50,  450uL extracto + 50uL (D2O+TMS))
without heating, vortex and centrifuged, temperature 0oC.
##JCAMPDX= 6.0         $$ Bruker NMR JCAMP-DX V2.0
##DATA TYPE= NMR SPECTRUM
##DATA CLASS= NTUPLES
##ORIGIN= Bruker BioSpin GmbH
##OWNER= Administrator
$$ 1.72 TOPSPIN		Version 2.1
$$ 2012-05-22 16:12:27.075 -0700  Administrator@X
$$ Compression mode = diff/dup
##.OBSERVE FREQUENCY= 400.13188198
##.OBSERVE NUCLEUS= ^1H
##.ACQUISITION MODE= SIMULTANEOUS (DQD)
##.ACQUISITION SCHEME= undefined
##.AVERAGES= 64
##.DIGITISER RES= 22
##SPECTROMETER/DATA SYSTEM= spect
##.PULSE SEQUENCE= noesygppr1d
##.SOLVENT NAME= H2O+D2O
##.SHIFT REFERENCE= INTERNAL, H2O+D2O, 1, 14.97969
##AUDIT TRAIL= $$ (NUMBER, WHEN, WHO, WHERE, PROCESS, VERSION, WHAT)
$$ ##TITLE= Audit trail, TOPSPIN		Version 2.1
$$ ##JCAMPDX= 5.01
$$ ##ORIGIN= Bruker BioSpin GmbH
$$ ##OWNER= Administrator
$$ $$ c:\Bruker\TOPSPIN/data/jwist/nmr/11-coffee-green-quantification-2/101/pdata/1/auditp.txt
$$ ##AUDIT TRAIL=  $$ (NUMBER, WHEN, WHO, WHERE, PROCESS, VERSION, WHAT)
(   1,<2011-11-17 15:52:41.997 -0500>,<Administrator>,<TOPSPIN>,<go>,<TOPSPIN 2.1>,
      <created by zg
	started at 2011-11-17 15:43:47.325 -0500,
	POWCHK enabled, PULCHK disabled,
       configuration hash MD5:
       DA 63 81 1B EF 4C B5 72 B4 DF EA D9 B4 DB 4C 08
       data hash MD5: 64K
       A1 A2 1B 02 52 BF 48 3E A1 21 40 10 D5 2D 32 CB>)
(   2,<2011-11-17 18:20:07.091 -0500>,<Administrator>,<TOPSPIN>,<proc1d>,<TOPSPIN 2.1>,
      <Start of raw data processing
       efp LB = 0 FT_mod = 6 PKNL = 1 PHC0 = 0 PHC1 = 0 SI = 32K 
       data hash MD5: 32K
       CB 02 BA A6 A5 4A 10 31 E6 CE AB 12 4D AF 40 45>)
(   3,<2011-11-17 18:20:07.450 -0500>,<Administrator>,<TOPSPIN>,<proc1d>,<TOPSPIN 2.1>,
      <pk PHC0 = 19.75342 PHC1 = 0 
       data hash MD5: 32K
       9C AC E6 C1 B0 8F CD 91 A9 BB 10 D3 2C 4C 62 FF>)
$$ ##END=
$$ 
$$ $$ hash MD5
$$ $$ 33 FF 60 BA 67 70 31 28 BB A3 B3 23 B0 96 AF 0C
##$RELAX= 
##$RELAX= 
##$RELAX= 
##$RELAX= 
##$RELAX= 
##$RELAX= 
$$ Bruker specific parameters
$$ --------------------------
##$DU= <Z:>
##$EXPNO= 101
##$NAME= <11-coffee-green-quantification-2>
##$PROCNO= 1
##$TYPE= <nmr>
##$USER= <jwist>
##$ACQT0= -8.185784082726
##$AMP= (0..31)
100 100 100 100 100 100 100 100 100 100 100 100 100 100 100 100 100 100
100 100 100 100 100 100 100 100 100 100 100 100 100 100
##$ANAVPT= -1
##$AQSEQ= 0
##$AQ_mod= 3
##$AUNM= <au_prof>
##$AUTOPOS= <>
##$BF1= 400.13
##$BF2= 400.13
##$BF3= 400.13
##$BF4= 400.13
##$BF5= 400.13
##$BF6= 400.13
##$BF7= 400.13
##$BF8= 400.13
##$BYTORDA= 0
##$CFDGTYP= 0
##$CFRGTYP= 9
##$CHEMSTR= <none>
##$CNST= (0..63)
1 1 145 1 1 1 1 1 1 1 1 1 1 1 1 1 1 1 1 1 1 1 1 1 1 1 1 1 1 1 1 1 1 1 1
1 1 1 1 1 1 1 1 1 1 1 1 1 1 1 1 1 1 1 1 1 1 1 1 1 1 1 1 1
##$CPDPRG= <>
##$CPDPRG1= <>
##$CPDPRG2= <>
##$CPDPRG3= <>
##$CPDPRG4= <mlev>
##$CPDPRG5= <mlev>
##$CPDPRG6= <mlev>
##$CPDPRG7= <mlev>
##$CPDPRG8= <mlev>
##$CPDPRGB= <>
##$CPDPRGT= <>
$$ [...]
150 150 150 150 150 150 150 150
##$TP07= 0
##$TPNAME0= <>
##$TPNAME1= <>
##$TPNAME2= <>
##$TPNAME3= <>
##$TPNAME4= <>
##$TPNAME5= <>
##$TPNAME6= <>
##$TPNAME7= <>
##$TPOAL= (0..7)
0.5 0.5 0.5 0.5 0.5 0.5 0.5 0.5
##$TPOFFS= (0..7)
0 0 0 0 0 0 0 0
##$TUNHIN= 0
##$TUNHOUT= 0
##$TUNXOUT= 0
##$USERA1= <user>
##$USERA2= <user>
##$USERA3= <user>
##$USERA4= <user>
##$USERA5= <user>
##$V9= 5
##$VALIST= <valist>
##$VCLIST= <CCCCCCCCCCCCCCC>
##$VD= 0
##$VDLIST= <DDDDDDDDDDDDDDD>
##$VPLIST= <PPPPPPPPPPPPPPP>
##$VTLIST= <TTTTTTTTTTTTTTT>
##$WBST= 2048
##$WBSW= 25
##$XGAIN= (0..3)
0 0 0 0
##$XL= 0
##$YL= 0
##$YMAX_a= 5641196
##$YMIN_a= -2304021
##$ZGOPTNS= <>
##$ZL1= 120
##$ZL2= 120
##$ZL3= 120
##$ZL4= 120
##$ABSF1= 0
##$ABSF2= 0
##$ABSG= 0
##$ABSL= 0
##$ALPHA= 0
##$AQORDER= 0
##$ASSFAC= 0
##$ASSFACI= 0
##$ASSFACX= 0
##$ASSWID= 0
##$AUNMP= <proc_prof1d>
##$AXLEFT= 0
##$AXNAME= <>
##$AXNUC= <1H>
##$AXRIGHT= 0
##$AXTYPE= 0
##$AXUNIT= <>
##$AZFE= 0.1
##$AZFW= 0.1
##$BCFW= 0
##$BC_mod= 0
##$BYTORDP= 0
##$COROFFS= 0
##$CY= 15
##$DATMOD= 1
##$DC= 0
##$DFILT= <>
##$DTYPP= 0
##$F1P= 14.9796895980835
##$F2P= -5.57284135567231
##$FCOR= 0.5
##$FTSIZE= 32768
##$FT_mod= 6
##$GAMMA= 0
##$GB= 0
##$INTBC= 1
##$INTSCL= 1
##$ISEN= 128
##$LB= 0
##$LEV0= 0
##$LPBIN= 0
##$MAXI= 10000
##$MC2= 0
##$MEAN= 0
##$ME_mod= 0
##$MI= 0
##$NCOEF= 0
##$NC_proc= -6
##$NLEV= 6
##$NOISF1= 0
##$NOISF2= 0
##$NSP= 0
##$NTH_PI= 0
##$NZP= 0
##$OFFSET= 14.97969
##$PC= 1
##$PHC0= 19.75342
##$PHC1= 0
##$PH_mod= 1
##$PKNL= yes
##$PPARMOD= 0
##$PPDIAG= 0
##$PPIPTYP= 0
##$PPMPNUM= 2147483647
##$PPRESOL= 1
##$PSCAL= 4
##$PSIGN= 0
##$PYNMP= <proc.py>
##$REVERSE= no
##$SF= 400.13
##$SI= 32768
##$SIGF1= 0
##$SIGF2= 0
##$SINO= 400
##$SIOLD= 32768
##$SPECTYP= <>
##$SREGLST= <1H.H2O+D2O>
##$SSB= 0
##$STSI= 32768
##$STSR= 0
##$SW_p= 8223.68421052631
##$SYMM= 0
##$S_DEV= 0
##$TDeff= 65536
##$TDoff= 0
##$TI= <>
##$TILT= no
##$TM1= 0
##$TM2= 0
##$TOPLEV= 0
##$USERP1= <user>
##$USERP2= <user>
##$USERP3= <user>
##$USERP4= <user>
##$USERP5= <user>
##$WDW= 1
##$XDIM= 32768
##$YMAX_p= 412380585
##$YMIN_p= -38280532
##$CURPLOT= <Network HP LaserJet P1505>
##$CURPRIN= <$Network HP LaserJet P1505>
##$DFORMAT= <normdp>
##$LAYOUT= <+/1D_H.xwp>
##$LFORMAT= <normlp>
##$PFORMAT= <normpl>
##$SURQMSG= 1
$$ End of Bruker specific parameters
$$ ---------------------------------
##NTUPLES= NMR SPECTRUM
##VAR_NAME=  FREQUENCY,     SPECTRUM/REAL,   SPECTRUM/IMAG
##SYMBOL=    X,             R,               I
##VAR_TYPE=  INDEPENDENT,   DEPENDENT,       DEPENDENT
##VAR_FORM=  AFFN,          ASDF,            ASDF
##VAR_DIM=   32768,         32768,           32768
##UNITS=     HZ,            ARBITRARY UNITS, ARBITRARY UNITS
##FACTOR=    0.250966925370066, 1,           1
##FIRST=     8223.43324360094, 70357,        -404713
##LAST=      0,             102242,          -266130
##MIN=       0,             -38280532,       0
##MAX=       8223.43324360094, 412380585,    0
$$ Real data points
##PAGE= N=1
##DATA TABLE= (X++(R..R)), XYDATA
$$ [...]
$$ plain form
19641 1720598 1599812 1748443 1600167 1625527 1957520 1911033 1821555 1747798 1779102 1892749
19631 1892749 1630623 1702437 1799050 1772296 1645024 1721083 1618551 1695793 1731517 1513854
19621 1513854 1559529 1619974 1807247 1598446 1598167 1653784 1804038 1645207 1667761 1599128 1640436
19610 1640436 1466397 1578309 1564912 1559343 1635674 1332543 1341220 1347209 1464479 1450648 1538623
19599 1538623 1699815 1406161 1494224 1407151 1497507 1377318 1576883 1291982 1461568 1389911
19589 1389911 1363875 1166152 1129746 1502620 1311984 1577869 1273706 1342885 1638794 1472176
19579 1472176 1521995 1279916 1465899 1315465 1264024 1426684 1277424 1184458 1375398 1478401
19569 1478401 1400768 1359725 1260030 1364876 1244385 1428310 1435292 1290891 1214983 1456010
$$ packed form
19641A720598j20786J48631j48276K5360L31993m6487q9478p3757L1304J13647
19631A892749k62126P1814R6613k6754j27272P6059j02532P7242L5724k17663
19621A513854M5675O0445J87273k08801k79N5617J50254j58831K2554o8633M1308
19610A640436j74039J11912j3397n569P6331l03131Q677N989J17270j3831Q7975
19599A538623J61192k93654Q8063q7073R0356j20189J99565k84901J69586p1657
19589A389911k6036j97723l6406L72874j90636K65885l04163O9179K95909j66618
19579A472176M9819k42079J85983j50434n1441J62660j49260r2966J90940J03003
19569A478401p7633m1043r9695J04846j20491J83925O982j44401p5908K41027
$$ plain form
19559 1456010 1424508 1218714 1354579 1424504 1392732 1405476 1305241 1120433 1343988 1436866
19549 1436866 1237546 1427457 1473895 1333343 1450103 1470870 1435500 1264891 1408226 1414882
19539 1414882 1508025 1125070 1415549 1338618 1147253 1172847 1550221 1484870 1359910 1305955
19529 1305955 1399996 1537477 1211451 977755 1206348 1414388 1452171 1455910 1047188 1343146
19519 1343146 1473179 1283114 1350732 1445148 1114367 1329385 1465054 1349544 1373735 1044920
19509 1044920 1300728 1326149 1148901 1064282 1315473 1300297 1098301 1396184 1167275 1155570
19499 1155570 1324938 1124520 1121489 1148356 1038155 1279751 1366227 1157430 1352492 1300169
19489 1300169 1283162 1228666 1340205 1475529 1222760 1039315 1219946 999199 1192500 890041
$$ packed form
19559A456010l1502k05794J35865O9925l1772J2744j00235j84808K23555R2878
19549A436866j99320J89911M6438j40552J16760K0767l5370j70609J43335O656
19539A414882R3143l82955K90479p6931j91365K5594L77374o5351j24960n3955
19529A305955R4041J37481l26026k33696K28593K08040L7783L739m08722K95958
19519A343146J30033j90065O7618R4416l30781K15018J35669j15510K4191l28815
19509A044920K55808K5421j77248q4619K51191j5176k01996K97883k28909j1705
19499A155570J69368k00418l031K6867j10201K41596Q6476k08797J95062n2323
19489A300169j7007n4496J11539J35324k52769j83445J80631k20747J93301l02459
$$ plain form
19479 890041 1038765 1095744 1317685 1259809 1162979 1107068 1026804 1076359 1112393 1028826 1066088
19468 1066088 1077261 1019448 1028890 1085197 1092408 1018625 926785 812494 968123 869868 730486
19457 730486 934070 844583 1316022 961107 877218 877073 868695 652945 739266 844803 828716
19446 828716 801014 839900 954227 1026466 937572 631458 946697 893572 992785 963167 920235
19435 920235 1020854 786202 938940 741355 908997 822224 695437 862667 982700 1163334
19425 1163334 1047084 998491 799801 662054 876232 939680 823231 787268 847259 752168
19415 752168 775362 889744 904844 831949 793657 822304 752492 820020 901952 791718 772773
19404 772773 911311 1124125 856911 964310 660318 967879 823991 915173 1048842 820773
$$ packed form
19479H90041J48724N6979K21941n7876r6830n5911q0264M9555L6034q3567L7262
19468A066088J1173n7813R442N6307P211p3783r1840j14291J55629r8255j39382
19457G30486K03584q9487M71439l54915q3889j45q378k15750Q6321J05537j6087
19446H28716k7702L8886J14327P2239q8894l06114L15239n3125R9213k9618m2932
19435I20235J00619k34652J52738j97585J67642q6773j26787J67230J20033J80634
19425A163334j16250m8593j98690j37747K14178O3448j16449l5963N9991r5091
19415G52168K3194J14382J5100p2895l8292K8647o9812O7528Q1932j10234j8945
19404G72773J38538K12814k67214J07399l03992L07561j43888R1182J33669k28069
$$ plain form
19394 820773 871775 1105833 719740 881399 720557 884792 782491 795927 1007346 895216
19384 895216 757342 747111 952632 768601 838998 868553 1064412 1002150 1035407 1000570 949447
19373 949447 685629 826145 871604 910508 896276 733117 835416 935984 663017 812622
19363 812622 655910 624820 794122 749596 731360 679473 812849 711319 851663 829642
19353 829642 877311 825713 603107 869090 788566 877706 832462 664516 706723 765316 862281
19342 862281 933790 915781 999578 755775 734165 936696 780330 1085507 987381 777100
19332 777100 925187 969479 743237 809833 751948 780214 1113659 1041115 834543 744213 822481
19321 822481 908207 1061090 781357 857336 1051984 946791 907213 950473 850011 980796
$$ packed form
19394H20773N1002K34058l86093J61659j60842J64235j02301J3436K11419j12130
19384H95216j37874j0231K05521j84031P0397K9555J95859o2262L3257l4837n1123
19373I49447k63818J40516M5459L8904j4232j63159J02299J00568k72967J49605
19363H12622j56712l1090J69302m4526j8236n1887J33376j01530J40344k2021
19353H29642M7669n1598k22606K65983q0524Q9140m5244j67946M2207N8593R6965
19342H62281P1509j8009Q3797k43803k1610K02531j56366L05177r8126k10281
19332G77100J48087M4292k26242O6596n7885K8266L33445p2544k06572r0330P8268
19321H22481Q5726J52883k79733P5979J94648j05193l9578M3260j00462J30785
$$ plain form
19311 980796 990791 806972 858171 959614 1087474 966371 861182 852059 769907 965711 1041110
19300 1041110 828317 795916 885148 1128501 696714 672315 753203 561995 712948 601794
19290 601794 674406 752529 591047 738438 635207 634036 908431 822614 978072 674497
19280 674497 640857 726326 766366 859425 847062 726719 748715 750051 530789 765608 826439
19269 826439 956048 762446 677636 915102 709872 970413 570370 938778 754575 763372
19259 763372 721635 938998 773793 770351 762613 952643 664661 765177 671357 890630 759646
19248 759646 867239 1128692 848476 734907 642426 1036878 919388 1010117 1445305 1384815
19238 1384815 1392806 1374173 1375569 1497947 1433189 1060439 813846 920144 802579 736396 843405
$$ packed form
19311I80796R995j83819N1199J01443J27860j21103j05189r123q2152J95804P5399
19300A041110k12793l2401Q9232K43353m31787k4399Q0888j91208J50953j11154
19290F01794P2612P8123j61482J47391j03231j171K74395q5817J55458l03575
19280F74497l3640Q5469M0040R3059j2363j20343K1996J336k19262K34819O0831
19269H26439J29609j93602q4810K37466k05230K60541m00043L68408j84203Q797
19259G63372m1737K17363j65205l442p738J90030k87982J00516r3820K19273j30984
19248G59646J07593K61453k80216j13569r2481L94452j17490R0729M35188o0490
19238A384815P991j8633J396J22378o4758l72750k46593J06298j17565o6183J07009
$$ plain form
19227 843405 915845 881719 846708 699868 723821 647084 651073 683677 680290 857004 775530
19216 775530 555568 814962 690987 644745 639393 671310 693012 864752 670308 689007 880163
19205 880163 584300 661636 685405 490499 626393 773123 838184 597265 495758 864460
19195 864460 695997 1006823 763878 849773 740982 676406 767418 789987 823336 672911
19185 672911 683622 747487 797977 702732 627865 661063 917265 673889 745359 907728 842740
19174 842740 1082135 826249 1207015 1060372 1280230 1245096 938539 1103006 1329806 1058815
19164 1058815 1122514 1088251 1068178 1063434 1081152 1205039 1066004 1207615 1004826 1171591
19154 1171591 1316892 1356231 1288903 1136926 943167 990443 1116309 1136804 919300 866661
$$ packed form
19227H43405P2440l4126l5011j46840K3953p6737L989L2604l387J76714q1474
19216G75530k19962K59394j23975m6242n352L1917K1702J71740j94444J8699J91156
19205H80163k95863P7336K3769j94906J35894J46730O5061k40919j01507L68702
19195H64460j68463L10826k42945Q5895j08791o4576R1012K2569L3349j50425
19185F72911J0711O3865N0490r5245p4867L3198K56202k43376P1470J62369o4988
19174H42740K39395k55886L80766j46643K19858l5134l06557J64467K26800k70991
19164A058815O3699l4263k0073m744J7718J23887j39035J41611k02789J66765
19154A171591J45301L9339o7328j51977j93759M7276J25866K0495k17504n2639
$$ plain form
19144 866661 892913 1104678 738977 896218 1020683 1164406 958916 776026 1025865 1156421
19134 1156421 761514 943544 956389 865807 1018777 975878 932800 924164 900921 1038644 1234377
19123 1234377 1194267 970488 1086944 1065624 1104405 1124141 1077645 1047590 1112804 1180863 1316962
19112 1316962 1160823 1384710 1334030 1601125 1581659 1772993 1926371 2151075 2212688 2603754
19102 2603754 2796863 3080357 3734388 4063998 4127899 4480661 4308615 4323827 4197831 3662685
19092 3662685 3366489 3212898 2563333 2383604 2118194 1979298 1808809 1647522 1798931
19083 1798931 1608033 1687549 1796461 1499367 1934057 1735523 2032815 2203742 2662377 2966529
19073 2966529 3632637 3701374 3981061 4170206 3828529 4105444 3795281 3507496 3558434 3425123
$$ packed form
19144H66661K6252K11765l65701J57241J24465J43723k05490j82890K49839J30556
19134A156421l94907J82030J2845r0582J52970m2899m3078q636k3243J37723J95733
19123A234377m0110k23779J16456k1320L8781J9736m6496l0055O5214O8059J36099
19112A316962j56139K23887n0680K67095j9466J91334J53378K24704O1613L91066
19102B603754J93109K83494O54031L29610O3901L52762j72046J5212j25996n35146
19092C662685k96196j53591o49565j79729k65410j38896j70489j61287J51409
19083A798931j90898P9516J08912k97094M34690j98534K97292J70927M58635L04152
19073B966529O66108O8737K79687J89145l41677K76915l10163k87785N0938j33311
$$ plain form
19063 3425123 3540370 3778696 4088966 4358728 4631319 4484239 4648777 4513839 4089272
19054 4089272 3799828 3230317 2774047 2629864 2333976 2359446 2107036 2034296 1901955 2054554
19044 2054554 1785721 1953756 1970319 2210199 2446256 2522803 2871500 3383533 3615064 4204111
19034 4204111 4325101 4445403 4331948 4448731 3908021 3680152 3078189 2736139 2523616
19025 2523616 2004503 2268599 2029685 1901540 1904732 1847377 1931648 1997613 1871489 2128875
19015 2128875 2154997 2485182 2785883 3153217 3230863 3867966 4172391 4551623 4818158 4917854
19005 4917854 4779849 4569390 4820684 4709276 4635672 5079464 5334861 6037614 6293859 7156537
18995 7156537 7678337 8375306 9647127 10610821 11667879 13096620 14764015 16422128 18453800
$$ packed form
19063C425123J15247K38326L10270K69762K72591j47080J64538j34938m24567
19054D089272k89444n69511m56270j44183k95888K5470k52410p2740j32341J52599
19044B054554k68833J68035J6563K39880K36057P6547L48697N12033K31531N89047
19034D204111J20990J20302j13455J16783n40710k27869o01963l42050k12523
19025B523616n19113K64096k38914j28145L192n7355Q4271O5965j26124K57386
19015B128875K6122L30185L00701L67334P7646O37103L04425L79232K66535R9696
19005D917854j38005k10459K51294j11408p3604M43792K55397P02753K56245Q62678
18995G156537N21800O96969J271821R63694J057058J428741J667395J658113K031672
$$ plain form
18986 18453800 19441570 20261772 20617469 20118480 19153208 17519767 15271991 13196670 10952213
18977 10952213 9435900 8033971 6789506 5884073 5149197 4502593 3928165 3566971 3327972
18968 3327972 3246984 2559450 2507306 2246076 2150850 2147988 1910891 1828179 1836298 1759242 1678873
18957 1678873 1548082 1705471 1653434 1681394 1620575 1600221 1582312 1773371 1798876 1823438 2122057
18946 2122057 1782188 1852966 2245584 1934213 2133610 2231648 2038981 2479620 2264100 2460930
18936 2460930 2951677 3071914 3396895 3624727 4063685 4777322 5320250 6507909 7678699
18927 7678699 9211980 10901379 13147813 15064072 16500091 17620124 18115482 18224059
18919 18224059 17834958 16464095 14912317 13090640 11124679 9239395 7783234 6483440
$$ packed form
18986A8453800R87770Q20202L55697m98989r65272j633441k247776k075321k244457
18977A0952213j516313j401929j244465r05433p34876o46604n74428l61194k38999
18968C327972q0988o87534n2144k61230r5226k862k37097q2712Q119p7056q0369
18957A678873j30791J57389n2037K7960o0819k0354j7909J91059K5505K4562K98619
18946B122057l39869P0778L92618l11371J99397R8038j92667M40639k15520J96830
18936B460930M90747J20237L24981K27832M38958P13637N42928J187659J170790
18927G678699J533281J689399K246434J916259J436019J120033M95358J08577
18919A8224059l89101j370863j551778j821677j965961j885284j456161j299794
$$ plain form
18911 6483440 5364919 4662579 4070095 3620527 3133197 2578266 2369175 2222667 2050389
18902 2050389 1864735 1816230 1478924 1513165 1294135 1259014 1098018 1214346 1068930 1179080
18892 1179080 1095443 977016 1001970 883026 771293 1023063 728517 780119 957502 681233
18882 681233 750238 848237 766562 808232 693148 916019 795498 629223 631498 495885 853118
18871 853118 790241 783796 741820 989257 634955 786259 828857 793361 918281 844629 776173
18860 776173 904836 660675 1012473 698752 790241 610550 612704 845661 778749 775725 722371
18849 722371 638869 499998 614840 818820 686601 798743 981906 658844 721165 656025
18839 656025 516483 766328 831001 574546 467818 605441 676190 668018 883576 864555
$$ packed form
18911F483440j118521p02340n92484m49568m87330n54931k09091j46508j72278
18902B050389j85654m8505l37306L4241k19030l5121j60996J16328j45416J10150
18892A179080q3637j18427K4954j18944j11733K51770k94546N1602J77383k76269
18882F81233O9005R7999q1675M1670j15084K22871j20521j66275K275j35613L57233
18871H53118o2877o445m1976K47437l54302J51304M2598l5496J24920p3652o8456
18860G76173J28663k44161L51798l13721R1489j79691K154K32957o6912l024n3354
18849G22371q3502j38871J14842K03980j32219J12142J83163l23062O2321o5140
18839F56025j39542K49845O4673k56455j06728J37623P0749q172K15558j9021
$$ plain form
18829 864555 647539 584550 799827 898257 671475 767460 502790 621636 695468 617625
18819 617625 624312 633971 528154 702632 572726 638450 669684 610725 702044 793638 582691
18808 582691 933589 635139 881734 517251 618872 614385 626960 736461 690108 834589
18798 834589 828281 660670 854344 673125 963272 853998 619554 845616 857458 895919
18788 895919 768470 718715 817209 841368 819075 852884 709256 930832 1253101 731351
18778 731351 839890 602860 685984 774100 866627 857427 847342 685152 854823 668003 884716
18767 884716 667151 874324 750868 676778 840792 592479 703903 728098 695381 738881
18757 738881 560635 579271 453372 746455 821967 690972 632843 556798 546614 633544 688146
$$ packed form
18829H64555k17016o2989K15277R8430k26782R5985k64670J18846P3832p7843
18819F17625O687R659j05817J74478j29906O5724L1234n8959R1319R1594k10947
18808E82691L50898k98450K46595l64483J01621m487J2575J09501m6353J44481
18798H34589o308j67611J93674j81219K90147j09274k34444K26062J1842L8461
18788H95919j27449m9755R8494K4159k2293L3809j43628K21576L22269n21750
18778G31351J08539k37030Q3124Q8116R2527r200j0085j62190J69671j86820K16713
18767H84716k17565K07173j23456p4090J64014k48313J11424K4195l2717M3500
18757G38881j78246J8636j25899K93083P5512j30995n8129p6045j0184Q6930N4602
$$ plain form
18746 688146 744299 717176 522809 776426 844787 750978 401444 614891 818449 680936
18736 680936 622496 733647 612350 791939 769713 625627 854987 652188 688382 866880
18726 866880 896637 693221 591129 780656 857090 643805 713860 797920 710917 602319
18716 602319 785815 738592 733192 858038 927180 670880 705794 563308 599726 777879 643794
18705 643794 586975 807744 584687 756416 775521 694202 657234 573411 677922 522161
18695 522161 747258 660502 683193 735626 737504 881951 718087 615587 470916 579943
18685 579943 758468 765669 317314 707319 857039 697809 662552 555588 702342 657503
18675 657503 636106 782058 398965 688574 813486 851957 631430 557244 826448 673634
$$ packed form
18746F88146N6153k7123j94367K53617O8361r3809l49534K13447K03558j37513
18736F80936n8440J11151j21297J79589k2226j44086K29360k02799L6194J78498
18726H66880K9757k03416j02092J89527P6434k13285P0055Q4060q7003j08598
18716F02319J83496m7223n400J24846O9142k56300L4914j42486L6418J78153j34085
18705F43794n6819K20769k23057J71729J9105q1319l6968q3823J04511j55761
18695E22161K25097q6756K2691N2433J878J44447j63864j02500j44671J09027
18685E79943J78525P201C17314L90005J49720j59230l5257j06964J46754m4839
18675F57503k1397J45952l83093K89609J24912L8471k20527p4186K69204j52814
$$ plain form
18665 673634 567694 859083 602474 374736 632821 913811 593421 774719 774216 768828
18655 768828 584317 673288 638424 578277 765263 545729 594671 548334 754962 737681 673609
18644 673609 562168 634486 641164 506001 507957 702535 744431 644405 740605 604204 513588
18633 513588 715892 619814 768071 609955 700602 414595 799356 650275 601023 537551
18623 537551 732353 790323 860089 618058 628115 376935 647346 438468 600029 469363
18613 469363 595849 667463 719396 486196 575572 658747 671758 574989 707224 576992 720739
18602 720739 604480 891654 767653 699784 811276 650159 665029 937293 827799 847441
18592 847441 805774 693258 803908 760066 688173 830312 819637 853749 1036446 845760
$$ packed form
18665F73634j05940K91389k56609k27738K58085K80990l20390J81298n03n388
18655G68828j84511Q8971l4864o0147J86986k19534M8942m6337K06628j7281o4072
18644F73609j11441P2318O678j35163J956J94578M1896j00026R6200j36401r0616
18633E13588K02304r6078J48257j58116R0647k86007L84761j49081m9252o3472
18623E37551J94802N7970O9766k42031J0057k51180K70411k08878J61561j30666
18613D69363J26486P1614N1933k33200Q9376Q3175J3011r6769J32235j30232J43747
18602G20739j16259K87174j24001o7869J11492j61117J4870K72264j09494J9642
18592H47441m1667j12516J10650m3842p1893J42139j0675L4112J82697j90686
$$ plain form
18582 845760 946310 655061 629951 727868 690089 554083 624206 760206 826315 756965 524379
18571 524379 1034529 437122 572837 514592 889405 649534 739200 417229 457612 517891
18561 517891 532018 655844 568431 511127 630802 835144 642823 811303 420570 653866
18551 653866 617410 645950 599198 524508 663825 551228 532697 650120 329671 756378
18541 756378 637581 548026 366406 593747 533586 494194 578690 738882 491915 562859
18531 562859 381125 413342 663573 494021 792772 547739 634889 648006 593951 498385
18521 498385 490703 540861 755090 527199 464849 269077 427491 718073 743974 401278
18511 401278 349744 392701 645063 724130 602905 500103 584576 550124 690664 708215 764902
$$ packed form
18582H45760J00550k91249k5110R7917l7779j36006P0123J36000O6109o9350k32586
18571E24379N10150D37122J35715n8245L74813k39871Q9666l21971M0383O0279
18561E17891J4127J23826q7413n7304J19675K04342j92321J68480l90733K33296
18551F53866l6456K8540m6752p4690J39317j12597j8531J17423l20449M26707
18541G56378j18797q9555j81620K27341o0161l9392Q4496J60192k46967P0944
18531E62859j81734L2217K50231j69552K98751k45033Q7150J3117n4055r5566
18521D98385p682N0158K14229k27891o2350j95772J58414K90582K5901l42696
18511D01278n1534M2957K52362P9067j21225j02802Q4473l4452J40540J7551N6687
$$ plain form
18500 764902 609139 503205 489007 823038 506252 575757 352721 479968 583543 643082
18490 643082 724358 666989 433244 433677 610722 552169 609769 704385 665122 336732 672261
18479 672261 598817 683063 207908 714228 440156 533619 469125 720888 722967 627413 748568
18468 748568 587771 707939 453148 776468 597491 675207 555512 621604 757873 758514
18458 758514 785338 844254 715727 503464 872408 824492 817738 768593 708385 890244 907499
18447 907499 791986 827079 715790 750806 614692 680650 547421 611687 521046 717113
18437 717113 676359 565706 513286 571577 581478 674706 549694 785369 753324 652076 652895
18426 652895 868057 936264 874474 635233 657459 932387 973226 683645 851399 778090
$$ packed form
18500G64902j55763j05934j4198L34031l16786O9505k23036J27247J03575N9539
18490F43082Q1276n7369k33745M33J77045n8553N7600R4616l9263l28390L35529
18479F72261p3444Q4246B07908N06320k74072R3463o4494K51763K079r5554J21155
18468G48568j60797J20168k54791L23320j78977P7716j19695O6092J36269O41
18458G58514K6824N8916j28527k12263L68944m7916o754m9145o0208J81859J7255
18447I07499j15513L5093j11289L5016j36114O5958j33229O4266r0641J96067
18437G17113m0754j10653n2420N8291R901R3228j25012K35675l2045j01248Q19
18426F52895K15162O8207o1790k39241K2226K74928M0839k89581J67754p3309
$$ plain form
18416 778090 716785 1005825 437991 808913 564097 519250 523686 655293 690754 732543 643216
18405 643216 468961 680038 401208 491505 739522 600952 556566 454335 488936 427464
18395 427464 501257 728857 378211 606656 599263 658074 528459 456387 652333 570973 426598
18384 426598 519404 631702 466590 569590 372889 465341 550739 362271 372671 304092
18374 304092 353155 236035 377260 658241 547223 638111 528315 507156 476645 529533
18364 529533 664720 568107 750986 614704 503147 562971 670625 548960 581412 405817
18354 405817 513012 613100 725983 616460 669095 613954 517671 816530 621260 587802
18344 587802 665893 659225 816374 906859 577399 669187 701375 631915 732980 468705 655732
$$ packed form
18416G78090o1305K89040D37991L70922k44816m4847M436J31607L5461M1789q9327
18405F43216j74255K11077k78830R0297K48017j38570m4386j02231L4601o1472
18395D27464P3793K27600l50646K28445p393N8811j29615p2072J95946q1360j44375
18384D26598R2806J12298j65112J03000j96701R2452Q5398j88468J0400o8579
18374C04092M9063j17120J41225K80981j11018R0888j09796k1159l0511N2888
18364E29533J35187r6613J82879j36282j11557N9824J07654j21665L2452j75595
18354D05817J07195J00088J12883j09523N2635n5141r6283K98859j95270l3458
18344E87802P8091o668J57149R0485l29460R1788L2188o9460J01065k64275J87027
$$ plain form
18333 655732 773173 683772 604868 572012 667507 460678 560129 563727 454712 274346 595630
18322 595630 530521 707666 491278 614838 665556 463927 823022 811904 424561 918052
18312 918052 706430 792861 652287 726209 890153 575966 566992 564652 418495 505039 638943
18301 638943 292395 421994 476701 451303 341784 437476 571704 740085 531239 527162
18291 527162 375700 585235 500882 662395 617646 586868 461280 567994 493118 547699
18281 547699 670249 520315 787667 697051 668430 576879 526672 599379 705261 585641
18271 585641 597020 569310 395316 704823 617515 460827 724032 424262 531178 514578
18261 514578 576619 667878 444858 488058 528552 643629 607216 766975 661217 629692 822915
$$ packed form
18333F55732J17441q9401p8904l2856R5495k06829R9451L598j09015j80366L21284
18322E95630o5109J77145k16388J23560N0718k01629L59095j1118l87343M93491
18312I18052k11622Q6431j40574P3922J63944l14187q974k340j46157Q6544J33904
18301F38943B92395J29599N4707k5398j09519R5692J34228J68381k08846m077
18291E27162j51462K09535q4353J61513m4749l0778j25588J06714p4876N4581
18281E47699J22550j49934K67352r0616k8621r1551n0207P2707J05882j19620
18271E85641J1379k7710j73994L09507q7308j56688K63205k99770J06916j6600
18261E14578O2041R1259k23020M3200M0494J15077l6413J59759j05758l1525J93223
$$ plain form
18250 822915 822614 600605 576746 812464 598090 901734 626989 612350 490614 525730 646870
18239 646870 722106 772662 668392 797061 582559 460077 709911 531717 654234 441707
18229 441707 461915 431663 594066 472830 605292 490633 778834 547649 512693 669667
18219 669667 677278 660251 638361 616092 526616 565246 586514 516786 613344 840817 641599
18208 641599 464473 579030 693260 490838 548223 661837 650063 561115 810386 656852
18198 656852 477130 530425 644119 913549 705915 796955 741285 693948 913175 544857
18188 544857 707985 700347 599758 568846 596006 506672 719707 606234 781649 525624
18178 525624 613609 490064 468539 686836 627750 699062 682380 635757 498745 677407 647118
$$ packed form
18250H22915l01k22009k3859K35718k14374L03644k74745j4639j21736L5116J21140
18239F46870P5236N0556j04270J28669k14502j22482K49834j78194J22517k12527
18229D41707K0208l0252J62403j21236J32462j14659K88201k31185l4956J56974
18219F69667P611j7027k1890k2269q9476L8630K1268o9728R6558K27473j99218
18208F41599j77126J14557J14230k02422N7385J13614j1774q8948K49271j53534
18198F56852j79722N3295J13694K69430k07634R1040n5670m7337K19227l68318
18188E44857J63128p638j00589l0912K7160q9334K13035j13473J75415k56025
18178E25624Q7985j23545k1525K18297n9086P1312j6682m6623j37012J78662l0289
$$ plain form
18167 647118 627466 623594 733574 564474 402374 727712 712530 514662 744184 488089
18157 488089 606005 591573 705718 480785 728626 786180 691264 522153 646439 671241
18147 671241 489906 572436 584245 622148 720868 650510 659110 788886 561863 686342 451277
18136 451277 738438 623547 563171 523889 455505 661949 528514 489981 599216 471090
18126 471090 669706 656443 906274 601722 651952 699715 692996 611987 499752 673131 527360
18115 527360 623908 608811 596483 417237 690275 694672 539396 679816 790500 409734
18105 409734 593155 724007 651832 436642 496637 705811 654962 480558 613322 557104
18095 557104 424331 411799 540175 687311 326136 740203 693256 667810 527760 561137
$$ packed form
18167F47118j9652l872J09980j69100j62100L25338j5182j97868K29522k56095
18157D88089J17916j4432J14145k24933K47841N7554r4916j69111J24286K4802
18147F71241j81335Q2530J1809L7903R8720p0358Q600J29776k27023J24479k35065
18136D51277K87161j14891o0376l9282o8384K06444j33435l8533J09235j28126
18126D71090J98616j3263K49831l04552N0230M7763o719q1009j12235J73379j45771
18115E27360R6548j5097j2328j79246K73038M397j55276J40420J10684l80766
18105D09734J83421J30852p2175k15190N9995K09174n0849j74404J32764n6218
18095E57104j32773j2532J28376J47136C26136M14067m6947k5446j40050L3377
$$ plain form
18085 561137 385434 400405 503082 331556 331632 572582 644709 637985 437549 680670 700365
18074 700365 654000 475549 628296 370151 375396 394186 541267 716730 406569 465316
18064 465316 491758 792771 247858 514675 255193 610695 570054 652202 456927 474711
18054 474711 484025 483084 439459 619521 642067 604075 488166 628626 432009 327849 533488
18043 533488 467898 372928 400860 344826 518624 539200 615146 527820 357574 582597 361296
18032 361296 331050 440042 747864 393412 496488 377550 529460 740092 537116 556660
18022 556660 486087 484747 533417 497249 526261 495262 592857 606454 268186 362008 553133
18011 553133 697813 233524 543451 483436 463723 647819 477483 546892 519982 359281
$$ packed form
18085E61137j75703J4971J02677j71526P6K40950P2127o724k00436K43121J9695
18074G00365m6365j78451J52747k58145N245J8790J47081J75463l10161N8747
18064D65316K6442L01013B47858K66817B55193L55502m0641Q2148j95275J7784
18054D74711R314r41m3625J80062K2546l7992j15909J40460j96617j04160K05639
18043E33488o5590r4970K7932n6034J73798K0576P5946q7326j70246K25023k21301
18032C61296l0246J08992L07822l54452J03076j18938J51910K10632k02976J9544
18022E56660p0573j340M8670l6168K9012l0999R7595J3597B68186R3822J91125
18011E53133J44680B33524L09927o0015j9713J84096j70336O9409k6910j60701
$$ plain form
18001 359281 680339 454161 690662 454213 484671 646142 461644 334067 380327 445824
17991 445824 538501 499197 680277 500815 503994 578643 635063 726723 537407 406839 443976
17980 443976 693234 635853 361511 349494 535642 528631 467271 596939 773183 748145 498662
17969 498662 596550 759074 596952 780609 454790 614475 389441 432889 744233 508977
17959 508977 349735 648074 495556 535341 456581 522977 573939 570609 743246 490752 780950
17948 780950 692341 502554 430970 474144 676153 925441 640681 476009 631320 638711
17938 638711 693457 659526 618431 795454 392181 632947 665838 773066 760318 759334 553870
17927 553870 526222 379455 729818 561432 518130 333125 859537 658186 572412 788104
$$ packed form
18001C59281L21058k26178K36501k36449L0458J61471j84498j27577M6260O5497
17991D45824R2677l9304J81080j79462L179P4649N6420R1660j89316j30568L7137
17980D43976K49258n7381k74342j2017J86148p011o1360J29668J76244k5038k49483
17969D98662R7888J62524j62122J83657l25819J59685k25034M3448L11344k35256
17959E08977j59242K98339j52518L9785p8760O6396N0962l330J72637k52494K90198
17948G80950q8609j89787p1584M3174K02009K49288k84760j64672J55311P391
17938F38711N4746l3931m1095J77023C92181K40766L2891J07228j2748r84k05464
17927E53870k7648j46767L50363j68386m3302j85005N26412k01351q5774K15692
$$ plain form
17917 788104 904681 536626 315437 741095 662848 664202 609970 517484 708305 832285
17907 832285 527901 791155 898122 429834 485820 528969 774432 651542 630374 410351
17897 410351 778157 811884 692432 720913 890680 915250 752620 674950 707717 645729 546627
17886 546627 660321 543230 633146 518782 554052 681291 609806 791182 504208 630825
17876 630825 714245 789086 698694 574603 670660 689014 520043 741945 725143 508240 670525
17865 670525 554795 419746 643264 708633 658582 335755 677237 647884 730556 467086
17855 467086 524587 573110 633351 691982 818567 685469 555661 641965 695199 842138 741126
17844 741126 654149 569570 892742 602622 826905 871257 375771 704298 740288 796911
$$ packed form
17917G88104J16577l68055k21189M25658p8247J354n4232r2486J90821J23980
17907H32285l04384K63254J06967D29834N5986M3149K45463j22890k1168k20023
17897D10351L67806L3727j19452K8481J69767K4570j62630p7670L2767o1988r9102
17886E46627J13694j17091Q9916j14364L5270J27239p1485J81376k86974J26617
17876F30825Q3420P4841r0392j24091R6057J8354j68971K21902j6802k16903J62285
17865F70525j15730j35049K23518O5369n0051l22827L41482k9353Q2672k63470
17855D67086N7501M8523O0241N8631J26585j33098j29808Q6304N3234J46939j01012
17844G41126q6977q4579L23172k90120K24283M4352C75771L28527L5990N6623
$$ plain form
17834 796911 744155 610210 689712 561260 867859 680468 572160 624153 830236 573762
17824 573762 700038 954019 420639 688596 775565 1036056 687874 1199084 941507 944710
17814 944710 989242 1021742 878641 1077847 1118474 1059610 1326808 1113373 931933 1112962
17804 1112962 730601 876858 893675 1117199 1079205 941109 1024676 1048721 1043428 1155411
17794 1155411 1072350 980450 978857 828428 898694 886667 755740 786102 611422 828131 651699
17783 651699 817728 576698 808696 1003809 614886 695438 581797 541333 811792 864209
17773 864209 496729 724571 718866 794707 594955 679609 673741 715386 624403 651110 555843
17762 555843 573155 901157 859110 687566 732421 779752 708714 546229 685313 864121
$$ packed form
17834G96911n2756j33945P9502j28452L06599j87391j08308N1993K06083k56474
17824E73762J26276K53981D20639K67957Q6969K60491l48182N11210k57577L203
17814I44710M4532L2500j43101J99206M0627n8864K67198k13435j81440J81029
17804A112962l82361J46257J6817K23524l7994j38096Q3567K4045n293J11983
17794A155411q3061r1900j593j50429P0266j2027j30927L0362j74680K16709j76432
17783F51699J66029k41030K31998J95113l88923Q0552j13641m0464K70459N2417
17773H64209l67480K27842n705P5841j99752Q4654n868M1645r0983K6707r5267
17762E55843J7312L28002m2047j71544M4855M7331p1038j62485J39084J78808
$$ plain form
17752 864121 749518 737881 588745 593769 643459 649210 984490 673958 806503 916287 721307
17741 721307 766595 555341 657395 541321 604116 803580 704767 709396 701663 512187 870079
17730 870079 861740 650112 618592 677915 708823 939387 698586 622411 707323 552902 636152
17719 636152 736532 725122 840001 622153 598141 615865 663870 897993 946983 642132
17709 642132 520789 781743 907346 818595 738055 694620 826631 875683 926464 798373
17699 798373 602984 725259 573094 722124 998683 607445 916644 874445 769212 647341
17689 647341 816112 842567 674890 598569 929355 654675 485170 718296 690771 826638
17679 826638 664638 597831 720172 736338 778360 706828 801437 800349 735600 1015253 861064
$$ packed form
17752H64121j14603j1637j49136N024M9690N751L35280l10532J32545J09784j94980
17741G21307M5288k11254J02054j16074O2795J99464r8813M629p733j89476L57892
17730H70079q339k11628l1520N9323L0908K30564k40801p6175Q4912j54421Q3250
17719F36152J00380j1410J14879k17848k4012J7724M8005K34123M8990l04851
17709F42132j21343K60954J25603q8751q0540m3435J32011M9052N0781j28091
17699G98373j95389J22275j52165J49030K76559l91238L09199m2199j05233j21871
17689F47341J68771K6455j67677p6321L30786k74680j69505K33126k7525J35867
17679H26638j62000o6807J22341J6166M2022p1532R4609j088o4749K79653j54189
$$ plain form
17668 861064 756919 666196 611701 877434 493823 836669 839822 738348 1064856 716648
17658 716648 934330 871589 887359 964341 743330 612991 1099912 760792 940017 931471
17648 931471 804567 776981 900806 1005765 1095314 1001970 1006051 945076 930991 790141 927007
17637 927007 947440 910290 831593 1100966 1127092 931953 1003111 987312 915035 996352 1059098
17626 1059098 1006425 1002815 1094899 1091263 1009466 1351930 1374395 1036530 1350141 980218 915741
17615 915741 1110908 1228441 1120121 1026187 1095861 1109519 1210069 1165957 1220482 1324152
17605 1324152 1355932 1127618 1285244 1207625 1093858 1104441 1168414 1230065 1183831 1152202 1236976
17594 1236976 1203341 1459721 1366697 1329395 1361497 1044321 1309783 1231960 1073293 1301607
$$ packed form
17668H61064j04145r0723n4495K65733l83611L42846L153j01474L26508l48208
17658G16648K17682o2741J5770P6982k21011j30339M86921l39120J79225q546
17648I31471j26904k7586J23825J04959Q9549r3344M081o0975j4085j40850J36866
17637I27007K0433l7150p8697K69373K6126j95139P1158j5799p2277Q1317O2746
17626A059098n2673l610R2084l636q1797L42464K2465l37865L13611l69923o4477
17615I15741J95167J17533j08320r3934O9674J3658J00550m4112N4525J03670
17605A324152L1780k28314J57626p7619j13767J0583O3973O1651m6234l1629Q4774
17594A236976l3635K56380r3024l7302L2102l17176K65462p7823j58667K28314
$$ plain form
17584 1301607 1385230 1207432 1246613 1299805 1212589 1180569 1419347 1123509 1293053 1382664
17574 1382664 1382236 1184597 1560950 1368172 1471687 1602220 1409871 1486892 1355217 1270607
17564 1270607 1491231 1339298 1209797 1164646 1165434 1296743 1337532 1329638 1423424 1342515 1429187
17553 1429187 1407809 1165175 1115555 1181793 1154110 1376847 1473468 1394736 1302953 1392864 1403475
17542 1403475 1518596 1435960 1771506 1476799 1784266 1589272 1598419 1510862 1313759 1576030
17532 1576030 1319179 1517929 1666691 1302056 1224851 1423667 1348000 1626545 1373154 1786082
17522 1786082 1705492 1619690 1408410 1541704 1557131 1526816 1524072 1733316 1790755 1939030 1980870
17511 1980870 2051985 2319845 2456778 2661899 2644242 2636006 2913068 2653932 2696533 2623176
$$ packed form
17584A301607Q3623j77798L9181N3192q7216l2020K38778k95838J69544Q9611
17574A382664m28j97639L76353j92778J03515J30533j92349P7021j31675q4610
17564A270607K20624j51933j29501m5151P88J31309M0789p894R3786q0909Q6672
17553A429187k1378k42634m9620O6238k7683K22737R6621p8732r1783Q9911J0611
17542A403475J15121q2636L35546k94707L07467j94994R147q7557j97103K62271
17532A576030k56851J98750J48762l64635p7205J98816p5667K78545k53391M12928
17522A786082q0590q5802k11280J33294J5427l0315k744K09244N7439J48275M1840
17511A980870P1115K67860J36933K05121j7657q236K77062k59136M2601p3357
$$ plain form
17501 2623176 2536636 2703503 2815393 2947841 2926967 3366304 3462179 4079184 4178518 4635785
17491 4635785 5075355 5691960 6207814 7464720 8324596 10847258 14808629 22078806 32916913
17482 32916913 47402417 62608637 75764095 84944921 89923984 90438310 87177071 79023688
17474 79023688 66781738 53107779 41383918 33080107 29796035 31117709 37997221 48901413
17466 48901413 62449938 75950727 85576653 91151049 92292211 89159927 81885451 69573258
17458 69573258 54941387 40460957 28445841 20458678 15018524 11321163 8876418 7128227
17450 7128227 5968572 5089706 4559213 4178760 3793907 3529705 3648216 3764037 3729945
17441 3729945 3807506 3820803 3556625 3450422 3320074 3201709 2992728 2841913 2916070 2943931
$$ packed form
17501B623176q6540J66867J11890J32448k0874M39337R5875O17005R9334M57267
17491D635785M39570O16605N15854J256906Q59876K522662L961371P270177J0838107
17482C2916913J4485504J5206220J3155458R180826M979063N14326l261239q153383
17474G9023688j2241950j3673959j1723861q303811l284072J321674O879512J0904192
17466D8901413J3548525J3500789R625926N574396J141162l132284p274476j2312193
17458F9573258j4631871j4480430j2015116p987163n440154l697361k444745j748191
17450G128227j159655q78866n30493l80453l84853k64202J18511J15821l4092
17441C729945P7561J3297k64178j06203j30348j18365k08981j50815P4157K7861
$$ plain form
17431 2943931 2895285 3219355 3114247 3369919 3052017 3146609 3116326 2960160 2952207 2446473
17421 2446473 2747440 2367873 2392149 2175190 2347546 2213810 2306914 2135584 2213824 2259386
17411 2259386 2507161 2319895 2053679 2334536 2411203 2267681 2304482 2638631 2786261 2738101
17401 2738101 2802076 3080188 3324613 3198481 3380504 3688817 3468597 3907787 4326808 4336081
17391 4336081 4747445 5278445 5569657 5974557 6517101 6952337 7157178 7255529 7107313 7264126
17381 7264126 7140878 6812090 6733297 6556507 6233193 5925649 6231422 6082751 6355769 6377488
17371 6377488 6557679 7161046 7510913 7797198 8432924 8263854 8758247 8870038 8797407 8659158
17361 8659158 8721649 8514303 8515383 8402634 8229615 8341906 8453679 8564487 8556198 9064771
$$ packed form
17431B943931m8646L24070j05108K55672l17902R4592l0283j56166p953n05734
17421B446473L00967l79567K4276k16959J72356j33736R3104j71330P8240M5562
17411B259386K47775j87266k66216K80857P6667j43522L6801L34149J47630m8160
17401B738101O3975K78112K44425j26132J82023L08313k20220M39190M19021R273
17391D336081M11364N31000K91212M04900N42544M35236K04841R8351j48216J56813
17381G264126j23248l28788p8793j76790l23314l07544L05773j48671K73018K1719
17371F377488J80191O03367L49867K86285O35726j69070M94393J11791p2631j38249
17361H659158O2491k07346J080j12749j73019J12291J11773J10808q289N08573
$$ plain form
17351 9064771 9588909 10004183 10529915 11256008 12056883 12594685 12947608 13701911 14012676
17342 14012676 14220645 14302610 14172655 14267870 13859814 13843535 13220121 12986938 12498937 12413674
17332 12413674 12309574 12211946 12643662 12711422 13051511 13840841 14100502 14539352 15082439 15563169
17322 15563169 15620085 15922947 15898703 15767528 15891281 16028971 15711763 15796387 15546395 15270410
17312 15270410 14876741 15037378 14693551 14886579 14856736 14949196 15282472 15343770 15628628 15813367
17302 15813367 16259937 16274700 16441060 16160758 16151167 16067697 15973427 15480609 15352820 15158264
17292 15158264 14774364 14953238 14990768 15224942 15029378 15313239 15250771 15413047 14947320 15096846
17282 15096846 14744509 14282282 13596427 12744897 11991646 11657539 10345071 9586240 9053066
$$ packed form
17351I064771N24138M15274N25732P26093Q00875N37802L52923P54303L10765
17342A4012676K07969Q1965j29955R5215m08056j6279o23414k33183m88001q5263
17332A2413674j04100r7628M31716O7760L40089P89330K59661M38850N43087M80730
17322A5563169N6916L02862k4244j31175J23753J37690l17208Q4624k49992k75985
17312A5270410l93669J60637l43827J93028k9843R2460L33276O1298K84858J84739
17302A5813367M46570J4763J66360k80302r591q3470r4270m92818j27789j94556
17292A5158264l83900J78874L7530K34174j95564K83861o2468J62276m65727J49526
17282A5096846l52337m62227o85855q51530p53251l34107j312468p58831n33174
$$ plain form
17273 9053066 8443729 7917404 7558444 7349315 7174375 6744293 6209855 6459671 6165334
17264 6165334 6145138 5841497 6048815 5576316 5576123 5479174 5648395 5524072 5229474 4961830
17254 4961830 4719851 4613200 4708537 4801143 4673008 4644499 4339758 4483096 4341814 4422834
17244 4422834 4363036 4329391 4224780 4239497 4238783 3986922 3979627 3849052 3917821 3973397 3652789
17233 3652789 3358099 3222054 3425972 3414673 3228676 3098074 3166124 3134506 3107440 3261447
17223 3261447 3390431 3179891 3433884 3470323 3360789 3518044 3414098 3552113 3533370 3328667
17213 3328667 3204768 3225837 3454385 3275745 3402327 3188420 3299117 3048547 2999672 2930159
17203 2930159 2972705 3036925 3245843 3103293 2900781 3002929 2842051 2804467 2670107 2512680
$$ packed form
17273I053066o09337n26325l58960k09129j74940m30082n34438K49816k94337
17264F165334k0196l03641K07318m72499j93r6949J69221j24323k94598k67644
17254D961830k41979j06651R5337R2606j28135k8509l04741J43338j41282Q1020
17244D422834n9798l3645j04611J4717p14k51861p295j30575O8769N5576l20608
17233C652789k94690j36045K03918j1299j85997j30602O8050l1618k7066J54007
17223C261447J28984k10540K53993L6439j09534J57255j03946J38015j8743k04703
17213C328667j23899K1069K28548j78640J26582k13907J10697k50570m8875o9513
17203B930159M2546O4220K08918j42550k02512J02148j60878l7584j34360j57427
$$ plain form
17193 2512680 2469922 2492179 2348419 2220300 2160067 2266260 2130129 2316249 2305547 2408705
17183 2408705 2167832 2324693 2223172 2103763 2128194 2308304 2482720 2327762 2384683 2360032
17173 2360032 2373913 2374422 2418520 2376537 2524302 2421551 2381476 2623555 2597236 2770371 2500803
17162 2500803 2648957 2598820 2481479 2781114 2854664 3058369 2899063 2916929 3080788 3112322
17152 3112322 2917986 2948050 2993403 2955535 2941045 2598059 3121043 2767310 2474602 2870063
17142 2870063 2665571 2536216 2964872 3031937 2945793 3051086 3220847 3062468 3111224 2853896
17132 2853896 2917836 2744681 2555614 2854679 2610845 2576450 2413551 2642634 2616609 2795103
17122 2795103 2701482 2819453 2794841 2897853 2806982 2542631 2964593 2682116 2726275 2583460
$$ packed form
17193B512680m2758K2257j43760j28119o0233J06193j36131J86120j0702J03158
17183B408705k40873J56861j01521j19409K4431J80110J74416j54958N6921k4651
17173B360032J3881N09M4098m1983J47765j02751m0075K42079k6319J73135k69568
17162B500803J48154n0137j17341K99635P3550K03705j59306J7866J63859L1534
17152C112322j94336L0064M5353l7868j4490l42986N22984l53733k92708L95461
17142B870063k04492j29355M28656O7065q6144J05293J69761j58379M8756k57328
17132B853896O3940j73155j89067K99065k43834l4395j62899K29083k6025J78494
17122B795103r3621J17971k4612J03012r0871k64351M21962k82477M4159j42815
$$ plain form
17112 2583460 2601673 2428113 2472618 2678732 2621835 2659701 2548465 2579433 2764288 2752726
17102 2752726 2852135 2615572 2504057 2452564 2484203 2237917 2211392 2027492 2119851 2126684 1879060
17091 1879060 1973714 1467153 1561940 1621419 1674592 1470518 1454616 1302678 1438439 1497054
17081 1497054 1435854 1213050 1281576 1258110 1499728 1418492 1224310 1340825 1339934 1407437 1625382
17070 1625382 1444030 1307631 1431972 1430634 1283345 1495197 1295632 1340797 1475868 1365319
17060 1365319 1437651 1488455 1636315 1540736 1664582 1710659 2079983 2247523 2173984 2509930
17050 2509930 2544109 2371210 2516657 2724661 2680928 2753861 2761872 2684914 2848395 3063263
17040 3063263 3151313 3105849 3318218 3349356 3559040 3136431 3169684 2849003 2688722 2526833
$$ packed form
17112B583460J8213j73560M4505K06114n6897L7866j11236L0968J84855j1562
17102B752726R9409k36563j11515n1493L1639k46286k6525j83900R2359O833k47624
17091A879060R4654n06561R4787N9479N3173k04074j5902j51938J35761N8615
17081A497054o1200k22804O8526k3466K41618q1236j94182J16515q91O7503K17945
17070A625382j81352j36399J24341j338j47289K11852j99565M5165J35071j10549
17060A365319P2332N0804J47860r5579J23846M6077L69324J67540p3539L35946
17050B509930L4179j72899J45447K08004m3733P2933Q011p6958J63481K14868
17040C063263Q8050m5464K12369L1138K09684m22609L3253l20681j60281j61889
$$ plain form
17030 2526833 2589986 2203062 2068508 2245769 1967358 1891492 1937654 1789826 1804235 1413050
17020 1413050 1450713 1364135 1486798 1510917 1416433 1485970 1565035 1471345 1466778 1377966 1401007
17009 1401007 1153626 1309595 1544803 1191473 1258650 1232061 1322876 1353417 1364842 1388721
16999 1388721 1497321 1300061 1335381 1430165 1234660 1370958 1554851 1518652 1048112 1280632
16989 1280632 1355123 1249320 1168292 1386910 1179569 1453849 1258489 1618543 1180141 1237982
16979 1237982 1345892 1148952 1271760 1472125 1480650 1477404 1585232 1554592 1807391 1480799
16969 1480799 1684402 1843226 1954961 1808862 2033859 1888928 2316577 2384469 2322746 2467390
16959 2467390 2637880 2676107 2727356 2930529 2990358 2657362 2741229 2698318 2602050 2467444
$$ packed form
17030B526833O3153l86924j34554J77261k78411p5866M6162j47828J4409l91185
17020A413050L7663q6578J22663K4119r4484O9537P9065r3690m567q8812K3041
17009A401007k47381J55969K35208l53330O7177k6589R0815L0541J1425K3879
16999A388721J08600j97260L5320R4784j95505J36298J83893l6199m70540K32520
16989A280632P4491j05803q1028K18618k07341K74280j95360L60054m38402N7841
16979A237982J07910j96940J22808K00365Q525l246J07828l0640K52799l26592
16969A480799K03603J58824J11735j46099K24997j44931M27649O7892o1723J44644
16959B467390J70490L8227N1249K03173N9829l32996Q3867m2911r6268j34606
$$ plain form
16949 2467444 2614566 2502350 2558224 2462575 2210666 2189566 1917477 2135439 2013133 1924105
16939 1924105 1660760 1490605 1660323 1412954 1563642 1527331 1315617 1656856 1438571 1591103
16929 1591103 1237222 1241438 1387830 1388979 1445626 1483959 1340430 1448045 1360150 1247465 1158141
16918 1158141 1127566 1228291 1240953 1082739 913087 1074380 1241797 1247738 999768 1119762
16908 1119762 1151758 1041604 1011635 1003877 833550 1141940 1019558 1161718 1024011 1090308
16898 1090308 979204 1271107 1240635 1047891 1153480 984091 755551 696431 866846 970280
16888 970280 895898 1044642 854498 872483 900061 895461 1202734 1064802 1135311 701335 902979
16877 902979 877897 1015119 1138713 974254 1113158 908128 1039799 1078414 871691 1375944
$$ packed form
16949B467444J47122j12216N5874r5649k51909k1100k72089K17962j22306q9028
16939A924105k63345j70155J69718k47369J50688l6311k11714L41239k18285J52532
16929A591103l53881M216J46392J149N6647L8333j43529J07615q7895j12685q9324
16918A158141l0575J00725J2662j58214j69652J61293J67417N941k47970J19994
16908A119762L1996j10154k9969p758j70327L08390j22382J42160j37707O6297
16898A090308j11104K91903l0472j92744J05589j69389k28540n9120J70415J03434
16888I70280p4382J48744j90144J7985K7578m600L07273j37932P0509m33976K01644
16877I02979k5082J37222J23594j64459J38904k05030J31671L8615k06723N04253
$$ plain form
16867 1375944 1019171 928296 1003027 1040192 1129685 1231588 1123062 1191290 1428076 1124467
16857 1124467 1246904 1097479 1094098 1149959 942327 1112961 1181097 918238 1072366 1255445
16847 1255445 1084544 1147023 1143756 1097271 932326 1048534 1230174 1058383 912007 1087846
16837 1087846 1122512 1209881 1074093 893431 1263408 1328669 1230045 1186384 1314572 1197565
16827 1197565 1279797 1303650 1359270 1321320 1307952 1431581 1330399 1500956 1710144 1834072
16817 1834072 2071827 1803585 1831115 1776239 2015787 2098907 1991382 2125835 1684054 1955341
16807 1955341 1660171 1912037 1955848 1868069 2139615 1960129 1684932 1791505 1976185 2055659
16797 2055659 1777813 1724473 1781692 1691283 1583410 1453126 1543347 1502298 1126949 1318339
$$ packed form
16867A375944l56773r0875P4731L7165Q9493J01903j08526O8228K36786l03609
16857A124467J22437j49425l381N5861k07632J70634O8136k62859J54128J83079
16847A255445j70901O2479l267m6485j64945J16208J81640j71791j46376J75839
16837A087846L4666Q7369j35788j80662L69977O5261r8624m3661J28188j17007
16827A197565Q2232K3853N5620l7950j3368J23629j01182J70557K09188J23928
16817A834072K37755k68242K7530n4876K39548Q3120j07525J34453m41781K71287
16807A955341k95170K51866M3811q7779K71546j79486k75197J06573J84680P9474
16797B055659k77846n3340N7219r0409j07873j30284R0221m1049l75349J91390
$$ plain form
16787 1318339 1218955 1268232 1086629 1165368 1181401 707371 1054431 959513 1074533 1126962
16777 1126962 868479 1274138 1212356 1164345 935212 1180281 1160850 977848 892966 1030074
16767 1030074 1364119 1041387 1041623 1217378 1126917 1118411 971497 1351591 956844 1033383 1119421
16756 1119421 1175211 1119153 1229429 1038330 992659 1146617 847675 909648 1076737 977447
16746 977447 1244293 1193595 893744 1196494 1235543 893645 971264 1060694 1130116 1117405 1125958
16735 1125958 987062 950725 1194847 1144173 1246226 1233877 1244528 1093776 1180413 1288555
16725 1288555 1195102 1208410 1301507 1179526 1184533 1087152 1435393 1368708 1349842 1124283 1224704
16714 1224704 1060615 1262920 1158795 1163417 1324121 1293975 1241085 1403117 1217483 1595818
$$ packed form
16787A318339r9384M9277j81603P8739J6033m74030L47060r4918J15020N2429
16777A126962k58483M05659o1782m8011k29133K45069j9431j83002q4882J37108
16767A030074L34045l22732K36J75755r0461q506j46914L80094l94747P6539Q6038
16756A119421N5790n6058J10276j91099m5671J53958k98942O1973J67089r9290
16746I77447K66846n0698k99851L02750L9049l41898P7619Q9430O9422j2711Q553
16735A125958j38896l6337K44122n0674J02053j2349J0651j50752Q6637J08142
16725A288555r3453J3308R3097j21981N007r7381L48241o6685j8866k25559J00421
16714A224704j64089K02305j04125M622J60704l0146n2890J62032j85634L78335
$$ plain form
16704 1595818 1564383 1797158 1749776 2054036 1788904 1721196 1668697 1729277 1876198 1769969
16694 1769969 1736648 1715101 1723751 1775630 1753942 2008665 2146624 1924857 1980224 2201931 1946327
16683 1946327 1647026 1773172 1663610 1704929 1545931 1473388 1396793 1474178 1572955 1530427
16673 1530427 1283835 1533329 1536255 1558697 1534336 1847463 1810169 2088684 1906498 2117204
16663 2117204 2074036 1912609 1769915 1889898 1683830 1871068 1688855 1882008 1977779 1939664
16653 1939664 1996186 2019141 2099476 1964687 1463616 1588522 1396044 1295122 1300340 1275138
16643 1275138 1337694 1248236 1363577 1086099 951916 1011517 1105921 1104664 1110058 1053344 1153164
16632 1153164 1193799 1165470 1014645 1074385 1078500 1043186 1099811 1055394 943680 1156931 1248509
$$ packed form
16704A595818l1435K32775m7382L04260k65132o7708n2499O0580J46921j06229
16694A769969l3321k1547Q650N1879k1688K54723J37959k21767N5367K21707k55604
16683A946327k99301J26146j09562M1319j58998p2543p6595P7385R8777m2528
16673A530427k46592K49494K926K2442k4361L13127l7294K78515j82186K10706
16663B117204m3168j61427j42694J19983k06068J87238j82213J93153R5771l8115
16653A939664N6522K2955Q0335j34789n01071J24906j92478j00922N218k5202
16643A275138O2556q9458J15341k77478j34183N9601R4404j257N394n6714R9820
16632A153164M0635k8329j50825N9740M115l5314N6625m4417j11714K13251R1578
$$ plain form
16621 1248509 1045131 1149088 881736 1230534 1070303 1174664 1226122 1217660 1090951 1265250
16611 1265250 1205748 1175388 926229 956927 1032570 1235463 1077734 982540 1296190 1142551
16601 1142551 1474253 1199652 1029331 1153479 1362727 1304704 1069646 1149539 1055907 1285175
16591 1285175 1204289 1311226 1152343 1231940 1423550 1123300 1238574 1225858 948354 1282743
16581 1282743 1229311 1085519 1121191 1060996 1002310 1157074 1349622 1180739 901447 1262623
16571 1262623 1251113 1163883 1172788 1228936 1330336 1447795 1133206 1409309 1412294 1301114 1334577
16560 1334577 1596533 1247316 1063363 1441363 1282629 1575006 1104729 1655989 1381210
16551 1381210 1428727 1421174 1487618 1363378 1212534 1442128 1446572 1536370 1367358 1300477 1298681
$$ packed form
16621A248509k03378J03957k67352L48798j60231J04361N1458q462j26709J74299
16611A265250n9502l0360k49159L0698P5643K02893j57729r5194L13650j53639
16601A142551L31702k74601j70321J24148K09248n8023k35058P9893r3632K29268
16591A285175q0886J06937j58883P9597J91610l00250J15274j2716k77504L34389
16581A282743n3432j43792L5672o0195n8686J54764J92548j68883k79292L61176
16571A262623j1510q7230Q905N6148J01400J17459l14589K76103K985j11180L3463
16560A334577K61956l49217j83953L78000j58734K92377m70277N51260k74779
16551A381210M7517p553O6444j24240j50844K29594M444Q9798j69012o6881j796
$$ plain form
16540 1298681 1335557 1165244 1210166 1319320 1225184 1493786 1430273 1325172 1263010 1317130
16530 1317130 1478729 1313531 1386952 1476309 1460046 1552016 1631165 1587564 1504920 1913738 1916782
16519 1916782 1838634 1696163 1676490 1986207 1766121 1769182 1907253 1908120 1825556 1758146 1625552
16508 1625552 1791387 1749311 1826443 1916072 1827519 1906024 1836169 1972975 1838568 2098780
16498 2098780 1743127 1917081 1957038 1962172 1660903 2103355 1993662 2152178 1798613 1883732
16488 1883732 2127868 2208062 2206695 2168791 2272080 2442747 2391759 2478445 2375852 2706338
16478 2706338 2600484 2508105 2739172 2867172 2647424 2873310 3084298 2827057 2740807 2964892
16468 2964892 2774643 3063033 2946249 2970805 2875244 3021879 3061356 3055393 3401106 3462332
$$ packed form
16540A298681L6876j70313M4922J09154r4136K68602o3513j05101o2162N4120
16530A317130J61599j65198P3421Q9357j6263R1970P9149m3601q2644M08818L044
16519A916782p8148j42471j9673L09717k20086L061J38071Q67q2564o7410j32594
16508A625552J65835m2076P7132Q9629q8553P8505o9855J36806j34407K60212
16498B098780l55653J73954L9957N134l01269M42452j09693J58516l53565Q5119
16488A883732K44136Q0194j367l7904J03289J70667n0988Q6686j02593L30486
16478B706338j05854r2379K31067J28000k19748K25886K10988k57241q6250K24085
16468B964892j90249K88390j16784K4556r5561J46635L9477n963L45713O1226
$$ plain form
16458 3462332 3576368 3399693 3613450 3611803 3725224 3859404 3911387 3833698 3841315 3641094
16448 3641094 3873162 3877440 4040774 4001495 4638134 4467881 4964349 5215078 5432568 5772559
16438 5772559 6426916 7056404 8045609 8798953 10051787 11167032 12191158 13234861 14557669
16429 14557669 16076367 17618953 19039671 20943139 22773933 24464488 26939779 29734365
16421 29734365 32350629 35449894 39007263 42691710 46925030 51349514 56255739 61176852
16413 61176852 66227751 69776723 72499466 74863913 76960524 78397158 79748080 79354341
16405 79354341 77795986 75128885 72060930 68776782 65548133 62077653 58273529 54449612
16397 54449612 50684659 46854741 43411114 40400581 37840153 37120202 38902189 45105331
$$ packed form
16458C462332J14036j76675K13757j647J13421J34180N1983p7689P617k00221
16448C641094K32068M278J63334l9279O36639j70253M96468K50729K17490L39991
16438E772559O54357O29488R89205P53344J252834J115245J024126J043703J322808
16429A4557669J518698J542586J420718J903468J830794J690555K475291K794586
16421B9734365K616264L099265L557369L684447M233320M424484M906225M921113
16413F1176852N050899L548972K722743K364447K096611J436634J350922l93739
16405G9354341j558355k667101l067955l284148l228649l470480l804124l823917
16397E4449612l764953l829918l443627l010533k560428p19951J781987O203142
$$ plain form
16389 45105331 57054053 72020538 84405032 91560837 93735335 91882671 86709988 79359408
16381 79359408 71210125 58611890 38531190 11970610 -14313449 -32480592 -38280532
16374 -38280532 -33057878 -21663831 -9003805 1748407 9743096 14916648 17793426 18630872
16366 18630872 17953576 16710898 15297295 13506967 12154619 10852176 9407602 8042530
16358 8042530 6928921 5846822 5049663 4231502 3726639 3429344 3238450 2871127 3001205
16349 3001205 2945105 2772020 3059533 3036001 2902779 2864528 2815473 3089591 2994816 2851533
16339 2851533 3167342 3036545 3132318 3268852 3155738 3015759 3281647 3042662 2920452 2799788
16329 2799788 2663739 2311379 2386278 2576927 2246313 2351058 2139860 2248088 2038277 1965477
$$ packed form
16389D5105331J1948722J4966485J2384494P155805K174498j852664n172683p350580
16381G9359408q149283j2598235k0080700A1970610a4313449j8167143n799940
16374c8280532N222654J1394047i003805A748407P994689N173552K876778Q37446
16366A8630872o77296j242678j413603j790328j352348j302443j444574j365072
16358H042530j113609j082099p97159q18161n04863k97295j90894l67323J30078
16349C001205n6100j73085K87513k3532j33222l8251m9055K74118r4775j43283
16339B851533L15809j30797R5773J36534j13114j39979K65888k38985j22210j20664
16329B799788j36049l52360P4899J90649l30614J04745k11198J08228k09811p2800
$$ plain form
16319 1965477 1946937 1993077 2168036 1705211 1837905 1999743 2123677 2043705 2094649 1998587
16309 1998587 1990933 2033685 2331116 2058068 2446765 2342211 2520325 2372462 2371155 2295117
16299 2295117 2288641 2264597 2219907 2228386 2450227 2323247 2392940 2407496 2465616 2251542 2606128
16288 2606128 2603781 2453978 2791105 2643992 2726648 2922741 2696794 2845920 2953586 2866986
16278 2866986 3004440 3065032 2657384 2906157 2559399 2724701 2764808 2780919 2615014 2645417
16268 2645417 2626492 2597535 2533042 2486181 2266246 2077359 2197589 2044186 1999091 1956044
16258 1956044 1687415 1988652 2069746 2008074 1990922 2169916 2113456 1897435 2051010 1858102
16248 1858102 2238672 2160369 2073469 1986521 1924115 2188648 1891768 2060167 2157548 2270812
$$ packed form
16319A965477j8540M6140J74959m62825J32694J61838J23934p9972N0944r6062
16309A998587p654M2752K97431k73048L88697j04554J78114j47863j307p6038
16299B295117o476k4044m4690Q479K21841j26980O9693J4556N8120k14074L54586
16288B606128k347j49803L37127j47113Q2656J96093k25947J49126J07666q6600
16278B866986J37454O0592m07648K48773l46758J65302M0107J6111j65905L0403
16268B645417j8925k8957o4493m6861k19935j88887J20230j53403m5095m3047
16258A956044k68629L01237Q1094o1672j7152J78994n6460k16021J53575j92908
16248A858102L80570p8303q6900q6948o2406K64533k96880J68399R7381J13264
$$ plain form
16238 2270812 2363088 2366941 2157086 2188894 2036565 2012331 1990905 1885155 1630137 1688385 1787493
16227 1787493 1686098 1463980 1652122 1585707 1356875 1626478 1438894 1523779 1582589 1455418
16217 1455418 1479292 1669413 1339727 1335136 1423600 1360736 1451040 1462091 1303807 1273562 1236575
16206 1236575 1385285 1339032 1260019 1426347 1350383 1451343 1075133 1324372 1200626 1351931
16196 1351931 1338522 1417925 1267520 1364795 1390093 1346939 1445703 1278431 1408302 1573846
16186 1573846 1588639 1440275 1427002 1326119 1611931 1481898 1037622 1226316 1294319 1256729
16176 1256729 963769 1236819 1115478 1103636 1179740 1143569 1086107 1377981 1079118 1206953
16166 1206953 1232351 1037825 1161656 918870 1149272 1107005 1124127 1264293 1196286 1028436
$$ packed form
16238B270812R2276L853k09855L1808j52329k4234k1426j05750k55018N8248R9108
16227A787493j01395k22118J88142o6415k28832K69603j87584Q4885N8810j27171
16217A455418K3874J90121l29686m591Q8464o2864R0304J1051j58284l0245l6987
16206A236575J48710m6253p9013J66328p5964J00960l76210K49239j23746J51305
16196A351931j3409P9403j50405R7275K5298m3154R8764j67272J29871J65544
16186A573846J4793j48364j3273j00883K85812j30033m44276J88694O8003l7590
16176A256729k92960K73050j21341j1842P6104l6171n7462K91874k98863J27835
16166A206953K5398j94526J23831k42786K30402m2267J7122J40166o8007j67850
$$ plain form
16156 1028436 1039174 1206556 1271354 1052558 1202241 1022595 982083 964331 1043750 1281791
16146 1281791 1075721 1130572 1505597 1282925 1185424 1261416 1092915 1192078 1266940 1201227
16136 1201227 1160902 1107639 1125147 1185491 1195957 1135483 1337847 1214105 1287720 1425942 1527938
16125 1527938 1092719 1226799 1287179 1201636 1353267 1351531 1174902 1377394 1276522 1182344
16115 1182344 1432616 1367231 1291365 1291391 1281598 1323770 1488279 1212229 1313881 1432199 1312033
16104 1312033 1141712 1276520 1146765 1400551 1340951 1337392 1575084 1399604 1341981 1481249
16094 1481249 1427820 1419555 1514995 1509266 1269297 1489024 1519078 1498333 1377448 1441330 1348664
16083 1348664 1415877 1513200 1607671 1497327 1433273 1675910 1634762 1452030 1581909 1531608
$$ packed form
16156A028436J0738J67382O4798k18796J49683j79646m0512j7752P9419K38041
16146A281791k06070N4851L75025k22672r7501P5992j68501R9163P4862o5713
16136A201227m0325n3263J7508O0344J0466o0474K02364j23742P3615J38222J01996
16125A527938m35219J34080O0380q5543J51631j736j76629K02492j00872r4178
16115A182344K50272o5385p5866K6r793M2172J64509k76050J01652J18318j20166
16104A312033j70321J34808j29755K53786n9600l559K37692j75480n7623J39268
16094A481249n3429q265R5440n729k39969K19727L0054k0745j20885O3882r2666
16083A348664O7213R7323R4471j10344o4054K42637m1148j82732J29879n0301
$$ plain form
16073 1531608 1598162 1610356 1635948 1548229 1712639 1756932 1613198 1917958 1801067 1781249
16063 1781249 1959636 1903259 1831811 2044445 1864816 2039141 1950882 1769170 1820286 2034852
16053 2034852 1944171 1853631 1971165 2191921 2085864 2024523 2086382 2099365 2022439 2005031 2020260
16042 2020260 2006610 2206712 2028944 2087038 2107982 2115961 2068424 2272959 2140774 2114142 1923915
16031 1923915 2008030 2242294 1959283 2261482 2205586 2461408 2335330 2411645 2372665 2441420
16021 2441420 2154421 2457733 2450333 2430296 2547148 2499838 2306915 2523351 2613164 2473097
16011 2473097 2638965 2449678 2410750 2478589 2449115 2321521 2518774 2159362 2479006 2478650
16001 2478650 2290757 2358325 2353166 2359995 2537910 2275067 2439214 2353133 2293262 2318655 2305349
$$ packed form
16073A531608O6554J2194K5592q7719J64410M4293j43734L04760j16891j9818
16063A781249J78387n6377p1448K12634j79629J74325q8259j81712N1116K14566
16053B034852r0681r0540J17534K20756j06057o1341O1859J2983p6926j7408J5229
16042B020260j3650K00102j77768N8094K0944P979m7537K04535j32185k6632j90227
16031A923915Q4115K34264k83011L02199n5896K55822j26078P6315l8980O8755
16021B441420k86999L03312p400k0037J16852m7310j92923K16436Q9813j40067
16011B473097J65868j89287l8928O7839k9474j27594J97253l59412L19644l56
16001B478650j87893O7568n159O829J77915k62843J64147q6081n9871K5393j3306
$$ plain form
15990 2305349 2532085 2320344 2370725 2348911 2330789 2226840 2356571 2407448 2489551 2415988
15980 2415988 2725620 2785073 2684758 2536656 2628246 2586729 2646144 2267483 2546920 2464303
15970 2464303 2405484 2632970 2559492 2617296 2603701 2436729 2296687 2613899 2559512 2571389
15960 2571389 2415061 2557690 2683586 2393321 2465476 2415131 2546877 2357547 2653261 2321858
15950 2321858 2609353 2732821 2346034 2647078 2617575 2586670 2457478 2704758 2624768 2495588
15940 2495588 2838046 2682825 2617192 2672431 2792398 2787818 2773044 2905189 2968994 2901654 2996931
15929 2996931 3159028 3223732 3224278 3352819 3430428 3323240 3519377 3742728 3968291 4042973
15919 4042973 4236609 4458501 4817466 5182025 5327132 5972007 6854978 7570974 8564280
$$ packed form
15990B305349K26736k11741N0381k1814j8122j03949J29731N0877Q2103p3563
15980B415988L09632N9453j00315j48102R1590m1517N9415l78661K79437q2617
15970B464303n8819K27486p3478N7804j3595j66972j40042L17212n4387J1877
15960B571389j56328J42629J25896k90265P2155n0345J31746j89330K95714l31403
15950B321858K87495J23468l86787L01044k9503l0905j29192K47280p9990j29180
15940B495588L42458j55221o5633N5239J19967m580j4774J32145O3805o7340R5277
15929B996931J62097O4704N46J28541P7609j07188J96137K23351K25563P4682
15919D042973J93636K21892L58965L64559J45107O44875Q82971P15996R93306
$$ plain form
15910 8564280 10579983 13571571 17134665 22483777 29066962 37239416 45401312 53241183
15902 53241183 59268617 63185353 64209248 62578611 58377677 51760885 44076042 36063506
15894 36063506 28668387 22531483 17940066 14238526 11540867 9594931 7905714 6835489
15886 6835489 5774787 5389614 4827247 4103971 4228022 3521836 3445268 3339772 2942955
15877 2942955 2828475 2866782 2910466 2761430 3010254 2730161 2771474 2786175 2778446 2875374 2702636
15866 2702636 2977370 2619098 2865488 2480911 2523442 2546534 2501460 2509130 2358532 2181354
15856 2181354 2603467 2276619 2340711 2381551 2275512 2337625 2478888 2219879 2354314 2419844
15846 2419844 2151842 2448290 2472574 2251343 2456167 2453799 2372778 2509354 2465464 2725360
$$ packed form
15910H564280K015703K991588L563094N349112O583185Q172454Q161896P839871
15902E3241183O027434L916736J023895j630637m200934o616792p684843q012536
15894C6063506p395119o136904m591417l701540k697659j945936j689217j070225
15886F835489j060702l85173n62367p23276J24051p06186p6568j05496l96817
15877B942955j14480L8307M3684j49036K48824k80093M1313J4701p729R6928j72738
15866B702636K74734l58272K46390l84577M2531K3092m5074P670j50598j77178
15856B181354M22113l26848O4092M0840j06039O2113J41263k59009J34435O5530
15846B419844k68002K96448K4284k21231K04824k368q1021J36576m3890K59896
$$ plain form
15836 2725360 2877704 2964345 2802948 2813285 2608634 2993922 2758971 2608153 2748649 2603025
15826 2603025 2409498 2469859 2395180 2719219 2525612 2358297 2569935 2274160 2393053 2433115
15816 2433115 2425746 2406521 2200653 2493520 2446938 2504809 2459297 2639060 2489342 2638227
15806 2638227 2664259 2541931 2526752 2704745 2594752 2661794 2568096 2766569 2716385 3117062
15796 3117062 3153870 3104018 3211803 3319514 3580834 3435917 3714344 3640051 3601508 3427482
15786 3427482 3559970 3517634 3808327 3833581 3892977 3899061 4241664 4331371 4587400 4561727 4822244
15775 4822244 4871668 4778039 4970351 4793115 4660746 4786243 4976696 4506417 4890399 4809104
15765 4809104 4989404 5026992 4948408 5271391 5094191 5181213 5531074 5287707 5042522 5396055
$$ packed form
15836B725360J52344Q6641j61397J0337k04651L85288k34951j50818J40496j45624
15826B603025j93527O0361p4679L24039j93607j67315K11638k95775J18893M0062
15816B433115p369j9225k05868K92867m6582N7871m5512J79763j49718J48885
15806B638227K6032j22328j5179J77993j09993O7042r3698J98473n0184M00677
15796C117062L6808m9852J07785J07711K61320j44917K78427p4293l8543j74026
15786C427482J32488m2336K90693K5254N9396O084L42603Q9707K56029k5673K60517
15775D822244M9424r3629J92312j77236j32369J25497J90453m70279L83982q1295
15765D809104J80300L7588p8584L22983j77200Q7022L49861k43367k45185L53533
$$ plain form
15755 5396055 5006409 5221408 5169203 5401792 5148849 5268575 5362794 5455491 5720983 5908796
15745 5908796 5775476 6257871 6383853 6421440 6889706 6715261 7311970 7568038 7521597 7605882
15735 7605882 7689327 7611177 7613254 7613210 7538264 7773215 7887474 7998191 8250429 8050110 8071130
15724 8071130 7945767 7881956 7435847 7084050 6909531 6792579 7012516 6714459 6871010 6954354
15714 6954354 7030444 7102309 6894742 7248199 6774354 6845996 6678644 6768943 7076336 7351935
15704 7351935 7216171 7623043 8037502 8120948 8417717 8444949 8695517 8715460 8773481 8877443
15694 8877443 9077193 9050152 9110673 9220898 9232677 9019304 9090906 8727105 8660198 8497249
15684 8497249 8429731 8456812 8441675 8493073 8501748 8571621 8538621 8188770 8099173 8224535 7698328
$$ packed form
15755E396055l89646K14999n2205K32589k52943J19726R4219R2697K65492J87813
15745E908796j33320M82395J25982L7587M68266j74445N96709K56068m6441Q4285
15735G605882Q3445p8150K077m4p4946K34951J14259J10717K52238k00319K1020
15724H071130j25363o3811m46109l51797j74519j16952K19937k98057J56551Q3344
15714F954354P6090P1865k07567L53457m73845P1642j67352R0299L07393K75599
15704G351935j35764M06872M14459Q3446K96769K7232K50568J9943N8021J03962
15694H877443J99750k7041O0521J10225J1779k13373P1602l63801o6907j62949
15684H497249o7518K7081j5137N1398Q675O9873l3000l49851q9597J25362n26207
$$ plain form
15673 7698328 7538027 7248810 7111829 7268822 7138789 7174338 6937592 7105708 6938991 7160659
15663 7160659 7321548 7308858 7993997 8214046 8297001 8625098 9169784 9465282 10112361 10503054
15653 10503054 11013670 11692166 12260929 13196558 13417462 14065642 14750441 15424333 15799968
15644 15799968 16280832 16609270 17215910 17717826 18670849 19552214 20521461 21484661 22097428
15635 22097428 22931665 23084578 23209761 23222796 23017790 22706724 22392973 21986395 21771764
15626 21771764 21931249 21754092 22227634 22182028 21915144 21528432 21358158 20462032 19481411
15617 19481411 18433559 17402612 16637242 15625482 15003787 14493519 13961089 13665494 13406807
15608 13406807 13171530 12679738 12323670 11952200 11691342 11208883 11048755 10878696 10474601
$$ packed form
15673G698328j60301k89217j36981J56993j30033L5549k36746J68116j66717K21668
15663G160659J60889j2690O85139K20049Q2955L28097N44686K95498O47079L90693
15653A0503054N10616O78496N68763R35629K20904O48180O84799O73892L75635
15644A5799968M80864L28438O06640N01916R53023Q81365R69247R63200O12767
15635B2097428Q34237J52913J25183J3035k05006l11066l13751m06578k14631
15626B1771764J59485j77157M73542m5606k66884l86712j70274q96126r80621
15617A9481411j047852j030947p65370j011760o21695n10268n32430k95595k58687
15608A3406807k35277m91792l56068l71470k60858m82459j60128j70059m04095
$$ plain form
15599 10474601 10364168 10335995 10343154 10662395 10547496 11077745 11395139 12333984 14026273 17174793
15589 17174793 24185998 37010645 55042085 71581339 82983182 89603284 91649103
15582 91649103 91185189 87622368 76274065 58230366 41049810 29535784 22276715 17549740
15574 17549740 14562308 12413175 10929306 10142641 9659296 9060902 9327121 9413970 9411235
15565 9411235 9412695 9753356 9777243 10045507 10290267 10569574 10824762 11820391 13099849 15363499
15555 15363499 20385053 31460856 50956536 74831081 94920080 108067236 114631653
15548 114631653 115974111 114380964 107467678 89233326 65339137 44442159 31051739
15541 31051739 22818811 17315935 13516805 11047421 9507441 8485230 7542854 6870630
$$ packed form
15599A0474601j10433k8173P159L19241j14899N30249L17394R38845J692289L148520
15589A7174793P011205J2824647J8031440J6539254J1401843O620102K045819
15582I1649103m63914l562821j1348303j8043699j7180556j1514026p259069m726975
15574A7549740k987432k149133j483869p86665m83345n98394K66219Q6849k735
15565I411235J460L40661K3887K68264K44760K79307K55188R95629J279458K263650
15555A5363499N021554J1075803J9495680K3874545K0088999J3147156O564417
15548A14631653J342458j593147o913286j8234352k3894189k0896978j3390420
15541C1051739q232928n502876l799130k469384j539980j022211r42376o72224
$$ plain form
15533 6870630 6587624 6559300 6278469 6185666 6090366 5768406 5618872 5347153 5278739 5007950
15523 5007950 4830336 4633670 4808099 4670598 4565305 4462112 4544862 4467035 4601985 4483706
15513 4483706 4508946 4793431 4749988 5028851 4897431 5133183 5072642 5128983 5063420 4916159
15503 4916159 5085530 4941288 4630995 4594468 4840382 4480735 4402450 4555217 4303902 4710560
15493 4710560 4643852 4643380 4751221 4809073 4824254 4748335 4968753 5222036 5341042 5274974 5602854
15482 5602854 5944573 6234583 6330585 6305719 6538715 6352655 6841185 6392834 6369136 6479329
15472 6479329 6818358 6909704 7482567 8205297 9317441 9810775 10569929 10896059 11398658
15463 11398658 11153353 10901570 10681067 9775013 9473489 9283616 9080509 9259230 9847556
$$ packed form
15533F870630k83006k8324k80831r2803r5300l21960j49534k71719o8414k70789
15523E007950j77614j96666J74429j37501j05293j03193Q2750p7827J34950j18279
15513D483706K5240K84485m3443K78863j31420K35752o0541N6341o5563j47261
15503D916159J69371j44242l10293l6527K45914l59647p8285J52767k51315M06658
15493D710560o6708m72J07841N7852J5181p5919K20418K53283J19006o6068L27880
15482E602854L41719K90010R6002k4866K32996j86060M88530m48351k3698J10193
15472F479329L39029R1346N72863P22730J112144M93334P59154L26130N02599
15463A1398658k45305k51783k20503r06054l01524j89873k03107J78721N88326
$$ plain form
15454 9847556 10387685 10952315 11809360 12339099 12555168 12319884 12225589 11629718 10957905 10409652
15444 10409652 10000490 9566598 9453556 9609702 9668925 10099923 10063873 10226655 10412093 10244249
15434 10244249 10190012 9956336 9357878 8933248 8764283 8339895 8146314 8142108 7740818 7711318
15424 7711318 7425010 7159116 7024248 6845746 6651101 6417199 5942321 6131602 5878922
15415 5878922 5699406 5326678 5361451 5292498 5208752 5235407 5270408 5368255 5292255 5125238 5271268
15404 5271268 5423311 5165345 5536251 5457746 5679936 5504309 6031697 6058967 6155634 6302323
15394 6302323 6086219 6324001 6209904 6131528 5816961 6183807 6124387 6282439 6286039 6391815
15384 6391815 6372286 6346110 6493604 6646779 6862743 6732374 6858462 6500591 6869278 6577406
$$ packed form
15454I847556N40129N64630Q57045N29739K16069k35284r4295n95871o71813n48253
15444A0409652m09162m33892j13042J56146N9223M30998l6050J62782J85438j67844
15434A0244249n4237k33676n98458m24630j68965m24388j93581m206m01290k9500
15424G711318k86308k65894j34868j78502j94645k33902m74878J89281k52680
15415E878922j79516l72728L4773o8953q3746K6655L5001R7847p6000j67017J46030
15404E271268J52043k57966L70906p8505K22190j75627N27388K7270R6667J46689
15394F302323k16104K37782j14097p8376l14567L66846n9420J58052L600J05776
15384F391815j9529k6176J47494J53175K15964j30369J26088l57871L68687k91872
$$ plain form
15374 6577406 6678700 6426876 6482395 6386692 6726135 6728785 6855565 6753319 6879136 6961355
15364 6961355 7452468 7345053 7723146 7733334 7818148 7775598 8063758 8122190 8329098 8277955
15354 8277955 8596418 8689663 9080167 9549060 9979264 10563352 12157810 14584003 19690738
15345 19690738 27563610 37488536 46481320 52903860 56283180 57295010 57074692 54249934
15337 54249934 47207629 38090381 29755749 24459228 20764096 19011573 17571410 16676309
15329 16676309 15886965 15237590 14590561 14062910 13422870 13117062 13033738 13202762 13479309
15320 13479309 13595884 13920574 14466464 14971171 16195863 17938707 21502356 28451688 40131905
15311 40131905 56412395 73511056 88210756 97973511 103079492 103618209 99818137 90118807
$$ packed form
15374F577406J01294k51824N5519r5703L39443K650J26780j02246J25817Q2219
15364F961355M91113j07415L78093J0188Q4814m2550K88160N8432K06908n1143
15354H277955L18463R3245L90504M68893M30204N84088J594458K426193N106735
15345A9690738P872872R924926Q992784O422540L379320J011830k20318k824758
15337E4249934p042305r117248q334632n296521l695132j752523j440163q95101
15329A6676309p89344o49375o47029n27651o40040l05808q3324J69024K76547
15320A3479309J16575L24690N45890N04707J224692J742844L563649O949332J1680217
15311D0131905J6280490J7098661J4699700R762755N105981N38717l800072r699330
$$ plain form
15303 90118807 75251556 58008716 43245813 32374643 25484922 20888817 18089094
15296 18089094 15917031 14764734 13732506 13607765 13232153 13233005 13131491 13032980 12603454
15287 12603454 12574187 12524349 12264486 12468526 12315289 12514727 13228870 14568788 17715966
15278 17715966 23217924 31214047 40468672 48382753 53605357 55916983 56372907 55032246
15270 55032246 51066163 43377336 34264568 26768621 21352138 18013358 15750633 14090639
15262 14090639 12931180 11494844 10666186 9670872 9235058 9033049 8943014 8917724 9282860
15253 9282860 9379644 9689459 9883709 9953552 10290773 10124714 10311915 10317114 9915711 10046191
15243 10046191 9848588 9482202 9368758 8847910 8393100 8364615 8361407 8685949 9102100 9402945
$$ packed form
15303I0118807j4867251j7242840j4762903j0871170o889721m596105k799723
15296A8089094k172063j152297j032228j24741l75612Q52j01514r8511m29526
15287A2603454k9267m9838k59863K04040j53237J99438P14143J339918L147178
15278A7715966N501958P996123R254625P914081N222604K311626M55924j340661
15270E5032246l966083p688827r112768p495947n416483l338780k262725j659994
15262A4090639j159459j436336q28658r95314m35814k02009r0035k5290L65136
15253I282860R6784L09815J94250O9843L37221j66059J87201N199m01403J30480
15243A0046191j97603l66386j13444n20848m54810k8485l208L24542M16151L00845
$$ plain form
15233 9402945 10010518 10697738 11090987 11382991 11514291 11777835 11560985 11365649 10896325
15224 10896325 10385923 10049800 9734191 9400097 9155411 9204867 9244261 9435772 9594178 9926581
15214 9926581 10286115 10897492 11180682 11540469 11476675 10974394 10815219 9918068 9512212 9196517
15204 9196517 8608369 8035763 7659128 7347980 7043824 7012331 6969695 6826632 6787240 6263041
15194 6263041 6251644 6344365 6288641 6636112 6579447 7002904 7140622 7227033 7236647 7448601 7459586
15183 7459586 7152566 7309181 7275330 7368665 7534563 7738390 7943917 8189729 8344698 8280607
15173 8280607 8391644 8028831 8256963 8233421 8117207 7958214 7968240 8244703 7935653 8015077
15163 8015077 7868340 8095364 8057885 8170914 8432982 8754078 8700893 9284185 9144161 9135658
$$ packed form
15233I402945O07573O87220L93249K92004J31300K63544k16850j95336m69324
15224A0896325n10402l36123l15609l34094k44686M9456L9394J91511J58406L32403
15214I926581L59534O11377K83190L59787o3794n02281j59175q97151m05856l15695
15204I196517n88148n72606l76635l11148l04156l1493m2636j43063l9392n24199
15194F263041j1397R2721n5724L47471n6665M23457J37718Q6411R614K11954J0985
15183G459586l07020J56615l3851R3335J65898K03827K05527K45812J54969o4091
15173H280607J11037l62813K28132k3542j16214j58993J0026K76463l09050P9424
15163H015077j46737K27024l7479J13029K62068L21096n3185N83292j40024q503
$$ plain form
15153 9135658 9199142 9213215 9019609 9131318 8977152 8708616 8853983 8945846 8700533 8561456
15143 8561456 8958210 8908269 8848406 9178100 8929631 8830896 8669421 8956521 8995465 8748648
15133 8748648 8796829 8750584 8953786 8846420 8693076 8908670 8881655 8826043 8814504 8681179
15123 8681179 8774935 8774953 8672353 8523856 8588053 8505368 8143369 8283366 8316482 8147221 8482630
15112 8482630 8003789 8317372 8256011 8340443 8410804 8179542 8568682 8470848 8580176 8748484
15102 8748484 8919403 9683083 9561134 9928981 10024112 10344466 10348342 10932930 10903567 11320314
15092 11320314 12191320 13113472 14457565 16879773 20206998 24058761 27420942 29966002
15084 29966002 31376208 31825131 31762045 30703948 28437279 25449967 23070925 22116330 21667780
$$ packed form
15153I135658O3484J4073j93606J11709j54166k68536J45367R1863k45313j39077
15143H561456L96754m9941n9863L29694k48469r8735j61475K87100L8944k46817
15133H748648M8181m6245K03202j07366j53344K15594k7015n5612j1539j33325
15123H681179R3756J8j02600j48497O4197q2685l61999J39997L3116j69261L35409
15112H482630m78841L13583o1361Q4432P0361k31262L89140r7834J09328J68308
15102H748484J70919P63680j21949L67847R5131L20354L876N84588k9363M16747
15092A1320314Q71006R22152J344093K422208L327225L851763L362181K545060
15084B9966002J410206M48923o3086j058097k266669k987312k379042r54595m48550
$$ plain form
15075 21667780 22699967 25176741 28921273 32619310 34849245 36834262 37379259 37623068
15067 37623068 36791789 35023572 32378392 30707581 31983751 36354544 41908407 47153313
15059 47153313 50127117 52362925 54305161 55754007 56086339 54561656 51464639 49396074
15051 49396074 49049399 50110613 52089263 55096089 58717470 60910521 62719818 63950992
15043 63950992 64464987 65161778 65171134 64260048 61371167 58431540 55974159 53808006 52233113
15034 52233113 50116416 47448256 45281593 43976632 44610579 47495818 52863096 58782750
15026 58782750 64060802 68981192 73213884 77924847 81789393 84077355 84862389 86396622
15018 86396622 89400174 93719189 99379326 105280942 111581315 116149280 118369024 118784501
$$ packed form
15075B1667780J032187K476774L744532L698037K229935J985017N44997K43809
15067C7623068q31279j768217k645180j670811J276170M370793N553863N244906
15059D7153313K973804K235808J942236J448846L32332j524683l097017k068565
15051D9396074l46675J061214J978650L006826L621381K193051J809297J231174
15043F3950992N13995O96791R356r11086k888881k939627k457381k166153j574893
15034E2233113k116697k668160k166663j304961O33947K885239N367278N919654
15026E8782750N278052M920390M232692M710963L864546K287962P85034J534233
15018H6396622L003552M319015N660137N901616O300373M567965K219744M15477
$$ plain form
15010 118784501 116882264 112868969 106981995 99187859 89952648 81385699 74167578 68294808
15002 68294808 63298446 59600276 57186372 56083179 55873986 57317106 58956724 60286162
14994 60286162 60756297 61301185 60854885 59250820 57375487 54294502 50996077 49324419
14986 49324419 49694628 50501209 51624895 52368599 53122213 54249183 54793974 54410964 51413208
14977 51413208 47241441 43092145 39670711 36973280 33513633 30693058 29300859 28260831
14969 28260831 27467673 27527260 27792729 28056420 28742335 29650228 29924326 30852903 31845224
14960 31845224 33028620 34682215 37028882 40786761 46454657 54668317 66485545 83575821
14952 83575821 106158265 134220014 166371683 202690163 241473877 280830722 319095602
$$ packed form
15010A18784501j902237m013295n886974p794136r235211q566949p218121n872770
15002F8294808m996362l698170k413904j103193k09193J443120J639618J329438
14994F0286162M70135N44888m46300j604065j875333l080985l298425j671658
14986D9324419L70209Q06581J123686P43704P53614J126970N44791l83010k997756
14977E1413208m171767m149296l421434k697431l459647k820575j392199j040028
14969B8260831p93158N9587K65469K63691O85915R07893K74098R28577R92321
14960C1845224J183396J653595K346667L757879N667896Q213660J1817228J7090276
14952H3575821K2582444K8061749L2151669L6318480L8783714L9356845L8264880
$$ plain form
14945 319095602 354752779 385124456 405331970 412380585 404528812 384353748 358111746
14938 358111746 330739234 301528631 268617097 237241577 212215027 195270454 183456246
14931 183456246 173706946 162053486 148566536 134623812 121697914 110094820 99647454
14924 99647454 91508890 86691745 84807932 84743430 84160857 82498534 79547983 75539897
14916 75539897 70808736 63173747 53021313 42449934 33463165 27200507 22831463 19539698
14908 19539698 17296643 15776717 15208727 14707250 14519023 15071323 15948302 16649749 18346641
14899 18346641 19593401 21220830 22847555 24725484 29070173 34670607 41546460 47579607
14891 47579607 51351499 53615867 54033431 53084091 49849048 44050024 36849436 29873225
$$ packed form
14945C19095602L5657177L0371677K0207514P048615p851773k0175064k6242002
14938C58111746k7372512k9210603l2911534l1375520k5026550j6944573j1814208
14931A83456246r749300j1653460j3486950j3942724j2925898j1603094j0447366
14924I9647454q138564m817145j883813o4502n82573j662323k950551m008086
14916G5539897m731161p634989j0152434j0571379q986769o262658m369044l291765
14908A9539698k243055j519926n67990n01477j88227N52300Q76979P01447J696892
14899A8346641J246760J627429J626725J877929M344689N600434O875853O033147
14891D7579607L771892K264368M17564r49340l235043n799024p200588o976211
$$ plain form
14883 29873225 24502845 21125078 18940415 17726578 16828929 16421556 16277803 16247242 16880828
14874 16880828 18035609 19014864 20481063 21199430 21603680 21465682 21884743 21889599 21553595
14865 21553595 20785154 20511378 21002870 21873009 23101869 25608227 30097891 37861992 48096452
14856 48096452 60193091 72983922 85821131 96832963 104697329 107931602 104414980
14849 104414980 97176789 86817450 75269633 62611728 50111908 39541350 32528297
14842 32528297 27324578 23819720 21418352 19741288 18436452 17555544 17107517 16353581
14834 16353581 16074784 15773600 15491193 15593185 15415905 15490305 15856749 16476273 17134065
14825 17134065 18068910 18935422 19684574 20944380 22816788 26451440 32715772 42196183
$$ packed form
14883B9873225n370380l377767k184663j213837q97649m07373j43753l0561O33586
14874A6880828J154781R79255J466199P18367M04250j37998M19061M856l36004
14865B1553595p68441k73776M91492Q70139J228860K506358M489664P764101J0234460
14856D8096452J2096639J2790831J2837209J1011832P864366L234273l516622
14849A04414980p238191j0359339j1547817j2657905j2499820j0570558p013053
14842C2528297n203719l504858k401368j677064j304836q80908m48027p53936
14834A6353581k78797l01184k82407J01992j77280P4400L66444O19524O57792
14825A7134065R34845Q66512P49152J259806J872408L634652O264332R480411
$$ plain form
14817 42196183 52437248 62591392 69527672 73202644 74100799 72231187 67030367 58200720
14809 58200720 46977517 36124954 27841459 22423565 18686504 16375428 14651102 13531927
14801 13531927 12859238 12154462 11720870 11166688 11339370 10641532 10143823 10044937 9823163
14792 9823163 9418702 9005141 8886315 8569907 8400992 8333644 8216966 8323231 8792464 8538567
14782 8538567 8910536 8900932 9336982 9981152 10832139 11975951 12948022 13581089 13689105 13943831
14772 13943831 13696783 13213864 12512884 11124780 10406149 9482857 8983983 8803255 8882730
14763 8882730 8941083 9153383 9072830 9181843 9469623 9650368 10176279 10375683 10728425 10892485
14753 10892485 10789757 11040928 11069450 11248389 11239743 11276453 11430651 11488000 11397334 11892446
$$ packed form
14817D2196183J0241065J0154144O936280L674972Q98155j869612n200820q829647
14809E8200720j1223203j0852563q283495n417894l737061k311076j724326j119175
14801A3531927o72689p04776m33592n54182J72682o97838m97709r8886k21774
14792I823163m04461m13561j18826l16408j68915o7348j16678J06265M69233k53897
14782H538567L71969r604M36050O44170Q50987J143812R72071O33067J08016K54726
14772A3943831k47048m82919p00980j388104p18631r23292m98874j80728P9475
14763H882730N8353K12300q0553J09013K87780J80745N25911J99404L52742J64060
14753A0892485j02728K51171K8522J78939q646L6710J54198N7349r0666M95112
$$ plain form
14743 11892446 11996047 12187411 12655350 13242726 14118040 15298039 16538860 18421648 20473271
14734 20473271 23627762 28028869 34212695 43809601 58851582 82774196 116803689 158606671
14726 158606671 203532031 246207693 280243027 301877135 309338375 301177466 276998827
14719 276998827 241338284 199212444 156207881 117545886 87351160 65698364 50726421
14712 50726421 40032979 32524890 27141782 23383549 20483852 18090272 16500861 15129162
14704 15129162 13877335 12946833 11775170 10848805 10242955 9446571 8971292 8635226 8044609
14695 8044609 7930219 7802118 7855963 7853048 7903606 8081177 8021522 8127607 7896952 8273200
14685 8273200 8227838 8018566 8281475 8190710 8673403 8650272 8769704 8870747 9262384 10225481
$$ packed form
14743A1892446J03601J91364M67939N87376Q75314J179999J240821J882788K051623
14734B0473271L154491M401107O183826R596906J5041981K3922614L4029493M1802982
14726A58606671M4925360M2675662L4035334K1634108P461240q160909k4178639
14719B76998827l5660543m2125840m3004563l8661995l0194726k1652796j4971943
14712E0726421j0693442p508089n383108l758233k899697k393580j589411j371699
14704A5129162j251827r30502j171663r26365o05850p96384m75279l36066n90617
14695H044609j14390j28101N3845k915N0558J77571n9655J06085k30655L76248
14685H273200m5362k09272K62909r0765M82693k3131J19432J01043L91637R63097
$$ plain form
14675 10225481 11073401 12028944 12990260 13137427 12997196 12886224 12375290 11298996 10048265
14666 10048265 9009620 8461671 8202242 8535284 8233416 8128550 8323217 8434148 8186937
14657 8186937 8081516 7406063 6848290 6656157 6099192 6221147 6285197 6051653 6160558 6148183
14647 6148183 6519708 6929161 6986358 7369556 7341988 7651206 8071502 8153423 7619989 7893303
14637 7893303 8032384 8640985 9007783 9902292 10196512 10727349 10594171 10698554 9884089
14628 9884089 9157603 7937615 7157022 6222733 5436260 5238960 4884204 4958713 4515077
14619 4515077 4479551 4341622 4485543 4537568 4483994 4462989 4311331 4677200 4501978 4492994
14609 4492994 4551877 4279413 4181407 4074986 3574523 3776737 3405348 3711159 3818306 4146146
$$ packed form
14675A0225481Q47920R55543R61316J47167j40231j10972n10934j076294j250731
14666A0048265j038645n47949k59429L33042l01868j04866J94667J10931k47211
14657H186937j05421o75453n57773j92133n56965J21955O4050k33544J08905j2375
14647F148183L71525M09453N7197L83198k7568L09218M20296Q1921n33434K73314
14637G893303J39081O08601L66798Q94509K94220N30837j33178J04383q14465
14628I884089p26486j219988p80593r34289p86473j97300l54756P4509m43636
14619D515077l5526j37929J43921N2025n3574k1005j51658L65869j75222q984
14609D492994N8883k72464r8006j06421n00463K02214l71389L05811J07147L27840
$$ plain form
14599 4146146 4620103 5447941 6485667 7176481 7891799 8323728 8610077 8338411 7700845
14590 7700845 7337405 6304195 5625809 4563432 4453530 4106433 3946090 4014605 4096606
14581 4096606 4205694 4035231 4096312 4134613 4354932 4503992 4359929 4220542 4610611 4544232
14571 4544232 4693451 4898520 4886369 5150460 5637884 6172986 6925222 7761150 8674619 9592712
14561 9592712 10784037 13035532 17620473 25159272 35790723 45456185 53099508 57701092
14553 57701092 59489792 59587705 57289736 50880503 41057171 31434350 24596361 20665695
14545 20665695 19917417 21426361 26722411 36240119 46998389 56331170 62504180 65229117
14537 65229117 65947948 64008809 58627800 49288204 37911107 28308203 21809376 18393365
$$ packed form
14599D146146M73957Q27838J037726O90814P15318M31929K86349k71666o37566
14590G700845l63440j033210o78386j062377j09902l47097j60343O8515Q2001
14581D096606J09088j70463O1081L8301K20319J49060j44063j39387L90069o6379
14571D544232J49219K05069j2151K64091M87424N35102P52236Q35928R13469R18093
14561I592712J191325K251495M584941P538799J0631451R665462P643323M601584
14553E7701092J788700R7913k297969o409233r823332r622821o837989l930666
14545B0665695p48278J508944N296050R517708J0758270R332781O173010K724937
14537F5229117P18831j939139n381009r339596j1377097r602904o498827l416011
$$ plain form
14529 18393365 16312765 15150023 14785212 14447099 14311511 14315986 14054848 13703499 13629757
14520 13629757 15081777 18450097 24890773 32829753 39597567 44372176 47117685 48000580
14512 48000580 47874418 45410159 39891548 32916468 27035295 23465209 22066253 22328697
14504 22328697 24966679 29781952 36542979 43414230 48029335 50923733 51551993 51113695
14496 51113695 49153691 44053663 36731154 29271990 23726460 20142782 17080730 14968100
14488 14968100 13369169 11853942 10616708 9293345 7984537 6660951 5675218 5032119
14480 5032119 4783522 4539467 4284490 4309728 4010333 4210413 4036154 4227835 4296550 4523898
14470 4523898 4922640 5455325 6107302 6574787 7044118 6828165 6981538 7019594 6480997 6174038
$$ packed form
14529A8393365k080600j162742l64811l38113j35588M475k61138l51349p3742
14520A3629757J452020L368320O440676P938980O767814M774609K745509Q82895
14512D8000580j26162k464259n518611o975080n881173l570086j398956K62444
14504B2328697K637982M815273O761027O871251M615105K894398O28260m38298
14496E1113695j960004n100028p322509p459164n545530l583678l062052k112630
14488A4968100j598931j515227j237234j323363j308808j323586r85733o43099
14480E032119k48597k44055k54977K5238k99395K00080j74259J91681O8715K27348
14470D523898L98742N32685O51977M67485M69331k15953J53373L8056n38597l06959
$$ plain form
14460 6174038 5715057 6131903 6465216 7237703 7771476 8328788 8444496 8303779 8521179
14451 8521179 7952714 7312039 6534794 6024492 6038035 6140502 6340753 6599097 6914931 6888623
14441 6888623 7564567 7682367 7769638 7970714 8207981 8449189 8613616 8962035 8899006 9714608
14431 9714608 10134947 11462689 13633567 16872246 22337269 29731049 37693941 44536772
14423 44536772 49927448 53321872 54533151 53655077 49938801 44050682 36988994 29972659
14415 29972659 24480776 20123315 16836355 14398602 12540496 10960358 9852246 9341484
14407 9341484 8885558 8398663 8413063 8328576 8407380 8270539 8457423 8430498 8517431 8770224
14397 8770224 9569115 10095031 11248903 13022023 15894459 20759418 28305990 38663643
$$ packed form
14460F174038m58981M16846L33313P72487N33773N57312J15708j40717K17400
14451H521179n68465o40675p77245n10302J3543J02467K00251K58344L15834k6308
14441F888623O75944J17800Q7271K01076K37267K41208J64427L48419o3029Q15602
14431I714608M20339J327742K170878L238679N465023P393780P962892O842831
14423D4536772N390676L394424J211279q78074l716276n888119p061688p016335
14415B9972659n491883m357461l286960k437753j858106j580138j108112n10762
14407I341484m55926m86895J4400q4487P8804j36841J86884k6925Q6933K52793
14397H770224P98891N25916J153872J773120K872436M864959P546572J0357653
$$ plain form
14389 38663643 51503256 64501984 75607673 83576082 88158762 88692869 85059200 77351400
14381 77351400 65789161 53299589 41856704 32406260 25330523 20440274 16438163 13799235
14373 13799235 12194998 10840614 10123605 9877531 9023522 8816499 8575856 8470265 8119683
14364 8119683 8304907 8095547 8358339 8044973 8713686 9029285 10108346 10736351 12896821
14355 12896821 15513984 18824404 23292778 29034662 34534880 39324224 42579370 44396780
14347 44396780 44691820 43429280 40336585 36785254 32738081 29274275 27239199 26632655
14339 26632655 28184402 31400442 36876417 45026997 56342353 69982051 82646862 93759759
14331 93759759 101764605 106282896 106871488 103765507 95540794 84027469 70857222 58226541
$$ packed form
14389C8663643J2839613J2998728J1105689P968409M582680N34107l633669p707800
14381G7351400j1562239j2489572j1442885r450444p075737m890249m002111k638928
14373A3799235j604237j354384p17009k46074q54009k07023k40643j05591l50582
14364H119683J85224k09360K62792l13366O68713L15599J079061O28005K160470
14355A2896821K617163L310420M468374N741884N500218M789344L255146J817410
14347D4396780K95040j262540l092695l551331m047173l463806k035076o06544
14339B6632655J551747L216040N475975Q150580J1315356J3639698J2664811J1112897
14331I3759759Q004846M518291N88592l105981q224713j1513325j3170247j2630681
$$ plain form
14323 58226541 47048823 37937144 30527851 25077272 20635733 17396955 14779924 12624887
14315 12624887 10956610 9632238 8606544 7878409 7189445 6794313 6155845 5850855 5542426
14306 5542426 5254173 4823132 4656302 4383846 4129117 4050760 3759756 3527356 3652542 3567572
14296 3567572 3584005 3679892 3350129 3242231 2975812 3019771 3033463 2821706 2921399 2833999
14286 2833999 2843524 2880641 2651203 2597920 2775972 2917833 2759747 2774716 2778391 2712794 2855963
14275 2855963 3082616 3120554 3045071 3026918 3277551 3180174 2909484 2795487 2825147 2701980
14265 2701980 2513853 2599761 2749486 2522942 2667803 2623550 2496494 2446886 2362073 2390463
14255 2390463 2211033 2248188 2214659 2078258 1957440 2337306 2470891 2157680 2147168 2133719
$$ packed form
14323E8226541j1177718r111679p409293n450579m441539l238778k617031k155037
14315A2624887j668277j324372j025694p28135o88964l95132o38468l04990l08429
14306E542426k88253m31041j66830k72456k54729p8357k91004k32400J25186q4970
14296C567572J6433R5887l29763j07898k66419M3959J3692k11757R9693q7400
14286B833999R525L7117k29438n3283J78052J41861j58086J4969L675o5597J43169
14275B855963K26653L7938p5483j8153K50633r7377k70690j13997K9660j23167
14265B701980j88127Q5908J49725k26544J44861m4253j27056m9608q4813K8390
14255B390463j79430L7155l3529j36401j20818L79866J33585l13211j0512j3449
$$ plain form
14245 2133719 2156375 2049326 2048554 1897670 2040654 1992752 2137018 1939348 2136518 2177601
14235 2177601 1831204 2021587 2320010 1913418 1814878 1984746 2111297 1839313 1968521 1874201
14225 1874201 1887586 1749109 1723196 1814032 2054175 1922604 1990905 1904936 1891064 2211047
14215 2211047 2315925 2160986 2288097 2850973 2641942 2636037 2551804 2702681 3425796 4015809
14205 4015809 4312159 4692992 4768684 4487572 4774295 4517334 3662546 2908080 2369743 2080745
14195 2080745 2172836 1926033 2025139 1924949 2008872 1901525 2127721 2231962 2023792 2123286
14185 2123286 2190551 2002015 2149918 1892808 1930444 1933854 1895183 2444580 2239331 2895651
14175 2895651 2594239 2631775 2627170 2858360 2804141 2499153 2573054 2137976 2296392 1965382
$$ packed form
14245B133719K2656j07049p72j50884J42984m7902J44266j97670J97170M1083
14235B177601l46397J90383K98423m06592r8540J69868J26551k71984J29208r4320
14225A874201J3385j38477k5913R0836K40143j31571O8301q5969j3872L19983
14215B211047J04878j54939J27111N62876k09031n905q4233J50877P23115N90013
14205D015809K96350L80833P5692k81112K86723k56961q54788p54466n38337k88998
14195B080745R2091k46803R9106j00190Q3923j07347K26196J04241k08170R9494
14185B123286O7265j88536J47903k57110L7636L410l8671N49397k05249O56320
14175B895651l01412L7536m605K31190n4219l04988P3901m35078J58416l31010
$$ plain form
14165 1965382 2078420 2085027 1884068 1844388 1879461 1746204 1835176 1931738 2222570 2045625
14155 2045625 2055861 2188200 2169017 2237726 2135621 2258062 2413977 2363907 2239953 2261575
14145 2261575 2324834 2523283 2720908 2899501 3282130 3831177 4444455 5580875 6937087
14136 6937087 7788758 8432799 8860479 8876897 8916383 8099579 7264294 6041374 5301337 4582662
14126 4582662 3958727 3478620 3563232 2821153 3035443 3063295 2989819 3413161 3662249 3972222
14116 3972222 4105680 3973644 4017495 4020413 3831845 3313008 2967393 2816709 2682138 2579535
14106 2579535 2444056 2477779 2529698 2384704 2622075 2747373 2513919 2837574 3343449 3748701
14096 3748701 4079681 4558520 4857639 5168230 5209066 5336528 5313407 4872318 4580873 4495167
$$ packed form
14165A965382J13038O607k00959l9680L5073j33257Q8972R6562K90832j76945
14155B045625J0236J32339j9183O8709j02105J22441J55915n0070j23954K1622
14145B261575O3259J98449J97625J78593L82629N49047O13278J136420J356212
14136F937087Q51671O44041M27680J6418L9486q16804q35285j222920p40037p18675
14126D582662o23935m80107Q4612p42079K14290K7852p3476M23342K49088L09973
14116C972222J33458j32036M3851K918j88568n18837l45615j50684j34571j02603
14106B579535j35479L3723N1919j44994K37371J25298k33454L23655N05875M05252
14096C748701L30980M78839K99119L10591M0836J27462k3121m41089k91445q5706
$$ plain form
14086 4495167 4044448 4192159 4743404 4984477 5728165 6205675 6580035 6998384 7247021
14077 7247021 7294435 7207099 7267301 7051016 7063223 6868033 7359009 7625438 8319306 9182838
14067 9182838 10209124 11510800 12896282 15166467 17859878 21577621 26645986 33266603
14059 33266603 42128257 53360146 65204550 77152288 86958718 94192254 97538634 97011024
14051 97011024 93229000 85563676 75186493 63451989 51811771 42030389 34152892 28184997
14043 28184997 23926413 20370236 17584067 15509881 13589838 12196206 10636088 9392651
14035 9392651 8540983 7332251 6631107 5918770 5545939 4945514 4732272 4381221 3988646
14026 3988646 3995337 4014361 3771531 3657975 3521398 3302761 3345042 3344721 3256783 2813257 2797924
$$ packed form
14086D495167m50719J47711N51245K41073P43688M77510L74360M18349K48637
14077G247021M7414q7336O0202k16285J2207j95190M90976K66429O93868Q63532
14067I182838J026286J301676J385482K270185K693411L717743N068365O620617
14059C3266603Q861654J1231889J1844404J1947738R806430P233536L346380n27610
14051I7011024l782024p665324j0377183j1734504j1640218r781382p877497n967895
14043B8184997m258584l556177k786169k074186j920043j393632j560118j243437
14035I392651q51668j208732p01144p12337l72831o00425k13242l51051l92575
14026C988646O691J9024k42830j13556j36577k18637M2281l21q7938m43526j5333
$$ plain form
14015 2797924 2758249 2643843 2532337 2586048 2541288 2532920 2509327 2694001 2560488 2651389 2270575
14004 2270575 2369459 2341017 2212219 2156938 2073690 2296738 2262186 2111634 2186508 2403724
13994 2403724 2283987 2464768 2359200 2522624 2769012 3056038 3467237 3818685 4394974
13985 4394974 5317985 6510471 8221292 9603397 10178453 10792523 11298595 11036535 10534756
13976 10534756 9755511 8365917 7162911 5783097 5124025 4665779 4169625 3942771 3795420
13967 3795420 3375238 3661173 3340212 3286853 3043727 2793185 2659720 2601983 2534095 2347214
13957 2347214 2313956 1965228 2333839 2162448 1996956 1919017 1914998 1960538 2200729 2283898
13947 2283898 2661760 2853431 3134334 2849468 3311391 3264706 3733535 4201078 5894115
$$ packed form
14015B797924l9675j14406j11506N3711m4760q368k3593J84674j33513R0901l80814
14004B270575R8884k8442j28798n5281q3248K23048l4552j50552P4874K17216
13994B403724j19737J80781j05568J63424K46388K87026M11199L51448N76289
13985D394974R23011J192486J710821J382105N75056O14070N06072k62060n01779
13976A0534756p79245j389594j203006j379814o59072m58246m96154k26854j47351
13967C795420m20182K85935l20961n3359k43126k50542j33465n7737o7888j86881
13957B347214l3258l48728L68611j71391j65492p7939m019M5540K40191Q3169
13947B283898L77862J91671K80903k84866M61923m6685M68829M67543J693037
$$ plain form
13938 5894115 7868527 10110738 13000309 15641280 17942795 19425326 20257042 19976471
13930 19976471 18327294 16066775 13665912 11140414 8736289 6391228 5022628 4017323
13922 4017323 3154178 2682868 2201277 2252347 2056921 1942520 1853120 1707059 1717197 1436510
13912 1436510 1656738 1582571 1631099 1552482 1812966 1395171 1506257 1312380 1387218 1494545
13902 1494545 1258472 1524304 1446958 1733125 1430736 1339504 1598250 1482688 1325281 1600561
13892 1600561 1383985 1333473 1156057 1730106 1342599 1388617 1466049 1323249 1608345 1583708
13882 1583708 1447413 1614815 1383879 1350619 1425066 1166989 1251932 1452270 1680031 1392192
13872 1392192 1185647 1580496 1359796 1459584 1309756 1322133 1380405 1578660 1416557 1325557
$$ packed form
13938E894115J974412K242211K889571K640971K301515J482531Q31716k80571
13930A9976471j649177k260519k400863k525498k404125k345061j368600j005305
13922D017323q63145m71310m81591N1070j95426j14401q9400j46061J0138k80687
13912A436510K20228p4167M8528p8617K60484m17795J11086j93877P4838J07327
13902A494545k36073K65832p7346K86167l02389r1232K58746j15562j57407K75280
13892A600561k16576n0512j77416N74049l87507M6018P7432j42800K85096k4637
13882A583708j36295J67402k30936l3260P4447k58077Q4943K00338K27761k87839
13872A392192k06545L94849k20700R9788j49828J2377N8272J98255j62103r1000
$$ plain form
13862 1325557 1705613 1481945 1706336 1741294 1367209 1619247 1638629 1438356 1427892 1588865
13852 1588865 1473368 1362461 1515495 1529511 1287823 1348904 1641933 1440054 1324312 1532929
13842 1532929 1550504 1334655 1327555 1455747 1391851 1075864 1418991 1427481 1439754 1315376 1256990
13831 1256990 1163541 1417699 1270291 1442096 1309437 1326537 1387814 1555676 1295540 1526390
13821 1526390 1215068 1418056 1471205 1100586 1108490 1315106 1253743 1359825 952647 1362664
13811 1362664 1496080 1254945 1190287 1312475 1466557 1253316 1329509 1429697 1512764 1189705
13801 1189705 1190893 1348220 1502558 1604653 1433919 1409895 1317429 1405788 1317511 1513410
13791 1513410 1246688 1388930 1068143 1119480 1216166 1344599 1212632 1131762 1365220 1301494
$$ packed form
13862A325557L80056k23668K24391L4958l74085K52038J9382k00273j0464J60973
13852A588865j15497j10907J53034J4016k41688O1081K93029k01879j15742K08617
13842A532929J7575k15849p100J28192o3896l15987L43127Q490J2273j24378n8386
13831A256990r3449K54158j47408J71805j32659J7100O1277J67862k60136K30850
13821A526390l11322K02988N3149l70619P904K06616o1363J06082m07178M10017
13811A362664J33416k41135o4658J22188J54082k13241P6193J00188Q3067l23059
13801A189705J188J57327J54338J02095j70734k4024r2466Q8359q8277J95899
13791A513410k66722J42242l20787N1337R6686J28433j31967q0870K33458o3726
$$ plain form
13781 1301494 1172202 1209350 1465597 978610 1446478 1035168 1239530 1347077 1404024 1345619
13771 1345619 1526214 1727538 1694690 1654275 2023200 1694893 1859793 1787151 1684097 1657517
13761 1657517 1496091 1679328 1566359 1656446 1397423 1639592 1475547 1312220 1342651 1067331
13751 1067331 1532290 1267828 1372537 1564913 1294271 1429718 1605728 1458315 1593629
13742 1593629 1439242 1556372 1312028 1346912 1674464 1615946 1433606 1645083 1441407 1817102
13732 1817102 1421536 1489583 1642892 1638417 1736307 1479740 1647555 1650998 1717454 1752702 1818071
13721 1818071 1700673 1778582 1927951 1656677 1799480 2048375 1989115 2037331 1783632 1948407
13711 1948407 2042837 2122464 2062956 2173853 2321210 1933336 2056951 2048596 2053564 1940572 2112914
$$ packed form
13781A301494j29292L7148K56247m86987M67868m11310K04362J07547N6947n8405
13771A345619J80595K01324l2848m0415L68925l28307J64900p2642j03054k6580
13761A657517j61426J83237j12969R0087k59023K42169j64045j63327L0431k75320
13751A067331M64959k64462J04709J92376k70642J35447J76010j47413J35314
13742A593629j54387J17130k44344L4884L27552n8518j82340K11477k03676L75695
13732A817102l95566O8047J53309m475R7890k56567J67815L443O6456L5248O5369
13721A818071j17398P7909J49369k71274J42803K48895n9260M8216k53699J64775
13711A948407R4430P9627n9508J10897J47357l87874J23615q355M968j12992J72342
$$ plain form
13700 2112914 2127037 1937343 1887932 1821030 1918383 2273841 2042697 2330030 2626792 2774580
13690 2774580 2811739 2931938 2790235 2596413 2479484 2249118 2001161 2010062 2015237 1808740
13680 1808740 1848746 2196753 1981430 1751087 1824670 1811621 1893197 1643392 2155303 1882783
13670 1882783 1655090 1756603 1875140 2343312 2201912 2521688 2375845 2705740 2987838
13661 2987838 2861607 2942893 2910630 2849608 2797525 2635150 2734653 2478398 2234006 2395957
13651 2395957 1996819 2051706 2130376 2101970 2027426 1849425 2094419 1871503 1908394 1824385
13641 1824385 1756265 1879177 1986752 1888500 2024011 2164484 2192992 2416249 2508208 2815492
13631 2815492 2699198 2921194 2951737 2923208 2547161 2406192 2105118 2099512 1543054 1799107
$$ packed form
13700B112914J4123j89694m9411o6902R7353L55458k31144K87333K96762J47788
13690B774580L7159J20199j41703j93822j16929k30366k47957Q901N175k06497
13680A808740M0006L48007k15323k30343P3583j3049Q1576k49805N11911k72520
13670A882783k27693J01513J18537M68172j41400L19776j45843L29895K82098
13661B987838j26231Q1286l2263o1022n2083j62375R9503k56255k44392J61951
13651B395957l99138N4887P8670k8406p4544j78001K44994k22916L6891q4009
13641A824385o8120J22912J07575r8252J35511J40473K8508K23257R1959L07284
13631B815492j16294K21996L0543k8529l76047j40969l01074n606n56458K56053
$$ plain form
13621 1799107 1909969 1763806 1820918 1914211 1846915 1794615 1756464 1666687 1743506 1733730 1875939
13610 1875939 2021733 2120292 2245891 2270477 2249237 2187529 2247318 2218517 2321807 2150194
13600 2150194 1922562 1866124 1877030 1800651 1898563 1963434 1832034 1909293 2032613 2052565 2050320
13589 2050320 2152006 1911658 2097172 2038304 1921607 2042081 1916174 1694373 1822459 1677800
13579 1677800 1734354 1646758 1638700 1459608 1402065 1768793 1616227 1480467 1340648 1481861
13569 1481861 1386587 1647231 1643584 1408971 1639797 1803749 1541794 1607439 1368329 1503780
13559 1503780 1641027 1651791 1694493 1648251 1628913 1495653 1694279 1476696 1458195 1691840
13549 1691840 1615368 1636923 1644839 1534687 1680604 1878331 1810869 2185957 2311149 2480983
$$ packed form
13621A799107J10862j46163N7112R3293o7296n2300l8151q9777P6819r776J42209
13610A875939J45794R8559J25599K4586k1240o1708N9789k8801J03290j71613
13600B150194k27632n6438J0906p6379R7912O4871j31400P7259J23320J9952k245
13589B050320J01686k40348J85514n8868j16697J20474j25907k21801J28086j44659
13579A677800N6554q7596q058j79092n7543L66728j52566j35760j39819J41213
13569A481861r5274K60644l647k34613K30826J63952k61955O5645k39110J35451
13559A503780J37247J0764M2702m6242j9338j33260J98626k17583j8501K33645
13549A691840p6472K1555P916j10152J45917J97727o7462L75088J25192J69834
$$ plain form
13539 2480983 2549452 2789323 2332970 2550155 2119138 2344212 1663481 1822249 1878401 1669114
13529 1669114 1812781 1764163 1823576 1976674 1850100 2076977 2454666 2823491 2727665 2562802
13519 2562802 2455454 2230884 2038201 1780363 1493549 1476450 1562221 1469558 1492543 1523058
13509 1523058 1456176 1339572 1460105 1269490 1528956 1419405 1380805 1195195 1515266 1195293
13499 1195293 1225802 1459382 1198705 1440250 1398684 1237614 1352743 1304706 1366819 1248573
13489 1248573 1341579 1117305 1292750 1438615 1545979 1253219 1426702 1311011 1291548 1253946
13479 1253946 1286671 1160753 1173087 1191981 1262712 1385474 1079361 1374418 1224999 1246991
13469 1246991 1392660 1248916 1022765 1269565 1438982 1279211 1347428 1142207 1153260 1410447
$$ packed form
13539B480983O8469K39871m56353K17185m31017K25074o80731J58768N6152k09287
13529A669114J43667m8618N9413J53098j26574K26877L77689L68825r5826j64863
13519B562802j07348k24570j92683k57838k86814j7099Q5771r2663K2985L0515
13509A523058o6882j16604J20533j90615K59466j09551l8600j85610L20071l19973
13499A195293L0509K33580k60677K41545m1566j61070J15129m8037O2113j18246
13489A248573R3006k24274J75445J45865J07364k92760J73483j15691j9463l7602
13479A253946L2725j25918J2334J8894P0731J22762l06113K95057j49419K1992
13469A246991J45669j43744k26151K46800J69417j59771O8217k05221J1053K57187
$$ plain form
13459 1410447 1370574 1431071 1421773 1615325 1375140 1600931 1683405 1876257 2254192 2441140
13449 2441140 2529575 2601394 2727569 2287512 2489977 2336917 2121413 1540378 1963902 1554480
13439 1554480 1590409 1541397 1594294 1414021 1653818 1509484 1575935 1345947 1587348 1418426
13429 1418426 1525034 1470228 1578855 1319286 1557265 1721898 1792158 1849681 2262469 2010183
13419 2010183 2512237 2873144 2557934 2500390 2692514 2309609 2039550 2044890 1877604 1530865
13409 1530865 1843774 1511560 1633574 1664912 1658413 1564606 1501933 1669833 1558964 1592537
13399 1592537 1569508 1677036 1543966 1621838 1474492 1899618 1695564 1788490 1937389 1800746
13389 1800746 1840348 1737758 1998542 1965428 2356139 2291773 2245589 2722433 2626654 2584193
$$ packed form
13459A410447l9873O0497r298J93552k40185K25791Q2474J92852L77935J86948
13449B441140Q8435P1819J26175m40057K02465j53060k15504n81035M23524m09422
13439A554480L5929m9012N2897j80273K39797j44334O6451k29988K41401j68922
13429A418426J06608n4806J08627k59569K37979J64633P0260N7523M12788k52286
13419B010183N02054L60907l15210n7544J92124l82905k70059N340j67286l46739
13409A530865L12909l32214J22014L1338o499r3807o2673J67900j10869L3573
13399A592537k3029J07528j33070P7872j47346M25126k04054R2926J48899j36643
13389A800746L9602j02590K60784l3114L90711o4366m6184M76844r5779m2461
$$ plain form
13379 2584193 2638392 2693739 2581607 2262613 2059699 2207831 2116654 1813130 1872924 1979073
13369 1979073 1806883 2105106 2087994 1925313 2006844 2195448 2048668 2202968 2230865 1959908
13359 1959908 1893657 1981172 2000676 2021951 2182216 2123308 2427096 2472194 2365741 2449280 2500311
13348 2500311 2330242 2612547 2317345 1969496 2259771 2132157 2269481 2127734 2164555 1976970
13338 1976970 2008620 2014136 1980277 1784195 2009838 1967783 1916277 2229007 2150887 2226769 1944338
13327 1944338 1881581 2178753 2247497 2167532 1908524 2362765 2227889 2201426 2425133 2541904
13317 2541904 2435048 2288312 2506715 2482330 2853823 2979072 2951067 2943171 2930996 3013574
13307 3013574 3401670 2916646 2937631 2964363 2782391 2810868 2616216 2958977 3022489 3280510
$$ packed form
13379B584193N4199N5347j12132l18994k02914J48132r1177l03524N9794J06149
13369A979073j72190K98223j7112j62681Q1531J88604j46780J54300K7897k70957
13359A959908o6251Q7515J9504K1275J60265n8908L03788M5098j06453Q3539N1031
13348B500311j70069K82305k95202l47849K90275j27614J37324j41747L6821j87585
13338A976970L1650N516l3859j96082K25643m2055n1506L12730p8120P5882k82431
13327A944338o2757K97172O8744p9965k59008M54241j34876k6463K23707J16771
13317B541904j06856j46736K18403k4385L71493J25249k8005p896j2175Q2578
13307C013574L88096m85024K0985K6732j81972K8477j94652L42761O3512K58021
$$ plain form
13297 3280510 3284562 3404060 3582570 3366359 3600967 3584370 3628827 3566151 3404867 3346365
13287 3346365 2999000 3201332 3497529 3261071 3095715 3266733 3360067 3281575 3388702 3536169
13277 3536169 3517262 3464182 3745992 3673862 3666139 3863670 3840222 4032184 3812659 4034618
13267 4034618 4149569 4255366 4272864 4423840 4457159 4355100 4555576 4620849 4559473 4997440
13257 4997440 4955448 5041769 5324443 5433997 5420393 5789873 5769983 6028398 6452734 6547994
13247 6547994 6441746 6775999 6918312 7046794 7351365 7502069 7287822 7268501 7346922 7596857
13237 7596857 7638782 7686012 7705086 8014635 7833404 8213453 8182526 8427860 8545745 8904782
13227 8904782 9203912 9603119 9802711 10116489 10424601 10739856 10795553 10993731 11226235 11329153
$$ packed form
13297C280510M052J19498J78510k16211K34608j6597M4457o2676j61284n8502
13287C346365l47365K02332K96197k36458j65356J71018R3334p8492J07127J47467
13277C536169j8907n3080K81810p2130p723J97531k3448J91962k19525K21959
13267D034618J14951J05797J7498J50976L3319j02059K00476O5273o1376M37967
13257D997440m1992Q6321K82674J09554j3604L69480j9890K58415M24336R5260
13247F547994j06248L34253J42313J28482L04571J50704k14247j9321P8421K49935
13237G596857M1925M7230J9074L09549j81231L80049l0927K45334J17885L59037
13227H904782K99130L99207J99592L13778L08112L15255N5697J98178K32504J02918
$$ plain form
13217 11329153 11281917 11380428 11364473 10984639 10887220 10907690 10647122 10624030 10270229 10062210
13207 10062210 10032843 9649999 9726522 9506078 9262932 9561135 9288973 9409030 9021926 9190682
13197 9190682 9220785 9211664 9365687 8968354 8934046 8726750 8777041 8364766 8162134 8188829
13187 8188829 7929793 7430038 7239969 7026421 6942115 6942891 6643615 6289916 6145598 6098337
13177 6098337 5911708 5659787 5467321 5547689 5559073 5231713 5247652 5032570 5324155 5278194
13167 5278194 4918774 5201626 5287649 5183325 5511586 5637210 5708121 5914235 6161096 6272915
13157 6272915 6813776 7280142 7347375 7412519 7498331 7238491 7303297 7173748 7292507 6859970
13147 6859970 6781925 6770695 6974717 7132728 6954759 7015678 6808232 6593912 6436938 5948381
$$ packed form
13217A1329153m7236R8511j5955l79834r7419K0470k60568k3092l53801k08019
13207A0062210k9367l82844P6523k20444k43146K98203k72162J20057l87104J68756
13197I190682L0103r121J54023l97333l4308k07296N0291m12275k02632K6695
13187H188829k59036m99755j90069k13548q4306P76k99276l53699j44318m7261
13177F098337j86629k51921j92466Q0368J1384l27360J5939k15082K91585m5961
13167E278194l59420K82852Q6023j04324L28261J25624P0911K06114K46861J11819
13157F272915N40861M66366O7233O5144Q5812k59840O4806j29549J18759m32537
13147F859970p8045j1230K04022J58011j77969O0919k07446k14320j56974m88557
$$ plain form
13137 5948381 5887676 5580276 5223229 4698509 4576435 4349614 4383859 4231461 4084848 3975406
13127 3975406 3814390 3955360 3929671 4071834 4220796 3915083 4076341 3809534 3887320 3576300
13117 3576300 3478844 3531068 3352293 3451171 3268563 3132053 3319279 3185501 3120874 3156075
13107 3156075 3217934 3283739 3251423 3250160 3529256 3580737 3812290 3846129 4053263 4437214 4756851
13096 4756851 5107814 5575353 5962329 6490843 6655822 7062164 7236452 7116659 7281540
13087 7281540 6950644 7166414 6776896 6921509 6800150 6906447 6775876 6786921 6609845 6479292
13077 6479292 6021973 5546536 5411481 4751415 4587748 4191342 4039892 3699577 3656732 3412485
13067 3412485 3381515 3067183 3296288 2997702 3282492 2957728 3381009 3187340 3054640 3213058
$$ packed form
13137E948381o0705l07400l57047n24720j22074k26821L4245j52398j46613j09442
13127C975406j61016J40970k5689J42163J48962l05713J61258k66807P7786l11020
13117C576300r7456N2224j78775R8878j82608j36510J87226j33778o4627L5201
13107C156075O1859O5805l2316j263K79096N1481K31553L3839K07134L83951L19637
13096D756851L50963M67539L86976N28514J64979M06342J74288j19793J64881
13087G281540l30896K15770l89518J44613j21359J06297j30571J1045j77076j30553
13077F479292m57319m75437j35055o60066j63667l96406j51450l40315m2845k44247
13067C412485l0970l14332K29105k98586K84790l24764M23281j93669j32700J58418
$$ plain form
13057 3213058 3258058 3071697 3462181 3467811 3553950 3309660 3289264 3500471 3357082 3382712
13047 3382712 3074327 3003041 3075376 3329359 3170814 3357599 3074559 3246203 3127688 3115078
13037 3115078 3445269 3277960 3560850 3457159 3509719 3624290 3635314 3553377 3581041 3800569
13027 3800569 3823317 3861343 3878472 3986103 3864598 3880713 3988524 3992817 4035457 4128224 4184514
13016 4184514 4503158 4181364 4359133 4309428 4664741 4498541 4685520 4988011 4949064 4863610
13006 4863610 4769274 4751328 5050834 5022838 4870334 5243413 5172788 5531005 5411304 5513323
12996 5513323 5367537 5411669 5675061 5443613 5653577 5877454 5715980 5890842 5800373 5929994
12986 5929994 5894929 5879903 5597633 5740418 5755684 5787810 5677605 6132362 5654445 5807287
$$ packed form
13057C213058M5000j86361L90484N630Q6139k44290k0396K11207j43389K5630
13047C382712l08385p1286P2335K53983j58545J86785k83040J71644j18515j2610
13037C115078L30191j67309K82890j03691N2560J14571J1024q1937K7664K19528
13027C800569K2748L8026J7129J07631j21505J6115J07811M293M2640R2767N6290
13016D184514L18644l21794J77769m9705L55313j66200J86979L02491l8947q5454
13006D863610r4336j7946K99506k7996j52504L73079p0625L58217j19701J02019
12996E513323j45786M4132K63392k31448K09964K23877j61474J74862r0469J29621
12986E929994l5065j5026k82270J42785J5266L2126j10205M54757m77917J52842
$$ plain form
12976 5807287 5660328 5682601 5508034 5365400 5536729 5530784 5452673 5593767 5270236 5320877
12966 5320877 5288813 5139808 5048954 5231496 5175291 5134934 5093529 4935634 5008037 5415765
12956 5415765 5067924 5142806 5115325 5160466 5192804 5093851 5257292 5086067 5311151 5140656
12946 5140656 5462988 5144604 5188798 5040832 4984635 5088888 5056962 5034962 5231887 5213867
12936 5213867 5277251 5152611 5260470 5558318 5329663 5334666 5427263 5499581 5446900 5306479
12926 5306479 5439582 5266710 5097780 4946130 4896436 4945596 4900475 4987000 4978663 4883215 4899252
12915 4899252 4714280 4548636 4653018 4338770 4644616 4526982 4129750 3908514 4298682
12906 4298682 3770318 3870026 3957223 3776975 3767592 3699650 3962606 3542087 3542568 3380992 3369221
$$ packed form
12976E807287j46959K2273j74567j42634J71329n945p8111J41094l23531N0641
12966E320877l2064j49005r0854J82542n6205m0357m1405j57895P2403M07728
12956E415765l47841P4882k7481M5141L2338r8953J63441j71225K25084j70495
12946E140656L22332l18384M4194j47966n6197J04253l1926k2000J96925j8020
12936E213867O3384j24640J07859K97848k28655N003R2597P2318n2681j40421
12926E306479J33103j72872j68930j51650m9694M9160m5121Q6525q337r5448J6037
12915D899252j84972j65644J04382l14248L05846j17634l97232k21236L90168
12906D298682n28364R9708Q7197j80248r383o7942K62956m20519M81j61576j1771
$$ plain form
12895 3369221 3105911 3684456 3426084 3119543 3298074 3394862 3288600 3261561 3346408 3365640
12885 3365640 3451518 3290692 3278564 3352506 3170455 3425505 3370061 3088787 3235604 2875322
12875 2875322 2992938 3307423 2854763 2925780 2788170 2988192 3191072 2996559 2878446 2814234
12865 2814234 2833512 2933560 2969012 2702238 2708940 2874839 2460712 2810443 2919031 2676625
12855 2676625 2883628 2840793 2945626 2748805 2549812 2757770 2614018 2606639 2807422 2986174
12845 2986174 2714976 2566144 2681948 2937545 2804206 2638835 2587857 2628319 2572652 2736113
12835 2736113 2495072 2584011 2348795 2745296 2652621 2596894 2677851 2609814 2692543 2650236 2592554
12824 2592554 2802951 2559186 2573569 2794115 2594918 2644229 2539488 2869616 2572032 2521014
$$ packed form
12895C369221k63310N78545k58372l06541J78531R6788j06262k7039Q4847J9232
12885C365640Q5878j60826j2128P3942j82051K55050n5444k81274J46817l60282
12875B875322J17616L14485m52660P1017j37610K00022K02880j94513j18113o4212
12865B814234J9278J00048L5452k66774O702J65899m14127L49731J08588k42406
12855B676625K07003m2835J04833j96821j98993K07958j43752p379K00783J78752
12845B986174k71198j48832J15804K55597j33339j65371n0978M0462n5667J63461
12835B736113k41041Q8939k35216L96501r2675n5727Q0957o8037Q2729m2307n7682
12824B592554K10397k43765J4383K20546j99197M9311j04741L30128k97584n1018
$$ plain form
12814 2521014 2589754 2924621 2603112 2586150 2566932 2589295 2639715 2575477 2686619 2632985 2628618
12803 2628618 2736865 2594312 2695023 2775408 2738761 2635901 2855224 2729131 2848830 2826099
12793 2826099 2631363 2646379 2903537 2809693 2929317 2876717 2708111 2909916 2793977 2823260
12783 2823260 2957614 2838562 2704968 2708664 2794909 2768426 2693281 2786230 2755241 2806528 2822656
12772 2822656 2919911 3009758 2747554 2715192 2871617 2870300 2688664 2834534 3176157 2863216
12762 2863216 2911651 3109855 2871506 2988578 3172841 2956338 2942004 2830030 3038021 3008095
12752 3008095 2984093 2959502 3212205 2956526 2738764 2785244 2939904 2921644 2741786 2873600
12742 2873600 3092993 2945557 2952157 3074727 3045799 3069897 2999117 2818536 2995971 3112382
$$ packed form
12814B521014O8740L34867l21509j6962j9218K2363N0420o4238J11142n3634m367
12803B628618J08247j42553J00711Q0385l6647j02860K19323j26093J19699k2731
12793B826099j94736J5016K57158r3844J19624n2600j68606K01805j15939K9283
12783B823260J34354j19052j33594L696Q6245k6483p5145R2949l0989N1287J6128
12772B822656R7255Q9847k62204l2362J56425j317j81636J45870L41623l12941
12762B863216M8435J98204k38349J17072J84263k16503j4334j11974K07991k9926
12752C008095k4002k4591K52703k55679k17762M6480J54660j8260j79858J31814
12742B873600K19393j47436O600J22570k8928K4098p0780j80581J77435J16411
$$ plain form
12732 3112382 2973057 3007219 2853982 2852058 3004761 2859633 3045873 2940969 2964381 3006674
12722 3006674 3105615 3057116 2991524 3043325 3093307 3093429 3257415 2895426 2978806 3177016 3416468
12711 3416468 3181154 3315650 3361675 3338438 3336662 3348917 3332059 3792974 3713925 3694372 3992973
12700 3992973 3984823 4081568 4325004 4110205 4423839 4581753 4727717 4755542 5068696 5522791
12690 5522791 5809515 6341247 7010224 7538278 7619777 7954312 7991637 7662149 7519969 6987028
12680 6987028 6776385 6121842 5375015 5180635 4859259 4435308 4443022 4600944 4300891 4373954
12670 4373954 4392990 4359219 4462667 4556342 4846446 4597808 4913551 4849664 4776854 4972046
12660 4972046 5050284 5095128 4919410 4695125 4947847 4883147 5153059 5477842 5628962 5900365
$$ packed form
12732C112382j39325L4162j53237j924J52703j45128J86240j04904K3412M2293
12722C006674R8941m8499o5592N1801M9982J22J63986l61989Q3380J98210K39452
12711C416468k35314J34496M6025k3237j776J2255j6858M60915p9049j9553K98601
12700C992973q150R6745K43436k14799L13634J57914J45964K7825L13154M54095
12690E522791K86724N31732O68977N28054Q1499L34535L7325l29488j42180n32941
12680F987028k10643o54543p46827j94380l21376m23951P714J57922l00053P3063
12670D373954J9036l3771J03448R3675K90104k48638L15743o3887p2810J95192
12660D972046P8238M4844j75718k24285K52722o4700K69912L24783J51120K71403
$$ plain form
12650 5900365 6283644 6343051 6685869 6730746 6662067 6747872 6732671 6455158 6583076 6467016
12640 6467016 6655112 6678170 6747062 6693727 6783675 6670632 6746977 6933866 7101374 7110399 7184205
12629 7184205 7281354 7357017 7469269 7515111 7397188 7272840 7063356 6912911 6536270 6248377
12619 6248377 6031166 5739056 5465420 5255808 5047513 4989747 5133129 5277250 5682595 6036524
12609 6036524 6472118 6766333 7692501 7968143 8421947 9010981 9125535 8895256 8632811
12600 8632811 8211447 7572816 6976166 6547231 6303214 5566775 5411998 5348532 5421084 5650140
12590 5650140 5900963 5727872 6229789 6183602 6517403 6558526 6218832 6394695 6141556 6039825
12580 6039825 6135292 6480885 6505382 6915590 6974087 7432235 7415277 7368974 7355757 6762751
$$ packed form
12650E900365L83279N9407L42818M4877o8679Q5805j5201k77513J27918j16060
12640F467016J88096K3058O8892n3335Q9948j13043P6345J86889J67508R025P3806
12629G184205R7149P5663J12252M5842j17923j24348k09484j50445l76641k87893
12619F248377k17211k92110k73636k09612k08295n7766J43382J44121M05345L53929
12609F036524M35594K94215R26168K75642M53804N89034J14554k30279k62445
12600H632811m21364o38631n96650m28935k44017p36439j54777o3466P2552K29056
12590E650140K50823j73091N01917m6187L33801M1123l39694J75863k53139j01731
12580F039825R5467L45593K4497M10208N8497M58148j6958m6303j3217n93006
$$ plain form
12570 6762751 6681681 6110499 5838925 5370425 4942188 4771296 4546234 4858627 4733618 4838797
12560 4838797 4891221 4923915 4929468 5116181 4916477 4821527 4810615 4743855 4943492 5074670 4930405
12549 4930405 4930772 4863731 4818669 4993509 5066281 4929804 4998379 5076688 5083342 5358783 5590142
12538 5590142 5527187 5671878 5872389 5779161 5543488 5548836 5438832 5276629 4891498 4851222
12528 4851222 5089338 5072687 4836381 4775540 5053114 5023556 5252009 5241501 5221162 5245346
12518 5245346 5333840 4988310 5159856 5287461 5314343 5491350 5874660 6070264 6411099 6766267
12508 6766267 7169538 7369154 7233720 7082704 7090014 6789672 6132621 6111060 5854459 5734352
12498 5734352 5377878 5621025 5431283 5493469 5466837 5553576 5538099 5442479 5504908 5684867
$$ packed form
12570F762751q1070n71182k71574m68500m28237j70892k25062L12393j25009J05179
12560D838797N2424L2694N553J86713j99704r4950j0912o6760J99637J31178j44265
12549D930405L67o7041m5062J74840P2772j36477O8575P8309O654K75441K31359
12538E590142o2955J44691K00511r3228k35673N348j10004j62203l85131m0276
12528D851222K38116j6651k36306o0841K77574k9558K28453j0508k0339K4184
12518E245346Q8494l45530J71546J27605K6882J77007L83310J95604L40835L55168
12508F766267M03271J99616j35434j51016P310l00342o57051k1561k56601j20107
12498E734352l56474K43147j89742O2186k6632Q6739j5477r5620O2429J79959
$$ plain form
12488 5684867 5731666 5686093 5651466 5632683 5799417 6034945 6124479 6336853 6552163 6694831
12478 6694831 6745289 6841275 6951248 6645630 6386881 6338713 6145150 6145774 6010670 6106960 5924479
12467 5924479 5894507 6148897 6058786 6205392 6104151 6290435 6370828 6249331 6649992 6677748
12457 6677748 6559266 6968189 6884572 7112375 7079839 7350885 7437027 7769024 7823749 8286353
12447 8286353 8428906 8881257 9368623 9391793 9903481 10262868 10416342 10614593 10930554 11188000
12437 11188000 11100778 11301817 11529602 11424268 11371437 11558078 11529063 11636544 11571206 11509280
12427 11509280 11740056 12119860 12033833 11966381 12465826 12282117 12756729 12925065 13462804 13523212
12417 13523212 13950944 14377630 15317586 15787501 16284542 16840385 17688026 17990880 17882540
$$ packed form
12488E684867M6799m5573l4627j8783J66734K35528Q9534K12374K15310J42668
12478F694831N0458R5986J09973l05618k58749m8168j93563O24j35104R6290j82481
12467E924479k9972K54390r0111J46606j01241J86284Q0393j21497M00661K7756
12457F677748j18482M08923q3617K27803l2536K71046Q6142L31997N4725M62604
12447H286353J42553M52351M87366K3170N11688L59387J53474J98251L15961K57446
12437A1188000q7222K01039K27785j05334n2831J86641k9015J07481o5338o1926
12427A1509280K30776L79804q6027o7452M99445j83709M74612J68336N37739O0408
12417A3523212M27732M26686R39956M69915M97041N55843Q47641L02854j08340
$$ plain form
12408 17882540 18191012 18086587 18201915 17958323 17704451 17413722 17050163 16714914 16463478
12399 16463478 16040912 15834214 15894473 15229481 15163102 15179211 15016690 14947859 14886536 15081202
12389 15081202 15150103 15670160 16080905 16557288 16823666 17195300 17671576 18114236 18198013 18526412
12379 18526412 18634049 18591382 18615497 18645481 18288652 18519095 18236004 18211718 17933175 17914328
12369 17914328 17405014 17520191 17259227 17123799 16979966 16787684 16719152 16526949 16399865
12360 16399865 16103588 15823404 15979923 15495616 15482396 15483501 15187142 15242574 14971136 14939205
12350 14939205 14768134 14592123 14080055 14147729 13714904 13648254 13441695 13369825 13243916 13762111
12340 13762111 14067665 13994080 14163230 14466510 14773251 15142167 15134501 15421900 15785253 16241052
$$ packed form
12408A7882540L08472j04425J15328k43592k53872k90729l63559l35249k51436
12399A6463478m22566k06698O0259o64992o6379J6109j62521o8831o1323J94666
12389A5081202O8901N20057M10745M76383K66378L71634M76276M42660Q3777L28399
12379A8526412J07637m2667K4115K9984l56829K30443k83091k4286k78543j8847
12369A7914328n09314J15177k60964j35428j43833j92282o8532j92203j27084
12360A6399865k96277k80184J56519m84307j3220J105k96359N5432k71438l1931
12350A4939205j71071j76011n12068O7674m32825o6650k06559p1870j25909N18195
12340A3762111L05554p3585J69150L03280L06741L68916p666K87399L63353M55799
$$ plain form
12330 16241052 16664587 16846482 17088835 17262682 17763956 17766237 17878430 18169693 18255446 18476582
12320 18476582 18541097 18741678 18550571 18758603 18682246 18689588 18598298 18555556 18485509 18558901 18583238
12309 18583238 19014889 19229610 19258207 19526494 20191513 20219715 20621320 20891337 21183505 21233262
12299 21233262 21341780 20971960 20672507 20347199 19897898 19082766 18748364 18524434 18226182
12290 18226182 17915293 17943087 17802401 17475411 17413710 16952375 16370663 15907254 15409158 15000220
12280 15000220 14414855 13965722 13695750 13401817 13106985 12782723 12530773 12354021 12126250
12271 12126250 12146287 12139658 12027437 11730636 11934729 11962120 11705317 11730399 11780218 11695365
12261 11695365 11855712 11756526 11635100 11671083 11556219 11854332 12040693 11966492 12523307 12693731
$$ packed form
12330A6241052M23535J81895K42353J73847N01274K281J12193K91263Q5753K21136
12320A8476582O4515K00581j91107K08032p6357P342r1290m2742p0047P3392K4337
12309A8583238M31651K14721K8597K68287O65019K8202M01605K70017K92168M9757
12299B1233262J08518l69820k99453l25308m49301q15132l34402k23930k98252
12290A8226182l10889K7794j40686l26990o1701m61335n81712m63409m98096m08938
12280A5000220n85365m49133k69972k93933k94832l24262k51950j76752k27771
12271A2126250K0037o629j12221k96801K04093K7391k56803K5082M9819q4853
12261A1695365J60347r9186j21426L5983j14864K98113J86361p4201N56815J70424
$$ plain form
12251 12693731 13280567 14135103 14574546 15371642 16162952 17029680 18055605 19022909 20162682
12242 20162682 20954060 21892603 22414606 22645701 23082456 23024007 22896218 22686362 22649521 22352715
12232 22352715 22270112 21960711 22053579 22132645 21474966 21261060 20888194 19928418 19045096 18018199
12222 18018199 17080956 16359356 15373011 14650296 13653362 12898038 12554672 12112149 11920274
12213 11920274 11850840 11463622 11443220 10971090 10717810 10416854 10351548 9821557 9873701 9542219
12203 9542219 9491801 9789301 9536000 9670935 9798320 9726285 9548615 9360695 9580518 9559664
12193 9559664 9653005 9650930 10036812 9939109 10355774 10487570 10524295 10946078 10966608 10934931 11235498
12182 11235498 11367773 11398408 11714741 11819408 12064143 11940646 11817565 11649049 11424659
$$ packed form
12251A2693731N86836Q54536M39443P97096P91310Q66728J025925R67304J139773
12242B0162682P91378R38543N22003K31095M36755n8449j27789k09856l6841k96806
12232B2352715q2603l09401R2868P9066o57679k13906l72866r59776q83322j026897
12222A8018199r37243p21600r86345p22715r96934p55324l43366m42523j91875
12213A1920274o9434l87218k0402m72130k53280l00956o5306n29991N2144l31482
12203I542219n0418K97500k53301J34935J27385p2035j77670j87920K19823k0854
12193I559664R3341k075L85882r7703M16665J31796L6725M21783K0530l1677L00567
12182A1235498J32275L0635L16333J04667K44735j23497j23081j68516k24390
$$ plain form
12173 11424659 11514095 11371779 11404612 11564462 11812312 11827158 11750159 11969305 12231725 12351704
12163 12351704 12739732 13007979 13432674 14028872 14384542 15133501 15495126 15550513 15744161
12154 15744161 15661396 15381860 14839408 14616644 14476110 14434381 14811316 15227785 15586154 16173270
12144 16173270 16610980 17177521 17085333 17509934 17938120 18786384 18978062 19339994 19868115
12135 19868115 20647681 21514607 22626044 23872826 25383350 26503536 28250479 30110315
12127 30110315 31984302 33848527 35628838 37300359 38510310 39706396 40629844 40554679
12119 40554679 40928583 40883031 40523088 40398162 39998364 39854183 39245809 38820940 37740752
12110 37740752 37769909 37246784 36711217 36431174 36367041 36168541 36115856 36313501 36473554 36820974
$$ packed form
12173A1424659Q9436j42316L2833J59850K47850J4846p6999K19146K62420J19979
12163A2351704L88028K68247M24695N96198L55670P48959L61625N5387J93648
12154A5744161q2765k79536n42452k22764j40534m1729L76935M16469L58369N87116
12144A6173270M37710N66541r2188M24601M28186Q48264J91678L61932N28121
12135A9868115P79566Q66926J111437J246782J510524J120186J746943J859836
12127C0110315J873987J864225J780311J671521J209951J196086R23448p5165
12119D0554679L73904m5552l59943j24926l99798j44181o08374m24869j080188
12110C7740752K9157n23125n35567k80043o4133j98500n2685J97645J60053L47420
$$ plain form
12100 36820974 37413017 37652656 37879206 37731345 37941766 37604894 36666228 35957577 35086599
12091 35086599 33880931 33364786 33217611 32846026 33436948 34295049 34880399 35816952 36607258
12082 36607258 37141995 37650538 37701090 37833488 37765790 37850141 37942257 37975102 37795129 37743929
12072 37743929 37886965 37447178 37650869 36880901 36379490 35787976 34923716 33687669 32436168
12063 32436168 31381924 30319369 29093670 28584400 27895534 27175211 26792687 26472810 26055822
12054 26055822 25743047 25253959 24553066 24358159 23761903 23360344 22803060 22495381 22390965
12045 22390965 21881483 21554617 21196860 20721454 20418298 19959917 19491156 19138322 18580758
12036 18580758 18229685 17646047 17267597 17084841 17132133 17188693 17253771 17323196 17840785 18171950
$$ packed form
12100C6820974N92043K39639K26550j47861K10421l36872r38666p08651q70978
12091C5086599j205668n16145j47175l71585N90922Q58101N85350R36553P90306
12082C6607258N34737N08543N0552J32398o7698Q4351R2116L2845j79973n1200
12072C7743929J43036m39787K03691p69968n01411n91514q64260j236047j251501
12063C2436168j054244j062555j225699n09270o88866p20323l82524l19877m16988
12054B6055822l12775m89088p00893j94907n96256m01559n57284l07679j04416
12045B2390965n09482l26866l57757m75406l03156m58381m68761l52834n57564
12036A8580758l51073n83638l78450j82756M7292N6560O5078O9425N17589L31165
$$ plain form
12026 18171950 18388023 18692166 18628382 18407072 18212045 17718227 17322218 16528908 15883286
12017 15883286 15553443 14785204 14726602 14377963 14041602 14229402 13673991 13405984 13134413
12008 13134413 12443992 12237799 11977875 11769652 12085673 12123999 12291216 12207405 12966300 12785203
11998 12785203 12959686 12534827 12367987 12024765 11660850 11201420 10626129 10522347 10111568
11989 10111568 9988669 10241890 9884641 10216826 10007503 9540912 9536438 9258536 8679877 8296864
11979 8296864 8104387 8158643 8098552 7758314 7798935 7753895 7800420 7541434 7378452 7270379
11969 7270379 6847400 6708341 6718077 6579176 5901300 5997208 5967208 5876232 5984200 5900634
11959 5900634 5811932 6000388 6112528 6327642 6467581 6610942 6535818 6787522 6589145 6568530
$$ packed form
12026A8171950K16073L04143o3784k21310j95027m93818l96009p93310o45622
12017A5883286l29843p68239n8602l48639l36361J87800n55411k68007k71571
12008A3134413o90421k06193k59924k08223L16021L8326J67217q3811P58895j81097
11998A2785203J74483m24859j66840l43222l63915m59430n75291j03782m10779
11989A0111568j22899K53221l57249L32185k09323m66591m474k77902n78659l83013
11979H296864j92477N4256o0091l40238M0621m5040M6525k58986j62982j08073
11969G270379m22979j39059R736j38901o77876R5908l0000r0976J07968q3566
11959E900634q8702J88456J12140K15114J39939J43361p5124K51704j98377k0615
$$ plain form
11949 6568530 6486600 6703553 6530987 6750952 6817602 6948928 7035849 7185052 7219605 7405654
11939 7405654 7564656 7634290 7952205 7522525 7895487 8075304 7905575 7844559 7903108 7909382
11929 7909382 8241088 7979939 7874158 8102818 7677438 7671865 7415372 7204974 6898167 6921011
11919 6921011 6725343 6475783 6333771 6385029 6130639 5976277 6152496 6079545 6064887 6234543
11909 6234543 6471515 7800467 9824438 11651107 12893070 13432127 13366033 13409336 12973252
11900 12973252 11728813 9834181 7813394 6802731 5885758 5632497 5415720 5389151 5259224
11891 5259224 5208169 5403941 5481532 5673962 5919820 6485166 7231181 7983389 8716475 9275889
11881 9275889 9648463 10064636 10293151 10375775 9918960 9419786 8862716 8097704 7937572 7440502
$$ packed form
11949F568530q1930K16953j72566K19965O6650J31326Q6921J49203L4553J86049
11939G405654J59002O9634L17915m29680L72962J79817j69729o1016N8549O274
11929G909382L31706k61149j05781K28660m25380n573k56493k10398l06807K2844
11919F921011j95668k49560j42012N1258k54390j54362J76219p2951j4658J69656
11909F234543K36972J328952K023971J826669J241963N39057o6094M3303m36084
11900A2973252j244439j894632k020787j010663r16973k53261k16777k6569j29927
11891E259224n1055J95772P7591J92430K45858N65346P46015P52208P33086N59414
11881I275889L72574M16173K28515Q2624m56815m99174n57070p65012j60132m97070
$$ plain form
11871 7440502 6823251 6600202 6038630 5858155 5733420 5422119 4944311 5027712 4806964 4867389
11861 4867389 4872165 4875997 4430001 4608443 4694702 4456640 4783139 4543333 5005969 4670564
11851 4670564 4902707 4833803 5088641 5153159 5420731 5494161 5812355 6091196 6440190 7062468
11841 7062468 7432388 8166987 8401363 8542132 8655477 8764812 8386209 8081442 7589965
11832 7589965 7319864 7431973 7414699 7273777 7286903 7493949 7589417 7298685 6955615 6368515
11822 6368515 5864517 5434052 5162603 4729123 4684998 4378121 4215777 4284071 4060826 4079870
11812 4079870 3978060 3954320 3941343 3692246 3444266 3757242 3583522 3685510 3620915 3761611
11802 3761611 3724098 3643999 3530713 3722775 3686766 3915014 3774239 3905446 3997502 3679809
$$ packed form
11871G440502o17251k23049n61572j80475j24735l11301m77808Q3401k20748O0425
11861D867389M776L832m45996J78442Q6259k38062L26499k39806M62636l35405
11851D670564K32143o8904K54838O4518K67572P3430L18194K78841L48994O22278
11841G062468L69920P34599K34376J40769J13345J09335l78603l04767m91477
11832G589965k70101J12109j7274j40922J3126K07046R5468k90732l43070n87100
11822F368515n03998m30465k71449m33480m4125l06877j62344O8294k23245J9044
11812D079870j01810k3740j2977k49097k47980L12976j73720J01988o4595J40696
11802C761611l7513q0099j13286J92062l6009K28248j40775J31207R2056l17693
$$ plain form
11792 3679809 4026409 4245042 4482221 4949100 5239910 5676532 5957579 6337646 6615446
11783 6615446 6408015 6245230 6009297 5730611 5141985 4676461 4368735 4102341 3913596
11774 3913596 3890821 3646870 3690890 3296446 3321575 3271016 3177680 3207952 3059089 3064778 3124048
11763 3124048 2923277 3044739 3135727 3171899 2902694 3153985 3123425 2857661 2916425 2966984
11753 2966984 2959216 3034352 3109917 3048975 2943372 2949119 2755016 2850441 3162790 3175730 2930379
11742 2930379 3197525 3060361 3095465 2890829 2845582 3016176 2771041 3065942 2741531 2942005
11732 2942005 2875117 2989869 2940053 2717244 2713316 2616280 2696856 2768125 2728346 2736129 2803336
11721 2803336 2820423 2675793 2615479 2745399 2598018 2755769 2754562 2715625 2563034 2711945
$$ packed form
11792C679809L46600K18633K37179M66879K90810M36622K81047L80067K77800
11783F615446k07431j62785k35933k78686n88626m65524l07726k66394j88745
11774C913596k2775k43951M4020l94444K5129n0559r3336L0272j48863N689N9270
11763C124048k00771J21462R0988L6172k69205K51291l0560k65764N8764N0559
11753B966984p768P5136P5565o0942j05603N747j94103R5425L12349J2940k45351
11742B930379K67146j37164L5104k04636m5247J70594k45135K94901l24411K00474
11732B942005o6888J14752m9816k22809l928r7036Q0576P1269l9779P783O7207
11721B803336J7087j44630o0314J29920j47381J57751j207l8937j52591J48911
$$ plain form
11711 2711945 2588951 2689534 2790160 2807381 2765079 2809743 2939415 2707166 2829537 2823915
11701 2823915 2846898 2756854 2700362 2936765 2893953 2714339 2846099 2522128 3145482 3141580
11691 3141580 2830867 2883640 3091081 3149792 3086799 3129304 3278183 3192325 3268623 3220607 3231036
11680 3231036 3425447 3426385 3360129 3495337 3614842 3564487 3476750 3341138 3631962 3467705
11670 3467705 3467202 3654508 3506620 3333018 3658903 3273976 3349572 3498410 3551799 3429395
11660 3429395 3384785 3595495 3351274 3430992 3547661 3557072 3332975 3602667 3374736 3192519
11650 3192519 3325634 3348157 3235558 3265011 3536246 3332435 3251699 3438246 3228753 3230055
11640 3230055 3235728 3407739 3183704 3483268 3185983 3418002 3338108 3311592 3018899 3290824
$$ packed form
11711B711945j22994J00583J00626J7221m2302M4664J29672k32249J22371n622
11701B823915K2983r0044n6492K36403m2812j79614J31760l23971O23354l902
11691C141580l10713N2773K07441N8711o2993M2505J48879q5858P6298m8016J0429
11680C231036J94411R38o6256J35208J19505n0355q7737j35612K90824j64257
11670C467705n03J87306j47888j73602L25885l84927P5596J48838N3389j22404
11660C429395m4610K10710k44221P9718J16669R411k24097K69692k27931j82217
11650C192519J33115K2523j12599K9453K71235k03811q0736J86547k09493J302
11640C230055N673J72011k24035K99564k97285K32019p9894k6516k92693K71925
$$ plain form
11630 3290824 3298488 3175427 3110114 3147605 3108766 3194604 3343534 3107145 3253229 3115771
11620 3115771 3169366 3165913 3291874 3023611 3163695 3156158 3276412 2970017 3040661 3186454
11610 3186454 3086411 3053051 3247258 3171093 3034541 3030425 3418676 3375022 3389788 3560081
11600 3560081 3537858 3513802 3474139 3328978 3817519 3616075 3369617 3502147 3327880 3445691
11590 3445691 3295481 3444004 3317903 3472911 3530305 3282717 3284207 3294154 3497441 3616842
11580 3616842 3357581 3477311 3501883 3609235 3646454 3585880 3690587 3498561 3564987 3522038
11570 3522038 3611370 3540056 3509462 3487255 3632687 3637100 3786970 3676439 3453010 3502842 3623675
11559 3623675 3608104 3651659 3566114 3596637 3695633 3563684 3652759 3706708 3745754 3597906 3675709
$$ packed form
11630C290824P664j23061o5313L7491l8839Q5838J48930k36389J46084j37458
11620C115771N3595l453J25961k68263J40084p537J20254l06395P0644J45793
11610C186454j00043l3360J94207p6165j36552m116L88251m3654J4766J70293
11600C560081k2223k4056l9663j45161M88541k01444k46458J32530j74267J17811
11590C445691j50210J48523j26101J55008N7394k47588J490R947K03287J19401
11580C616842k59261J19730K4572J07352L7219o0574J04707j92026O6426m2949
11570C522038Q9332p1314l0594k2207J45432M413J49870j10531k23429M9832J20833
11559C623675j5571M3555q5545L0523R8996j31949Q9075N3949L9046j47848P7803
$$ plain form
11548 3675709 3732757 3641846 3646451 3917378 3630611 3606343 3683152 3430188 3353707 3293561 3353859
11537 3353859 3578164 3475494 3606703 3438389 3468852 3537197 3611170 3593464 3352447 3417180
11527 3417180 3616765 3387145 3428907 3567755 3540289 3476133 3633198 3432383 3538985 3520515
11517 3520515 3495184 3641803 3661859 3815976 3552202 3539100 3828629 3797799 3615895 3786991
11507 3786991 3886579 3859168 3939838 3741241 3982739 3849834 3727512 3941351 3767488 3898573
11497 3898573 3876752 4054075 4000936 3883713 3956164 3836795 3882326 3829925 3915079 3951752 3965231
11486 3965231 4248834 4122347 4339725 4043734 4161082 4254692 4224584 4247999 4307237 4320253
11476 4320253 4498689 4458953 4475144 4434517 4402203 4186612 4424061 4317243 4433137 4181773
$$ packed form
11548C675709N7048r0911M605K70927k86767k4268P6809k52964p6481o0146O0298
11537C353859K24305j02670J31209j68314L0463O8345P3973j7706k41017O4733
11527C417180J99585k29620M1762J38848k7466o4156J57065k00815J06602j8470
11517C520515k5331J46619K0056J54117k63774j3102K89529l0830j81904J71096
11507C786991R9588k7411Q0670j98597K41498j32905j22322K13839j73863J31085
11497C898573k1821J77323n3139j17223P2451j19369M5531n2401Q5154L6673J3479
11486C965231K83603j26487K17378k95991J17348R3610l0108K3415N9238J3016
11476D320253J78436l9736J6191m0627l2314k15591K37449j06818J15894k51364
$$ plain form
11466 4181773 4523157 4124483 3989391 4084072 4196664 4222850 3854318 4055920 4151731 4029090
11456 4029090 4270567 4036528 3972306 4234532 4213254 4122533 4284326 4053349 4254386 4104139
11446 4104139 4142038 4458318 4280772 4372809 4434489 4366932 4599396 4547006 4538676 4790692 4667894
11435 4667894 4802062 4856279 4819335 5079320 4961402 4841347 5231163 5143079 5378372 5610650
11425 5610650 5504357 5514799 5533951 5432645 5463805 5648197 5728019 5666162 5594719 5475884
11415 5475884 5797533 5857618 5787701 6003173 6081166 6022491 6194647 6181241 6230121 6134318 6505171
11404 6505171 6809430 6631153 6777167 6887528 6880548 7260062 7334208 7229647 7480678 7720244
11394 7720244 7804310 7868250 7856459 8121149 8382010 8516244 8480529 8851174 8928722 8990069
$$ packed form
11466D181773L41384l98674j35092R4681J12592K6186l68532K01602R5811j22641
11456D029090K41477k34039o4222K62226k1278r0721J61793k30977K01037j50247
11446D104139L7899L16280j77546R2037O1680o7557K32464n2390q330K52016j22798
11435D667894J34168N4217l6944K59985j17918j20055L89816q8084K35293K32278
11425E610650j06293J0442J9152j01306L1160J84392P9822o1857p1443j18835
11415E475884L21649O0085o9917K15472P7993n8675J72156j3406M8880r5803L70853
11404F505171L04259j78277J46014J10361o980L79514P4146j04561K51031K39566
11394G720244Q4066O3940j1791K64690K60861J34234l5715L70645P7548O1347
$$ plain form
11384 8990069 9341079 8915247 9409014 9398278 9611922 9932569 10067472 9847178 10043747 10309490
11374 10309490 10335669 10325031 10435921 10555688 10486065 10809402 10883601 11026891 11036849 11041460 10975581
11363 10975581 11036822 11406136 11142108 11332376 11240013 11295031 11415205 11310704 11482996 11595518
11353 11595518 11570110 11660945 11873623 11597405 11862958 11603939 11765176 11534743 11434137 11432900
11343 11432900 11422707 11639832 11444696 11281850 11127310 11071840 11005931 10927813 10994104 11007388
11333 11007388 10759283 10628217 10528024 10526617 10212325 10307199 10366088 10189710 9944414 9906131
11323 9906131 9847270 9562910 9659427 9142171 9265416 9218805 8793856 8693541 8517526 8747530
11313 8747530 8140456 8176679 8054274 7823831 7659092 7698192 7460821 7134457 7219378 6857578
$$ packed form
11384H990069L51010m25832M93767j0736K13644L20647J34903k20294J96569K65743
11374A0309490K6179j0638J10890J19767o9623L23337P4199J43290R958M611o5879
11363A0975581O1241L69314k64028J90268r2363N5018J20174j04501J72292J12522
11353A1595518k5408R0835K12678k76218K65553k59019J61237k30433j00606j237
11343A1432900j0193K17125j95136j62846j54540n5470o5909p8118O6291J3284
11333A1007388k48105j31066j00193j407l14292R4874N8889j76378k45296l8283
11323I906131n8861k84360R6517n17256J23245m6611m24949j00315j76015K30004
11313H747530o07074L6223j22405k30443j64739L9100k37371l26364Q4921l61800
$$ plain form
11303 6857578 6685470 6720901 6285412 6282785 6336541 6056453 5997796 5820904 5686189 5671368
11293 5671368 5578946 5432557 5589131 5419805 5129696 4854648 4977392 5065557 4851454 4796696
11283 4796696 4600433 4507284 4567632 4206360 4381942 4103703 4028418 4076990 3850704 3979428
11273 3979428 3807979 3765129 3938904 3869872 3787816 3746581 3698200 3688205 3474828 3556891 3603255
11262 3603255 3514710 3598454 3289567 3333037 3226080 3500443 3487121 3343571 3370217 3379462 3232180
11251 3232180 3350570 3206579 3231148 3160262 3200446 3023530 3005255 3031992 3070113 3042406 3324762
11240 3324762 3182484 3161574 3086000 3119156 3159594 3225583 3331603 3045396 3022487 3183192
11230 3183192 3228261 3291380 3304217 3566088 3485693 3458948 3605994 4382926 5211184 6016921
$$ packed form
11303F857578j72108L5431m35489k627N3756k80088n8657j76892j34715j4821
11293E671368r2422j46389J56574j69326k90109k75048J22744Q8165k14103n4758
11283D796696j96263r3149O0348l61272J75582k78239p5285M8572k26286J28724
11273C979428j71449m2850J73775o9032q2056m1235m8381r995k13377Q2063M6364
11262C603255q8545Q3744l08887M3470j06957K74363j3322j43550K6646R245j47282
11251C232180J18390j43991K4569p0886M0184j76916j8275K6737L8121k7707K82356
11240C324762j42278k0910p5574L3156M0438O5989J06020k86207k2909J60705
11230C183192M5069O3119J2837K61871q0395k6745J47046P76932Q28258Q05737
$$ plain form
11220 6016921 6549644 7064631 7143618 7182272 6942174 6514406 5668339 4848799 4352653 4076244
11210 4076244 3662607 3251398 3558959 3395644 3241545 3399373 3249282 3154757 3104857 3070276
11200 3070276 3234396 3375963 3282957 3411391 3526042 3776070 4398621 5693929 6173871
11191 6173871 6753061 6965338 7090875 7128455 6965207 6455097 5651869 4800958 4248984 4032826
11181 4032826 3882699 3784728 3740604 3492627 3564230 3517252 3627643 3397082 3515610 3646529
11171 3646529 3373881 3574710 3460611 3523978 3742246 3567495 3653112 3575117 3455726 3475223
11161 3475223 3632795 3611772 3695016 3627243 3659795 3592871 3504989 3568178 3744862 3888329 3899329
11150 3899329 3713872 3904549 4008390 3743823 3803650 3893891 3592949 3939939 3714663 4033525
$$ packed form
11220F016921N32723N14987P8987L8654k40098m27768q46067q19540m96146k76409
11210D076244m13637m11209L07561j63315j54099J57828j50091r4525m9900l4581
11200C070276J64120J41567r3006J28434J14651K50028O22551J295308M79942
11191F173871N79190K12277J25537L7580j63248n10110q03228q50911n51974k16158
11181D032826j50127r7971m4124k47977P1603m6978J10391k30561J18528J30919
11171C646529k72648K00829j14099O3367K18268j74751Q5617p7995j19391J9497
11161C475223J57572k1023Q3244o7773L2552o6924q7882O3189J76684J43467J1000
11150C899329j85457J90677J03841k64567N9827R0241l00942L46990k25276L18862
$$ plain form
11140 4033525 3804913 3816947 3974161 3974124 3997098 4146255 3932688 4148128 3993293 4160496
11130 4160496 4061147 4241156 4243764 4141581 4360512 4354694 4344807 4322297 4341027 4593245 4286961
11119 4286961 4402430 4349594 4610523 4550771 4459457 4545231 4388015 4680085 4495557 4542058
11109 4542058 4464590 4427250 4658844 4475220 4682521 4759761 4439338 4415996 4639114 4539930
11099 4539930 4553749 4362079 4438127 4550674 4363030 4554680 4255432 4391102 4518842 4460894
11089 4460894 4398146 4346252 4483526 4404909 4407763 4322586 4582847 4449721 4365907 4446717 4415975
11078 4415975 4412953 4401041 4367391 4463045 4504004 4492104 4249518 4540336 4437348 4531437 4612556
11067 4612556 4723919 4652078 4699788 4864725 4797406 5105398 5048974 5142120 5380534 5405956
$$ packed form
11140D033525k28612J2034J57214l7K2974J49157k13567K15440j54835J67203
11130D160496r9349J80009K608j02183K18931n818r887k2510J8730K52218l06284
11119D286961J15469n2836K60929n9752r1314Q5774j57216K92070j84528M6501
11109D542058p7468l7340K31594j83624K07301P7240l20423k3342K23118r9184
11099D539930J3819j91670P6048J12547j87644J91650k99248J35670J27740n7948
11089D460894o2748n1894J37274p8617K854q5177K60261j33126q3814Q0810l0742
11078D415975l022j1912l3650R5654M0959j1900k42586K90818j02988R4089Q1119
11067D612556J11363p1841M7710J64937o7319L07992n6424R3146K38414K5422
$$ plain form
11057 5405956 5492891 5520771 5476157 5801262 5658903 5631580 5591589 5837853 6019631 5889558
11047 5889558 5953787 6147578 6035797 6077002 5858453 5942691 6179287 6360066 6365810 6334940
11037 6334940 6773450 6792638 6911242 7169769 7272387 7129373 7393512 7459066 8143105 7921222
11027 7921222 8281060 8393960 8540687 8890607 9114812 9323922 9319123 9567349 9969858 9830616
11017 9830616 10222712 10169447 10198143 10434885 10865036 10673380 11199402 10923815 11182728 11379222
11007 11379222 11532879 11743807 12044815 12321259 12495759 12663762 12931501 13341418 13461022
10998 13461022 13797194 14407625 14610466 14698093 14821645 15024442 15198323 15554297 15839266
10989 15839266 15865096 16069170 16332143 16442519 16484002 16588452 17025010 17285068 17545497 18173917
$$ packed form
11057E405956Q6935K7880m4614L25105j42359k7323l9991K46264J81778j30073
11047E889558O4229J93791j11781M1205k18549Q4238K36596J80779N744l0870
11037F334940M38510J9188J18604K58527J02618j43014K64139O5554O84039k21883
11027G921222L59838J12900J46727L49920K24205K09110m799K48226M02509j39242
11017I830616L92096n3265K8696K36742M30151j91656N26022k75587K58913J96494
11007A1379222J53657K10928L01008K76444J74500J68003K67739M09917J19604
10998A3461022L36172O10431K02841Q7627J23552K02797J73881L55974K84969
10989A5839266K5830K04074K62973J10376M1483J04450M36558K60058K60429O28420
$$ plain form
10979 18173917 18525186 19027435 19378478 19628733 19854509 20299084 20349613 20355021 20412656 20791201
10969 20791201 21016697 21288699 21764041 22141365 22623245 22946763 23356029 23472246 24325782
10960 24325782 24539528 25085690 25383000 25878538 26367818 26813265 27659230 28447852 28966316
10951 28966316 29667659 30311560 30730758 31110647 31788492 32131044 32430960 33031476 33476992
10942 33476992 34002396 34663648 35376837 36060176 36778787 37439234 38469599 38746417 39748604
10933 39748604 40570005 41469341 41852497 42954465 43783287 44574373 45446612 46227566 47254138
10924 47254138 48058551 49179380 50318117 51150210 51876087 52675166 53302211 53882412 54192519
10915 54192519 54483037 54743511 54945906 54928054 55285412 55187122 55150711 55112068 55185037 55476088
$$ packed form
10979A8173917L51269N02249L51043K50255K25776M44575N0529N408N7635L78545
10969B0791201K25496K72002M75342L77324M81880L23518M09266J16217Q53536
10960B4325782K13746N46162K97310M95538M89280M45447Q45965P88622N18464
10951B8966316P01343O43901M19198L79889O77845L42552K99916O00516M45516
10942C3476992N25404O61252P13189O83339P18611O60447J030365K76818J002187
10933C9748604Q21401Q99336L83156J101968Q28822P91086Q72239P80954J026572
10924D7254138Q04413J120829J138737Q32093P25877P99079O27045N80201L10107
10915E4192519K90518K60474K02395j7852L57358r8290l6411l8643P2969K91051
$$ plain form
10905 55476088 55415705 55285851 55409845 55536108 55712119 55842584 55877339 56330157 56609100 57240602
10895 57240602 57343228 57700510 58441155 59101598 59638124 60273355 61278153 62386206 63417038
10886 63417038 64828814 66632461 68166025 70147986 72168580 74504874 77416948 80447268
10878 80447268 84142833 87811430 91995332 96668957 101494426 106468125 111105248 115490504
10870 115490504 119626432 123219682 125686886 127716506 128733508 128550764 127553718 125954062
10862 125954062 123488638 120380793 116720837 112483748 108217419 103441404 98776754 93926875
10854 93926875 89222550 84666076 80097341 75565673 71416039 67216655 63384034 59578832
10846 59578832 56160981 52671731 49265363 46568792 43851348 41120656 38953589 36702334
$$ packed form
10905E5476088o0383j29854J23994J26263J76011J30465L4755M52818K78943O31502
10895E7240602J02626L57282P40645O60443N36526O35231J004798J108053J030832
10886F3417038J411776J803647J533564J981961K020594K336294K912074L030320
10878H0447268L695565L668597M183902M673625M825469M973699M637123M385256
10870A15490504M135928L593250K467204K029620J017002j82744r97046j599656
10862A25954062k465424l107845l659956m237089m266329m776015m664650m849879
10854I3926875m704325m556474m568735m531668m149634m199384l832621l805202
10846E9578832l417851l489250l406368k696571k717444k730692k167067k251255
$$ plain form
10838 36702334 34556494 32597529 30823289 28989504 27676107 26197439 24927337 23807916
10830 23807916 22506878 21340099 20651314 19783470 18445910 17827202 17060833 16403532 15535838
10821 15535838 15055106 14558015 14138294 13573983 13206356 12748165 12545432 11741475 11611843
10812 11611843 11362333 11290580 10985324 10890177 10551202 10454834 10132957 9684594 9263770 9017001
10802 9017001 8797615 8296042 7944973 7866406 7534559 7214517 7292697 7082131 6657639 6637004
10792 6637004 6617376 6510157 6129556 6090353 6271135 5992127 5828307 5937117 5790362 5705825
10782 5705825 5501958 5297913 5263956 5370367 5259822 5036209 5014126 5090656 4777926 4687237
10772 4687237 4541235 4641149 4475494 4422205 4219129 4289802 4218729 4102507 4052708 4257558
$$ packed form
10838C6702334k145840j958965j774240j833785j313397j478668j270102j119421
10830B3807916j301038j166779o88785q67844j337560o18708p66369o57301q67694
10821A5535838m80732m97091m19721n64311l67627m58191k02733q03957j29632
10812A1611843k49510p1753l05256r5147l38975r6368l21877m48363m20824k46769
10802I017001k19386n01573l51069p8567l31847l20042P8180k10566m24492k0635
10792F637004j9628j07219l80601l9203J80782k79008j63820J08810j46755q4537
10782E705825k03867k04045l3957J06411j10545k23613k2083P6530l12730r0689
10772D687237j46002R9914j65655n3289k03076P0673p1073j16222m9799K04850
$$ plain form
10762 4257558 4041595 3948635 4104509 3720699 3953779 3710476 3883683 4005912 3917787 4064895
10752 4064895 3862753 4004005 3868211 3852244 3851720 3995159 3820217 3576343 3570104 3491467 3266519
10741 3266519 3244349 3247785 3150581 3182983 3132570 3281373 3113776 3084985 3214941 3019657 3196703
10730 3196703 3493343 3397997 3276785 3440913 3387372 3368278 3370685 3138457 3298121 3444745
10720 3444745 3464437 3218120 3151801 3315092 3134886 3110412 2896774 3365206 3063584 3359058
10710 3359058 3249132 2997427 3318325 3438139 3233799 3373735 3280751 3228611 3195247 3079175
10700 3079175 3390425 3171030 3096577 3139528 3003172 3031841 2842913 2807954 2986191 2763205
10690 2763205 2669757 2933929 2987795 3006775 2876753 2927210 2964510 2813380 2790905 2784024 2858003
$$ packed form
10762D257558k15963r2960J55874l83810K33080k43303J73207J22229q8125J47108
10752D064895k02142J41252j35794j5967n24J43439j74942k43874o239p8637k24948
10741C266519k2170L436r7204L2402n0413J48803j67597k8791J29956j95284J77046
10730C196703K96640r5346j21212J64128n3541j9094K407k32228J59664J46624
10720C444745J9692k46317o6319J63291j80206k4474k13638M68432l01622K95474
10710C359058j09926k51705L20898J19814k04340J39936r2984n2140l3364j16072
10700C079175L11250k19395p4453M2951j36356K8669j88928l4959J78237k22986
10690B763205r3448K64172N3866J8980j30022N0457L7300j51130k2475o881P3979
$$ plain form
10679 2858003 2908465 2833145 2692068 2760299 3003013 2829758 2887151 2782044 2900477 2881312
10669 2881312 2700613 2754065 2569815 2631068 2547853 2510342 2463298 2596613 2245539 2384235
10659 2384235 2472275 2633673 2301675 2259500 2296627 2378384 2270732 2222717 2411346 2425807
10649 2425807 2402094 2541427 2464999 2584508 2550380 2348221 2197671 2310560 2321113 1912911
10639 1912911 2081489 2351988 2151523 2058546 2107418 2244426 2198704 2156572 2201573 2155310
10629 2155310 2327839 2168225 1855758 2060279 1988272 2145273 2085403 2220776 2047533 2022791
10619 2022791 2039976 2190649 2157142 2020366 2066869 2031110 2117853 1955311 2117041 2195538
10609 2195538 2113283 2162121 2052646 2002394 2169851 1906738 2022396 2208602 1914512 1938234
$$ packed form
10679B858003N0462p5320j41077O8231K42714j73255N7393j05107J18433j9165
10669B881312j80699N3452j84250O1253q3215l7511m7044J33315l51074J38696
10659B384235Q8040J61398l31998m2175L7127Q1757j07652m8015J88629J4461
10649B425807k3713J39333p6428J19509l4128k02159j50550J12889J0553m08202
10639A912911J68578K70499k00465r2977M8872J37008m5722m2132M5001m6263
10629B155310J72529j59614l12467K04521p2007J57001n9870J35373j73243k4742
10619B022791J7185J50673l3507j36776M6503l5759Q6743j62542J61730P8497
10609B195538q2255M8838j09475n0252J67457k63113J15658J86206k94090K3722
$$ plain form
10599 1938234 1995886 2165813 2048512 1928205 2041846 2089481 1909683 2016467 1866527 1871704
10589 1871704 1974752 2015658 1874554 1918422 1820552 1764571 1962602 1924242 2080767 1915861
10579 1915861 2049576 2022706 2140892 1916279 2064865 1923301 1992976 2088741 1771118 2004342
10569 2004342 1834988 1850815 1677443 1949022 1704810 1878058 1823147 1563741 1567455 1544547
10559 1544547 1485286 1548176 1672779 1394731 1693538 1558462 1553648 1496845 1494326 1714688 1480599
10548 1480599 1499139 1408713 1688353 1604067 1548441 1207595 1280526 1365780 1333813 1351759 1518181
10537 1518181 1515188 1539285 1430152 1526190 1625271 1425639 1303874 1569381 1775701 1666281
10527 1666281 1743995 1614644 1664337 1736176 1785075 1693206 1681565 1673271 1904692 2212191 2465509
$$ packed form
10599A938234N7652J69927j17301j20307J13641M7635j79798J06784j49940N177
10589A871704J03048M0906j41104M3868r7870n5981J98031l8360J56525j64906
10579A915861J33715k6870J18186k24613J48586j41564O9675R5765l17623K33224
10569B004342j69354J5827j73372K71579k44212J73248n4911k59406L714k2908
10559A544547n9261O2890J24603k78048K98807j35076m814n6803k519K20362k34089
10548A480599J8540r0426K79640q4286n5626l40846P2931Q5254l1967J7946J66422
10537A518181k993K4097j09133R6038R9081j99632j21765K65507K06320j09420
10527A666281P7714j29351M9693P1839M8899r1869j1641q294K31421L07499K53318
$$ plain form
10516 2465509 2492880 2258616 2631742 2641011 2576052 2238621 2313336 1972512 1956457 1749530
10506 1749530 1946011 1773125 1987476 1728944 2062818 1830769 1930870 1783088 1907460
10497 1907460 1910035 1873543 1761343 2195383 2113747 2119361 2452641 2385457 2381341 2701445 2645231
10486 2645231 2867714 2704985 2422875 2593661 2376907 2273808 2227968 1989469 2035013 2137545
10476 2137545 2014524 1891448 2109356 2141311 2042587 2244866 2046167 2199753 2028176 2183108
10466 2183108 2247022 2598934 2461869 2603815 2598588 2793443 2856970 2415599 2441266 2398616
10456 2398616 2494573 2493192 2521922 2370232 2387291 2561115 2672789 2596798 2903838 2902339 2658650
10445 2658650 2917991 2896556 2600912 2797513 2702965 2656755 2674989 2802248 3183366 3529861
$$ packed form
10516B465509K7371k34264L73126R269o4959l37431P4715l40824j6055k06927
10506A749530J96481j72886K14351k58532L33874k32049J00101j47782J24372
10497A907460K575l6492j12200M34040q1636N614L33280o7184m116L20104n6214
10486B645231K22483j62729k82110J70786k16754j03099m5840k38499M5544J02532
10476B137545j23021j23076K17908L1955r8724K02279j98699J53586j71577J54932
10466B183108O3914L51912j37065J41946n227J94855O3527m41371K5667m2650
10456B398616R5957j381K8730j51690J7059J73824J11674p5991L07040j499k43689
10445B658650K59341k1435k95644J96601r4548m6210J8234J27259L81118L46495
$$ plain form
10435 3529861 3622249 3627478 3861527 3394589 3614814 3161836 2837364 2513929 2540887 2673359
10425 2673359 2521009 2260825 2349371 2305772 2418528 2218123 2035927 2302291 2169993 2258059
10415 2258059 2384203 2129510 2481739 2436057 2550258 2926187 3382063 3175906 3584959 3633037
10405 3633037 4204694 4194981 4455816 4217911 4414209 4448451 4438134 4411687 4492288 4550049 4902321
10394 4902321 5258818 5556829 5917153 5811730 6106131 6380900 6405308 6491549 6842879 6743187
10384 6743187 6564849 6623641 6483742 6282633 6521866 6241856 6345556 6277534 6292170 6014668
10374 6014668 6071325 6124598 6151982 6333840 6376576 6231404 6357255 6709031 6893611 6822135
10364 6822135 6839419 6837649 6679558 6719280 6371153 6175002 6381764 6269019 6152766 6064227
$$ packed form
10435C529861R2388N229K34049m66938K20225m52978l24472l23435K6958J32472
10425B673359j52350k60184Q8546m3599J12756k00405j82196K66364j32298Q8066
10415B258059J26144k54693L52229m5682J14201L75929M55876k06157M09053M8078
10405C633037N71657r713K60835k37905J96298L4242j0317k6447Q0601N7761L52272
10394D902321L56497K98011L60324j05423K94401K74769K4408Q6241L51330r9692
10384F743187j78338N8792j39899k01109K39233k80010J03700o8022J4636k77502
10374F014668N6657N3273K7384J81858M2736j45172J25851L51776J84580p1476
10364F822135J7284j770j58091L9722l48127j96151K06762j12745j16253q8539
$$ plain form
10354 6064227 6128552 5930705 5885985 5711948 5481489 5346968 5289537 4798769 4941127 4884548
10344 4884548 4540461 4537581 4415702 4343260 4453383 4546898 4726090 4557445 4691943 4872311
10334 4872311 4633761 4949297 4644458 4656859 4834016 4554304 4732055 4601990 4456092 4605353
10324 4605353 4591451 4484530 4530939 4571102 4647835 4483369 4684137 4651173 4503670 4438134
$$ packed form
10354F064227O4325j97847m4720j74037k30459j34521n7431m90768J42358n6579
10344D884548l44087k880j21879p2442J10123R3515J79192j68645J34498J80368
10334D872311k38550L15536l04839J2401J77157k79712J77751j30065j45898J49261
10324D605353j3902j06921M6409M0163P6733j64466K00768l2964j47503o5536
$$ [...]
##END NTUPLES=NMR SPECTRUM
##END=
