##TITLE=Coffee green (M3-ROVE40 + 1.5mL buffer 50/50,  450uL extracto + 50uL (D2O+TMS))
without heating, vortex and centrifuged, temperature 0oC.
##JCAMPDX= 6.0         $$ Bruker NMR JCAMP-DX V2.0
##DATA TYPE= NMR SPECTRUM
##DATA CLASS= NTUPLES
##ORIGIN= Bruker BioSpin GmbH
##OWNER= Administrator
$$ 1.72 TOPSPIN		Version 2.1
$$ 2012-05-22 16:13:20.450 -0700  Administrator@X
$$ Compression mode = diff/dup
##.OBSERVE FREQUENCY= 400.13188198
##.OBSERVE NUCLEUS= ^1H
##.ACQUISITION MODE= SIMULTANEOUS (DQD)
##.ACQUISITION SCHEME= undefined
##.AVERAGES= 64
##.DIGITISER RES= 22
##SPECTROMETER/DATA SYSTEM= spect
##.PULSE SEQUENCE= noesygppr1d
##.SOLVENT NAME= H2O+D2O
##.SHIFT REFERENCE= INTERNAL, H2O+D2O, 1, 14.97969
##AUDIT TRAIL= $$ (NUMBER, WHEN, WHO, WHERE, PROCESS, VERSION, WHAT)
$$ ##TITLE= Audit trail, TOPSPIN		Version 2.1
$$ ##JCAMPDX= 5.01
$$ ##ORIGIN= Bruker BioSpin GmbH
$$ ##OWNER= Administrator
$$ $$ c:\Bruker\TOPSPIN/data/jwist/nmr/11-coffee-green-quantification-2/161/pdata/1/auditp.txt
$$ ##AUDIT TRAIL=  $$ (NUMBER, WHEN, WHO, WHERE, PROCESS, VERSION, WHAT)
(   1,<2011-11-17 17:37:14.435 -0500>,<Administrator>,<TOPSPIN>,<go>,<TOPSPIN 2.1>,
      <created by zg
	started at 2011-11-17 17:28:19.794 -0500,
	POWCHK enabled, PULCHK disabled,
       configuration hash MD5:
       DA 63 81 1B EF 4C B5 72 B4 DF EA D9 B4 DB 4C 08
       data hash MD5: 64K
       8E 96 B3 8E 10 30 73 B6 37 46 65 84 24 01 EC 71>)
(   2,<2011-11-17 18:22:44.419 -0500>,<Administrator>,<TOPSPIN>,<proc1d>,<TOPSPIN 2.1>,
      <Start of raw data processing
       efp LB = 0 FT_mod = 6 PKNL = 1 PHC0 = 0 PHC1 = 0 SI = 32K 
       data hash MD5: 32K
       63 A4 02 87 63 DC 80 5D 5B 87 22 5B DD 2D EE 24>)
(   3,<2011-11-17 18:22:44.779 -0500>,<Administrator>,<TOPSPIN>,<proc1d>,<TOPSPIN 2.1>,
      <pk PHC0 = 21.22009 PHC1 = 0 
       data hash MD5: 32K
       8B E3 74 10 72 93 73 59 B3 DE A3 C2 18 DD DF 59>)
$$ ##END=
$$ 
$$ $$ hash MD5
$$ $$ D1 D5 8B 65 9C 3D 50 85 DA 50 A5 1D AE BB BF 04
##$RELAX= 
##$RELAX= 
##$RELAX= 
##$RELAX= 
##$RELAX= 
##$RELAX= 
##$RELAX= 
$$ Bruker specific parameters
$$ --------------------------
##$DU= <Z:>
##$EXPNO= 161
##$NAME= <11-coffee-green-quantification-2>
##$PROCNO= 1
##$TYPE= <nmr>
##$USER= <jwist>
##$ACQT0= -8.19182559859216
##$AMP= (0..31)
100 100 100 100 100 100 100 100 100 100 100 100 100 100 100 100 100 100
100 100 100 100 100 100 100 100 100 100 100 100 100 100
##$ANAVPT= -1
##$AQSEQ= 0
##$AQ_mod= 3
##$AUNM= <au_prof>
##$AUTOPOS= <>
##$BF1= 400.13
##$BF2= 400.13
##$BF3= 400.13
##$BF4= 400.13
##$BF5= 400.13
##$BF6= 400.13
##$BF7= 400.13
##$BF8= 400.13
##$BYTORDA= 0
##$CFDGTYP= 0
##$CFRGTYP= 9
##$CHEMSTR= <none>
##$CNST= (0..63)
1 1 145 1 1 1 1 1 1 1 1 1 1 1 1 1 1 1 1 1 1 1 1 1 1 1 1 1 1 1 1 1 1 1 1
1 1 1 1 1 1 1 1 1 1 1 1 1 1 1 1 1 1 1 1 1 1 1 1 1 1 1 1 1
##$CPDPRG= <>
##$CPDPRG1= <>
##$CPDPRG2= <>
##$CPDPRG3= <>
##$CPDPRG4= <mlev>
##$CPDPRG5= <mlev>
##$CPDPRG6= <mlev>
##$CPDPRG7= <mlev>
##$CPDPRG8= <mlev>
##$CPDPRGB= <>
$$ [...]
150 150 150 150 150 150 150 150
##$TP07= 0
##$TPNAME0= <>
##$TPNAME1= <>
##$TPNAME2= <>
##$TPNAME3= <>
##$TPNAME4= <>
##$TPNAME5= <>
##$TPNAME6= <>
##$TPNAME7= <>
##$TPOAL= (0..7)
0.5 0.5 0.5 0.5 0.5 0.5 0.5 0.5
##$TPOFFS= (0..7)
0 0 0 0 0 0 0 0
##$TUNHIN= 0
##$TUNHOUT= 0
##$TUNXOUT= 0
##$USERA1= <user>
##$USERA2= <user>
##$USERA3= <user>
##$USERA4= <user>
##$USERA5= <user>
##$V9= 5
##$VALIST= <valist>
##$VCLIST= <CCCCCCCCCCCCCCC>
##$VD= 0
##$VDLIST= <DDDDDDDDDDDDDDD>
##$VPLIST= <PPPPPPPPPPPPPPP>
##$VTLIST= <TTTTTTTTTTTTTTT>
##$WBST= 2048
##$WBSW= 25
##$XGAIN= (0..3)
0 0 0 0
##$XL= 0
##$YL= 0
##$YMAX_a= 5433804
##$YMIN_a= -2096930
##$ZGOPTNS= <>
##$ZL1= 120
##$ZL2= 120
##$ZL3= 120
##$ZL4= 120
##$ABSF1= 0
##$ABSF2= 0
##$ABSG= 0
##$ABSL= 0
##$ALPHA= 0
##$AQORDER= 0
##$ASSFAC= 0
##$ASSFACI= 0
##$ASSFACX= 0
##$ASSWID= 0
##$AUNMP= <proc_prof1d>
##$AXLEFT= 0
##$AXNAME= <>
##$AXNUC= <1H>
##$AXRIGHT= 0
##$AXTYPE= 0
##$AXUNIT= <>
##$AZFE= 0.1
##$AZFW= 0.1
##$BCFW= 0
##$BC_mod= 0
##$BYTORDP= 0
##$COROFFS= 0
##$CY= 15
##$DATMOD= 1
##$DC= 0
##$DFILT= <>
##$DTYPP= 0
##$F1P= 7.93112723809753
##$F2P= 6.09084514794348
##$FCOR= 0.5
##$FTSIZE= 32768
##$FT_mod= 6
##$GAMMA= 0
##$GB= 0
##$INTBC= 1
##$INTSCL= 1
##$ISEN= 128
##$LB= 0
##$LEV0= 0
##$LPBIN= 0
##$MAXI= 10000
##$MC2= 0
##$MEAN= 0
##$ME_mod= 0
##$MI= 0
##$NCOEF= 0
##$NC_proc= -6
##$NLEV= 6
##$NOISF1= 0
##$NOISF2= 0
##$NSP= 0
##$NTH_PI= 0
##$NZP= 0
##$OFFSET= 14.97969
##$PC= 1
##$PHC0= 21.22009
##$PHC1= 0
##$PH_mod= 1
##$PKNL= yes
##$PPARMOD= 0
##$PPDIAG= 0
##$PPIPTYP= 0
##$PPMPNUM= 2147483647
##$PPRESOL= 1
##$PSCAL= 0
##$PSIGN= 0
##$PYNMP= <proc.py>
##$REVERSE= no
##$SF= 400.13
##$SI= 32768
##$SIGF1= 0
##$SIGF2= 0
##$SINO= 400
##$SIOLD= 32768
##$SPECTYP= <>
##$SREGLST= <1H.CDCl3>
##$SSB= 0
##$STSI= 32768
##$STSR= 0
##$SW_p= 8223.68421052631
##$SYMM= 0
##$S_DEV= 0
##$TDeff= 65536
##$TDoff= 0
##$TI= <>
##$TILT= no
##$TM1= 0
##$TM2= 0
##$TOPLEV= 0
##$USERP1= <user>
##$USERP2= <user>
##$USERP3= <user>
##$USERP4= <user>
##$USERP5= <user>
##$WDW= 1
##$XDIM= 32768
##$YMAX_p= 335628571
##$YMIN_p= -100898218
##$CURPLOT= <Network HP LaserJet P1505>
##$CURPRIN= <$Network HP LaserJet P1505>
##$DFORMAT= <normdp>
##$LAYOUT= <+/1D_H.xwp>
##$LFORMAT= <normlp>
##$PFORMAT= <normpl>
##$SURQMSG= 1
$$ End of Bruker specific parameters
$$ ---------------------------------
##NTUPLES= NMR SPECTRUM
##VAR_NAME=  FREQUENCY,     SPECTRUM/REAL,   SPECTRUM/IMAG
##SYMBOL=    X,             R,               I
##VAR_TYPE=  INDEPENDENT,   DEPENDENT,       DEPENDENT
##VAR_FORM=  AFFN,          ASDF,            ASDF
##VAR_DIM=   32768,         32768,           32768
##UNITS=     HZ,            ARBITRARY UNITS, ARBITRARY UNITS
##FACTOR=    0.250966925370066, 1,           1
##FIRST=     8223.43324360094, 98715,        -142393
##LAST=      0,             29917,           -237808
##MIN=       0,             -100898218,      0
##MAX=       8223.43324360094, 335628571,    0
$$ Real data points
##PAGE= N=1
##DATA TABLE= (X++(R..R)), XYDATA
$$ [...]
23424 189614 131181 267836 375034 289215 231123 172358 333716 242539 639335 78040 262016
23413 262016 245409 329021 219672 299735 305468 392724 415511 374510 185402 319918 406152
23402 406152 190632 348979 388436 357271 428115 132142 432431 133409 243748 376200
23392 376200 577606 471172 396508 307314 364307 540787 628560 497763 604758 779035
23382 779035 667380 713960 846208 930317 927302 1139688 1488111 1902983 2296248 3065706
23372 3065706 3818295 4969443 6557703 7636704 9637995 11014950 12904075 14790680
23364 14790680 16580831 18113098 19696661 20798318 21393722 21781002 21257066 20845004 20138760
23355 20138760 19095579 17833884 16190397 14203533 12611952 10559065 8978179 7641847
23347 7641847 6398696 5142247 4120385 3389152 2464813 2141682 1778451 1557655 1480281
23338 1480281 934376 833485 740654 665227 732129 425210 508341 400662 356573 431505
23328 431505 526503 166996 379171 288179 544219 180176 82773 295884 144380 288884
23318 288884 32689 122769 -253167 383132 107483 244508 309429 407987 162244 189212
23308 189212 441288 219277 319578 328314 266517 121298 159444 70868 -98191 163733 125588
23297 125588 58873 83699 190818 249356 362632 179414 291400 303489 350937 484526
23287 484526 206240 316976 210120 376394 319517 104097 326679 150108 345653 281079
23277 281079 190084 280298 335779 389602 271924 168316 210462 171464 223575 147756 315067
23266 315067 172425 61272 239796 493288 319450 400698 218639 434422 263384 365316
23256 365316 270717 227227 314717 409354 223307 263188 297838 176892 132044 278144 454361
23245 454361 427981 333335 34278 276770 111408 432922 380569 175604 232754 71643 301558
23234 301558 -3386 146721 203539 140710 131595 -22576 195544 277122 -51282 311178 242267
23223 242267 307905 349176 11424 94976 493462 190742 -3531 207192 232940 40298 449506
23212 449506 192315 407722 371506 301578 231491 304265 -130094 146134 200036 -104020
23201 227128 375976 430885 500300 227104 125771 52512 454061 309096 96227 -20643
23190 442879 51968 325638 165948 176095 445685 62032 207830 288923 204903 63623 574872
23179 574872 497979 300992 77747 209865 111389 111503 315181 233405 247269 289283 385209
23168 385209 158536 133128 476669 213567 228419 146123 311881 103841 384348 88077
23157 259022 331690 289451 208604 455112 289365 366945 119141 76922 239458 63127 162960
23146 162960 193415 240089 380909 104934 138505 33641 272121 391682 431659 305077
23136 305077 236548 175648 215074 427321 113846 100166 133102 338630 384529 170914 322206
23125 322206 182780 120809 102931 183459 363786 181679 266137 31078 271692 261723 341801
23114 341801 117817 374144 354155 209929 289897 238835 232577 96242 413439 77119 129827
23103 129827 153758 359462 340321 28460 140192 260770 169223 157292 297315 69043 302736
23092 302736 37186 -36409 253433 97785 581795 380691 84717 462818 255945 259152 58239
23080 369772 585567 480114 237508 516950 363367 500553 203792 346886 216119 325539
23070 325539 291557 146688 208131 210869 223894 333868 20850 61003 87927 167316 87402
23059 87402 122458 380337 229369 489569 418384 430959 169016 315568 291164 248455 362130
23048 362130 98133 339016 516901 347676 246166 277746 132224 354669 185364 241964
23038 241964 358552 315989 172388 414160 225408 201191 277074 202016 266269 177460 329470
23027 329470 155336 218425 113195 341757 347813 293449 366800 353438 130828 457113 387460
23016 387460 456448 248835 422115 369302 343107 354290 367393 494758 449806 245494 157229
23005 157229 327861 550547 289647 382150 174512 143688 282020 238301 269688 406543
22995 406543 320979 321541 177099 259800 359942 395994 254994 436283 299432 516716 418121
22984 418121 407049 448074 296378 441904 556732 415479 584662 93769 676665 593588
22974 593588 397351 387229 473369 439286 521091 481815 501620 539897 665187 498345 642880
22963 642880 458748 461394 537744 523906 683129 943113 886951 898453 1071507 1066105 1211730
22952 1211730 1500381 1792521 2702646 3050572 4227403 4981732 5962164 6838373 7961874
22943 7961874 9029267 10189091 10668897 11336522 11393281 12093209 11899854 11371578 11117448
22934 11117448 10415790 9385590 8659133 7489642 6690778 5679511 4984352 4307906 3861672
22925 3861672 3185232 2944329 3009568 2982233 3038937 3239484 3856561 4398341 5496577 6524313
22915 6524313 7749354 9375130 10685093 12337527 14082250 16004840 17231870 18476453
22907 18476453 19337008 19917538 20339473 20483971 20087534 19173351 18269980 16923975 15436218
22898 15436218 14120142 12777854 11156975 10304268 9102364 8221014 7521171 6967605 6917797
22889 6917797 7022467 7037119 7248741 7560832 7829081 8235904 8802968 9090427 9400849 9735043
22879 9735043 9773491 9678766 9360910 8818623 8503772 7923555 7345067 6849648 5876951 5596996
22869 5596996 5013572 4222127 3853588 3423874 3057575 2659235 2092805 1866637 1666143
22860 1666143 1525138 1398927 1266817 1212503 1047896 1015855 792356 857221 776998 889089
22850 889089 714419 749360 398324 617447 469699 554916 522158 400493 681694 425937
22840 425937 604774 491957 691582 664618 612139 364434 596332 341014 418416 282935
22830 282935 490087 343844 573942 384682 281323 378115 145033 389123 179686 282025
22820 282025 397342 462709 234496 267470 479238 454792 349813 346605 264830 353770 124069
22808 488025 393097 395505 579232 364548 322743 487935 358002 309096 291287 305133 399259
22797 399259 295853 181809 575961 109863 330097 338359 371575 162350 210483 128568
22787 128568 312107 345327 157842 483707 213808 490352 283064 292736 303748 159181
22777 159181 344548 416450 277928 152059 435994 327845 188538 164678 252453 222021
22767 222021 399051 308112 285700 249242 196213 437423 366304 348580 233395 352511 330291
22756 330291 498612 367325 186654 293021 249518 169586 203488 356707 297366 477958
22746 477958 377747 226880 315893 213784 46615 71659 275376 228373 89330 248054
22736 248054 148124 381780 249781 598487 282099 313955 383463 273641 227050 420532
22726 420532 364883 135250 36663 568819 213095 329411 136012 381631 138484 313448
22716 313448 475381 182734 225438 450974 418080 454436 234934 448145 150509 241452
22706 241452 330047 348049 182114 119919 339683 166586 -1439 95402 212339 102335 228886
22695 228886 119082 295119 505142 220722 167386 325975 319419 244531 182166 316039
22685 316039 228225 361670 210614 234191 217501 458625 173256 190847 239906 234970 250707
22674 250707 499426 252862 398301 456467 182623 97842 243583 314071 294511 269883
22664 269883 281822 342030 328999 403327 449790 225780 453483 404938 379204 402225 428969
22653 428969 378958 262632 208687 290539 100975 317217 354802 310215 308344 427653 355783
22642 355783 465842 504311 306973 463960 419496 172431 184496 495327 290654 297883
22632 297883 467806 252920 230776 575255 374674 331090 509767 474642 270846 419469
22622 419469 665568 550251 562336 495026 401707 298379 329306 551733 525621 510790 423622
22611 423622 385379 332696 378468 561602 546497 467698 340071 344378 262092 531536 405195
22600 405195 179806 437492 534417 394734 385649 507850 401966 297594 557276 649554
22590 649554 362675 334573 469077 213045 570295 568201 470445 273734 580495 429456
22580 429456 729968 480126 489229 417920 375005 301039 463597 227883 217478 398078 384892
22569 384892 317844 386902 530270 493525 253297 539538 470404 535463 578405 597946 330920
22558 330920 416638 314960 396134 420985 536693 397528 480213 476483 496345 376826 409665
22547 409665 386584 347522 425138 396056 366593 375468 445126 441764 588771 410954 340060
22536 340060 362290 220174 400296 324996 439803 406608 248827 232174 461608 421024
22526 421024 413613 239532 266856 476887 367027 407247 470715 415625 406802 488622 522844
22515 522844 378895 520254 354226 634550 407270 607833 555537 456220 517496 230205
22504 294636 424779 498913 504710 524306 654087 419196 257621 499512 504120 376268 625198
22493 625198 312031 482768 557633 374746 552379 625309 739886 545306 373658 592378
22483 592378 519280 321555 402240 347825 437728 264122 460701 565671 371294 496478
22473 496478 535405 312082 357740 339923 460158 546 408472 574224 467678 275999 416979
22462 416979 180007 458541 259844 218995 540411 370637 429356 541502 450146 511453
22452 511453 295964 456322 442848 229145 424748 397538 300845 255008 207534 478809
22442 478809 334894 563771 181648 368602 411371 503308 418310 397391 271870 545592
22432 545592 289610 472662 580339 434886 532516 296947 402170 531965 539876 426443
22422 426443 723049 465302 316646 462221 778280 242663 360565 332732 133828 506806
22412 506806 484870 571708 275641 395441 342084 342425 461856 245947 388117 387999 526050
22401 526050 528979 408822 401903 408200 720319 372576 291326 539124 377762 326090 559455
22390 559455 522472 611554 674284 420786 499104 165552 508843 395407 328757 384275 553474
22379 553474 477576 530821 481325 597096 464019 464686 419846 306774 537224 575408 610985
22368 610985 660402 619198 353428 372042 412633 479434 389338 644958 465608 761675 325857
22356 322793 453109 606147 633280 483924 648854 341270 703198 361767 737278 532270
22346 532270 266928 418979 607875 494558 606541 432915 605158 417389 332140 632857
22336 632857 232695 555347 571459 776356 720298 1074798 1008996 1002346 1127141 1094011 832351
22325 832351 735886 820627 1035930 964504 628391 572621 521305 599193 629472 773515 680221
22314 680221 580023 679466 678674 725460 627128 544793 335925 422374 386895 535212 805652
22303 805652 587887 454833 641472 738736 660508 760036 586162 578734 753738 524968
22293 524968 485887 643890 596243 660387 640553 738841 470509 800661 718329 743503 643577
22282 643577 596254 591573 650320 455066 544789 456432 519041 701263 697272 252969 581979
22271 581979 522090 575256 684290 574665 756911 536192 875355 614727 761043 802719
22261 802719 712532 689095 690654 789255 740186 392003 768447 672290 833645 807943 762949
22250 762949 666337 735561 622485 552759 511183 642282 752670 450296 630156 565708
22240 565708 657696 510969 608546 747198 471498 632143 670748 538909 724987 624266
22230 624266 438187 621962 818741 745790 707319 735254 646068 776819 604003 780111
22220 780111 472942 557545 623606 618424 661547 613207 701109 531246 631533 712202 603157
22209 603157 691997 712024 632559 837966 563997 662055 698721 823835 765000 665937 815247
22198 815247 699231 496270 662119 516508 947349 490667 598844 658266 536814 451485
22188 451485 703115 858912 843763 514216 717698 563948 725430 857530 489707 479508
22178 479508 469134 813034 691203 702214 667171 629912 732666 557214 582823 728715
22168 728715 422611 661371 689746 800661 499158 688131 566154 536165 499709 831678
22158 831678 624341 844581 754446 759656 840665 720748 571188 770482 619116 957644
22148 957644 654166 593063 578441 458562 697186 542397 569482 733545 620595 680273
22138 680273 611914 676403 681308 642292 438454 716758 720027 457677 621921 883832 780837
22127 780837 676144 314430 713659 625825 413265 655267 354576 659684 704380 359223
22117 359223 427332 675083 485110 587582 443893 688053 681455 455930 605495 578172
22107 578172 675419 505783 692678 550540 476849 837525 615144 579391 618452 571824
22097 571824 516923 748033 531896 623269 473925 666840 805733 341727 714255 737169
22087 737169 703157 520089 633361 542954 798965 500393 656448 836573 644250 713920
22077 713920 782723 780112 653648 702868 600781 738940 720255 520279 831404 705637
22067 705637 749270 738632 776259 822467 659095 932496 623097 559749 689952 682404 929835
22056 929835 999219 824298 746230 817780 733073 839539 752370 741498 845118 696117 599926
22045 599926 743359 768833 794887 784178 841165 773385 740020 857524 708754 730385 573743
22034 573743 773468 824816 747283 649781 859209 595675 779047 766454 461967 858387
22024 858387 838850 867715 611898 749158 602577 640031 502088 636743 681358 688991 759468
22013 759468 757339 622951 743549 691644 977788 609187 771318 718669 793594 874743 720851
22002 720851 739455 552102 701852 844209 910204 742114 965747 701174 859864 763665
21992 763665 710025 896484 607857 711241 582090 823727 953286 719572 822327 889834
21982 889834 727033 881211 710613 789398 840082 799715 624114 590721 865165 924339
21972 924339 931714 747786 970375 699693 682762 824643 773359 935185 764106 951010
21962 951010 743501 775156 761451 1130535 749591 874694 1058589 715272 785048 738538
21952 738538 961134 673996 690804 826801 872721 853374 752626 592540 823785 873014
21942 873014 607717 900895 925044 812380 925017 970059 983245 805110 909261 1001650
21932 1001650 767986 711348 679362 706937 634140 853606 624839 954822 754325 612504
21922 612504 839804 920680 704790 906106 852304 715213 870956 681920 722312 963850
21912 963850 822501 733895 618614 857526 873043 728500 717705 859807 764336 807818
21902 807818 803615 879851 950219 949933 657773 911365 976158 814004 843259 997849 874838
21891 874838 751566 807348 875441 769611 763135 678933 872910 859819 677743 876075 789552
21880 789552 744925 738848 810461 816703 775062 816289 1115026 797084 812110 715447 994800
21869 994800 695633 1109486 1086660 665503 742433 850111 856769 835451 895592 953905 933858
21858 933858 946685 909685 642176 882435 868510 611778 635365 644389 782155 725946 976456
21847 976456 830835 883112 741429 751867 756678 833833 942334 774738 860936 754246 654636
21836 654636 699645 826687 824456 745234 785558 794457 943700 750646 1045172 654360 812589
21825 812589 814677 801350 804767 646462 762370 462998 586512 729758 815335 660396 764127
21814 764127 746893 969407 858407 753688 708304 627856 598057 662484 701032 840780 630585
21803 630585 684543 877780 635726 689454 687310 888424 624401 785211 468336 932410
21793 932410 634138 733626 688840 1044363 761503 583689 831264 694574 812236 859985
21783 859985 823133 658819 708390 721580 792691 938168 894242 660292 835515 629380
21773 629380 689430 872245 830301 972368 872339 818627 814662 887230 992866 777606 1032470
21762 1032470 789633 1073966 1050966 1172668 932745 1123053 1208107 1105835 1314118 1398637
21752 1398637 1550673 1677636 1898848 1827591 2343918 2811994 2828542 3195395 3687219 4088218
21742 4088218 4859652 5102357 5720886 5866021 6655213 6473636 6224658 5920064 5983529 5701158
21732 5701158 5115142 4832394 4544833 4323725 4062210 3932051 3800384 3913372 3961706 4154220
21722 4154220 4379202 4393963 4907737 5340309 6081542 6307106 7032684 7523776 8192270 8634675
21712 8634675 9058444 9172240 9423307 9535939 9582112 8987046 9231551 8767595 8374657 7897586
21702 7897586 7310243 6886766 6306054 5628014 5348146 4879821 4469576 4246084 4120245
21693 4120245 3951039 3802718 3714382 4059401 4007467 4391477 4601729 5073525 5416470 5956704
21683 5956704 6066596 6253344 6140767 6103472 5667546 5499680 5137052 4871255 4292469 3931947
21673 3931947 3405002 3001890 2730550 2458342 2406935 1705631 1943221 1669665 1725591 1502700
21663 1502700 1334729 1396048 1284507 1328072 1116266 1301890 1007435 1063816 939960 844027
21653 844027 1044856 883151 908352 830366 1058715 871115 984799 1005032 598522 979533
21643 979533 990501 779342 763930 780755 926521 934280 1047100 799895 896564 723492 582187
21632 582187 849933 800209 636214 683843 681930 665781 741934 821246 742082 735734 534083
21621 534083 704660 759959 664002 864363 815636 730822 819466 783191 530828 677155 654758
21610 654758 967386 505351 862203 751014 534493 783382 932106 916693 673572 676359
21600 676359 782720 910279 816718 935751 831078 608536 866272 802648 744687 818746
21590 818746 780107 661531 753288 625715 703373 841207 816984 597912 571469 780072
21580 780072 843293 744605 813899 606557 810261 812026 631793 802374 499537 620311
21570 620311 800398 803456 663486 751684 752962 657253 784425 654016 936933 668593 765855
21559 765855 578525 834921 838487 774840 717571 824858 511148 611044 562822 887185 779962
21548 779962 936996 895356 488916 720341 761724 628996 753686 749422 776121 616410
21538 616410 607642 865784 846083 620778 850521 813671 947284 626962 748389 965517
21528 965517 987841 627175 837434 918590 710675 792030 882366 846846 907814 870375 1000544
21517 1000544 795503 777261 908613 788823 737147 647939 603973 757473 603354 767038
21507 767038 999254 876523 868068 944262 1162792 945317 888422 868226 795275 682279 929188
21496 929188 886069 1116720 820525 808246 898064 991672 933873 999515 731645 588164 698872
21485 698872 849152 1009318 1132881 861066 904405 992301 994999 727201 1026952 1000990
21475 1000990 837549 934403 846669 824480 942213 924517 1020825 878134 975534 721298
21465 721298 966333 816221 993744 824170 726607 833451 941362 1061594 852165 775241
21455 775241 782211 885257 935304 1010605 735813 845081 869977 801185 890756 1025506 621121
21444 621121 1098995 999560 851409 610849 830675 849587 1001562 874560 854683 887789
21434 887789 821960 818709 846016 668634 915415 814611 762160 818258 828492 863183 822612
21423 822612 1050791 777216 831276 761365 821801 884095 1040924 902588 642629 759934
21413 759934 983555 808933 932310 1002757 817240 928088 970903 775497 785560 829724
21403 829724 788057 917510 784537 1115754 912822 894316 982722 1011744 690412 708143
21393 708143 794166 916098 896738 1124853 1027977 1160882 1054823 1142240 991820 1056784
21383 1056784 752975 1005211 895186 995546 908049 1077560 954348 857370 981633 951852
21373 951852 956369 979591 956237 1039036 1182130 872776 1020411 968622 1119051 1019939 1111710
21362 1111710 1174929 1099318 1094987 955707 954257 1205801 1043341 976126 1167121 1065106 1196780
21351 1196780 1010706 1128693 1118454 1075304 970821 1104632 1389280 1377191 1359021 1350159
21341 1350159 1276223 1490974 1392683 1353676 1357263 1357380 1451017 1487775 1325851 1455992 1543566
21330 1543566 1550573 1658385 1727293 1525796 1776553 1766562 1714988 1934197 1868266 1839439 2089456
21319 2089456 2349754 2074365 2467540 2233243 2252181 2370389 2482383 2539085 2752892 2685853
21309 2685853 3044546 3324420 3127539 3393275 3819055 4063098 4083004 4664491 4972087 5359747
21299 5359747 5598986 6241905 6960353 7656625 8272657 9436836 10173644 11307326 12422887
21290 12422887 13629886 15014228 16314247 17113293 18330994 18935055 19684621 19818954 19761227
21281 19761227 19468230 18928591 18105333 17352284 15972440 14816330 13785189 12676972 11403366
21272 11403366 10737080 9587122 8685217 7821599 7349761 6478702 6047534 5541302 5036199
21263 5036199 4826694 4220092 3822797 3826848 3588557 3470208 3095961 2888423 2930965 2791698
21253 2791698 2705166 2496114 2199508 2414205 2037777 2118438 1921072 1822042 1728745 1783457
21243 1783457 1627997 1434537 1521878 1600549 1668755 1656958 1497463 1441540 1291301 1423379
21233 1423379 1194705 1269036 1382527 1596886 1251011 1206288 1286878 1294968 1026126 1451697
21223 1451697 1060256 1006679 1358177 1174587 1454500 1200204 1242979 1221308 1270846 1088152
21213 1088152 1232033 919675 1016539 1097190 1087175 1114615 1129999 948592 980541 972369 1175791
21202 1175791 1111606 1197769 947816 895930 869713 1354925 1151455 866370 1089231 1085208
21192 1085208 1002906 958339 1217310 1136938 1125783 1086604 1238929 1095412 1194924 1040455
21182 1040455 1103471 953851 1234797 1040475 1040129 1119652 1110062 986649 876714 1299409 952831
21171 952831 1169898 1193024 1191946 1251335 1030250 1249287 1144457 1165242 1285340 1165855
21161 1165855 880739 1114398 1051219 1391471 1151198 1010910 1170434 1094198 1113999 957281
21151 957281 1108890 1049777 785557 1064466 881284 897549 1065814 908631 1141940 923748
21141 923748 939641 907789 1000981 998549 1055697 1013882 1037882 761497 853245 795232 872873
21130 872873 1001409 964958 904599 868337 1042191 1183624 1232701 1162176 1130203 949828 1145696
21119 1145696 1053100 1329911 1233349 1279023 1189292 1177184 1415300 1340434 1536787 1534168 1653643
21108 1653643 1460991 1378365 1643189 1520214 1571972 1439276 1719339 1344937 1457799 1557225
21098 1557225 1306514 1325936 1323275 1214541 1112963 1336902 1203203 1324467 1246452 1337539
21088 1337539 1410286 1302088 1536657 1648694 1549144 1457335 1622271 1406367 1390695 1406187
21078 1406187 1544797 1496660 1251667 1253054 1328122 1236179 1322663 1280094 1275988 1116409 1441243
21067 1441243 1147840 1304727 1539534 1065378 1342399 1429940 1648933 1424754 1310700 1325514
21057 1325514 1619339 1773850 1456446 1858913 1925202 1901158 2222400 2628283 3131058 3439799
21047 3439799 4026143 4351701 4733842 4501421 4554109 4419389 4142889 3924792 3861003 3263734
21037 3263734 3192827 2948802 2739373 2766531 2360437 2330238 2359421 2405794 2437518 2209215
21027 2209215 2508207 2487062 2288943 2709515 2833127 3017256 3253135 3715055 4001284 4481124
21017 4481124 4681891 5049736 5214225 4790257 4808485 4359955 4049886 4001972 3653233 3039060
21007 3039060 3060516 2884057 2597426 2357769 2430902 2366697 2436760 2318090 2381131 2087486
20997 2087486 2125425 2154092 1936457 2131410 2234537 2277672 2291815 2626133 2581507 2578060 3104031
20986 3104031 3564250 3874768 4739245 4827181 5173105 5084860 5410627 5181212 5433143 5074438
20976 5074438 4984895 5131678 4963147 5364898 5310130 5783921 6268964 6616210 7241044 7437378
20966 7437378 8084249 8536771 9405482 10072650 11191784 13067790 14698511 16803242 18902782
20957 18902782 20545554 21676871 22250195 22243967 21685991 20675514 19125477 17312191 15488816
20948 15488816 13666018 11858002 10151205 8726026 7633618 6574449 5790817 5511583
20940 5511583 4802199 4157029 3993601 3639004 3543751 3158589 3258308 2598725 2665783 2515798
20930 2515798 2409215 2282037 2632478 2181691 2439716 2367769 2253844 2522428 2145299 2190837
20920 2190837 2364479 2203998 2227444 2313634 2707293 2548206 2865411 2871749 3079985 3612858
20910 3612858 3850183 4138587 4813158 5494567 5815213 6103798 6641937 7217569 7900303
20901 7900303 8557148 9428170 10280680 12103894 13655738 15352670 17316651 18778435 19801716
20892 19801716 20458934 20088058 19424521 18386993 16915343 15273324 13277275 11505414
20884 11505414 9914707 8571571 7222629 6272061 5498875 4835684 4452148 4212691 3332072
20875 3332072 3152674 3053059 2709031 2744781 2417689 2238290 2167395 1894265 2123938 1832526
20865 1832526 1866139 1799868 1748527 1899250 1695499 1798406 1559279 1529009 1675921 1625027
20855 1625027 1534982 1626740 1522674 1588145 1582331 1327266 1242738 1610667 1342301 1602245
20845 1602245 1488315 1596839 1565333 1608076 1714036 1597950 1774233 1595002 1830410 1637536
20835 1637536 1646247 1658083 1640835 1704677 1811186 1712754 1806028 1588329 1807200 1674228 1663003
20824 1663003 1622185 1636892 1500802 1484389 1517511 1587481 1469256 1391688 1638922 1505210
20814 1505210 1551745 1482773 1497315 1784123 1436624 1731085 1520935 1638270 1742025 1683549
20804 1683549 1644836 1586224 1779731 1529902 1622226 1719260 1597222 1647518 1590488 1649289 1749602
20793 1749602 1457840 1488970 1758656 1558234 1432594 1451663 1124166 1375396 1174823 1360189
20783 1360189 1112153 1419621 1157526 1455836 1272851 1425001 1356991 1373420 1504885 1368569
20773 1368569 1571272 1434377 1338354 1448099 1453430 1404092 1306701 1425426 1168363 1268726
20763 1268726 1401321 1224698 1307413 1420892 1155769 1203886 1269898 1303850 1120153 1266753
20753 1266753 1389943 1396313 1411190 1501418 1333623 1286379 1559121 1365628 1167207 1223929
20743 1223929 1319604 1501812 1243331 1327605 1277325 1295717 1230389 1409168 1249598 1399317
20733 1399317 1571032 1515324 1443406 1359289 1516885 1563328 1345186 1451750 1349066 1402288
20723 1402288 1354560 1284301 1416507 1331440 1640451 1275761 1423502 1546815 1436804 1524838
20713 1524838 1193687 1525909 1449331 1268800 1700862 1388383 1199161 1287717 1422871 1493603
20703 1493603 1265600 1354421 1276912 1312779 1384194 1403108 1244440 1274221 1354697 1162904 1211036
20692 1211036 1434032 1302984 1437446 1349512 1039157 1324641 1366070 1437509 1551662 1415068
20682 1415068 1462495 1526432 1787779 1846902 1615664 1458298 1833498 1757649 1570138 1721104
20672 1721104 1727990 1519425 1577173 1525996 1748746 1630524 1444658 1621853 1321944 1512633
20662 1512633 1431221 1467326 1340737 1254408 1411078 1584284 1499715 1399388 1680831 1368146
20652 1368146 1717587 1735558 1761878 1650336 1540540 1764826 1848037 2010116 1891685 1681579
20642 1681579 1766312 1535267 1733332 1822964 1399920 1385103 1463155 1411675 1502712 1226917
20632 1226917 1323909 1120423 1237818 1272765 1418938 1384257 1429338 1315777 1371463 1510104
20622 1510104 1250412 1346514 1486137 1468995 1470622 1647034 1263477 1552554 1516388 1253442
20612 1253442 1558079 1581248 1544544 1617316 1399072 1315793 1171393 1288472 1184191 1222346
20602 1222346 1307123 1269141 1397250 1223920 1141545 1540087 1343849 1277068 1564463 1421298
20592 1421298 1420578 1242847 1294357 1276132 1546241 1537703 1552712 1349773 1440878 1248510 1383634
20581 1383634 1446540 1261644 1252255 1449734 1104021 1428190 1351715 1368643 1186082 1266911
20571 1266911 1164934 1317459 1221153 1187892 1186460 1389833 1305994 1383820 1260287 1358191 1124168
20560 1124168 1196158 1295638 1596097 1251990 1269566 1230755 1456884 1177269 1396383 1401745
20550 1401745 1467025 1267998 1060332 1389668 1327265 1303225 1224519 1242693 1452029 1357384
20540 1357384 1452738 1736505 1707921 1922902 1584718 1707023 1713389 1903428 1844695 1966815
20530 1966815 1982258 1679162 1583550 1614438 1826547 1602398 1876679 1634747 1210963 1420425
20520 1420425 1479013 1364851 1430350 1303365 1276676 1558025 1378173 1542645 1182432 1227935
20510 1227935 1547504 1329602 1635341 1592478 1465954 1557987 1505107 1647452 1693386 1794043
20500 1794043 1573868 1651314 1749352 1661101 1622844 1694242 1611820 1338022 1405700 1457557 1429900
20489 1429900 1364024 1404243 1404100 1732179 1581356 1470959 1677338 1752340 1581279 1689244
20479 1689244 1596055 1552176 1840804 1643975 1822971 1645748 1735511 1731997 1706208 1540102
20469 1540102 1528706 1745214 1743461 1564587 1616371 1384349 1802230 1327043 1531440 1594427
20459 1594427 1470530 1433918 1436589 1531635 1820675 1668921 1591061 1474765 1543275 1405766
20449 1405766 1463891 1570015 1602755 1412508 1382793 1227801 1174802 1492466 1409998 1317103
20439 1317103 1328643 1653857 1544611 1407035 1404087 1484297 1420922 1397793 1118423 1333321
20429 1333321 1323200 1338468 1318993 1436421 1556503 1680547 1296292 1425906 1612967 1503023
20419 1503023 1556208 1670281 1562250 1585275 1573513 1674447 1540313 1733652 1738345 1747965 1527487
20408 1527487 1915142 1751940 1784237 1696471 1710873 1557335 1724784 1611366 1638429 1726015
20398 1726015 1686475 1817652 1807902 1946118 1741989 1735974 1587478 1642615 1507283 1694308
20388 1694308 1670954 1597680 1811288 1754172 1620730 1571012 1911713 1479402 1530313 1329615
20378 1329615 1367787 1376937 1444967 1432837 1559700 1469555 1444305 1542063 1510932 1357229 1473629
20367 1473629 1705677 1573501 1822280 1716947 1551913 1843135 1620418 1685794 1559156 1724495
20357 1724495 1541969 1627277 1553810 1621230 1994547 1713817 1664910 1588360 1849038 1889716
20347 1889716 1902686 1913546 2205646 2231004 1963099 2259666 2392925 2284048 2316465 2454621
20337 2454621 2565744 2601327 2585250 2403058 2661449 2461568 2418246 2406442 2575768 2408136
20327 2408136 2391593 2280515 2374746 2164442 2415019 2122963 2000129 2061391 1922355 2116808
20317 2116808 2027035 1892466 2175900 2209332 1896309 2107393 1973811 2197713 2130732 2005883
20307 2005883 2203147 2064152 2290900 2440845 2097816 2259224 2310595 2209099 2492883 2465031
20297 2465031 2863436 2902489 3283868 3634337 4034991 4273600 4692796 5155598 5556489 5870734
20287 5870734 6238303 6506735 6767668 6658710 7024977 7182848 6878830 6766161 6693156 6138921
20277 6138921 5776675 5700286 5187250 4839300 4220145 4105791 3805605 3398439 3185765 3001217
20267 3001217 3048729 2981438 2618334 2531631 2599635 2573687 2419441 2195790 2692132 2465564
20257 2465564 2394605 2325734 2271694 2394428 2319662 2271045 2079297 2103512 2191862 2387979 2050356
20246 2050356 2376387 1911858 2074273 2393602 2255879 2286262 2244708 2426980 2353067 2505596
20236 2505596 2697053 2667824 2684222 2851589 2915777 2890184 3241138 3230466 3566672 3673790
20226 3673790 3997695 4362549 5005622 5473952 6060030 6729564 7486955 7927195 8394256
20217 8394256 8714447 9316782 9536296 9719266 9940236 10295166 10193607 10224475 9795765 9555109
20207 9555109 8910467 8392994 7815539 7398441 6429480 6068372 5725933 5405520 5209805
20198 5209805 5028331 4707894 4723411 4867153 4859106 4998269 5173555 5506669 5810884 6462894
20188 6462894 6868098 7319300 8068273 8959868 10201847 11480339 13216867 14631921 16176826
20179 16176826 18570567 20319881 22165824 23991740 25282890 26488546 27444516 28277868
20171 28277868 28833318 29093569 29134615 28594380 27508099 26293768 24816107 23141241 21316717
20162 21316717 19128358 17201121 15832500 14114290 12367811 11088989 9971896 8937207
20154 8937207 8242666 7576680 7050917 6518613 6371724 5964172 5859175 5721834 5606689
20145 5606689 5694334 5773503 5840408 5995532 6039547 6117135 5957462 6335988 6029314 6337823
20135 6337823 6192789 6294340 6522045 6416123 6591297 6636233 6682386 6810911 6988186 6824293
20125 6824293 6726510 6650097 6478149 6314317 6415149 6215012 6140016 5956562 5619491 5372465
20115 5372465 4997817 4850444 4433363 4574174 4068316 3889148 3837789 3872991 3897226 3646810
20105 3646810 3906067 4029465 4259300 4399142 4801567 4980633 5544783 6061545 6764544
20096 6764544 7628040 8270517 9014701 9965558 10737441 11696148 12651102 13764690 14788863
20087 14788863 15718908 16214354 16859148 17059217 17062189 16777614 16892388 16295282 15874198 15397606
20077 15397606 14482346 13869878 12840639 12182409 11246034 10482332 9604372 8832764 8407664
20068 8407664 8013670 7783564 7257287 7356965 7282243 7427221 7922481 8057691 8688158 9377915
20058 9377915 10249229 11364520 12470840 13349490 14516038 15476587 16044985 16422587 17013512
20049 17013512 17269747 17171726 17276379 16831296 16472761 15775430 14874931 14075066 12731808
20040 12731808 11474114 10556793 9527161 8576366 7477418 6738708 5998243 5432557 4693574
20031 4693574 4360861 4293910 3859353 3460482 3212371 3210266 3215954 2785647 2536313 2638749
20021 2638749 2376742 2391901 2320278 1909482 1974243 2113175 2012392 1950829 1730363 1913410
20011 1913410 1920371 1934282 1944475 1598192 1769402 1785451 1772576 1680815 1854499 1643231 1511106
20000 1511106 1865298 1592235 1674018 1702012 1771962 1366611 1665664 1693364 1727324 1697807
19990 1697807 1653752 1618944 1857478 1731810 1696184 1728405 1613988 1707685 1549004 1584652
19980 1584652 1684572 1858591 1706579 1826301 1757905 1712428 1709236 1823843 1642074 1671481
19970 1671481 1892615 1682069 1989227 1837593 1829521 1770413 1993498 1712057 1916839 1661182
19960 1661182 1840727 1852888 1799869 1924609 1931191 2141383 1921556 2034974 1805712 1979528
19950 1979528 2260612 2023574 2157739 2044236 1982009 2135142 2048239 2152448 2007775 2082867
19940 2082867 2129956 2023501 2226500 2248093 1981300 2106287 2241320 2017159 1965955 2056779
19930 2056779 1928300 2127681 2086295 2112547 2003440 1923559 2148747 2007322 1927301 1950464
19920 1950464 1799536 1861730 1929056 1989103 2304055 2129342 2009730 2240513 2170406 2105299
19910 2105299 2086678 1911044 2051903 2059613 2101803 2072596 2253883 2142236 2365703 2188244
19900 2188244 2387511 2335775 2220588 2540938 2609741 2410781 2367568 2585887 2391451 2548202
19890 2548202 2658163 2544770 2760005 2775935 2762098 2868729 2865145 2813836 2851305 3064261
19880 3064261 2865306 3126506 3090170 3254914 3041557 3221337 3286902 3229024 3282703 3476695
19870 3476695 3485441 3686006 3764896 3773055 3800330 3998040 4256318 4379101 4558114 4514888 4930043
19859 4930043 5346656 5575470 6147015 6501214 7241384 8112082 8850232 9701512 10750027
19850 10750027 11305570 12157413 12411537 12936440 13482219 13776432 14433583 15118236 15973993
19841 15973993 17244595 18463879 19737057 21201779 22425978 23087353 23790384 23815480 23458729
19832 23458729 22518836 21378812 20132659 18582083 17362495 15985210 14860233 13885627
19824 13885627 12981351 12650018 12225474 12272985 12267239 12691976 12868583 12902330 12940402 12950296
19814 12950296 12985571 12943278 13190757 13262255 13401554 14243719 14899479 16103911 17014681 17905872
19804 17905872 18729251 18999473 19201399 18964713 18413217 17471005 16556463 14942495 13822506
19795 13822506 12571669 11264351 10055566 9064914 8248482 7738047 7056632 6369633 5939196
19786 5939196 5483323 5254655 4915431 4696607 4526087 3960400 3890452 3606676 3476919 3561088
19776 3561088 3494067 3171439 3105095 2899131 3015086 3165184 2624314 2726982 2786949 2801553
19766 2801553 2858760 2899256 2768618 2683239 2687505 3110032 2651686 2656509 2804237 2861849 2635303
19755 2635303 2668592 2834910 2700339 2852696 2560606 2605226 2464023 2848701 2611820 2599672
19745 2599672 2535503 2646853 2390496 2616922 2311397 2219522 2450510 2529152 2351363 2570111
19735 2570111 2356020 2293734 2392462 2148570 2222816 2293445 2187812 2212637 2477153 2157996
19725 2157996 2157809 2131441 2113610 2331095 2246022 2313463 2344702 2338278 2297405 2311356 2226960 2282398
19713 2282398 2311642 2117614 2089505 2248163 2313785 2176609 1928125 2167582 2019386 2063754
19703 2063754 2251497 2002945 1970936 1942886 2051487 1960894 2011191 2256525 1996776 1983920
19693 1983920 2067339 2163702 1716870 2111021 1978526 2016003 2036524 2013878 2108744 1846317
19683 1846317 1974822 2143079 2061473 1839990 1747500 1757908 1805333 1635401 1896737 1696073
19673 1696073 1924900 1849301 1932244 1915989 1938362 1722327 1806207 1921751 1979449 1904175 1941404
19662 1941404 1857138 1769241 1720823 1948494 1863890 1933350 1832024 1855149 1955567 1647523
19652 1647523 1867399 1905130 1682582 1799928 1732468 1780724 1693755 1830321 1945690 1758535
19642 1758535 1876825 1681350 1699105 1889353 1745040 1731930 1772452 1693278 1581325 1913708
19632 1913708 1923346 2065967 1696563 1713007 1620854 1870712 1739695 1840273 1861092 1838385
19622 1838385 1885466 1847532 1653555 1606882 1673354 1867703 1789171 1535541 1648167 1510096
19612 1510096 1696256 1762417 1629320 1754262 1665865 1770525 1460214 1379263 1741446 1546574
19602 1546574 1723205 1624093 1755304 1559841 1672171 1632089 1570447 1453374 1726807 1525895
19592 1525895 1469785 1727236 1507867 1461580 1572168 1607572 1488376 1568345 1698826 1819321
19582 1819321 1346455 1562877 1337233 1629792 1639546 1449169 1517070 1485323 1266927 1424082
19572 1424082 1522311 1285482 1501605 1451677 1245185 1506736 1707073 1627375 1387003 1422616
19562 1422616 1436152 1592657 1543754 1346310 1455190 1295785 1346035 1189124 1303232 1372044
19552 1372044 1186382 1339629 1426423 1354622 1281338 1500601 1371766 1481256 1212688 1399561
19542 1399561 1431915 1249047 1254518 1622895 1204783 1532778 1301315 1097801 1170362 1322504
19532 1322504 1419749 1381248 1265753 1295921 1487305 1448498 1549049 1450878 1605882 1533708
19522 1533708 1628835 1350807 1425636 1322996 1543814 1376637 1594823 1404758 1542849 1619985
19512 1619985 1199438 1247522 1223331 1366420 1486006 1252540 1276904 1381635 1350434 1352269
19502 1352269 1240196 1186029 1145797 1171947 1018083 1229513 1373563 1308805 1373232 1451953
19492 1451953 1187658 1050368 1251906 1423387 1276132 1307433 1221331 1381663 1222039 1101565
19482 1101565 1265445 1193766 1128654 1173796 1107779 1151910 980366 967933 1288101 1311745 935510
19471 935510 941111 962787 1399735 1089661 1017672 1062144 931216 1059339 1078658 1372785 1128612
19460 1128612 915029 878302 1140143 1064605 1007535 1059189 757638 907511 1029860 920869
19450 920869 1065512 930357 950100 1013450 826245 887668 853925 928689 713473 907370
19440 907370 1102135 909728 893225 733565 892660 811184 938411 629868 835847 1022744
19430 1022744 907185 966841 615866 807373 1131790 1046655 805541 780530 1013883 818694
19420 818694 990815 772119 903606 844621 845438 901020 815520 673969 877797 792880 1076396
19409 1076396 772538 799471 939554 770152 840063 828563 947520 723859 787401 703383
19399 703383 801517 894706 714286 867804 795557 837071 1002986 607425 1112825 992725
19389 992725 1027847 780112 879618 817749 773337 605076 932450 972520 781211 762658 798527
19378 798527 823979 1060368 566130 802158 1019007 816656 1018258 872673 568216 954515
19368 954515 831088 662629 600138 722732 779415 534858 763324 856244 759356 909868
19358 909868 779834 895526 855634 594713 744439 680405 1136518 841635 715192 822351
19348 822351 902527 887311 717501 764668 875884 814773 814257 578654 872052 780467 856035
19337 856035 958043 784837 933027 806279 751695 978279 886132 871342 1003900 981785
19327 981785 811483 863445 701450 737133 837065 910940 796510 678082 852765 892245
19317 892245 887755 877709 971657 1103241 941408 1100319 999237 611100 770142 926248
19307 926248 854445 980211 970867 981306 952169 1137902 1070084 812753 1016398 1079502 875511
19296 875511 856858 914381 1044773 869875 978751 720413 743006 872460 759721 797341
19286 797341 738820 573039 681910 639020 639801 768361 720762 689015 613987 611899 752311
19275 752311 752419 769516 725940 746491 840082 953504 937934 744471 544952 744590 777588
19264 777588 763897 608679 749673 1008705 771408 936796 640990 985348 775703 419583
19254 419583 628836 525574 532867 577018 656866 885092 796332 745236 565957 705316 1139891
19243 1139891 995986 1205810 1221476 1293022 1381861 1252018 1198132 1211857 1137416 1056979 1087398
19232 1087398 948339 573962 789106 943167 775460 669888 792544 966256 800489
19223 800489 1017572 726169 716044 582988 733687 556229 661194 531241 702934 704264
19213 704264 751251 823269 833287 843680 640555 666771 818870 501674 592109 803287 786829
19202 786829 529024 650287 475764 841145 754305 826239 564488 613350 596956 860745
19192 860745 675379 791990 569034 726379 595196 532050 554954 869874 620832 752031
19182 752031 793290 634181 604734 812644 669081 620924 705023 650497 981483 850871
19172 850871 857980 714883 841582 708266 808145 987769 846038 960181 944642 1233913
19162 1233913 1268488 1295326 1193046 1133063 1130345 1107924 1338689 1089448 942250 1141701
19152 1141701 1321926 1070986 793470 1040313 1329284 1161927 990346 1217946 1034640
19143 1034640 924978 1161981 1023178 1172593 1234802 1061557 975994 968791 894347 916493
19133 916493 1022062 1032001 1003627 971786 1134846 1048008 1043631 907632 986272 840354 1050746
19122 1050746 1112983 994042 1057110 1192496 1180773 1143891 922569 1081572 952942 800482
19112 800482 1039470 1151339 981332 1043776 997215 1256857 1190371 1265676 1065512 1426052
19102 1426052 1364514 1506673 1826121 1610756 1639508 2027088 2231666 2478844 2546147 2994150
19092 2994150 3542560 3898047 4466638 4273734 4430666 4529712 4418060 3978836 4051299 3739876
19082 3739876 3274998 3046252 2808852 2350327 2288004 2288070 2062027 2070103 1922741 2009179 1752935
19071 1752935 1951003 2267303 2623901 2885013 3294101 3710170 3954534 4096297 3953350
19062 3953350 3973029 3808379 3727682 3398852 3463953 3162098 3109584 3123148 2971568 3529007
19052 3529007 3677168 4274048 4565885 4811353 4979605 4888794 4878100 4486301 4073043 4111474
19042 4111474 3663462 3410531 2774922 2726656 2676815 2268283 2439632 2030730 2291802 2241952
19032 2241952 2440978 2598539 2772705 3116411 3651418 3990435 4356699 4750429 4465898
19023 4465898 4340956 4007553 3957154 3494407 3334040 3054641 2667083 2326533 2234238 2063438
19013 2063438 1888910 1911859 2057612 2065756 2040787 2104757 2250592 2608295 3084929 3312946
19003 3312946 3848174 4190415 4360019 4387766 4395606 4279115 4450933 4525916 4384031 4086498
18993 4086498 4017448 4073172 4695778 4868419 5369417 6156993 6872102 7673790 8558982 9278648
18983 9278648 10439553 11501145 12946008 14088007 16078854 17379351 18996269 19863588
18975 19863588 20241403 20005181 19789074 18257222 17107511 15470880 13653153 11949467
18967 11949467 10629908 9237898 7850088 6701815 6158371 5107891 4579772 4094909
18959 4094909 3543750 3250490 3055390 2971844 2605183 2321656 2495924 2063792 1996723 1891367
18949 1891367 1660275 1716284 1778097 1541927 1782735 1698158 1581994 1754644 1886170 1640619
18939 1640619 1817825 1691298 1652528 1886774 2069647 2068817 2041698 2068671 2092448 2136217 2115997
18928 2115997 2660868 2657894 3007540 3055632 3264363 3862220 4449242 4992557 5904759 7181431
18918 7181431 8413777 9938515 11563512 13375468 15220128 16728018 17375191 17963006
18910 17963006 17681575 17012717 16138316 14638134 13424732 11791630 10290122 8686623
18902 8686623 7394465 6577766 5320464 4789824 4050479 3479441 3115438 2765079 2548785
18893 2548785 2452776 2074584 1909891 1801287 1241270 1467345 1527340 1233827 1419954 1202353
18883 1202353 1135062 1226086 1091229 917737 1182974 722441 1029216 907893 929139 917278
18873 917278 924185 682087 937857 745225 881091 713566 810223 801301 757322 901486 938206
18862 938206 790972 730510 556620 776180 454353 832029 833212 868211 536465 816034
18852 816034 905029 992526 701425 789841 814261 733120 753887 717650 852093 548957 600484
18841 600484 697234 663831 782989 549351 795845 914815 754840 526188 695906 475473
18831 475473 818858 679108 553393 693340 808354 670007 704429 726180 849206 513639
18821 513639 596238 793425 578991 771939 621702 694208 637272 512290 771054 714810
18811 714810 726543 591445 701409 480646 755444 676245 570119 464633 680216 760526
18801 760526 669791 585721 578251 728396 731674 763732 711728 837369 872744 765325 754465
18790 754465 768018 654750 825145 816835 879551 837153 775817 678396 829435 694150 723192
18779 723192 855038 954191 818054 701228 697790 727841 760790 681716 549375 771490 879835
18768 879835 690656 666088 637766 803528 870433 611343 645862 442173 452384 566731
18758 566731 753715 718035 717813 513156 613223 486973 514263 334566 528609 652302
18748 652302 692190 842006 549832 517040 493271 350455 653804 799425 546090 679974
18738 679974 665903 655159 642415 573033 618325 463789 676971 675131 817956 752384 519556
18727 519556 653858 511221 582679 688607 636293 747240 416762 783515 681408 819062
18717 819062 622344 900758 719284 902031 841448 662595 549575 395006 606309 686055
18707 686055 506479 740616 837495 797520 658397 666337 781600 586231 539223 471920 819134
18696 819134 558661 633431 492058 846495 609865 694241 528424 597496 473062 723214
18686 723214 719791 621438 827114 696461 547466 749369 582229 700624 660347 694045
18676 694045 410268 453696 636767 667700 598268 642582 790015 750932 605170 462157
18666 462157 517135 491889 499949 625615 654243 584820 527224 583482 586704 731789 532475
18655 532475 978448 497415 616791 693104 723212 667104 769643 674914 742285 705422 841121
18644 841121 527937 659312 796814 659182 504764 620058 577619 401583 699798 519634
18634 519634 685925 455270 616938 593966 449866 743431 518249 611659 705522 723267
18624 723267 507357 351621 624906 485048 425627 394747 571157 588628 566430 418398
18614 418398 459519 237750 654863 638086 671470 636137 698310 627506 733260 489718 736268
18603 736268 662277 640260 698369 519382 579173 739845 617525 646135 697677 722296 683622
18592 683622 864593 479724 614246 614154 906479 649407 903812 686311 591609 893281
18582 893281 886157 957995 737127 697396 691236 582077 843476 643747 794172 867298 747430
18571 747430 643377 544321 606708 530823 706338 952185 661133 703400 711668 740222 592442
18560 592442 682663 786733 845072 488307 608103 645930 501889 555935 398847 497825
18550 497825 526308 388628 393486 611958 535637 521971 629944 482721 677628 599489 502355
18539 502355 737370 719580 438950 561477 532615 439335 292550 514948 462172 625478
18529 625478 704146 622484 681446 695574 628656 512105 665265 434850 355621 638431 506747
18518 506747 570720 577241 672191 331187 420967 405057 417563 444279 638489 435219 263774
18507 263774 448760 503384 575490 484414 497213 426020 473105 472664 654619 587516 453707
18496 453707 523550 621844 617979 486784 694898 440551 472871 746565 501752 724104
18486 724104 596789 585929 538197 472993 578599 502122 678938 339187 708022 348536
18475 494013 704731 540915 886707 448714 555371 675738 536561 597576 595247 542282
18465 542282 621373 665941 708445 749884 524756 688247 517036 695537 731674 896817
18455 896817 513127 780372 739285 366309 386643 662577 744853 858993 708097 255743
18444 710455 728387 806088 920887 745271 669726 709850 624423 641477 786727 591053 775192
18433 775192 336163 656752 655458 545712 439045 764256 727239 465012 731868 662661
18423 662661 755763 589623 588954 668697 754298 691089 568026 628423 778706 774318 659092
18412 659092 479314 703967 758348 407738 627246 536235 482988 794049 342352 579942
18402 579942 478189 600695 536285 510016 395277 620388 591964 485799 507783 155257
18391 574633 426250 548769 710416 633146 658569 214797 471352 281942 618000 150707
18380 615387 576186 422493 468431 500080 420553 528907 747610 735386 312903 375941 554398
18369 554398 598403 306812 522232 530358 442952 517732 491833 597570 503603 292759 694998
18358 694998 686604 665567 624693 676873 457295 576053 615646 417740 577729 565904 674800
18347 674800 621659 554259 577876 393994 398930 588730 737114 663819 424911 463896 626298
18336 626298 633472 824664 599671 497010 638802 516420 589194 646607 700068 530752
18326 530752 552691 320031 465409 554918 543459 619815 657450 437105 523842 550086 592889
18315 592889 580801 632140 497276 612081 447965 685067 654284 590582 698682 663077
18305 663077 1046698 780866 472405 765890 695148 738526 688727 747701 617338 759001
18295 759001 734228 548826 742358 642899 575770 741931 461470 571890 295040 424722
18285 424722 357103 489613 708418 399577 474699 424581 506883 552908 483571 486716 508288
18274 508288 586730 621187 555825 382322 386365 529583 269661 429002 533410 612959 539094
18263 539094 594809 470857 467066 577595 355059 665325 423699 591695 713714 713583 724810
18252 724810 496171 622193 473159 664614 284875 546039 495949 545918 757203 595243
18242 595243 439637 601259 637504 428053 398489 590828 437355 539536 642569 657111
18232 657111 492255 361606 410558 382935 534552 521257 401388 614248 551188 530025
18222 530025 635046 389361 592311 708164 420620 599729 493584 282883 279590 569027
18212 569027 461770 708422 441102 586222 550808 497482 570068 582567 626067 538531 407752
18201 407752 569691 560980 541663 848734 523177 507549 488817 625245 774810 728022 704647
18190 704647 535064 658581 718423 539240 610445 672065 678720 405866 461520 323399 385181
18179 385181 401861 653553 497224 606965 420395 609287 592569 643204 515681 515689 527153
18168 527153 498804 545965 540410 675355 593900 641840 777501 538031 719056 514164 526583
18157 526583 623389 725723 553621 471555 640993 659185 502906 468063 524351 633027
18147 633027 605160 645059 745342 361319 507838 651896 623945 286045 456177 557947
18137 557947 502844 348626 391139 255241 550521 650376 753837 513071 676540 578936
18127 578936 554957 277202 452168 442942 362265 557033 557657 475744 604701 676775 607296
18116 607296 665158 679167 419559 479045 524173 549316 391734 603426 567595 612411 571101
18105 571101 569626 611740 625675 675588 521983 646204 488057 364990 494392 360761
18095 360761 358101 655345 435870 411104 502294 570472 555340 392176 579967 430176 453934
18084 453934 440345 493674 739921 641275 518503 679068 453109 742042 454755 379162
18074 379162 519249 465085 397474 431856 293439 410470 684034 534027 530743 487989 453062
18063 453062 270753 412116 500957 396758 381568 330203 711182 294586 495709 523816
18053 523816 476399 393898 540438 656037 322163 470935 569846 464818 257489 361301
18043 361301 266547 350479 441574 434354 509841 452267 416738 442705 500895 308775 538151
18032 538151 377519 450663 596351 630437 362241 617649 541441 588927 368797 310331
18022 310331 438172 454353 428461 426982 475328 362130 457928 518978 563743 479182 385112
18011 385112 525460 396987 676089 592627 444730 721076 719037 592263 252218 674604
18001 674604 393996 467120 483145 471005 380976 569217 522587 646424 305008 441274
17991 441274 387549 495566 392187 363768 352862 719700 510539 353867 292151 740929
17981 740929 677389 308919 642287 622454 608190 548502 363609 619187 515063 144156
17970 610920 309962 499329 522327 364520 439733 561753 423934 549535 627470 568317
17960 568317 544956 474134 433503 688023 736740 574409 471517 494374 334618 460589
17950 460589 546306 477557 647566 595297 693430 475545 590704 392365 341968 509659
17940 509659 459595 614703 655331 410368 458606 518790 367183 598951 850600 727828
17930 727828 663617 488792 431747 650175 432585 606651 485480 448173 493174 601111
17920 601111 509426 694967 499122 696755 643521 687477 687140 469275 558462 763621 599316
17909 599316 721009 515725 766172 542333 498647 610268 484821 389425 420613 556901
17899 556901 548334 519153 639442 730086 536520 816154 628276 546528 575752 604121 590854
17888 590854 400851 722546 755966 824376 548586 728654 567676 600799 687823 629990
17878 629990 567521 657892 439449 635959 427667 575450 711107 758607 620827 704984
17868 704984 922769 849658 742102 675198 567530 706898 439940 659506 534991 577873
17858 577873 857434 756965 796448 587668 804384 758515 702344 694402 619634 560282 503324
17847 503324 623913 822322 684809 490886 708224 890425 750678 740175 566415 559933
17837 559933 770306 539653 760599 656533 512491 797293 633461 813697 743969 562925
17827 562925 640622 757800 574995 835547 568044 829732 818224 726228 926423 1046927
17817 1046927 942118 860150 766355 1103482 651773 888238 1071528 1171152 789143 904793
17807 904793 693605 747095 668345 807452 788647 815496 959561 979456 846617 1087147
17797 1087147 1090771 834471 887116 863121 479358 826469 689905 715339 462495 558450
17787 558450 740097 516621 707452 459304 590792 849332 483275 741137 557941 509516
17777 509516 666181 545595 709664 666132 738462 554825 570451 592970 655138 601818 608578
17766 608578 778865 470421 679133 805473 777512 399612 917193 830651 770291 647196
17756 647196 710677 598870 465870 531509 521888 536262 660877 380421 493163 706621
17746 706621 785589 737922 671762 752550 491537 843054 735009 631637 691042 453501
17736 453501 659302 543801 861101 918173 653933 715311 697052 655921 694075 462330
17726 462330 887464 636300 693173 724167 436034 631859 563220 636847 602888 354643
17716 354643 664019 752851 464994 790456 624735 756627 570180 595251 605102 743963
17706 743963 908626 502644 512890 657383 683020 554467 474152 497858 503501 517660 716434
17695 716434 956477 549778 411658 517518 630473 708922 802402 529549 601162 705578
17685 705578 676657 909894 696835 768471 510525 736309 608373 769536 538521 663210
17675 663210 724064 639472 777980 760699 709276 687192 551190 644945 813954 652451 799757
17664 799757 483476 801560 741601 505925 859384 919629 883705 626579 591284 674994
17654 674994 799687 720739 641601 648666 606296 921318 885609 865428 851031 751741 834868
17643 834868 731654 838027 1002441 881068 623993 1008501 885942 715196 783534 716214
17633 716214 863787 880975 1003893 1036319 1002732 974025 1065377 945991 1245831 874142
17623 874142 1050226 1090903 972988 1131461 964936 1316991 1168616 987616 1166413 970974
17613 970974 1077396 1155894 1170789 1166404 1236759 1092845 1134102 1110639 1277284 1137425 1001804
17602 1001804 1220623 1017883 1071334 836631 1217052 1137473 1559195 1070731 1252932 1264090
17592 1264090 1086253 1144971 1149361 965162 1216835 1065483 1198056 1222648 1406805 1159810
17582 1159810 1197011 1494217 1099524 1197205 1301379 1131417 1287398 1256877 1189252 1263236
17572 1263236 1355869 1188192 1360236 1123561 1157934 1190617 1275936 1111497 1188589 1084956
17562 1084956 1063081 1274232 1210545 1234498 1065212 1120412 1232518 1098295 1199624 1079067
17552 1079067 1128888 1040510 1059345 1026380 1242489 1103332 964223 1245998 1254464 1121072
17542 1121072 1325319 1437029 1372561 1249787 1268833 1329727 1353087 1398316 1219141 1270871
17532 1270871 1218294 1199396 1003634 1349452 1390965 1367669 1194736 1512005 1540710 1390121
17522 1390121 1234700 1363652 1406000 1412616 1595942 1558229 1497388 1656681 1785019 1875176
17512 1875176 1806942 2180099 2212484 2377097 2320235 2303967 2323578 2277570 2409357 2210861
17502 2210861 2425824 2338163 2615908 2877099 2888860 2948617 3248459 3726757 4068138 4448582
17492 4448582 4921396 5810362 6805808 8315071 11004142 14924950 20830356 29478011 40040216
17483 40040216 51325365 61084215 67193329 69737249 68840353 65629567 60311274 54863045
17475 54863045 49022636 43784541 38955242 35260316 35043401 38673171 45933244 55491121
17467 55491121 64049682 70578018 73361401 72361586 68441907 62701861 56157483 49202301
17459 49202301 41705785 34272281 26754960 20291152 15168797 12199640 10106475 8521479
17451 8521479 7225182 6216427 5782034 5333493 4746728 4341135 4421410 4182302 3878827
17442 3878827 3979481 3754185 3675736 3228011 3299086 2956929 3164748 2953162 3000701 2981382
17432 2981382 3040389 3241834 3411868 3337392 3244079 3212702 2823374 2752394 2851221 2629141
17422 2629141 2709530 2453329 2269605 2395399 2426302 2340308 2087145 2491979 2428251 2287548
17412 2287548 2151284 2354858 2072152 2224927 2362605 2408697 2413294 2280050 2964797 2505764
17402 2505764 3002543 2948117 3286786 3337049 3410276 3589326 3727990 4099868 4154047 4436333
17392 4436333 4892869 5292397 5671652 6047724 6472108 6764183 6927748 7177947 6946684
17383 6946684 7014132 6759170 6509163 6498156 6203116 6193801 6389918 6281933 6229819 6199784
17373 6199784 6651832 6957604 7190697 7373936 7689580 8037597 8507079 8549182 8502351 8591501
17363 8591501 8372732 8570426 8414128 8383054 8369523 8599331 8458691 8423487 8552354 8939198
17353 8939198 9198866 9794515 10287627 10564248 11359744 12105942 12297030 13084707 13439486
17344 13439486 13774614 13851808 14025747 13941394 13763545 13338075 12857722 12664125 12622544 12471395
17334 12471395 12594704 12401907 12692497 12981429 13280066 13602909 14096266 14286088 14912273
17325 14912273 15410352 15540131 15916252 16047726 16239679 15778612 15515270 15641253 15267919
17316 15267919 15048965 14713359 14500410 14181527 14049216 13907868 13841053 14062545 14248790
17307 14248790 14488308 14579441 14735495 15322982 15314007 15653782 15385599 15511793 15208325 15042813
17297 15042813 14941560 14765620 14474020 14709021 14248044 14261823 13979049 13795749 14011766
17288 14011766 13980163 13648983 13501857 13195240 12990625 12759353 12175797 11528007 11068395
17279 11068395 10298605 9762969 9125107 8436873 7961895 7437823 7095492 6715122 6773348
17270 6773348 6165211 6012638 6081546 5566450 5611049 5422745 5190054 5208487 5051669 5052575
17260 5052575 4865031 4796884 4702880 4465828 4384337 4318864 4145558 4063527 4018167 3973493 4082620
17249 4082620 3751794 4101412 4026364 3896831 3899294 3856431 3615058 3497467 3669529 3378101
17239 3378101 3390034 3470551 3360201 3076759 3174448 3018073 2789251 2884002 2757665 2980811
17229 2980811 3078858 2908346 2899504 3165952 3059615 3006720 3383791 3319133 3139082 3138000 3099600
17218 3099600 3118171 3180785 3208412 2773948 3134255 3080766 2957978 2925923 2785634 3078008
17208 3078008 2882817 2880082 2942037 3047529 2822503 2983296 2832501 2846739 2748420 2808666
17198 2808666 2511031 2780889 2439014 2294326 2323628 2159798 2176486 2313101 2014691 2096089
17188 2096089 2185272 2299144 1951703 2240977 2223102 1933938 1858698 1893773 2225790 2070399
17178 2070399 2168161 2160989 1856765 2277145 2117148 1931191 2019942 2348628 2330522 2250074
17168 2250074 2327615 2269801 2223876 2446032 2172351 2316800 2456836 2396736 2686821 2605820
17158 2605820 2297525 2680010 2778670 2527123 2491080 2408811 2470858 2502025 2504056 2395456 2375227
17147 2375227 2351241 2362679 2493489 2603694 2527476 2752847 2335663 2502111 2655509 2677303
17137 2677303 2849079 2431101 2770336 2577511 2536138 2437770 2519646 2500710 2502084 2480845 2352832
17126 2352832 2763711 2500340 2744497 2512166 2657265 2474492 2630255 2440290 2423009 2386854
17116 2386854 2534678 2299939 2297980 2066529 2283498 1998775 2161507 2289960 2277649 2267678
17106 2267678 2287880 2211841 2302165 2150009 2281258 2014851 2031001 1806025 2049476 1710681
17096 1710681 1836219 1846286 1680217 1604638 1481312 1384024 1382367 1141202 1254066 1314013
17086 1314013 1203964 1142201 1228793 1184023 1161281 1278844 999832 1191370 843054 1211681
17076 1211681 1372454 1017100 1175587 984855 1222858 1266137 1128202 1114310 1292294 1083006
17066 1083006 980045 1174336 1241808 1268789 1259142 1334327 1359729 1375301 1519653 1605738 1543642
17055 1543642 1825892 1727145 1798870 1903510 1967393 1978353 2152600 2112771 2140802 2135628 2099427
17044 2099427 2262947 2261900 2325455 2568557 2742509 2925539 3034845 2634376 2592461 2580412
17034 2580412 2495822 2151798 2468230 2021911 2197230 1870235 1958897 1638201 1592259 1478911
17024 1478911 1533829 1488090 1472132 1561442 1390207 1139355 1380285 1298174 1244824 1018093
17014 1018093 1453392 1298483 1189060 1064050 980669 1232640 1315961 839257 1051989 1123211
17004 1123211 1213024 1062075 952345 1260258 997423 1187156 1385833 1199654 950117 1187042
16994 1187042 1120701 1176713 1194674 1145470 1200312 1041878 1188652 1159650 1130513 1178611 1212599
16983 1212599 1225517 1063750 901802 1342850 1155577 1122652 1243870 1372637 1338279 1386204
16973 1386204 1355717 1270947 1524480 1597246 1782374 1860326 1667018 2019812 2152730 2010411
16963 2010411 2330704 2387827 2451646 2383527 2603133 2670852 2486599 2634711 2714800 2730068
16953 2730068 2369028 2387728 2471758 2501770 2409056 2108411 2174886 2193106 1857021 1777116 1766571
16942 1766571 1713197 1758097 1678456 1536378 1666431 1034639 1397956 1275829 1135950 1296902
16932 1296902 1058358 1249790 1141128 1096429 1009716 1152542 1141759 1066856 1036501 980309
16922 980309 922929 1050855 972652 900801 832223 813234 834964 909207 882227 835740 1151283
16911 1151283 818594 824694 815386 965854 1016443 1039418 853391 729397 794944 858094 1049150
16900 1049150 676287 915241 830976 724373 956787 870404 1050297 729375 534269 680240
16890 680240 570235 921721 760183 683184 641438 547494 627638 623862 749207 1021330 831345
16879 831345 669060 645236 601608 750341 683614 875717 849202 957056 1139110 710197
16869 710197 1054225 817201 851240 1013734 802753 678654 701943 804537 1002854 884985
16859 884985 810800 708475 841277 917175 970067 561591 836037 1041080 726356 1040901
16849 1040901 715838 612860 798910 1001161 812839 594999 770421 648262 869790
16840 869790 963703 937455 772057 1086077 883772 847288 1010772 950464 1062316 923122
16830 923122 1004524 734643 1039337 1123662 1016197 1249721 1086310 1262561 1161316 1260511
16820 1260511 1490833 1631968 1504656 1573741 1429496 1776185 1517538 1931081 1544895 1468027
16810 1468027 1604375 1619649 1545642 1584134 1612597 1714146 1561230 1312585 1649647 1555113
16800 1555113 1243559 1509387 1623260 1436936 1548500 1287019 1324909 1348491 963634 1303605
16790 1303605 890014 1078430 926857 930600 759501 902541 684183 775994 986471 709011
16780 709011 658403 803685 779476 593116 835377 638445 720941 631988 790924 745368
16770 745368 861020 845207 673877 863314 733846 754484 699478 960621 792243 883567
16760 883567 854922 787355 630556 553545 601878 655728 845637 699345 524798 651805
16750 651805 916534 704308 691501 799934 685450 543487 668277 960713 762911 662011
16740 662011 596162 856744 822781 829426 947676 760300 816577 782191 826602 500604 564014
16729 564014 804238 898786 829507 739499 865681 918522 836767 920096 885820 1148194 1087012
16718 1087012 998095 767644 1123463 897847 942655 1049036 961729 1152528 1184760 1273375
16708 1273375 1221661 1239977 1346126 1565530 1817213 1842838 1701070 1758245 1583628 1658170
16698 1658170 1548167 1567182 1681675 1700961 1576186 1551711 1439334 1839555 1759054 1595285
16688 1595285 1645981 1638414 1738289 1671778 1412829 1458615 1359079 1326140 1352576 1167746 1265982
16677 1265982 1214973 1220887 1202578 1146830 1313238 1143883 1159370 1209869 1656161 1921239 1515538
16666 1515538 1686665 1755188 1756798 1538643 1709023 1737242 1705323 1372788 1587451 1572995
16656 1572995 1722396 1851219 1421847 1630088 1821610 1535326 1375482 1217311 1095715
16647 1095715 969816 817730 801014 746933 659412 687689 651387 412370 606361 860150
16637 860150 547243 669067 618261 738417 934679 647923 535338 786133 639207 625364
16627 625364 610822 839456 683072 740553 473011 408117 780673 733055 842373 673883
16617 673883 552836 587303 777082 611763 852218 584982 721678 799364 560485 672020
16607 672020 834812 661414 663763 710718 1116417 965639 378290 942790 1137334 890220
16597 890220 973722 904697 847608 854851 911872 764471 879643 893797 839735 853393 927131
16586 927131 1030775 932728 1062112 951344 1049703 846794 1082747 657031 1057024 914973
16576 914973 896989 1010996 1009065 660404 1027833 826003 811318 744161 570472 835250
16566 835250 600756 749751 726115 806011 772668 696670 806769 776293 878988 813201 707657
16555 707657 852731 882525 673412 706253 681736 713896 671313 660600 849706 619092 578795
16544 578795 458208 841299 691577 624718 557246 685547 526144 593532 633462 484203
16534 484203 533177 587331 453585 748640 804091 507191 808759 443443 686301 419820
16524 419820 768345 680774 379659 568182 591343 540434 668062 601976 655551 591942 743076
16513 743076 640767 671125 669748 834322 602072 873716 623906 603311 1134814 876177
16503 876177 711678 724570 677597 654595 701672 677131 716493 589877 349887 400907 737670
16492 737670 226368 269858 335348 383793 419681 618702 679465 795955 855287 1077815 1111231
16481 1111231 1244711 1396547 1289455 1310453 1393748 1348570 1209573 1335263 1251594 1338295
16471 1338295 1489456 1458585 1395191 1629145 1678350 1658692 1624252 1659698 1563537 1607766 1521710
16460 1521710 1606904 1619921 1680980 1722233 1556051 1723258 1891718 2007122 2117294 2301110
16450 2301110 2420943 2760087 2577762 2873783 2847816 2847047 3225442 3331812 3355609 3773920
16440 3773920 3925601 4217856 4403692 4285456 4753468 4983001 5300545 5707264 5930061
16431 5930061 6382110 6745210 7441203 8111927 8773265 10446544 11780655 13414166 15398678
16422 15398678 17169804 18992514 21177934 23537858 26254060 29056256 32173054 36122590
16414 36122590 40438481 45049690 50332292 56154961 61633915 65349141 68158726 70215292
16406 70215292 71840942 73551691 75098506 76387845 75869553 74201819 71427725 68157233
16398 68157233 63835614 59874188 55604822 51925219 50363272 52731357 61239555 74505188
16390 74505188 85790327 90491657 89117089 84867488 79942464 75566900 71035792 64800397
16382 64800397 56145798 45541778 31372422 11825845 -14755386 -46365687 -74849270
16375 -74849270 -94080072 -100898218 -94416615 -76151840 -48498306 -14899707 20456434
16367 54244173 84193482 108377520 126046660 137809693 144874496 148542064 148191789 143806515
16359 143806515 135756326 126038564 115641748 105997748 97010883 88106712 79205825 70033338
16351 70033338 61829371 54712676 48385331 42330305 36775520 31724507 26998446 23295776
16343 23295776 19835988 16869546 14297797 12393764 10225792 8813702 7655553 6551160
16335 6551160 5517945 4982529 4223178 3802632 3343872 3106093 2813852 2670496 2516357
16326 2516357 2120861 2032749 2069768 2128907 2347174 2051327 1994982 2118803 2189537 2229542
16316 2229542 2330484 2289846 2310952 2256925 2206636 2061476 1921343 2032792 1852131 1523372
16306 1523372 1471279 1341056 1258944 1294339 1007234 888913 1123437 920797 1296500 1224507
16296 1224507 1157476 1104332 1044866 974177 839202 882233 931215 787230 896919 785209
16286 785209 640615 855774 608964 744209 836433 1150570 1088531 1179562 1205343 1277465
16276 1277465 1267591 1459443 1490319 1431393 1357454 1528907 1423089 1456576 1341764 1359787 1368693
16265 1368693 1336697 1288392 1200173 1196046 1157810 1216334 1095426 1324784 1199518 1408257 1096190
16254 1096190 1156427 1104661 1206428 1321071 1071872 1354356 1532997 1333735 1542407 1402680
16244 1402680 1418278 1261053 1514687 1746100 1417956 1631747 1532402 1429167 1464180 1450518
16234 1450518 1316788 1482319 1272733 1407794 1438146 1124761 1264563 1298183 1190875 1174418
16224 1174418 1161289 954832 1180812 971803 1075781 907111 902705 792993 887537 905939
16214 905939 732805 995944 625589 776874 822091 730799 585926 828741 751703 820795
16204 820795 727174 758665 798654 646134 522516 862639 793078 809801 621949 643723 723030
16193 723030 862685 868329 601245 992228 917395 624592 928617 822359 785891 1052258
16183 1052258 923146 1090521 1008884 1025352 1037084 946664 1095563 996423 1134738 1122015
16173 1122015 1021889 1051777 1037267 1261440 1096832 1230348 1120053 1069173 976732 999652
16163 999652 986900 986922 1135601 971741 1041042 1021176 1077688 981606 751680 776141 1150010
16152 1150010 864506 782302 828714 762662 993273 941669 1055091 1180645 911536 1140309
16142 1140309 900188 1053312 982036 999245 981558 974951 1021651 812366 982070 702628
16132 702628 1313214 1190437 1078681 1307596 1038478 1071314 1116602 1031733 968564 1099043
16122 1099043 1112645 1142337 1205951 957238 1069233 912146 995036 1020990 971438 1087525
16112 1087525 821772 763106 934521 778601 1105131 887592 1110836 1145912 1020360 983610
16102 983610 1180898 844821 943552 1148501 1096488 1248404 1050011 1084286 851433 1253344
16092 1253344 1310398 1076017 1150165 1181193 1160984 1185782 1175001 1168591 1030526 1208041 1164035
16081 1164035 1387282 1381222 892524 1260502 1183404 1056034 1232283 1260304 1331346 1352510
16071 1352510 1521816 1433572 1299346 1547884 1383387 1439188 1420912 1489117 1362858 1479323
16061 1479323 1384803 1555800 1462742 1546456 1596078 1325260 1446168 1729445 1444071 1644052
16051 1644052 1570564 1640200 1688578 1964348 1486688 1575125 1977805 1511758 1573638 1604222
16041 1604222 1878780 1681146 1915743 1904310 1652173 1681788 1842713 1878509 1720245 1921062
16031 1921062 1841242 2063279 1772242 1947832 1980694 1861480 1945541 1699499 1946059 2191054
16021 2191054 2065084 2119588 2190364 2180958 2260713 2192728 2157463 2028926 2249381 2095864 2112302
16010 2112302 2211859 2020942 2081520 2323333 2268509 2011876 2085407 2390192 2046617 2081949
16000 2081949 2158144 2103761 2003814 2341342 2268196 2066001 2105579 2184434 2084581 2045306 2278806
15989 2278806 2098756 2076775 2182042 2110510 2075829 2382128 2226849 2130360 2130921 2060735 2211741
15978 2211741 2069912 2365202 2331601 2304873 2237888 2087743 2217930 2225985 2163674 2336457
15968 2336457 2080011 2098331 2224234 2067169 2008838 2123966 2000003 2129715 2269585 2061121
15958 2061121 2099109 1959990 2104671 2183479 2081566 2023190 2044486 2315015 2355362 2022628
15948 2022628 2406908 2266259 2207539 2467572 2251703 2498472 2338475 2450185 2372117 2378608
15938 2378608 2477995 2320906 2382667 2386401 2531512 2531083 2572917 2759848 2662161 2648820 2666654
15927 2666654 2933488 2922732 3235274 3122004 3256687 3812398 3407286 3927746 3873627 4182477
15917 4182477 4674731 5068978 5166733 6147575 6970926 7918986 9740359 12050363 15412448
15908 15412448 19632020 24850940 31567802 38595525 45272571 50990108 54598029 56066457
15900 56066457 55325814 52842774 49200305 44420944 39313533 33949675 28498792 23566586
15892 23566586 19290950 15878976 13076818 11196288 9350118 8097644 7157331 6331565
15884 6331565 5357900 4749605 4301620 3879517 3617724 3471023 3091977 3106699 2920886 2612474
15874 2612474 2803210 2611449 2819490 2547078 2629999 2781733 2430328 2300697 2382953 2615584
15864 2615584 2420111 2500399 2325364 2279999 2274713 2161945 2306911 2246133 2191742 2240802 2253505
15853 2253505 2321586 2193756 2251672 2007968 2180872 2248345 2368804 2166631 2196415 2307437
15843 2307437 2098662 2305509 2188451 2252073 2612338 2490842 2329172 2639189 2429608 2647326
15833 2647326 2346682 2704050 2573917 2384116 2383723 2502352 2410807 2327439 2488976 2297548
15823 2297548 2413184 2043104 2088129 2289905 2243266 2086949 2261163 2367133 2026121 2384698
15813 2384698 2231357 2279745 2296309 2494269 2256489 2406753 2597272 2245136 2662111 2743796
15803 2743796 2770393 2651458 2448019 2735037 2913346 2917964 2976798 2976961 3277368 3310035 3322865
15792 3322865 3261714 3433216 3380444 3428698 3422968 3508246 3610653 4077314 3862293 4107387
15782 4107387 4205856 4345124 4623653 4716725 4626380 4696923 4654999 4681969 4917203 4772290
15772 4772290 4817458 4792977 4707705 4879895 4996705 4880299 4852612 4985246 4740370 5005159
15762 5005159 5087272 5128941 5217878 5023801 4978809 5166758 5196491 5020566 4716006 5137403
15752 5137403 5091629 5319160 5126682 5263127 5530829 5375092 5832427 5879827 6191924 6386902
15742 6386902 6587308 6762073 6754127 7055812 7052658 7297155 7262533 7032952 7274478 7170785
15732 7170785 7512015 7726020 7476461 7964931 7792108 7810922 7510004 7419509 7159849 7081127
15722 7081127 7070692 6829938 6720844 6632808 6450331 6808092 6768708 6725323 6544994 6585357
15712 6585357 6445279 6392254 6386740 6354422 6463352 6702638 7030555 7121091 7397695 7515125
15702 7515125 7825231 7854033 8481730 8362233 8234746 8311073 8380444 8572199 8501078 8636362
15692 8636362 8481337 8441587 8340022 8249105 7978269 8163356 8195966 7909075 8126073 7963882
15682 7963882 8037985 7691414 7419044 7630681 7452211 7237689 7217957 7144309 6748360 6788165
15672 6788165 6663726 6626582 6692678 6403122 6593943 6790932 7007512 6986873 7425654 7608519
15662 7608519 7825812 7979115 8376386 9020313 9137964 9836534 10315365 11021251 11541210
15653 11541210 12110391 13051511 13350430 13801846 14573446 15006418 15546766 16197417 16788619
15644 16788619 17229515 18254035 18953729 19756951 20334152 21431729 22132283 22400045 22881512
15635 22881512 22959853 22853600 23039295 22705882 22625223 22547695 22323347 22517584 22310399 22306309
15625 22306309 22172899 21974745 21545080 20807217 20184300 19261647 18610085 17832570 16764434
15616 16764434 16023369 15421404 14720042 14508722 13824855 13369165 12950045 12547893 12108064
15607 12108064 11933368 11287876 11089190 10890675 10617843 10230303 10093898 10049976 9946519
15598 9946519 9895688 10364456 10769412 11728631 13171065 15518977 18884490 24944105 35400482
15589 35400482 48878339 60513280 68221980 72209386 71760133 67589450 61592409 55583772
15581 55583772 49480685 43610557 37130546 28511193 21495525 17310620 14839273 13453688
15573 13453688 12168570 11120190 10690375 10268702 9932924 9665285 9523887 9565984 9310926
15564 9310926 9339549 9644389 9926302 10385875 11672140 14175378 17406064 22801621 32261107
15555 32261107 47341689 64551802 79033851 87688201 91575737 89469189 82959546 75057245
15547 75057245 66850026 58839265 51060249 41502119 30200589 22001500 17651644 14819767
15539 14819767 12689144 11249842 10115023 9208801 8362145 7628240 7461471 6829266 6348587
15530 6348587 6137325 5685200 5542389 5304086 5203288 4947135 4617081 4700005 4396222 4453015
15520 4453015 4220779 4469404 4526129 4428985 4586228 4488604 4805841 4637584 4725277 4858927
15510 4858927 5035328 4894096 4994789 5023565 5018619 5046459 4681740 4723540 4874915 4719195
15500 4719195 4547699 4708395 4684448 4626419 4653088 4851373 4637232 4491833 4977137 4789044
15490 4789044 4976178 5064479 5101578 5266883 5344122 5355425 5711684 5873717 6020698 6050091
15480 6050091 6104972 6298694 6164740 6445513 6308759 6318861 6615755 7034997 7341059 8086267
15470 8086267 8526832 9330161 9714619 10002277 10048305 10093341 9849695 9783939 9546945 9430349
15460 9430349 9225713 9192977 9429587 9731747 10112296 10672283 11033445 11362288 11526063 11478877
15450 11478877 11367957 11009775 10848273 10588549 10246379 9899605 9857781 9902726 10247308 10141566
15440 10141566 10213590 10305590 10594041 10301936 10007701 9868083 9776450 9275683 9359377 8964144
15430 8964144 8564087 8501430 7915878 7846545 7508894 7574624 7102529 6994971 6763745 6460668
15420 6460668 6272277 5970520 5937481 5547688 5601867 5554084 5474578 5207230 5409278 5381002
15410 5381002 5197348 5365506 5211482 5049222 5379730 5382713 5694824 5795471 5534477 5816029
15400 5816029 6026605 5987011 6072515 6264305 5952988 6066468 6008993 6077011 6016742 6117586
15390 6117586 6129520 6214699 6017788 6361861 6225134 6454696 6247852 6534297 6244498 6509663
15380 6509663 6525437 6511670 6363795 6258197 6340670 6390937 6319747 6427489 6354758 6353818 6416263
15369 6416263 6370757 6616084 6772667 6980423 6852359 7148332 7174721 7313836 7281849 7491314
15359 7491314 7540665 7692325 7962283 7913962 8399967 8722787 9024691 9815502 10950363 12966298
15349 12966298 15367530 20004641 26604461 33838487 40140602 43867565 45738064 45470693
15341 45470693 43378465 40127368 37125990 33989984 30888438 27389273 23253229 20377923
15333 20377923 18582358 17370474 16549088 15680461 14849973 14498556 13775141 13600939 13523836
15324 13523836 13301031 13386006 13512497 13475432 13888775 14963949 16680703 19108349 23047463
15315 23047463 29715320 39569670 51987543 64425512 74166540 80018303 81097967 78714926
15307 78714926 73589012 66940496 60154036 53448237 45771237 37403435 29860120 24200588
15299 24200588 20629127 18015889 16793072 15547001 14589099 14546267 13653864 13676397 13290571
15290 13290571 13046158 12546636 12443281 12401042 12372650 12718013 13331453 14127563 15739876
15281 15739876 18622558 23096647 29493796 36218773 41514432 44462349 45197422 44162966
15273 44162966 41460362 38148847 34897126 31768760 28122760 23918124 20042257 16766509
15265 16766509 14881426 13507420 12358011 11567418 10938258 10363797 9941956 9933856 9694114
15256 9694114 9633481 9223415 9449087 9526581 9927699 9914076 9999061 10089228 10113915 9826842
15246 9826842 9875527 9855933 9433895 9235546 9244159 9050467 9239467 8903420 9071855 9445674
15236 9445674 9771456 10331174 11011145 11074224 11121306 11388744 11346826 11322339 10621781 10931703
15226 10931703 10399262 10259664 10045527 9838414 9513026 9384710 9664342 9789242 9876361
15217 9876361 10349237 10573161 10783589 10811654 11043422 10768743 10612927 10097122 9661504 9346917
15207 9346917 8948199 8330111 8134936 7687367 7491090 7191510 6831285 6961640 6649529
15198 6649529 6363127 6483791 6453019 6358623 6518095 6325248 6798083 6768079 6988966 6976561
15188 6976561 7003865 6971244 7091808 7140041 7321918 7180025 7535738 7792637 7640855 7817823
15178 7817823 8146815 7978503 8064671 8090180 8052993 8109616 8337946 8106224 8045474 7988550
15168 7988550 8105840 7830631 8012825 7951577 7991912 8158483 8339354 7972653 8265072 8547071
15158 8547071 8716143 8596563 8862906 9090234 8692746 8939175 8858191 8814542 8756276 8593177
15148 8593177 8737614 8522560 8535147 8575372 8778244 8775956 8641554 9001482 8797584 8870579
15138 8870579 8727347 9020959 8645205 9024414 8810867 8672750 8867101 8662080 8903478
15129 8903478 8589862 8657747 8725854 8836374 8783342 8605230 8350789 8343446 8145121 8204071
15119 8204071 8126711 8059221 8066048 7961367 7963643 7913629 7717676 7872859 7970410 8056851 7801720
15108 7801720 7970281 8381223 8093793 8455941 8436041 8816604 9057754 9333266 9497501 9618424
15098 9618424 10067964 10367649 10553656 11142762 11900914 12988763 14185275 15929032 18813821
15089 18813821 21789055 23917041 25682294 26731699 26657590 26194033 25337481 24439926 23518456
15080 23518456 23147658 22559815 22248121 22690595 24625238 27217693 29507515 31248348 32217957
15071 32217957 32357675 31792752 31196180 30523830 30343754 30689496 32340934 35426400 38946335
15062 38946335 42103594 44496897 46027933 46523618 46750639 47026613 48064923 48311579 48636724
15053 48636724 48346446 47448525 48135863 50129744 52907121 55423522 56706160 57040663 56878552
15044 56878552 56398873 55641276 55340967 54585556 53287531 50791128 47611828 44374395 42217113
15035 42217113 40223198 38967258 38135367 38321766 39764159 42799516 45986286 48282791
15027 48282791 49789203 50705028 50685691 50697250 51476076 53073305 55459255 59164681 63065640
15018 63065640 68195248 75176743 82923872 90184824 96702867 101932985 107055441 111334403
15010 111334403 114783843 117654144 119435333 120270910 119409464 117107012 114047929 110607790
15002 110607790 107268258 103162312 98826179 94821160 91093351 86970751 82907691 78693883
14994 78693883 74716852 70418743 66449563 62642330 59135277 56536537 55355767 54657794
14986 54657794 54545837 54108300 53861540 52867455 51482401 49770591 47714208 45559174 42783864
14977 42783864 39561778 36793960 34085654 31997400 30676806 29388835 28438864 27787833
14969 27787833 27613824 27544638 27864001 28166988 28687737 29507105 30172391 31162959 33124546
14960 33124546 35570908 39368126 45269619 53321378 64350541 79069600 98166931 121199984
14952 121199984 147441917 175834730 206455256 236365474 264533383 290610214 313810757
14945 313810757 329762064 335628571 331415614 318719926 301334660 282129108 263060798
14938 263060798 244220285 227115459 210327414 192412702 175207813 160821375 149345929
14931 149345929 139328362 129716693 119276078 108686949 99007511 91597799 86513102
14924 86513102 84302572 83011743 80455499 77182673 72805082 67220514 60683672 54392573
14916 54392573 48572876 43417127 37664144 32017731 26837640 22775597 19946357 18355909
14908 18355909 17430145 16798136 16452265 16559314 16909233 17277043 18324747 19405920 20834782
14899 20834782 22190502 24734920 28259015 32937517 38003967 42077878 44786682 46050694
14891 46050694 44782455 42631517 40068395 37276682 34158834 30776908 27202886 23750572
14883 23750572 21081299 19243346 18400781 17820069 17544853 17453990 17878149 18611027 19145351
14874 19145351 20120549 20326634 20695033 20725986 20567019 20434465 20545259 21146644 21398307
14865 21398307 21702535 22952561 24311641 26900044 31816710 38699894 47199566 56854087
14857 56854087 66105587 74860709 81563293 85309726 85345785 82764268 78336792 71999613
14849 71999613 64486892 56602711 49142111 42240667 36405872 30681816 26359230 24100815
14841 24100815 22156630 20589478 19577760 18633808 17730411 17021391 16632355 16095954 15978044
14832 15978044 15927187 15630583 16029666 16366420 16642265 17425731 18359393 19390983 21215888
14823 21215888 23403330 27225652 32833862 40080643 48032865 54794611 58944400 60379588
14815 60379588 59239722 55702839 51271330 46739948 41894158 36764547 31219472 25711721
14807 25711721 21254191 18259208 16533535 14980115 14302159 13633482 12689384 12170191 11851554
14798 11851554 11397776 10833526 10423174 10247700 9733360 9406744 9339558 9220715 9177186 9048404
14788 9048404 8793819 8787064 8838005 8858822 9138791 9477363 9534486 10063802 10899643 11751419
14778 11751419 12323940 12768712 12963293 12800733 12466024 11999917 11702350 11084545 10757726
14769 10757726 10256030 9809257 9052001 9177048 9214461 8817709 9219497 9435686 9426246 9442378
14759 9442378 10115210 10095913 10187511 10428201 10430908 10630152 10588563 10823696 11253208 11189755
14749 11189755 11061191 11275706 11433682 11432636 11618896 11889816 12097142 12770354 13499063 14407087
14739 14407087 15783644 17586165 19895064 23048432 28149408 34947115 44943654 59150938
14731 59150938 79948863 107559003 140016904 173313113 203660225 226153633 237307688
14724 237307688 237752904 229040308 213842207 194047677 171430312 146701541 121952722
14717 121952722 98987798 78683547 61477089 49271889 40843224 34956465 30038518
14710 30038518 26204357 22612853 20293505 18104476 15985658 14454172 13331558 12246717
14702 12246717 10829791 10190509 9107100 8908286 8448763 8222240 7980641 7931597 8037248
14693 8037248 7846453 7549722 7891169 7705231 7776195 7799483 7932838 7800028 7983356 8213735
14683 8213735 8341938 8509003 8843338 9244492 9344414 9905709 10937379 11721188 12127321
14674 12127321 12315105 12356780 11879592 11258895 10364083 9947682 9450985 9245036 8978207
14665 8978207 8598116 8768857 8533036 8488062 8119923 7740876 7533076 7391268 7110916 6953419
14655 6953419 6550286 6327463 6217176 6067878 5984603 6386599 6648446 6917793 7297216 7642710
14645 7642710 7594174 7622476 7763502 7924059 8206939 8273173 8708843 9403981 9742921 10445641
14635 10445641 10611588 10983323 10531351 9920091 9556213 8869459 8166418 7305238 6731004
14626 6731004 6193186 5593771 5121385 4968059 4470726 4485270 4421182 4315026 4390930 4315254
14616 4315254 4190180 4010714 4132203 3910463 4070605 3767820 3904821 3800068 3984383
14607 3984383 3825189 3994324 4069330 4120865 4719387 4904629 5663808 6181226 7009859 7644558
14597 7644558 8169890 8103283 8000199 8041613 7439360 6920314 6407718 5921034 5441113 5015561
14587 5015561 4620116 4312769 4111244 4139853 3995187 4175973 4257497 4253987 4172106 4010915
14577 4010915 4300715 4317575 4376957 4352527 4563080 4649762 4899698 4959964 5268982 6196479
14567 6196479 7055649 7699584 8583050 9912271 11539984 13849493 17665037 23654950 31909336
14558 31909336 39103972 44455188 47187746 47526819 45492842 42477351 38907306 35554765
14550 35554765 32197698 28934133 25234004 23089842 23762724 27395021 34069245 41790590
14542 41790590 48278505 52088722 53507931 52405934 48754734 44765839 40250665 36108680
14534 36108680 31485422 26728438 21914537 18589002 16782599 15572880 15004535 14473941
14526 14473941 14128175 13607470 13761114 14509989 15964169 18890818 23421432 29029806 33747838
14517 33747838 37282269 38824553 38770730 36868745 34734412 32630628 30690044 29046780
14509 29046780 27268979 24844014 24185118 25158553 28155787 33068002 37976226 41253182
14501 41253182 42892867 42927775 41286765 38513378 35490183 32458149 29587986 26288681
14493 26288681 22653077 18926050 16457969 14311587 12841416 11108267 9798464 8882494
14485 8882494 7977972 6921761 6260845 5557493 5079985 4486786 4392359 4313275 4223808 4183226
14475 4183226 4307510 4548358 4502272 5007641 5448467 6194497 6331092 6460692 6507580 6396099
14465 6396099 6268956 6243176 6333283 6543972 6627487 6889080 7614716 7781654 8166690 8111912
14455 8111912 8204099 7816111 7649654 7256134 6840552 6539061 6560682 6068134 6032345 6304346
14445 6304346 6157636 6605033 6772623 7057429 7099232 7314730 7425351 7691978 8068412 8182174
14435 8182174 8627736 9181404 10165941 11326705 13564345 16945095 21183198 26931947 32773383
14426 32773383 37701339 41475192 42928746 42740000 41295836 38924424 36379117 32833173
14418 32833173 29300621 25440932 21593655 18020686 15520688 13680555 12310382 11032414
14410 11032414 10090928 9351117 8770026 8580778 8247892 7851948 8019700 7669755 7894386
14401 7894386 7839139 8248781 8899901 9483187 10993724 13133113 16223021 20394456 26609594
14392 26609594 35204197 44829258 54092555 62135990 67275163 69183365 68018181 64946711
14384 64946711 60202420 54309349 48431119 41507722 34416720 28117842 22841549 18973094
14376 18973094 16236296 14179593 12533207 11152369 10306744 9724501 9292866 8764556 8470745
14367 8470745 8160054 7771739 7683535 7464645 7297488 7754835 8056138 8842334 9940011
14358 9940011 11530076 13486333 16463800 20206092 24123586 27947229 30962604 32964197
14350 32964197 33520638 33093397 31576654 29285129 27206521 24494389 21899638 19147327
14342 19147327 17157356 15883083 15093400 14925012 15868443 18454411 21777328 24563185
14334 24563185 26983169 29268742 31163590 33429744 36323567 40520887 46557864 54476497
14326 54476497 63723111 74055692 84211895 93385131 99750259 101941342 100688874 96546671
14318 96546671 90260041 82502931 73703375 64075227 53983612 45005079 37095881 31126013
14310 31126013 26084337 22178599 18973581 16402160 14053662 12479506 11117427 9581434
14302 9581434 8624115 7987664 7064530 6728426 6088124 5725191 5334291 5086730 4757987
14293 4757987 4541409 4250132 4128723 4129944 3594843 3762680 3369128 3271948 3616522 3342314
14283 3342314 3308171 3298601 3390091 3247729 3215982 3233976 3367307 3224766 3425288 3406841 3165354
14272 3165354 3298134 3225616 2937042 3001856 2708574 2774468 2873050 2739278 2871998 2484898
14262 2484898 2621928 2476424 2504865 2449191 2520541 2430206 2416451 2520654 2052148 2214371
14252 2214371 2319035 2318427 2137299 2078286 2191416 2139879 1966105 2204151 1996779 1962979
14242 1962979 1871090 1973716 2143602 2152631 2000019 2135070 2031588 1979952 2217684 1944733
14232 1944733 2061979 1938461 1902438 1841069 1933671 1970357 1872699 1649699 2003802 1684004
14222 1684004 1744950 1961474 2027952 2069759 2304345 2280364 2175856 2533415 2387011 2452701
14212 2452701 2480910 2635049 2805999 3324946 3593316 4252404 4231669 4240826 4182234 3746480
14202 3746480 3481383 3646157 3089812 2817320 2613535 2291473 2326884 2194264 2164819 2045783
14192 2045783 2089742 2103070 1972125 2196991 1980741 1998690 2138010 2164446 2181656 1936342
14182 1936342 2305109 1990453 2209054 2391343 2520729 2762722 2797210 2681102 2347678 2660600
14172 2660600 2346454 2468927 2229810 2174709 1933237 1948145 1795656 2252235 1903022 1824985
14162 1824985 1994072 1875653 2096189 2057376 2009509 2228194 2338813 2039375 2175638 2290704
14152 2290704 2289528 2163386 2251296 2308622 2220042 2400588 2420610 2559513 2822476 3464413
14142 3464413 3869089 4763669 5717725 6749639 7298002 7529640 8130262 7990967 8079642
14133 8079642 7548197 6991533 6431692 5749780 5142964 4415918 3853675 3451478 3410968 3287117
14123 3287117 3133367 3304877 3579054 3658529 3982991 3995706 3981639 3921428 3607279 3456911
14113 3456911 3491457 3197689 3013893 3015475 2687622 2763447 2365900 2466057 2509596 2565025
14103 2565025 2470715 2637621 2762943 3233842 3362597 3790336 4136487 4499418 4683512 4789642
14093 4789642 4562934 4568959 4426800 4168576 4324483 3905663 4051048 4282558 4886051 4899231
14083 4899231 5537552 5898516 5812422 5880688 5855787 5715411 5459108 5316550 5152971 4904544
14073 4904544 4964680 4939288 4858799 5100050 4991143 5186770 5812310 6164113 6477916 6859751
14063 6859751 7675105 8596593 9562748 10810766 12129490 14000461 15950542 18138512 21427929
14054 21427929 25299000 30645938 37786164 46415947 58150201 70488565 83330671 93762610
14046 93762610 101299542 104644768 104068365 100168085 94092320 86116824 76896712 66930258
14038 66930258 56687757 46711257 38300568 31699891 26576219 22274305 18988951 16394286
14030 16394286 14275440 12494616 10955137 9875260 8674545 7777758 7061012 6629237
14022 6629237 6111086 5561250 5430664 4737460 4682760 4341138 4162968 4027440 3825902 3656460
14012 3656460 3363529 3215552 3260403 3097489 3096005 3035073 2830402 2844784 2778388 2949922
14002 2949922 2484604 2632914 2652431 2559379 2442877 2700984 2577493 2590516 2711528 2634787
13992 2634787 3137904 3390186 3742121 4000549 4639548 5189767 6313219 7188518 8113045
13983 8113045 8916651 9361772 9625047 9595198 8933289 8485914 8125691 7212642 6735167 6014686
13973 6014686 5297683 4707000 4407894 4155518 4107636 3878917 3423361 3455558 3076616 3094637
13963 3094637 2679120 2716212 2479532 2596619 2231814 2090248 2110732 2065366 2152332 2220744
13953 2220744 2252220 2479615 2536329 2528614 2656535 2824436 2922598 3021509 3205732 3457375
13943 3457375 3986702 4829485 6389997 8002165 10247146 12800597 15588742 17753569
13935 17753569 19317051 19701741 19589632 19070225 17342861 15457422 13729742 11593674
13927 11593674 9720882 7698011 6407333 5102346 3966559 3538623 3143215 2881873
13919 2881873 2477147 2396072 2325529 2038760 2004552 2076604 1793673 1804726 1795983 1793543 1777793
13908 1777793 1630032 1697044 1747050 1252691 1713226 1227957 1504024 1411075 1662159 1466866
13898 1466866 1480505 1587404 1391295 1463931 1581532 1552784 1960238 1866693 1394815 1656977
13888 1656977 1378149 1588612 1594738 1453896 1576825 1520802 1514308 1543068 1449107 1449610 1322490
13877 1322490 1343256 1576550 1415440 1596719 1467865 1284311 1448907 1415544 1537661 1233161
13867 1233161 1812469 1529361 1573596 1795330 1452328 1696695 1536788 1612574 1592214 1462852
13857 1462852 1592834 1817636 1735763 1543325 1617746 1708401 1670141 1727303 1629377 1498427
13847 1498427 1649831 1534059 1614488 1302135 1486647 1688400 1390319 1490430 1848091 1303563
13837 1303563 1248153 1427373 1289951 1436556 1404201 1337098 1334221 1378313 1309824 1567920 1293128
13826 1293128 1322703 1534567 1194124 1349295 1352749 1510513 1557569 1287253 1077195 1197872
13816 1197872 1297809 1237305 1260735 1306205 1406021 1282818 1173831 1079267 1335880 1259030 1362854
13805 1362854 1108039 1234113 1250921 1445120 1436608 1531693 1480615 1477198 1397221 1572901 1558295
13794 1558295 1497028 1415422 1314824 1338336 1367260 1436554 1199110 1184803 1310343 1157291
13784 1157291 1087029 1239075 1129883 1186927 1261307 1369459 1380491 1129741 1146112 1359227
13774 1359227 1440394 1217258 1489434 1721733 1205271 1552345 1637554 1381301 1512317 1488428
13764 1488428 1641421 1521098 1757791 1786146 1630177 1853833 1818440 1967410 1761990 1788881
13754 1788881 1870767 1709749 1837162 1687198 1629649 1892703 1562787 1476375 1560837 1548801
13744 1548801 1199597 1229608 1500676 1691684 1429422 1603285 1485543 1728929 1529187 1651785
13734 1651785 1682300 1640981 1683777 1598974 1718019 1659503 1595001 1612408 1691893 1464150 1576746
13723 1576746 1754967 1811763 1740649 1804363 1713089 1732051 1865404 1869182 1825007 2045669 1591026
13712 1591026 1772446 1948382 2003829 1837468 2099430 2024392 2063001 1989608 2039659 2191989
13702 2191989 1935276 1735983 1706024 2113945 2097508 2126914 2124323 2387375 2438715 2632078
13692 2632078 2840747 2755919 2567905 2625545 2438904 2449914 1859347 2145411 2147798 1968373
13682 1968373 1967743 1931130 1891538 1912273 1938685 1903923 2077940 1953809 2174073 2261118 2015517
13671 2015517 2064155 2302124 2170188 2366143 2428645 2682151 2814513 2989298 2999584 2935704
13661 2935704 2890934 3074497 3023961 2834293 2988525 2406844 2467576 2376984 2224338 2132088
13651 2132088 2174774 2076558 1998140 1890665 2193053 2077576 1959053 1892709 1855630 1899673
13641 1899673 2071739 2010837 1755197 1843635 2345563 2390088 2656365 2834133 2798015 2899021
13631 2899021 2880654 2769464 2699953 2619820 2322289 2133051 1951776 2012575 1965658 1846835
13621 1846835 1829930 1518720 1735491 1797395 2067467 1937447 1764721 1904043 2065299 1938556
13611 1938556 2147346 2181768 2034964 2168331 2384690 2441118 2086032 2180336 1980758 2247238
13601 2247238 1849099 1928771 1795084 1856086 2020631 2162076 2206952 2111257 1849062 2213398
13591 2213398 2250611 2188202 2099853 1950693 2068922 2187803 1853207 1952397 1720115 1685558
13581 1685558 1475370 1664061 1626497 1728338 1556977 1478035 1533991 1479275 1627509 1787820
13571 1787820 1505522 1636438 1451025 1550245 1747073 1522008 1565270 1569310 1608901 1617373 1678802
13560 1678802 1563815 1473905 1764153 1569897 1519488 1468318 1414663 1337866 1412562 1704987
13550 1704987 1557167 1506053 1710992 1732901 1910511 2142545 2466114 2632455 2711131 2596236
13540 2596236 2788186 2357603 2541318 2523952 2382589 2176777 2146116 1736016 1933986 1884526
13530 1884526 1643585 2010192 2083997 2656008 2634796 2521670 2402153 2601848 2727808 2459583
13520 2459583 2268240 2383927 2155564 2095737 1808731 1658703 1596306 1504061 1645994 1261990
13510 1261990 1209067 1469505 1428920 1296839 1355245 1308929 1184272 1280413 1341524 1229551
13500 1229551 1272437 1314936 1114930 1361949 1053853 1341277 1338574 1517905 1390941 1302540
13490 1302540 1480327 1337029 1501945 1164790 1279819 1289656 1238508 1170018 1215341 1359374
13480 1359374 1430443 1296622 1441300 1411558 1165231 1308961 1435165 1378092 1120350 1404943
13470 1404943 1243659 1123243 1522971 1363379 1250314 1489931 1290920 1426630 1278511
13461 1278511 1355240 1244460 1403871 1411248 1534829 1475470 1692667 1901682 2218470 2625335
13451 2625335 2794201 2534536 2670859 2629005 2597924 2350715 2227376 2198427 1819460 1842978
13441 1842978 1803620 1815832 1289622 1497090 1526910 1354831 1513492 1348671 1461097 1397239
13431 1397239 1428564 1243247 1635335 1400378 1820224 1645515 1943882 2235628 2164415 2188349
13421 2188349 2513765 2657714 2566696 2623360 2186911 2238580 2320781 2041826 1982126 2074105
13411 2074105 1608977 1743926 1854762 1648561 1487921 1572320 1418431 1593341 1372311 1302469
13401 1302469 1410670 1415652 1354815 1510980 1390673 1644269 1656330 1613694 1740818 1566773
13391 1566773 1842221 1844514 2232995 2161576 2232555 2382645 2242506 2545361 2429149 2490524
13381 2490524 2611886 2435009 2343621 2371983 2462465 2301461 2174467 2072463 1981085 1930721
13371 1930721 1725774 2123404 2077895 2302776 2051413 2034033 2308409 1856886 2058701 2057350
13361 2057350 1922884 1966376 1845886 1908115 2014739 2155129 2281589 2319728 2529523 2408130
13351 2408130 2169918 2279377 2228571 2154714 2070212 2350632 1918941 2325129 2100639 1981556
13341 1981556 1970701 1949455 1873057 1784195 1910171 2144377 1746435 2006611 1961987 2022997
13331 2022997 2153892 2076573 1804695 2186237 1932977 2100015 2101567 1909326 2043152 1981660
13321 1981660 2157710 2187968 2309114 2136431 2245710 2441481 2586687 2808865 2694970 2863771
13311 2863771 2899193 2748574 2788991 3032389 2760094 2801228 2660864 2631340 2682754 2788244
13301 2788244 2723655 2947525 3263729 3262318 3260609 3132458 3090632 3272792 3254691 3275093 3184977
13290 3184977 3345920 3140805 3224528 2739659 3391186 3058098 3312566 2977440 3159838 3121817
13280 3121817 3082326 3347693 3273665 3194197 3273902 3719905 3242895 3570391 3679264 3659001
13270 3659001 3936128 3937338 3888740 3938448 3848119 4002882 4093747 4164684 4482746 4596372 4492772
13259 4492772 4471001 4788491 4956193 5127525 5163942 5472436 5832040 5865699 6268622 6274713
13249 6274713 6323526 6383755 6577305 6680028 6704190 6666233 6849474 6964616 7040422 6936988
13239 6936988 7214195 7286604 7223268 7319560 7570552 7685086 7820409 8043188 8088181 8316926
13229 8316926 8935892 9062508 9273690 9624161 9813601 9963770 10133005 10173320 10218634 10338430
13219 10338430 10249787 10180837 10044158 9907192 9642722 9632865 9437791 9435346 9263157 9126878
13209 9126878 8938655 9114020 8928515 8920383 8970934 8843475 8769639 8755319 8894028 8776488
13199 8776488 8563069 8494117 8586226 8482151 8267738 8172162 7852981 7553794 7523522 7499661
13189 7499661 7204593 7217646 7019395 6678323 6668475 6574842 6143966 6132075 5988398 5941284
13179 5941284 5938100 5626948 5630763 5643217 5492515 5186412 5181648 5189984 5216649 5087421 5177909
13168 5177909 5046588 5185294 5059178 5334137 5420446 5758759 5905935 6364638 6348120 6621162
13158 6621162 6803916 7007939 7315309 7046247 7252471 7189520 6782668 6952775 6676309 6869883
13148 6869883 6696349 6721464 6717365 6751235 6833589 6616012 6397092 6371075 6331049 5736298 5715312
13137 5715312 5218527 5213797 4749157 4571706 4224195 4119472 4239694 4029470 4090098 4367464
13127 4367464 4016431 4182741 4100928 3825124 4020578 4099424 3810475 3781640 3637536 3567297
13117 3567297 3551269 3286714 3452682 3156288 3116054 3264227 3303204 3197418 3105626 3319567
13107 3319567 3257735 3427429 3472513 3106867 3622470 3796628 3797784 4013023 4392441 4747344
13097 4747344 4962694 5405937 5882799 5885636 6100430 6393525 6531522 6536560 6391285 6309351
13087 6309351 6324601 6366081 6679900 6546545 6300925 6246355 6255770 6048013 5681519 5680050 5282466
13076 5282466 4817693 4539837 4349882 3844929 3850455 3633083 3396936 3108115 3070481 3167809
13066 3167809 3067080 2955099 2875075 2912546 2874139 3168503 3010793 2969338 2963458 3303916
13056 3303916 3038884 3127045 3254230 3170112 2775597 2898337 3038443 3036068 2986289 2940454
13046 2940454 2903527 2856134 3062065 2874765 2964627 2937616 3205861 3295059 3005267 3248768
13036 3248768 3245939 3179219 3370932 3205041 3358413 3527777 3407452 3455343 3702999 3685142
13026 3685142 3656585 3699975 3492693 3929881 3922964 4111385 3874296 4049460 3927314 3928853
13016 3928853 4036808 3890540 4223346 4480880 4262572 4438526 4518055 4569353 4526939 4686718
13006 4686718 4991967 4631011 4914467 4914898 5211149 5197475 5127989 5391816 5335128 5576373
12996 5576373 5534808 5686093 5721284 5819152 6223219 5748422 6060636 5741735 6008786 5699196
12986 5699196 6027151 5680764 5719829 5909885 5856028 5915443 5926917 5873863 5720696 5787900
12976 5787900 5825730 5434167 5559086 5512130 5582858 5574315 5536034 5221175 5269419 5295919 5130190
12965 5130190 5222182 5235267 4976922 5054850 5182040 4903456 5173192 5061496 5151370 4972821
12955 4972821 5046498 5179335 5170022 5313017 5112150 5070087 5050048 5007627 5133267 5249136
12945 5249136 4986717 5035120 5012154 5080806 5163276 5271406 5062181 5217867 5087535 5148513
12935 5148513 5260279 5306678 5230838 5524972 5373144 5482090 5502892 5393463 5543898 5498082
12925 5498082 5060817 5079461 5208324 5192621 5085040 4877326 5034158 4949995 4977458 4758934
12915 4758934 4434874 4928414 4581189 4412238 4317774 4280854 4124629 4279258 3900151 3915703
12905 3915703 3932995 4041249 3764909 3548643 3751007 3734793 3595740 3602298 3368680 3578437
12895 3578437 3386577 3532280 3125539 3400278 3398841 3113187 3447562 3209737 3347938 3129377
12885 3129377 3371709 3033685 3348126 3360529 3178515 3171359 3406153 3060508 3141583 3138930
12875 3138930 2914577 3170236 3050515 2923122 2783429 2857762 2749647 2759349 2731200 2656489
12865 2656489 2764393 2726923 2503395 2698664 2641362 2556411 2854889 2784015 2476382 2606736
12855 2606736 2750364 2678493 2592612 2709384 2587835 2805209 2596576 2669256 2736222 2550395
12845 2550395 2596572 2489917 2621978 2739919 2699198 2540894 2579404 2659151 2904412 2595779
12835 2595779 2646121 2664142 2510381 2631213 2652425 2662567 2539486 2630488 2514313 2664981
12825 2664981 2663640 2653012 2602511 2700132 2584006 2745233 2628814 2487677 2696191 2490113
12815 2490113 2528580 2642436 2590318 2592020 2473031 2591038 2517466 2509196 2535466 2577038 2728062
12804 2728062 2648384 2844964 2626091 2554621 2853751 2753111 2469978 2606870 2733896 2804223
12794 2804223 2839098 2799800 2683661 2758799 2658625 2600003 2602296 2689072 2735587 2802347 2741636
12783 2741636 2882089 2614614 2759565 2619161 2757680 2770872 2819654 2728807 2575798 2881482
12773 2881482 2929872 2584813 2843945 2984748 2839332 2761087 2718216 2928253 3014079 3054458
12763 3054458 3117684 3000494 3046811 3090276 2653572 3065179 2633022 3041350 2978067 2955851
12753 2955851 2915819 2853105 3010991 2841954 2865412 2878503 2652967 3015579 3093492 2891816
12743 2891816 3111816 2747619 2862743 2807968 2764041 3087847 3045435 3252936 3009427 2927152
12733 2927152 3053731 3042648 2918743 2822114 3004815 2948046 2932916 2816366 3086634 3112730
12723 3112730 3006443 2971336 3071297 3082995 3099126 3027681 3205852 3113742 3100664 3076092 3138114
12712 3138114 2956167 3175358 3195514 3331181 3109409 3204348 3482313 3409478 3563700 3609879
12702 3609879 3881640 3806322 4160544 3791008 3890692 4080892 4190781 4599778 4774245 5141987
12692 5141987 5489425 5673018 6288176 7157092 7230069 7522923 7472687 7550737 7278614 6845573
12682 6845573 6509938 6062102 5838588 5529985 5227512 4939377 4435824 4642552 4535089
12673 4535089 4762771 4568255 4416049 4373355 4454132 4531295 4654552 4502918 4740678 4489074
12663 4489074 4692244 4791526 4565576 4745051 4677272 4727386 4791518 4976433 4995774 5353124
12653 5353124 5378491 5470158 5911851 6239803 6332064 6323502 6347629 6219118 6192626 6338649 6525513
12642 6525513 6486311 6444482 6616438 6221490 6376458 6369484 6399373 6517001 6550393 6914747
12632 6914747 6652262 6685140 6901486 6907898 7071360 6876471 7033837 6733299 6847821 6598800
12622 6598800 6284390 6073058 5642553 5682992 5386408 5328888 5077007 5302994 5424573 5514485
12612 5514485 6159577 6620777 6867675 7119005 7708110 7852691 8216777 8412317 8213763
12603 8213763 7966065 7681019 7410790 6702329 6440647 5898456 6031057 5800344 5383743
12594 5383743 5742668 5279831 5629932 5645009 5753730 5862634 6130724 6015776 6193103 6139074
12584 6139074 6222210 6155528 6253514 6258332 6384231 6877689 7108353 7108253 7151605 7251830 6965016
12573 6965016 6477664 6360527 6198428 5683692 5607408 5173449 5057940 4715337 4604347 4755815
12563 4755815 4580947 4813777 4797080 4699962 4614007 4817095 4710612 4497281 4757154 4726206
12553 4726206 4679289 4832726 4701901 4728634 4860130 4630614 4901403 4853980 4979528 4862483
12543 4862483 4930856 5378529 5495597 5648580 5636735 5493120 5580854 5596610 5471762 5117726
12533 5117726 5342906 5163842 5114243 5184305 4972185 4373035 4820158 4842327 5056341 4655225
12523 4655225 5045080 5153785 4892668 5038388 5130788 5177999 5194226 5185832 5557961 5633851
12513 5633851 6306047 6422629 6835789 7104361 7243932 7157622 6907004 6926629 6646446 6504613
12503 6504613 6372928 6012168 5792989 5555580 5383266 5398497 5371079 5615056 5619413 5384512
12493 5384512 5326078 5224684 5413354 5446836 5415878 5621782 5322455 5684660 5782174 6087946
12483 6087946 6026195 6330487 6684910 6687676 6581662 6474350 6487922 6406051 6227651 6131355
12473 6131355 6097493 6197767 6129085 5693197 5925504 5775560 5787610 6097325 6130933 5949229
12463 5949229 6208948 6033950 6336420 6613338 6490170 6889083 6719902 6779040 6955778 7129437
12453 7129437 7399559 7487496 7773557 7928641 8254770 8384780 8818807 8984391 9379953 9616934
12443 9616934 9826449 10021422 10249083 10300247 10542918 10790873 10752355 10935714 10787016 10787927
12433 10787927 10788396 11002368 11066925 11244374 11292867 11113512 11597087 11559716 11813881 12105225
12423 12105225 12527350 12638138 12907903 13575905 14001454 14447606 14734070 15468583 15387682
12414 15387682 16178232 16525130 16757980 16801414 16807730 17072561 16855077 16507657 16383282 15999421
12404 15999421 16007099 15419712 15481765 14980040 14805572 14596068 14573426 14632345 14425084 14502270
12394 14502270 14498398 14529091 15107981 15256493 15530951 15793974 16199711 16735973 17146053 17333969
12384 17333969 17626351 17726439 17953985 18057867 18096188 18117128 18157210 18254326 18119053 18006290
12374 18006290 17835306 17482296 17337396 17317839 17019012 17222607 16775797 16940491 16893911 16660611
12364 16660611 16420286 16248204 16133167 15917679 15860771 15798083 15771438 15564246 15505136 15211142
12354 15211142 15273300 15211467 14941684 14620566 14537517 14422168 14036210 14113615 14066867 13963722
12344 13963722 14099844 14263873 14561058 14551717 14834825 15058137 15280771 15535828 15842473 16038008
12334 16038008 16519872 16819146 17011691 17457601 17570927 17739199 18029072 18448741 18499010
12325 18499010 18604539 18765226 19019798 19116805 19148839 18959942 19012431 19062001 18983183 19098252
12315 19098252 19094889 19044672 19430552 19425772 19582678 19827086 19997831 20358064 20767142 21151401
12305 21151401 21258248 21427959 21630047 21628908 21796306 21548571 21144886 20461450 20415629 19846592
12295 19846592 19258370 19293071 18719772 18587525 18366691 18116910 17880799 17579339 17065858
12286 17065858 16806565 16292588 15670335 15444128 14810292 14355991 14176797 13681179 13197055
12277 13197055 13094752 12997145 12747277 12567360 12325239 12267365 12341622 12025513 12309313 12109209
12267 12109209 11995284 11846655 12017481 11908490 11983315 11833013 11759753 11774218 12048951 12131342
12257 12131342 12272772 12595358 12847992 13329929 13800377 14365737 15294080 16086323 16722887
12248 16722887 17651518 18706780 19636152 20724515 21394899 22217794 22950465 23117185 23285644
12239 23285644 23393649 23174780 23379973 23065084 22999108 23012509 22854792 22472073 22256826 21891110
12229 21891110 21342645 20644077 20073047 19336071 18424307 17429070 16508409 15529592 14566207
12220 14566207 14116979 13258245 12973575 12512098 12073801 11784798 11661985 11344400 10973501
12211 10973501 10662109 10466108 10091340 9953124 9794804 9682624 9608466 9476477 9672868
12202 9672868 9402424 9377007 9434936 9444804 9287130 9516180 9515402 9629929 9799713 9932623 9797182
12191 9797182 9925204 10363053 10453287 10575477 10763752 10845296 11015401 11331883 11141751 11552048
12181 11552048 11584572 11563149 11633509 11453518 11485339 11316411 11166403 11306262 11462188 11284844
12171 11284844 11348351 11133918 11445101 11627759 12027410 11650392 12090042 12378678 12840948
12162 12840948 13371994 13881683 14159028 14740081 14398484 14627502 14400949 14451570 14369447 14325132
12152 14325132 14571151 14491841 14589092 15040295 15175971 15921905 16193061 16512704 17279730 17530990
12142 17530990 17894646 18564521 19028666 19549816 20426104 21060363 21990280 23185476 24330526
12133 24330526 25544248 27182498 28931467 30154729 32525522 33993646 35578162 36992585
12125 36992585 38243913 39156191 39869131 40277581 40488368 40645666 40627433 40234206 39957518
12116 39957518 39460255 38956335 38605901 38003504 37378127 37242862 36664385 36454378 36204015
12107 36204015 35695267 35594267 35499075 35410505 35623314 35858935 36115908 36248672 36139377 35692916
12097 35692916 35408905 34979913 34119941 33320234 32855468 32662471 32702683 32710537 33130367 33608288
12087 33608288 34222006 34900338 35519277 35796990 36352995 36834182 37297277 37438359 37391857
12078 37391857 37450437 37266026 37534995 37059836 36877052 36849217 36518955 36237611 35506275 34677141
12068 34677141 33499116 32651245 31561504 30275365 29764140 29077053 28054870 27451824 26859481
12059 26859481 26381614 25977065 25687890 25185671 24532637 24204860 23692481 23183673 22735300
12050 22735300 22493731 21773110 21643272 21265937 20875237 20753530 20077012 19707591 19361500
12041 19361500 18995141 18585982 18025767 17667061 17148676 17098181 16702786 16814719 16688653
12032 16688653 16975278 17265583 17558705 17670490 17871176 18088306 18082906 17743026 17400093 17011162
12022 17011162 16642229 15961877 15456860 15030536 14660982 14078251 13827062 13544283 13368314
12013 13368314 12785306 12318753 12342770 11901853 11561150 11553390 11254795 11308782 11585589 11272771
12003 11272771 11553359 11737983 11830033 11849792 11622953 11702207 11472867 11029557 10561084 10334890
11993 10334890 10090875 10043738 10010976 9801091 9663233 9313132 9405209 9066867 8757176 8633916
11983 8633916 8278100 8290104 8189633 8034783 7864013 7510899 7589875 7596307 7202234 7213240
11973 7213240 6862318 6969774 6952550 6565499 6423643 6282878 6233260 5918549 5937167 5626661
11963 5626661 5800102 5696632 5827488 5669589 6027218 5987849 5954291 6266748 6265134 6389124
11953 6389124 6211770 6181240 6297535 6203074 6212950 6465636 6514595 6568370 6568406 6698347 6915492
11942 6915492 7074433 7269236 7242075 7434430 7629142 7502507 7707837 7781432 7522854 7590013
11932 7590013 7752484 7685098 7734984 7702369 7673034 7549630 7529098 7249449 7122801 6901479
11922 6901479 7048419 6652673 6375312 6312766 6114046 6184980 6025591 6202123 6196584 6239320
11912 6239320 6836554 6982452 8760400 10829387 12513016 13765745 13969683 13919075 13169261
11903 13169261 11915501 11266894 10187265 9511116 9057164 7216241 6110051 5850024 5743390
11894 5743390 5821577 5640957 5401737 5562280 5510200 5744231 6426275 7020140 7588964 7881167
11884 7881167 8617881 9034236 9306332 9538536 9113859 9133704 8708483 8740701 8218534 7870897
11874 7870897 7502918 7130973 6375597 6232414 5926270 5543696 5528981 5094040 5003666 4921780
11864 4921780 4905734 4758588 4449036 4754963 4575177 4538639 4645795 4557462 4554647 4553914 4712994
11853 4712994 4713126 4827740 5087213 5262565 5120849 5551076 5465286 5980827 6077160 6848478
11843 6848478 7090631 7389804 7718492 7776631 7885890 7984633 7429220 7423123 7222671 7076176
11833 7076176 7199923 7116657 7130386 7091090 7038426 6836459 6460373 6119688 6023145 5414504
11823 5414504 5191355 5155276 4651859 4542872 4266719 4185099 4249975 4037556 3908236 3722755
11813 3722755 3774664 3945016 3486544 3606312 3526986 3834640 3269612 3521587 3324092 3313215
11803 3313215 3559888 3562253 3388488 3609655 3325537 3403302 3610144 3570842 3585318 3796842
11793 3796842 4062767 4120651 4501589 4734018 4966819 5643734 5772738 5744759 5652425 5646120
11783 5646120 5201284 5062631 4849316 4720373 4266719 3958506 3934672 3864387 3622515 3472019
11773 3472019 3175867 3344373 2917794 3120334 3241643 2958576 3149449 3170646 2998839 2887388
11763 2887388 2851592 2803780 2804576 2884248 2859875 2745924 2894196 2706023 2763611 2759939 2823746
11752 2823746 2733588 2943361 2837774 2803280 2718017 2550806 2787903 2800631 2706285 2808571
11742 2808571 2733274 2846564 2610174 2573606 2736050 2847947 2526496 2653213 2632598 2662556
11732 2662556 2671258 2765881 2655148 2743644 2638710 2506697 2617806 2556579 2531260 2362683
11722 2362683 2676487 2333213 2483672 2668249 2614665 2452717 2588602 2846999 2668348 2518569
11712 2518569 2267951 2538264 2495946 2508843 2765516 2625384 2650033 2621413 2718028 2528414
11702 2528414 2549241 2499927 2853337 2649872 2600842 2736285 2784871 2633737 2541006 2831114
11692 2831114 2490896 2760295 2765099 2838599 2944311 3114771 2933552 3045813 2764540 2808637
11682 2808637 3014667 3157522 3231939 3261178 3111982 3096481 3211226 3307586 3138895 3352906
11672 3352906 3200016 3184764 3215502 3208033 2941802 3320820 3334732 3043279 3329867 3130837
11662 3130837 3361935 3306945 3208656 3154603 3133823 3253662 3169397 3002287 3169383 2985014
11652 2985014 2978871 3102041 3231174 3165034 2901011 3133053 3104577 2974048 2982439 3317955
11642 3317955 3119904 2910827 3130844 3054175 3097670 3049168 2953575 2878784 3005540 3034059
11632 3034059 3099700 3316379 3082173 2887757 2890022 3188025 2960850 2811446 2801479 2951568
11622 2951568 2682941 2845444 3060996 2861191 2734740 3187680 2880592 2911590 2888284 2930010
11612 2930010 2914019 2900281 2869505 2835573 2934899 2876386 3130997 2997748 2924674 3019425 3274513
11601 3274513 3327037 3279478 3013347 3373413 3382348 3351697 3524806 3496318 3176976 3114313 3212118
11590 3212118 3299043 3034179 3299796 3265859 3299723 3097040 3323043 3110240 3237010 3334187
11580 3334187 3478376 3424656 3574292 3209315 3352161 3471025 3620088 3346548 3349444 3678277
11570 3678277 3625980 3363499 3356412 3210530 3415847 3611915 3511616 3462071 3302554 3260534
11560 3260534 3461337 3238042 3544265 3467359 3474539 3225516 3319061 3554471 3326569 3412532
11550 3412532 3370050 3276157 3426473 3375539 3533972 3513170 3191007 3419760 3255105 3223816
11540 3223816 3241098 3229381 3334755 3146142 3337617 3158013 3213602 3090962 3119304 3450417
11530 3450417 3333029 3216458 3353342 3386162 3207862 3340362 3339132 3240313 3392458 3554508
11520 3554508 3310531 3300541 3347255 3241401 3582598 3533376 3427941 3379370 3512840 3408342
11510 3408342 3511874 3485395 3495348 3551721 3669620 3569474 3649477 3826786 3778467 3650342
11500 3650342 3434003 3559218 3396896 3455744 3378933 3549270 3860257 3491661 3569827 3595351
11490 3595351 3656652 3648305 3615235 3815495 3636641 3753090 3822320 3720629 3813946 3885248 4115441
11479 4115441 3917179 4217554 4119329 3814276 4170220 3888291 3948139 3998597 3968481 3857740
11469 3857740 3790048 3643615 3663986 3990639 3748169 3519852 3589418 3743223 3911706 3779791
11459 3779791 3624023 3867125 3776444 3464440 3516197 3525168 3594046 3923815 3596952 3862251
11449 3862251 3656475 3828318 3787156 3945119 3852750 3882381 3660912 4050272 4035226 4069758
11439 4069758 4179173 4047954 4147655 4280251 4014792 4190358 4480557 4478172 4490241 4621945
11429 4621945 4730583 4821117 4587652 4731276 4793174 4984222 4934641 5007343 5049589 5144377
11419 5144377 5235160 5155376 5082887 5267104 5322359 5172440 5524963 5405396 5401520 5650703
11409 5650703 5752408 5774503 6077946 5944261 5947945 6153103 6193735 6263156 6598582 6813673
11399 6813673 6761105 6630642 6824905 7207376 7331902 7184950 7346257 7297986 7531987 7739451
11389 7739451 7927900 7861407 8163412 8189954 8434748 8446681 8572078 8744885 8665609 9044115
11379 9044115 9031817 9116448 9248960 9331074 9400802 9284067 9598493 9717436 9664031 9805592
11369 9805592 9843787 10158621 9845968 9986516 10198612 10002364 10029023 10199140 10523585 10319780
11359 10319780 10252913 10690959 10298193 10511664 10193598 10270795 10504761 10517362 10398370 10577934
11349 10577934 10494085 10388971 10342213 10414145 10124907 10064007 10154611 10237998 10027169 9970140
11339 9970140 9897703 9782242 9572577 9765509 9835909 9407587 9604618 9235927 9378967 8991620
11329 8991620 8876823 8852603 8947724 8619032 8620374 8626225 8369429 8320388 8271493 7956515 7897855
11318 7897855 7935916 7641116 7665003 7437806 7198760 7209145 6996082 7043689 7042187 6638547
11308 6638547 6839830 6182951 6251599 6298782 6120920 6042649 5723395 5504341 5595422 5345512
11298 5345512 5215075 5227169 4967063 5052481 4975912 4822480 4793769 4420953 4485170 4755324
11288 4755324 4375312 4685556 4428869 4317644 3972689 3872561 4215326 3899390 3929479 3771857
11278 3771857 3708667 3634607 3421131 3644186 3465550 3678679 3520459 3378936 3444539 3086231
11268 3086231 3605222 3275324 3422021 3447963 3164687 3268967 3146389 3262181 3209833 2885812
11258 2885812 3103617 2986881 3123002 3018640 2994484 2992000 2951145 3053960 3064459 3004630
11248 3004630 2890346 3043895 2893937 2897693 3021981 3024934 2840465 2936220 2785554 2932364
11238 2932364 2955723 2776152 2877567 2781188 2800202 2961811 3147659 2845692 3075571 3174916
11228 3174916 3572332 3360050 3809535 4414825 5201678 5749411 6074474 6602044 6449058
11219 6449058 6422485 5985686 5692195 5609162 5006013 4774368 4273714 3754979 3510365 3486679
11209 3486679 3311160 3418293 3413327 3122086 3031237 3193803 3145129 3236989 3143202 3089436 3580513
11198 3580513 3681257 4030550 4582341 5166471 6087592 6454329 6690537 6724676 6361296 6383005
11188 6383005 5780846 5122866 5092493 4699610 4288836 3980765 3556950 3390869 3287207 3325334
11178 3325334 3193613 3452757 3091013 3240049 3172779 3312432 3296451 3454034 3256003 3282140
11168 3282140 3116947 3377288 3135998 3366706 3325468 3161677 3403920 3540457 3196362 3306738
11158 3306738 3446280 3477958 3458742 3659719 3456167 3654512 3345449 3532682 3542145 3578474
11148 3578474 3699698 3523384 3484641 3426839 3500362 3667570 3502949 3733496 3735982 3669057
11138 3669057 3518713 3875176 3764868 3869132 4038883 3775126 3641229 4022247 3931093 3878636
11128 3878636 3920919 3952690 3928943 4052151 4091705 3941600 4031189 4090291 4157731 4041154 3854519
11117 3854519 4190209 4055681 4161701 4141452 3996000 4139011 4469258 4236063 4119749 4235761
11107 4235761 4176749 4221297 4008937 4109317 4057938 4187282 3928961 4251999 3992751 4192396
11097 4192396 3962492 4238122 3954366 4119356 4128712 4047632 3926455 4050291 4016585 4175918
11087 4175918 4043088 4060693 4044768 4031456 3891765 4046775 3980964 4131709 4093442 3906881
11077 3906881 3949402 4142500 4306429 4327731 4283790 4207663 4183115 4358309 4417519 4546574
11067 4546574 4472745 4404338 4475014 4804517 4743306 4989199 4857362 4827288 4855372 4936925 5077131
11056 5077131 5128742 5171966 5540433 5391805 5283810 5203159 5224304 5377914 5275132 5590299
11046 5590299 5406624 5581371 5656804 5602095 5985448 5947875 5998065 6108652 6319073 6214228
11036 6214228 6261684 6848963 6692322 7054586 7069909 7398311 7284949 7559221 7831751 8145706
11026 8145706 8124676 8417271 8686811 8703952 8831338 8919299 9114459 9107415 9320828 9273774
11016 9273774 9560124 9466763 9742243 9818419 10105505 10246632 10439205 10650346 10777700 10792681
11006 10792681 11086652 11401860 11569655 11773332 12011547 12270683 12663112 13016035 12988303
10997 12988303 13404130 13401162 13620386 13995019 13751147 14235278 14052143 14234305 14576949 14944122
10987 14944122 14616119 14959809 15084858 15523875 15811715 16333333 16796580 16968955 17446339
10978 17446339 17510677 17707926 18140262 18296089 18521029 18809217 18874663 19175639 19522683 19817239
10968 19817239 19992724 20575626 20860129 21327546 21688831 21966384 22336016 22779090 23308895
10959 23308895 23961354 24350106 24782844 25472890 26122819 26744013 27191458 27665967 28407537
10950 28407537 28583860 29107437 29760165 30230694 30623187 31194794 31518345 32269971 32565942
10941 32565942 33290037 33969128 34724820 35409384 36131999 36899102 37463503 38283818 38989094
10932 38989094 39917129 40669883 41324000 41859863 42717190 43504417 44389835 45232397 45841249
10923 45841249 46553109 47400272 47745376 48401954 48390501 49001293 49224316 49323978 49151143 49416886
10913 49416886 49315138 49263193 49132340 49273499 49224318 49223428 49324539 49632644 49613161 49701149
10903 49701149 49868048 50107913 50089359 50600425 50941797 51462827 51673172 52290133 52861290
10894 52861290 53382099 54460094 55404742 56396839 57851400 58982608 60445438 62193517
10886 62193517 64043739 66558896 68803055 71529247 75078550 78463808 82232681 86501892
10878 86501892 90615024 94887541 99121856 103062839 106387292 109558932 111855421 113676721
10870 113676721 114290417 114363613 113726573 112418771 110431703 107910733 104835858 101534051
10862 101534051 97858086 94087241 89926686 85688178 81670373 77783860 73845348 69933473
10854 69933473 66200970 62483063 58987804 55573976 52657480 49229635 46508617 43858278
10846 43858278 41212371 38861220 36779888 34226895 32740529 30761334 29044780 27703140
10838 27703140 26022074 24705554 23518418 22337729 21403985 20268384 19246376 18536530
10830 18536530 17607228 16752816 15975589 15522467 14981392 14054507 13544896 12926950 12573426
10821 12573426 12113505 11821906 11177386 11185594 10794795 10184510 10248990 9832535 9666262 9529397
10811 9529397 9147411 8922771 8810992 8488151 8448474 8154555 8129229 7628373 7430455 7243272
10801 7243272 7146838 6699120 6601939 6242413 6168747 6149032 5956228 5784649 5811880 5610917
10791 5610917 5696203 5307272 5048377 5218423 5299161 5162791 5077119 4994475 4997336 4933390 4667988
10780 4667988 4637076 4498319 4480736 4570763 4286549 4383453 4223437 3966588 4257149 3943834
10770 3943834 4058472 3959956 3805895 3634734 3757770 3858064 3689099 3794383 3779347 3502560
10760 3502560 3461160 3610722 3528607 3309797 3512591 3413323 3614922 3678124 3456024 3622687
10750 3622687 3756236 3545759 3116797 3232716 3368531 3313294 3127266 3123648 3143891 3060447
10740 3060447 2727887 3027568 2804063 3129791 2822620 2755294 3064460 2928856 2795302 3075521
10730 3075521 2944033 3113774 3077637 2786785 3122773 3028324 3096323 3325404 2875916 3172630
10720 3172630 2802743 2936887 2613227 2833485 2767836 2838130 3105156 2931517 2990722 2878577
10710 2878577 3092979 2759233 2929580 2948753 2806663 2892802 3088023 3013812 3120093 2867292
10700 2867292 2899335 2912366 2703031 2993275 2534780 2652919 2699136 2654463 2863732 2890585
10690 2890585 3035002 2859438 2796882 2664117 2950639 2615631 2581101 2684541 2723531 2567973
10680 2567973 2625999 2498429 2720531 2648380 2649744 2674642 2810971 2803598 2745719 2567524 2672493
10669 2672493 2562162 2575956 2413575 2503415 2420065 2330333 2378878 2332759 2234587 2381068 2351393
10658 2351393 2272473 2256787 2248657 2334144 2372997 2327235 2406205 2404232 2413277 2486034 2454253 2578815
10646 2578815 2342584 2262969 2134793 2130039 2184010 2148280 2174734 2037393 1850733 2106540
10636 2106540 1968203 2164593 2012984 1964782 1915366 2115057 2116706 1774957 1825465 1761239
10626 1761239 1734140 2038218 1890834 1634048 1879750 1821428 1979539 1674131 1961356 1809754
10616 1809754 1987008 1696522 1942005 2065848 1886232 1661379 1810130 2053906 2105190 1926033
10606 1926033 1903567 2077383 1991443 1687045 1968853 1874376 2015270 1904524 2115217 1840735
10596 1840735 1644689 1954138 1913767 2025709 1866897 1917268 1875789 1822583 1778618 1982890
10586 1982890 1829644 1948940 1857318 1803387 1904851 1815601 2014699 2149059 1990192 2192437
10576 2192437 1684131 1984209 1915101 1936976 1866827 2140814 1594754 1853621 1734737 1623393
10566 1623393 1673987 1744907 1361902 1608520 1351630 1719839 1597125 1383842 1272061 1675078
10556 1675078 1334174 1680371 1355141 1585323 1498117 1557246 1331768 1273347 1287707 1722598
10546 1722598 1337794 1231890 1575875 1456543 1565247 1463778 1228369 1333741 1586547
10537 1586547 1429562 1501417 1458221 1388036 1459674 1354916 1553525 1346914 1574979 1633908
10527 1633908 1442742 1515975 1512707 1572390 1703245 1871942 1871538 2201520 2199407 2341928 2622676
10516 2622676 2455048 2346316 2349411 2387037 1941202 2077017 2042440 2205743 2082185 2031023
10506 2031023 1878413 1687151 1643149 1891020 1878074 1819119 1742440 1874165 1607706 2053659
10496 2053659 2022579 1939783 2047666 2048851 2367992 2452890 2674196 2557071 2755433 2478028
10486 2478028 2546237 2417608 2260878 2295311 2325361 2372672 1968027 2119196 2102059 2059351
10476 2059351 2135321 2025319 2099155 2028921 2183281 2139611 2076682 1926286 2418537 2294921
10466 2294921 2702788 2517436 2451576 2464533 2569409 2437691 2466632 2504664 2591846 2455033
10456 2455033 2377671 2424405 2350763 2220955 2332087 2433628 2402964 2543239 2508154 2738187
10446 2738187 2554502 2455177 2666628 2629726 2873288 3070285 2916607 3447413 3415853 3368838
10436 3368838 3800831 3620776 3511071 3342983 3009291 2932863 2854158 2884250 2406859 2323533
10426 2323533 2303275 2248597 2146322 2188222 2219584 2078540 2100822 2157372 2278395 2139728
10416 2139728 2222723 2361083 2466145 2592097 2644428 3080261 3218492 3441579 3516886 3577859
10406 3577859 3640793 3946588 3865823 3762794 3948531 3972847 3915295 4092493 3984892 4223945
10396 4223945 4444939 4745392 4902484 4775383 5094830 5010500 5318809 5247639 5349746 5476284
10386 5476284 5558813 5757721 5624132 5703630 5799989 5271312 5688078 5659016 5827961 5727471
10376 5727471 5704406 5752352 5513554 5351108 5631775 5628845 5810805 6125747 5941269 5805738
10366 5805738 5900544 5946666 5981261 5860806 5740129 5820443 5608884 5535968 5428871 5659519
10356 5659519 5409285 5511943 5378795 5309972 5229570 5324884 4940924 4836486 4607086 4658451
10346 4658451 4654801 4478872 4461729 4359981 4575453 4513970 4324724 4440401 4582018 4694790
10336 4694790 4454193 4594014 4551782 4567374 4827135 4580168 4538816 4636357 4439479 4304116
10326 4304116 4292891 4409598 4352340 4282347 4522918 4494129 4496927 4623416 4278231 4304959 4491777
10315 4491777 4441179 4601411 4725157 4778755 4990826 4912051 5186932 5179085 5290695 5348280
10305 5348280 5432354 5167146 5128880 5370829 5199968 5424758 5303245 5332789 5371453 5254057
10295 5254057 5851599 5563380 5945139 6156115 6347792 6828726 6993564 7504505 7850163
10286 7850163 8346325 8862340 9173664 9635103 10044061 10410952 10728826 11116002 11506412
10277 11506412 11902565 12279561 12572492 12932811 13332460 13773550 14300503 14822038 15014026
10268 15014026 15553829 15863646 16434013 16899230 17355443 18145675 18911658 19420177 20121013
10259 20121013 20576054 21021681 21466053 22003617 21910473 21858869 22320457 22395165 22615914 22924516
10249 22924516 23124162 23553217 23665094 24007508 24060186 24186309 24165509 23924112 23800157 23320559
10239 23320559 22962166 22270023 21872981 21375120 20930398 20519560 19996804 19474713 19241704
10230 19241704 18596121 18224241 17788727 17537596 16978314 16901619 16541997 16069627 16056790 15610777
10220 15610777 15253136 15348347 15201995 14844055 14277564 14244628 13823818 13671994 12908465 12472433
10210 12472433 12090985 11841630 11283959 10566901 10239987 9765170 9259052 8895307 8409428
10201 8409428 7880027 7712858 7431898 7222102 6939820 6595853 6022662 6100050 6014515 5721844
10191 5721844 5500744 5453511 5314606 4839060 4761921 4965207 4688042 4663034 4511910 4280249
10181 4280249 4360501 4307034 4245704 3979321 4153144 3851272 3873620 3869443 3817603 3845102 3888612
10170 3888612 3769853 3617898 3675304 3653916 3571722 3576227 3445447 3552094 3298965 3342339
10160 3342339 3252047 3262517 3233392 3307030 3337727 3048026 3334815 3123995 3005748 3097612
10150 3097612 3049266 3152612 3170388 3215782 3073172 2846596 2992747 2665407 2763914 3007587
10140 3007587 2981376 2679843 2854894 2881798 2608143 2644406 2675852 2812213 2810905 2827903 2542771
10129 2542771 2323487 2384391 2780645 2570076 2469048 2521019 2448080 2615217 2441467 2340598
10119 2340598 2286146 2429495 2275515 2397173 2270878 2405692 2344825 2510179 2416931 2504428
10109 2504428 2344515 2443576 2399118 2185306 2341395 2224385 2307909 2355666 2308419 2310699 2372767
10098 2372767 2268465 2272058 2432799 2281066 2173756 2198579 1957864 2088839 2112762 2340007
10088 2340007 2122420 2242587 2119288 2076951 2341871 2308586 2351429 2177542 2290163 2139074
10078 2139074 2284538 2371585 2195267 2255444 2269236 2296772 2238636 2486763 2375116 2473539
10068 2473539 2183971 2393738 2470548 2458342 2607408 2572748 2725743 2482521 2723360 2523450
10058 2523450 2617015 2663437 2701568 2722711 2773119 2696719 2776626 2554792 2501057 2676401 2564712
10047 2564712 2416553 2621561 2424518 2550449 2404499 2313535 2442353 2263298 2291199 2174902
10037 2174902 2292874 2263633 2156943 2462915 2228950 2337609 2384991 2248905 1813091 2201799
10027 2201799 2140380 2244540 2087258 2163529 2020110 2137757 2194294 2065580 1964408 1907307
10017 1907307 2155598 1916354 2020931 2229890 1851003 2150247 1917091 2133214 2342860
10008 2342860 2043360 2122586 2013955 1825772 1941374 1947969 1997658 1689660 1917720 1945472
9998 1945472 1674172 1878718 1639163 2019691 1668635 1661318 1976395 1595443 1947443 1741761
9988 1741761 1540902 1630586 1696747 1557472 1668329 1539690 1571222 1485117 1360998 1749785
9978 1749785 1319310 1356604 1602336 1442640 1538149 1288564 1396653 1321137 1481089 1552075
9968 1552075 1222909 1251317 1215613 1291262 1272894 1310659 1370212 1263998 977491 1147730 1078952
9957 1078952 1194702 950020 1090200 1205737 1266755 1063795 978758 972073 1050234 1207433
9947 1207433 939985 996823 1087187 1074060 935642 979947 944867 949210 974787 1082040 694971
9936 694971 941060 1012337 1085068 1140907 943418 978037 907059 921821 954637 1051853 821242
9925 821242 812155 873945 825681 811649 836165 780049 932174 759387 666181 906385 1127451
9914 1127451 796467 1036679 964349 1027734 651331 821248 942520 661554 882880 942539
9904 942539 876384 804217 748981 921261 813350 665871 709725 891491 771329 953864
9894 953864 720558 825523 701960 1003282 798311 727694 790158 750513 847949 719366
9884 719366 822348 878391 920447 620713 672930 884903 786891 945473 749459 799234 551892
9873 551892 810733 609450 718913 748536 969765 1082160 749684 863021 870250 613928
9863 613928 923770 827611 474461 861458 773174 861201 841704 883384 605679 942098 783938
9852 783938 694242 994972 733154 662046 876082 857425 997958 675556 969266 1006925
9842 1006925 791920 737861 728779 787511 778687 648004 923529 772804 696754 780646 911811
9831 911811 771564 767544 850133 800173 658938 818434 761050 929143 702955 731224 800731
9820 800731 614783 735824 863564 451967 856058 714611 859898 721547 807184 772472
9810 772472 919565 751736 843537 927014 672267 754516 1034527 819941 829027 563555 798728
9799 798728 622181 572832 836679 765994 718646 662150 762031 669683 655853 809779 515042
9788 515042 737362 554247 792081 766515 508804 647902 562324 828254 818765 925506
9778 925506 740991 625981 721751 761195 792888 659202 806264 853886 660679 564761 620962
9767 620962 657394 562105 678288 637112 759161 606067 573077 670450 745933 725766 505566
9756 505566 394066 514378 552129 758400 471389 681975 639871 689842 525069 379234
9746 379234 710008 287662 490780 528732 567562 632562 416807 619794 574977 713543
9736 713543 478154 712098 553501 395483 407482 298857 611598 432837 650292 391133
9726 391133 538480 643982 375026 514080 524365 291915 283845 197288 312059 395827 514656
9715 514656 423176 597255 590496 436968 498184 580514 494295 331941 521204 454321 370282
9704 370282 289868 385925 251172 460026 535989 317015 424865 552630 218123 348240
9694 348240 602847 589939 510745 505742 332682 581833 472218 326471 305072 137419 154543
9683 154543 526829 467170 374001 175534 390746 403563 459094 381627 205405 434806 572448
9672 572448 323804 608118 307321 221835 342841 530975 300032 362388 275767 314185
9662 314185 420407 249541 270159 343125 420035 249910 341390 479637 529301 341988 465055
9651 465055 157235 333419 194662 420846 267645 415888 274186 289223 541935 502577
9641 502577 497692 442369 200681 512312 288286 313592 322021 285251 283576 361785 326785 334521
9629 334521 447392 177712 360435 396382 391160 271693 452332 368102 337486 290815 182585
9618 182585 555119 384823 282296 429599 410928 650144 249222 306234 359827 390423
9608 390423 503214 186479 408579 238231 335192 314199 378410 260097 343811 378965 548819
9597 548819 424862 352712 412843 484111 552572 316248 498521 482015 333189 430970 496036
9586 496036 268754 377626 470975 345484 219373 480906 246775 433766 232234 300855
9576 300855 181756 325794 417458 332996 484273 280004 384356 455661 452683 397741 640565
9565 640565 435464 514950 175944 91010 376856 186114 462177 259766 385295 350153
9555 350153 280144 412160 182122 436103 268539 412837 412561 262808 300667 286436 299084
9544 299084 330344 465388 453640 347949 320991 267464 228299 381199 319811 408608 321893
9533 321893 435280 310424 352336 243585 287896 439451 317727 343928 326701 406579 414820
9522 414820 180728 250876 240927 522874 431004 133971 303019 298264 554657 230271 318804
9511 318804 351841 222482 32117 404592 343483 220115 188222 232764 310347 273614 281150
9500 281150 435702 507774 529863 220171 479618 63032 306752 264738 413237 428268 235959
9489 235959 287742 315773 342518 343114 322577 179345 295194 330291 186353 396530 349164
9478 349164 435673 491139 331508 314834 193345 395444 328136 210151 213666 162558 105465
9467 105465 340242 248867 95439 194478 275485 312953 109678 183386 2154 226439 124744
9456 124744 368014 223157 174082 27153 386967 389650 113983 95810 402420 499099 250198
9445 250198 313464 232271 174054 82139 160847 340449 312392 241789 351973 358851 97525
9433 -2372 283086 170534 278058 317598 113521 360995 19102 257043 207309 193448 211892
9422 211892 441605 216679 118898 157045 319311 150001 -122729 80705 114099 211479 280339
9411 280339 366441 340016 191919 322609 212129 149647 359741 191034 277265 170975
9401 170975 198322 76676 409847 223099 334398 268224 297881 307578 321296 522504 155808
9389 209253 180448 205285 112757 217423 14640 281136 330865 153076 433102 220741 352569
9378 352569 64475 228645 260000 307136 333972 118946 85078 253996 296754 352661 206543
9367 206543 101502 125210 218609 461252 82877 145717 -101037 179060 431815 171343
9356 65453 226497 123747 344012 277732 289636 122956 234902 236465 395666 36476 145926
9345 145926 75488 116896 -3796 209049 204803 305526 129157 102876 90274 31212 156961
9334 156961 414547 68737 275207 274367 251715 82542 328815 -128241 296008 193342 104556
9323 104556 99200 136616 228834 177372 310654 77576 27282 381747 228972 302903 223575
9312 223575 199067 169901 174105 154294 419857 -42090 426090 144097 283808 229414 16411
9300 313782 72745 225392 217930 180368 152747 66003 297407 43156 168265 136843 -36711
9288 257836 -7297 151890 223731 282830 206717 -56911 248306 85095 242043 101115 30920
9276 -66872 273795 185176 125171 275175 81372 295191 44816 358903 6484 158652 212040
9265 212040 443271 84743 266228 196457 189386 142827 -10331 307193 241955 480701 90128
9253 191572 214958 212437 -26653 113508 105181 94679 138405 300289 411573 -24481 332933
9241 212914 184383 282201 236471 279297 179810 196797 304510 464982 305388 87952 -242115
9229 265793 283165 106504 120267 2772 135179 244072 117555 -17409 115226 59389 136412
9218 136412 197583 213154 -44401 149835 354223 70350 174727 321758 143210 49798 -42829
9206 153337 109777 41384 369116 75284 123946 148265 67121 86396 119026 211657 -3831 48037
9193 -5417 115094 278831 188456 232021 268119 159527 166813 190209 451827 142116 338961
9182 338961 268801 281252 269833 146382 358549 -63243 209723 66222 118810 91775 207139
9171 207139 81225 371450 316595 150643 246163 97489 30937 137259 -8583 101426 390211
9160 390211 160763 160370 206050 84937 385152 166883 112255 279320 285114 78181 252416
9149 252416 177552 254276 -18741 215202 154301 321684 54003 204055 360090 -115520 89832
9137 156050 136295 231513 285233 348234 184345 311891 -15651 333695 44991 -10746 34630
9125 293336 357784 150439 123316 136327 206892 62595 233084 134319 345610 155219 164971
9114 164971 49545 160903 293515 212147 401145 246584 167403 71258 328484 98376 213082
9103 213082 136942 306199 161536 205025 339843 315392 169920 156076 217196 501491 193918
9091 84438 109716 178207 366641 136547 296568 275423 391096 287849 248943 356331 186411
9080 186411 427970 373020 297268 385528 336299 246034 375162 434573 252296 313266 223736
9069 223736 234415 164049 298606 237362 391884 258407 225297 148889 196647 241165 344919
9058 344919 213434 391636 180742 230972 137245 215781 406774 172218 118662 232830
9048 232830 174188 154780 168911 270592 133129 72763 253793 172437 108270 343066 106387
9036 104663 109938 308991 137387 101665 142569 187250 184724 102930 335211 309534 201069
9025 201069 24305 314011 309366 267287 175160 95054 303200 146762 -40716 -33782 169038
9013 272428 135578 263345 132583 28334 256392 283453 140086 65188 100649 -48639 48875
9001 -55063 -4836 177715 114346 162881 10518 200937 282357 86063 211679 151169 107691
8990 107691 165153 329613 188608 394184 -8344 230699 91297 266938 348967 18597 205495
8979 205495 192186 79243 15886 231119 340501 142864 99870 -13894 118879 126157 139735
8968 139735 193016 46471 155353 118861 198816 338653 398682 44045 261473 155697 203307
8957 203307 303058 198037 232924 8640 193635 211610 412485 -26000 -72805 374401 133585
8945 419420 21124 309501 313580 197232 288557 145381 157237 267371 162161 -57505 280692
8933 354634 189439 147515 279720 119128 475329 196723 282659 274154 314820 237164 242193
8922 242193 335632 -5944 287609 340100 72050 423850 93687 134930 299576 101050 61824
8911 61824 380914 444149 113247 294262 125656 299733 384625 442534 316072 189426
8901 189426 415637 664848 335499 335470 604964 366892 439122 455811 285096 471292 495753
8890 495753 356611 287562 422888 313141 504323 349979 413641 537778 599472 589259
8880 589259 342032 302753 287214 655628 505947 222824 447583 413276 641323 423976
8870 423976 387349 590239 491174 433971 512786 381069 644322 426005 368970 535111 176407
8858 219604 574620 600191 388789 448453 296425 380565 210600 559621 150929 376929
8848 376929 281478 363545 258993 471798 217508 279941 367758 323697 282629 248110 516478
8837 516478 239693 525470 227749 283051 207530 224382 142439 146388 281227 298625 184343
8826 184343 175523 240564 373273 56646 136384 3100 409896 317369 29345 81606 74318 93393
8814 93393 176911 176405 290222 122073 177071 79598 135490 107231 219764 121386 378253
8803 378253 98961 290542 256400 264891 114097 147095 139519 190954 62499 240850 204883
8792 204883 285768 213019 297155 103735 403331 10954 74488 203241 296255 162664 198518
8781 198518 182563 397875 148228 260758 235285 59141 -119642 130435 89916 370501
8771 370501 241048 213755 369018 304573 173722 149765 268039 98470 145587 179251 188324
8760 188324 39768 128297 84220 40867 84196 112328 171835 160807 82238 167714 74899 51534
8748 51534 332451 157311 305666 143905 89857 376975 -84167 240367 105755 239954
8738 239954 312031 51748 67731 83889 257782 82307 274791 -99983 248840 138112 150050
8727 150050 128415 212008 145638 77999 63119 249021 70881 -111052 -18808 295588 359497
8716 359497 208997 214719 12779 257364 60508 387595 67780 327165 63354 346010 178221
8705 178221 157554 309057 78387 271513 271297 123048 87658 250681 122515 -108151 118800
8693 -198023 160593 -57068 331982 350857 212721 26818 309012 35717 105786 209075 -92590
8681 163988 624 -41984 165124 30850 44961 175350 63947 318794 -45154 209272 384101
8670 384101 477280 157071 45955 17319 140560 275086 39892 239152 229041 156560 104664
8659 104664 31328 198195 232055 368037 74229 39086 271047 200840 106664 -53078 68456
8647 273859 190544 276444 230328 -87941 85420 195473 287992 -73642 208779 87304 53832
8636 53832 14047 219355 93993 209287 68800 -438 45622 270218 154078 93962 141042
8625 141042 141225 316541 80920 46400 52224 -18142 212804 9643 -56700 175983 163829 106927
8613 106927 80208 182927 147033 99820 134468 131088 -95088 12401 220971 133691 141088 171111
8601 171111 -22415 181280 120836 -32981 300878 149134 -119972 135334 76607 240429
8591 240429 -83448 299773 322886 103750 102514 229026 81710 44881 121032 -2034 381676
8579 -88887 118562 284941 309247 286492 145052 295163 141522 -21547 152460 158893 221964
8568 221964 138156 207225 -44717 139607 -33427 133373 -7856 130735 12766 52530 185850
8557 185850 151573 84055 -73946 12521 431021 54206 108786 67042 297691 91401 80858
8546 80858 216255 158051 127385 386584 154100 148868 -2060 -64827 283443 244317 299303
8535 299303 57813 299308 216334 254987 304171 -77763 141159 159368 172787 56438 190227
8524 190227 390268 172673 153652 254345 2342 196765 132872 255087 162563 154160 151074
8513 151074 131022 49001 5995 34343 157204 -11693 265923 12993 -34118 342123 112909
8501 256613 281090 182225 45258 171825 223327 213936 155615 -41571 145934 158572 191355
8490 191355 -49142 315033 256335 68320 121923 448494 205790 388970 95933 -55752 -14588
8478 275421 -112526 123968 117847 65659 270495 126257 84193 161501 56617 202145 -2589
8466 163283 54189 140112 166933 13926 107117 183994 193733 169316 -167279 93899 233340
8455 233340 224888 281709 34875 76573 -58871 213423 52764 552 -6727 243930 130598 274852
8443 274852 209097 216573 -31942 51092 82918 69266 102653 251640 61590 248102 7494 27830
8431 27830 -12463 64003 25166 371649 21407 317759 135419 96582 193016 220438 198226
8420 198226 25441 282618 60860 -18477 111876 116507 90503 118582 104523 100843 132888 170148
8408 170148 -56211 31572 83179 285773 -33024 2489 273165 238954 163040 110474 7829 109122
8396 109122 65640 175997 43257 80495 133524 128841 188141 124522 -157218 163303 157709
8385 157709 162236 65310 190339 335871 37206 -135155 314230 328918 202006 71460 71115
8374 71115 147768 64467 120079 283698 119443 -62571 231620 134163 295842 38233 128722
8363 128722 33508 152799 15915 23942 19 -66411 159317 -339 156067 7702 -5386 164750
8350 131346 90759 279652 175225 187071 -8058 152173 207394 20162 51080 461295 88460
8338 204715 97947 75223 28182 265729 104652 144676 190397 242449 142465 247931 134012
8327 134012 59423 56535 38411 -15214 90276 63936 260904 140943 234918 -132910 210691
8315 124114 208516 120702 19432 152985 19968 66113 101335 72287 297741 99440 87556
8304 87556 -8982 -25176 259875 326565 93468 166967 260690 -7569 -237371 -21828 212402 -117470
8291 -149005 100264 295778 281314 258426 149248 324877 130650 29505 194092 162402
8281 162402 -107978 195257 129674 268838 129807 98831 27360 134354 110081 -49671 382259
8269 62085 128988 98683 102906 103165 168229 118959 101446 72779 -42250 54017 39429 118746
8257 118746 199990 -32503 294339 272010 239966 381515 145753 12369 24611 -14878 139803
8245 3251 225038 142078 69175 5963 63011 105238 77106 55242 36858 77817 289797 107986
8232 228620 164841 160926 166139 299441 364548 119819 202559 46503 54831 -27297 211027 -67155
8219 9096 -74773 149918 297843 81530 38661 240345 72477 -150412 167898 -95363 98138
8207 160213 -117008 238322 277217 128120 89214 194637 120999 318744 -157088 48321
8196 157018 -114937 231541 151589 -41153 156449 141685 229320 145461 208557 -8797 -72113
8185 -72113 31792 111535 -43371 192323 111030 74679 -20490 250276 235920 413635 -213184
8173 109011 165456 108655 316994 -63292 168932 42767 63226 428366 159373 147236 203041
8162 203041 -107760 30492 143087 61957 206280 70486 -86776 94081 28214 -135700 40153
8150 -2237 -106846 -24121 111388 242751 23380 91022 14331 285464 237623 -51823 249310
8138 142766 284767 88550 165728 97741 -43801 -43769 88379 -14799 110212 191303 40780 -2224
8125 12014 -953 7495 148345 226394 74769 78592 18934 -49365 41185 416755 -31623 474820
8112 29826 77880 50436 -155994 14209 282703 202636 46765 23199 85692 98606 174146
8101 174146 316458 83727 67977 368035 47801 57248 40066 246316 144123 53347 453045
8090 453045 60001 204391 -10041 -8828 49106 255146 140438 150243 264551 57151 61235
8079 61235 -23966 157753 47275 300169 79831 166954 22005 32987 63661 -18975 116693
8067 -64005 187888 103884 254433 106041 141471 83547 -5937 28661 215428 34866 48688
8056 48688 261750 31486 9498 178460 -73540 184128 61544 88544 126422 17986 214653
8045 214653 229310 31955 -86624 162065 211369 21266 277992 246813 141980 158051 282381
8034 282381 -231650 -4783 78252 309784 63949 271075 -17103 -51624 160726 280778 -38578
8022 -51024 149503 25048 189539 50195 435024 2519 84269 70964 164136 146634 -14466
8010 135173 -227000 41718 84165 112718 -41169 -8272 125660 119618 131495 87178 -122313
7998 251039 -32645 -21000 16562 331309 -16627 124419 -203400 35542 248708 171972 -11707
7986 186717 -5867 -69466 93072 136747 -245446 7035 -170268 156542 -149702 143800 65953
7974 242938 139039 -49225 57852 146167 94434 -13210 19282 217421 308469 34578 205520
7963 205520 122123 113467 -89598 172944 212035 -43335 75967 54501 -3829 219623 -20773 -60471
7951 -60471 116357 122849 -34206 300684 -144154 70236 31208 270770 130118 96166 -64840
7939 74205 207004 229117 140441 -27383 -186826 120222 216200 100717 196767 -232681 122252
7927 180456 164798 -36120 114589 167135 -132918 -24584 -38430 111185 112609 75342 -105986
7915 337182 302754 127246 132899 41506 119291 258203 -32008 -58412 126846 149794 -241854
7903 10956 38481 279027 51187 -170759 181360 225256 -223334 -188747 -88348 117549 114555
7892 114555 44880 153550 -37091 14492 135507 29517 7766 81944 124099 105739 -70238
7880 222159 195957 167553 -97525 172607 -160531 -134167 33755 175182 -176790 53622 211334
7869 211334 117155 46162 21038 18944 118898 -54737 298050 -62006 159484 62015 41834
7858 41834 7432 31755 -58862 -24387 401322 48527 92210 -40627 94484 42369 167928 -17006
7845 271225 26352 75633 213427 34577 -74529 286949 152330 216939 340083 246967 36342
7833 117484 80604 50252 109205 72517 318425 85497 147111 75792 -17723 25835 -11885
7821 144314 192089 23101 -136853 66564 25490 -90988 184080 51811 -39886 89338 174757
7810 174757 239476 -20162 156564 97897 118637 47026 146422 337016 128098 -78396 241750
7798 78889 240379 11525 193643 133963 142921 52762 64475 106301 121427 -104157 60822
7786 27399 258774 133421 249251 46089 79750 57055 -31842 240092 144261 25609 70002
7775 70002 273546 -122615 83545 286637 42059 74156 351437 166551 117339 51158 128658
7764 128658 109202 -104960 127779 -95906 8888 152676 207869 -126372 -77557 67701 140257
7753 140257 93984 4422 151350 223658 56491 95763 28803 338609 -101105 134311 132809
7742 132809 49312 -38152 63230 -265942 274384 21810 -23196 131337 74708 178686 259721
7731 259721 -11479 63215 -40181 -50815 -104 -60872 109465 144754 166363 199306 -47439 28257
7718 -12843 31828 45327 -102957 147390 138792 1096 95439 -46816 -10477 410501 182278
7706 57571 200783 270035 191201 41833 98801 127969 70797 -100486 -125625 47123 -54621
7694 -50795 30491 -135659 -112398 205019 -104826 132130 113313 20126 77511 197645 119645
7683 119645 -70087 -162507 100708 195925 174169 128768 40719 -282601 9785 -124534 168954
7671 -19301 226521 78448 113947 140288 -92699 40569 191727 190769 68719 12767 -67554 1188
7658 142425 223522 65019 166607 104019 214890 -31593 121397 -22810 -32543 14264 108841
7647 108841 3796 214387 52538 -248373 -67133 160730 24089 158997 91615 -22323 23818
7635 263019 115867 82729 143432 -112798 251185 218444 -75099 101839 -7645 63288 136837
7624 136837 205012 303946 125602 130884 90718 94025 138124 -92241 -127315 -14757 96560 -207550
7611 43151 254774 -11936 272208 47307 191819 -63183 -69264 -53250 46688 212813 73749
7599 -29472 10673 -39729 76984 -135717 122431 223171 176538 207661 101520 110440 27963
7587 151762 70498 -8679 141757 -39832 -91771 -65685 116491 87437 195180 159028 222896
7576 222896 73218 70509 -113081 136141 100060 62138 149660 166165 83573 89445 17462 39037
7564 39037 250371 -3086 -95064 48483 74044 34068 77710 306515 17942 122343 115634 117507
7552 117507 111836 -57618 316829 68066 -3521 97610 56665 115996 195581 311698 182893
7541 182893 -97726 211977 17095 -7488 5911 -72429 257371 132203 217574 6248 314868
7530 314868 -16434 302925 147762 297237 110966 -74965 85314 130119 148986 -86955 192848
7518 97348 -57784 178913 -62457 41778 128703 -104294 7190 114351 108119 56778 96632 -19998
7505 -106441 116648 -65990 31766 46123 196504 -11076 -92540 15309 -51647 131574 -65656
7493 77237 209103 -74495 60613 145098 130341 -30050 167817 376854 68767 115961 148373
7482 148373 73158 -110990 84419 173388 29247 91650 187266 87128 -18539 19215 -32767
7470 166625 19075 86288 -33611 74693 -1067 -37615 73226 185441 42531 -51095 46386 -19550
7457 195472 146392 100023 24221 65794 218734 86516 148483 92703 -107217 44476 -170030
7445 80683 198865 172437 116707 34133 -122654 248613 78594 -175701 197895 67946 227966
7434 227966 41796 13921 -84520 95478 -108939 -14927 107206 210953 91515 151511 -40529
7422 95418 26355 162283 64604 -66025 267805 186036 127394 242489 -1985 151906 73724
7410 226772 269491 154718 28029 138343 -69027 101018 168348 193317 45226 151050 -2243
7398 163576 148672 138485 83992 70362 -33289 -33017 4114 203844 123300 187556 104904 28508
7385 -10217 117717 -62296 113870 114291 120010 81425 22021 109583 166135 -400 -108779 -35227
7372 -56491 -21642 107360 163891 -23347 195952 86311 -450 -77799 -160829 -59315 99593 106245
7360 106245 160377 -45427 -20400 -2383 230150 110875 116638 -57893 -54045 28243 74427 -182834
7347 -46083 180842 27555 73073 149858 127746 90863 196015 -133207 -1993 179215 118091
7336 118091 401101 -69419 -142961 50310 -10904 75370 87279 125251 40999 -92708 -15386
7324 65856 -100396 75381 153036 158487 244576 -26686 -45242 67432 -30604 83414 -2449 80300
7311 -84003 -74383 35236 210707 32170 81029 -59714 73400 150825 6195 -147886 -156615 166624
7298 243271 72445 18947 8679 -3 806 -214250 -37699 214455 14905 77657 9631 -81641 90960
7284 63204 228151 -15791 102496 -15155 149486 181197 -4267 149290 -21664 70653 -45737
7272 169059 -107394 -65837 97224 139864 -81276 108934 106752 209643 -72283 -18205 -72299
7261 -72299 52033 -12815 69797 102389 -178713 154816 36422 94733 100102 255710 -64864
7249 -67687 -9231 63875 113786 -198294 99250 -204924 -23828 82257 104439 189302 172486 320739
7237 320739 19385 -27408 143074 100936 24661 105965 -56470 64049 -27908 -49200 -19015
7225 94353 -110374 161778 41598 -293466 -29486 13065 116899 213776 165727 42273 77844
7214 77844 146251 56273 211597 229305 -70113 144798 -198538 231985 -116744 123240 95814
7203 95814 175136 140283 209187 24872 -81508 64224 -272224 15211 45779 126078 29961 94800
7191 94800 18150 -67836 191058 -43507 196761 126206 141940 -53330 143754 -204738 200655
7179 23377 80002 159196 38819 49063 130931 70786 137219 2859 -39558 -7921 -10209 -3437 -201473
7166 -201473 120317 -43997 -100735 -20126 195070 187907 69013 -7331 213301 -5540 5285 29022
7154 29022 65263 28548 61296 -37438 -123030 86315 696 107360 -66501 169315 -206640 -11917
7141 185660 191326 122497 272286 -11049 165766 -34544 56224 38791 267368 16162 -123777
7129 113872 49090 237352 227161 -148871 186710 -86628 18726 185773 105856 115482 -39259
7117 200185 -5093 124716 -7182 119186 54237 118788 105129 18374 133218 175892 17839
7105 84775 240164 134035 73059 290019 7825 -18175 -62904 139738 396313 -4028 60663
7093 68555 -103211 -19670 157763 19450 135876 73035 95800 123192 40643 5540 225179
7082 225179 218337 224933 -131325 46102 -22617 4518 87118 101886 -104599 12338 228177 -66514
7069 113940 112462 225764 -49180 -10304 55861 -34799 243982 119634 312054 309070 107837
7057 17641 -46424 -22973 122643 33964 -131246 -20720 17327 131444 11225 133109 -163359
7045 116732 225730 113351 -57770 140727 131123 110403 -302502 247281 -30827 155223 -215361
7033 423 104399 230068 33539 55600 -69966 66190 98792 199203 24899 66414 149731 -69506
7020 159227 -65112 -61751 63851 57157 78452 49361 337437 18746 149258 198025 -112823
7008 194425 94914 159926 -39309 -144801 42459 -4738 -53154 103929 115905 203558 -138687
6996 22774 112077 159323 -227850 -53403 -6546 4453 71550 157056 18857 60783 90142 219519
6984 219519 -36145 85554 146869 45394 70441 -103117 102334 197657 -164 44951 110941 13676
6971 -81283 189381 -60635 23361 117880 15268 193671 7765 2628 156921 126601 87163 42254
6958 -43871 -81833 292116 -72869 -72802 80092 33050 -189135 -2011 8292 204419 -71732 -24186
6945 174704 35115 7933 60586 45178 400141 88562 127652 77567 30649 40192 -71692 101868
6932 83653 7149 23571 172740 49372 257691 -154746 143579 11907 -51910 131923 167893
6921 167893 55091 -69607 200194 124837 -51232 -101851 188636 -65906 96052 180547 139600
6910 139600 166749 -7133 104713 -32360 -62294 210091 213792 18245 206962 30572 -55404
6898 209022 -95032 168081 259106 25996 -36535 137840 56283 98470 -87421 152290 169242
6887 169242 89453 311348 -48076 17774 52196 204963 86778 62097 34650 -2691 -16102
6876 -16102 155712 -153531 108684 16415 65803 179162 -15951 139454 40116 115998 -37254
6864 -3966 -81557 -13876 89292 -40807 -123601 -188177 -94342 162803 -58956 -126332 94188 149205
6852 149205 225850 -44478 39802 128506 69623 177896 -175133 194715 15070 380908 124352
6840 -167805 -75841 -1685 68232 31315 41802 -22842 77036 225906 198258 10445 119239
6829 119239 302373 85726 163669 -94189 248310 168171 109737 7938 59366 -77894 125037
6817 163242 59571 80599 -17814 115531 126519 -52571 116483 116626 -6889 132011 28689 -163169
6804 -121670 -70059 160772 42721 151434 85935 -101263 42445 -44037 113297 226055 -70852
6792 -102033 -42240 47060 155360 44353 -27669 5554 -67011 -3528 225016 131968 57117 -38278
6779 32995 190311 -162254 76132 19859 -106860 182175 -213101 137430 -177624 196939
6768 -138699 179101 91148 127025 212996 -114504 258608 -34250 242817 188794 85361 101817
6757 101817 -106094 -111557 -67330 73859 189066 161615 129397 256303 -106258 -219261 -69969
6745 -66003 -76655 230979 139668 180769 79 -46710 104516 -265057 105201 73120 250151
6734 250151 73467 134786 160920 109839 18156 -77895 78039 63267 276750 258947 -147916
6722 44283 117647 -87288 165499 51133 286849 114878 26170 -145688 208906 -36861 40555
6710 118482 92091 224279 -88249 120921 42119 -149270 58817 128638 -104773 65443 112974
6699 112974 -183660 75609 58835 200590 204909 -5215 -69039 288553 -962 -9635 99149 652
6686 145729 66732 123207 -26022 -93312 132684 147641 207936 175928 -149240 -121645 246621
6674 136097 12538 92224 -171088 183057 177935 -76300 184091 -17094 -151644 -14858 91420
6662 -16029 219264 -37024 -143884 -24453 67937 49333 -155291 66556 18677 -208534 19293
6650 8695 -97881 135945 74366 158635 380130 34023 -16110 -34201 75207 -111855 6673 184469
6638 184469 72488 108911 58823 9148 144296 109987 141398 142130 102212 217069 193103 -47329
6625 85328 19565 205197 80622 49769 173784 152854 157521 30951 68708 15446 104182 38111
6612 -80389 34801 -16400 45380 96218 -161626 286384 -53629 -50388 146443 -15591 41671
6600 243781 196642 132542 2968 -64242 -25804 84259 -72778 57448 -155040 103840 93589
6589 93589 113083 28443 146954 35376 114182 2068 1710 -120106 76506 60849 295720 212056
6577 212056 152424 -27184 -102282 202905 24025 -42636 160997 31049 23562 182464 138605
6566 138605 -26607 367181 -1807 67077 1150 78869 98975 -104870 154054 301818 108266
6554 -136548 68232 -77062 102640 75067 150666 149857 146190 -36874 -117693 414926 -90077 -144707
6542 -144707 -148176 -134879 -85384 34934 121917 -100869 -66827 -141272 187548 96123 -65648
6530 33068 83143 231651 -30018 -85266 212241 -13970 199853 60860 64166 143088 -13457
6518 41569 -86007 154346 -39829 95680 222862 108034 258051 -23296 85995 39761 -45993
6506 -141396 56053 79572 16311 19045 79893 -27722 78291 -125975 -134416 -113334 -95869 27291
6493 74333 104665 -22991 42632 58082 161834 -149335 247775 145367 -84680 -208021 252712
6481 -62788 -48569 131092 -103220 320421 126898 140831 267902 -133676 258469 -10858
6470 9677 56063 -104703 -117509 90418 -60980 -288262 118228 2276 312880 113691 -355428
6458 -66417 200668 118530 238344 46057 77946 92712 23213 112855 -38879 38885 116163
6447 116163 57067 -33749 -40822 -31006 -32633 99802 -222720 102607 235590 193479 202912 223052
6435 223052 64094 -11538 -211899 -51381 -98507 138881 36291 -59410 175662 59235 -235771
6423 -57217 33756 185585 71227 119848 154201 -29766 287763 -139524 264725 -39164 128777
6411 24273 -51838 46467 93863 38653 -91923 22101 74959 143498 -66107 84231 151940 38006
6398 -180949 264588 117103 -176677 106418 244202 -21015 28494 84690 -200051 271991
6387 72063 39912 6387 131835 8196 -111460 -80533 117919 98320 279161 119620 -469 81948
6374 -151322 248275 -202430 186923 -77747 147882 110407 218957 254774 -70044 140137
6363 79910 168539 184852 10466 -56764 94363 270262 64874 17618 244302 87262 -135425
6351 -89938 145217 -54668 65685 342213 23357 50171 240354 -160457 -27395 135901 -61659
6339 -129766 26779 -11188 -12702 -15254 172120 99123 59621 -142465 22365 100908 -53888 50569
6326 31946 143927 -6026 67986 160306 318318 -21114 -6815 -76614 269025 156282 -16203
6314 309673 -7567 -79125 156909 41135 11288 97601 -99161 141965 175638 -47417 90626
6302 -60708 10561 -82639 -184145 120717 -50708 -263079 -77166 -138273 30388 165612 -30325
6290 -76037 -95024 251028 50029 25492 -62024 187608 191832 393510 329179 -21884 11892
6278 -129162 230038 44370 149640 -57594 -96788 -24161 130746 -12637 -28855 20371 -11559
6266 186248 22902 172026 -28245 98492 304679 -36842 -35170 -113179 81986 -20349 -3313 34057
6253 218074 114841 -147438 67880 -136586 121856 175396 143191 249108 346517 10076 42613
6242 42613 24807 40061 -76672 138981 14999 64380 -48809 -105334 215655 -5645 -290333
6231 -290333 176044 54345 -55719 68501 21012 82788 184013 199410 84034 158312 100346
6220 100346 306287 214960 73026 151722 -106653 100358 -5526 269266 117795 50503 -99086
6208 -30228 193464 159805 -44973 77625 280035 -150708 227852 136100 -53168 148646 128863
6197 128863 185689 159120 -328744 10293 -7778 21339 83629 93830 85874 -72559 241013 -111229
6184 113028 1448 105531 40168 45012 227890 -12877 52815 -67054 -35965 -143279 -164018
6173 -164018 95998 -72508 66705 20701 -3600 87998 -201099 33588 -117315 54938 -148171
6161 174258 146122 98045 166289 -132 84707 135288 -142235 -25939 -151205 -68974 46489 33847
6149 33847 -106783 64487 87419 123165 171189 35106 11283 -71407 29429 107235 25458 296556
6137 296556 -90076 55056 163588 -11481 51880 129836 148244 -146178 195768 68597 21936
6125 122261 -104153 -15519 352315 -61906 -39410 136377 -120008 157644 39140 217033
6115 217033 69326 14913 47709 125182 41693 72994 -12754 84638 26086 51534 92299 119082
$$ [...]
##END NTUPLES=NMR SPECTRUM
##END=
