##TITLE=Coffee green (M3-ROVE60 + 1.5mL buffer 50/50,  450uL extracto + 50uL (D2O+TMS))
without heating, vortex and centrifuged, temperature 0oC.
##JCAMPDX= 6.0         $$ Bruker NMR JCAMP-DX V2.0
##DATA TYPE= NMR SPECTRUM
##DATA CLASS= NTUPLES
##ORIGIN= Bruker BioSpin GmbH
##OWNER= Administrator
$$ 1.72 TOPSPIN		Version 2.1
$$ 2012-05-22 16:14:32.293 -0700  Administrator@X
$$ Compression mode = diff/dup
##.OBSERVE FREQUENCY= 400.13188198
##.OBSERVE NUCLEUS= ^1H
##.ACQUISITION MODE= SIMULTANEOUS (DQD)
##.ACQUISITION SCHEME= undefined
##.AVERAGES= 64
##.DIGITISER RES= 22
##SPECTROMETER/DATA SYSTEM= spect
##.PULSE SEQUENCE= noesygppr1d
##.SOLVENT NAME= H2O+D2O
##.SHIFT REFERENCE= INTERNAL, H2O+D2O, 1, 14.97969
##AUDIT TRAIL= $$ (NUMBER, WHEN, WHO, WHERE, PROCESS, VERSION, WHAT)
$$ ##TITLE= Audit trail, TOPSPIN		Version 2.1
$$ ##JCAMPDX= 5.01
$$ ##ORIGIN= Bruker BioSpin GmbH
$$ ##OWNER= Administrator
$$ $$ C:\Bruker\TOPSPIN/data/jwist/nmr/11-coffee-green-quantification-2/231/pdata/1/auditp.txt
$$ ##AUDIT TRAIL=  $$ (NUMBER, WHEN, WHO, WHERE, PROCESS, VERSION, WHAT)
(   1,<2011-11-18 13:26:46.997 -0500>,<Administrator>,<TOPSPIN>,<go>,<TOPSPIN 2.1>,
      <created by zg
	started at 2011-11-18 13:17:50.216 -0500,
	POWCHK enabled, PULCHK disabled,
       configuration hash MD5:
       DA 63 81 1B EF 4C B5 72 B4 DF EA D9 B4 DB 4C 08
       data hash MD5: 64K
       30 56 47 37 DE B8 B5 BD 3C C9 BB 15 DA C3 DF 40>)
(   2,<2011-11-18 15:24:45.950 -0500>,<Administrator>,<TOPSPIN>,<proc1d>,<TOPSPIN 2.1>,
      <Start of raw data processing
       efp LB = 0 FT_mod = 6 PKNL = 1 PHC0 = 0 PHC1 = 0 SI = 32K 
       data hash MD5: 32K
       6F CB B2 76 5F 44 54 4A 47 20 2B 05 BA 5C 3C B0>)
(   3,<2011-11-18 15:24:46.357 -0500>,<Administrator>,<TOPSPIN>,<proc1d>,<TOPSPIN 2.1>,
      <pk PHC0 = 23.34595 PHC1 = 0 
       data hash MD5: 32K
       9F 94 68 EF 18 CC 01 C0 6C 9C 03 BE 76 AA B2 F6>)
$$ ##END=
$$ 
$$ $$ hash MD5
$$ $$ 5D 7D 86 B2 01 9E F1 9A E0 59 E8 73 E1 34 2B 9A
##$RELAX= 
##$RELAX= 
##$RELAX= 
##$RELAX= 
##$RELAX= 
$$ Bruker specific parameters
$$ --------------------------
##$DU= <Z:>
##$EXPNO= 231
##$NAME= <11-coffee-green-quantification-2>
##$PROCNO= 1
##$TYPE= <nmr>
##$USER= <jwist>
##$ACQT0= -8.19719866817466
##$AMP= (0..31)
100 100 100 100 100 100 100 100 100 100 100 100 100 100 100 100 100 100
100 100 100 100 100 100 100 100 100 100 100 100 100 100
##$ANAVPT= -1
##$AQSEQ= 0
##$AQ_mod= 3
##$AUNM= <au_prof>
##$AUTOPOS= <>
##$BF1= 400.13
##$BF2= 400.13
##$BF3= 400.13
##$BF4= 400.13
##$BF5= 400.13
##$BF6= 400.13
##$BF7= 400.13
##$BF8= 400.13
##$BYTORDA= 0
##$CFDGTYP= 0
##$CFRGTYP= 9
##$CHEMSTR= <none>
##$CNST= (0..63)
1 1 145 1 1 1 1 1 1 1 1 1 1 1 1 1 1 1 1 1 1 1 1 1 1 1 1 1 1 1 1 1 1 1 1
1 1 1 1 1 1 1 1 1 1 1 1 1 1 1 1 1 1 1 1 1 1 1 1 1 1 1 1 1
##$CPDPRG= <>
##$CPDPRG1= <>
##$CPDPRG2= <>
##$CPDPRG3= <>
##$CPDPRG4= <mlev>
##$CPDPRG5= <mlev>
##$CPDPRG6= <mlev>
##$CPDPRG7= <mlev>
##$CPDPRG8= <mlev>
##$CPDPRGB= <>
##$CPDPRGT= <>
##$D= (0..63)
$$ [...]
##$TP= (0..7)
150 150 150 150 150 150 150 150
##$TP07= 0
##$TPNAME0= <>
##$TPNAME1= <>
##$TPNAME2= <>
##$TPNAME3= <>
##$TPNAME4= <>
##$TPNAME5= <>
##$TPNAME6= <>
##$TPNAME7= <>
##$TPOAL= (0..7)
0.5 0.5 0.5 0.5 0.5 0.5 0.5 0.5
##$TPOFFS= (0..7)
0 0 0 0 0 0 0 0
##$TUNHIN= 0
##$TUNHOUT= 0
##$TUNXOUT= 0
##$USERA1= <user>
##$USERA2= <user>
##$USERA3= <user>
##$USERA4= <user>
##$USERA5= <user>
##$V9= 5
##$VALIST= <valist>
##$VCLIST= <CCCCCCCCCCCCCCC>
##$VD= 0
##$VDLIST= <DDDDDDDDDDDDDDD>
##$VPLIST= <PPPPPPPPPPPPPPP>
##$VTLIST= <TTTTTTTTTTTTTTT>
##$WBST= 2048
##$WBSW= 25
##$XGAIN= (0..3)
0 0 0 0
##$XL= 0
##$YL= 0
##$YMAX_a= 5480019
##$YMIN_a= -2197588
##$ZGOPTNS= <>
##$ZL1= 120
##$ZL2= 120
##$ZL3= 120
##$ZL4= 120
##$ABSF1= 0
##$ABSF2= 0
##$ABSG= 0
##$ABSL= 0
##$ALPHA= 0
##$AQORDER= 0
##$ASSFAC= 0
##$ASSFACI= 0
##$ASSFACX= 0
##$ASSWID= 0
##$AUNMP= <proc_prof1d>
##$AXLEFT= 0
##$AXNAME= <>
##$AXNUC= <1H>
##$AXRIGHT= 0
##$AXTYPE= 0
##$AXUNIT= <>
##$AZFE= 0.1
##$AZFW= 0.1
##$BCFW= 0
##$BC_mod= 0
##$BYTORDP= 0
##$COROFFS= 0
##$CY= 15
##$DATMOD= 1
##$DC= 0
##$DFILT= <>
##$DTYPP= 0
##$F1P= 0
##$F2P= 0
##$FCOR= 0.5
##$FTSIZE= 32768
##$FT_mod= 6
##$GAMMA= 0
##$GB= 0
##$INTBC= 1
##$INTSCL= 1
##$ISEN= 128
##$LB= 0
##$LEV0= 0
##$LPBIN= 0
##$MAXI= 10000
##$MC2= 0
##$MEAN= 0
##$ME_mod= 0
##$MI= 0
##$NCOEF= 0
##$NC_proc= -6
##$NLEV= 6
##$NOISF1= 0
##$NOISF2= 0
##$NSP= 0
##$NTH_PI= 0
##$NZP= 0
##$OFFSET= 14.97969
##$PC= 1
##$PHC0= 23.34595
##$PHC1= 0
##$PH_mod= 1
##$PKNL= yes
##$PPARMOD= 0
##$PPDIAG= 0
##$PPIPTYP= 0
##$PPMPNUM= 2147483647
##$PPRESOL= 1
##$PSCAL= 4
##$PSIGN= 0
##$PYNMP= <proc.py>
##$REVERSE= no
##$SF= 400.13
##$SI= 32768
##$SIGF1= 0
##$SIGF2= 0
##$SINO= 400
##$SIOLD= 32768
##$SPECTYP= <>
##$SREGLST= <1H.CDCl3>
##$SSB= 0
##$STSI= 32768
##$STSR= 0
##$SW_p= 8223.68421052631
##$SYMM= 0
##$S_DEV= 0
##$TDeff= 65536
##$TDoff= 0
##$TI= <>
##$TILT= no
##$TM1= 0
##$TM2= 0
##$TOPLEV= 0
##$USERP1= <user>
##$USERP2= <user>
##$USERP3= <user>
##$USERP4= <user>
##$USERP5= <user>
##$WDW= 1
##$XDIM= 32768
##$YMAX_p= 316355015
##$YMIN_p= -69813641
##$CURPLOT= <Network HP LaserJet P1505>
##$CURPRIN= <$Network HP LaserJet P1505>
##$DFORMAT= <normdp>
##$LAYOUT= <+/1D_H.xwp>
##$LFORMAT= <normlp>
##$PFORMAT= <normpl>
##$SURQMSG= 1
$$ End of Bruker specific parameters
$$ ---------------------------------
##NTUPLES= NMR SPECTRUM
##VAR_NAME=  FREQUENCY,     SPECTRUM/REAL,   SPECTRUM/IMAG
##SYMBOL=    X,             R,               I
##VAR_TYPE=  INDEPENDENT,   DEPENDENT,       DEPENDENT
##VAR_FORM=  AFFN,          ASDF,            ASDF
##VAR_DIM=   32768,         32768,           32768
##UNITS=     HZ,            ARBITRARY UNITS, ARBITRARY UNITS
##FACTOR=    0.250966925370066, 1,           1
##FIRST=     8223.43324360094, -10426,       -239917
##LAST=      0,             35396,           -215257
##MIN=       0,             -69813641,       0
##MAX=       8223.43324360094, 316355015,    0
$$ Real data points
##PAGE= N=1
##DATA TABLE= (X++(R..R)), XYDATA
$$ [...]
19667B120454p350j23968j27588J98328k7830j38949o9501J20797j23040J49673
$$ 2120454 2113104 1989136 1861548 2059876 2032046 1893097 1823596 1944393 1821353 1971026
19657A971026N1995K8542J7983l7438J28119k25379K85281j82717j94783J27153
$$ 1971026 2023021 2051563 2069546 2032108 2160227 1934848 2220129 2037412 1842629 1969782
19647A969782k382j48613K23267n6905k24921K36452J09734m4244Q7810m4626
$$ 1969782 1967400 1818787 2042054 1985149 1760228 1996680 2106414 2062170 2149980 2105354
19637B105354k27629Q9164l8819L00774j81115Q4471J5464k43651r5311J79849
$$ 2105354 1877725 1966889 1928070 2228844 2047729 2132200 2147664 1904013 1808702 1988551
19627A988551m8429M1199l4859q8969r847K13451j90974J6688J7654K14259k05669
$$ 1988551 1940122 1981321 1946462 1857493 1847646 2061097 1870123 1886811 1904465 2118724 1913055
19616A913055j00744J99479k10703J49677K2943q9137k384r5970j25287K49726
$$ 1913055 1812311 2011790 1801087 1950764 1973707 1884570 1882186 1786216 1660929 1910655
19606A910655k99209K26423j96178J51454j47371K8495R4722k14097K86450j53080
$$ 1910655 1611446 1837869 1641691 1793145 1645774 1674269 1768991 1554894 1841344 1688264
19596A688264J89958k20244M852R383J3467J08883q7542P2790k14879M29149k11491
$$ 1688264 1878222 1657978 1662830 1672213 1685680 1794563 1707021 1779811 1564932 1994081 1782590
19585A782590r4765P5472L09210l37175k3632m9965J15498J45792j36692p0010
$$ 1782590 1687825 1763297 2072507 1735332 1711700 1661735 1777233 1923025 1786333 1716323
19575A716323j06063K3536J57171l6592j40688N4290J72418k4815J20915k77516
$$ 1716323 1610260 1633796 1790967 1754375 1613687 1667977 1840395 1815580 1936495 1658979
19565A658979K68299l16585n355J61850j56192M4265M0057J25297k0020j82356
$$ 1658979 1927278 1610693 1605338 1767188 1610996 1655261 1695318 1820615 1800595 1618239
19555A618239L44m9124M5056J13114l2268j73624J78036j31810J88227j7931l34437
$$ 1618239 1618583 1569459 1614515 1727629 1695361 1521737 1699773 1567963 1756190 1738259 1403822
19544A403822L18907l65811K85824j06213j6676J63169K3463j84068M9130j22380
$$ 1403822 1722729 1356918 1642742 1536529 1519853 1683022 1706485 1522417 1571547 1449167
19534A449167J9039l6904J03411k29774J94638L3855R7622j22978j4247J38841
$$ 1449167 1468206 1431302 1534713 1304939 1499577 1533432 1631054 1508076 1493829 1632670
19524A632670l26949J49706N0467O3289K5078R7509k57409J65174j15533P2672
$$ 1632670 1305721 1455427 1505894 1569183 1594261 1691770 1434361 1599535 1484002 1556674
19514A556674p989l1914K26725k06013J70475j7935k9913L812j26303j06488m9075
$$ 1556674 1548685 1516771 1743496 1537483 1707958 1690023 1660110 1663922 1537619 1431131 1382056
19503A382056L0388L69403l00183J04991m4668j8221O1378k16932l3593Q1499
$$ 1382056 1412444 1781847 1481664 1586655 1541987 1523766 1585144 1368212 1334619 1416118
19493A416118O7781j22825K86J38150j27646J53739k59382J61369j58900N5727
$$ 1416118 1483899 1361074 1361360 1499510 1371864 1525603 1266221 1427590 1268690 1324417
19483A324417q2882j22694J8959K89516P9737j47968q4616J3706J99880k14262
$$ 1324417 1241535 1118841 1137800 1427316 1507053 1359085 1274469 1288175 1488055 1273793
19473A273793M1144k1144O6065k72829K62334j82714N6615l4490j37665J76836
$$ 1273793 1314937 1293793 1359858 1087029 1349363 1166649 1223264 1188774 1051109 1227945
19463A227945j04601k1879K9994l4192l145K60518l92229R7393K58236k66937
$$ 1227945 1123344 1101465 1131459 1097267 1094122 1354640 962411 1059804 1318040 1051103
19453A051103j19459q1934K58592L7637n3464j14765P5256k105L0738j28155l5024
$$ 1051103 931644 849710 1108302 1145939 1092475 977710 1052966 1050861 1081599 953444 918420
19442I18420j02042L71636l83981K70407p3263L727j09328Q9636p9192M2289l5735
$$ 918420 816378 1188014 804033 1074440 1001177 1004904 895576 985212 906020 948309 912574
19431I12574j9170J38596j73052m7337J97620j73926J14426p6514J28176J05743
$$ 912574 893404 1032000 858948 811611 1009231 835305 949731 873217 1001393 1107136
19421A107136j40496j1145M7477K4699k22303J38400k35888J92266N9996p4815
$$ 1107136 966640 955495 1002972 1027671 805368 943768 707880 900146 960142 885327
19411H85327o9567K2622L654M994J45716J26692m9732k13886j27233J74459k9199
$$ 885327 815760 838382 842036 847030 992746 1119438 1069706 855820 728587 903046 873847
19400H73847j7190J20897k11117j17673L62342L6618q4899l3683J01401l2754
$$ 873847 856657 977554 766437 648764 1011106 1047724 962825 929142 1030543 997789
19390I97789k3072n7074J5116q3148J12653O2000l10377N3618P995J27855O5731
$$ 997789 974717 917643 932759 849611 962264 1024264 713887 767505 775500 903355 969086
19379I69086k23208J72404N0239j02206j6784R2847l3366L3662k68425L48603
$$ 969086 745878 918282 968521 866315 849531 942378 909012 942674 674249 1022852
19369A022852k91871J51822J8243j12558k7105j65365K84285j71594P4072J00880
$$ 1022852 730981 882803 901046 788488 761383 596018 880303 708709 782781 883661
19359H83661J71237k32535L7466m1357l1261l2367K46778k52795K12696j64653
$$ 883661 1054898 822363 859829 818472 787211 754844 1001622 748827 961523 796870
19349G96870J92234j39893Q711O3212l04268P4074j4238Q3185J82968j94244o3918
$$ 796870 989104 849211 857922 921134 616866 690940 676702 759887 942855 748611 684693
19338F84693M58297m34668P2504q4081L14308l08318J47377P7620k37193Q0600
$$ 684693 1142990 708322 780826 696745 1011053 702735 850112 927732 690539 771139
19328G71139j35776K02922N1021j77420J39242p6425O9240J39208r6733m6306
$$ 771139 635363 838285 889306 711886 851128 774703 843943 983151 886418 840112
19318H40112K76008q6343j03660n391j14541J75063p6626j99289K49708J7415
$$ 840112 1116120 1029777 926117 920726 806185 981248 904622 705333 955041 972456
19308I72456l09905L05392R2122j31269k70494J53128J59017q3444K3670K90726
$$ 972456 662551 967943 1060065 928796 658302 811430 970447 887003 910673 1201399
19298A201399k40255j60154J06851r7640p1241L07820L4786q5551j3728j89367
$$ 1201399 961144 800990 907841 810201 738960 1046780 1081566 996015 982287 792920
19288G92920K48767L2520n24j1179j41296P0564l3183O2938q5071J668j75151
$$ 792920 1041687 1074207 1073683 1062504 921208 991772 958589 1021527 936456 938124 762973
19277G62973o807P0847j23957L00236n1369j0188j14835J28251l8958j92578K05097
$$ 762973 756166 827013 703056 1003292 951923 941735 826900 955151 916193 723615 928712
19266I28712k22278j8245L10705j45816R4188l00658O6896p474Q148m1928J42413
$$ 928712 706434 688189 998894 853078 947266 646608 713504 706030 714178 672250 814663
19255H14663l3762m6243Q4496J44465l48902K86547j58020O3212k50383K26584
$$ 814663 780901 734658 819154 963619 614717 901264 743244 806456 556073 782657
19245G82657K17915k15815K21102O2922L56483O39n5635j22867j6762J10568J04527
$$ 782657 1000572 784757 1005859 1068781 1425264 1425903 1370268 1247401 1230639 1341207 1445734
19234A445734j43369m24490L41348l76427j48548J9166K82893j9664o0458k35109
$$ 1445734 1302365 877875 1219223 842796 694248 713414 996307 976643 916185 681076
19224F81076J66706j16316J56751L0969j58973J31826j7828P2801n5308n4583
$$ 681076 847782 731466 888217 919186 760213 892039 874211 947012 891704 837121
19214H37121p2785K14050k02274L2301q5130m3510J99540j26522m7188p7278j7184
$$ 837121 764336 978386 776112 808413 723283 679773 879313 752791 705603 628325 611141
19203F11141J28066R077j08796K40509m6946p3956o9769j71867M20683l15000
$$ 611141 739207 748284 639488 879997 833051 759095 689326 517459 938142 623142
19193F23142O2602K82852l2038r2701m3852m5005k5188J62152j00356j02945q9910
$$ 623142 685744 968596 936558 843857 800005 755000 729812 891964 791608 688663 598753
19182E98753L34529j66599k16213P2133J65531r8713k9715K09188j2230j02841
$$ 598753 933282 766683 550470 622603 788134 689421 659706 868894 856664 753823
19172G53823J9234j8777l00473L81304p9235k85761L23376j48527P294m9508J52226
$$ 753823 773057 754280 453807 835111 755876 470115 793491 644964 652258 602750 754976
19161G54976l9112K09429j3357p4375p8941K03934l1416n4655J53235r8826J10128
$$ 754976 715864 925293 911936 837561 758620 962554 931138 876483 1029718 930892 1041020
19150A041020K27545k08248L34909J7935M2396j24569J77421l8206k16108J95761
$$ 1041020 1268565 1060317 1395226 1413161 1455557 1330988 1508409 1470203 1254095 1449856
19140A449856l25903K21985M9349P4896J14223l25985r9539K95850o9444J93299
$$ 1449856 1123953 1345938 1395287 1470183 1584406 1258421 1158882 1454732 1385288 1578587
19130A578587j25273l39591J01721Q6691K46935o18612K65525j5944k13937K82347
$$ 1578587 1453314 1113723 1215444 1302135 1549070 930458 1195983 1180039 966102 1248449
19120A248449m53164L39547m6788Q4820l3727k21019J7608R0000J11531k78822
$$ 1248449 795285 1134832 1088044 1172864 1139137 918118 935726 1025726 1137257 858435
19110H58435J29511o7498J00199J16334l7199Q813M0885O5715p7909N1529J49952
$$ 858435 987946 920448 1020647 1136981 1099782 1108595 1149480 1215195 1137286 1188815 1338767
19099A338767k2867m7081q4080q7336M9420J82467j09006K31593K13872k10169
$$ 1338767 1315900 1268819 1184739 1097403 1146823 1329290 1220284 1451877 1665749 1455580
19089A455580k2989J22162K10778m9508J90149R1134L07756M71971K85239M35992
$$ 1455580 1432591 1554753 1765531 1716023 1906172 1997306 2305062 2777033 3062272 3498264
19079C498264O61378N12649J19911J12505L12349K88889l14851j59361l51228
$$ 3498264 4159642 4672291 4792202 4904707 5217056 5505945 5191094 5031733 4680505
19070D680505k15149m17476o40685l46761l80790j93858O2451l20799q2072N197
$$ 4680505 4465356 4047880 3407195 3060434 2679644 2485786 2548237 2227438 2145366 2150563
19060B150563K91494k47912P71268K77729L72204M51735J48168K70470L9210J4197
$$ 2150563 2442057 2194145 2965413 3243142 3615346 4067081 4215249 4485719 4524929 4539126
19050D539126j718k02874k33504p33730p6873l58158k56422j08013j84496L10865
$$ 4539126 4537408 4334534 4101030 3367300 3290427 2932269 2675847 2567834 2383338 2694203
19040B694203K21235L36435M59242N84103O39669L05553N94245J65064J46187
$$ 2694203 2915438 3251873 3711115 4295218 4934887 5240440 5834685 5999749 6145936
19031F145936J281j83182m28201k19802m62709o86037n64029n40128q0001j70566
$$ 6145936 6147217 5964035 5535834 5316032 4853323 4167286 3603257 3063129 2983128 2812562
19021B812562m41538Q8717K91100J46548L15491N75924L6096N97897M14869l477
$$ 2812562 2371024 2459741 2750841 2897389 3212880 3788804 3824900 4422797 4837666 4834189
19011D834189L63516k97409j70884L2382m70322n48356l59100n77073j43894m22653
$$ 4834189 5197705 4900296 4729412 4761794 4291472 3743116 3384016 2806943 2663049 2240396
19001B240396k6310M7968j66487M3006P8147L47031J87426N61135N27527L58461
$$ 2240396 2214086 2262054 2095567 2138573 2216720 2563751 2751177 3312312 3839839 4198300
18991D198300J69258M81167q6492K21711L4158K8939l68633j84319l88284j68121
$$ 4198300 4367558 4848725 4762233 4983944 5018102 5047041 4678408 4494089 4105805 3937684
18981C937684l12313M6991K04235Q7252L21668N09775O40732O74189J026749J103985
$$ 3937684 3625371 3672362 3876597 3963849 4285517 4795292 5436024 6110213 7136962 8240947
18971H240947R16161J291677J086384J349982J987012K051097J516367J570909
$$ 8240947 9157108 10448785 11535169 12885151 14872163 16923260 18439627 20010536
18963B0010536J334270P01750M63711J82962l54077p41715j373473j881892k030494
$$ 20010536 21344806 22046556 22510267 22693229 22339152 21597437 20223964 18342072 16311578
18954A6311578k169412k199964j608433j922810j273843q50536j034583n76860
$$ 16311578 14142166 11942202 10333769 8410959 7137116 6286580 5251997 4675137
18946D675137k38729n44186n40482m15701m4759k94258k20942J14613n27784L06085
$$ 4675137 4436408 3892222 3351740 2936039 2891280 2597022 2376080 2490693 1962909 2268994
18936B268994l53164O9080R8708j57165k0768k42049J68403o8529N9106K06236
$$ 2268994 1915830 1984910 2083618 1926453 1905685 1663636 1832039 1763510 1822616 2028852
18926B028852k14072J72956J03996Q6846n4632r6654J81825k62051K84891o9310
$$ 2028852 1814780 1987736 2091732 2178578 2123946 2027292 2209117 1947066 2231957 2162647
18916B162647J14382L74174l4785N8051K73982N88384J7978N43952O47364O79874
$$ 2162647 2277029 2651203 2616418 2674469 2948451 3536835 3554813 4098765 4746129 5426003
18906E426003R37268J005756J226253K018015J954969K103983J670671J604818
$$ 5426003 6363271 7369027 8595280 10613295 12568264 14672247 16342918 17947736
18898A7947736J194689N71072K48699j98009q88330j518398j637008j856950k166274
$$ 17947736 19142425 19713497 19962196 19764187 18875857 17357459 15720451 13863501 11697227
18889A1697227j861825j352930j401256j293112r27214m12861r67180k80565j42557
$$ 11697227 9835402 8482472 7081216 5788104 4860890 4448029 3480849 3200284 3057727
18880C057727q15398K32945m10974k6451j82585J6907k29750j43976j25127P511
$$ 3057727 2242329 2475274 2064300 2037849 1855264 1872171 1642421 1498445 1373318 1380829
18870A380829J5028k46396q3754Q8481k10988J29275q3776M8368r6116J32694
$$ 1380829 1395857 1149461 1065707 1154188 943200 1072475 988699 1037067 940951 1073645
18860A073645O7546j49100j75723R6848n3013P4167r4447M4296K11610j95572
$$ 1073645 1141191 992091 816368 913216 860203 934370 839923 884219 1095829 900257
18850I00257m5818j25072l3204K74499j99838J53620k76436J21158J00188r2806
$$ 900257 854439 729367 696163 970662 770824 924444 648008 769166 869354 776548
18840G76548q6344p892k66320M28800P2176j38729j6707n8635p6886K21900k61372
$$ 776548 690204 682312 415992 844792 916968 778239 761532 702897 626011 847911 586539
18829E86539L06309k25194j86040J03887J91876M5907r1365Q5910l95498K59814
$$ 586539 892848 667654 481614 585501 777377 823284 731919 817829 422331 682145
18819F82145j1770q3278L0743N6078j08951O8151J29976m6587L5596K84718n02874
$$ 682145 670375 587097 617840 673918 564967 633118 763094 716507 752103 1036821 533947
18808E33947L49568j2666j42204j00104O1426Q2267Q4321K6245p4667j00896P4251
$$ 533947 883515 870849 728645 628541 689967 772234 856555 882800 808133 707237 781488
18797G81488j58841J74436r0100J28092q6891j50668j0107J45714K96785k52331
$$ 781488 622647 797083 706983 835075 748184 597516 587409 733123 1029908 777577
18787G77577J35053o96k1095l2424o0083N5775q1036J6829Q3799J67291m2290
$$ 777577 912630 911934 890839 858415 798332 854107 773071 789900 873699 1040990 998700
18776I98700q4414p0068J3731J70027j07352k37965K29546j17101j05664J59652
$$ 998700 914286 844218 857949 1027976 920624 682659 912205 795104 689440 849092
18766H49092k85550J25863K14336q8075j13682R0607p3277k7407O6474j07015
$$ 849092 563542 689405 903741 815666 701984 792591 719314 691907 758381 651366
18756F51366n0233R7398M1500j62814O2017p6963Q5372Q7865j47304J62186j39372
$$ 651366 601133 698531 740031 577217 639234 562271 647643 735508 588204 750390 611018
18745F11018J80168l7040j14699J656J80208k62698J75947o2107J09989k81059
$$ 611018 791186 754146 639447 641103 821311 558613 734560 672453 782442 501383
18735E01383O9178J12881P5768J19608k3301j99947l1312q1026K01817k6857O5715
$$ 501383 570561 683442 759210 878818 855517 655570 624258 543232 745049 718192 783907
18724G83907q4929P4622K3148j50299N8887j55747M43342j97076o911k70551K50534
$$ 783907 698978 773600 796748 646449 705336 549589 992931 795855 788944 518393 768927
18713G68927O6911j14036q3042K9678j0128J49432j42620J27207K7354q9990N4535
$$ 768927 835838 721802 638760 668438 658310 807742 665122 792329 819683 729693 784228
18702G84228J30981j79569j6764M7784o7245j43900k8316N4218J8531m0598L21237
$$ 784228 915209 735640 718876 766660 699415 555515 527199 581417 599948 559350 880587
18691H80587l92673K29093k61639M10367j95353m8266j9903K11079k0133M5256
$$ 880587 487914 717007 455368 865735 670382 622116 602213 813292 793159 838415
18681H38415l1647k90849L089O032L5738j07112K21331j59841J15764Q6868R4695
$$ 838415 806768 515919 519008 525040 560778 453666 674997 515156 630920 717788 812483
18670H12483R1618k82104j13777J00838J0157K8596l0074J51000o1114j05300
$$ 812483 904101 621997 508220 609058 619215 647811 617737 768737 707623 602323
18660F02323p9029J517P7814Q2215M0947j48643K47528k64859Q4026L05M8083
$$ 602323 523294 524811 602625 684840 725787 577144 824672 559813 643839 644144 692227
18649F92227k41751Q784J80679J29462m1003j72923M2297M1309j35030J03882
$$ 692227 450476 459260 639939 769401 728398 555475 597772 639081 504051 607933
18639F07933L27o5458k6976l1972P3937R4199l1089l7178P0198j48809J14460
$$ 607933 608260 542802 515826 483854 557791 651990 620901 583723 653921 505112 619572
18628F19572J62929P1852j10873j26680j4064J02865k49002l7857J01877n0383
$$ 619572 782501 854353 743480 616800 602736 705601 456599 418742 520619 470236
18618D70236q6090L72611l9494k09361K37195j77750j29381J39275L39868k89561
$$ 470236 384146 756757 717263 507902 745097 567347 437966 577241 917109 627548
18608F27548m7061J73870k3373k9469M9113j32693M7942m6663j8691J19587J3492
$$ 627548 580487 754357 730984 701515 750628 617935 665877 619214 600523 720110 733602
18597G33602M8888N4325k8061m6144L550N5576K0462k38631L41669j47638o2219
$$ 733602 782490 836815 808754 762610 766160 821736 842198 603567 945236 797598 735379
18586G35379j4046L0813O9540j3022j05057p4125J61584k2601K76405m89154K33802
$$ 735379 721333 752146 821686 808664 703607 629482 791066 768465 1044870 555716 789518
18575G89518N5141l54508k787n005Q3972L73352j32920p182o6543j23747J38503
$$ 789518 844659 490151 487364 482359 566331 939683 806763 799581 733038 609291 747794
18564G47794R7731l153j63839o9482R3013M6546K25330l92690P4289k5322n5236
$$ 747794 845525 842372 678533 609051 702064 748610 973940 581250 655539 630217 574981
18553E74981p2751m5982K12033p3395o158k48414J30090P8898n5000N262J23018
$$ 574981 502230 456248 668281 594886 588728 340314 470404 549302 494302 499564 622582
18542F22582j42403J17796N1281K17886l91064J69472q1257J34672j02669k33306
$$ 622582 480179 597975 649256 867142 476078 645550 564293 698965 596296 362990
18532C62990J18349K573P6367j61441J39756l7802n6677K38159k20186R7732k65771
$$ 362990 481339 483912 560279 398838 538594 500792 444115 682274 462088 559820 294049
18521B94049M72767j27272C13628L79176k31743R1592m99K04470k54715m8305
$$ 294049 766816 639544 313628 692804 461061 552653 552154 756624 501909 453604
18511D53604J4705N9349p547M3588J55j47959L41947j18393j46225l0400P0614
$$ 453604 468309 527658 520111 563699 563854 415895 757842 639449 493224 462824 533438
18500E33438m1083K18868j59343K2113j11296K33723j30752K41448C94673L41000
$$ 533438 492355 711223 551880 573993 462697 696420 565668 807116 394673 735673
18490G35673o2608j54629o13P8651j54593Q669K91287k0993l23757L54700j26319
$$ 735673 673065 518436 517823 596474 441881 450550 741837 720844 397087 751787 625468
18479F25468J85460l20272J65556k57975N1836J8299L6351j79696J92696P1152
$$ 625468 810928 490656 656212 398237 450073 468372 504723 325027 517723 588875
18469E88875m6241N7762M4603l0221M7633j23861M2094R9523n9455K8491r0704
$$ 588875 542634 600396 644999 614778 662411 538550 580644 680167 620712 649203 558499
18458E58499l9964K33506j18587j83105Q9133K3083k09408K58314k44107M55306
$$ 558499 518535 752041 633454 450349 539482 562565 353157 611471 367364 822670
18448H22670k71501J06581j05679M0055O6017n5518J53987k90750K23146l6414
$$ 822670 551169 657750 552071 592126 658143 602625 756612 465862 689008 652594
18438F52594m3425K48799k48993J11625j95071K00493J32961l16362R1182R7620
$$ 652594 609169 857968 608975 720600 525529 726022 858983 542621 633803 731423
18428G31423k19449L01178O3921j67716j19194L14537k36584j41008M3541R022
$$ 731423 511974 813152 877073 709357 590163 904700 668116 527108 570649 579671
18418E79671j04728R3227j04683o1968J55634q2225K6833j18427K81404J47846
$$ 579671 474943 568170 463487 401519 557153 474928 501761 383334 664738 812584
18408H12584j53917p1266J4522J63019o3467k02465J03540J34301J78130l64416
$$ 812584 658667 587401 601923 764942 701475 499010 602550 736851 914981 550565
18398E50565l6413j29648J38198l5174J27543K55646j63297k84224J59668M7159
$$ 550565 514152 384504 522702 487528 615071 870717 707420 423196 582864 630023
18388F30023k21787J05937j10695k785j18876K04361j01408K24873q6863j82193
$$ 630023 408236 514173 403478 400693 281817 486178 384770 609643 522780 340587
18378C40587P3508P3275J16063q6782N2436L3834n2156k5179o1543J30633B33171
$$ 340587 414095 487370 603433 516651 569087 602921 550765 525586 464043 594676 233171
18366F81030r5172P6861l7583j01222L5848k60855K62924j49397L03217j24378
$$ 681030 585858 662719 625136 523914 559762 298907 561831 412434 715651 591273
18356E91273k46463N911L26089p1756r8912K4406j22529K16082J46313k20920
$$ 591273 344810 350721 676810 605054 506142 530548 408019 624101 770414 549494
18346E49494k00262K37396n4596K52408k72219l6584r8696K89108j68343Q0634
$$ 549494 349232 586628 532032 784440 512221 475637 376941 666049 497706 578340
18336E78340j39950m4582L04419k86149J39336J37437k18774K24111j27590L8056
$$ 578340 438390 393808 698227 412078 551414 688851 470077 694188 566598 604654
18326F04654P3346r1238J48015r2374r9049r0620K77744j77141K48545j98449
$$ 604654 678000 586762 734777 642403 543354 452734 730478 553337 801882 603433
18316F03433J39366k9799l40923L11463r0524R5366j65511Q669j01155N2256n5198
$$ 603433 742799 713000 372077 683540 593016 688382 522871 531540 430385 482641 427443
18305D27443k9785J94551M9252n8363J87608k80597J87388k32132J42102J68484
$$ 427443 397658 592209 641461 583098 770706 490109 677497 445365 587467 755951
18295G55951j33268j04225J66592p0314j07832K5411R605o0853J17304k7391j20429
$$ 755951 622683 518458 685050 614736 506904 532315 541920 481067 598371 570980 450551
18284D50551j5179K02971o1511K08930C91406K66794j21646J25296j55580N9785
$$ 450551 435372 638343 576832 785762 391406 658200 536554 661850 506270 566055
18274E66055j8085j02912o70q7159J41924j22316L39762k48686q871J0527J75118
$$ 566055 547970 445058 444388 357229 499153 376837 716599 467913 459042 469569 644687
18263F44687k5453q0155p0299j3827J89702P4031k03126K7169n1254J19945P3006
$$ 644687 619234 539079 468780 454953 644655 718686 515560 542729 491475 611420 684426
18252F84426K3230n4931l8924l2912j7000J65267j54007J14097j21357j3756j70817
$$ 684426 707656 652725 613801 580889 563889 729156 575149 689246 567889 554133 383316
18241C83316J15638J49670O2581j49416j76753L97552k20970K50765p2451k16225
$$ 383316 498954 648624 711205 561789 385036 782588 561618 812383 739932 523707
18231E23707Q3997J38417k85851M4573L2488j01376R3512O7516n6889J31230L8933
$$ 523707 607704 746121 460270 504843 537331 435955 529467 596983 540094 671324 710257
18220G10257j41170n0999j45946J50023J15919q5949P5422l4382k91983K42657
$$ 710257 569087 518088 372142 522165 638084 552135 627557 593175 301192 543849
18210E43849K81351j85591j75317o9556L05195p5337j71774J35138J99281k34908
$$ 543849 825200 639609 464292 394736 699931 624594 452820 587958 787239 552331
18200E52331j35454O3463K19134k19226J21118J57201Q6185k76250J67519j62628
$$ 552331 416877 480340 699474 480248 601366 758567 844752 568502 736021 573393
18190E73393J72390l31748J26887L6555k59322K11353m9223K52733C44289J91210
$$ 573393 745783 414035 540922 577477 318155 529508 480285 733018 344289 535499
18180E35499J23612O4107j62182K89788l07138m8528K07734j22326K7097J34275
$$ 535499 659111 723218 561036 850824 543686 495158 702892 580566 607663 741938
18170G41938j89325j33798K08246k2013j35086J15515J2612j08588Q6436j56085
$$ 741938 552613 418815 627061 605048 469962 585477 598089 489501 575937 419852
18160D19852K48783k7421J85539C95718J61424n7980K63052l65305L39316n318
$$ 419852 668635 641214 826753 395718 557142 499162 762214 396909 736225 730907
18150G30907k91701K63302k42405o3732J98510R9862k07847k925J45728j51339
$$ 730907 439206 702508 460103 396371 594881 694743 486896 483971 629699 478360
18140D78360k5224P6060K28112n5848C38677J27161Q9359p6222j23541p7816J74898
$$ 478360 453136 529196 757308 701460 338677 465838 555197 478975 355434 277618 452516
18129D52516J8590K16778j95300k05948L8204N03043J3042l56157n9039J49915
$$ 452516 471106 687884 492584 286636 324840 827883 840925 484768 425729 575644
18119E75644n0147M1453p8317J02025o7765n6144j3145K56711k08176r6443J33877
$$ 575644 525497 566950 488633 590658 522893 466749 453604 710315 502139 405696 539573
18108E39573J38583k67704J35026K24715k98978L04346l22877K58795j24617r2014
$$ 539573 678156 410452 545478 770193 471215 775561 452684 711479 586862 494848
18098D94848J47744k38324L24664l43796J96816K16966k76149k3174J44379k12493
$$ 494848 642592 404268 728932 385136 581952 798918 522769 499595 643974 431481
18088D31481Q0031J39948j13846J6935m4146Q0547j60730J08152m9507K17064
$$ 431481 511512 651460 537614 554549 510403 590950 430220 538372 488865 705929
18078G05929m4897q5256o8841O6745j4881R0291l14938p4918K58322A50206K33087
$$ 705929 661032 575776 506935 573680 558799 649090 334152 259234 517556 150206 383293
18067C83293J4957N1541Q6329o5487K10457q1909k56123M5869K10652B79952K01440
$$ 383293 398250 449791 536120 470633 681090 599181 343058 388927 599579 279952 481392
18056D81392O9003L4797k85337k4922M14289l1909o9368k57481K85571j25808
$$ 481392 550395 585192 299855 274933 689222 657313 587945 330464 616035 490227
18046D90227L6493Q1734o5188j8616m9434J09514O0112J122k78254K1119J44520
$$ 490227 526720 608454 543266 524650 475216 584730 644842 645964 367710 388829 533349
18035E33349k8699Q415l9998j3291M2692j75098J35051J51204N6824B28977L88972
$$ 533349 504650 513065 473067 459776 502468 327370 462421 613625 670449 228977 617949
18024F17949j24140J84178k38817J0154O7088P7323k56462K45741j24414O7143
$$ 617949 493809 677987 439170 449324 516412 593735 337273 583014 458600 525743
18014E25743O7106j83342J98791p968k5614o6652P4657L3556k69540J93395p5992
$$ 525743 592849 409507 608298 600330 574716 508064 582721 616277 346737 540132 464140
18003D64140O9617j47396O2805j8108q703R7208j29688L5488L2933m4272Q322
$$ 464140 533757 386361 449166 431058 422355 519563 389875 425363 458296 414024 422346
17992D22346J73601j07096J5467R5328k15613K2060L6979n4512m7097J63718J94512
$$ 422346 595947 488851 504318 599646 384033 406093 443072 388560 341463 505181 699693
17981F99693J04937l27487J48506m5040M6819k16472Q6760l4053M7183J72221
$$ 699693 804630 477143 625649 580609 627428 410956 497716 463663 510846 683067
17971F83067r5462q961J83257k81026j25157K36090J00573j7733K7998j09477
$$ 683067 587605 578644 761901 480875 355718 591808 692381 674648 702646 593169
17961E93169K26509l30647k2136L5157m5043J52824o7956o3862L80289l37439
$$ 593169 819678 489031 466895 502052 457009 609833 541877 478015 858304 520865
17951E20865N7937j86005K34147p1867k37218M23935l47659M1298K36513P581
$$ 520865 578802 392797 626944 555077 317859 741794 394135 435433 671946 679527
17941F79527o3800k21406R9200J34500j68565J00362K17861C80222J91034j09259
$$ 679527 615727 394321 493521 628021 459456 559818 777679 380222 571256 461997
17931D61997R6893n9785R9890j02946J14478J4022j2920P1535J04221j85870L2551
$$ 461997 558890 499105 598995 496049 610527 624549 611629 683164 787385 601515 634066
17920F34066p715R9022j19347j44004l7546K06751L17441k17038j34093P5380
$$ 634066 626351 725373 606026 462022 424476 631227 948668 731630 597537 672917
17910F72917J9452l7754K9535o4215K53482j23007J36185m41519K14185j1067
$$ 672917 692369 654615 684150 619935 873417 750410 886595 445076 659261 648194
17900F48194r8190L03680j86576J89925j00160n4788J69943o0075j36324O1552
$$ 648194 550004 853684 667108 857033 756873 702085 872028 811953 675629 737181
17890G37181p0310j59064L27026j28590K9239R1956Q6808k06372P1057K2114o4445
$$ 737181 666871 507807 834833 706243 735482 827438 914246 707874 778931 801045 736600
17879G36600k01605M5290J17201j51741K35615j20690J16701m6936J02069l58912
$$ 736600 534995 580285 697486 545745 781360 660670 777371 730435 832504 473592
17869D73592M38599J695j56853J17209j62028n8999o8191M81762l20196o1909
$$ 473592 912191 913886 757033 874242 712214 653215 585024 1066786 746590 684681
17859F84681R3073J03277m35453J55392K59252j58011j12323j00091K64165j04582
$$ 684681 777754 881031 445578 600970 860222 702211 589888 489797 753962 649380
17849F49380K55967j42569L4343j41771j85289M80364j84746L1459j4998j37184
$$ 649380 905347 762778 797121 655350 470061 950425 765679 797138 782140 644956
17839F44956J19491j24526J41165m0351K11333j76213k19037K80388k61277K07611
$$ 644956 764447 639921 781086 740735 952068 775855 556818 837206 575929 783540
17829G83540j19229K14550l66800K23815j1177k06099K76752m9494l8508j7574
$$ 783540 664311 878861 512061 735876 724699 518600 795352 745858 707350 689776
17819F89776J12609l5211O2959j26749L93287n901r8147n0412M546K6216j26955
$$ 689776 802385 767174 830133 703384 1096671 1090770 992623 942211 946757 972973 846018
17808H46018J01470j92374M9965k8395j59039q6848N59915j34111j8831J0466
$$ 846018 947488 755114 805079 776684 617645 530797 1090712 956601 937770 948236
17798I48236m8374K20657k34779n083N5611p3403j0184j36332k0083J04946j65515
$$ 948236 899862 1120519 885740 880657 936268 862865 852681 716349 696266 801212 635697
17787F35697K75116j91515J261J0433k73203K72965r1027j27120N4101M7883K07807
$$ 635697 910813 719298 720559 730992 457789 730754 639727 512607 566708 614591 822398
17776H22398k40236J1656J0063j24359L24036o6207n9496l1634J8425j53889P1023
$$ 822398 582162 593818 603881 479522 803558 737351 677855 646221 664646 510757 581780
17765E81780K69896k4871k99058R2100n6609k07443K63986M1837L5977J12476
$$ 581780 851676 826805 527747 619847 563238 355795 619781 661618 697595 810071
17755H10071j18970j84918K91706j37966J75292p1281M5279m3305N7686k24256
$$ 810071 691101 506183 797889 659923 835215 763934 809213 765908 823594 599338
17745E99338J96619N6795k34253Q3446J37007j83881N6464k14241K75842N3715
$$ 599338 795957 852752 618499 701945 838952 655071 711535 497294 773136 826851
17735H26851j31525J01556n7606k6868j33295j18570R390M67719k36514j71723
$$ 826851 695326 796882 739276 712408 579113 460543 469933 937652 701138 529415
17725E29415J62349l3638J06784J6270j46319Q8829p0657r3219j15916O1531J64772
$$ 529415 691764 658126 764910 781180 634861 723690 653033 559814 443898 505429 670201
17714F70201p8281J47141j41924k08260J14178J70548J96480k33454K6561J11938
$$ 670201 591920 739061 597137 388877 503055 673603 870083 636629 663190 775128
17704G75128j08236j55044K59955k95775L23742l26299J52604r6663J22171p9435
$$ 775128 666892 511848 771803 476028 799770 473471 626075 529412 651583 572148
17694E72148J44740N967j01914k03589M18589j51513j42426J98786r7705K72296
$$ 572148 716888 722855 620941 417352 835941 684428 542002 740788 643083 915379
17684I15379k65964J83200j43363R5785j03677K15568j77803M5158k77018K03123
$$ 915379 649415 832615 689252 785037 681360 896928 719125 764283 487265 690388
17674F90388L0362J64258q9679n795k32230M1940K15713k00254J47633j64693
$$ 690388 720750 885008 795329 789534 557304 599244 814957 614703 762336 597643
17664E97643O5221o8435J89079J93532p9962k05828M5022K9579j0023j59954K48837
$$ 597643 662864 594429 783508 977040 897078 691250 736272 765851 755828 595874 844711
17653H44711p6002p7926L02565k10891r5043L0746J62623p1339J7270J0374J19218
$$ 844711 768709 690783 993348 782457 687414 718160 880783 809444 826714 837088 956306
17642I56306o996J0991m7130j40832K68993l07259K06920j01510P544m141J78027
$$ 956306 949310 960301 913171 772339 1041332 734073 940993 839483 847027 842886 1020913
17631A020913j67624K5446m180j18492K01587M89005k01842k41962M6215r8943
$$ 1020913 853289 878735 874555 756063 957650 1446655 1244813 1002851 1049066 950123
17621I50123K41174j37504m6434J9374K54192k64839K13440O1332l1944K9426
$$ 950123 1191297 1053793 1007359 1026733 1280925 1016086 1229526 1290858 1258914 1288340
17611A288340k45031J87623P4554j64190J14855p541o9869j47J03191o971j45142
$$ 1288340 1043309 1230932 1305486 1141296 1256151 1248610 1178741 1178594 1281785 1274814 1129672
17600A129672p009J28438j47481K39434j05322J57615r6227j63049P4875O3394
$$ 1129672 1122663 1251101 1103620 1343054 1237732 1395347 1299120 1136071 1210946 1274340
17590A274340j2134K36651l64306O8534o5390J61670j6618K8302j66551j2525
$$ 1274340 1262206 1498857 1134551 1203085 1137695 1299365 1282747 1311049 1144498 1131973
17580A131973J54507j64257J8508r5133L25503p4305j14333J94381l26997J17540
$$ 1131973 1286480 1122223 1140731 1045598 1371101 1296796 1182463 1376844 1049847 1167387
17570A167387J57897O3091k0638l52678L37200l4208r6424P9385o7450Q1414j33791
$$ 1167387 1325284 1388375 1367737 1015059 1352259 1318051 1221627 1301012 1233562 1314976 1181185
17559A181185J35706j05147L2204j11379n2408o3479Q4282L50306m68008Q6707
$$ 1181185 1316891 1211744 1243948 1132569 1080161 1016682 1100964 1451270 983262 1069969
17549A069969J36173k15583N3395j53881L12211L71932k12627k71123K56530p7020
$$ 1069969 1206142 990559 1043954 890073 1202284 1574216 1361589 1090466 1346996 1269976
17539A269976J05986P8307j09502l4263J02121J01634l15394K29711q4615K71596
$$ 1269976 1375962 1454269 1344767 1310504 1412625 1514259 1198865 1428576 1343961 1615557
17529A615557j01805l44247R7282j97049J66409R1173j5425J80564j99310N8546
$$ 1615557 1513752 1169505 1266787 1069738 1236147 1327320 1311895 1492459 1293149 1351695
17519A351695J78878k2826O772j13239K54380J47M00328q5501k79100L41295K20567
$$ 1351695 1530573 1507747 1514519 1401280 1655660 1655807 2056135 1970634 1691534 2032829 2253396
17508B253396J3539n5482Q2086n0136M1701j4687J43569o3217m3827K49930K30036
$$ 2253396 2266935 2211453 2293539 2243403 2285104 2270417 2413986 2350769 2306942 2556872 2786908
17497B786908j3261k0381L51349K34956L16726M03468L81694M77177P70173Q94718
$$ 2786908 2773647 2753266 3104615 3339571 3656297 4059765 4441459 4918636 5688809 6583527
17487F583527J838019K986627N533312P798197R964819R729606P565366N666640
$$ 6583527 8421546 11408173 16941485 24739682 34704501 44434107 51999473 57666113
17479E7666113M295134J953235O18609j703677l876873o605100p781173p586315
$$ 57666113 61961247 63914482 64533091 62829414 58952541 52347441 44566268 36979953
17471C6979953n376423j526144K624656O426593P953058P072925N395377L644289
$$ 36979953 31603530 30077386 32702042 39128635 47081693 54154618 59549995 63194284
17463F3194284J902154M28330j605035l716141o557079q516104r687245r008251
$$ 63194284 65096438 65524768 63919733 60203592 53646513 45130409 35443164 26434913
17455B6434913p292997m947011l417561k461641j779986r91361m72316n44756
$$ 26434913 19141916 14194905 10777344 8315703 6535717 5544356 5072040 4527284
17447D527284k60036n31522J42292o9608J14607J08616j59242J34500o6115N5395
$$ 4527284 4267248 3735726 3878018 3808410 3923017 4031633 3872391 4006891 3940776 3996171
17437C996171l00982K15101n80858R7929o4915k22398L89889n1990k8680J94075
$$ 3996171 3695189 3910290 3329432 3427361 3362446 3140048 3529937 3477947 3449267 3643342
17427C643342m4156q4092K4970k54979R6304k9644m73723j55178j3004K8507j96545
$$ 3643342 3599186 3515094 3540064 3285085 3381389 3351745 2878022 2722844 2709840 2738347 2541802
17416B541802N2674o5833p2165Q7004j85469J13774j85720K47634R2734l03405
$$ 2541802 2594476 2528643 2456478 2543482 2358013 2471787 2286067 2533701 2626435 2323030
17406B323030N50221k06450K06569J1111L21210m7791K93510j47230M47472l3758
$$ 2323030 2873251 2666801 2873370 2884481 3205691 3157900 3451410 3304180 3751652 3717894
17396C717894M02563j6936L13067M3363K07100P54984J56470O54059K63198M75842
$$ 3717894 4120457 4103521 4416588 4459951 4667051 5422035 5578505 6232564 6495762 6971604
17386F971604L26352J73857K39359R0207J7959o8051k22734q1610k21679M399
$$ 6971604 7297956 7471813 7711172 7801379 7819338 7751287 7528553 7446943 7225264 7229663
17376G229663j62868l67253K26699Q0418L41121J93239J56539O65317K69435K60689
$$ 7229663 7066795 6699542 6926241 7006659 7347780 7541019 7697558 8362875 8632310 8892999
17366H892999N10890J94132N12906j33096J85987l59420k57033K84109l37873
$$ 8892999 9403889 9598021 10110927 9977831 10163818 9804398 9547365 9831474 9493601
17357I493601q1850K52469n8575J52804L97763O2116O35716K75858Q87029N19187
$$ 9493601 9411751 9664220 9605645 9758449 10156212 10218328 10854044 11129902 12016931 12536118
17347A2536118M61482Q46456L90820N26517O03825K73053L38008o4038k69814
$$ 12536118 12997600 13844056 14234876 14761393 15365218 15638271 15976279 15912241 15642427
17338A5642427j97441m12442k20987l17879j12336k46152j48571N26260k7398
$$ 15642427 15444986 15032544 14811557 14493678 14381342 14135190 13986619 14512879 14485481
17329A4485481O34000Q06276M18459O65428O34707O15592M92833N2284K70046
$$ 14485481 15119481 15925757 16344216 17009644 17644351 18259943 18752776 18805060 19075106
17320A9075106J77583j95577k19490j95708k61757o37375k37369q27680l51793
$$ 19075106 19252689 19057112 18837622 18641914 18380157 17742782 17505413 16677733 16325940
17311A6325940j98985m05350j52768J14413o2740M06169O3986L93479J16019K20606
$$ 16325940 16126955 15721605 15568837 15683250 15620510 16026679 16090665 16484144 16600163 16820769
17301A6820769M25823L26406J7847J40334J7225j26527j20928m39260k78422j76384
$$ 16820769 17246592 17572998 17590845 17731179 17748404 17621877 17500949 17061689 16783267 16606883
17291A6606883n02548m49021k28565j82649n57546l437m70479k91464m04976m86089
$$ 16606883 16104335 15655314 15426749 15244100 14686554 14683117 14212638 13921174 13516198 13030109
17281A3030109k38538k91538p07281p22188o20724o35182p43472m44188m42440
$$ 13030109 12791571 12500033 11792752 11070564 10449840 9814658 9071186 8626998 8184558
17272H184558m35419m09247m28500j83740p8966l63055k1614j02647k59081j25355
$$ 8184558 7749139 7339892 6911392 6727652 6648686 6285631 6264017 6161370 5902289 5776934
17262E776934J50935m95496j14873j08021k31538j64490j22847J06256l72696
$$ 5776934 5927869 5432373 5317500 5209479 4977941 4813451 4690604 4796860 4424164
17253D424164j39663J28828j18231k6492K5374q5956p8676J23880j33116p847
$$ 4424164 4284501 4413329 4295098 4268606 4293980 4208024 4129348 4253228 4120112 4112265
17243D112265J01837l46208q5017k41700j51805J99894j85516J00720l89179j53066
$$ 4112265 4214102 3867894 3782877 3541177 3389372 3589266 3403750 3504470 3115291 2962225
17233B962225L09233j3372l19472J66128N245O1779L8364j56260J41820P7343
$$ 2962225 3271458 3258086 2938614 3104742 3109987 3171766 3210130 3053870 3195690 3273033
17223C273033j6765J60684j55506r6460K30977O3333k7416j49061p0967L5561
$$ 3273033 3256268 3416952 3261446 3164986 3395963 3459296 3431880 3282819 3211852 3247413
17213C247413r6681K53704m86516M05306j93353m9537J99447j7564q6322K03253
$$ 3247413 3150732 3404436 2917920 3323226 3129873 3080336 3279783 3262219 3175897 3379150
17203C379150j57054J51043k97729K33377p0087j62742l8018n5313r6425n07543
$$ 3379150 3222096 3373139 3075410 3308787 3238700 3075958 3037940 2982627 2886202 2378659
17193B378659j32073K85594L463p9474j9901k08519J91358l080l0248j57104L2849
$$ 2378659 2246586 2532180 2535643 2456169 2436268 2227749 2419107 2416027 2385779 2228675 2261524
17182B261524K5944j18988k6426R0687j21223J36304j3808K51061j80712O3919
$$ 2261524 2287468 2168480 2142054 2232741 2111518 2247822 2234014 2485075 2304363 2368282
17172B368282J9533J15319j54691j0953J02777j8314j13021K73913j40429K07949
$$ 2368282 2387815 2503134 2348443 2337490 2440267 2421953 2308932 2582845 2442416 2650365
17162B650365k19587K71280P6609J1938p5088J48532q5281K8654M77669k98280
$$ 2650365 2430778 2702058 2778667 2790605 2715517 2864049 2778768 2807422 3285091 2986811
17152B986811M9991k30062R8842P4786j9776r6800j5674q1612k38199K55407k66199
$$ 2986811 3036802 2806740 2905582 2980368 2960592 2863792 2848118 2766506 2528307 2783714 2517515
17141B517515K42317Q7590J22824p0074k3137J36128k23260J86156m3190j5387
$$ 2517515 2759832 2847422 2970246 2900172 2877035 3013163 2789903 2976059 2932869 2917482
17131B917482k96277K09332j77395J02861q6546m5074m4030K98674j85583j07929
$$ 2917482 2621205 2830537 2653142 2756003 2669457 2624383 2580353 2879027 2693444 2585515
17121B585515L01884k61276J35773j76516J60361j52657j13491j22478j61288
$$ 2585515 2887399 2626123 2761896 2585380 2745741 2593084 2479593 2357115 2195827
17112B195827K60427m97599M0383R2928j32926P2221j72625J00524l6451K36427
$$ 2195827 2456254 1958655 1999038 2091966 1959040 2031261 1858636 1959160 1922709 2159136
17102B159136j45689j19176J6890J70672l21502J5579m2228j17539J50367j13833
$$ 2159136 2013447 1894271 1911161 2081833 1760331 1775910 1733682 1616143 1766510 1652677
17092A652677r6955o383j10883j51888Q7104J14397m8910r9180j41850q0473j74715
$$ 1652677 1555722 1549339 1438456 1286568 1373672 1488069 1439159 1339979 1198129 1117656 942941
17081I42941M42388k07062R3782j85459J52936k5597L9886J9230l123o3573M4712
$$ 942941 1385329 1178267 1272049 1086590 1239526 1213929 1253815 1273045 1269922 1206349 1251061
17070A251061l12279J69400J63741k54224K02305o8502Q1104p6233J49518j13553
$$ 1251061 938782 1108182 1271923 1017699 1220004 1151502 1232606 1156373 1305891 1192338
17060A192338j32832K73263o973K19900j70029J39405M2671J80573M9517r3919
$$ 1192338 1059506 1332769 1325796 1545696 1375667 1515072 1557743 1738316 1787833 1693914
17050A693914k8654K35008j1788l6171N3471j58219j02944J66437K91156k4238
$$ 1693914 1665260 1900268 1888480 1852309 1905780 1747561 1644617 1811054 2102210 2077972
17040B077972K3704L67975q7808J0475n9879J49930j71166J77116m14689r8455
$$ 2077972 2101676 2469651 2381843 2392318 2332439 2482369 2311203 2488319 2073630 1975175
17030A975175p7854k0462q5951N221j55526k09234J76841l7845j7238k21881k6373
$$ 1975175 1897321 1876859 1790908 1796129 1640603 1431369 1608210 1570365 1553127 1331246 1304873
17019A304873k2559Q2236j22524O1808j43101O5359K24603p0948j97038O0704
$$ 1304873 1282314 1364550 1242026 1303834 1160733 1226092 1450695 1379747 1182709 1243413
17009A243413k53226L03946j83843j28548J37967P9584N3913k26974J0793j4750
$$ 1243413 990187 1294133 1110290 981742 1119709 1199293 1253206 1026232 1037025 1022275
16999A022275J73125j06773Q8924N2565k66608K76166j65094J84380j07036o4495
$$ 1022275 1195400 1088627 1177551 1230116 963508 1239674 1074580 1258960 1151924 1087429
16989A087429Q9767n634J24444j27538l5782l1274J06621N4471J34787j33636
$$ 1087429 1177196 1171562 1296006 1168468 1132686 1101412 1208033 1262504 1397291 1263655
16979A263655P5680j21674L76539l08353K1735K25301k18335l8086N20781k76366
$$ 1263655 1339335 1217661 1594200 1285847 1307582 1532883 1314548 1276462 1797243 1520877
16969A520877J41786P101J44231j55181P91008k43667n7982L81437L9816j60425
$$ 1520877 1662663 1669764 1813995 1658814 2449822 2206155 2148173 2529610 2569426 2409001
16959B409001n3073L84882K47170m04839K51518N8053j59807l9269k92704M26215
$$ 2409001 2355928 2740810 2987980 2583141 2834659 2892712 2732905 2693636 2400932 2827147
16949B827147k64669k6943o8662n5662j42947k44216m9249J8767k40869n6115
$$ 2827147 2562478 2535535 2466873 2411211 2268264 2024048 1974799 1993566 1752697 1696582
16939A696582j8709k49386P3400l6870k04750L78345m6927l41250R2757j90282
$$ 1696582 1677873 1428487 1501887 1465017 1260267 1638612 1591685 1250435 1343192 1152910
16929A152910L28276k23612k0932N5129k26370J01574J05368M6714j96604k15236
$$ 1152910 1481186 1257574 1236642 1291771 1065401 1166975 1272343 1319057 1122453 907217
16919I07217J98139q5459j87521L18845j35986k1955j37584J37733m3537o2050
$$ 907217 1105356 1019897 832376 1151221 1015235 993280 855696 993429 949892 887842
16909H87842J20769J2402n1917n3716j56661K69892R6656l77368L550J74066k4619
$$ 887842 1008611 1021013 969096 915380 758719 1028611 1125267 747899 751449 925515 900896
16898I00896Q7103J21484j45995k66649K2616K35204R6738k60613M7235j55374
$$ 900896 987999 1109483 963488 696839 719455 954659 1051397 790784 838019 682645
16888F82645J59437j08773J59723l22422L75660j57990j17209l5459K09740N9108
$$ 682645 842082 733309 893032 570610 946270 788280 671071 635612 845352 904460
16878I04460Q5231j32346M4762K67061l45421J72521m5149p7562N1655m3459k6720
$$ 904460 989691 857345 902107 1169168 823747 996268 951119 873557 925212 881753 855033
16867H55033j51757J05115K52537k95985J28612P433P8163p2761R0453L0552k3181
$$ 855033 703276 808391 1060928 764943 893555 900988 979151 906390 996843 1027395 1004214
16856A004214Q2436j19699o9723R648o7109J2479L06225k31234m5153M5879l3278
$$ 1004214 1086650 966951 897228 906876 839767 852246 1158471 927237 882084 927963 894685
16845H94685J0258j10211J54901k42950L59647k03690o1968L98805l48635J17756
$$ 894685 904943 794732 949633 706683 1066330 862640 800672 1199477 850842 968598
16835I68598J81947k66392J71437Q3516l9282l5280n5799K45990k79577L1767
$$ 968598 1150545 884153 1055590 1139106 1099824 1064544 1008745 1254735 975158 1006925
16825A006925j57217M34786J5088j58260J77386J11638K4431R149j00156L39979
$$ 1006925 849708 1284494 1299582 1141322 1318708 1430346 1454777 1463926 1363770 1703749
16815A703749p7259M38814m20834N171J29367j05637K08847k64859J45350j28410
$$ 1703749 1626490 2065304 1644470 1649641 1779008 1673371 1882218 1617359 1762709 1634299
16805A634299p958J39818m8351m7083j53207M39070l95816J02168k70501J02870
$$ 1634299 1626341 1766159 1717808 1670725 1517518 1956588 1560772 1662940 1392439 1495309
16795A495309j62334P946j03313j66144J65187j94627j53201l04702O5203J71380
$$ 1495309 1332975 1340921 1237608 1071464 1236651 1042024 888823 584121 649324 820704
16785H20704O0076k36290J60627O3881j1151j4519k85205J59152K3700k55724
$$ 820704 880780 644490 805117 868998 857847 843328 558123 717275 740975 485251
16775D85251K55871j06585q3945J13550p480R6166j0665R6826k96080J4132k6190
$$ 485251 741122 634537 550592 664142 656662 752828 742163 838989 542909 557041 530851
16764E30851L35782n9753k46488j01145K92302j24608K74545j98667K44265Q713
$$ 530851 866633 806880 560392 459247 751549 626941 901486 702819 947084 955797
16754I55797l55959J14784O6388M6346r012j58881J3876K72053k8893L545j51248
$$ 955797 599838 714622 781010 827356 818344 659463 673339 945392 916499 920044 768796
16743G68796l2601N480j68700N4788K71048j28109J655J45562J53809k9203n7150
$$ 768796 736195 741675 572975 627763 898811 770702 772357 917919 1071728 1042525 985375
16732I85375J98713j13512l01545Q3719J45200r6945l1298k138K5294l4791L2652
$$ 985375 1184088 1070576 769031 852750 997950 901005 869707 867569 892863 858072 890724
16721H90724J72385k2309k56472J62281Q9841J82817j54063k1205q8821L4310
$$ 890724 1063109 1040800 784328 946609 1036450 1219267 1065204 1043999 955178 989488
16711I89488J04084o8745J42317j21885K33729J62766j39476Q4932L01088J5355
$$ 989488 1093572 1024827 1167144 1045259 1278988 1441754 1302278 1387210 1688298 1703653
16701A703653J01143m6769j9415j1895M148J81234l19044K03954j13996J4312
$$ 1703653 1804796 1758027 1738612 1726717 1730865 1912099 1593055 1797009 1683013 1697325
16691A697325k4934M16046m32001K54265J3232L1767N1886k96638J65940k80554
$$ 1697325 1672391 2088437 1656436 1910701 1923933 1955700 2007586 1710948 1876888 1596334
16681A596334k0734j12246n4130j42258J46605l13278P3809J76883m6873L6810
$$ 1596334 1575600 1463354 1409224 1266966 1413571 1100293 1174102 1350985 1304112 1340922
16671A340922J38100j9919J32835K16628j7510r5913R2281K91830k52241J95207
$$ 1340922 1479022 1459103 1591938 1808566 1791056 1695143 1787424 2079254 1827013 2022220
16661B022220k4111J21491m47898J78558R9254l26118J87440O6403k47924J19442
$$ 2022220 1998109 2119600 1671702 1850260 1949514 1623396 1810836 1877239 1629315 1748757
16651A748757J873R607k67928j48372R3k42123R5776l12989k05613j02998J83178
$$ 1748757 1750630 1760237 1492309 1343937 1344030 1101907 1197683 884694 679081 576083 759261
16640G59261l2502O6659p85k8916J05542r4182r8668k840L7391j92084J9446J42268
$$ 759261 726759 793418 792633 763717 869259 775077 676409 673569 710960 518876 538322 680590
16628F80590j26715P7975Q3812K16863k40594J62141j47838k43944M1354k21702
$$ 680590 553875 631850 715662 932525 691931 854072 706234 462290 503644 281942
16618B81942K57459o8675O5673k12150J91478M3314j09659K26613j93979P3154
$$ 281942 539401 470726 536399 324249 515727 559041 449382 675995 482016 555170
16608E55170J61921J00670j85681R2647O5016o3721P4928K29078k01267K09024
$$ 555170 717091 817761 632080 724727 789743 726022 800950 1030028 828761 1037785
16598A037785P0595j90850K0618K79539j33616J9481l09111M3481j07936L40682
$$ 1037785 1108380 917530 938148 1217687 1084071 1103552 794441 837922 729986 1070668
16588A070668k46668K5337j31127l04212K32005J44298j42331M6556M3612j80949
$$ 1070668 824000 849337 718210 413998 646003 790301 647970 694526 738138 557189
16578E57189p6849K79237k72558K29520j70539K01897j91282q3982J19713j43192
$$ 557189 480340 759577 487019 716539 546000 747897 556615 472633 592346 449154
16568D49154k22800L15039L23027m8753l81511J01194p7513M7167k42842K59842
$$ 449154 226354 541393 864420 815667 434156 535350 457837 505004 262162 522004
16558E22004J0341J13105K5046K3534J93331k59923J77073j42177J13055L9129
$$ 522004 532345 645450 670496 694030 887361 627438 804511 662334 775389 814518
16548H14518P189k97248K20108j41237k02305L57244l37136K30947k57378M02249
$$ 814518 821707 524459 744567 603330 401025 758269 421133 652080 394702 796951
16538G96951l85361Q2787k6350j69408J71917J54436J32853k59502L86893k43068
$$ 796951 411590 494377 468027 298619 470536 624972 757825 498323 885216 642148
16528F42148j61510j9135J85598k65650J60360p0866J77193j82606J66481j49794
$$ 642148 480638 461503 647101 381451 541811 470945 648138 465532 632013 482219
16518D82219o1462M28398j64079o2433J8609K35154k29800K83847k37292k6212
$$ 482219 420757 849155 685076 622643 641252 876406 646606 930453 693161 666949
16508F66949j78846M05766j93079M1547K57611l06802J20208K30578j10852j71956
$$ 666949 488103 893869 700790 742337 999948 693146 813354 1043932 933080 761124
16498G61124j58946J60769p4456N655K62276p9021j31347J48240k5915J46927
$$ 761124 602178 762947 688491 694146 956422 877401 746054 894294 868379 1015306
16488A015306J64864j43043l1648j2162J63364o7083l6008k05057Q1144J97412
$$ 1015306 1180170 1037127 1005479 993317 1156681 1089598 1053590 848533 929677 1127089
16478A127089j9081o1359J4896j7068P9996k68505n2238L3612L7111L7345o2636
$$ 1127089 1108008 1046649 1061545 1044477 1124473 855968 803730 837342 874453 911798 849162
16467H49162J0061q5284J64397m7125L00969k53863k03478K44287r7401L76680
$$ 849162 859223 773939 938336 891211 1192180 938317 734839 979126 881725 1258405
16457A258405o8813K57036j01133N0657P8704J63072j8481K6015q0948J27032
$$ 1258405 1189592 1446628 1345495 1396152 1474856 1637928 1619447 1645462 1564514 1691546
16447A691546J24444q7449k01905k2909k7593K91865n3224K47871j31303M67664
$$ 1691546 1815990 1728541 1526636 1503727 1476134 1767999 1714775 1962646 1831343 2299007
16437B299007R3047M68319J85430K10803M91565K72485K61794K34582K51114N24909
$$ 2299007 2392054 2860373 3045803 3256606 3748171 4020656 4282450 4517032 4768146 5293055
16427E293055O32626N25925O01454R83413J285647J165732J283084J296402J287968
$$ 5293055 5925681 6451606 7053060 8036473 9322120 10487852 11770936 13067338 14355306
16418A4355306J166242J665842J281429J584755J679504K123488K302605K561835
$$ 14355306 15521548 17187390 18468819 20053574 21733078 23856566 26159171 28721006
16410B8721006K600074K644211L079258L334823K882405K943652L013983K837428
$$ 28721006 31321080 33965291 37044549 40379372 43261777 46205429 49219412 52056840
16402E2056840K212699J027366k09281o63176j240552j104017j287668q10930
$$ 52056840 54269539 55296905 55087624 54424448 53183896 52079879 50792211 49981281
16394D9981281j59620K618965P288221J2197630J5770209J3649153M894914l987731
$$ 49981281 49821661 52440626 59728847 71926477 87696686 101345839 106240753 102253022
16386A02253022q943366j0699131j1127051j0952662j2618736j2938385j3948384
$$ 102253022 93309656 82610525 71483474 60530812 47912076 34973691 21025307
16379B1025307D751185a5454522k3856584k0597402r905133K362357J2626158
$$ 21025307 4751185 -15454522 -39311106 -59908508 -69813641 -67451284 -54825126
16372e4825126J8540366a7284362a719197H811099N611980K031495l28517j977617
$$ -54825126 -36284760 -17284362 -1719197 8811099 14423079 16454574 16126057 14148440
16364A4148440k344552k669495j997563j459481j150968j042775l49002p21926
$$ 14148440 11803888 9134393 7136830 5677349 4526381 3483606 3134604 2412678
16356B412678j57403m47822P9015k84289l74533k8715k74804m662k13533m9889
$$ 2412678 2255275 1807453 1886468 1602179 1227646 1198931 924127 919465 705932 656043
16346F56043n8033J45630K53953k4995K71121L8079j9202K03707K79873k49326
$$ 656043 598010 743640 997593 972598 1243719 1281798 1262596 1466303 1746176 1496850
16336A496850Q2028K00380k36235K87291j71991K16313p1408J26046j22653j73885
$$ 1496850 1578878 1779258 1543023 1830314 1658323 1874636 1803228 1929274 1806621 1632736
16326A632736K54602q0279J94450j71453k01175q9429j11521J14528l97909l51375
$$ 1632736 1887338 1807059 2001509 1830056 1628881 1539452 1427931 1542459 1144550 793175
16316G93175o363j06252j89876K09843A85827M15665o6404N6628k600m6441J55646
$$ 793175 786812 680560 490684 700527 185827 601492 535088 591716 589116 542675 698321
16305F98321P5074J30625l677R0153m05249K55168J20148j25306L33740L5318
$$ 698321 773395 904020 900343 990496 585247 840415 960563 835257 1168997 1204315
16295A204315j14686k34079k0899R4563k59295O4284j13643j59443J91397k72326
$$ 1204315 1089629 855550 834651 929214 669919 734203 620560 461117 652514 380188
16285C80188J0159J68851A95577p664K92157m0420j81039K38321N6477m3434K21391
$$ 380188 390347 559198 195577 187913 480070 439650 258611 496932 553409 509975 731366
16274G31366j8070K59471Q196J87965K7082J64386j63538L2877J02939n414k11450
$$ 731366 713296 972767 980963 1168928 1196010 1360396 1196858 1229735 1332674 1327260 1115810
16263A115810j89809K3239m0118o4104o2897j41374J81349j90233o649K34398
$$ 1115810 926001 949240 909122 845018 782121 640747 822096 631863 625214 859612
16253H59612M6418K66464j66455l9192j1538K6466N6150K81334k46636J77885
$$ 859612 906030 1172494 1006039 966847 955309 981775 1037925 1319259 1072623 1250508
16243A250508K67589j42250k91012K31363J9033k9855J46969k12822J41072k41891
$$ 1250508 1518097 1375847 1084835 1316198 1335231 1305376 1452345 1239523 1380595 1138704
16233A138704J71719p0297l02623j28752O2782q7207m9624j04358J63215k09507
$$ 1138704 1310423 1240126 937503 808751 871533 784326 734702 630344 793559 584052
16223E84052j06167L55072m1k91736J93908m8363K18265j87180L4455N9274j41636
$$ 584052 477885 832957 832916 541180 735088 686725 904990 717810 752265 811539 669903
16212F69903K55316J02041k9347r7344K50593p3432j86393K90714j44886P9721
$$ 669903 925219 1027260 997913 900569 1151162 1077730 891337 1182051 1037165 1116886
16202A116886R3888P4712k0389j52240j67576M89501j71393m4886P4708J56620
$$ 1116886 1210774 1285486 1265097 1112857 945281 1434782 1263389 1218503 1293211 1449831
16192A449831k93118K7327l3473P4038l3081R6513K6568j87904J83951n8765q6681
$$ 1449831 1156713 1184040 1150567 1224605 1191524 1288037 1314605 1126701 1310652 1251887 1165206
16181A165206k63728J72154J51179j13984r025Q4296l13054L45359k48349K1236
$$ 1165206 901478 1073632 1224811 1110827 1101802 1186098 873044 1218403 970054 991290
16171I91290j14390L1505j80170L64865j16698l3405R8642k42517L42746k08194
$$ 991290 876900 908405 728235 1093100 976402 942997 1041639 799122 1141868 933674
16161I33674j70921r4109L08742L26065j07580j80047N2789j02852J20226k76312
$$ 933674 762753 668644 977386 1303451 1195871 1015824 1068613 965761 1085987 809675
16151H09675J15810Q6430O4693j00579J10969L8555j77589J75350j15642K5735
$$ 809675 925485 1011915 1076608 976029 1086998 1125553 947964 1123314 1007672 1033407
16141A033407P1561l84139L06912j88879J64529j15117J56335l5543j09391j68622
$$ 1033407 1104968 720829 1027741 838862 1003391 888274 1044609 1009066 899675 731053
16131G31053L91357J7741k93793n0912J77005k4247K34813l83781K20386J35022
$$ 731053 1122410 1140151 846358 795446 972451 948204 1183017 799236 1019622 1154644
16121A154644l08362K16204r1720j37628J4287J14000j28306o5386j08274J6559
$$ 1154644 846282 1062486 970766 833138 847425 961425 833119 767733 659459 676018
16111F76018M62472k20832L4545k41166R4053J17434k3611j23777K19901m3316
$$ 676018 1138490 917658 952203 711037 805090 922524 898913 775136 995037 951721
16101I51721P9569l35680M25768J3903j05513J04420r3504L2506O2148k79400
$$ 951721 1031290 695610 1121378 1135281 1029768 1134188 1040684 1073190 1135338 855938
16091H55938L01796o5725n0231K58920j47677J37333p0646N5239p0231K02040
$$ 855938 1157734 1092009 1041778 1300698 1153021 1290354 1219708 1274947 1204716 1406756
16081A406756k47108m0374j16756R4256K51715j27839J31702k06712K57595P7109
$$ 1406756 1159648 1119274 1002518 1096774 1348489 1220650 1352352 1145640 1403235 1480344
16071A480344J67852l33500J06980K3272q3992l4741J32161J50006m56885L01121
$$ 1480344 1648196 1314696 1421676 1444948 1360956 1326215 1458376 1608382 1151497 1452618
16061A452618J97403k71985R8271L03980l53413J93357m8997J76749j91005M5285
$$ 1452618 1650021 1378036 1476307 1780287 1426874 1620231 1571234 1747983 1556978 1602263
16051A602263J56216J37016q9270l72749K80761j75520J75040k9692j15070K67689
$$ 1602263 1758479 1895495 1806225 1433476 1714237 1538717 1713757 1684065 1568995 1836684
16041A836684K0934m7758j75610R4977L2327l7749j4261r93O1982l3493J08996
$$ 1836684 1857618 1809860 1634250 1729227 1761554 1723805 1709544 1708551 1770533 1737040 1846036
16030A846036k82371L43345m6330J11047r1626J42476J31671j69463J3257m1212
$$ 1846036 1563665 1907010 1860680 1971727 1880101 2022577 2154248 1984785 1998042 1956830
16020A956830K27356p9118J36756m3557R7111M8117K2676l9435j2898L789j81108
$$ 1956830 2184186 2105068 2241824 2198267 2295378 2343495 2366171 2326736 2313838 2317627 2136519
16009B136519J55875j9115l2453J70861k88570K87972j95662O0391r3685J52898
$$ 2136519 2292394 2273279 2240826 2411687 2123117 2411089 2215427 2275818 2182133 2335031
15999B335031r6088Q6554j02132j90615K24911m1924Q915n5366P777K422l4804
$$ 2335031 2238943 2325497 2223365 2032750 2257661 2215737 2224652 2169286 2177063 2179485 2144681
15988B144681p6597N31880l56589Q1969J6065q1638J46682j58948M5628J37989
$$ 2144681 2068084 2599964 2243375 2325344 2341409 2259771 2406453 2247505 2293133 2431122
15978B431122j81412L04917o8958r1275o0794M8382Q6590k30881k430P6177j8173
$$ 2431122 2249710 2554627 2485669 2394394 2333600 2381982 2468572 2237691 2235261 2311438 2293265
15967B293265j05918J66664K1726J82922n20636J29927K13193m7146J693j37224
$$ 2293265 2187347 2354011 2375737 2558659 2038023 2167950 2381143 2333997 2335690 2198466
15957B198466J17283o7188J38749j49684k1701K04866r1473j08008J94235M0682
$$ 2198466 2315749 2248561 2387310 2237626 2215925 2420791 2329318 2221310 2415545 2456227
15947B456227k84389K55392k44764J62170Q5440J76658l81330Q2501J41497K16
$$ 2456227 2171838 2427230 2182466 2344636 2430076 2606734 2225404 2307905 2449402 2449618
15937B449618J31991J61111j57674q793K15890j4029O9301j31513j01597L46146
$$ 2449618 2581609 2742720 2585046 2576253 2792143 2778114 2847415 2715902 2614305 2960451
15927B960451j48437K2730J97401n3391K06167l1632m5010J74379N8158K96987
$$ 2960451 2812014 2834744 3032145 2978754 3184921 3153289 3108279 3282658 3340816 3637803
15917C637803J83045j4488K65248K67144M33350O01933L30914P62624J327765
$$ 3637803 3820848 3806360 4071608 4338752 4772102 5374035 5704949 6467573 7795338
15908G795338J627276K240709L640293M832652O002819P183419P197677P200512
$$ 7795338 9422614 11663323 15303616 20136268 26139087 33322506 40520183 47720695
15900D7720695N598740M277144K337468N48208j343640l169361n070123o412932
$$ 47720695 53319435 57596579 59934047 60482255 59138615 55969254 50899131 44486199
15892D4486199o958560p165493o155714n337444m074819l041171k152814j611484
$$ 44486199 37527639 30362146 24206432 18868988 14794169 11752998 9600184 7988700
15884G988700j063271j075188q68455m68304n44146j72605k20502j77823m00060
$$ 7988700 6925429 5850241 4981786 4513482 3969336 3796731 3576229 3398406 2998346
15875B998346L88130o56346J87925L4427O2213j22214k6888M3636k77611n7418
$$ 2998346 3386476 2730130 2918055 2952482 3014695 2892481 2865593 2909229 2631618 2574200
15865B574200j95811R4456p0388J11297j82189k6242Q6385N1978j17698J10717
$$ 2574200 2378389 2472845 2402457 2513754 2331565 2305323 2391708 2443686 2325988 2436705
15855B436705q4426J53896j37287j1753P9030L3466k21623J76726m04408L79959
$$ 2436705 2352279 2506175 2368888 2357135 2436165 2469631 2248008 2424734 2020326 2400285
15845B400285l08470o8868J68292K14566l75816K07496K47071J7430J12167Q3122
$$ 2400285 2091815 2022947 2191239 2405805 2029989 2237485 2484556 2501986 2614153 2697275
15835B697275l5471o1901o8371L6617J14201j96317k0046o1400J03709q3711j3997
$$ 2697275 2661804 2599903 2531532 2568149 2682350 2486033 2465987 2404587 2508296 2424585 2410588
15824B410588l1794L604O5356j90347P3841M5736j11175M2740J79068k03237R3159
$$ 2410588 2378794 2382398 2447754 2257407 2331248 2376984 2265809 2308549 2487617 2284380 2377539
15813B377539R0632L1436K36742k18934P8996k3560P4118p4016J77808P5412L1014
$$ 2377539 2468171 2499607 2736349 2517415 2596411 2572851 2646969 2572953 2750761 2826173 2857187
15802B857187k82470L01727r668Q6909L7261L20111j00867K88982l4834J55430
$$ 2857187 2574717 2876444 2866776 2953685 2990946 3311057 3210190 3499172 3464338 3619768
15792C619768P4268J13749p5387J17653M3721j04941J80625M9336Q6905M57515
$$ 3619768 3694036 3807785 3732398 3850051 3893772 3788831 3969456 4018792 4105697 4563212
15782D563212k38622K81881J43438K24351O3308L62277j1690k69741Q8939M5765
$$ 4563212 4324590 4606471 4749909 4974260 5037568 5399845 5388155 5118414 5207353 5253118
15772E253118j20160R0017j49691j64724K44161R9362P6742J05096j5397j3632
$$ 5253118 5132958 5222975 5073284 4908560 5152721 5252083 5328825 5433921 5418524 5404892
15762E404892J18254J72742k03846P0320q5284J35238j92623J10778j65590k9195
$$ 5404892 5523146 5695888 5492042 5562362 5477078 5612316 5419693 5530471 5364881 5335686
15752E335686p9045J84117j91570K93518L7748J2261O077K32358P8285M30604
$$ 5335686 5256641 5440758 5249188 5542706 5580454 5592715 5598792 5831150 5909435 6340039
15742F340039k7465M89652J59552J00978K41881l0346L23527J76603j04895j34642
$$ 6340039 6312574 6802226 6961778 7062756 7304637 7274291 7597818 7774421 7669526 7534884
15732G534884K17994n7145K66101j08322R4454J72861R0369j93543j81222k0518
$$ 7534884 7752878 7695733 7961834 7853512 7947966 8120827 8211196 8017653 7836431 7815913
15722G815913j85012k7624k76438q187j24337j61730J59459k26205Q8601n1422
$$ 7815913 7630901 7603277 7326839 7318652 7194315 7032585 7192044 6965839 7054440 7003018
15712G003018p1490k75941K84402k48612J63765r7124k0762L74240J02014M04519
$$ 7003018 6931528 6655587 6939989 6691377 6855142 6758018 6737256 7111496 7213510 7618029
15702G618029J71342K96608K99715J34983K52988n3895N7964J95866J18122j11925
$$ 7618029 7789371 8085979 8385694 8520677 8773665 8719770 8777734 8973600 9091722 8979797
15692H979797Q3321R5612n83854J79645K3743n3291o1925r7276p7365r8178J0405
$$ 8979797 9063118 9158730 8574876 8754521 8778264 8724973 8663048 8565772 8488407 8390229 8400634
15681H400634J19030k17238l26339K0554k07999j41768j3060j98065m19236J72516
$$ 8400634 8519664 8302426 7976087 7996641 7788642 7646874 7633814 7435749 7016513 7189029
15671G189029k73092j468j4445N5638k13527M61183N3767J73014L98681M9555
$$ 7189029 6915937 6914469 6900024 6955662 6742135 7203318 7257085 7430099 7828780 7878335
15661G878335O06771M89548M75032L82284M10283P86495J71820Q79360J039926
$$ 7878335 8485106 8974654 9449686 9831970 10242253 11028748 11200568 12079928 13119854
15652A3119854M36344Q91173N03908Q42897N54451O64534P70138O91836M10502
$$ 13119854 13556198 14447371 14951279 15794176 16348627 17013161 17783299 18475135 18885637
15643A8885637P13567N45738J050053R46137P28765J024957P48418M73976L51278
$$ 18885637 19599204 20144942 21194995 22141132 22869897 23894854 24643272 25117248 25468526
15634B5468526O2537J82394k65443q6195k03002p7621l41944J1046l49640k7451
$$ 25468526 25531063 25713457 25448014 25361819 25158817 25081196 24739252 24750298 24400658 24373207
15624B4373207j76675l28460m70571n31426n58682j079468r44546r91674j043823
$$ 24373207 24196532 23868072 23397501 22866075 22307393 21227925 20283379 19291705 18247882
15615A8247882j025017r86417p16347n72387n15389o54096j23709m09354n99715
$$ 18247882 17222865 16236448 15520101 14947714 14432325 13778229 13654520 13245166 12645451
15606A2645451m51257l0637m89102l59259k23343l54450m09136j2458J1743k89855
$$ 12645451 12194194 12163557 11674455 11315196 11091853 10737403 10328267 10315809 10327552 10037697
15596A0037697L67092j46589O35341N92175J502351L664989P008573J1840615
$$ 10037697 10404789 10258200 10893541 11485716 12988067 16653056 23661629 35502244
15588C5502244J1202314P301014N355446L490108K683395P34205n85006l520994
$$ 35502244 46704558 54005572 59361018 62851126 65534521 66268726 65683720 62162726
15580F2162726p207604r766030j0326423r740375o031695l658333k454771k005029
$$ 62162726 54955122 45189092 34862669 25122294 19090599 15432266 12977495 10972466
15572A0972466j047470n13657q82151J13588J13997l0720J5524m1539J67443K34667
$$ 10972466 9924996 9411339 8529188 8642776 8756773 8726053 8741577 8700038 8867481 9102148
15562I102148J41145J08616L59864O57401J386050K204986N650704J1455566J6100121
$$ 9102148 9243293 9351909 9711773 10369174 11755224 13960210 19610914 31066480 47166601
15553D7166601J3019217Q843216O440291M248746K498526N59662j532675o014661
$$ 47166601 60185818 69029034 75469325 79718071 82216597 82776259 81243584 75228923
15545G5228923j0489047j3176712j3933258j1275942o906708m474575k812175
$$ 75228923 64739876 51563164 37629906 26353964 19447256 14972681 12160506
15538A2160506k206838j520943q28171o86186m86734j57256o9092k22724J1599
$$ 12160506 9953668 8432725 7604554 6918368 6431634 6274378 6205286 5982562 5994161
15529E994161r0268k90740O6493o7308m04058J58284l07875k05444j60395j67194
$$ 5994161 5903893 5613153 5679646 5612338 5208280 5366564 5058689 4853245 4692850 4525656
15519D525656K66017l08460J52067K46907l515l31330L10449K0096J58285O0310
$$ 4525656 4791673 4483213 4635280 4882187 4878672 4547342 4857791 4877887 5036172 5096482
15509E096482M27591p8867j19919K2579n3317K86638k84418r2826k61295K92452
$$ 5096482 5524073 5445206 5325287 5347866 5294549 5581187 5296769 5203943 4942648 5235100
15499E235100l68009J39164j48842j93695J89269J13054Q0735j1612K63661l28084
$$ 5235100 4867091 5006255 4857413 4663718 4852987 4966041 5046776 5035164 5298825 4970741
15489D970741L36158K35283N0504m8971N1809K43880p2999J33913M66937p4730
$$ 4970741 5306899 5542182 5592686 5543715 5595524 5839404 5766405 5900318 6367255 6292525
15479F292525J93846J13323j76197J81108J5415J0621J57463L86743L73168P69636
$$ 6292525 6486371 6599694 6423497 6604605 6620020 6630641 6788104 7174847 7548015 8317651
15469H317651O68456M68260P64618K950K61546K757K41496k82318l13269k72645
$$ 8317651 8986107 9454367 10218985 10221935 10483481 10486238 10727734 10445416 10132147 9859502
15459I859502k40485k48195k1961N55877L30601M71760J86612L39831N55762P539
$$ 9859502 9619017 9370822 9348861 9904738 10235339 10707099 10893711 11233542 11789304 11796843
15449A1796843p8613m2736l4335o29183n41571p0106m2660j66592L31089k7960
$$ 11796843 11718230 11675494 11641159 11011976 10470405 10400299 10357639 10191047 10522136 10494176
15439A0494176K49722k5528K7966J58890n3854j24997j4178l90965n23339j32265
$$ 10494176 10743898 10718370 10746336 10905226 10851372 10726375 10712197 10321232 9797893 9665628
15429I665628l84710m81518K77023m94522k89608m34529n8463k33999j86765l72133
$$ 9665628 9280918 8799400 9076423 8581901 8292293 7857764 7799301 7565302 7378537 7006404
15419G006404j71637j19762k68170k94012J60769k99096O9229k82115Q0415k08519
$$ 7006404 6834767 6715005 6446835 6152823 6313592 6014496 6083725 5801610 5882025 5673506
15409E673506J40736P7740j96145q0999J15933K97620J21246j9104M1865K4726
$$ 5673506 5814242 5891982 5695837 5614838 5730771 6028391 6149637 6130533 6172398 6197124
15399F197124K07876j2008K30702K23896j29289L2350J69218R054k68799N2988
$$ 6197124 6405000 6392992 6623694 6847590 6718301 6750651 6919869 6928923 6660124 6713112
15389F713112L5444M7185O5134J27670J17467p7132K0343R4897p1164J58977l02806
$$ 6713112 6748556 6795741 6860875 6988545 7106012 7028880 7049223 7144120 7072956 7231933 6929127
15378F929127O3282K20788k8377k97492J81348M3322j06905q6373K15522j96069
$$ 6929127 6992409 7213197 7184820 6887328 7068676 7111998 7005093 6918720 7134242 6938173
15368F938173K37983j29524L78339K28601K11945j03953R5819J32426J72664K22170
$$ 6938173 7176156 7046632 7424971 7653572 7865517 7761564 7857383 7989809 8162473 8384643
15358H384643K56544J31468o7341n4058J41640K18221N23528L82395N32876J812970
$$ 8384643 8641187 8772655 8705314 8651256 8792896 9011117 9534645 9917040 10449916 12262886
15348A2262886L403717M803045P035748N590853L656828L210725K028944J595446
$$ 12262886 15666603 20469648 27505396 33096249 36753077 39963802 41992746 43588192
15340D3588192J60227q77664k205062m086571n011152n388360m064511k568105
$$ 43588192 43748419 42870755 40665693 36579122 31567970 26179610 22115099 19546994
15332A9546994j663955j096248p36513p73514m95020m48741m61954k26375K2411
$$ 19546994 17883039 16786791 16050278 15276764 14781744 14333003 13871049 13644674 13667085
15323A3667085j99536j03141K04875M2077L99932N04711J045591K166268M085756
$$ 13667085 13467549 13364408 13569283 13611360 14011292 14516003 15561594 17727862 21813618
15314B1813618P382127J0368681J0893182R582567O799654M475748L239629J332047
$$ 21813618 29195745 39564426 50457608 60040175 66839829 71315577 74555206 75887253
15306G5887253j114826l357120o854602r372560j0548293j0186806p847282n117425
$$ 75887253 74772427 71415307 64560705 55188145 44639852 34453046 26605764 21488339
15298B1488339l522577k120794j387421j161814m50211l64742N1591l00719P0635
$$ 21488339 17965762 15844968 14457547 13295733 12845522 12480780 12532371 12231652 12302287
15289A2302287j77925N9104l935j79673L06806M2917m336J131202J337013L324740
$$ 12302287 12124362 12183466 12179531 11999858 12306664 12349581 12345245 13476447 14813460 18138200
15279A8138200N285729N955778N074438L169453K387765J704239M89068p5807
$$ 18138200 23423929 29379707 34454145 37623598 40011363 41715602 42204670 42128863
15271D2128863j602969k706089m353783n566308n438720m106102k628041j551136
$$ 42128863 40525894 37819805 33466022 27899714 22460994 18354892 15726851 14175715
15263A4175715j333070q85192r42256n62821p27948J15456l49555q879j03970
$$ 14175715 12842645 11957453 11015197 10452376 9724428 9839884 9490329 9481450 9377480
15254I377480l3402J67379K01057J30546L90256K01034K04456j0679k9282l17656
$$ 9377480 9344078 9511457 9712514 9843060 10233316 10434350 10638806 10628127 10598845 10281189
15244A0281189J34864k28982l05534p1745r3227K4705j03446K21620M15607L76362
$$ 10281189 10416053 10187071 9881537 9809792 9716565 9741270 9637824 9859444 10275051 10651413
15234A0651413N30359N38739K88729J31050K61497j54622K302j15551m21429l17096
$$ 10651413 11181772 11720511 12009240 12140290 12401787 12247165 12249467 12133916 11712487 11395391
15224A1395391m11147l30320m54403K8656j73411M043L56463L51587p4562K02735
$$ 11395391 10984244 10653924 10199521 10228177 10054766 10058809 10415272 10766859 10692297 10895032
15214A0895032M26791J37754Q6878n2430j18197m99024l56941n17151l86936m76822
$$ 10895032 11321823 11459577 11546455 11494025 11375828 10876804 10519863 10002712 9615776 9138954
15204I138954p36243m61254m01710j75447j33156m56179P165j00423q6605k6159
$$ 9138954 8402711 7941457 7539747 7364300 7231144 6774965 6782130 6681707 6595102 6568943
15194F568943o6593J05653J39227N2839K75980K502K84658J93314n7455K13076
$$ 6568943 6502350 6608003 6747230 6800069 7076049 7078551 7363209 7556523 7499068 7712144
15184G712144J11643J22648k3536J10591l02709N43637M2670J7291O9764J84130
$$ 7712144 7823787 7946435 7922899 8033490 7730781 8274418 8317088 8334379 8404143 8588273
15174H588273K03407N3092k5973l1689j00330r8030j51262j25654k20218K93558
$$ 8588273 8791680 8844772 8818799 8787110 8686780 8588750 8437488 8311834 8091616 8385174
15164H385174K82109j86308L7377J11081p3529P5107K18897J05400J24201J01898
$$ 8385174 8667283 8480975 8518352 8629433 8555904 8631011 8849908 8955308 9079509 9181407
15154I181407J12002j25852J55249k02308n9706J10065k47002O4333J12493r8698
$$ 9181407 9293409 9167557 9322806 9120498 9060792 9170857 8923855 8988188 9100681 9001983
15144I001983J34469j25748k1691J61393J76476K7746J23718k53297K50601r8098
$$ 9001983 9136452 9010704 8989013 9150406 9326882 9354628 9478346 9225049 9475650 9377552
15134I377552p2456j17586J44084N1419k62478P5021J87917j96716M5216r7209
$$ 9377552 9305096 9187510 9331594 9383013 9120535 9195556 9383473 9186757 9231973 9134764
15124I134764J30455l62869p8338P8182l27064L1001j09727p0275j37072k5604
$$ 9134764 9265219 8902350 8824012 8902194 8575130 8606131 8496404 8426129 8289057 8263453
15114H263453Q8014j99268P0980j64237l9134O0173L922K06692P9567j51170K46832
$$ 8263453 8351467 8152199 8223179 8058942 8019808 8079981 8083903 8290595 8370162 8218992 8465824
15103H465824L02379L464K22483L29154M8900N50010J53513L55021J57836P29729
$$ 8465824 8768203 8771667 8994150 9323304 9372204 9922214 10075727 10430748 10588584 11318313
15093A1318313L76916R09854J201247K383184K504668K310226J952623J421767
$$ 11318313 11695229 12605083 13806330 16189514 18694182 21004408 22957031 24378798
15085B4378798P70630P36529J23488N8535p29312r65837j581822j122796m56857
$$ 24378798 25149428 25885957 26009445 26067980 25338668 24372831 22791009 21668213 21211356
15076B1211356J047578J767094K184364J823950J358898Q04271P69822M74134
$$ 21211356 22258934 24026028 26210392 28034342 29393240 30197511 30967333 31441467
15068C1441467m7449m16254j26244l18059J341711K770763K041592K077263J688381
$$ 31441467 31394018 30977764 30851520 30533461 31875172 34645935 36687527 38764790 40453171
15059D0453171J920773J941294K308009J734460Q30419k06877j397810j438416
$$ 40453171 42373944 44315238 46623247 48357707 49188126 48981249 47583439 46145023
15051D6145023k03639J771346K586831K312819J101606K99355M04311L52954Q71628
$$ 46145023 45941384 47712730 50299561 52612380 53713986 54013341 54417652 54770606 55642234
15042E5642234M75248l23934j532736k454288k716030l167806k351266k334245
$$ 55642234 56117482 55793548 54260812 51806524 49090494 45922688 43571422 41237177
15034D1237177j900742k345873j982903r22094J172433J825008R55258Q27187
$$ 41237177 39336435 36990562 35007659 34085565 35257998 37083006 38038264 38865451
15026C8865451Q57171J124148R31458N95008Q25639L86240k22301J58197J321582
$$ 38865451 39722622 40846770 41778228 42373236 43198875 43585115 43362814 43521011 44842593
15017D4842593L422986M286278N130089N135871N295992N462497N280337M206858
$$ 44842593 48265579 52551857 57681946 62817817 68113809 73576306 78856643 83063501
15009H3063501L690907J983397J022745M17337j34716K85566P75042J581093K363741
$$ 83063501 86754408 88737805 89760550 90177887 90043171 90328737 91103779 92684872 95048613
15000I5048613L849450N444927O500005O618093O433172N245372L834765K257911
$$ 95048613 98898063 104342990 110842995 117461088 123894260 129139632 132974397 135232308
14992A35232308l22563k309677m301333o245742o249044o595759p241743p436595
$$ 135232308 134909745 132600068 128298735 122052993 115803949 109208190 101966447 94529852
14984I4529852o379292o012734m967601m751497m376606m537630m678222m978328
$$ 94529852 88150560 82137826 77170225 72418728 68042122 63504492 58826270 53847942
14976E3847942m943045m042595l635881k919482k958594j934331j639159j153987
$$ 53847942 48904897 44862302 41226421 38306939 35348345 33414014 31774855 30620868
14968C0620868o36733j79394L343O0784J96104K81879M49364Q48670J187000K004779
$$ 30620868 29984135 29804741 29808084 29868868 30064972 30346851 30796215 31644885 32831885 34836664
14958C4836664L075168M563764O447340R422649J2842696J7563912K0123628K2897507
$$ 34836664 37911832 42475596 48922936 58345585 71188281 88752193 108875821 131773328
14950A31773328K6257110K8564100K8383154K7912695K8529166K4362632J5138488
$$ 131773328 158030438 186594538 214977692 242890387 271419553 295782185 310920673
14943C10920673N434342k524741q516333j2129217j4808534j7645647k1147070
$$ 310920673 316355015 313830274 305313941 293184724 278376190 260730543 239583473
14936B39583473k2867984k2601820k0136908j5282433j0936516r319948r197983
$$ 239583473 216715489 194113669 173976761 158694328 147757812 138437864 129239881
14929A29239881r919707j0463618j0077272q198489o219752l540610k381030k774810
$$ 129239881 119320174 108856556 98779284 90580795 84361043 80820433 78439403 75664593
14921G5664593l181941l511594l339621l370308l535495m012019n192608o397514
$$ 75664593 72482652 68971058 65631437 62261129 58725634 54713615 49521007 43123493
14913D3123493o646118o424734n070444l786146k176470k009315j237174m35626
$$ 43123493 36477375 30052641 24982197 21196051 19019581 17010266 15773092 15337466
14905A5337466n0777P1061M57001N62882Q04739J140513J123467K042071K830435
$$ 15337466 15286689 15357750 15814751 16377633 17182372 18322885 19446352 21488423 24318858
14896B4318858M304894M896401L972624K691854J946380R32430K66446Q1949j542131
$$ 24318858 28623752 33520153 37492777 40184631 42131011 43063441 43329887 43411836 41869705
14887D1869705k836136l466669m595984m442946l561618k478171j399225n81881
$$ 41869705 39033569 35566900 30970916 26527970 22966352 20488181 19088956 18507075
14879A8507075p50081n22381R3355O44836O80648O52358O77608K45412K39241
$$ 18507075 17756994 17234613 17327968 17972804 18653452 19305810 19983418 20228830 20468071
14870B0468071J91616N44974K06622L09371J48740K53813l5020O48782J629234
$$ 20468071 20659687 21204661 21411283 21720654 21869394 22123207 22088187 22736969 24366203
14861B4366203K562500M893611P185951P338713Q362235Q281212Q004694O316201
$$ 24366203 26928703 31822314 39008265 46346978 54709213 62990425 70995119 77311320
14853G7311320L413329J656446p81008l389716n552064p258633q364123q539743
$$ 77311320 80724649 82381095 81600087 78210371 72658307 65399674 57035551 48495808
14845D8495808p641972p380615n379627l403258k041191j929126j470979o92548
$$ 48495808 40853836 33473221 28093594 24690336 22649145 20720019 19249040 18556492
14837A8556492o64652o81214m48389l84349k31943o9239j56374N3325J31924J91464
$$ 18556492 17891840 17210626 16762237 16377888 16145945 16076706 15920332 15973657 16105581 16297045
14827A6297045N35378O89160O78175O03968J749577K121738M312945O212584P044341
$$ 16297045 16832423 17521583 18199758 18803726 20553303 22675041 26987986 33200570 40244911
14818D0244911O398031M312348L071017J773835N84459n27145j989084m478650
$$ 40244911 46642942 50955290 54026307 55800142 56384601 55857456 53868372 49389722
14810D9389722o037972p073856p006928n937355l770608k904104j506822j322943
$$ 49389722 43351750 36277894 29270966 23333611 19563003 16658899 15152077 13829134
14802A3829134p91376q91793k38313k51755j22193l27003k23049l00191j90672
$$ 13829134 13037758 12145965 11907652 11655897 11533704 11206701 10983652 10683461 10492789
14793A0492789j62343m29727l788n9037n8642k18634j28228j70863L407L03826
$$ 10492789 10330446 9900719 9896931 9837894 9779252 9560618 9432390 9261527 9264934 9568760
14783I568760J618J31142O22505M32361P82338P67428M08889L72993J15330R2355
$$ 9568760 9570378 9701520 10324025 10756386 11538724 12306152 12715041 13088034 13203364 13295719
14773A3295719j51967k52779j13447p41159n74805p40933p85464l77449j77869
$$ 13295719 13143752 12890973 12777526 12036367 11461562 10720629 9935165 9557716 9379847
14764I379847j4571l1201q9089O1724N4575J86472L64798K97883j301Q8972N3067
$$ 9379847 9365276 9334075 9244986 9306710 9361285 9547757 9912555 10210438 10209137 10298109 10351176
14753A0351176M75566J12512K31454K80357M8869j82381K56692Q3385j47593N11483
$$ 10351176 10826742 10939254 11170708 11451065 11499934 11317553 11574245 11657630 11510037 12021520
14743A2021520J10504J49015M60903M77985N35594J426065J434712J395645K841957
$$ 12021520 12132024 12281039 12741942 13219927 13755521 15181586 16616298 18011943 20853900
14734B0853900L511772N337935Q295548J3548547K0825653K5868529K8593851
$$ 20853900 24365672 29703607 37999155 51547702 72373355 98241884 126835735
14727A26835735K8807955K6263291K0179663J3507120P129451K94794p133859
$$ 126835735 155643690 181906981 202086644 215593764 222723215 223018009 215884150
14720B15884150j5297795k2572515k7496620k9112293k6772573k2694808j7393489
$$ 215884150 200586355 178013840 150517220 121404927 94632354 71937546 54544057
14713E4544057j2119765q275221o169655m214785l619987k371431j506027j559350
$$ 54544057 42424292 34149071 27979416 23764631 20144644 17773213 16267186 14707836
14705A4707836q27251p75551j066683n50832q95997p19483m75017l85953m81578
$$ 14707836 13880585 13105034 12038351 11487519 10591522 9872039 9397022 9011069 8529491
14696H529491k4831J36862l73555j5842j13068P0007j4388J42660j7784J75124
$$ 8529491 8504660 8641522 8267967 8252125 8139057 8209064 8194676 8337336 8319552 8494676
14686H494676l16558K03451r5838l6657N01352J14068M36745P0034P05281O61015
$$ 8494676 8178118 8381569 8285731 8249074 8750426 8864494 9301239 9371273 10076554 10737569
14676A0737569J074323M03509L52307n9862j59553j08327j98482n71090l00940
$$ 10737569 11811892 12215401 12567708 12507846 12348293 12239966 12041484 11470394 11169454
14667A1169454j081847m87567k49148m59577k74884o5159k80605K14104l5795
$$ 11169454 10087607 9600040 9350892 8891315 8616431 8551272 8270667 8484771 8448976
14658H448976o7541l98301m51246n73290j66757m07084K05398n07057K13383J75175
$$ 8448976 8381435 7983134 7531888 6958598 6791841 6384757 6590155 6083098 6296481 6471656
14648F471656M47459K16711K65979L12819J28745M36156K25291L16655L02474
$$ 6471656 6919115 7135826 7401805 7714624 7843369 8279525 8504816 8821471 9123945
14639I123945O30113K16639L71831N59966K49427N47512r0142j2748j91373l37570
$$ 9123945 9754058 9970697 10342528 10902494 11151921 11699433 11609291 11596543 11405170 11067600
14629A1067600p49672j096535j089097q98275p54232m00793q71453l83852j61447
$$ 11067600 10317928 9221393 8132296 7234021 6479789 6078996 5207543 4823691 4662244
14620D662244k17231O7100Q8274j60864p8513J46421l54258K07021R3722j99585
$$ 4662244 4445013 4512113 4600387 4439523 4361010 4507431 4153173 4360194 4453916 4254331
14610D254331j458j40553j75399j99655R1471p2383M9259J56980L04674M56392
$$ 4254331 4252873 4112320 3936921 3737266 3828737 3756354 3805613 3962593 4267267 4723659
14600D723659Q95021O99266J028069O22718M60739M23246R4436J3418k99427k73447
$$ 4723659 5618680 6317946 7346015 7968733 8429472 8852718 8947154 8960572 8661145 8387698
14590H387698p00362r08098n56357m81308p61934o0257l80766K68840m45106J34882
$$ 8387698 7687336 6779238 6222881 5741573 4979639 4919382 4538616 4807456 4362350 4497232
14580D497232K556j12401k57025K94886k26575L47370k526Q9354Q8518R3428P0870
$$ 4497232 4499788 4387387 4130362 4425248 4198673 4546043 4543517 4632871 4721389 4814817 4885687
14569D885687K44980L49636J033902O36423J70120P94104J154347J162498K226634
$$ 4885687 5130667 5480303 6514205 7150628 7320748 8114852 9269199 10431697 12658331
14560A2658331L818029O817824O960645N024189L537755K447380J903853P23087
$$ 12658331 16476360 23294184 30254829 35279018 38816773 41264153 43168006 43891093
14552D3891093k12547j586303l562749n125293n593581n158576k910052Q66734
$$ 43891093 43678546 42092243 38529494 33404201 27810620 22652044 19741992 20608726
14544B0608726M189314O369699O230903M563096L015164K121158J586386l9845
$$ 20608726 24798040 31167739 37398642 41961738 44976902 47098060 48684446 48644601
14536D8644601j487795l291974m830966o423092o556274n313500l558005k132946
$$ 48644601 47156806 43864832 39033866 32610774 26054500 20741000 17182995 15050049
14528A5050049j184155p41243o25232j84594j55818m9153N99242J358973L220744
$$ 15050049 13865894 13124651 12499419 12314825 12159007 12109854 12709096 14068069 17288813
14519A7288813M929268M551076L301720K648498J619346J600075O47972P0564
$$ 17288813 22218081 26769157 30070877 32719375 34338721 35938796 36586768 36657332
14511C6657332j027220k670616l315750l775449k933461q46321J289832L627158
$$ 36657332 35630112 32959496 29643746 25868297 22934836 22088515 23378347 27005505
14503B7005505M308541L446868K237439J205626J568174k0110q40316j124693
$$ 27005505 31314046 34760914 36998353 38203979 39772153 39752043 38911727 37787034
14495C7787034k715304l872052m110629m900025l567655k859977j879190j738724
$$ 37787034 35071730 31199678 27089049 22189024 18621369 15761392 13882202 12143478
14487A2143478j378401j338210j065643j210104q66120p73579o85979l76198j61227
$$ 12143478 10765077 9426867 8361224 7151120 6285000 5511421 4825442 4449244 4288017
14478D288017k67739J20909j66380p4831J31386K27838N01656L50567P19986M29878
$$ 4288017 4020278 4141187 3974807 3899976 4031362 4259200 4760856 5111423 5831409 6261287
14468F261287L49170J98573j0496N3747l3610J39774N6174j93913K61154Q3428
$$ 6261287 6610457 6809030 6798534 6852281 6818671 6958445 7014619 6820706 7081860 7165288
14458G165288P99727J34587K80732L84710l0756n0687j90286m65632k41673n52656
$$ 7165288 7965015 8099602 8380334 8765044 8734288 8683601 8493315 8027683 7786010 7233354
14448G233354o50467m29467L3117l20884L00669J31019J09029L45202J91548L09504
$$ 7233354 6582887 6153420 6186537 5865653 6166322 6297341 6406370 6751572 6943120 7252624
14438G252624p5878M07721J67278J79845K96281O88187M56029R19619J746368
$$ 7252624 7176746 7584467 7751745 7931590 8227871 8916058 9372087 10291706 12038074
14429A2038074L636854M354162N314416M920311M032401K955256J871205J600147
$$ 12038074 15674928 20029090 25343506 30263817 34296218 37251474 39122679 40722826
14421D0722826J99723r10179k061051l509473m805137m660765m186501l445869
$$ 40722826 40922549 40012370 37951319 34441846 29636709 24975944 20789443 17343574
14413A7343574k754699j796268j468416j095465j094271o30694m54379p15447
$$ 17343574 14588875 12792607 11324191 10228726 9134455 8503761 8049382 7333935
14405G333935J246k1166j63891J77808N0099J0207Q6907N99854N73367Q02048
$$ 7333935 7335181 7314015 7150124 7327932 7378031 7388238 7475145 8074999 8648366 9450414
14395I450414J752065K351695M421298O315862Q064738Q555472Q077387O478695
$$ 9450414 11202479 13554174 17975472 24291334 32356072 40911544 48988931 55467626
14387E5467626M726418L443613J379435n41027k757804n244779p076976q198838
$$ 55467626 60194044 63637657 65017092 64476065 61718261 56473482 49396506 41197668
14379D1197668p753890p132862n246366m099676k995113k284280j422148j139304
$$ 41197668 33443778 26310916 21064550 16964874 13969761 11685481 10263333 9124029
14371I124029m83427n96888m70556Q9794l64886o0656l35643j74460Q6187K48275
$$ 9124029 8640602 8043714 7573158 7662952 7298066 7237410 6901767 6727307 6813494 7061769
14361G061769j74803L80976O41599O90135J408317K111294K644446L408021L637216
$$ 7061769 6886966 7267942 7909541 8599676 10007993 12119287 14763733 18171754 21808970
14352B1808970L163519K852167J685162J227662O723o13195j220260k332284k984707
$$ 21808970 24972489 27824656 29509818 30737480 30744203 30131008 28910748 26578464 23593757
14343B3593757l398546l120995k865301k085719j183041o58161J300986K938961
$$ 23593757 20195211 17074216 14208915 12123196 10940155 10281994 11582980 14521941
14335A4521941J959617J383902R35892P73812N68583O13265R976k51651j422461
$$ 14521941 16481558 17865460 18801352 19575164 20143747 20757012 20766988 20515337 19092876
14326A9092876j613802j977521j458623J09378M70283M84486J450781K110312
$$ 19092876 17479074 15501553 14042930 14152308 14622591 15107077 16557858 18668170
14318A8668170K853022L736001M836977O578929Q987682J1555182J3506449J3817827
$$ 18668170 21521192 25257193 30094170 36673099 45660781 57215963 70722412 84540239
14310H4540239J2393205R957178O842677M290739J634995j524517m851375q717536
$$ 84540239 96933444 106890622 113733299 118024038 119659033 118134516 113283141 104565605
14302A04565605j1764876j4069789j3945212j2155573j0043561p741037o206261
$$ 104565605 92800729 78730940 64785728 52630155 42586594 34845557 28639296
14295B8639296m953940l760159l000861k404019j944772j344622j430126n86742
$$ 28639296 23685356 19925197 16924336 14520317 12575545 11230923 9800797 9214055
14287I214055p72154r83540l38998o75708m19711j91485k49443l69252j96495
$$ 9214055 8441901 7458361 7119363 6443655 6023944 5832459 5583016 5213764 5017269
14278E017269j63716J04329m20255N2019j6389l08387P2771n00304J08749m39042
$$ 5017269 4853553 4957882 4537627 4589646 4573257 4264870 4337641 3837337 3946086 3507044
14268C507044K79515k53186l27706P4465j25571n3195L9606r5584j17741J27686
$$ 3507044 3786559 3533373 3205667 3280132 3154561 3101366 3140972 3045388 2927647 3055333
14258C055333j75857L6027j94031J60119k32525L41290l28419n9483M5608M674
$$ 3055333 2879476 2915503 2721472 2881591 2649066 2990356 2661937 2602454 2648062 2652736
14248B652736l3992j22258j70863o4938P7105j86997j14502O1420K06914k97066
$$ 2652736 2618744 2496486 2325623 2260685 2337790 2150793 2036291 2097711 2304625 2007559
14238B007559L35756l48692j814L00445l3830j54538M6378j61012k6411L083J64494
$$ 2007559 2343315 1994623 1992809 2293254 2259424 2104886 2151264 1990252 1963841 1966924 2131418
14227B131418j50116N6662l4983J29700R761j61457Q5345r4042M2313K11845P8085
$$ 2131418 1981302 2037964 2002981 2132681 2142442 1980985 2066330 1972288 2014601 2226446 2304531
14216B304531J63637J45021j92638O3833o8359M1424J73867J59400M99396O38627
$$ 2304531 2468168 2613189 2420551 2484384 2416025 2457449 2631316 2790716 3290112 3928739
14206C928739K15354j87715K04110j4599M4497j94379Q598o37951k53614m80402
$$ 3928739 4144093 3956378 4160488 4145889 4190386 3996007 4004605 3366654 3113040 2632638
14196B632638m35517J50808l93721J45513j03728J31442P5128N6347j36772Q6440
$$ 2632638 2197121 2347929 1954208 2099721 1995993 2127435 2202563 2258910 2122138 2208578
14186B208578N6959k68973K28238k37023J65786J4131K49903K4652J02338m7882
$$ 2208578 2265537 1996564 2224802 1987779 2153565 2167696 2417599 2442251 2544589 2496707
14176B496707m4416J29380j79540L00836j07931l37442J92016j27538K06415l48204
$$ 2496707 2452291 2581671 2402131 2702967 2595036 2257594 2449610 2322072 2528487 2180283
14166B180283n7651J01003j50157j53832J46947q8954n1861J01779J85052J12262
$$ 2180283 2122632 2223635 2073478 1919646 2066593 1977639 1925778 2027557 2212609 2324871
14156B324871p7701q8357J07014j60482J69239o9801J86466J6228j73584O9274
$$ 2324871 2247170 2158813 2265827 2105345 2274584 2204783 2391249 2407477 2233893 2303167
14146B303167j2166Q9385J51439L34721L77727M61735Q97316J128348J049671
$$ 2303167 2291001 2380386 2531825 2866546 3244273 3706008 4603324 5731672 6781343
14137F781343P22813N61718N9034N62200q033P6831o11484q57883j404363n70162
$$ 6781343 7504156 8065874 8124908 8687108 8679075 8755906 8144422 7286539 5882176 5312014
14127E312014n75492m79078n73879l93586m23475K38494L54874L37842j16568
$$ 5312014 4736522 4257444 3683565 3289979 2866504 3104998 3459872 3797714 3681146
14118C681146J08734L32786J47009k15676J92216k55290j87100k58094k00178
$$ 3681146 3789880 4122666 4269675 4053999 4246215 3990925 3803825 3545731 3345553
14109C345553m06103k2435k63603o0020K5346J48908j54412k05854L01683J06196
$$ 3345553 2939450 2917015 2653412 2593392 2618738 2767646 2613234 2407380 2709063 2815259
14099B815259L54202M77873L58800L22912K37717L9826K86687R007J50989n2495
$$ 2815259 3169461 3647334 4006134 4329046 4566763 4606589 4893276 4902283 5053272 5000777
14089E000777k62283m60763j56118j54861L99888L63449L99019K36436K42794
$$ 5000777 4738494 4277731 4121613 3966752 4366640 4730089 5129108 5365544 5608338
14080E608338R9583K83987k33441m5934k42558l76576m22984j58168n53334k11264
$$ 5608338 5707921 5991908 5758467 5712533 5469975 5093399 4670415 4512247 3958913 3747649
14070C747649J71542k74832K8097j54508L13766p1189J78779M21371L53268K35546
$$ 3747649 3919191 3644359 3672456 3517948 3831714 3760525 3939304 4360675 4713943 4949489
14060D949489Q11609M9566P48170J92270L65820M61359J19861L80309O78963L17777
$$ 4949489 5761098 5810664 6558834 6751104 7116924 7578283 7698144 8078453 8757416 9075193
14050I075193N62700K37486J233614J135661J708631J517151K208475L165471
$$ 9075193 9637893 9875379 11108993 12244654 13953285 15470436 17678911 20844382
14042B0844382L395569M836786N920457P972498J0252559J3290077J4706845J3800049
$$ 20844382 24239951 29076737 34997194 42969692 53222251 66512328 81219173 95019222
14034I5019222J1378857Q196926N587314K374138l12197l803908p546534j0919538
$$ 95019222 106398079 114595005 120182319 122556457 122244260 118440352 110893818 99974280
14026I9974280j3914313j4544148j3570191j1123504q863552o908137n507324
$$ 99974280 86059967 71515819 57945628 46822124 37958572 31050435 25543111
14019B5543111l953617l213468k983367k004317j437898j224071j122462j111320
$$ 25543111 21589494 18376026 15392659 13388342 11950444 10726373 9603911 8492591
14011H492591q38924m37652m56744m73300o61861m34813l24614j25428k55267
$$ 8492591 7653667 7216015 6759271 6285971 5624110 5189297 4864683 4739255 4483988
14002D483988k20602M7658l18561L0376l32367n2042j35588j99274j9796J28485
$$ 4483988 4263386 4311044 3992483 4022859 3690492 3638450 3502862 3303588 3283792 3412277
13992C412277M875J43295J37421M87486J07046M87176N55829Q89905R32309Q67186
$$ 3412277 3417152 3560447 3697868 4185354 4292400 4779576 5335405 6225310 7157619 8024805
13982H024805Q45234L44178L34543R9657j11182j15738p60620n67514q25710p88083
$$ 8024805 8870039 9214217 9548760 9648417 9537235 9421497 8660877 8093363 7267653 6479570
13972F479570p13771p11202k31268n42338k52572l40072j46543m4750k35233j80943
$$ 6479570 5765799 5054597 4823329 4280991 4028419 3688347 3541804 3497054 3261821 3080878
13962C080878r8051k16957l16827N7826k88014q2974k84490J90089L3826n8152
$$ 3080878 2982827 2765870 2449043 2506869 2218855 2135881 1851391 2041480 2075306 2017154
13952B017154J88878K16082J87392n4799L89169M0532J30162J01018J56600L50607
$$ 2017154 2206032 2422114 2609506 2554707 2943876 2984408 3114570 3215588 3372188 3722795
13942C722795K01494R60766O81950K238743K371103K628425L073763K533497K508276
$$ 3722795 3924289 4885055 5567005 7805748 10176851 12805276 15879039 18412536 20920812
13933B0920812J683398N73316N01361o41131j658266k595762k702422k730834
$$ 20920812 22604210 23177526 23678887 23037756 21379490 18783728 16081306 13350472
13925A3350472k984137k318860k147241j156370o99124q82997n32651j09243j42548
$$ 13350472 10366335 8047475 5900234 4743864 4044740 3161743 2629092 2519849 2377301
13916B377301l63670K26273j23543k06593j56016k15388M51045j10243j15834
$$ 2377301 2013631 2239904 2116361 1909768 1753752 1538364 1989409 1879166 1763332
13907A763332j01597o1734J83311K70898n92724J54029o3843K49939O4018j87316
$$ 1763332 1661735 1600001 1783312 2054210 1461486 1615515 1551672 1801611 1865629 1678313
13897A678313k27345K32717j14725k4574K58169k19154R2527j19731M1778k4690
$$ 1678313 1450968 1683685 1568960 1544386 1802555 1583401 1675928 1556197 1597975 1573285
13887A573285J02482J38874k69295J17429P5624m8147p4240k2450m9826q3998
$$ 1573285 1675767 1814641 1545346 1662775 1738399 1690252 1616012 1593562 1543736 1459738
13877A459738K35549p6004j55622L68040l86253J80652j66470K85822j99957J72125
$$ 1459738 1695287 1619283 1463661 1831701 1445448 1626100 1459630 1745452 1545495 1717620
13867A717620M4708k03584K05102j31343K5525k6250q2532L47577j68560J44381
$$ 1717620 1762328 1558744 1763846 1632503 1658028 1631778 1549246 1896823 1728263 1872644
13857A872644n7135M0863l47490L61769j35791J45437m1298o9498j54499J76038
$$ 1872644 1815509 1856372 1508882 1870651 1734860 1880297 1838999 1769501 1615002 1791040
13847A791040J65630k29824n9999j9252M3476J43613j57212j50850k7298k3370
$$ 1791040 1956670 1726846 1666847 1647595 1691071 1834684 1677472 1526622 1499324 1475954
13837A475954K29896l50783J62457j05985q3675J06369n7654M4916o0824R4814
$$ 1475954 1705850 1355067 1517524 1411539 1327864 1434233 1376579 1421495 1360671 1455485
13827A455485J96725j81109K31248p0049J8593j28236K06519k90197R9384K580
$$ 1455485 1652210 1471101 1702349 1632300 1650893 1522657 1729176 1438979 1538363 1540943
13817A540943J13413k36850R9415j74070J28533k38437J61886P1658J2323j97767
$$ 1540943 1654356 1417506 1516921 1342851 1471384 1232947 1394833 1466491 1478814 1281047
13807A281047L31179k60471q2954j78208M97272m5051k21636K02873J13240J60901
$$ 1281047 1612226 1351755 1268801 1090593 1587865 1542814 1321178 1524051 1637291 1798192
13797A798192l02019K19459j6218j3292k23913J89558J37445k49398j23j18281
$$ 1798192 1496173 1715632 1699414 1686122 1462209 1651767 1789212 1539814 1539691 1421410
13787A421410o8429P3321J10154Q7165j15698j49133J88861k14382R1287q5557
$$ 1421410 1352981 1426302 1536456 1623621 1507923 1358790 1547651 1333269 1424556 1338999
13777A338999l7205K25394P3202k35511n2059j0670J04213K23446k2301j05356
$$ 1338999 1301794 1527188 1600390 1364879 1312820 1302150 1406363 1629809 1607508 1502152
13767A502152J9693j1416J62361J57475k27726P9162j96159J21877q2961K7976
$$ 1502152 1521845 1510429 1672790 1830265 1602539 1681701 1485542 1607419 1524458 1552434
13757A552434J64154j79730O6328r5104K56745l78059J50566P4797L5836R5519
$$ 1552434 1716588 1536858 1603186 1508082 1764827 1386768 1537334 1612131 1647967 1743486
13747A743486J55370K51422j97257P0115O3110j25935p8915k59807L73649O5204
$$ 1743486 1898856 2150278 1953021 2023136 2086246 1960311 1881396 1621589 1995238 2060442
13737B060442j67346j0780j79433J27946j95521K05832j53902q9556k18567J03767
$$ 2060442 1893096 1882316 1702883 1830829 1635308 1841140 1687238 1597682 1379115 1482882
13727A482882K19188k62230K14641j69348K65288j22918l9596J45169J23640k44326
$$ 1482882 1702070 1439840 1654481 1485133 1750421 1627503 1587907 1733076 1856716 1612390
13717A612390J8298K08865j57971K1175K68234k40671j4347P9665R2745M2866
$$ 1612390 1630688 1839553 1681582 1702757 1970991 1730320 1715973 1795638 1888383 1931249
13707A931249Q1433o6015J26721k25610q5127K06038k25466J07179J67121J23431
$$ 1931249 2012682 1946667 2073388 1847778 1762651 1968689 1743223 1850402 2017523 2140954
13697B140954j58076L18750J82651J58330j8879J00108R7444l7529J86812j08971
$$ 2140954 1982878 2301628 2484279 2642609 2623730 2723838 2821282 2783753 2970565 2861594
13687B861594k68987R0616j97356j45807k75503k6765J31557j44582k9777r2198
$$ 2861594 2592607 2683223 2485867 2340060 2064557 2037792 2169349 2024767 1994990 1902792
13677A902792J33243q0537J89898j00878J05866j5253J82856n9616P6368p0996
$$ 1902792 2036035 1955498 2145396 2044518 2150384 2135131 2317987 2258371 2334739 2263743
13667B263743M44212K71564J92426p6152R7646L75228J86463k61198J18764o5824
$$ 2263743 2707955 2979519 3171945 3095793 3193439 3568667 3755130 3493932 3612696 3546872
13657C546872M3148n59152k82416j22821L6466l13495K26124k60140l32547J51105
$$ 3546872 3590020 3030868 2748452 2625631 2662097 2348602 2574726 2314586 1982039 2133144
13647B133144j12025J34588Q692O8712j97021j36392J44222J65673Q741p8009
$$ 2133144 2021119 2155707 2164399 2233111 2036090 1899698 2043920 2209593 2218334 2140325
13637B140325O7055L04900Q0673M20698l47047K63638K82284j54850m7815L54628
$$ 2140325 2207380 2512280 2592953 3013651 2666604 2930242 3212526 3057676 3009861 3364489
13627C364489n76802n1844k54704l52454K7105j28737L528k4240r4822j70331
$$ 3364489 2787687 2735843 2481139 2128685 2155790 2027053 2030581 2006341 1911519 1741188
13617A741188K90132k19773k30185M42112q5034r5893J81528J62872O238L52182
$$ 1741188 2031320 1811547 1581362 2023474 1938440 1842547 2024075 2186947 2193185 2545367
13607B545367M5257k84384q4892J56859m8666l6839k1044r8053m7084j03632K52677
$$ 2545367 2590624 2306240 2221348 2378207 2329541 2292702 2271658 2173605 2126521 2022889 2275566
13596B275566k56256J83662j8806N1579r5202J96452J22861j72466M0637o5722
$$ 2275566 2019310 2202972 2184166 2235745 2140543 2336995 2459856 2287390 2328027 2262305
13586B262305N726k01134J24494l06541k2150k6402k53559j34677L47638j61672
$$ 2262305 2268031 2066897 2191391 1884850 1862700 1836298 1582739 1448062 1795700 1634028
13576A634028k1278n5264K4579K6788J40613j25778m9652Q1263j81356K32758
$$ 1634028 1612750 1557486 1582065 1608853 1749466 1623688 1574036 1655299 1473943 1706701
13566A706701J29449j87535p2722R4476J52178l55834J96961J34517k24554O3273
$$ 1706701 1836150 1648615 1575893 1670369 1822547 1466713 1663674 1798191 1573637 1636910
13556A636910r8764m9352J298K7423J98431N3679k5613j47177J2879J69925O0259
$$ 1636910 1538146 1488794 1490092 1517515 1715946 1769625 1744012 1596835 1609714 1779639 1839898
13545A839898K40273L22746J60234k0725K22070K31861o0736J0634j37686J60402
$$ 1839898 2080171 2402917 2563151 2542426 2764496 2996357 2935621 2946255 2808569 2968971
13535B968971l95402l6140j56834l85569K33020k84630j03538J60420O6612L47538
$$ 2968971 2573569 2537429 2380595 1995026 2228046 1943416 1839878 2000298 2066910 2414448
13525B414448K30234J34551l29033K37094L85007m01801O3312k78667r7827P507
$$ 2414448 2644682 2779233 2450200 2687294 3072301 2670500 2733812 2455145 2357318 2364825
13515B364825m53210k13235j8720N2097l43857K26862j01710M3862m28459K86232
$$ 2364825 1911615 1698380 1679660 1731757 1387900 1614762 1513052 1556914 1128455 1414687
13505A414687k42446L20508r8279j30235J40246j96921J78169o8038o9311j3283
$$ 1414687 1172241 1492749 1394470 1264235 1404481 1207560 1385729 1317691 1248380 1235097
13495A235097J56781k41430N00760r2061j57647j18732p226J8908M2406n1216
$$ 1235097 1391878 1150448 1651208 1559147 1401500 1282768 1275542 1294450 1336856 1285640
13485A285640J35892k78951J13618K14768j27204L9110j46971N2125R2807N7446
$$ 1285640 1421532 1142581 1256199 1470967 1343763 1382873 1235902 1288027 1380834 1438280
13475A438280j03323R5569j71397j12703K81299l7628k32642J05344J68664j49526
$$ 1438280 1334957 1430526 1259129 1146426 1427725 1390097 1157455 1262799 1431463 1281937
13465A281937J50860p6185m8597P0282J21964k2306R3069K5149O4597j61398L25485
$$ 1281937 1432797 1356612 1308015 1378297 1500261 1477955 1571024 1596173 1660770 1499372 1824857
13454A824857Q5800K04162O28709n1370J65959l08829L65296j48861J12328j50906
$$ 1824857 1910657 2114819 2743528 2692158 2858117 2549288 2914584 2765723 2878051 2727145
13444B727145j49951k84279j06531j37166k71898j85735J21754k38328J60653
$$ 2727145 2577194 2292915 2186384 2049218 1777320 1591585 1713339 1475011 1635664
13435A635664j51812q1267L81j57169J77921J5627j3562N1677J92897j63196J39236
$$ 1635664 1483852 1402585 1402966 1245797 1423718 1439345 1425783 1477460 1670357 1507161 1646397
13424A646397K12926K23964J0640N41881R1204M2392J46688q0671J09188n32044
$$ 1646397 1859323 2083287 2093927 2635808 2727012 2769404 2916092 2835421 2944609 2412565
13414B412565K44977k41197O9211o11266j41764L4807R094j10722k62174J31076
$$ 2412565 2657542 2416345 2485556 1874290 1732526 1767333 1776427 1665705 1403531 1534607
13404A534607J76766k29540L7362q3745O9599j75024L76183J9194j57471Q4499
$$ 1534607 1711373 1481833 1519195 1435450 1505049 1330025 1706208 1725402 1567931 1652430
13394A652430q2974j75656L35639n3232K32366j34129J63970L36059q7517K78769
$$ 1652430 1569456 1393800 1729439 1676207 1908573 1774444 1938414 2274473 2186956 2465725
13384B465725J23163K72582j44765q3190L16921k55034J18390k46293k18587O8236
$$ 2465725 2588888 2861470 2716705 2633515 2950436 2695402 2813792 2567499 2348912 2417148
13374B417148m29065O3942k40770K32644O8089j93669M779K25847K8714j20474
$$ 2417148 1988083 2052025 1811255 2043899 2111988 1918319 1923098 2148945 2177659 2057185
13364B057185J20929j2324J76800k39145m1075j51836J22661q7610O7535J81803
$$ 2057185 2178114 2165790 2342590 2103445 2062370 1910534 2033195 1945585 2013120 2194923
13354B194923m4994K36108K47166k60780J12846J52027o8126l03928R6569r4292
$$ 2194923 2149929 2386037 2633203 2372423 2485269 2637296 2569170 2265242 2361811 2267519
13344B267519j54870R9521j48765j41634J64540q9323L2682k31901L35920k77481
$$ 2267519 2112649 2212170 2063405 1921771 2086311 1996988 2029670 1797769 2133689 1856208
13334A856208K67112l44164l190K57426j61994N5990k455M1151j31932M289P5914
$$ 1856208 2123320 1779156 1775966 2033392 1871398 1927388 1924933 1966084 1834152 1838441 1914355
13323A914355m2978M34469k77916R4196N8493p7422K43390j10838L15510L20714
$$ 1914355 1871377 2305846 2027930 2122126 2180619 2103197 2346587 2235749 2551259 2871973
13313B871973L8158j9200o8127L09102j50319L135K2258l86589J06066j76354
$$ 2871973 2910131 2890931 2822804 3131906 2981587 2984722 3006980 2620391 2726457 2550103
13303B550103J23881R2779j00030K88128K02408o8774J66716L44384l26409K93912
$$ 2550103 2673984 2766763 2666733 2954861 3157269 3088495 3255211 3599595 3273186 3567098
13293C567098l85610J50288k90384J97000j9021p8243k78130K85264q4067o5697
$$ 3567098 3181488 3331776 3041392 3238392 3219371 3141128 2862998 3148262 3064195 2998498
13283B998498J24246N0453j31396J99784l3302K02554o3903K58893M6209k45726
$$ 2998498 3122744 3173197 3041801 3241585 3208283 3410837 3346934 3605827 3652036 3406310
13273C406310K86552J77772m6009N7725J88347o9077M5507O3553M0923J93680
$$ 3406310 3692862 3870634 3824625 3882350 4070697 4001620 4047127 4110680 4151603 4345283
13263D345283J41030K91737L7758J00549J19534j60395P24702K44798J94159l7451
$$ 4345283 4486313 4778050 4815808 4916357 5035891 4875496 5600198 5844996 6039155 6001704
13253F001704N79528k09226K20448L51960R2992J13321J78564N3919o0570L9043
$$ 6001704 6581232 6372006 6592454 6944414 7037406 7150727 7329291 7383210 7322640 7361683
13243G361683L0089J5619L09594j48670J16562Q8076K61968K31867J1811L32920
$$ 7361683 7391772 7407391 7716985 7568315 7684877 7772953 8034921 8266788 8278599 8611519
13233H611519M42629m4915O90664K75555K66729M0013M95621J01856J81809M21420
$$ 8611519 9054148 9009233 9699897 9975452 10242181 10282194 10777815 10879671 11061480 11482900
13223A1482900l8653L3480j71022O7760l46708k13366o8809k2263l02673j85594
$$ 11482900 11444247 11477727 11306705 11374465 11027757 10814391 10745582 10723319 10420646 10235052
13213A0235052J1548k92832m1310k97244O0488K2313k74604J97486n7502M0155
$$ 10235052 10246600 9953768 9912458 9615214 9675702 9698015 9423411 9620897 9563395 9603550
13203I603550R4832j60459M6645k21109N7440k64600j92379o121j57953j18479
$$ 9603550 9698382 9537923 9584568 9363459 9420899 9156299 8963920 8957799 8799846 8681367
13193H681367q8424k49231m33814M8610l04739r9110j31013j76683l95791j767
$$ 8681367 8592943 8343712 7909898 7958508 7653769 7554659 7423646 7246963 6851172 6849405
13183F849405j62576M9471n60098J49215o4746j73585l90278J69597j21699j2912
$$ 6849405 6686829 6736300 6176202 6325417 6260671 6087086 5696808 5866405 5744706 5731794
13173E731794l5653o5554j7323r2328K1079L5742m569l3241N9506K11461J48350
$$ 5731794 5696141 5630587 5613264 5520936 5542015 5577757 5573188 5539947 5599453 5810914 5959264
13162E959264J66737K17848K09149J98981L51016N9344L76253J4000j24452P4790
$$ 5959264 6126001 6343849 6552998 6751979 7102995 7162339 7538592 7552592 7428140 7502930
13152G502930n4129j50788J25945l54921J716K2774j27625m6807j11672J37314
$$ 7502930 7448801 7298013 7423958 7069037 7070753 7093527 6965902 6919095 6807423 6944737
13142F944737M1180j55790m37968O3225k81000j48529l69924m07009l00742J16258
$$ 6944737 6985917 6830127 6392159 6455384 6174384 6025855 5655931 5248922 4948180 5064438
13132E064438m27237k4670r3250k43220j01203M10676k30255J23993q8378l20656
$$ 5064438 4637201 4612531 4519281 4276061 4174858 4585534 4355279 4479272 4390894 4070238
13122D070238N6851m6870j06914J1087k42629j34004j19184j51732J93306j66612
$$ 4070238 4127089 4080219 3973305 3984392 3741763 3607759 3488575 3336843 3530149 3363537
13112C363537j27767K9910j16803J98420j00935P834J48442j73321J9940J26160
$$ 3363537 3235770 3265680 3148877 3347297 3246362 3254196 3402638 3229317 3249257 3375417
13102C375417K17893L5349J26255K4720M57176J33860O04940K02206N29294L75573
$$ 3375417 3593310 3628659 3754914 3779634 4236810 4370670 4975610 5177816 5707110 6082683
13092F082683J12182K74463J01268n5497m2554J26658p3033k37805J1392J16859
$$ 6082683 6194865 6469328 6570596 6515099 6472545 6599203 6526170 6288365 6299757 6416616
13082F416616j39749p9034J38498k20538l33867j77756k06774m62477j39862m60349
$$ 6416616 6276867 6197833 6336331 6115793 5781926 5604170 5397396 4934919 4795057 4334708
13072D334708j62390n98068j32146l5483k16020j4499k67757J35782O268k65926
$$ 4334708 4172318 3574250 3442104 3406621 3190601 3176102 2908345 3044127 3050395 2784469
13062B784469J43342k06647K29026j17599J45952L7499J83188O4207o7337j20473
$$ 2784469 2927811 2721164 2950190 2832591 2978543 3016042 3199230 3263437 3196100 3075627
13052C075627k79958K5711K73487k76975J20403K4300L4974o283k11128J51458
$$ 3075627 2795669 2821380 3094867 2817892 2938295 2962595 2997569 2991286 2780158 2931616
13042B931616L0152k63818Q4426J08535l204J35781m558m4097J64242k4246k6517
$$ 2931616 2961768 2697950 2782376 2890911 2887707 3023488 3018930 2974833 3139075 3114829 3088312
13031C088312Q7780N3802j9268K81006j58085J72752j09783K96007r9091l3890
$$ 3088312 3176092 3229894 3210626 3491632 3333547 3506299 3396516 3692523 3593432 3559542
13021C559542J086K11322p553K07578q7851k9646K87826m4544o6539L6454J46322
$$ 3559542 3560628 3771950 3764397 3971975 3884124 3854478 4142304 4097760 4031221 4067675 4213997
13010D213997n052M22710n5248K36415l7664l2657J95368L2046J69759J393J02903
$$ 4213997 4208945 4631655 4576407 4812822 4775158 4742501 4937869 4969915 5139674 5141067 5243970
12999E243970R4779L20582j99510J49062J11921M51963j9561J29291j1165P0919
$$ 5243970 5338749 5659331 5459821 5608883 5720804 6172767 6153206 6282497 6271332 6342251
12989F342251P9398J79439l64207K01871R5114K8519k08946J98707j4630J15034
$$ 6342251 6421649 6601088 6236881 6438752 6533866 6562385 6353439 6552146 6537516 6652550
12979F652550l19695P2284J54339j40186o3201j13160N816n5030j04022k09395
$$ 6652550 6332855 6405139 6559478 6419292 6356091 6242931 6248747 6193717 6089695 5880300
12969E880300O0133n2035k1257K6833k32959o5218l8740m9860m3727n128j02615
$$ 5880300 5940433 5888398 5867141 5893974 5661015 5595797 5557057 5507197 5463470 5458342 5355727
12958E355727o7694J03502l2505K05877k93356r0977P4270N5669J69481k86769
$$ 5355727 5288033 5391535 5359030 5564907 5271551 5180574 5254844 5310513 5479994 5193225
12948E193225J65174J55446j69001r1135N3290J02145l5680J11707l27164K36067
$$ 5193225 5358399 5513845 5344844 5253709 5306999 5409144 5373464 5485171 5158007 5394074
12938E394074J00090j46388K8138k50484N68089J05469J28644k32078K14306q1050
$$ 5394074 5494164 5347776 5375914 5125430 5693519 5798988 5927632 5695554 5909860 5828810
12928E828810k5868K02766j47070k3697l34066J69141j7012Q1589j93373J87634
$$ 5828810 5802942 6005708 5858638 5834941 5500875 5670016 5653004 5734593 5541220 5728854
12918E728854J38826k27739k45023M0683l4110k26068q372l1077l16507j14937
$$ 5728854 5867680 5639941 5394918 5435601 5401491 5175423 5167051 5135974 4819467 4704530
12908D704530j44253J89637l31032Q4207j18846K05608j94414k42871k36183J35069
$$ 4704530 4560277 4749914 4418882 4503089 4384243 4589851 4395437 4152566 3916383 4051452
12898D051452J5265j7991j16981j17990j04429n9257k23584j4352J45130r7243
$$ 4051452 4066717 4048726 3931745 3813755 3709326 3650069 3426485 3412133 3557263 3460020
12888C460020j53740L89609O073l87820M9361p2886J3373R9364k92736J18659
$$ 3460020 3306280 3695889 3701962 3314142 3363503 3290617 3303990 3403354 3110618 3229277
12878C229277j1066q7282J5056Q0316j98574J74038l42742J69471n6467j6111
$$ 3229277 3218211 3130929 3145985 3226301 3027727 3201765 2859023 3028494 2972027 2955916
12868B955916j92988K44153j77694L2610Q7304M9516k7333k56848N8625M5351
$$ 2955916 2762928 3007081 2829387 2861997 2949301 2998817 2971484 2714636 2773261 2818612
12858B818612k23903K01491n1903k5824j41697P6498Q4405k03086p4705K87189
$$ 2818612 2594709 2796200 2744297 2718473 2576776 2653274 2737679 2534593 2459888 2747077
12848B747077M6541j80649L28299k50634m1822J57660j64420k77693O04354k52080
$$ 2747077 2793618 2612969 2941268 2690634 2648812 2806472 2642052 2364359 2968713 2716633
12838B716633j75978J90112R0100p5245m667j01901J31662O9792j6823N5398J2121
$$ 2716633 2540655 2730767 2820867 2745622 2740955 2639054 2770716 2840508 2823685 2879083 2891204
12827B891204j83135J03783q6453R3148M44j0534j44348O3099O3031j26447n9942
$$ 2891204 2708069 2811852 2725399 2818547 2818991 2808457 2664109 2727208 2790239 2663792 2603850
12816B603850R1700J00917k71018J86699N6715k49751M8615J08363n654l1120
$$ 2603850 2695550 2796467 2525449 2712148 2768863 2519112 2567727 2676090 2670436 2639316
12806B639316L7294J45426j86606J34061j68631K65640j26258m6298K64568l9007
$$ 2639316 2676610 2822036 2635430 2769491 2600860 2866500 2740242 2693944 2958512 2919505
12796B919505J76176l16953N1068j7306J8481J15334K0358j37947k0915P0065
$$ 2919505 3095681 2778728 2829796 2812490 2830971 2946305 2966663 2828716 2807801 2877866
12786B877866J68827k84683M57841N4180m59685K54548n0794j78294J4286K48662
$$ 2877866 3046693 2762010 3219851 3274031 2814346 3068894 3018100 2839806 2854092 3102754
12776C102754k36230J28842j05151j47888K83161O3612l09750J90757n0356J80451
$$ 3102754 2866524 2995366 2890215 2742327 3025488 3089100 2779350 2970107 2919751 3100202
12766C100202J66221k67540o2081J01312k6669K67952k15908r2865p2509K62635
$$ 3100202 3266423 2998883 2936802 3038114 3011445 3279397 3063489 2970624 2898115 3160750
12756C160750p9183j50250r798K47263j99810J75146l59768J28095j16343K73517
$$ 3160750 3081567 2931317 2921519 3168782 2968972 3144118 2784350 2912445 2796102 3069619
12746C069619j20073M2930K17101j83832k4249J7186J47005j1060l7520L6346
$$ 3069619 2949546 2992476 3209577 3025745 3001496 3018682 3165687 3154627 3117107 3153453
12736C153453j77647K56640P3952k06191K69629j98161j36128m4971P419K7884
$$ 3153453 2975806 3232446 3306398 3100207 3369836 3171675 3035547 2990576 2997995 3025879
12726C025879p6610K54566l24329J78656J43699M0126k19640P815j26476L74016
$$ 3025879 2949269 3203835 2879506 3058162 3201861 3241987 3022347 3030162 2903686 3277702
12716C277702j77955K8232j12834J50018J66861K29488k03074j7585N052P8634
$$ 3277702 3099747 3127979 3015145 3165163 3332024 3561512 3358438 3340853 3345905 3424539
12706C424539k53424L35584J05842Q2835O9688p508J80988J58044N3197k28157
$$ 3424539 3171115 3506699 3612541 3695376 3765064 3757556 3938544 4096588 4149785 3921628
12696C921628J27582J66239Q1275L63740K37436M15645N72222Q71259O78944L57690
$$ 3921628 4049210 4215449 4296724 4660464 4897900 5313545 5885767 6757026 7435970 7793660
12686G793660N1043R9183J72783j66338j22003l59341n35310n08385n48075o55910
$$ 7793660 7844703 7943886 8116669 7950331 7828328 7468987 6933677 6425292 5877217 5221307
12676E221307l50276k20766q6472J85627j04761J35316l01158P3876N0889M56391
$$ 5221307 4871031 4650265 4563793 4749420 4644659 4779975 4478817 4552693 4603582 5059973
12666E059973j84847k05l9530L88406m25146J61275j58199J18282J00946k17153
$$ 5059973 4875126 4874921 4835391 5223797 4798651 4959926 4801727 4920009 5020955 4803802
12656D803802m8691K6681K27218J87253K64215K42074J33042N20870j2928K00416
$$ 4803802 4755111 4781792 5009010 5196263 5460478 5702552 5835594 6356464 6343536 6543952
12646F543952k084J64660L8940J2287L03025k79453j87983L8600R0614M7855j85208
$$ 6543952 6541868 6706528 6745468 6757755 7060780 6781327 6593344 6631944 6722558 6770413 6585205
12635F585205J27152O8425O4955l42712L95820o2972K88297J1804L97575O5889
$$ 6585205 6712357 6780782 6845737 6503025 6898845 6835873 7124170 7135974 7533549 7599438
12625G599438l71478j33292J12561j06497n62887k0941m05070l09313j327m36484
$$ 7599438 7227960 7094668 7207229 7100732 6537845 6516904 6111834 5802521 5801194 5364710
12615E364710j27289K9457K63744K30215N86788O3569L79126L94761N88104N09150
$$ 5364710 5237421 5266878 5530622 5760837 6347625 6411194 6790320 7185081 7773185 8282335
12605H282335K57505K04624N5341j07131m89560l03108m21002m97402l92335m65300
$$ 8282335 8539840 8744464 8799805 8692674 8203114 7900006 7479004 6981602 6589267 6123967
12595F123967m18315j93109j0402k75065K77494M505K71266L19762j97565M04545
$$ 6123967 5705652 5512543 5502141 5227076 5504570 5509075 5780341 6100103 5902538 6307083
12585F307083r6018P4834J06136n7761L76079K30994j0441O8013K72969J67048
$$ 6307083 6211065 6285899 6392035 6334274 6710353 6941347 6930906 6998919 7271888 7438936
12575G438936J82001l37739J9110k56054l71625l83096j32754n94950o0848l51858
$$ 7438936 7620937 7283198 7302308 7046254 6674629 6291533 6158779 5563829 5502981 5151123
12565E151123k0313k95664N945J46225j65945J07154j66292M6675K48933j27728
$$ 5151123 5130810 4835146 4841091 4987316 4821371 4928525 4762233 4808908 5057841 4930113
12555D930113j50258K92241p6115J2168j60863P1407j11582K16637k04149L49970
$$ 4930113 4779855 5072096 4995981 5008149 4847286 4918693 4807111 5023748 4819599 5169569
12545E169569n0408J60407r3341M45276K34276J17087m9901K37217n4879K85581
$$ 5169569 5119161 5279568 5186227 5631503 5865779 5982866 5932965 6170182 6115303 6400884
12535F400884k70420q0765q0916k58050J38544l68221l65329r4928J23695j46456
$$ 6400884 6130464 6049699 5968783 5710733 5849277 5481056 5115727 5020799 5144494 4998038
12525D998038L7841J43687o3042J5571p36J09593L6626K5149K70891j15461K80993
$$ 4998038 5035879 5179566 5116524 5132095 5131359 5240952 5277578 5302727 5573618 5458157 5739150
12514E739150M4132O42148M72273K93056M67358M896J70555J13561j38512K03520
$$ 5739150 5783282 6425430 6897703 7190759 7658117 7663013 7833568 7947129 7808617 8012137
12504H012137m01098k21333n37816k92003m66573l196l11563q5522K28398l76218
$$ 8012137 7611039 7389706 6851890 6559887 6093314 6090118 5778555 5693033 5921431 5545213
12494E545213L8178K17554p8746N8182K7547j77137J36870M1262L9612L00138
$$ 5545213 5583391 5800945 5722199 5780381 5807928 5630791 5767661 5808923 5848535 6148673
12484F148673P5708K37738M50862R4517R3609L15847K4696k7672L2727p4574q0247
$$ 6148673 6224381 6462119 6912981 7007498 7101107 7416954 7441650 7413978 7446705 7372131 7291884
12473G291884k18791l73166j34678j23815m21046M02757N2730K4031J68790k7643
$$ 7291884 7073093 6699927 6565249 6441434 6020388 6423145 6475875 6499906 6668696 6641053
12463F641053p0328J64336K47312n0709L18506Q1864R4102K82084K76997O7232
$$ 6641053 6570725 6735061 6982373 6931664 7250170 7332034 7426136 7708220 7985217 8052449
12453H052449K67410K69578M92989K93584O6376M60834K40478M29077L68634J37656
$$ 8052449 8319859 8589437 9082426 9376010 9442386 9903220 10143698 10572775 10941409 11079065
12443A1079065N63664M54347m13390K33409L50253j93511n5920K24572j42635
$$ 11079065 11642729 12097076 11683686 11917095 12267348 12073837 12017917 12242489 12099854
12434A2099854j13662L61194m10390Q5281L51136k5539N56823K23350p3938N27654
$$ 12099854 11986192 12347386 11936996 12022277 12373413 12347874 12904697 13128047 13054109 13581763
12424A3581763K34016M84153K77575L86154O16239O24809M03545O09124M82121
$$ 13581763 13815779 14299932 14577507 14963661 15579900 16204709 16608254 17217378 17699499
12415A7699499N68671Q26555J3441J95298L19263j31752p0133P5875n38805m40432
$$ 17699499 18268170 19094725 19108166 19303464 19622727 19490975 19420842 19496717 18957912 18517480
12405A8517480l72531l89692o55770n0060o58197J9743k10403k69846k12774n7253
$$ 18517480 18144949 17755257 17099487 17049427 16391230 16410973 16200570 15930724 15717950 15660697
12395A5660697J1061J41263M69730o0232L42498N79517M89479J83715P13507M64244
$$ 15660697 15671758 15813021 16282751 16222519 16565017 17144534 17634013 17817728 18531235 18995479
12385A8995479K35155M38596K97010K8352J70589n9886J35464k8930j24814k50331
$$ 18995479 19230634 19669230 19966240 19994592 20165181 20105295 20240759 20211829 20087015 19836684
12375A9836684M5540j93274m10209k13913M874j77267p7400l99973K3506p3211
$$ 19836684 19882224 19688950 19278741 19064828 19069702 18892435 18815035 18415062 18438568 18365357
12365A8365357k64171j90511j1747j06969l60268p6622Q5245k6256j72224Q0950
$$ 18365357 18101186 17910675 17898928 17791959 17431691 17355069 17440314 17414058 17241834 17322784
12355A7322784m17994j26139J23163k4092l43069j84843l63326j06555l32325
$$ 17322784 16904790 16778651 16901814 16877722 16534653 16349810 15986484 15879929 15547604
12346A5547604p2117o2171o9166K31659J69661j61672K45924K65916L20152M77947
$$ 15547604 15475487 15413316 15344150 15575809 15745470 15583798 15829722 16095638 16415790 16893737
12336A6893737n6874O01375L09685M96537L36501L41175J45500L81146L88268
$$ 16893737 16836863 17438238 17747923 18244460 18580961 18922136 19067636 19448782 19837050
12327A9837050N81720o0283L32523K19063p5791K16565n1762n9862J56755P4676
$$ 19837050 20418770 20358487 20691010 20910073 20834282 21050847 20999085 20939223 21095978 21170654
12317B1170654N597j22327J23433j35888J81974R3806j09348N64065n3440L53026
$$ 21170654 21176251 21053924 21177357 21041469 21223443 21317249 21207901 21771966 21718526 22071552
12307B2071552L23341M38248J29452M51823K62460M06312l34062p3507q9178j46150
$$ 22071552 22394893 22833141 22962593 23414416 23676876 24083188 23749126 23675619 23586441 23440291
12297B3440291p22702l32757n93597k53767n04530n98065k38627j10301k48634
$$ 23440291 22717589 22384832 21791235 21537468 21032938 20434873 20196246 20085945 19837311
12288A9837311m36259k55962l85576l88049n57856p76917l79933n49741l18873
$$ 19837311 19401052 19145090 18759514 18371465 17813609 17036692 16656759 16107018 15788145
12279A5788145l31499p21389m56698j64439k54243o7264m36982q3025j57861n853
$$ 15788145 15456646 14735257 14278559 14114120 13859877 13792613 13355631 13272606 13114745 13108892
12269A3108892J4284Q6614l30571J44610j35271j91438J07084k79707J6277K41056
$$ 13108892 13123176 13209790 12879219 13023829 12888558 12697120 12804204 12524497 12540774 12781830
12259A2781830j82930J56900L37910K42605N00792K99594M94734N78453N99472
$$ 12781830 12598900 12755800 13093710 13336315 13837107 14136701 14631435 15209888 15809360
12250A5809360J119817N30732J093574J273828J054788J085423J261180O07310
$$ 15809360 16929177 17459909 18553483 19827311 20882099 21967522 23228702 23836012
12242B3836012R85635N36015N98499J9995O5527j00183r5750k19953j27486k67700
$$ 23836012 24821647 25357662 25956161 25976156 26041683 25941500 25845750 25625797 25498311 25230611
12232B5230611p7150n57540l34564l58569o90285o02839j014248r08362q14648
$$ 25230611 25153461 24595921 24261357 23902788 23212503 22609664 21595416 20687054 19872406
12223A9872406r57186j385790q54833r55949p84739p27683p05464m92913j06999
$$ 19872406 18915220 17529430 16674597 15718648 14933909 14206226 13500762 13007849 12900850
12214A2900850n77860m32422k23759m60310q8676n26246j32819m57670K55839
$$ 12900850 12322990 11890568 11666809 11206499 11117823 10591577 10458758 10001088 10256927
12205A0256927j27530j40033k90928L3682J85359m28124L45189q4297L64187k36098
$$ 10256927 10129397 9989364 9698436 9732118 9917477 9489353 9834542 9750245 10114432 9878334
12195I878334J99718j50943N12134j80789K09116N01089j03281J11393L60146
$$ 9878334 10078052 9927109 10439243 10258454 10467570 10968659 10865378 10976771 11336917
12186A1336917J02784K05106K88650K63381r9815J60624m6916L19885k07059L0347
$$ 11336917 11439701 11644807 11933457 12196838 12097023 12257647 12210731 12530616 12323557 12353904
12176A2353904m25378K6009k11731J19458J021j2685J29878m1319p1316J74541
$$ 12353904 11928526 11954535 11742804 11862262 11863283 11850598 11980476 11939157 11867841 12042382
12166A2042382J03725J36702L68048M48734L44070N85087P5837L47761K72663
$$ 12042382 12146107 12282809 12650857 13099591 13443661 14028748 14104585 14452346 14725009
12157A4725009L49273K54016j6705k2132J2949j56173o308m3194L10653M87636
$$ 14725009 15074282 15328298 15311593 15289461 15302410 15146237 15139929 15096735 15407388 15895024
12147A5895024K23651N94996P32804N24168P44104N87630P38206M95277Q94099
$$ 15895024 16118675 16713671 17446475 17970643 18714747 19302377 20040583 20535860 21429959
12138B1429959M98308R52525P72111J172755J243195J156886J401435J880980
$$ 21429959 21928267 22880792 23652903 24825658 26068853 27225739 28627174 30508154
12130C0508154J593779K003565J797533J747738K220968J366572J587697J042457
$$ 30508154 32101933 34105498 35903031 37650769 39871737 41238309 42826006 43868463
12122D3868463J141698K18308O36998q3828L2621p06436n63769j73249r12943
$$ 43868463 45010161 45228469 45865467 45781639 45814260 45107824 44544055 44370806 43457863
12113D3457863n18363p56129n34629n73682n81020n92053n75682m16824m40951
$$ 43457863 42939500 42183371 41648742 41075060 40494040 39901987 39326305 38909481 38468530
12104C8468530j94921R8318k62983K32820K2722K3412l02396l86465j46889k95305
$$ 38468530 38273609 38371927 38108944 38341764 38364486 38387898 38085502 37699037 37552148 37256843
12094C7256843n10176p62409r2303p07016K0116J00580N29930N78440P48913P61406
$$ 37256843 36746667 35984258 35891955 35184939 35205055 35305635 35835565 36414005 37162918 37924324
12084C7924324Q89100Q67467N36441Q95055o9619M55810l50475J7323L36562k89796
$$ 37924324 38813424 39680891 40217332 41112387 41042768 41498578 41148103 41165426 41501988 41212192
12074D1212192l00373k08585k63942o05903p47147p50935p95966j123708r07700
$$ 41212192 40911819 40703234 40439292 39833389 39086242 38335307 37539341 36415633 35507933
12065C5507933j039201j017050j196006r82094q38194n93947n47228q32803l83052
$$ 35507933 34468732 33451682 32255676 31273582 30435388 29841441 29294213 28461410 28078358
12056B8078358l66850n09317l92281n98226n10342n68274n11170l73316m59003
$$ 28078358 27711508 27202191 26809910 26211684 25701342 25133068 24621898 24248582 23789579
12047B3789579m60423n87840k79098m53299l01792m58892l90521q30132k86053
$$ 23789579 23329156 22741316 22462218 22008919 21707127 21248235 20857714 20027582 19741529
12038A9741529m49396n71055r3668m18510m67096l2630J45737R5524O41026J07000
$$ 19741529 19292133 18721078 18627410 18208900 17741804 17709174 17854911 17950435 18591461 18698461
12028A8698461M07094J4130K00801K6658l58487l28457m39522o18969j022799
$$ 18698461 19105555 19119685 19320486 19347144 18988657 18660200 18220678 17601709 16578910
12019A6578910k05178o66415n30849q05070m24238l98192j25208l16669o60919
$$ 16578910 16373732 15707317 15176468 14371398 13947160 13548968 13423760 13107091 12446172
12010A2446172j0127l28582l31702o1441l73049r4914J56532k04791J85985K54852
$$ 12446172 12436045 12107463 11775761 11714320 11341271 11246357 11402889 11198098 11384083 11638935
12000A1638935Q691L04743k51615M3050l52294j88857k45780m16307k9186k62261
$$ 11638935 11647626 11952369 11700754 11743804 11391510 11202653 10956873 10540566 10511380 10249119
11990A0249119j68194l52835M3946n5520j35456l12275J05667l72545j54693n28128
$$ 10249119 10080925 9728090 9772036 9716516 9581060 9268785 9374452 9001907 8847214 8319086
11980H319086p405l15323m006L4748l05163N2353j09153j8432m00317P5872l30010
$$ 8319086 8311681 7996358 7992352 8027100 7721937 7774290 7665137 7646705 7246388 7322260 6992250
11969F992250l6757k16680l27547n4064l50202K2499r0034n3735m0511P468J00429
$$ 6992250 6955493 6738813 6411266 6357202 6007000 6029499 5939465 5885730 5845219 5852687 5953116
11958E953116j25381L85272L4538r2047J13776K93977k20150Q9079j07735J00499
$$ 5953116 5827735 6213007 6247545 6155498 6269274 6563251 6343101 6432180 6324445 6424944
11948F424944K06176j83414K23819j01205J75545J8913N18345M2677J378L87908
$$ 6424944 6631120 6447706 6671525 6570320 6745865 6764778 7283123 7325800 7327178 7715086
11938G715086m9576O04173k30153j15776K53732J73798P844J7097o3964o8367
$$ 7715086 7665510 8269683 8039530 7923754 8177486 8351284 8359128 8376225 8312261 8243894
11928H243894L9464k77295l57541p7385R0233j56016k50815j01017j97429k21623
$$ 8243894 8283358 8006063 7648522 7571137 7661370 7505354 7254539 7153522 6956093 6734470
11918F734470j73571k38702Q9569k92555J19023j79993Q1231K77230J446519K625046
$$ 6734470 6560899 6322197 6411766 6119211 6238234 6058241 6139472 6416702 7863221 10488267
11908A0488267K206566J031204Q71163P29918J75532J81063j03146m49796j641631
$$ 10488267 12694833 13726037 14597200 15327118 15502650 15683713 15580567 15130771 13489140
11899A3489140j772454k233824k070913q10362m48997m45651l56969K12551m39875
$$ 13489140 11716686 9482862 7411949 6601587 6152590 5706939 5349970 5562521 5122646
11890E122646M62395M1739L28372M75830L06049O52763P18038L84818N11741L60683
$$ 5122646 5585041 5626780 5955152 6430982 6737031 7389794 8107832 8492650 9004391 9365074
11880I365074J84081K33239J57291k99985m31089k88975n62718n58845l88147
$$ 9365074 9549155 9782394 9939685 9639700 9208611 8919636 8356918 7798073 7409926
11871G409926l47720o26008k86139m45461j31741j86622k83987n3617k73710j31991
$$ 7409926 7062206 6436198 6150059 5704598 5572857 5386235 5102248 5048631 4774921 4642930
11861D642930q1743K3566P9911q2446j257k079m7804O9907k3057M03525j34613
$$ 4642930 4561187 4584753 4664664 4582218 4580961 4578882 4531078 4600985 4577928 4981453 4846840
11850D846840K56102K91531N5003J94110J54478K00386N88400K51840M93947K23871
$$ 4846840 5102942 5394473 5449476 5643586 5798064 5998450 6586850 6838690 7332637 7556508
11840G556508J07059K36093j01111n732O691l31442k6367k20571l54165O9519
$$ 7556508 7663567 7899660 7798549 7792817 7799508 7468066 7441699 7221128 6866963 6936482
11830F936482q6849j43740K4365l90241J59055j29793l13334l56913l28754l82544
$$ 6936482 6849633 6705893 6730258 6340017 6499072 6369279 6055945 5699032 5370278 4987734
11820D987734m98485k30379j95279J27139k50547K8996j16336K87164l86965o592
$$ 4987734 4489249 4258870 4063591 4190730 3940183 3969179 3852843 4140007 3753042 3746450
11810C746450j10467L5934j71661K3688L8584j55927J78486o9122k1472k9293
$$ 3746450 3635983 3671917 3500256 3523944 3562528 3406601 3585087 3515965 3494493 3465200
11800C465200P4749k56037J44824R7456J01535j82257Q2486q946K7315L30164
$$ 3465200 3539949 3283912 3428736 3526192 3627727 3445470 3527956 3519010 3546325 3876489
11790C876489M39432M10610O1285L37961L49684J0780P8958J1511k75804O0444
$$ 3876489 4315921 4726531 4787816 5125777 5475461 5486241 5565199 5576710 5300906 5361350
11780E361350n67582j58145l77122k67938j83655l48099j89647J02141j45228
$$ 5361350 4793768 4635623 4258501 3990563 3806908 3458809 3269162 3371303 3226075
11771C226075j27963L0282j08511J00532r6694m2385K0495j69882M3870O646r972
$$ 3226075 3098112 3128394 3019883 3120415 3023721 2981336 3001831 2831949 2875819 2882465 2872493
11760B872493J31276l29321K66776j16501K70262j59791j10656j20109K26942
$$ 2872493 3003769 2674448 2941224 2824723 3094985 2935194 2824538 2704429 2931371
11751B931371j12021q3773K18226k26435J37539k38259J36839K23464l10566K31020
$$ 2931371 2819350 2735577 2953803 2727368 2864907 2626648 2763487 2986951 2676385 2907405
11741B907405l23573L55995m836l15593q3481R0342J14248l095L317O0678j58891
$$ 2907405 2583832 2939827 2934991 2619398 2535917 2626259 2740507 2737412 2740729 2801407 2642516
11730B642516J72974k60457r7774R9866R8374n625j55769K11439n0738j60801
$$ 2642516 2815490 2555033 2457259 2557125 2655499 2649874 2494105 2705544 2654806 2494005
11720B494005J74419j44613J05192P9171j08949M0654l1959p0996J67367j9712
$$ 2494005 2668424 2523811 2629003 2708174 2599225 2639879 2607920 2536924 2704291 2684579
11710B684579o0528M5227j3856J1261r9910J61890q8884m4115L8474J04504r6753
$$ 2684579 2624051 2669278 2655422 2666683 2566773 2728663 2639779 2595664 2634138 2738642 2641889
11699B641889p808J79527J55489j53552P8451l07837K59214j5350j96122J04833
$$ 2641889 2634081 2813608 2969097 2815545 2893996 2586159 2845373 2830023 2633901 2738734
11689B738734m8410J13069j18393K04723K16785r9301j81427J61585J32669k41435
$$ 2738734 2690324 2803393 2685000 2889723 3106508 3007207 2825780 2987365 3120034 2878599
11679B878599K45406j27273p0533J19366K2438J82250R8583j51317P3555j28568
$$ 2878599 3124005 2996732 2926199 3045565 3068003 3250253 3348836 3197519 3271074 3142506
11669C142506j27790N3403K37378k5621j30100J3883J13449o6813J4372r854k4270
$$ 3142506 3014716 3068119 3305497 3279876 3149776 3163659 3277108 3210295 3224667 3214813 3190543
11658C190543l17186K33579J41183j38531j58078L31231k54810K74072l66962
$$ 3190543 2873357 3106936 3248119 3109588 2951510 3282741 3027931 3302003 2935041
11649B935041M7778J53105k38707L40765r975k462k37523J96064L3568j28879
$$ 2935041 2982819 3135924 2897217 3237982 3228007 3225545 2988022 3184086 3217654 3088775
11639C088775j25981M2342P5377J16241j44875j29119J83411L3693j54783J43267
$$ 3088775 2962794 3005136 3080513 3196754 3051879 2922760 3106171 3139864 2985081 3128348
11629C128348j21607j55986L61335j38378K27882j65368l11595L13173q2914j42193
$$ 3128348 3006741 2850755 3212090 3073712 3301594 3136226 2824631 3137804 3054890 2912697
11619B912697n4601L3411K28702j20719J5962k2804o9212L2279O1827j39014L51019
$$ 2912697 2858096 2891507 3120209 2999490 3015452 2992648 2923436 2955715 3017542 2878528 3229547
11608C229547j63252j23335r833J93458K346K9409M3641J38639J2065p4727Q8328
$$ 3229547 3066295 2942960 2933127 3126585 3128931 3158340 3201981 3340620 3352685 3277958 3366286
11597C366286L51081m72064K54310j68129J43381k26249K1149J70943l51647J83206
$$ 3366286 3717367 3245303 3499613 3331484 3474865 3248616 3269765 3440708 3089061 3272267
11587C272267O1489k42064J25393j26321j9213J51934J82620k63126K0355r81
$$ 3272267 3333756 3091692 3217085 3090764 3071551 3223485 3406105 3142979 3163334 3162353
11577C162353M18623P796R00j00783J69199k65156J63635K25265o8312j02203
$$ 3162353 3580976 3588772 3589672 3488889 3658088 3392932 3556567 3781832 3713520 3611317
11567C611317k16503K50098n1998l43979K61623r7059J11428J69786k09085j19078
$$ 3611317 3394814 3644912 3592914 3248935 3510558 3413499 3524927 3694713 3485628 3366550
11557C366550K10534j94534J39113k96297J63977O9179j47521K74785k5495j05798
$$ 3366550 3577084 3382550 3521663 3225366 3389343 3458522 3311001 3585786 3560291 3454493
11547C454493K075K5012l12798J98034J56753j13575m0866k31389J28981J15549
$$ 3454493 3456568 3481580 3168782 3366816 3523569 3409994 3369128 3137739 3266720 3382269
11537C382269j65899J48851k06924M40689k95476l5896K10113o3336N7587k01865
$$ 3382269 3216370 3365221 3158297 3598986 3303510 3267614 3477727 3414391 3471978 3270113
11527C270113J73937J59132k80113J57516k24045J99306j94861J36831o3118J59957
$$ 3270113 3444050 3603182 3323069 3480585 3256540 3455846 3260985 3397816 3334698 3494655
11517C494655q0825J9869k76309L13615r2785l2778J66788K11848k08635k77566
$$ 3494655 3413830 3433699 3157390 3471005 3378220 3345442 3512230 3724078 3515443 3237877
11507C237877L48582J43110j15381q0734P8556n8471J22958j51020O7164K46836
$$ 3237877 3586459 3729569 3614188 3533454 3612010 3553539 3676497 3525477 3592641 3839477
11497C839477j59271k42544J40383Q8587q6963Q4067P6313J35281k14325J11448
$$ 3839477 3680206 3437662 3578045 3666632 3579669 3663736 3740049 3875330 3661005 3772453
11487C772453N9342O5387r2684j02981N4229K31132j08172M3134J66394j94310
$$ 3772453 3831795 3897182 3804498 3701517 3755746 3986878 3878706 3921840 4088234 3893924
11477C893924J57506j75405K29401j08145j24748N8242J21306k53548J48837n7250
$$ 3893924 4051430 3876025 4105426 3997281 3872533 3930775 4052081 3798533 3947370 3890120
11467C890120K4611j61809K27500o7198J84562j52418r8837j92265K52037j65703
$$ 3890120 3914731 3752922 3980422 3913224 4097786 3945368 3846531 3654266 3906303 3740600
11457C740600r0975J57609K0011j44250K18137k52745J99228r2669J26915J29986
$$ 3740600 3649625 3807234 3827245 3682995 3901132 3648387 3847615 3754946 3881861 4011847
11447D011847k67530K89134j01514Q6873j1076m4565J07237J5045J76595j04103
$$ 4011847 3744317 4033451 3931937 4018810 4007734 3963169 4070406 4085451 4262046 4157943
11437D157943J36170j26364J50784M534J53441p0063K08146M5957k34163K08550
$$ 4157943 4294113 4167749 4318533 4323067 4476508 4406445 4614591 4660548 4426385 4634935
11427D634935L0655K58731J23364o9138Q700J88076J51988k29560L95275m2977
$$ 4634935 4665590 4924321 5047685 4978547 4987247 5175323 5327311 5097751 5493026 5450049
11417E450049N4102J01951l9814J14729K12219J20185J22288Q117J64086K31466
$$ 5450049 5504151 5606102 5566288 5681017 5893236 6013421 6135709 6143826 6307912 6539378
11407F539378j06783J9086Q8322J85730j1298P2742K50482L01622m4854K12817
$$ 6539378 6432595 6451681 6540003 6725733 6714435 6787177 7037659 7339281 7294427 7507244
11397G507244K65828m8960J54220N2926K30313J34596L67006k6557J96850J30308
$$ 7507244 7773072 7724112 7878332 7931258 8161571 8296167 8663173 8636616 8833466 8963774
11387H963774J42031r974Q2104L25490r2066K47297K23797L7183J60538J74146
$$ 8963774 9105805 9095831 9177935 9503425 9411359 9658656 9882453 9919636 10080174 10254320
11377A0254320P2496J51068O7387j3946J69839P6501J94139K39284l54564N26308
$$ 10254320 10326816 10477884 10545271 10531325 10701164 10777665 10971804 11211088 10856524 11382832
11367A1382832j85425P495K17680J66576k03321K81755M2413j27124M20280k78385
$$ 11382832 11197407 11204902 11422582 11589158 11385837 11667592 11710005 11582881 12003161 11724776
11357A1724776o1652K77994j12051k72800L58076j63551P2566P6952k16227J56405
$$ 11724776 11663124 11941118 11829067 11556267 11914343 11750792 11823358 11900310 11684083 11840488
11347A1840488k49552n6529j35543k8213P1163j99524Q654l0938m16376J00570
$$ 11840488 11590936 11534407 11398864 11370651 11441814 11242290 11250944 11220006 10803630 10904200
11337A0904200m8133j54204j60772J3917j40179k2375r4093j10156l51298m3747
$$ 10904200 10856067 10701863 10541091 10555008 10414829 10392454 10298361 10188205 9836907 9793160
11327I793160P7752l4394l94003j34455l5317k98365N899j46544J8596k49517
$$ 9793160 9870912 9836518 9442515 9308060 9272743 8974378 8980277 8833733 8852329 8602812
11317H602812M6491n31453r4031k34442n3258k29283j30469j07942j34640r8984
$$ 8602812 8649303 8117850 8023819 7789377 7736119 7506836 7376367 7268425 7133785 7034801
11307G034801j15265k31931j48805R3588l60897j98217J99507l53470r3080k21318
$$ 7034801 6919536 6687605 6538800 6632388 6271491 6073274 6272781 5919311 5826231 5604913
11297E604913k5644n9406k71091k1271p7843p8416l61403J10439j11034j39094
$$ 5604913 5579269 5519863 5248772 5227501 5149658 5071242 4709839 4820278 4709244 4570150
11287D570150J09703o440k95945j88572M6490o1126l16552J31247q7559j4395
$$ 4570150 4679853 4673413 4377468 4188896 4235386 4174260 3857708 3988955 3901396 3887001
11277C887001J3441k37314J81655O9365q013l54845k1914Q1056J31159l11275
$$ 3887001 3900442 3663128 3844783 3914148 3906135 3551290 3529376 3610432 3741591 3430316
11267C430316J48360K09871l93561j24955L08811k30256m0003K90666k18747m1015
$$ 3430316 3578676 3788547 3394986 3270031 3578842 3348586 3308583 3599249 3380502 3339487
11257C339487k08562O4485J20085l34580J83756N4191j92882J11890M2304o5866
$$ 3339487 3130925 3195410 3315495 2980915 3164671 3218862 3025980 3137870 3180174 3114308
11247C114308J96917j93443N0394j11809J7588p697q0949J65367n5864k7033l779
$$ 3114308 3311225 3117782 3168176 3056367 3073955 3066258 2985309 3150676 3094812 3067779 3064000
11236C064000j35422J62412j48665L23456j59755J59758p0352n7651Q9036K35169
$$ 3064000 2928578 3090990 2942325 3265781 3106026 3265784 3195432 3137781 3226817 3461986
11226C461986J02284N34376P66383R69024R1076R02459M7225J39142J25958j6895
$$ 3461986 3564270 4098646 4865029 5834053 5925129 6827588 6874813 7013955 7139913 7123018
11216G123018j62089o86582n20988l95452q44137m90049l69239p5129J6560n2923
$$ 7123018 6960929 6274347 5753359 5357907 4513770 4023721 3654482 3579353 3595913 3542990
11206C542990k98987j8062q64N7532p0318M7784k5853L20303j73824O59601L3170
$$ 3542990 3244003 3225941 3225077 3282609 3212291 3260075 3234222 3554525 3380701 4040302 4073472
11195D073472J093387N16847N88521M59638J75024N8229J48654j18591j69653
$$ 4073472 5166859 5683706 6272227 6731865 6906889 6965118 7113772 6995181 6825528
11186F825528k95994r02276n24195p12910m82855n3217l00271M5345m7140j47403
$$ 6825528 6529534 5627258 5103063 4390153 3907298 3854081 3553810 3599155 3552015 3404612
11176C404612Q2283J5542j5039k43287p2822J75346J41686Q031r2949J15596M4925
$$ 3404612 3486895 3502437 3487398 3244111 3171289 3346635 3488321 3496352 3403403 3518999 3563924
11165C563924j97310l1060J88492N808n4508J94652n2632J5787R26p5834R0648
$$ 3563924 3366614 3335554 3524046 3529854 3475346 3669998 3617366 3633153 3634079 3558245 3648893
11154C648893k65972K73484O9345m5598k74600M21635j41573K53359l46803J50111
$$ 3648893 3382921 3656405 3725750 3680152 3405552 3827187 3685614 3938973 3592170 3742281
11144C742281L06537m21398J76274M5756l6505p7405J4642K8770m5502J91430
$$ 3742281 4048818 3627420 3803694 3849450 3812945 3735540 3750182 3778952 3733450 3924880
11134C924880j080L3853J4762J05949q6544N0294P8484p4632M4218M1248p1609
$$ 3924880 3923800 3957653 3972415 4078364 3991820 4042114 4120598 4045966 4090184 4131432 4059823
11123D059823P3591M4813j59950K40698l6837O2169j91907K47166r2006J28628
$$ 4059823 4133414 4178227 4018277 4258975 4222138 4284307 4092400 4339566 4247560 4376188
11113D376188J88313r5018j43937K56892k25597m9764L9330j5104J96111m3600
$$ 4376188 4564501 4469483 4325546 4582438 4356841 4307077 4346407 4331303 4527414 4483814
11103D483814m7965j4486j64471J29664M6980r6350p2197K13414p6922j33523
$$ 4483814 4435849 4421363 4256892 4386556 4433536 4337186 4264989 4478403 4401481 4267958
11093D267958j0788J60462k95109J72757P243J36311q4641q2177R2667K338J20993
$$ 4267958 4257170 4417632 4122523 4295280 4302523 4438834 4354193 4272016 4364683 4367021 4488014
11082D488014j29835J29553k03233J12903j59563K84450P2810j32629J18450q8336
$$ 4488014 4358179 4487732 4284499 4397402 4237839 4522289 4595099 4462470 4580920 4492584
11072D492584J31840J9069Q3831Q2788r3540K75102J3994J76476o7056J18300
$$ 4492584 4624424 4643493 4727324 4810112 4716572 4991674 5005668 5182144 5115088 5233388
11062E233388J05837J2092Q2236K60073j09967J21759K28572j8152N3858P1247
$$ 5233388 5339225 5351317 5433553 5693626 5583659 5705418 5933990 5915838 5969696 6040943
11052F040943J2858J99817k27165M31888l15265J80495K05690L9223l00890M67401
$$ 6040943 6053801 6253618 6026453 6458341 6143076 6323571 6529261 6568484 6267594 6734995
11042F734995j50970M58708m4241M6192K04339L05879J83947l4851L52841J42961
$$ 6734995 6584025 7042733 6998492 7044684 7249023 7554902 7738849 7703998 8056839 8199800
11032H199800N6677K96734L38753J0318L25146K87286R9184K26964o4179J41166
$$ 8199800 8256477 8553211 8891964 8902282 9227428 9514714 9613898 9840862 9776683 9917849
11022I917849L29046J32948J12045L8892J1563L62178J46490J03460J88558J43341
$$ 9917849 10246895 10379843 10491888 10530780 10542343 10904521 11051011 11154471 11343029 11486370
11012A1486370J38542K48597J71059L03972J23363M52645L73282K42527K49076
$$ 11486370 11624912 11873509 12044568 12348540 12471903 12924548 13297830 13540357 13789433
11003A3789433M02586J91311L44345J97087j15824N33259J02980N61104J3386
$$ 13789433 14192019 14383330 14727675 14924762 14808938 15342197 15445177 16006281 16019667
10994A6019667k9352J43624K40542J83252L78395l03312M70465J12775m1227K35004
$$ 16019667 15990315 16133939 16374481 16557733 16936128 16632816 17103281 17216056 17174829 17409833
10984A7409833M92975M25369N28125L71040L51118N87206M24027L21381K78751
$$ 17409833 17902808 18328177 18856302 19227342 19578460 20165666 20589693 20911074 21189825
10975B1189825K77768M54243M8534M62719O9158K50399K07058O17403O3489Q54574
$$ 21189825 21467593 21921836 21970370 22433089 22502247 22752646 22959704 23577107 23640596 24495170
10965B4495170M63523K89478M46566Q08500N21918N47435N86801P29386N15169
$$ 24495170 24958693 25248171 25694737 26503237 27025155 27572590 28159391 28888777 29403946
10956B9403946O68587Q32389P82485O60831P99721N69799P31488N05114P08051
$$ 29403946 30072533 30904922 31687407 32348238 33147959 33717758 34449246 34954360 35662411
10947C5662411O65477M82930M35351Q50908M76816Q25722Q14845M67504J189931
$$ 35662411 36327888 36810818 37246169 38097077 38573893 39399615 40214460 40681964 41871895
10938D1871895P57765J162522Q70418P56814J027893J007782R48462P74528R34897
$$ 41871895 42629660 43792182 44662600 45419414 46447307 47455089 48403551 49178079 50112976
10929E0112976R33153Q42036R04833O34150R19134O22660N95870P07760N32038
$$ 50112976 51046129 51888165 52792998 53427148 54346282 54968942 55564812 56272572 56804610
10920E6804610L90455P3330N92792L0153p1484J11598l59923J15154k91596M085
$$ 56804610 57195065 57268395 57861187 57891340 57819856 57931454 57571531 57686685 57395089 57399174
10910E7399174k43753K0918J1705L9683L8450L10794L32721J80872N87838P1602
$$ 57399174 57155421 57176339 57188044 57227727 57266177 57576971 57909692 58090564 58678402 58750004
10900E8750004N64076M07280Q07448N71810J330522M07200J069601J559621J320874
$$ 58750004 59314080 59721360 60528808 61100618 62431140 62838340 63907941 65467562 66788436
10891F6788436J644135J779609J891961K413760K568426K948709L179736L987171
$$ 66788436 68432571 70212180 72104141 74517901 77086327 80035036 83214772 87201943
10883H7201943M313778M512132M738063N404140N441468N201059M894426M930355
$$ 87201943 91515721 96027853 100765916 106170056 111611524 116812583 121707009 126637364
10875A26637364L691159K967552K273876J190544k55365p86780k076376l015309
$$ 126637364 130328523 133296075 135569951 136760495 136505130 135718350 133641974 130626665
10867A30626665l605405m315965m633091m904285n082558n206234n164859n105467
$$ 130626665 127021260 122705295 118072204 113167919 108085361 102879127 97714268 92608801
10859I2608801n019452m889466m702374m388656l986493m270972l855458l820636
$$ 92608801 87589349 82699883 77997509 73608853 69622360 65351388 61495930 57675294
10851E7675294l554889l141726k992429k711045k453852k428014k309599k051939
$$ 57675294 54120405 50978679 47986250 45275205 42821353 40393339 38083740 36031801
10843C6031801k402576j681274j599726j711461j395481j406649j417124j307099
$$ 36031801 33629225 31947951 30348225 28636764 27241283 25834634 24417510 23110411
10835B3110411j099785q81447j106592p90001q30429r35772n45522o25488q50941
$$ 23110411 22010626 21129179 20022587 19232586 18402157 17466385 16920863 16295375 15444434
10826A5444434n29071n68079n85922k93473n32668l16424m98379l84304l63006
$$ 15444434 14915363 14347284 13761362 13467889 12935221 12618797 12120418 11736114 11373108
10817A1373108n40672k13468l30702l21925k87341n00956N6758l62096J58560
$$ 11373108 10832436 10618968 10288266 9966341 9679000 9178044 9234802 8872706 9031266
10808I031266l34961m8351k99363k61191m06857J3006n8408m24329j77867j10749
$$ 9031266 8696305 8647954 8348591 8087400 7680543 7693549 7635141 7210812 7032945 6922196
10798F922196k28932k3933K921j99136l72327l16391K40007m16045N1956m50786
$$ 6922196 6693264 6669331 6672252 6473116 6100789 5784398 6024405 5608360 5660316 5209530
10788E209530K97505Q0806k66790N4415l03850P3024n3133j36489P0449j88815
$$ 5209530 5507035 5587841 5321051 5375466 5071616 5144640 5091507 4955018 5025467 4836652
10778D836652l37165K08242R0108m42250K35963n53902J20547R0723j18684J8067
$$ 4836652 4499487 4707729 4797837 4355587 4591550 4037648 4158195 4248918 4130234 4148301
10768D148301j91557l4833q2340Q8561k30226j7732J48768l3234o6069m5270k97886
$$ 4148301 3956744 3921911 3839571 3928132 3697906 3680174 3828942 3795708 3729639 3684369 3386483
10757C386483K04383K09122P2863k79529J18900j04963J3581M0175l9522o4565
$$ 3386483 3590866 3799988 3872851 3593322 3712222 3607259 3620840 3661015 3621493 3556928
10747C556928k6413j35118K7923J33358j84912j09014k40518j4210J9294M26352
$$ 3556928 3530515 3395397 3423320 3556678 3371766 3262752 3022234 3008024 3027318 3453670
10737C453670n06082n4706N7424K604J86059k33862N5574J50668j635M2603j79433
$$ 3453670 2947588 2892882 2950306 2952910 3138969 2905107 2960681 3111349 3109714 3152317 2972884
10726B972884R7421K16602k74064J62351o6928K8448j83728J70004j11435k5369
$$ 2972884 3070305 3286907 3012843 3175194 3108266 3136714 2952986 3122990 3011555 2986186
10716B986186J1402j55015j40768J18165M46212m09080K02042p2477q9712o1155
$$ 2986186 2997588 2842573 2701805 2819970 3266182 2857102 3059144 2986667 2896955 2835800
10706B835800R6719K8631M2113k81734K99320O5553j76581o7163L37440l56892
$$ 2835800 2932519 2961150 3003263 2721529 3020849 3086402 2909821 2842658 3180098 2823206
10696B823206J80139p6920J15223l22443L70300k7754l21844J76236o46k1138
$$ 2823206 3003345 2926425 3041648 2719205 3089505 3061751 2739907 2916143 2915497 2894359
10686B894359k93500K29223j6085l19268K42980j58015J94709p1817k75397M06274
$$ 2894359 2600859 2830082 2813997 2494729 2737709 2579694 2774403 2702586 2427189 2833463
10676B833463q4642J14676P6457j23445j39067P8841R8873k4119j01060Q1778
$$ 2833463 2748821 2863497 2939954 2816509 2677442 2756283 2855156 2831037 2729977 2811755
10666B811755l56946K38198K3764k44955O3343k19999K34867l09599J88659j40854
$$ 2811755 2454809 2693007 2716771 2471816 2535159 2315160 2550027 2240428 2429087 2288233
10656B288233K67538j5927j72769K45270j8035N1709k41260J49298P0156J34922
$$ 2288233 2555771 2539844 2367075 2612345 2594310 2646019 2404759 2554057 2624213 2759135
10646B759135k10156K2303j87234R2880l84113k1629J1793J98862k32245n5140
$$ 2759135 2548979 2571282 2384048 2476928 2092815 2071186 2082979 2281841 2049596 1994456
10636A994456P1072k16898L47520m7378k3531j00271J92451j19451p5796O704
$$ 1994456 2065528 1848630 2196150 2148772 2125241 2024970 2217421 2097970 2022174 2028878
10626B028878q5484j73222L43962j05913n6347J20658L6477l77287J50514K59136
$$ 2028878 1943394 1770172 2114134 2008221 1951874 2072532 2109009 1731722 1882236 2141372
10616B141372l07560J12197j66381R1081P8519P7860J6378j59647k4692J46418
$$ 2141372 1833812 1946009 1779628 1870709 1949228 2027088 2043466 1883819 1859127 2005545
10606B005545K2987n6620R8193j25523J3165J54442k62652R3405j4796j61805
$$ 2005545 2028532 1971912 2070105 1944582 1957747 2112189 1849537 1942942 1928146 1766341
10596A766341J50661j60265J76336R0339q2609J65757rk61552J23869m8730L7402
$$ 1766341 1917002 1756737 1933073 2023412 1940803 2106560 2106551 1844999 1968868 1920138 1957540
10585A957540j61834K97223l41117L55888k48753R5111J88249k02385R113R7940
$$ 1957540 1795706 2092929 1751812 2107700 1858947 1954058 2142307 1939922 1949035 2046975
10575B046975j00149k9262K9056M2167l065K41391m86995j07506K55098q9806
$$ 2046975 1946826 1917564 1946620 1988787 1985722 2227113 1740118 1632612 1887710 1797904
10565A797904J5814j25054j04705J55967J9326j14935m5692j20424j01842J49651
$$ 1797904 1813718 1688664 1583959 1739926 1759252 1644317 1598625 1478201 1376359 1526010
10555A526010J48645j68345J36788k70486K52184n9195j65416n7560M9365j19239
$$ 1526010 1674655 1506310 1643098 1372612 1624796 1565601 1400185 1342625 1391990 1272751
10545A272751K95852j20836P4514O40N0097O3062j43173O7612j33189k0476j84829
$$ 1272751 1568603 1447767 1522281 1522921 1573018 1636080 1492907 1560519 1427330 1406854 1222025
10534A222025M43332j95274p045R4832J34778l21739j29546L02691n9284Q0180
$$ 1222025 1665357 1470083 1463038 1557870 1692648 1370909 1241363 1544054 1484770 1564950
10524A564950K30597j01411r2685L15903J28526L63443o3075J7495L67103k93164
$$ 1564950 1795547 1694136 1601451 1917354 2045880 2409323 2346248 2363743 2730846 2437682
10514B437682K06978j7962o1910j93693l1111k8677l11712o7004r0078l2656R1416
$$ 2437682 2644660 2626698 2564788 2371095 2339984 2311307 1999595 1932591 1842513 1809857 1901273
10503A901273j39775J18544q9419J66810N8969l19550J89323m7431J81968O2131
$$ 1901273 1761498 1880042 1790623 1957433 2016402 1696852 1886175 1838744 2020712 2082843
10493B082843J61466J40677K2995L63129o9031J40085r5523N5898j0630n8941
$$ 2082843 2244309 2384986 2407981 2771110 2702079 2842164 2746641 2802539 2791909 2732968
10483B732968m5216O827l10451n4892J6812k78522j73678L35395j90254J62486
$$ 2732968 2687752 2694579 2384128 2329236 2346048 2067526 1893848 2229243 2038989 2201475
10473B201475k74771K06566J54254l8193p1629r4780M64357j93786J74176J22598
$$ 2201475 1926704 2133270 2287524 2249331 2177702 2082922 2547279 2353493 2527669 2650267
10463B650267j06070M7625K42908J56457j52582j00265j02524k06065J21491r3363
$$ 2650267 2544197 2591822 2834730 2991187 2838605 2738340 2635816 2429751 2551242 2457879
10453B457879j32680j10067K42667j11199M03152m92879K32748n4098j59447J72683
$$ 2457879 2325199 2215132 2457799 2346600 2749752 2256873 2489621 2435523 2276076 2448759
10443B448759J46528N927P8157L93694K03264L38596n0604J81032J40189m778
$$ 2448759 2595287 2601214 2679371 3073065 3276329 3614925 3564321 3745353 3885542 3880764
10433C880764k69j82007Q1385n31856q4724k66034k91590k5988n3679j40893M1204
$$ 3880764 3880495 3698488 3779873 3248017 3163293 2897259 2605669 2579681 2526002 2385109 2426313
10422B426313M582L4437J0754j97333J29154j85395N4914N3914K24982R9393J14201
$$ 2426313 2430895 2465332 2476086 2278753 2407907 2222512 2277426 2331340 2556322 2655715 2769916
10411B769916J22482L70315j68634L32843J13174L1867M52134j53516r9953K26845
$$ 2769916 2892398 3262713 3094079 3426922 3540096 3571963 4024097 3870581 3770628 3997473
10401C997473l59701J00423P1742j38316J58362P4887K38408j63612L1216M62795
$$ 3997473 3637772 3738195 3809937 3671621 3829983 3904870 4143278 3979666 4010882 4473677
10391D473677L27834m56444L54724K78185l60608L69591L1369j70553K50449K9077
$$ 4473677 4801511 4345067 4699791 4977976 4617368 4986959 5018328 4847775 5098224 5127301
10381E127301k3195N4914K59595r3710K99272o9160q3455P348j49026J01953j8651
$$ 5127301 5104106 5159020 5418615 5324905 5624177 5555017 5471562 5478910 5329884 5431837 5413186
10370E413186K7494K78180L05205j67487n265n2833K76584j2816k12781K0486
$$ 5413186 5440680 5718860 6024065 5856578 5851313 5798480 6075064 6062248 5849467 5869953
10360E869953m20945M9133j43706j26573J28653k48531K15191J6798j77478J45651
$$ 5869953 5449008 5498141 5354435 5227862 5356515 5107984 5323175 5339973 5162495 5308146
10350E308146j84295j5895M0614J12598l39395N0665l47812p7772J35192r6703
$$ 5308146 5123851 5107956 5148570 5261168 4921773 4972438 4624626 4546854 4682046 4585343
10340D585343j35754J89710K64441R6263r4556j30795J69317Q2429K29756j39087
$$ 4585343 4449589 4639299 4903740 5000003 4905447 4774652 4943969 5026398 5256154 5117067
10330E117067r4704k89290K52182k78046J81692l68634J20067j07499J26428J93436
$$ 5117067 5022363 4733073 4985255 4707209 4888901 4520267 4640334 4532835 4659263 4852699
$$ [...]
##END NTUPLES=NMR SPECTRUM
##END=
