##TITLE=Coffee green (M3-ROVE80 + 1.5mL buffer 50/50,  450uL extracto + 50uL (D2O+TMS))
without heating, vortex and centrifuged, temperature 0oC.
##JCAMPDX= 6.0         $$ Bruker NMR JCAMP-DX V2.0
##DATA TYPE= NMR SPECTRUM
##DATA CLASS= NTUPLES
##ORIGIN= Bruker BioSpin GmbH
##OWNER= Administrator
$$ 1.72 TOPSPIN		Version 2.1
$$ 2012-05-22 16:15:38.481 -0700  Administrator@X
$$ Compression mode = diff/dup
##.OBSERVE FREQUENCY= 400.13188196
##.OBSERVE NUCLEUS= ^1H
##.ACQUISITION MODE= SIMULTANEOUS (DQD)
##.ACQUISITION SCHEME= undefined
##.AVERAGES= 64
##.DIGITISER RES= 22
##SPECTROMETER/DATA SYSTEM= spect
##.PULSE SEQUENCE= noesygppr1d
##.SOLVENT NAME= H2O+D2O
##.SHIFT REFERENCE= INTERNAL, H2O+D2O, 1, 14.97964
##AUDIT TRAIL= $$ (NUMBER, WHEN, WHO, WHERE, PROCESS, VERSION, WHAT)
$$ ##TITLE= Audit trail, TOPSPIN		Version 2.1
$$ ##JCAMPDX= 5.01
$$ ##ORIGIN= Bruker BioSpin GmbH
$$ ##OWNER= Administrator
$$ $$ C:/Bruker/TOPSPIN/data/jwist/nmr/11-coffee-green-quantification-2/281/pdata/1/auditp.txt
$$ ##AUDIT TRAIL=  $$ (NUMBER, WHEN, WHO, WHERE, PROCESS, VERSION, WHAT)
(   1,<2011-11-18 14:50:17.575 -0500>,<Administrator>,<TOPSPIN>,<go>,<TOPSPIN 2.1>,
      <created by zg
	started at 2011-11-18 14:41:23.075 -0500,
	POWCHK enabled, PULCHK disabled,
       configuration hash MD5:
       DA 63 81 1B EF 4C B5 72 B4 DF EA D9 B4 DB 4C 08
       data hash MD5: 64K
       1D 5B 35 4B 25 03 1B FE 8F 46 BA 24 6B 0B E5 DE>)
(   2,<2011-11-18 15:26:15.747 -0500>,<Administrator>,<TOPSPIN>,<proc1d>,<TOPSPIN 2.1>,
      <Start of raw data processing
       efp LB = 0 FT_mod = 6 PKNL = 1 PHC0 = 0 PHC1 = 0 SI = 32K 
       data hash MD5: 32K
       30 54 29 29 4A 22 C8 C3 69 27 5C 10 E1 25 06 83>)
(   3,<2011-11-18 15:26:16.122 -0500>,<Administrator>,<TOPSPIN>,<proc1d>,<TOPSPIN 2.1>,
      <pk PHC0 = 22.0166 PHC1 = 0 
       data hash MD5: 32K
       0D AD CB 94 4E 45 6B FA FA 2C A7 E4 83 0A D7 3D>)
$$ ##END=
$$ 
$$ $$ hash MD5
$$ $$ 34 87 2D 12 97 8D 51 A8 CF CD B7 9A C0 AC 6D D7
##$RELAX= 
##$RELAX= 
##$RELAX= 
##$RELAX= 
##$RELAX= 
$$ Bruker specific parameters
$$ --------------------------
##$DU= <Z:>
##$EXPNO= 281
##$NAME= <11-coffee-green-quantification-2>
##$PROCNO= 1
##$TYPE= <nmr>
##$USER= <jwist>
##$ACQT0= -8.16505617666767
##$AMP= (0..31)
100 100 100 100 100 100 100 100 100 100 100 100 100 100 100 100 100 100
100 100 100 100 100 100 100 100 100 100 100 100 100 100
##$ANAVPT= -1
##$AQSEQ= 0
##$AQ_mod= 3
##$AUNM= <au_prof>
##$AUTOPOS= <>
##$BF1= 400.13
##$BF2= 400.13
##$BF3= 400.13
##$BF4= 400.13
##$BF5= 400.13
##$BF6= 400.13
##$BF7= 400.13
##$BF8= 400.13
##$BYTORDA= 0
##$CFDGTYP= 0
##$CFRGTYP= 9
##$CHEMSTR= <none>
##$CNST= (0..63)
1 1 145 1 1 1 1 1 1 1 1 1 1 1 1 1 1 1 1 1 1 1 1 1 1 1 1 1 1 1 1 1 1 1 1
1 1 1 1 1 1 1 1 1 1 1 1 1 1 1 1 1 1 1 1 1 1 1 1 1 1 1 1 1
##$CPDPRG= <>
##$CPDPRG1= <>
##$CPDPRG2= <>
##$CPDPRG3= <>
##$CPDPRG4= <mlev>
##$CPDPRG5= <mlev>
##$CPDPRG6= <mlev>
##$CPDPRG7= <mlev>
##$CPDPRG8= <mlev>
##$CPDPRGB= <>
##$CPDPRGT= <>
##$D= (0..63)
$$ [...]
##$TP= (0..7)
150 150 150 150 150 150 150 150
##$TP07= 0
##$TPNAME0= <>
##$TPNAME1= <>
##$TPNAME2= <>
##$TPNAME3= <>
##$TPNAME4= <>
##$TPNAME5= <>
##$TPNAME6= <>
##$TPNAME7= <>
##$TPOAL= (0..7)
0.5 0.5 0.5 0.5 0.5 0.5 0.5 0.5
##$TPOFFS= (0..7)
0 0 0 0 0 0 0 0
##$TUNHIN= 0
##$TUNHOUT= 0
##$TUNXOUT= 0
##$USERA1= <user>
##$USERA2= <user>
##$USERA3= <user>
##$USERA4= <user>
##$USERA5= <user>
##$V9= 5
##$VALIST= <valist>
##$VCLIST= <CCCCCCCCCCCCCCC>
##$VD= 0
##$VDLIST= <DDDDDDDDDDDDDDD>
##$VPLIST= <PPPPPPPPPPPPPPP>
##$VTLIST= <TTTTTTTTTTTTTTT>
##$WBST= 2048
##$WBSW= 25
##$XGAIN= (0..3)
0 0 0 0
##$XL= 0
##$YL= 0
##$YMAX_a= 5131164
##$YMIN_a= -1934095
##$ZGOPTNS= <>
##$ZL1= 120
##$ZL2= 120
##$ZL3= 120
##$ZL4= 120
##$ABSF1= 0
##$ABSF2= 0
##$ABSG= 0
##$ABSL= 0
##$ALPHA= 0
##$AQORDER= 0
##$ASSFAC= 0
##$ASSFACI= 0
##$ASSFACX= 0
##$ASSWID= 0
##$AUNMP= <proc_prof1d>
##$AXLEFT= 0
##$AXNAME= <>
##$AXNUC= <1H>
##$AXRIGHT= 0
##$AXTYPE= 0
##$AXUNIT= <>
##$AZFE= 0.1
##$AZFW= 0.1
##$BCFW= 0
##$BC_mod= 0
##$BYTORDP= 0
##$COROFFS= 0
##$CY= 15
##$DATMOD= 1
##$DC= 0
##$DFILT= <>
##$DTYPP= 0
##$F1P= 0
##$F2P= 0
##$FCOR= 0.5
##$FTSIZE= 32768
##$FT_mod= 6
##$GAMMA= 0
##$GB= 0
##$INTBC= 1
##$INTSCL= 1
##$ISEN= 128
##$LB= 0
##$LEV0= 0
##$LPBIN= 0
##$MAXI= 10000
##$MC2= 0
##$MEAN= 0
##$ME_mod= 0
##$MI= 0
##$NCOEF= 0
##$NC_proc= -6
##$NLEV= 6
##$NOISF1= 0
##$NOISF2= 0
##$NSP= 0
##$NTH_PI= 0
##$NZP= 0
##$OFFSET= 14.97964
##$PC= 1
##$PHC0= 22.0166
##$PHC1= 0
##$PH_mod= 1
##$PKNL= yes
##$PPARMOD= 0
##$PPDIAG= 0
##$PPIPTYP= 0
##$PPMPNUM= 2147483647
##$PPRESOL= 1
##$PSCAL= 4
##$PSIGN= 0
##$PYNMP= <proc.py>
##$REVERSE= no
##$SF= 400.13
##$SI= 32768
##$SIGF1= 0
##$SIGF2= 0
##$SINO= 400
##$SIOLD= 32768
##$SPECTYP= <>
##$SREGLST= <1H.CDCl3>
##$SSB= 0
##$STSI= 32768
##$STSR= 0
##$SW_p= 8223.68421052631
##$SYMM= 0
##$S_DEV= 0
##$TDeff= 65536
##$TDoff= 0
##$TI= <>
##$TILT= no
##$TM1= 0
##$TM2= 0
##$TOPLEV= 0
##$USERP1= <user>
##$USERP2= <user>
##$USERP3= <user>
##$USERP4= <user>
##$USERP5= <user>
##$WDW= 1
##$XDIM= 32768
##$YMAX_p= 278438802
##$YMIN_p= -49430354
##$CURPLOT= <Network HP LaserJet P1505>
##$CURPRIN= <$Network HP LaserJet P1505>
##$DFORMAT= <normdp>
##$LAYOUT= <+/1D_H.xwp>
##$LFORMAT= <normlp>
##$PFORMAT= <normpl>
##$SURQMSG= 1
$$ End of Bruker specific parameters
$$ ---------------------------------
##NTUPLES= NMR SPECTRUM
##VAR_NAME=  FREQUENCY,     SPECTRUM/REAL,   SPECTRUM/IMAG
##SYMBOL=    X,             R,               I
##VAR_TYPE=  INDEPENDENT,   DEPENDENT,       DEPENDENT
##VAR_FORM=  AFFN,          ASDF,            ASDF
##VAR_DIM=   32768,         32768,           32768
##UNITS=     HZ,            ARBITRARY UNITS, ARBITRARY UNITS
##FACTOR=    0.250966925370066, 1,           1
##FIRST=     8223.43324360094, 37310,        -203084
##LAST=      0,             102151,          -205570
##MIN=       0,             -49430354,       0
##MAX=       8223.43324360094, 278438802,    0
$$ Real data points
##PAGE= N=1
##DATA TABLE= (X++(R..R)), XYDATA
$$ [...]
$$ plain form
19658 2237399 2175743 2037232 2181135 2058899 1963293 2084665 2264364 2123788 2218049 2240975
19648 2240975 2275005 2190830 2039252 2390111 2287094 2258231 2140339 2263949 2254120 2128694
19638 2128694 2215939 2157268 2020260 1938210 2112006 2156513 2088420 2047988 2070808 2157451 2004642
19627 2004642 2225091 2081089 1946109 1698218 2084248 2010807 2200264 2065190 2030498 2152901
19617 2152901 2118757 1734691 1882286 1783482 1962755 1965839 1909682 1860965 2195521 2007425
19607 2007425 1866046 1952468 1785990 1873929 1685800 2146870 2159655 1609616 1783555 1842129
19597 1842129 1855635 1678269 1855918 1580664 1747825 1621051 1791880 1816971 1820816 1929167
19587 1929167 1770594 1898910 1873067 1930542 2008820 2096640 1806419 1874077 1999933 1908394
$$ packed form
19658B237399o1656j38511J43903j22236r5606J21372J79699j40576R4261K2926
19648B240975L4030q4175j51578L50859j03017k8863j17892J23610r829j25426
19638B128694Q7245n8671j37008q2050J73796M4507o8093m0432K2820Q6643j52809
19627B004642K20449j44002j34980k47891L86030p3441J89457j35074l4692J22403
19617B152901l4144l84066J47595r8804J79273L084n6157m8717L34556j88096
19607B007425j41379Q6422j66478Q7939j88129M61070J2785n50039J73939N8574
19597A842129J3506j77366J77649k75254J67161j26774J70829K5091L845J08351
19587A929167j58573J28316k5843N7475P8278Q7820k90221O7658J25856r1539
$$ plain form
19577 1908394 1868870 1941998 1928343 1938919 2184834 1901863 1711736 1727172 1995380 1909211
19567 1909211 1765825 1864079 1875187 1806931 2067222 1952105 1833731 1950872 2135386 1963839
19557 1963839 1965217 1893863 1885631 1858312 1950673 1907503 1762600 1819280 1740346 1772036 1762427 1858014
19545 1858014 1802889 1774373 1701757 1970539 1656601 1799949 1708356 1880143 1710559 1640992
19535 1640992 1804585 1675856 1703320 1650666 1643238 1700716 1716569 1424090 1615573 1605426 1595152
19524 1595152 1671612 1652798 1754284 1757383 1546258 1591230 1805419 1425601 1595641 1739552
19514 1739552 1614325 1736255 1750474 1453606 1744262 1624489 1628792 1679694 1728916 1423615
19504 1423615 1428762 1578575 1588913 1495380 1458436 1927714 1582835 1587904 1610994 1665493 1728773
$$ packed form
19577A908394l9524P3128j3655J0576K45915k82971j90127J5436K68208q6169
19567A909211j43386R8254J1108o8256K60291j15117j18374J17141J84514j71547
19557A963839J378p1354q232k7319R2361m3170j44903N6680p8934L1690r609R5587
19545A858014n5125k8516p2616K68782l13938J43348r1593J71787j69584o9567
19535A640992J63593j28729K7464n2654p428N7478J5853k92479J91483j0147j0274
19524A595152P6460j8814J01486L099k11125M4972K14189l79818J70040J43911
19514A739552j25227J21930J4219k96868K90656j19773M303N0902M9222l05301
19504A423615N147J49813J0338r3533l6944M69278l44879N069K3090N4499O3280
$$ plain form
19493 1728773 1734072 1560838 1536882 1692424 1547063 1730165 1683889 1612023 1490790 1566389
19483 1566389 1524088 1568951 1444025 1456708 1475503 1531121 1414779 1401736 1435754 1411649 1436366
19472 1436366 1485659 1386550 1461106 1373512 1421334 1249551 1180328 1317409 983554 1312533
19462 1312533 1177054 1477964 1368352 1487586 1150595 1205804 1309485 926915 1270410 1258396
19452 1258396 1094370 1156959 1301292 1213672 1184364 1102477 1073038 1111238 1018756 1236458 1259413
19441 1259413 1131891 1182283 1063177 1204952 945981 1129996 1095370 1081600 1130813 1123638
19431 1123638 1210554 963509 1180435 1154474 1214451 1104703 1031207 1226818 958314 1055284
19421 1055284 1054055 1024163 1010853 888347 1130608 906426 1050403 957606 1078693 1041784
$$ packed form
19493A728773N299j73234k3956J55542j45361J83102m6276p1866j21233P5599
19483A566389m2301M4863j24926J2683J8795N5618j16342j3043L4018k4105K4717
19472A436366M9293r9109P4556q7594M7822j71783o9223J37081l33855L28979
19462A312533j35479L00910j09612J19234l36991N5209J03681l82570L43495j2014
19452A258396j64026O2589J44333q7620k9308q1887k9439L8200r2482K17702K2955
19441A259413j27522N0392j19106J41775k58971J84015l4626j3770M9213p175
19431A123638Q6916k47045K16926k5961N9977j09748p3496J95611k68504R6970
19421A055284j229k9892j3310j22506K42261k24182J43977r2797J21087l6909
$$ plain form
19411 1041784 1038329 1147501 1105648 848239 758418 1023349 911646 1045372 869703 899952
19401 899952 620871 781306 1066007 1078747 1038070 1036385 972476 762929 888412 751726
19391 751726 863789 1009994 893225 857197 1003013 946783 886810 1001425 787136 996766
19381 996766 954519 949820 719646 984776 779117 932936 921347 869959 1100081 1073231 972926
19370 972926 1068542 726259 952225 673026 1253154 833379 1054481 882786 764734 914098
19360 914098 851467 892963 863509 1066861 978989 811306 813221 909545 898404 928156 918667
19349 918667 893364 846235 786782 931750 1141959 693098 801202 830207 777591 737993 893298
19338 893298 754637 844829 1074112 770498 1026495 815517 1196909 798622 785635 656716
$$ packed form
19411A041784l455J09172m1853k57409q9821K64931j11703J33726j75669L0249
19401H99952k79081J60435K84701J2740m0677j685o3909k09547J25483j36686
19391G51726J12063J46205j16769l6028J45816n6230n9973J14615k14289K09630
19381I96766m2247m699k30174K65130k05659J53819j1589n1388K30122k6850j00305
19370I72926R5616l42283K25966k79199N80128m19775K21102j71695j18052J49364
19360I14098o2631M1496k9454K03352q7872j67683J915R6324j1141K9752r489
19349I18667k5303m7129n9453J44968K10209m48861J08104K9005n2616l9598J55305
19338H93298j38661R0192K29283l03614K55997k10978L81392l98287j2987j28919
$$ plain form
19328 656716 923808 825095 807683 1011661 841392 1020189 572279 855254 853071 610321
19318 610321 932103 838126 756058 697214 963441 906855 869414 630929 659723 782464 794317
19307 794317 831840 917049 882959 869143 772241 711660 1093471 943618 965315 959660 940241
19296 940241 1135836 1030830 806213 1063181 983155 929473 755507 1014388 840948 979267
19286 979267 1018930 861544 836984 851124 682067 824072 813086 935411 938227 1114318 1033374
19275 1033374 1128518 1175758 648254 683081 949957 869467 923786 993882 1140312 922363
19265 922363 836132 1087097 722480 748439 676818 792633 890557 813685 583379 1025031
19255 1025031 1025747 852305 707768 953666 866630 839666 702621 965287 975912 812065
$$ packed form
19328F56716K67092r8713j7412K03978j70269J78797m47910K82975k183k42750
19318F10321L21782r3977q2068n8844K66227n6586l7441k38485K8794J22741J1853
19307G94317L7523Q5209l4090j3816r6902o0581L81811j49853K1697n655j9419
19296I40241J95595j05006k24617K56968q0026n3682j73966K58881j73440J38319
19286I79267L9663j57386k4560J4140j69057J42005j0986J22325K816J76091q0944
19275A033374R5144M7240n27504L4827K66876q0490N4319P0096J46430k17949
19265I22363q6231K50965l64617K5959p1621J15815R7924p6872k30306M41652
19255A025031P16j73442j44537K45898q7036k6964j37045K62666J0625j63847
$$ plain form
19245 812065 781990 922633 935975 1112306 1150686 1594145 1372615 1521377 1450308 1475006
19235 1475006 1410460 1171726 1155950 1182153 763570 823843 791503 859597 745736 874979
19225 874979 553878 781056 828112 919695 884726 820480 749739 512832 704975 850738
19215 850738 735344 1002546 702797 992682 801326 720945 750019 883480 616526 769599
19205 769599 823958 765849 585710 845146 585087 542262 713176 862555 414342 652144
19195 652144 735314 787511 887588 780423 915160 708878 696538 1101346 747565 601876
19185 601876 668217 502431 840539 589024 573804 823408 808511 725538 617900 756882
19175 756882 698233 556228 819532 678665 828235 888670 798759 987891 624048 781565
$$ packed form
19245H12065l0075J40643J3342J76331L8380M43459k21530J48762p1069K4698
19235A475006o4546k38734j5776K6203m18583O0273l2340O8094j13861J29243
19225H74979l21101K27178M7056R1583l4969o4246p0741k36907J92143J45763
19215H50738j15394K67202k99749K89885j91356q0381K9074J33461k66954J53073
19205G69599N4359n8109j80139K59436k60059m2825J70914J49379D14342K37802
19195F52144Q3170N2197J00077j07165J34737k06282j2340M04808l53781j45689
19185F01876O6341j65786L38108k51515j5220K49604j4897q2973j07638J38982
19175G56882n8649j42005K63304j40867J49570O0435q9911J89132l63843J57517
$$ plain form
19165 781565 741909 1023317 691606 680741 677411 756976 878276 1136504 918077 716672
19155 716672 947948 875349 662155 814323 1044396 889387 882001 903006 673524 658899
19145 658899 949659 696300 900521 754680 1141444 1138383 1292055 1251004 1323857 1401987
19135 1401987 1488732 1502544 1620953 1620334 1591451 1573598 1650297 1653036 1468477 1629614 1304583
19124 1304583 1483862 1485826 1332139 1512152 1405529 1363988 1145624 1143737 1344537 893436
19114 893436 990435 1152867 985985 847130 1041598 1093442 825501 1068692 1077822 886495
19104 886495 1211121 1281890 1315862 1394400 1209480 1089261 1131674 1387754 1103234 1162394
19094 1162394 1160667 1111128 1253758 1360813 1177751 1080669 1195279 1127211 1399692 1257379
$$ packed form
19165G81565l9656K81408l31711j0865l330P9565J21300K58228k18427k01405
19155G16672K31276p2599k13194J52168K30073j55009p386K1005k29482j4625
19145F58899K90760k53359K04221j45841L86764l061J53672m1051P2853P8130
19135A401987Q6745J3812J18409o19k8883j7853P6699K739j84559J61137l25031
19124A304583J79279J964j53687J80013j06623m1541k18364j887K00800m51101
19114H93436R6999J62432j66882j38855J94468N1844k67941K43191R130j91327
19104H86495L24626P0769L3972P8538j84920j20219M2413K56080k84520N9160
19094A162394j727m9539J42630J07055j83062r7082J14610o8068K72481j42313
$$ plain form
19084 1257379 1360103 1330525 1487915 1638513 1488999 1453714 1318261 1789534 1738703 2022086
19074 2022086 2304306 2315499 3055858 3390860 3847064 4514591 4862481 5730766 5808752 5756814
19064 5756814 5828193 5683221 5984952 5301619 4516203 4352076 3536639 2936065 2699386 2561472
19054 2561472 2151840 2117235 2138763 2584331 2588865 3418414 3689765 3992553 4454990 4734327
19044 4734327 4893994 4705711 4743745 4755122 4534761 4276143 3329717 2894426 2549766 2549121
19034 2549121 2344178 2228082 2059587 2177435 2541286 2782187 3059220 3371298 3641629
19025 3641629 4690412 5374990 6031412 6406289 6609454 6993371 6611602 6941367 6451363
19016 6451363 6101735 5171858 4556707 3986670 3478351 2952058 2763828 2859483 3241829 3076649
$$ packed form
19084A257379J02724k9578J57390J50598j49514l5285j35453M71273n0831K83383
19074B022086K82220J1193P40359L35002M56204O67527L47890Q68285P7986n1938
19064E756814P1379j44972L01731o83333p85416j64127q15437o00574k36679j37914
19054B561472m09632l4605K1528M45568M534Q29549K71351L02788M62437K79337
19044D734327J59667j88283L8034J1377k20361k58618r46426m35291l44660o45
19034B549121k04943j16096j68495J17848L63851K40901K77033L12078K70331
19025C641629J048783O84578O56422L74877K03165L83917l81769L29765m90004
19016F451363l49628r29877o15151n70037n08319n26293j88230R5655L82346j65180
$$ plain form
19006 3076649 3932438 4239400 4959647 5235060 5338799 5433705 5324541 5032168 4957823 4691509
18996 4691509 3707302 3590112 2852224 2566250 2182496 2160681 2285489 2480932 2460149 2788976
18986 2788976 3099768 3682326 3881631 4517943 4880930 5027908 5155433 5159083 5400166 5074827
18976 5074827 4503489 4123639 3707383 3299949 3451533 3288870 3021895 3225621 3410830
18967 3410830 3622199 4001254 4317571 5095171 5943452 6919085 7892434 9221367 10546254
18958 10546254 11867320 13766456 15194400 17542517 19460790 20866545 22580971 23090595
18950 23090595 23558553 23807989 23243635 22329698 20833038 19105344 16633519 14103502 12090816
18941 12090816 9859861 8544481 7136401 5921603 5236235 4514321 3982811 3426536 2933943
$$ packed form
19006C076649Q55789L06962P20247K75413J03739R4906j09164k92373p4345k66314
18996D691509r84207j17190p37888k85974l83754k1815J24808J95443k0783L28827
18986B788976L10792N82558J99305O36312L62987J46978J27525L650K41083l25339
18976E074827n71338l79850m16256m07434J51584j62663k66975K03726J85209
18967C410830K11369L79055L16317P77600Q48281R75633R73349J328933J324887
18958A0546254J321066J899136J427944K348117J918273J405755J714426N09624
18950B3090595M67958K49436n64354r13937j496660j727694k471825k530017k012686
18941A2090816k230955j315380j408080j214798o85368p21914n31510n56275m92593
$$ plain form
18932 2933943 2614395 2893932 2508371 2364102 2441096 2101664 2104315 2176545 2103657 2047175
18922 2047175 1812119 1834899 1691718 2074107 1821352 1880026 1975957 2166831 1859566 1871358
18912 1871358 2098171 1671723 2087009 2143121 2077987 2031161 2266891 2446839 2648383 2464609
18902 2464609 2893312 3072066 3344352 3618356 4217593 4659555 5473889 6099022 7221494
18893 7221494 8627979 10465587 12450182 14319487 16276084 18200281 19279863 20139066
18885 20139066 20628280 20234171 19494761 18135687 16055370 13931523 11642495 9938300
18877 9938300 8024481 6524302 5402874 4952487 3929170 3559784 3413041 2824857 2390548
18868 2390548 2396005 1931149 1910795 1760312 1902933 1464975 1596202 1548199 1421568 1338225
$$ packed form
18932B933943l19548K79537l85561j44269P6994l39432K651P2230p2888n6482
18922B047175k35056K2780j43181L82389k52755N8674R5931J90874l07265J1792
18912A871358K26813m26448M15286N6112o5134m6826K35730J79948K01544j83774
18902B464609M28703J78754K72286K74004N99237M41962Q14334O25133J122472
18893G221494J406485J837608J984595J869305J956597J924197J079582Q59203
18885B0139066M89214l94109p39410j359074k080317k123847k289028j704195
18877I938300j913819j500179j121428m50387j023317l69386j46743n88184m34309
18868B390548N457m64856k0354j50483J42621m37958J31227m8003j26631q3343
$$ plain form
18858 1338225 1402856 1337673 1204460 1071975 1142155 1121916 1247597 1139372 1040642 1140908
18848 1140908 867028 1130101 1048599 924755 1030974 884392 908873 999534 849183 889102
18838 889102 879358 818660 807894 851720 920501 850650 909856 687882 856532 792160 899989
18827 899989 824116 776491 624181 790850 688388 885966 794113 776004 680551 696949 683999
18816 683999 865435 831143 721247 828490 560958 810823 833880 1017710 940956 806051
18806 806051 680564 689692 690722 914077 880243 805791 899099 676025 691036 814623 472235
18795 472235 810770 735422 709729 865027 819147 690525 890428 704937 819686 652511
18785 652511 1010949 844463 724188 712186 875701 858978 671350 981089 826082 1045033
$$ packed form
18858A338225O4631o5183j33213j32485P0180k0239J25681j08225r8730J00266
18848A140908k73880K63073q1502j23844J06219j46582K4481R0661j50351L9919
18838H89102r744o0698j0766M3826O8781o9851N9206k21974J68650o4372J07829
18827H99989p5873m7625j52310J66669j02462J97578r1853j8109r5453J6398j2950
18816F83999J81436l4292j09896J07243k67532K49865K3057J83830p6754j34905
18806H06051j25487R128J030K23355l3834p4452R3308k23074J5011J23587l42388
18795D72235L38535p5348k5693J55298m5880j28622J99903j85491J14749j67175
18785F52511L58438j66486j20275j2002J63515j6723j87628L09739j55007K18951
$$ plain form
18775 1045033 1033317 894606 851377 952246 851753 812502 938604 713797 1073136 696792
18765 696792 1144954 750486 617464 984198 761335 920013 833548 1115877 756246 527966
18755 527966 648093 920256 667114 828848 840010 547326 828951 683898 630896 622666
18745 622666 885045 791159 601873 847091 745112 736944 619402 517806 555442 699924
18735 699924 643696 688655 623498 681037 683501 401311 988811 748648 741542 500017 820512
18724 820512 904842 609575 676679 780052 792006 598986 658046 695128 677018 653583 908561
18713 908561 768524 786380 1009386 579600 672301 854912 594285 890784 823523 817264
18703 817264 1041447 808091 785844 674673 603118 726443 808747 856105 557716 930878
$$ packed form
18775A045033j1716j38711m3229J00869j00493l9251J26102k24807L59339l76344
18765F96792M48162l94468j33022L66734k22863J58678q6465K82329l59631k28280
18755E27966J20127K72163k53142J61734J1162k92684K81625j45053n3002q230
18745F22666K62379r3886j89286K45218j01979q168j17542j01596L7636J44482
18735F99924n6228M4959o5157N7539K464k82190N87500k40163p106k41525L20495
18724H20512Q4330k95267O7104J03373J1954j93020N9060L7082j8110k3435K54978
18713I08561j40037J7856K23006m29786R2701J82611k60627K96499o7261o259
18703H17264K24183k33356k2247j11171p1555J23325Q2304M7358k98389L73162
$$ plain form
18693 930878 694485 937555 674177 677604 864632 615946 754678 578285 715868 722757
18683 722757 784287 614648 466695 687515 673482 479141 735549 604660 611466 520323
18673 520323 557250 666555 400516 651959 491098 624336 762367 591600 611616 528161
18663 528161 598964 673989 764550 708867 495496 796131 517127 656048 637321 718321 593878
18652 593878 644339 716500 718196 690762 569306 541118 757670 430128 714107 694708 550683
18641 550683 610726 802002 653685 660837 609793 515818 798961 517869 569794 652193 576694
18630 576694 776935 839675 646481 630195 459617 654344 575386 443144 693510 809901
18620 809901 561496 652796 552534 793992 395837 654246 676521 564334 579533 567679
$$ packed form
18693I30878k36393K43070k63378L427J87028k48686J38732j76393J37583O889
18683G22757O1530j69639j47953K20820j4033j94341K56408j30889O806r1143
18673E20323L6927J09305k66039K51443j60861J33238J38031j70767K0016q3455
18663E28161P0803P5025R0561n5683k13371L00635k79004J38921j8727Q1000j24443
18652E93878N0461P2161J696k7434j21456k8188K16552l27542K83979j9399j44025
18641E50683O0043J91276j48317P152n1044r3975K83143k81092N1925Q2399p5499
18630E76694K00241O2740j93194j6286j70578J94727p8958j32242K50366J16391
18620H09901k48405R1300j00262K41458C95837K58409K2275j12187J5199j1854
$$ plain form
18610 567679 626888 611717 757101 841930 550502 734878 646096 859259 850434 686646 605365
18599 605365 664636 835498 614265 604991 604039 596356 704210 784878 682707 863764 594096
18588 594096 787363 731428 695639 698699 811194 892223 693355 482806 635625 577977 437090
18577 437090 746922 976853 794524 689711 592498 680869 650654 517418 805146 717846
18567 717846 702528 726219 760692 736475 559768 753859 658223 690663 683403 776376 675999
18556 675999 847974 658945 509883 547953 519411 789367 721779 1006417 724280 827013
18546 827013 630083 569082 417569 286837 693592 380526 670157 541862 611938 614238
18536 614238 626469 251214 542712 583362 472933 537611 500628 554712 719685 576888
$$ packed form
18610E67679N9209j5171J45384Q4829k91428J84376q8782K13163q825j63788q1281
18599F05365N9271J70862k21233r274r52p683J07854Q0668j02171J81057k69668
18588E94096J93267n5935l5789L060J12495Q1029j98868k10549J52819n7648j40887
18577D37090L09832K29931j82329j04813r7213Q8371l0215j33236K87728q7300
18567G17846j5318K3691L4473k4217j76707J94091r5636L2440p260R2973j00377
18556F75999J71975j89029j49062L8070k8542K69956o7588K84638k82137J02733
18546H27013j96930o1001j51513j30732M06755l13066K89631j28295P0076K300
18536F14238J2231B51214K91498M0650j10429O4678l6983N4084J64973j42797
$$ plain form
18526 576888 483637 558480 669180 620151 433421 537080 599913 237310 696434 168237
18515 298036 454521 424490 552574 656434 552229 624991 545887 484180 635726 695562
18505 695562 620678 653963 426518 507396 613868 305069 387327 578332 394827 600589
18495 600589 634724 512501 412387 425894 487009 620261 627467 573604 592208 665700 287484
18483 721994 435971 433879 630810 707716 488655 718118 628385 403535 481054 520524 411326
18472 411326 430069 489348 590016 380968 590468 486996 518189 704643 541792 575152
18462 575152 608948 579448 570534 609200 446868 598515 395781 758396 758687 705014 589100
18451 589100 561739 682935 504311 460033 488034 855504 576142 583657 496196 516227 652085
$$ packed form
18526E76888r3251P4843J10700m9029j86730J03659O2833B37310M59124A68237
18515B98036J56485l0031J28084J03860j04205P2762p9104o1707J51546N9836
18505F95562p4884L3285k27445Q0878J06472C05069Q2258J91005j83505K05762
18495F00589L4135j22223j00114J3507O1115J33252P206n3863J8604P3492B87484
18483G21994k86023k092J96931P6906k19061K29463q9733k24850P7519L9470j09198
18472D11326J8743N9279J00668k09048K09500j03472L1193J86454j62851L3360
18462E75152L3796k9500q914L8666j62332J51647k02734L62615K91n3673j15914
18451E89100k7361J21196j78624m4278K8001L67470k79362P515q7461K0031J35858
$$ plain form
18440 652085 628447 410202 505302 435672 485206 607667 628455 537670 491695 642205 522929
18429 522929 423680 649847 545136 746082 547000 644623 632924 684991 653314 876549
18419 876549 642084 622905 510603 598430 355363 528405 803983 599122 377385 476059
18409 476059 652169 583393 666895 492181 782832 749682 574678 431679 617282 662715
18399 662715 657624 827961 951453 720661 543495 777121 559157 445372 639345 415722
18389 415722 529373 464565 356164 256750 532008 417651 725741 603420 700552 438794
18379 438794 708538 558328 548742 455597 409606 425830 575389 547777 544869 535482 489950
18368 489950 359476 591539 463839 597166 496020 540684 512941 469656 529464 358080
$$ packed form
18440F52085k3638k18245R5100o9630M9534J22461K0788r0785m5975J50510j19276
18429E22929r9249K26167j04711K00946j99082R7623j1699N2067l1677K23235
18419H76549k34465j9179j12302Q7827k43067J73042K75578k04861k21737R8674
18409D76059J76110o8776Q3502j74714K90651l3150j75004j42999J85603M5433
18399F62715n091J70337J23492k30792j77166K33626k17964j13785J93973k23623
18389D15722J13651o4808j08401r9414K75258j14357L08090j22321R7132k61758
18379D38794K69744j50210r586r3145m5991J6224J49559k7612k908r387m5532
18368D89950j30474K32063j27700J33327j01146M4664k7743m3285N9808j71384
$$ plain form
18358 358080 535176 451726 367400 444288 383529 660553 417837 671622 307572 598017
18348 598017 550622 619362 496854 586717 534336 580012 399943 679400 623714 516216 661621
18337 661621 499955 490086 423473 585633 491781 687683 516903 622213 493813 786856
18327 786856 514435 436749 426939 526033 392406 423180 356646 654871 737222 661223 605553
18316 605553 345933 379536 734523 514648 597654 482252 425283 477732 317026 347862
18306 347862 627269 669770 516180 474232 471017 582891 471920 432026 444879 748620 579823
18295 579823 486465 701885 524014 744861 674811 549878 437317 575961 626764 571207
18285 571207 586548 222954 746147 579542 466906 502000 507496 488298 540079 709803 548808
$$ packed form
18358C58080J77096q3450q4326P6888o0759K77024k42716K53785C07572K90445
18348E98017m7395O8740j22508Q9863n2381M5676j80069K79457n5686j07498J45405
18337F61621j61666r869o6613J62160r3852J95902j70780J05310j28400K93043
18327G86856k72421p7686r810R9094j33627L0774o6534K98225Q2351p5999n5670
18316F05553k59620L3603L54987k19875Q3006j15402n6969N2449j60706L0836
18306C47862K79407M2501j53590m1948l215J11874j10971l9894J2853L03741j68797
18295E79823r3358K15420j77871K20847p0050j24933j12561J38644N0803n5557
18285E71207J5341B22954N23193j66605j12636L5094N496j9198N1781J69724j60995
$$ plain form
18274 548808 498768 554760 489504 429214 298472 594880 619589 500629 470972 398457 606514
18263 606514 363551 433625 587785 308608 481542 324073 591415 551749 417415 580520
18253 580520 568101 566336 703558 650897 630186 559860 898688 705058 566672 680174 601758
18242 601758 624635 502799 526638 681013 532035 605464 522135 533330 825766 441659
18232 441659 368328 555976 564351 560028 363736 459528 504175 484886 671959 675017 374379
18221 374379 544655 385522 325697 444995 502493 548906 722964 504968 503834 614978
18211 614978 659046 328618 350406 610623 659312 410278 350700 606087 467318 559634
18201 559634 591772 553943 426621 731898 826362 604359 515488 408165 550189 611403
$$ packed form
18274E48808n0040N5992o5256o0290j30742K96408K4709j18960k9657p2515K08057
18263F06514k42963P0074J54160k79177J72934j57469K67342l9666j34334J63105
18253E80520j2419j765J37222n2661k0711p0326L38828j93630j38386J13502p8416
18242F01758K2877j21836K3839J54375j48978P3429q3329J1195K92436l84107
18232D41659p3331J87648Q375m323j96292R5792M4647j9289J87073L058l00638
18221C74379J70276j59133n9825J19298N7498M6413J74058k17996j134J11144
18211F14978M4068C28618K1788K60217M8689k49034n9578K55387j38769R2316
18201E59634L2138l7829j27322L05277R4464k22003q8871j07323J42024O1214
$$ plain form
18191 611403 501271 378376 572544 576928 524838 387118 487485 591671 568100 343053
18181 343053 564468 527552 523228 548725 405529 445305 583105 526181 476447 452145 557789
18170 557789 332737 460288 718134 382917 276692 566962 490453 489261 384830 417590
18160 417590 461978 568157 504294 429026 393490 599951 299302 503211 527816 487698 716860
18149 716860 455425 372861 658879 488371 433886 638090 624595 583123 425070 644116
18139 644116 338907 480544 690195 230445 527703 751872 581182 471236 366672 508972
18129 508972 404261 685500 453304 578610 447938 479323 547619 447020 260766 353863
18119 353863 450835 447355 554814 509419 637208 597270 797658 518010 574706 591154 526843
$$ packed form
18191F11403j10132j22895J94168M384n2090j37720J00367J04186k3571k25047
18181C43053K21415l6916m324K5497j43196L9776J37800n6924m9734k4302J05644
18170E57789k25052J27551K57846l35217j06225K90270p6509j192j04431L2760
18160D17590M4388J06179o3863p5268l5536K06461B99302K03909K4605m0118K29162
18149G16860k61435q2564K86018j70508n4485K04204j3495m1472j58053K19046
18139F44116l05209J41637K09651B30445K97258K24169j70690j09946j04564J42300
18129E08972j04711K81239k32196J25306j30672L1385O8296j00599j86254R3097
18119C53863R6972l480J07459m5395J27789l9938K00388k79648N6696J6448o4311
$$ plain form
18108 526843 624243 850109 521402 608986 695438 601669 535860 646161 623663 633142 437836
18097 437836 613571 550680 485107 503488 401012 480002 711724 408466 369596 612872
18087 612872 860467 284518 606199 388361 469356 348468 579295 350352 421393 489971
18077 489971 590812 470293 660709 475549 591552 587973 179563 464916 440666 434863
18067 434863 415201 573084 539311 247753 387058 452427 672111 674183 608791 432826 467223
18056 467223 436477 472354 737212 468183 475817 412721 420752 316799 463664 485130 357922
18045 357922 484281 512066 395277 109906 278001 625619 323633 577467 346054 249717
18035 249717 212790 455188 473855 420226 556131 563154 371889 582560 360080 162076
$$ packed form
18108E26843R7400K25866l28707Q7584Q6452r3769o5809J10301k2498R479j95306
18097D37836J75735o2891o5573J8381j02476P8990K31722l03258l8870K43276
18087F12872K47595B84518L21681k17838Q0995j20888K30827k28943P1041O8578
18077D89971J00841j20519J90416j85160J16003l579A79563K85353k4250n803
18067D34863j9662J57883l3773B47753J39305O5369K19684K072o5392j75965L4397
18056D67223l0746L5877K64858k69029P634o3096Q031j03953J46865K1466j27208
18045C57922J26359K7785j16789A09906J68095L47618l01986K53834k31413r6337
18035B49717l6927K42398J8667n3629J35905P023j91265K10671k22480A62076
$$ plain form
18024 460676 538861 235873 459623 618436 176678 407388 566184 470502 536012 349703
18014 349703 459613 513862 628125 338373 458335 551080 412626 481518 710344 699647
18004 699647 326280 547643 475877 391403 545400 515321 365201 648896 440632 485415
17994 485415 336789 622202 414496 609108 410423 689522 623608 543511 481018 558586
17984 558586 503424 223583 513792 708773 404253 451210 618100 384325 394234 306659
17974 306659 536909 666603 326757 451831 567945 341120 483879 573010 421552 480522
17964 480522 528191 441834 512007 612911 590720 717591 590116 541577 605335 551199 483355
17953 483355 417626 640619 656337 450267 746092 777595 534508 539190 729982 415241
$$ packed form
18024D60676P8185B35873K23750J58813A76678K30710J58796r5682O5510j86309
18014C49703J09910N4249J14263k89752J19962R2745j38454O8892K28826j0697
18004F99647C26280K21363p1766q4474J53997l0079j50120K83695k08264M4783
17994D85415j48626K85413k07706J94612j98685K79099o5914q0097o2493P7568
17984E58586n5162B23583K90209J94981l04520M6957J66890k33775R909q7575
17974C06659K30250J29694C26757J25074J16114k26825J42759Q9131j51458N8970
17964D80522M7669q6357P0173J00904k2191J26871j27475m8539O3758n4136o7844
17953D83355o5729K22993J5718k06070K95825L1503k43087M682J90792l14741
$$ plain form
17943 415241 742068 406697 613296 747131 527318 501268 796307 640668 577029 573024
17933 573024 482107 804418 609328 616474 482813 784389 484026 815584 551756 405533
17923 405533 636192 617491 505916 505178 640264 763622 775832 766691 790748 771083 759337
17912 759337 771948 787651 601628 926758 663155 761917 682991 874044 587462 415243
17902 415243 868232 630038 854080 781848 950227 751198 631237 813662 546484 598831
17892 598831 890837 677924 620795 716117 761209 659603 729224 678603 833827 817511 811729
17881 811729 671049 726039 997152 703552 1003344 819946 910810 1074483 817120 922418
17871 922418 700228 830829 756349 721659 695144 882113 853602 762318 633276 819294
$$ packed form
17943D15241L26827l35371K06599J33835k19813k6050K95039j55639o3639m005
17933E73024r0917L22311j95090P146j33661L01576l00363L31558k63828j46223
17923D05533K30659j8701j11575p38J35086J23358J2210r141K4057j9665j1746
17912G59337J2611J5703j86023L25130k63603R8762p8926J91053k86582j72219
17902D15243M52989k38194K24042p2232J68379j99029j19961J82425k67178N2347
17892E98831K92006k12913n7129R5322M5092j01606O9621n0621J55224j6316n782
17881H11729j40680N4990K71113k93600K99792j83398R0864J63673k57363J05298
17871I22418k22190J30601p4480l4690k6515J86969k8511r1284j29042J86018
$$ plain form
17861 819294 591674 862452 771167 804640 676934 586096 637402 545720 760861 601790
17851 601790 618084 690985 751455 724359 565600 606391 579900 788621 645961 514122 881229
17840 881229 578416 880637 707570 804842 629629 697989 681048 787157 814484 580117
17830 580117 533418 696055 705493 812765 309098 791195 837100 769360 568204 692529
17820 692529 776758 634466 678686 729214 815260 802168 1074851 990679 889419 830859 869938
17809 869938 833740 643480 872008 890313 939039 730009 812458 674450 927008 750678
17799 750678 927783 981274 916680 770423 941534 900977 705374 737231 721243 604777
17789 604777 619764 413733 847575 618331 589044 597405 792904 428250 590396 359917
$$ packed form
17861H19294k27620K70778r1285L3473j27706r0838N1306r1682K15141j59071
17851F01790J6294P2901O0470k7096j58759M0791k6491K08721j42660j31839L67107
17840H81229l02813L02221j73067R7272j75213O8360j6941J06109K7327k34367
17830E80117m6699J62637R438J07272C09098M82097M5905o7740k01156J24325
17820F92529Q4229j42292M4220N0528Q6046j3092K72683q4172j01260n8560L9079
17809H69938l6198j90260K28528J8305M8726k09030Q2449j38008K52558j76330
17799G50678J77105N3491o4594j46257J71111m0557j95603L1857j5988j16466
17789F04777J4987k06031M33842k29244k9287Q361J95499l64654J62146k30479
$$ plain form
17779 359917 660837 683467 563593 479922 648115 515855 668631 545268 426465 914798
17769 914798 526671 747443 813313 825589 791066 814078 724540 814834 899018 566851 682060
17758 682060 730993 705556 498481 452382 608592 483533 481868 594665 797305 673953
17748 673953 722706 661378 528015 571685 751061 874597 853627 838943 743065 701092 964918
17737 964918 497364 694972 817824 670084 891314 704168 697112 479092 674681 572643
17727 572643 680997 683779 601597 736236 594230 592775 646373 528208 620957 834018 481745
17716 481745 840313 814432 493616 587153 767695 608929 507247 640764 711082 584536
17706 584536 494063 730457 549085 379819 715730 419652 602563 763936 795832 698562
$$ packed form
17779C59917L00920K2630j19874q3671J68193j32260J52776j23363j18803M88333
17769I14798l88127K20772O5870J2276l4523K3012q9538R0294Q4184l32167J15209
17758F82060M8933k5437k07075m6099J56210j25059j665J12797K02640j23352
17748F73953M8753o1328j33363M3670J79376J23536k0970j4684r5878m1973K63826
17737I64918m67554J97608J22852j47740K21230j87146p056k18020J95589j02038
17727E72643J08354K782q2182J34639j42006j455N3598j18165R2749K13061l52273
17716D81745L58568k5881l20816R3537J80542j58766j01682J33517P0318j26546
17706E84536r0473K36394j81372j69266L35911k96078J82911J61373L1896r7270
$$ plain form
17696 698562 615774 748473 574360 670419 591040 417348 785221 790007 582464 691192
17686 691192 618334 566925 733035 642448 880689 581655 512747 524291 845985 704221
17676 704221 818728 454101 521384 746908 572425 461138 401782 650379 844847 446725
17666 446725 832747 872528 659450 700396 732644 626557 664533 901183 805084 693039
17656 693039 639134 702979 762265 655291 655425 813755 822443 803499 737452 970450 768833
17645 768833 818966 840480 853053 833415 665161 887082 820574 1073730 986885 850873 1060122
17634 1060122 974006 1091672 971756 969707 1006525 1062843 1020890 1025113 1204119 852620 1054209
17623 1054209 1227530 1177267 981748 1278347 847004 1253114 1324062 1127274 1277382 1128649
$$ packed form
17696F98562q2788J32699j74113R6059p9379j73692L67873M786k07543J08728
17686F91192p2858n1409J66110r0587K38241k99034o8908J1544L21694j41764
17676G04221J14507l64627O7283K25524j74483j11287n9356K48597J94468l98122
17666D46725L86022L9781k13078M0946L2248j06087L7976K36650r6099j12045
17656F93039n3905O3845N9286j06974J34J58330Q688j8944o6047K32998k01617
17645G68833N0133K1514J2573j9638j68254K21921o6508K53156q6845j36012K09249
17634A060122q6116J17666j19916k049L6818N6318m1953M223J79006l51499K01589
17623A054209J73321n0263j95519K96599m31343M06110P0948j96788J50108j48733
$$ plain form
17613 1128649 1104223 1197304 1336508 1267188 1040875 1260164 1370099 1234436 1085892 1296087
17603 1296087 1214162 1569003 1245364 1362903 1234718 1299789 1315997 1050714 1132206 1642267
17593 1642267 1314110 1260889 1206259 1475955 1258259 1329860 1343166 1068435 1231877 1307598
17583 1307598 1025512 1171989 1165643 1344303 1299174 1341543 1121381 1129535 1046200 1356933 1397777
17572 1397777 1080806 1172690 1319714 1203537 1086232 1247431 1065403 1068069 1024612 1224909
17562 1224909 1189680 1375948 941512 1407741 1112509 1033954 1032778 1175579 1148949 1142421 1199871
17551 1199871 1037689 960880 1320084 1255296 1099193 1132201 1405305 1281318 1275825 1070284
17541 1070284 1372381 1236296 1002811 1048819 1255682 1228169 1135233 1103636 1108932 1037055 1166892
$$ packed form
17613A128649k4426R3081J39204o9320k26313K19289J09935j35663j48544K10195
17603A296087q1925L54841l23639J17539j28185O5071J6208k65283Q1492N10061
17593A642267l28157n3221n4630K69696k17696P1601J3306k74731J63442P5721
17583A307598k82086J46477o346J78660m5129M2369k20162Q154q3335L10733M0844
17572A397777l16971R1884J47024j16177j17305J61199j82028K666m3457K00297
17562A224909l5229J86268m34436M66229k95232p8555j176J42801k6630o528N7450
17551A199871j62182p6809L59204o4788j56103L3008K73104j23987n493k05541
17541A070284L02097j36085k33485M6008K06863k7513r2936l1597N296p1877J29837
$$ plain form
17530 1166892 1318899 1413537 1245627 1108748 1271097 1307332 1391435 1392880 1445401 1240899
17520 1240899 1310975 1348519 1223415 1302549 1408258 1486691 1533749 1861683 2018532 1755206
17510 1755206 1875677 1944810 2228221 2247803 2451440 2242313 2345051 2357625 2306009 2435119
17500 2435119 2349471 2102790 2339317 2701554 2699738 3228085 3075659 3365648 3789885 4218351
17490 4218351 4723626 5166588 5902239 7222390 9839536 14662522 21135648 29510551 38115015
17481 38115015 45148683 50288668 53878373 55747942 56425373 55311548 51959368 46337451
17473 46337451 37974840 29941090 24074679 22584226 25269225 31498044 39073507 45797052
17465 45797052 51220540 54770424 56711899 57035779 56094465 52770922 47122405 38908816
$$ packed form
17530A166892J52007R4638j67910j36879J62349L6235Q4103J445N2521k04502
17520A240899P0076L7544j25104P9134J05709P8433M7058L27934J56849k63326
17510A755206J20471O9133K83411J9582K03637k09127J02738J2574n1616J29110
17500B435119q5648k46681K36527L62237j816N28347j52426K89989M24237M28466
17490D218351N05275M42962P35651J320151K617146M822986O473126Q374903Q604464
17481C8115015P033668N139985L589705J869569O77431j113825l352180n621917
17473D6337451q362611q033750n866411j490453K684999O228819P575463O723545
17465D5797052N423488L549884J941475L23880r41314l323543n648517q213589
$$ plain form
17457 38908816 29285741 20344909 13859611 9813582 7192614 6065895 5023949 4390692
17449 4390692 3966254 3648812 3633179 3584458 3562215 3836256 3539129 3981264 3998135 3794366
17439 3794366 4016383 4122800 3899038 3468297 3656524 3322124 3276343 3181123 3469396 3483383
17429 3483383 3563367 3459427 3747891 3846643 3626993 3399811 3201249 3071736 2814923 2734572
17419 2734572 2892101 2504912 2399950 2350868 2414467 2327254 2171165 2461709 2504243 2349932
17409 2349932 2397465 2653330 2754926 2375513 2769377 2887439 2822077 3300993 3356875 3367977
17399 3367977 3500301 3664939 3707238 3695594 3856361 4016086 4422159 4447308 4623866 5264386
17389 5264386 5715372 6000557 6559118 7184226 7384156 7564016 7751156 7518062 7719722
$$ packed form
17457C8908816r623075q940832o485298m046029k620968j126719j041946o33257
17449D390692m24438l17442j5633m8721k2243K74041k97127M42135J6871k03769
17439C794366K22017J06417k23762m30741J88227l34400m5781r5220K88273J3987
17429C483383P9984j03940K88464R8752k19650k27182j98562j29513k56813q0351
17419B734572J57529l87189j04962m9082O3599q7213j56089K90544M2534j54311
17409B349932M7533K55865J01596l79413L93864J18062o5362M78916N5882J1102
17399C367977J32324J64638M2299j1644J60767J59725M06073K5149J76558O40520
17389E264386M50986K85185N58561O25108J99930J79860J87140k33094K01660
$$ plain form
17380 7719722 7548281 7170227 7105541 6596870 6480438 6527504 6448096 6453030 6741367 6792355
17370 6792355 7400365 7824613 8098964 8438443 8916372 9367746 9379209 9552464 9739513 9500873
17360 9500873 9507700 9387563 9161074 9192431 9063460 9140263 9167137 9252966 9629439 10051283
17350 10051283 10623889 10908754 11560923 11833457 12854288 13351687 14076000 14702459 14974771
17341 14974771 15045308 15390811 14873866 14881820 14568366 14134697 13753578 13523385 13520444 12990290
17331 12990290 13205712 13689958 13836235 14420195 15165211 15901193 16138642 16948773 17183090
17322 17183090 17586076 17635053 17762907 17320508 17023891 16671860 15988514 15446362 15075424
17313 15075424 14391977 13973514 13422854 13071119 13174296 13084852 13015387 13233791 13324162 13621665
$$ packed form
17380G719722j71441l78054o4686n08671j16432M7066p9408M934K88337N0988
17370F792355O08010M24248K74351L39479M77929M51374J1463J73255J87049k38640
17360I500873O827j20137k26489L1357j28971P6803K6874Q5829L76473M21844
17350A0051283N72606K84865O52169K72534J020831M97399P24313O26459K72312
17341A4974771P0537L45503n16945P954l13454m33669l81119k30193k941n30154
17331A2990290K15422M84246J46277N83960P45016P35982K37449Q10131K34317
17322A7183090M02986M8977J27854m42399k96617l52031o83346n42152l70938
17313A5075424o83447m18463n50660l51735J03177q9444o9465K18404R0371K97503
$$ plain form
17303 13621665 14344126 14653881 15147587 15484895 15358372 15744524 15622954 15709250 15148390
17294 15148390 14764490 14504015 13628421 13234867 12771239 12671795 11924412 11697442 11772857 11361439
17284 11361439 11218434 11057861 10847596 10554142 10333204 10046410 9551798 8807967 8600105
17275 8600105 7925664 7285016 6802392 6529461 6227437 5824987 5734821 5222857 5411693 4968183
17265 4968183 5035066 4767498 4404053 4479391 4315224 4207755 4129217 3946279 3883691 3847908
17255 3847908 3744118 3669190 3693599 3699849 3607068 3769517 3751375 3493362 3549117 3304447 3347404
17244 3347404 3207609 3153003 3253840 3134232 3065071 2862553 2697934 2808701 2831329 2636601
17234 2636601 2961841 2794994 2686952 2780816 2863872 2685089 2848287 2748970 3049100 2976183
$$ packed form
17303A3621665P22461L09755M93706L37308j26523L86152j21570Q6296n60860
17294A5148390l83900k60475q75594l93554m63628r9444p47383k26970P5415m11418
17284A1361439j43005j60573k10265k93454k20938k86794m94612p43831k07862
17275H600105o74441o40648m82624k72931l02024m02450r0166n11964J88836m43510
17265D968183O6883k67568l63445P5338j64167j07469p8538j82938o2588l5783
17255C847908j03790p4928K4409O250r2781J62449j8142k58013N5755k44670M2957
17244C347404j39795n4606J00837j19608o9161k02518j64619J10767K2628j94728
17234B636601L25240j66847j08042R3864Q3056j78783J63198r9317L00130p2917
$$ plain form
17224 2976183 2914112 2897944 3045876 3030011 3043187 3006083 2934132 2831432 2815515 2984748 2944565
17213 2944565 2951170 2917090 2968803 2898065 2779277 2923853 3109573 3131619 3076035 3372256 3050656
17202 3050656 3183912 3180315 3150576 3145403 3067399 2971673 2865836 2591571 2486250 2368791 2118280
17191 2118280 2176502 2126201 2332053 2319594 2170041 1946028 2301319 2336290 2010204 2063486
17181 2063486 2146004 2071113 2006271 1906560 1771695 1797009 1842623 2076782 1958195 1856638
17171 1856638 1992152 2049691 2026703 2083396 2060138 2103054 1932880 2082410 2104009 2240550
17161 2240550 2188530 2313338 2342361 2281940 2222729 2375107 2353730 2703834 2582511 2649903
17151 2649903 2600300 2277333 2393587 2424275 2586130 2332320 2371037 2145324 2496526 2366454
$$ packed form
17224B976183o2071j6168J47932j5865J3176l7104p1951j02700j5917J69233m0183
17213B944565O605l4080N1713p0738j18788J44576J85720K2046n5584K96221l21600
17202C050656J33256l597k9739n173p8004r5726j05837k74265j05321j17459k50511
17191B118280N8222n0301K05852j2459j49553k24013L55291L4971l26086N3282
17181B063486Q2518p4891o4842r9711j34865K5314M5614K34159j18587j01557
17171A856638J35514N7539k2988N6693k3258M2916j70174J49530K1599J36541
17161B240550n2020J24808K9023o0421n9211J52378k1377L50104j21323O7392
17151B649903m9603l22967J16254L0688J61855k53810L8717k25713L51202j30072
$$ plain form
17141 2366454 2429294 2358988 2348942 2393554 2652430 2832987 2468387 2328046 2532890 2570666
17131 2570666 2277381 2367454 2359299 2624567 2516033 2461880 2649978 2456937 2553859 2591358
17121 2591358 2639776 2831605 2477203 2523686 2728252 2348619 2205092 2369343 2070883 2082560
17111 2082560 2216883 1720032 1782880 2022623 1669008 1777453 1707961 1635980 1429006 1415891
17101 1415891 1456260 1738613 1658771 1538927 1375882 1523608 1425596 1715799 1207751 1352841
17091 1352841 1314884 1052699 1029495 1386468 1177912 1352797 1251258 1051266 1236094 949898
17081 949898 1232471 1215818 1235816 1117463 977164 1173233 1340374 1100964 1156829 955199
17071 955199 1157163 1109709 1269603 1042048 1247752 1178480 1254626 1351983 984733 1176337
$$ packed form
17141B366454O2840p0306j0046M4612K58876J80557l64600j40341K04844L7776
17131B570666k93285R0073q155K65268j08534n4153J88098j93041R6922L7499
17121B591358M8418J91829l54402M6483K04566l79633j43527J64251k98460J1677
17111B082560J34323m96851O2848K39743l53615J08445o9492p1981k06974j3115
17101A415891M0369K82353p9842j19844j63045J47726r8012K90203n08048J45090
17091A352841l7957k62185k3204L56973k08556J74885j01539j99992J84828k86196
17081I49898K82573j6653J9998j18353j40299J96069J67141k39410N5865k01630
17071I55199K01964m7454J59894k27555K05704o9272P6146R7357l67250J91604
$$ plain form
17061 1176337 1131923 1123373 1062262 1312136 1251944 1391487 1351071 1416784 1509841 1536662 1666607
17050 1666607 1519717 1660622 1766933 1460840 1407610 1569280 1597769 1739042 1529508 1685704
17040 1685704 1723393 1892210 1912855 1847205 2078656 2060579 2089956 1714741 1841240 1953128
17030 1953128 1677304 1681371 1450723 1381788 1375320 1433671 1345779 1137506 1128529 1230794 1332957
17019 1332957 1229910 1417426 1156137 1159505 1158881 1131067 1262986 1284538 983212 1146818 1115032
17008 1115032 1045424 994216 917908 987872 1018575 948418 1034164 1202582 1100642 1178937 1294599
16997 1294599 1317313 1134345 1258188 1256307 1373248 1108855 1062763 1066108 1109322 1245133 1119525
16986 1119525 1092571 1074622 1069367 983838 1058565 1104048 1111901 1208739 1272498 1258113 1314096 1226871
$$ packed form
17061A176337m4414q550o1111K49874o0192J39543m0416O5713R3057K6821J29945
17050A666607j46890J40905J06311l06093n3230J61670K8489J41273k09534J56196
17040A685704L7689J68817K0645o5650K31451j8077K9377l75215J26499J11888
17030A953128k75824M067k30648o8935o468N8351q7892k08273q977J02265J02163
17019A332957j03047J87516k61289L368o24k7814J31919K1552l01326J63606l1786
17008A115032o9608n1208p6308O9964L0703p0157Q5746J68418j01940P8295J15662
16997A294599K2714j82968J23843j881J16941k64393m6092L345M3214J35811j25608
16986A119525k6954j7949n255q5529P4727M5483P853R6838O3759j4385N5983q7225
$$ plain form
16974 1226871 1296223 1443973 1518964 1586809 1694283 1429446 1717815 1769588 1983349 2088946
16964 2088946 1948122 2122784 2485774 2466502 2556241 2727687 2670392 2766224 2772905 2774436 2821829
16953 2821829 2733328 2933429 3005316 2818316 2656628 2490915 2453869 2700737 2304631 2186767
16943 2186767 2094809 1833613 1825327 1808588 1652760 1746597 1547636 1285352 1489766 1066547
16933 1066547 1376530 1243735 1160201 1369321 1220400 1340963 1301146 1213000 1170267 1128292
16923 1128292 1138206 1188085 1134317 1066670 1139943 1128158 987798 996898 865654 910526 949390
16912 949390 1079730 915415 1007557 740447 1005721 814319 761246 839363 947175 1000976
16902 1000976 839805 843502 865694 652210 976701 1079327 925203 946475 722194 633723
$$ packed form
16974A226871O9352J47750P4991O7845J07474k64837K88369N1773K13761J05597
16964B088946j40824J74662L62990j9272Q9739J71446n7295R5832O681J531M7393
16953B821829q8501K00101P1887j87000j61688j65713l7046K46868l96106j17864
16943B186767r1958k61196q286j6739j55828R3837j98961k62284K04414m23219
16933A066547L09983j32795q3534K09120j48921J20563l9817q8146m2733m1975
16923A128292R914M9879n3768o7647P3273j1785j40360R100j31244M4872L8864
16912I49390J30340j64315R2142k67110K65274j91402n3073P8117J07812N3801
16902A000976j61171L697K2192k13484L24491J02626j54124K1272k24281q8471
$$ plain form
16892 633723 756607 897149 756225 988213 875545 747717 758295 1108330 754938 649912
16882 649912 705274 814112 742850 955618 883762 937258 877334 931438 937095 857762 877466
16871 877466 917412 855228 780734 1257766 619450 834136 1011695 930223 1009534 883657
16861 883657 975464 925175 957572 828536 986028 1025958 1039439 914296 1029244 724076
16851 724076 1001484 908198 684496 904450 923051 1068909 914807 974122 722030 677725
16841 677725 1054691 725980 1048397 756422 1109163 810032 1012314 888421 807554 1057018
16831 1057018 1090029 960420 998551 884004 1142332 1016414 1089113 952412 1212036 1090412
16821 1090412 1306145 1132448 1264455 1511744 1357475 1323623 1559929 1747869 1660095 1709312
$$ packed form
16892F33723J22884J40542j40924K31988j12668j27828J0578L50035l53392j05026
16882F49912N5362J08838p1262K12768p1856N3496n9924N4104N657p9333J9704
16871H77466L9946o2184p4494M77032F19450K14686J77559q1472P9311j25877
16861H83657R1807n0289L2397j29036J57492L9930J3481j25143J14948l05168
16851G24076K77408r3286k23702K19954J8601J45858j54102N9315k52092m4305
16841F77725L76966l28711L22417k91975L52741k99131K02282j23893q0867K49464
16831A057018L3011j29609L8131j14547K58328j25918P2699j36701K59624j21624
16821A090412K15733j73697J32007K47289j54269l3852K36306J87940q7774M9217
$$ plain form
16811 1709312 1615829 1382863 1706262 1571087 1617862 1577241 1493937 1471495 1586310 1387735
16801 1387735 1456023 1736028 1596943 1414814 1656646 1363529 1454662 1384170 1128876 1120641
16791 1120641 1213328 1254737 796034 1000323 959559 996778 810570 770806 865378 488514
16781 488514 819438 594395 687839 880500 767998 775994 632709 763548 748163 618792
16771 618792 672832 749910 699676 525341 695181 654774 718355 610566 673998 609142 639835
16760 639835 596872 790718 694723 621243 782058 621439 916703 927516 794719 817319
16750 817319 774539 638773 1006053 643755 1033387 748522 825316 508674 554926 739516
16740 739516 898178 889577 661617 790773 719491 1169634 991146 559047 852009 944448
$$ packed form
16811A709312r3483k32966L23399j35175M6775m0621q3304k2442J14815j98575
16801A387735O8288K80005j39085j82129K41832k93117R1133p0492k55294q235
16791A120641R2687M1409m58703K04289m0764L7219j86208l9764R4572l76864
16781D88514L30924k25043R3444J92661j12502P996j43285J30839j5385j29371
16771F18792N4040P7078n0234j74335J69840m0407O3581j07789O3432o4856L0693
16760F39835m2963J93846r5995p3480J60815j60619K95264J0813j32797K2600
16750H17319m2780j35766L67280l62298L89632k84865P6794l16642M6252J84590
16740G39516J58662q601k27960J29156p1282M50143j78488m32099K92962R2439
$$ plain form
16730 944448 731597 901028 632750 879882 873359 761598 858271 819622 978632 956070
16720 956070 1220073 1297304 1136465 1004044 1153429 1111615 986518 901973 992682 1117471
16710 1117471 1026967 1127005 1286647 1183717 1318523 1406845 1536221 1830921 1700334 1785904
16700 1785904 1846979 1781099 1844615 1528976 1716290 1864096 1812276 1712162 1749259 1581975
16690 1581975 1717653 1883388 1768986 1936656 1878418 1932521 1759695 1635697 1760479 1498225
16680 1498225 1552634 1496912 1220951 1445378 1286294 1332795 1287913 1244385 1341009 1225737
16670 1225737 1025470 1569955 1497050 1802353 1783846 1825068 1980746 1775226 1997466 1733855
16660 1733855 1708244 1790833 1583996 1852943 1783326 1766943 2045189 1776879 1734291 1974273
$$ packed form
16730I44448k12851J69431k68278K47132o523j11761R6673l8649J59010k2562
16720I56070K64003P7231j60839j32421J49385m1814j25097q4545R0709J24789
16710A117471r0504J00038J59642j02930J34806Q8322J29376K94700j30587Q5570
16700A785904O1075o5880O3516l15639J87314J47806n1820j00114L7097j67284
16690A581975J35678J65735j14402J67670n8238N4103j72826j23998J24782k62254
16680A498225N4409n5722k75961K24427j59084M6501m4882m3528R6624j15272
16670A225737k00267N44485p2905L05303j8507M1222J55678k05520K22240k63611
16660A733855k5611Q2589k06837K68947o9617j6383K78246k68310m2588K39982
$$ plain form
16650 1974273 1721900 1628213 1629044 1267823 1243657 1147132 761642 593313 743668 724106 661063
16639 661063 849195 712230 882193 820957 657769 439194 751168 309913 616291 728725
16629 728725 635589 568841 587458 917712 648054 398703 712728 854210 781647 759399
16619 759399 787301 624313 820998 820340 777688 647723 786631 927660 711133 939100
16609 939100 943292 872326 963134 887115 730385 819104 1034795 957992 870718 847250 1067142
16598 1067142 764226 848064 962960 781112 825426 750842 962083 986973 792024 1028387
16588 1028387 1117173 865404 1060373 891939 843047 678017 896760 683958 701110 590214
16578 590214 581929 633349 604267 656588 502065 839862 563839 846642 659185 759573
$$ packed form
16650A974273k52373r3687Q31l61221k4166r6525l85490j68329J50355j9562o3043
16639F61063J88132j36965J69963o1236j63188k18575L11974C09913L06378J12434
16629G28725r3136o6748J8617L30254k69658k49351L14025J41482p2563k2248
16619G59399K7902j62988J96685o58m2652j29965J38908J41029k16527K27967
16609I39100M192p0966R0808p6019j56730Q8719K15691p6803q7274k3468K19892
16598A067142l02916Q3838J14896j81848M4314p4584K11241K4890j94949K36363
16588A028387Q8786k51769J94969j68434m8892j65030K18743k12802J7152j10896
16578E90214q285N1420k9082N2321j54523L37797k76023K82803j87457J00388
$$ plain form
16568 759573 625350 461065 545407 772407 527086 590794 688350 580721 881068 683361
16558 683361 515277 521166 652624 468317 378192 387186 350998 357032 392944 532998 559960
16547 559960 410325 266989 533203 428192 300174 350156 433228 344877 466605 422735
16537 422735 298413 248021 173357 190081 91995 157682 161421 66151 102393 -111913 357729
16525 226554 235078 298280 378255 75688 211705 301833 458583 372113 569105 416077 573200
16514 573200 268160 620895 564690 515503 480478 603512 632328 320575 617578 631279
16504 631279 568648 591020 544803 364562 604241 154999 230081 261523 363187 409285 319763
16493 319763 350530 536008 911891 783325 1133709 1020881 1257346 1151005 1130352 1139284
$$ packed form
16568G59573j34223j64285Q4342K27000k45321O3708R7556j07629L00347j97707
16558F83361j68084N889J31458j84307r0125Q994l6188O034L5912J40054K6962
16547E59960j49635j43336K66214j05011j28018M9982Q3072q8351J21728m3870
16537D22735j24322n0392p4664J6724I1995O5687L739F6151L6242a11913C57729
16525B26554Q524O3202P9975G5688J36017R0128J56750q6470J96992j53028J57123
16514E73200B68160L52735n6205m9187l5025J23034K8816l11753K97003J3701
16504F31279o2631K2372m6217j80241K39679A54999P5082L1442J01664M6098q9522
16493C19763L0767J85478L75883j28566L50384j12828K36465j06341k0653Q932
$$ plain form
16483 1139284 1186701 790150 810203 904950 972587 960307 884318 1001329 993433 1292693 1145169
16472 1145169 1193419 968229 1405305 1445965 1380349 1095444 1003089 1251855 904258 946896
16462 946896 687817 801524 754135 591861 782617 801310 934439 781322 951135 919741
16452 919741 1076610 1301992 1448272 1252694 1510041 1611933 1673554 1700596 1801679 1771647
16442 1771647 2113875 2135755 2759228 2807576 3126211 3315817 3423900 4030778 4398383 4695640
16432 4695640 5415107 6128873 6889871 7786248 8722300 9454755 10540196 11659104 12639693
16423 12639693 13633653 14957201 16272208 17785836 19147908 20647625 22853056 24930956
16415 24930956 27356435 30027549 32676115 35475643 38377711 41659629 44783321 48156328
$$ packed form
16483A139284M7417l96551K0053R4747O7637j2280p5989J17011p896K99260j47524
16472A145169M8250k25190M37076M0660o5616k84905r2355K48766l47597M2638
16462I46896k59079J13707m7389j62274J90756J8693J33129j53117J69813l1394
16452I19741J56869K25382J46280j95578K57347J01892O1621K7042J01083l0032
16442A771647L42228K1880O23473M8348L18635J89606J08083O06878L67605K97257
16432D695640P19467P13766P60998Q96377R36052P32455J085441J118908R80589
16423A2639693R93960J323548J315007J513628J362072J499717K205431K077900
16415B4930956K425479K671114K648566K799528K902068L281918L123692L373007
$$ plain form
16407 48156328 51568842 54421048 56196814 57019142 57156287 56815255 56538228 55920078 54979221
16398 54979221 53345929 51590129 49757303 47713361 45870588 45079526 46623539 51247556
16390 51247556 60164611 72464034 82646960 85538169 81742509 74103082 64154856 52308430
16382 52308430 40791661 30318736 18623495 2869134 -19582636 -40277371 -49430354
16375 -49430354 -43840366 -30117524 -15669324 -4793151 2289564 6315432 7805787 8103195
16367 8103195 7915925 6748973 6009694 5113512 4197465 3424530 2992062 2602179 2538688
16358 2538688 2720394 2705904 2659510 2852540 2941326 2873774 3097864 2807241 2533941 2622551
16348 2622551 2429848 2159026 2001556 1742153 1689160 1467130 1205263 951479 1123908 889227
$$ packed form
16407D8156328L412514K852206J775766Q22328J37145l41032k77027o18150r40857
16398E4979221j633292j755800j832826k043942j842773p91062J544013M624017
16390E1247556Q917055J2299423J0182926K891209l795660p639427r948226j1846426
16382E2308430j1516769j0472925j1695241B869134a9582636k0694735r152983
16375d9430354N589988J3722842J4448200d793151B289564M025868J490355K97408
16367H103195j87270j166952p39279q96182r16047p72935m32468l89883o3491
16358B538688J81706j4490m6394J93030Q8786o7552K24090k90623k73300Q8610
16348B622551j92703k70822j57470k59403n2993k22030k61867k53784J72429k34681
$$ plain form
16338 889227 897574 755005 740251 958922 1046587 891981 711688 1036745 1352951 1101407
16328 1101407 1146126 1277637 1752167 1411197 1380114 1339471 1227598 1418471 1493447 1457337
16318 1457337 1496121 1331756 1197825 1106728 1268046 1126890 1108342 1040433 996816 1080367
16308 1080367 1070539 887432 805896 664917 539639 416295 375617 620677 477260 373880
16298 373880 686784 589895 610526 573953 453883 829295 790638 1007865 772425 839594
16288 839594 1020434 982944 827416 1123336 766908 1210648 1041486 1186686 1157344 1254954
16278 1254954 1229893 1343370 1436768 1676807 1481432 1656214 1558469 1707443 1476888 1442246
16268 1442246 1612499 1507459 1331085 1274824 942754 915349 990778 937429 769841 517443
$$ packed form
16338H89227Q347j42569j4754K18671Q7665j54606j80293L25057L16206k51544
16328A101407M4719J31511M74530l40970l1083m0643j11873J90873P4976l6110
16318A457337L8784j64365j33931r1097J61318j41156j8548o7909m3617Q3551
16308A080367r828j83107q1536j40979j25278j23344m0678K45060j43417j03380
16298C73880L12904r6889K0631l6573j20070L75412l8657K17227k35440O7169
16288H39594J80840l7490j55528K95920l56428M43740j69162J45200k9342R7610
16278A254954k5061J13477R3398K40039j95375J74782r7745J48974k30555l4642
16268A442246J70253j05040j76374n6261l32070k7405P5429n3349j67588k52398
$$ plain form
16258 517443 1002602 877129 1121971 894796 953586 998823 799422 723900 778342 999234
16248 999234 905500 903011 1212263 988533 1038889 949542 1207928 1114500 1145948 1228273 1026352
16237 1026352 1159062 1018722 1240379 1225180 995518 902095 887726 974744 849828 1161014
16227 1161014 761619 990192 775994 963068 924855 739298 424011 661244 594706 829925
16217 829925 746859 842375 657411 926113 909409 1084699 602988 645408 866791 712843
16207 712843 801836 825630 1063083 649427 651088 831609 980257 975820 1120102 976291 1035283
16196 1035283 979226 943443 1163470 667883 965043 1070042 985814 942968 806044 885534
16186 885534 1098363 1103316 1105923 1070649 950724 1089725 948502 1051661 971846 1026733 1288339
$$ packed form
16258E17443M85159j25473K44842k27175N8790M5237j99401p5522N4442K20892
16248I99234r3734k489L09252k23730N0356q9347K58386r3428L1448Q2325k01921
16237A026352J32710j40340K21657j5199k29662r3423j4369Q7018j24916L11186
16227A161014l99395K28573k14198J87074l8213j85557l15287K37233o6538K35219
16217H29925q3066R5516j84964K68702j6704J75290m81711M2420K21383j53948
16207G12843Q8993K3794K37453m13656J661J80521J48648m437J44282j43811N8992
16196A035283n6057l5783K20027m95587K97160J04999q4228m2846j36924P9490
16186H85534K12829M953K607l5274j19925J39001j41223J03159p9815N4887K61606
$$ plain form
16175 1288339 982351 1028085 919461 946924 1105137 825518 1121699 1000303 961312 924581
16165 924581 910883 663530 975375 963962 686188 1071546 867802 398920 1054848 821773
16155 821773 1034799 840136 921708 890970 906697 1031960 791899 683012 875060 518669
16145 518669 1056213 1047606 867354 1073666 1246886 1132686 1302406 1125011 913011 1256384
16135 1256384 1024640 1126919 957040 831608 851985 879806 1142619 1006971 797609 1105442
16125 1105442 996021 978096 795874 1042747 1117976 1034903 846278 960505 808635 765601
16115 765601 986386 1192559 764490 1015179 939397 944210 1166871 938923 1018586 984031
16105 984031 1058724 1055788 1226065 920561 1021714 1098149 826025 1008966 1082521 1161585 902334
$$ packed form
16175A288339l05988M5734j08624K7463J58213k79619K96181j21396l8991l6731
16165I24581j3698k47353L11845j1413k77774L85358k03744C98920O55928k33075
16155H21773K13026j94663Q1572l0738J5727J25263k40061j08887J92048l56391
16145E18669N37544q607j80252K06312J73220j14200J69720j77395k12000L43373
16135A256384k31744J02279j69879j25432K0377K7821K62813j35648k09362L07833
16125A105442j09421j7925j82222K46873P5229q3073j88625J14227j51870m3034
16115G65601K20785K06173m28069K50689p5782M813K22661k27948P9663l4555
16105I84031P4693k936J70277l05504J01153P6435k72124J82941P3555P9064k59251
$$ plain form
16094 902334 1184379 969675 1315118 1051138 1165297 911623 1169650 871766 1112134 1086778
16084 1086778 1126687 1293252 1225682 1249722 1354515 1284532 1244802 1361772 1100418 1271142
16074 1271142 1277403 1431913 1322038 1324169 1453626 1214670 1547218 1739754 1283781 1578395
16064 1578395 1648246 1549937 1559048 1570636 1597858 1278034 1506354 1445430 1384337 1491581 1556414
16053 1556414 1651297 1568705 1825561 1418968 1756727 1687951 1781269 1634694 1644114 1675587 1971674
16042 1971674 1953753 1570928 1794173 1702967 1551571 1809038 1781457 1727453 1671634 1922086
16032 1922086 1731651 1717937 2061086 1830998 1945582 1941596 1999162 1768626 1943344 1871354
16022 1871354 1902682 1983178 1946925 2081770 2045796 2354285 2350488 2160942 2202648 2376529 2188361
$$ packed form
16094I02334K82045k14704L45443k63980J14159k53674K58027k97884K40368k5356
16084A086778L9909J66565o7570K4040J04793o9983l9730J16970k61354J70724
16074A271142O261J54510j09875K131J29457k38956L32548J92536m55973K94614
16064A578395O9851r8309R111J1588K7222l19824K28320o0924o1093J07244O4833
16053A556414R4883q2592K56856m06593L37759o8776R3318j46575R420L1473K96087
16042A971674j7921l82825K23245r1206j51396K57467k7581n4004n5819K50452
16032A922086j90435j3714L43149k30088J14584l986N7566k30536J74718p1990
16022A871354L1328Q0496l6253J34845l5974L08489l797j89546M1706J73881j88168
$$ plain form
16011 2188361 2286196 2472371 2441192 2476417 2540459 2156115 2262201 2417945 2506166 2405375
16001 2405375 2344019 2157017 2172430 2116061 2206327 2482762 2239440 1969451 2263148 2333460
15991 2333460 1967681 1823977 2157797 2218446 2264361 2201358 2353013 2081772 2305549 2472424
15981 2472424 2356994 2080705 2316159 2218053 2406799 2537883 2350545 2298655 2509914 2431822
15971 2431822 2565161 2530603 2306269 2432306 2151297 2322719 2421390 2092801 2211820 1963447
15961 1963447 2304126 2092066 2291438 1959866 2368033 2097691 2494035 2276785 2226910 2296758
15951 2296758 2237996 2205073 2387236 2129099 2136242 2275959 2194828 2427924 2370681 2253913
15941 2253913 2290698 2200166 2351527 2502403 2247283 2386926 2577590 2459405 2609699 2502886
$$ packed form
16011B188361R7835J86175l1179L5225O4042l84344J06086J55744Q8221j00791
16001B405375o1356j87002J5413n6369R0266K76435k43322k69989K93697P0312
15991B333460l65779j43704L33820O0649M5915o3003J51655k71241K23777J66875
15981B472424j15430k76289K35454r8106J88746J31084j87338n1890K11259p8092
15971B431822J33339l4558k24334J26037k81009J71422R8671l28589J19019k48373
15961A963447L40679k12060J99372l31572M08167k70342L96344k17250m9875O9848
15951B296758n8762l2923J82163k58137P143J39717q1131K33096n7243j16768
15941B253913L6785r0532J51361J50876k55120J39643J90664j18185J50294j06813
$$ plain form
15931 2502886 2602957 2402144 2646660 3007924 2810608 2719420 3166074 3178520 3154893 3181679
15921 3181679 3470213 3561353 3506407 3643107 3349950 3797030 4044255 4251882 4292849 4507214
15911 4507214 4944097 5512436 6289251 7415536 8561609 10547826 13701400 17934212 23364449
15902 23364449 30320981 37494426 44755208 50806184 55680958 58863063 60388908 59797956
15894 59797956 56815605 52230084 45482227 37428640 29992308 23098245 17673288 13485492
15886 13485492 10703065 8881705 7092394 6160112 5203488 4655839 4202724 3865912 3687683
15877 3687683 3372346 3303490 3002326 3056590 2937744 2906932 3000929 2736239 2734305 2799475 2813880
15866 2813880 2378261 2517251 2657632 2832238 2248350 2584018 2471524 2563591 2441271 2263112
$$ packed form
15931B502886J00071k00813K44516L61264j97316r1188M46654J2446k3627K6786
15921C181679K88534R1140n4946J36700k93157M47080K47225K07627M0967K14365
15911D507214M36883N68339P76815J126285J146073J986217L153574M232812N430237
15902B3364449O956532P173445P260782O050976M874774L182105J525845n90952
15894E9797956k982351m585521o747857q053587p436332o894063n424957m187796
15886A3485492k782427j821360j789311r32282r56624n47649m53115l36812j78229
15877C687683l15337o8856l01164N4264j18846l0812R3997k64690j934O5170J4405
15866B813880m35619J38990J40381J74606n83888L35668j12494R2067j22320j78159
$$ plain form
15856 2263112 2080635 2121151 2096587 2364949 2135177 2459272 2265252 2292707 2027678 2162296
15846 2162296 2225516 2273757 2130275 2151810 2116104 2412892 2174930 2363368 2327402 2425871
15836 2425871 2647636 2616553 2338612 2591350 2497288 2599066 2645172 2545694 2767969 2506329
15826 2506329 2396762 2522068 2470474 2186905 2353441 2292922 2408012 2453582 2360187 2364947
15816 2364947 2275272 2491768 2496632 2430063 2503094 2523070 2636186 2852258 2566341 2779123
15806 2779123 2746217 2634324 2695468 2638428 2755411 2647902 2777311 2949879 3175459 3226927
15796 3226927 3387750 3540556 3449915 3636485 3971017 3819244 3807230 4120708 3856678 4134509
15786 4134509 3961816 3981958 4172166 4473566 4532436 4895314 5181966 4961409 5331261 5393529
$$ packed form
15856B263112j82477M0516k4564K68362k29772L24095j94020K7455k65029J34618
15846B162296O3220M8241j43482K1535l5706K96788k37962J88438l5966R8469
15836B425871K21765l1083k77941K52738r4062J01778M6106r9478K22275k61640
15826B506329j09567J25306n1594k83569J66536o0519J15090M5570r3395M760
15816B364947q9675K16496M864o6569P3031J9976J13116K16072k85917K12782
15806B779123l2906j11893O1144n7040J16983j07509J29409J72568K25580N1468
15796C226927J60823J52806r0641J86570L34532j51773j2014L13478k64030K77831
15786D134509j72693K0142J90208L01400N8870L62878K86652k20557L69852O2268
$$ plain form
15776 5393529 5576133 5518905 5425721 5198372 5271613 5372007 5145366 5269063 5115957 5107527
15766 5107527 5109877 5551124 5547540 5627827 5893931 5840685 5570873 5626580 5509631 5589570 5652963
15755 5652963 5271357 5309327 4987706 5363479 5040853 5213608 5037990 5359703 5458442 5522843
15745 5522843 5522374 5735069 6103233 6126037 6665133 6678186 6873320 7227344 7337995 7431817
15735 7431817 7384683 7383900 7285627 7345310 7409448 7618294 7711071 7802844 8008731 7808679 8080297
15724 8080297 7746466 7866063 7745741 7291125 7058923 6938766 6880028 6712625 6843396 6926341
15714 6926341 6752333 6941916 6668452 6446422 6447012 6350484 6191916 5828722 6213384 6462890
15704 6462890 6746903 7147388 7233411 7402130 7816396 7831322 8127044 8301730 8283936 8245832
$$ packed form
15776E393529J82604n7228r3184k27349P3241J00394k26641J23697j53106q430
15766E107527K350M41247l584Q0287K66104n3246k69812N5707j16949P9939O3393
15755E652963l81606L7970l21621L75773l22626J72755j75618L21713R8739O4401
15745E522843m69K12695L68164K2804N39096J3053J95134L54024J10651R3822
15735G431817m7134p83r8273N9683O4138K08846R2777R1773K05887k00052K71618
15724H080297l33831J19597j20322m54616k32202j20157n8738j67403J30771Q2945
15714F926341j74008J89583k73464k22030N90r6528j58568l63194L84662K49506
15704F462890K84013M00485Q6023J68719M14266J4926K95722J74686j7794l8104
$$ plain form
15694 8245832 8133508 8331429 8180118 7976921 7948982 8075861 7916532 7725414 7830954 7882427
15684 7882427 7677948 7822795 7791491 7830065 7492043 7365643 7154230 7162957 7057076 6838757
15674 6838757 6776068 6570947 6498415 6168708 6449307 6387945 6541892 6465835 6478327 6979155
15664 6979155 7090516 7659996 7849641 8191743 8689372 9052341 9617136 10547040 10696354
15655 10696354 11333511 11862024 12905986 13606209 14392697 15099495 15623227 16403927 16701676
15646 16701676 17621803 18385068 18510977 19195185 19910356 20838466 21760410 22389618 23556018
15637 23556018 24429822 24903440 25476190 25614716 25593674 25279934 25167337 24891119 24453806
15628 24453806 24441045 24183946 23806630 23919914 23610455 23453671 23060525 22491504 21752141
$$ packed form
15694H245832j12324J97921j51311k03197k7939J26879j59329j91118J05540N1473
15684G882427k04479J44847l1304L8574l38022j26400k11413Q727j05881k18319
15674F838757o2689k05121p2532l29707K80599o1362J53947p6057J2492N00828
15664F979155J11361N69480J89645L42102M97629L62969N64795R29904J49314
15655A0696354O37157N28513J043962P00223P86488P06798N23732P80700K97749
15646A6701676R20127P63265J25909O84208P15171R28110R21944O29208J166400
15637B3556018Q73804M73618N72750J38526k1042l13740j12597k76218m37313
15628B4453806j2761k57099l77316J13284l09459j56784l93146n69021p39363
$$ plain form
15619 21752141 20903964 19608523 18359244 17573896 16362158 15468302 14818555 14139735 13819025
15610 13819025 13309231 12811603 12417833 12158936 11741822 11471898 11048002 10726584 10553120
15601 10553120 10172595 10066305 10062225 9777544 9809234 9852445 9697174 10144188 10548206 12025142
15591 12025142 14567629 21034605 31168230 41562283 48316500 52874854 56183961 58174798
15583 58174798 58967162 57927485 55537932 50417138 39658156 26902196 18576062 14092509
15575 14092509 11235210 9973762 8893046 8336300 7942331 7888951 7720865 8179076 8181105
15566 8181105 8078346 8611691 8349657 8489476 8719750 8577604 9056183 9591880 10336112
15557 10336112 12301307 16776554 26895690 41018569 53117145 61518315 67223574 70717672
$$ packed form
15619B1752141q48177j295441j249279p85348j211738q93856o49747o78820l20710
15610A3819025n09794m97628l93770k58897m17114k69924m23896l21418j73464
15601A0553120l80525j06290m080k84681L1690M3211j55271M47014M04018J476936
15591A2025142K542487O466976J0133625J0394053O754217M558354L309107J990837
15583E8174798P92364j039677k389553n120794j0758982j2755960q326134m483553
15575A4092509k857299j261448j080716n56746l93969n3380j68086M58211K029
15566H181105j02759N33345k62034J39819K30274j42146M78579N35697P44232
15557A0336112J965195M475247J0119136J4122879J2098576Q401170N705259L494098
$$ plain form
15549 70717672 73019577 73452959 71486618 67892220 59058837 43667849 27597755 18413702
15541 18413702 13507883 10616851 8992517 7518565 7164142 6404832 6169713 6261689 6009939
15532 6009939 6076164 5823153 5629363 5767117 5633981 5415133 5441363 5517309 5136097 4799842
15522 4799842 4759707 4716012 4733877 4680182 4672508 4831566 4800100 4753740 4827122 4924639 4985608
15511 4985608 5062217 5208585 5394017 5398335 5549707 5677321 5562234 5488618 5523886 5489014
15501 5489014 5120948 5191273 5095026 5040736 4918611 5337255 4972770 5085835 4997473 5180877
15491 5180877 5370334 5242816 5376610 5274882 5423023 5391738 5593125 5767962 5943797 6053053
15481 6053053 6175036 6330377 6433638 6269826 6523877 6406087 6429725 6901228 6799804 7158486
$$ packed form
15549G0717672K301905M33382j966341l594398q833383j5390988j6070094r184053
15541A8413702m905819k891032j624334j473952l54423p59310k35119R1976k51750
15532F009939O6225k53011j93790J37754j33136k18848K6230P5946l81212l36255
15522D799842m0135m3695J7865n3695p674J59058l1466m6360P3382R7517O0969
15511D985608P6609J46368J85432M318J51372J27614j15087p3616L5268l4872
15501E489014l68066P0325r6247n4290j22125M18644l64485J13065q8362J83404
15491E180877J89457j27518J33794j01728J48141l1285K01387J74837J75835J09256
15481F053053J21983J55341J03261j63812K54051j17790K3638M71503j01424L58682
$$ plain form
15471 7158486 7804791 8062503 8869365 9546807 9900228 10293138 10301644 10341717 10316872 10438832
15461 10438832 9979657 9625668 9298070 9297543 9363940 9501551 9922098 10574952 10746939 11277440
15451 11277440 11483007 11960931 11928326 11732704 11751503 11352206 11034282 10561336 10537466 10204028
15441 10204028 10422154 10835746 11131410 11075468 11377129 11149325 11427034 11315986 10957606
15432 10957606 10759930 10259834 9866345 9711943 9362686 8997646 8646206 8519385 8093072
15423 8093072 7952022 7827676 7426663 7100290 7092925 6691831 6489954 6296977 6222353 5989685
15413 5989685 6121790 6096534 5740416 5886483 5806602 5699105 6035037 5868932 6158813 6006492
15403 6006492 5949041 6162582 6376995 6495155 6597183 6773505 6842767 6922809 6831564 6818177
$$ packed form
15471G158486O46305K57712Q06862O77442L53421L92910Q506M0073k4845J21960
15461A0438832m59175l53989l27598n27O6397J37611M20547O52854J71987N30501
15451A1277440K05567M77924l2605j95622J8799l99297l17924m72946k3870l33438
15441A0204028K18126M13592K95664n5942L01661k27804K77709j11048l58380
15432A0957606j97676n00096l93489j54402l49257l65040l51440j26821m26313
15423H093072j41050j24346m01013l26373p365m01094k01877j92977p4624k32668
15413E989685J32105k5256l56118J46067p9881j07497L35932j66105K89881j52321
15403F006492n7451K13541K14413J18160J02028J76322O9262Q0042r1245j3387
$$ plain form
15393 6818177 7073866 7059488 6845390 6655653 6601531 6510513 6381866 6683482 6752590 6580489
15383 6580489 6823762 6509010 6702455 6775066 6681927 6559295 6757905 6598271 6617672 6518676
15373 6518676 6362706 6455230 6673460 6539405 6691250 6667794 6756855 7044597 7279650 7209790
15363 7209790 7414955 7360100 7747414 7798343 7708862 7738651 7729273 7981475 8131439 8122099 8541645
15352 8541645 8687178 9055625 10073893 11352871 14415983 19174592 25105502 30131663
15344 30131663 33930896 36093400 38060522 39269984 39167924 38749953 36755865 32776705
15336 32776705 27009659 21434802 18271515 16778911 15656516 15026486 14637310 14471437
15328 14471437 14055591 13773788 13147072 12700044 12376285 12638871 12562114 12631752 12712148 13201512
$$ packed form
15393F818177K55689j4378k14098j89737n4122r1018j28647L01616O9108j72101
15383F580489K43273l14752J93445P2611r3139j22632J98610j59634J9401r8996
15373F518676j55970R2524K18230j34055J51845k3456Q9061K87742K35053o9860
15363G209790K05165n4855L87314N0929q9481K9789r378K52202J49964r340M19546
15352H541645J45533L68447J018268J278978L063112M758609N930910N026161
15344C0131663L799233K162504J967122J209462j02060m17971j994088l979160
15336C2776705n767046n574857l163287j492604j122395o30030l89176j65873
15328A4471437m15846k81803o26716m47028l23759K62586p6757O9638Q0396M89364
$$ plain form
15318 13201512 13720548 14844317 16407091 19925887 26419383 35479827 45423168 53788189
15310 53788189 59911307 64064286 66572366 67251885 66486907 63465794 57089286 47007631
15302 47007631 36011910 26252735 19867212 16102617 13956414 12810230 11932885 11910709
15294 11910709 11649474 11637847 11623064 11514004 11511483 11783487 11819969 11827423 11836831 11726383 11848744
15283 11848744 11914887 12407303 13699759 16363220 21363794 26763184 30983552 33885939
15275 33885939 35824527 37068841 37768214 37418132 36559613 34111575 29400003 23327856
15267 23327856 18172356 15071661 13313537 12476125 11492885 11136517 10668181 9949730 9702829
15258 9702829 9524855 9429916 9556785 9405299 8992711 9527204 9679016 9682678 10308055 10513193
$$ packed form
15318A3201512N19036J123769J562774L518796O493496R060444R943341Q365021
15310E3788189O123118M152979K508080O79519p64978l021113o376508j0081655
15302D7007631j0995721r759175o385523l764595k146203j146184q77345k2176
15294A1910709k61235j1627j4783j09060k521K72004L6482P454R408j10448J22361
15283A1848744O6143M92416J292456K663461N000574N399390M220368K902387
15275C3885939J938588J244314O99373l50082q58519k448038m711572o072147
15267B3327856n155500l100695j758124q37412r83240l56368m68336p18451k46901
15258I702829j77974r4939J26869j51486m12588N34493J51812L662O25377K05138
$$ plain form
15248 10513193 10771723 10516811 10356780 10599835 10336933 10304489 10264570 10310079 10179245 10021085
15238 10021085 10036000 10493402 10661559 11201259 11817589 12186191 12494369 12802920 12872868 12758561
15228 12758561 12572308 12187048 12253324 11575827 11064303 10637332 10471425 10376113 10092073 10106328
15218 10106328 10644512 10781556 10858985 11398642 11404940 11724901 11459383 11567012 11302264 11169413
15208 11169413 10538312 9809161 9410484 8941010 7998925 7704651 7306263 7275723 6803095
15199 6803095 6729635 6492505 6291467 6373287 6453234 6380193 6476609 6815855 7018166 7181505
15189 7181505 7082200 7538446 7733240 7563775 7828018 8063922 8045060 8044263 8058683 8087498 8328204
15178 8328204 8465380 8598178 8619818 8744372 8931590 8873173 8834174 9051912 9025700 8713022
$$ packed form
15248A0513193K58530k54912j60031K43055k62902l2444l9919M5509j30834j58160
15238A0021085J4915M57402J68157N39700O16330L68602L08178L08551O9948j14307
15228A2758561j86253l85260O6276o77497n11524m26971j65907r5312k84040J4255
15218A0106328N38184J37044P7429N39657O298L19961k65518J07629k64748j32851
15208A1169413o31101p29151l98677m69474r42085k94274l98388l0540m72628
15199F803095p3460k37130k01038Q1820P9947p3041R6416L39246K02311J63339
15189G181505r9305M56246J94794j69465K64243K35904j8862p97J4420K8815K40706
15178H328204J37176J32798K1640J24554J87218n8417l8999K17738k6212l12678
$$ plain form
15168 8713022 8551567 8463839 8307403 8364083 8457936 8376701 8602832 8735064 8668913 9036305
15158 9036305 9038726 9099081 9460034 9211133 9128344 9347177 9215778 9062417 9021613 8970313
15148 8970313 8671464 9069398 8909301 8762791 8702444 8921085 9040970 8958932 9298899 9188399
15138 9188399 9306508 9370540 9317367 9401193 9451334 9540278 9619381 9377111 9291280 9301886 9397614
15127 9397614 9136007 9400595 9399113 9037596 9143096 8754160 8809580 8673625 8663133 8551008
15117 8551008 8364135 8269341 8227015 8218118 7775997 7866162 7940665 7983803 7812436 8172219 7968498
15106 7968498 8101924 7988552 8368072 8392028 8647621 8725604 9214335 9120984 9324691 9973414
15096 9973414 10323665 10584147 11010580 11435630 12285739 13578532 15170936 17853166 20071952
$$ packed form
15168H713022j61455q7728j56436N6680R3853q1235K26131J32232o6151L67392
15158I036305K421O0355L60953k48901q2789K18833j31399j53361m0804n1300
15148H970313k98849L97934j60097j46510o0347K18641J19885q2038L39967j10500
15138I188399J18109O4032n3173Q3826N0141Q8944P9103k42270q5831J0606R5728
15127I397614k61607K64588j482l61517J05500l88936N5420j35955j0492j12125
15117H551008j86873r4794m2326q897m42121R0165P4503M3138j71367L59783k03721
15106G968498J33426j13372L79520K3956K55593P7983M88731r3351K03707O48723
15096I973414L50251K60482M26433M25050Q50109J292793J592404K682230K218786
$$ plain form
15087 20071952 21467569 22774862 23749733 24564512 24620650 24603997 24096570 23221440 21588047
15078 21588047 19827720 19295876 19827513 21690073 23903322 25763037 27237710 28470199
15070 28470199 28749559 29328582 29382172 29138473 28611612 27960537 28633611 31005217 33090016
15061 33090016 35009044 36689915 38444480 40491941 42322883 44413245 45840678 45717753
15053 45717753 43601795 41851082 42168673 43927145 46305308 48435715 49611826 49825481
15045 49825481 49592020 49649187 50402703 50864730 51010226 49861414 47391144 44538712 41776925
15036 41776925 39944410 38273824 36548648 34141386 31956995 30942716 31474040 32836115
15028 32836115 33546233 34229440 34627697 35115369 35427610 35610962 36124769 35836803 35109010
$$ packed form
15087B0071952J395617J307293R74871Q14779N6138j6653n07427q75130j633393
15078B1588047j760327n31844N31637J862560K213249J859715J474673J232489
15070B8470199K79360N79023N3590k43699n26861o51075O73074K371606K084799
15061C3090016J919028J680871J754565K047461J830942K090362J427433j22925
15053D5717753k115958j750713L17591J758472K378163K130407J176111K13655
15045D9825481k33461N7167P53516M62027J45496j148812k470270k852432k761787
15036D1776925j832515j670586j725176k407262k184391j014279N31324J362075
15028C2836115P10118O83207L98257M87672L12241J83352N13807k87966p27793
$$ plain form
15019 35109010 33829079 34639379 37779618 42128671 47007070 51130461 54897183 58383470
15011 58383470 61537568 63859088 65723260 67096699 67571853 67960376 68824089 70175167
15003 70175167 72799397 75782386 78594270 81223191 84410072 87414351 89314286 90491009
14995 90491009 90906360 91078008 92296337 93945914 96759610 100834067 106044216 112525239
14987 112525239 118855539 125724705 130961453 134563427 136746016 136737239 134904348 130115679
14979 130115679 122930183 113668221 102511662 91200779 80627016 71800753 63910243
14972 63910243 57006294 51279975 46862846 43452627 40874970 39126027 37755332 36597706
14964 36597706 35746039 34995029 34642112 34761054 35514913 36288047 39112766 42625802 47583071
$$ packed form
15019C5109010j279931Q10300L140239M349053M878399M123391L766722L486287
15011E8383470L154098K321520J864172J373439M75154L88523Q63713J351078
15003G0175167K624230K982989K811884K628921L186881L004279J899935J176723
14995I0491009M15351J71648J218329J649577K813696M074457N210149O481023
14987A12525239O330300O869166N236748L601974K182589q777j832891m788669
14979A30115679p185496r261962j1156559j1310883j0573763q826263p890510
14972F3910243o903949n726319m417129l410219k577657j748943j370695j157626
14964C6597706q51667p51010l52917J18942P53859P73134K824719L513036M957269
$$ plain form
14955 47583071 55433256 66570150 80917902 98582649 118617066 141485354 166572686
14948 166572686 190768111 215099182 239751697 261478137 274885704 278438802 274425211
14941 274425211 266075212 254380788 238997107 221926175 204627579 183548986 161143935
14934 161143935 142501964 130458254 122879543 117303114 110832083 102623484 93309247 84187304
14926 84187304 77349509 72502921 69629427 67643837 65490512 62702491 59819594 57165383
14918 57165383 54331007 51099624 48140023 43900030 38407080 31189493 25073120 20596864
14910 20596864 18010651 16331997 15062618 14281429 14172060 14373190 14906652 15178290 15486669
14901 15486669 16437514 17896220 18673690 20176902 23029403 26797887 31114355 34445612
$$ packed form
14955D7583071P850185J1136894J4347752J7664747K0034417K2868288K5087332
14948A66572686K4195425K4331071K4652515K1726440J3407567L553098m013591
14941B74425211q349999j1694424j5383681j7070932j7298596k1078593k2405051
14934A61143935j8641971j2043710p578711n576429o471031q208599r314237r121943
14926H4187304o837795m846588k873494j985590k153325k788021k882897k654211
14918E7165383k834376l231383k959601m239993n492950p217587o116373m476256
14910B0596864k586213j678654j269379p81189j09369K01130N33462K71638L08379
14901A5486669R50845J458706P77470J503212K852501L768484M316468L331257
$$ plain form
14893 34445612 37424794 38879020 39647691 39972911 39905557 38644177 36419344 32729924 28100971
14884 28100971 23620026 20750988 19116711 18270204 17814708 17315102 17083716 17292673 17777976
14875 17777976 18525033 19145943 19815508 19837888 20209617 20381812 20927625 21470188 22142809
14866 22142809 22080710 21816353 21754126 22242676 23735854 26326807 30889336 36460417 43046185
14857 43046185 50272352 57695654 64702510 69977319 73076884 74163903 73460196 70500350
14849 70500350 64501614 57209429 49676854 41712114 34041209 27812598 24090500 21787607
14841 21787607 20131509 19194438 18538642 18112846 17576068 16953773 16535198 16286727 16111623
14832 16111623 16104551 15850620 15511240 15756876 16127570 16535476 16951598 17676097 18585697 19393688
$$ packed form
14893C4445612K979182J454226P68671L25220o7354j261380k224833l689420m628953
14884B8100971m480945k869038j634277q46507m55496m99606k31386K08957M85303
14875A7777976P47057O20910O69565K2380L71729J72195N45813N42563O72621
14866B2142809o2099k64357o2227M88550J493178K590953M562529N571081O585768
14857D3046185P226167P423302P006856N274809L099565J087019p03707k959846
14849G0500350n998736p292185p532575p964740p670905o228611l722098k302893
14841B1787607j656098r37071o55796m25796n36778o22295m18575k48471j75104
14832A6111623p072k53931l39380K45636L70694M07906M16122P24499R09600Q07991
$$ plain form
14822 19393688 21536072 25696855 31107832 37391533 42827486 46823756 49209963 50599845
14814 50599845 51192022 50632379 48498291 44461559 38477974 30821356 23866465 18818949
14806 18818949 15991892 14376097 13219334 12356203 11788237 11643616 11241365 11434172 11352371
14797 11352371 11428955 11161402 10878789 10586396 10508923 10246731 10436441 10128725 9879407 9649672
14787 9649672 9650485 9713875 9987533 9650472 9714600 10033549 10372727 10931939 11467532 12418569
14777 12418569 12601130 13022199 13207456 13280459 13245810 13048196 12647775 12248328 11456248 10399568
14767 10399568 10021129 9564750 9342970 9298242 9313462 9237910 9564941 9715189 9629887 9991522
14757 9991522 10081292 10112710 10132572 10494940 10638004 11029297 11209682 11373642 11851979 11744681
$$ packed form
14822A9393688K142384M160783N410977O283701N435953L996270K386207J389882
14814E0599845N92177n59643k134088m036732n983585p656618o954891n047516
14806A8818949k827057j615795j156763q63131n67966j44621m02251J92807q1801
14797A1352371P6584k67553k82613k92393p7473k62192J89710l07716k49318k29735
14787I649672Q13O3390K73658l37061O4128L18949L39178N59212N35593R51037
14777A2418569J82561M21069J85257P3003l4649j97614m00421l99447p92080j056680
14767A0399568l78439m56379k21780m4728J5220p5552L27031J50248q5302L61635
14757I991522Q9770L1418J9862L62368J43064L91293J80385J63960M78337j07298
$$ plain form
14747 11744681 11928733 11646317 11932781 11877840 12383738 12327441 12383113 12968709 13532693 14347525
14737 14347525 15521330 17192021 19361632 22632878 27208902 34261014 46116366 63545971
14729 63545971 85900592 111500628 136759973 160141289 178083801 190057740 196283235
14722 196283235 196690301 190673297 175964770 153576664 126996499 99972779 74237137
14715 74237137 53968936 39854070 31124127 25300761 21415482 18458271 16497301 15134898
14707 15134898 14062911 13178111 12543869 11970874 11612791 10531306 9651302 9387931 9015657
14698 9015657 8510138 8578905 8574672 8662998 8449812 8716635 8888078 8746603 8605089 8874817
14688 8874817 8710040 8810032 8999382 8941607 8577216 8435936 8693422 8832596 9316129 9718810
$$ packed form
14747A1744681J84052k82416K86464n4941N05898n6297N5672N85596N63984Q14832
14737A4347525J173805J670691K169611L271246M576024P052112J1855352J7429605
14729F3545971K2354621K5600036K5259345K3381316J7942512J1973939O225495
14722A96283235M07066o017004j4708527k2388106k6580165k7023720k5735642
14715G4237137k0268201j4114866q729943n823366l885279k957211j960970j362403
14707A5134898j071987q84800o34242n72995l58083j081485q80004k63371l72274
14698I015657n05519O8767m233Q8326k13186K66823J71443j41475j41514K69728
14688H874817j64777R9992J89350n7775l64391j41280K57486J39174M83533M02681
$$ plain form
14678 9718810 10085279 10851458 11818823 12367065 12699287 12788168 12529540 12140492 11805885 11653059
14668 11653059 10871088 10143610 9395284 9188267 8983066 8918933 9027227 9081134 8926600 8983668
14658 8983668 8886206 8765130 8212647 7313237 6671365 6479793 6285399 6253210 6272301 6609672
14648 6609672 6917633 7533430 7732172 7974449 8413734 8515898 8952633 9317240 9799113
14639 9799113 10195759 10490491 11154467 11615204 12405935 12353071 12734450 12479618 12359755 11320785
14629 11320785 10459900 9473451 8497135 7310644 6051980 5319834 4619434 4411613 4453872
14620 4453872 4412562 4430519 4295096 4411502 4372150 4325270 4408384 4036493 4437275 4279531
14610 4279531 4172645 3881741 4080036 3925797 3856018 3660180 3720926 3859264 4449807 5016686
$$ packed form
14678I718810L66469P66179R67365N48242L32222Q8881k58628l89048l34607j52826
14668A1653059p81971p27478p48326k07017k05201o4133J08294N3907j54534N7068
14658H983668r7462j21076n52483q99410o41872j91572j94394l2189J9091L37371
14648F609672L07961O15797J98742K42277M39285J02164M36735L64607M81873
14639I799113L96646K94732O63976M60737P90731n2864L81379k54832j19863j038970
14629A1320785q60885r86449r76316j186491j258664p32146p00400k07821M2259
14620D453872m1310J7957j35423J16406l9352m6880Q3114l71891M00782j57744
14610D279531j06886k90904J98295j54239o9779j95838O0746J38338N90543N66879
$$ plain form
14600 5016686 6057120 6674234 7827644 8458640 9101204 9379338 9216905 9243196 9049644
14591 9049644 8410607 7520822 6511395 5560727 4954316 4580552 4276250 4418431 4701025
14582 4701025 4641051 4550280 4806771 4736648 4679513 4674832 5028130 4896325 4962894 5062512 4922500
14571 4922500 5144745 5294854 5301577 5704171 6718714 7426961 7953210 8434411 9142367 10267187
14561 10267187 12345374 15878905 21430047 27772174 32297291 35147105 37257026 38931794
14553 38931794 39474939 39343972 37983887 35094370 29929406 22897598 17903327 15518478
14545 15518478 16514506 20273413 26522849 32213996 37067858 40458326 42418311 43686773
14537 43686773 43632390 42698140 40214523 35929463 28823121 21704984 16825815 13968811
$$ packed form
14600E016686J040434O17114J153410O30996O42564K78134j62433K6291j93552
14591I049644o39037q89785j009427r50668o06411l73764l04302J42181K82594
14582D701025n9974r0771K56491p0123n7135m681L53298j31805O6569R9618j40012
14571D922500K22245J50109O723M02594J014543P08247N26249M81201P07956J124820
14561A0267187K078187L533531N551142O342127M525117K849814K109921J674768
14553C8931794N43145j30967j360085k889517n164964p031808m994271k384849
14545A5518478R96028L758907O249436N691147M853862L390468J959985J268462
14537D3686773n4383r34250k483617m285060p106342p118137m879169k857004
$$ plain form
14529 13968811 12431192 11402024 11249145 11144084 11157874 11436174 11331603 11552484 12765142
14520 12765142 15282112 19516453 23927490 26946508 29658616 31228035 32467265 33346442
14512 33346442 33260720 32754856 31050626 27079294 22624762 19790340 19338945 20495938 23733329
14503 23733329 28018641 30807274 32913506 34126443 34949972 35407484 35100171 33966532
14495 33966532 32216813 28971164 23763014 19113699 16243463 13993961 12269618 10502542
14487 10502542 9535160 8599725 8095796 6785490 5649838 5005759 4330788 4055796 3923299
14478 3923299 3896943 3516703 3969999 3747263 3887183 3937039 4308644 4980549 5950827 6315116
14468 6315116 6609223 6893944 6909354 7318210 7397084 7375879 7257132 7045156 6910443 7271795
$$ packed form
14529A3968811j537619j029168j52879j05061J3790K78300j04571K20881J212658
14520A2765142K516970M234341M411037L019018K712108J569419J239230Q79177
14512C3346442q5722n05864j704230l971332m454532k834422m51395J156993L237391
14503B3733329M285312K788633K106232J212937Q23529M57512l07313j133639
14495C3966532j749719l245649n208150m649315k870236k249502j724343j767076
14487A0502542r67382r35435n03929j310306j135652o44079o74971k74992j32497
14478C923299k6356l80240M53296k22736J39920M9856L71605O71905R70278L64289
14468F315116K94107K84721J5410M08856P8874k1205j18747k11976j34713L61352
$$ plain form
14458 7271795 7769832 8075507 8750275 8978496 9163188 9318319 8987069 8717983 7843973
14449 7843973 7072895 6348494 5788438 5628404 5633553 5395996 5713915 5851258 6143691 6584986
14439 6584986 6793173 6771296 6931788 7294399 7566101 7812990 8242812 8891302 9533141 11398208
14429 11398208 13939759 17856533 22506021 26968191 30420220 33237308 35185506 36444710
14421 36444710 36727591 35824104 34024871 30226363 25783137 20861522 17193220 14326877
14413 14326877 12679048 10927006 9990379 9138583 8109805 7594498 6906386 6794116 6651019
14404 6651019 6427463 6171850 6458695 6382544 6837806 6882104 7170912 7696554 8553349 9656829
14394 9656829 11768515 15367489 21109617 27742196 35734400 42846906 48761423 53222227
$$ packed form
14458G271795M98037L05675O74768K28221J84692J55131l31250k69086q74010
14449G843973p71078p24401n60056j60034N149k37557L17919J37343K92433M41295
14439F584986K08187k1877J60492L62611K71702K46889M29822O48490O41839J865067
14429A1398208K541551L916774M649488M462170L452029K817088J948198J259204
14421C6444710K82881r03487j799233l798508m443226m921615l668302k866343
14413A4326877j647829j752042r36627q51796j028778n15307o88112j12270j43097
14404F651019k23556k55613K86845p6151M55262M4298K88808N25642Q56795J103480
14394I656829K111686L598974N742128O632579P992204P112506N914517M460804
$$ plain form
14386 53222227 56271179 57287891 57067113 54872832 50189882 43103889 34743965 26806045
14378 26806045 20813088 16298976 12730855 10643319 9321193 8295805 8218733 7515465
14370 7515465 7283829 7060530 7029431 6877904 6556332 6576740 6297695 6378594 6288669 6510028
14360 6510028 6638730 6910843 7646341 8960762 10714518 13078542 15822640 19072492 22092032
14351 22092032 24541136 25940611 27033313 27127401 26565481 25415564 23176794 20395725
14343 20395725 17043168 13890115 11418907 9743740 8623621 8546375 9976936 12856531
14335 12856531 15623182 17219289 18380380 19211116 19997117 20305344 19871380 19636339 18224484
14326 18224484 15014266 11412902 9391610 8672250 8237937 8212732 8379924 8601319 8933646
$$ packed form
14386E3222227L048952J016712k20778k194281m682950p085993q359924p937920
14378B6806045n992957m514112l568121k087536j322126j025388p7072p03268
14370G515465k31636k23299l1099j51527l21572K0408k79045Q0899q9925K21359
14360F510028J28702K72113P35498J314421J753756K364024K744098L249852L019540
14351B2092032K449104J399475J092702R4088n61920j149917k238770k781069
14343B0395725l352557l153053k471208j675167j120119p7246J430561K879595
14335A2856531K766651J596107J161091Q30736P86001L08227m33964k35041j411855
14326A8224484l210218l601364k021292p19360m34313k5205J67192K21395L32327
$$ plain form
14317 8933646 9391414 10211079 10959547 12324419 13446304 15134535 16868984 19125779 22142657
14308 22142657 25839246 30760985 37094998 45352683 56393084 69944254 84893238 100054448
14300 100054448 113073770 123105834 130313835 134070817 134461533 131168883 123810259 112245575
14292 112245575 96654404 79804985 64032505 51154243 41273704 33112914 27445016
14285 27445016 22803936 19338717 16373155 14453316 12542211 11008723 10211812 9060820
14277 9060820 8334169 8025286 7652563 6926042 6432388 6482069 5894058 5498651 5075533 4795283
14267 4795283 4509562 4370791 3937952 4070115 3471866 3628242 3581155 3582523 3447051 3426143
14257 3426143 3304174 3272169 3130735 3061594 3214030 2895443 3199605 2762728 3094720 2798158
$$ packed form
14317H933646M57768Q19665P48468J364872J121885J688231J734449K256795L016878
14308B2142657L696589M921739O334013Q257685J1040401J3551170J4948984J5161210
14300A00054448J3019322J0032064P208001L756982L90716l292650p358624j1564684
14292A12245575j5591171j6849419j5772480j2878262r880539q160790n667898
14285B7445016m641080l465219k965562j919839j911105j533488p96911j150992
14277I060820p26651l08883l72723p26521m93654M9681n88011l95407m23118k80250
14267D795283k85721j38771m32839J32163n98249J56376m7087J368j35472k0908
14257C426143j21969l2005j41434o9141J52436l18587L04162m36877L31992k96562
$$ plain form
14247 2798158 2735153 2664518 2551486 2472320 2383602 2169069 2436998 2408439 2161598 2420712
14237 2420712 2284817 2475647 2119714 2176028 2068216 2457543 2178501 2116736 2197073 2044043
14227 2044043 1770411 2117374 2313684 2116000 1989650 2175410 2231025 2083577 2339178 2197669
14217 2197669 2430453 2315505 2725894 2473484 2487546 2385863 2776409 2596078 2714971 3318583
14207 3318583 3633525 3765430 3872265 4138219 4037885 4069322 3832585 4083366 3755458 2793504
14197 2793504 2345485 1971634 1882682 2097189 1933544 2086931 2187294 2230315 2152033 2172065
14187 2172065 1989416 2223108 2313490 2066068 2082791 2373879 2063176 2074522 2031479 2267742
14177 2267742 2351162 2484483 2313691 2496462 2156260 2508376 2745397 2499732 2623048 2223250
$$ packed form
14247B798158o3005p0635j13032p9166q8718k14533K67929k8559k46841K59114
14237B420712j35895J90830l55933N6314j07812L89327k79042o1765Q0337j53030
14227B044043k73632L46963J96310j97684j26350J85760N5615j47448K55601j41509
14217B197669K32784j14948M10389k52410J4062j01683L90546j80331J18893O03612
14207C318583L14942J31905J06835K65954j00334L1437k36737K50781l27908r61954
14197B793504m48019l73851q8952K14507j63645J53387J00363M3021p8282K0032
14187B172065j82649K33692R0382k47422J6723K91088l10703J1346m3043K36263
14177B267742Q3420J33321j70792J82771l40202L52116K37021k45665J23316l99798
$$ plain form
14167 2223250 2197016 2071077 2125147 2084039 1909236 1995749 1939853 1907036 1897577 2241949 2537746
14156 2537746 2234168 2226199 2147612 2318292 2337051 2294693 2497638 2130127 2194868 2058380
14146 2058380 2306683 2335306 2719594 3009787 3239623 3538549 4786870 6035056 6746748
14137 6746748 7413446 8402816 8746107 9068387 9217658 8969102 8758440 7572436 5999864
14128 5999864 5089820 4442984 3631427 3180355 2692052 2824987 2932824 3194727 3546846
14119 3546846 3751727 3896347 3909252 4068174 4038719 4054529 3737389 3726034 3297686 2937477
14109 2937477 2767364 2877927 2512845 2405554 2535167 2532326 2527262 2687337 2687326 2715786 3003377
14098 3003377 3586426 4221380 4412804 4674477 4808493 4918541 4953461 5215508 5100659 4504256
$$ packed form
14167B223250k6234j25939N4070m1108j74803Q6513n5896l2817r459L44372K95797
14156B537746l03578p969p8587J70680J8759m2358K02945l67511O4741j36488
14146B058380K48303K8623L84288K90193K29836K98926J248321J248186P11692
14137F746748O66698R89370L43291L22280J49271k48556k10662j186004j572572
14128E999864r10044o46836q11557m51072m88303J32935J07837K61903L52119
14119C546846K04881J44620J2905J58922k9455J5810l17140j1355m28348l60209
14109B937477j70113J10563l65082j07291J29613k841n064J60075j1K8460K87591
14098C003377N83049O34954J91424K61673J34016J10048L4920K62047j14849n96403
$$ plain form
14088 4504256 4166741 4056462 3616323 4241069 4555820 5124389 5446253 5690917 5625622 5770243
14078 5770243 5740863 5644525 5413708 5046050 4399701 3898968 3439883 3321829 3085580 3349776
14068 3349776 3428100 3381509 3118756 3481302 3683947 3371054 3974842 4203062 4711218 4777513
14058 4777513 5216546 5543080 5645379 6288692 6096187 6349720 6604830 6477684 6371973
14049 6371973 6466307 6488319 7410890 7817350 8599457 9138428 10272070 10893133 12086551
14040 12086551 13043142 13590747 15003678 16469589 17698878 19530223 22228189 25646834
14032 25646834 30304587 36618717 45455882 57453405 72168463 88471465 103995371
14025 103995371 117509779 127945020 134926758 138270118 138177715 134028431 125598269 112472256
$$ packed form
14088D504256l37515j10279m40139O24746L14751N68569L21864K44664o5295J44621
14078E770243k9380r6338k30817l67658o46349n00733m59085j18054k36249K64196
14068C349776P8324m6591k62753L62546K02645l12893O03788K28220N08156O6295
14058D777513M39033L26534J02299O43313j92505K53533K55110j27146j05711
14049F371973R4334K2012R22571M06460P82107N38971J133642O21063J193418
14040A2086551R56591N47605J412931J465911J229289J831345K697966L418645
14032B5646834M657753O314130Q837165J1997523J4715058J6303002J5523906
14025A03995371J3514408J0435241O981738L343360r2403m149284q430162j3126013
$$ plain form
14017 112472256 95910732 78209446 62160211 49373010 39754011 32105941 26678230
14010 26678230 22175755 18790224 16244851 14100901 12310755 11174962 9872501 8798453
14002 8798453 8305195 7280237 6753402 6413874 6117073 5564835 5194669 5143007 5052676 4726519
13992 4726519 4885017 4854364 4955854 4877075 5202560 5595034 5940462 6558788 7082003 8108221
13982 8108221 8865884 9059973 9056767 9334267 9182927 9413713 8846116 8181384 7244736 6386743
13972 6386743 5750808 5080536 4704645 4446567 4168325 3541376 3373705 3175270 3161096 3108426
13962 3108426 3042719 2699892 2633469 2428530 2443810 2404077 2127382 2240196 2426319 2203038
13952 2203038 2201903 2714165 2707173 3134729 3046081 3257219 3443296 3484354 3978635 3798070
$$ packed form
14017A12472256j6561524j7701286j6049235j2787201r618999p648070n427711
14010B6678230m502475l385531k545373k143950j790146j135793j302461j074048
14002H798453m93258j024958n26835l39528k96801n52238l70166n1662r0331l26157
13992D726519J58498l0653J01490p8779L25485L92474L45428O18326N23215J026218
13982H108221P57663J94089l206K77500j51340K30786n67597o64732r36648q57993
13972F386743o35935o70272l75891k58078k78242o26949j67671j98435j4174n2670
13962C108426o5707l42827o6423k04939J5280l9733k76695J12814J86123k23281
13952B203038j135N12262o992M27556q8648K11138J86077M1058M94281j80565
$$ plain form
13942 3798070 4339245 4584013 5340067 7074483 9566569 12575260 15626816 18701228 22063495
13933 22063495 24581643 25927012 26712602 26211182 24966424 22483882 19297435 16006682
13925 16006682 12434817 9214963 6381148 4752528 3759831 3203158 2962277 2430955 2180493
13916 2180493 1908269 2024197 1847923 1861650 1963146 1780559 1894648 1830380 1862630 2039662
13906 2039662 1696246 1813039 1655894 1761566 1977561 1697133 1669572 1878519 1899446 1649482
13896 1649482 1873436 1638912 1757256 1633832 1680923 1818550 1758360 2168398 1662214 1943558
13886 1943558 1857331 1713686 1826930 1976800 1509554 1671054 1646865 1556191 1718528 1769563
13876 1769563 1620438 1612598 1623508 1598695 1606727 1461368 1655711 1709080 1813879 1869044 1780699
$$ packed form
13942C798070N41175K44768P56054J734416K492086L008691L051556L074412L362267
13933B2063495K518148J345369P85590n01420j244758k482542l186447l290753
13925A6006682l571865l219854k833815j628620r92697n56673k40881n31322k50462
13916B180493k72224J15928j76274J3727J01496j82587J14089o4268L2250J77032
13906B039662l43416J16793j57145J05672K15995k80428k7561K08947K0927k49964
13896A649482K23954k34524J18344j23424M7091J37627o0190M10038n06184K81344
13886A943558q6227j43645J13244J49870m67246J61500k4189r0674J62337N1035
13876A769563j49125p840J0910k4813Q032j45359J94343N3369J04799N5165q8345
$$ plain form
13865 1780699 1928809 1800786 1784748 1690074 1765107 1652737 1806359 1781774 1850334 1812245
13855 1812245 1792638 1778604 1809474 1732196 1901353 1802540 1821585 1953539 1718596 1938025
13845 1938025 1702882 1939165 1848184 2004694 1723016 1758595 1586053 1617770 1587413 1528609
13835 1528609 1444643 1362296 1361344 1561664 1616587 1535838 1492367 1762842 1437458 1631361 1648306
13824 1648306 1821052 1785858 1707214 1428107 1589935 1594503 1596038 1570647 1351921 1652472 1425473
13813 1425473 1216246 1504435 1455708 1390070 1386236 1417788 1324423 1163256 1373784 1475105
13803 1475105 1521677 1454250 1596543 1344649 1730168 1781933 1673128 1614280 1614600 1895369 1782818
13792 1782818 1647634 1803971 1529669 1593510 1357013 1614279 1270658 1468463 1507369 1317737
$$ packed form
13865A780699J48110j28023j6038r4674P5033j12370J53622k4585O8560l8089
13855A812245j9607j4034L0870p7278J69157r8813J9045J31954k34943K19429
13845A938025k35143K36283r0981J56510k81678L5579j72542L1717l0357n8804
13835A528609q3966q2347r52K00320N4923q0749m3471K70475l25384J93903J6945
13824A648306J72746l5194p8644k79107J61828M568J535k5391k18726L00551k26999
13813A425473k09227K88189m8727o5638l834L1552r3365j61167K10528J01321
13803A475105M6572o7427J42293k51894L85519N1765j08805n8848L20K80769j12551
13792A782818j35184J56337k74302O3841k36497K57266l43621J97805L8906j89632
$$ plain form
13782 1317737 1219851 1534453 1337961 1455630 1424969 1450504 1329433 1342292 1442726 1546457
13772 1546457 1488120 1669807 1551287 1872325 1440805 1557415 1695451 1771346 1549846 1660150
13762 1660150 1845225 1501685 1598502 1564461 1541252 1433767 1428993 1549332 1574889 1331152
13752 1331152 1429017 1467611 1507594 1447115 1452876 1346701 1283611 1699919 1520476 1570933 1776342
13741 1776342 1691954 1766256 1996233 1837934 1952095 2255677 2009850 2102489 2213812 2113783
13731 2113783 1954229 2091213 1975550 2006533 1957097 1724796 1755011 1721103 1629115 1329253
13721 1329253 1453382 1529512 1590841 1590379 1513776 1778744 1681530 1441947 1776674 1744855 1533415
13710 1533415 1669589 1575233 1830585 1685612 1741613 1616636 1747726 1887323 1883017 1769949
$$ packed form
13782A317737r7886L14602j96492J17669l0661K5535j21071J2859J00434J03731
13772A546457n8337J81687j18520L21038m31520J16610J38036P5895k21500J10304
13762A660150J85075l43540R6817l4041k3209j07485m774J20339K5557k43737
13752A331152R7865L8594L9983o0479N761j06175o3090M16308j79443N0457K05409
13741A776342q4388P4302K29977j58299J14161L03582k45827R2639J11323j00029
13731B113783j59554J36984j15663L0983m9436k32301L0215l3908r1988k99862
13721A329253J24129P6130O1329m62p6603K64968r7214k39583L34727l1819k11440
13710A533415J36174r4356K55352j44973N6001j24977J31090J39597m306j13068
$$ plain form
13700 1769949 1806380 1857618 1807492 1984790 2044515 2564693 2619741 2891157 2929574 2897550 2967351
13689 2967351 2896747 3015504 2844107 2547048 2346487 2140935 1995286 1766730 1820786 1895529
13679 1895529 1783601 1875238 1823592 2142425 2026701 2026818 2254189 2239277 2221984 2352433 2414600
13668 2414600 2690189 2739401 3387473 3085937 3541176 3383890 3649154 3798818 3864806 3793182
13658 3793182 3639672 3604118 3370635 2966655 2749720 2487332 2293633 2440814 2099804 2120987
13648 2120987 2131803 2234600 2153895 2266386 2033767 2132463 2333134 2172858 2045709 2213688
13638 2213688 2251971 2271849 2686472 2867680 2948360 3402384 3179387 3214711 3378815 3115226
13628 3115226 3202694 3119321 2843340 2482983 2293647 2094906 2087968 1677869 2081187 2007031
$$ packed form
13700A769949L6431N1238n0126J77298N9725N20178N5048K71416L8417l2024O9801
13689B967351p0604J18757j71397k97059k00561k05552j45649k28556N4056P4743
13679A895529j11928R1637n1646L18833j15724J17K27371j4912j7293J30449O2167
13668B414600K75589M9212O48072l01536M55239j57286K65264J49664O5988p1624
13658C793182j53510l5554k33483m03980k16935k62388j93699J47181l41010K1183
13648B120987J0816J02797q0705J12491k32619R8696K00671j60276j27149J67979
13638B213688L8283J9878M14623J81208Q0680M54024k22997L5324J64104k63589
13628C115226Q7468q3373k75981l60357j89336j98741o938m10099M03318p4156
$$ plain form
13618 2007031 1903143 1785323 1948377 1980458 1995967 2087216 2080400 2353829 2101331 2377954
13608 2377954 2321177 2513084 2523577 2532448 2373485 2461787 2297533 2144842 2037137 1797021
13598 1797021 2008255 1907514 2148117 2204171 2212239 2072554 2315235 2435121 2449880 2280650
13588 2280650 2341142 2255426 2092462 2288616 1987506 1978108 1798422 1614716 1628597 1610891
13578 1610891 1665278 1540637 1482032 1536159 1643084 1577074 1664493 1790847 1597433 1834240
13568 1834240 1697365 1490949 1714472 1655214 1852298 1507868 1288942 1666065 1677064 1587609
13558 1587609 1443393 1416245 1693140 1775378 1754065 1488041 1614532 1667762 1616617 1561324
13548 1561324 1738889 1816204 1829921 2011371 2343356 2748178 2527106 2861620 3276339 3098219
$$ packed form
13618B007031j03888j17820J63054L2081J5509R1249o816K73429k52498K76623
13608B377954n6777J91907J0493Q871j58963Q8302j64254j52691j07705k40116
13598A797021K11234j00741K40603N6054Q068j39685K42681J19886J4759j69230
13588B280650O0492q5716j62964J96154l01110r398j79686j83706J3881j7706
13578A610891N4387j24641n8605N4127J06925o6010Q7419J26354j93414K36807
13568A834240j36875k06416K23523n9258J97084l44430k18926L77123J0999q9455
13558A587609j44216k7148K76895Q2238k1313k66024J26491N3230n1145n5293
13548A561324J77565P7315J3717J81450L31985M04822k21072L34514M14719j78120
$$ plain form
13538 3098219 3249239 3178076 3184573 2833374 2410903 2207717 1945639 2111176 1861147 1885582
13528 1885582 2122988 2337215 2397277 2652079 2709886 3162462 3123052 2817247 2946359 2783796
13518 2783796 2617005 2541054 2097581 1791502 1609554 1471586 1259093 1595153 1541979 1353820
13508 1353820 1317225 1577802 1408234 1226904 1363582 1342308 1129292 1275931 1133945 1454448
13498 1454448 1317964 1271662 1418264 1190258 1398699 1430104 1343591 1270137 1460536 1183945
13488 1183945 1491169 1126819 1319646 1564698 1220803 1214030 1389643 1312350 1384980 1320543
13478 1320543 1313375 1133294 1388704 943576 1150340 1391096 1330611 1196992 1239739 1281534
13468 1281534 1166709 1498295 1282413 1182309 1487614 1091601 1290970 1402109 1339541 1360606
$$ packed form
13538C098219J51020p1163O497l51199m22471k03186k62078J65537k50029K4435
13528A885582K37406K14227O0062K54802N7807M52576l9410l05805J29112j62563
13518B783796j66791p5951m43473l06079j81948j37968k12493L36060n3174j88159
13508A353820l6595K60577j69568j81330J36678k1274k13016J46639j41986L20503
13498A454448j36484m6302J46602k28006K08441L1405q6513p3454J90399k76591
13488A183945L07224l64350J92827K45052l43895o773J75613p7293P2630o4437
13478A320543p168j80081K55410m45128K06764K40756o0485j33619M2747M1795
13468A281534j14825L31586k15882j00104L05305l96013J99369J11139o2568K1065
$$ plain form
13458 1360606 1625757 1275905 1453342 1592696 1842968 2253967 2607495 2802422 2930472
13449 2930472 2774761 3163440 2976422 3044943 2761274 2641733 2423236 2095089 1834065 1531943
13439 1531943 1578845 1497719 1281087 1451292 1483772 1636586 1308628 1485468 1337630 1522570
13429 1522570 1686536 1389098 1610653 1579200 1577892 1850140 2233551 2564302 2564107 2617444 2996290
13418 2996290 3201049 3114625 2855754 3209602 2814190 2654351 2036601 1735923 1394544 1479361
13408 1479361 1652586 1545788 1425027 1374748 1285899 1434016 1278894 1462694 1596567 1243867
13398 1243867 1268115 1516051 1415807 1350034 1543182 1678182 1790241 1669573 1721285 1797343
13388 1797343 2280569 1922999 2180019 2421193 2481778 2795181 2627175 2827709 2721922 2578111
$$ packed form
13458A360606K65151l49852J77437J39354K50272M10999L53528J94927J28050
13449B930472j55711L88679j87018O8521k83669j19541k18497l28147k61024l02122
13439A531943M6902q1126k16632J70205L2480J52814l27958J76840j47838J84940
13429A522570J63966k97438K21555l1453j308K72248L83411L30751j95N3337L78846
13418B996290K04759q6424k58871L53848l95412j59839o17750l00678l41379Q4817
13408A479361J73225j06798j20761n0279q8849J48117j55122J83800J33873l52700
13398A243867K4248K47936j00244o5773J93148J35000J12059j20668N1712P6058
13388A797343M83226l57570K57020K41174O0585L13403j68006K00534j05787j43811
$$ plain form
13378 2578111 2734638 2462215 2456040 2202646 2093443 1819829 1908060 1838193 1736492 1996325
13368 1996325 1922773 2025265 2246872 2042819 2016201 1932738 2016469 2103853 2021386 1679151
13358 1679151 1766451 1965217 1946061 2009423 2265446 2196135 2553076 2279679 2465412 2471743
13348 2471743 2378612 2383968 2361071 1938680 2111299 1836838 1671602 1861781 1905592 1998422
13338 1998422 1876888 1888111 1907030 1909652 1887219 1542215 1879320 1850163 1777119 1536530 1942526
13327 1942526 1942534 1766018 1682779 2008658 1967299 1933295 1995348 1982571 2046051 1931072 2007858
13316 2007858 2193363 2320550 2702079 2418508 2655917 2839534 2933466 3043687 3067310 3033002
13306 3033002 2846704 2710475 2584135 2566106 2423491 2465158 2810105 3071149 2801007 3071357
$$ packed form
13378B578111J56527k72423o175k53394j09203k73614Q8231o9867j01701K59833
13368A996325p3552J02492K21607k04053k6618q3463Q3731Q7384q2467l42235
13358A679151Q7300J98766j9156O3362K56023o9311L56941k73397J85733O331
13348B471743r3131N356k2897m22391J72619k74461j65236J90179M3811R2830
13338A998422j21534J1223J8919K622k2433l45004L37105k9157p3044k40589M05996
13327A942526Qj76516q3239L25879m1359l4004O2053j2777O3480j14979P6786
13316B007858J85505J27187L81529k83571K37409J83617R3932J10221K3623l4308
13306C033002j86298j36229j26340j8029j42615M1667L44947K61044k70142K70350
$$ plain form
13296 3071357 3047247 3340025 3088755 3190205 3357314 3303269 3030332 3037672 2623889 2783857
13286 2783857 2656101 2704134 2691478 2652449 2886676 2861557 2964919 2821666 2910941 3077534
13276 3077534 3037305 3315828 2982497 3464800 3384621 3528083 3362949 3329710 3506210 3575257
13266 3575257 3592176 3763301 3880710 3938976 4090509 4391565 4412214 4484938 4596918 4751009
13256 4751009 5189121 5230632 5125036 5645708 5576764 5895037 6105285 6094439 6129787 6182200
13246 6182200 6152365 6269392 5997045 6160622 6368024 6432096 6530805 6819622 6786132 6809700
13236 6809700 6933024 7194355 7652166 7766534 8025589 8296427 8787405 8896688 9163214
13227 9163214 9155847 9475820 9572327 9543903 9321375 9327472 9234272 9153780 8922006 8907404 8945769
$$ packed form
13296C071357k4110K92778k51270J01450J67109n4045k72937P340m13783J59968
13286B783857j27756M8033j2656l9029K34227k5119J03362j43253Q9275J66593
13276C077534m0229K78523l33331M82303q0179J43462j65134l3239J76500O9047
13266C575257J6919J71125J17409N8266J51533L01056K0649P2724J11980J54091
13256D751009M38112M1511j05596N20672o8944L18273K10248j0846L5348N2413
13246F182200k9835J17027k72347J63577K07402O4072R8709K88817l3490K3568
13236F809700J23324K61331M57811J14368K59055K70838M90978J09283K66526
13227I163214p367L19973R6507k8424k22528O097r3200q0492k31774j4602L8365
$$ plain form
13216 8945769 8383181 8570039 8457596 8303161 8145089 8222557 8067639 8051003 8096518 8145208
13206 8145208 8257091 7999609 8146782 7956497 7941944 8170428 8172853 7923130 7814109 7802021
13196 7802021 7553898 7371827 7147648 7384170 7060780 6608596 6671133 6468383 6437451 6266394
13186 6266394 6174598 6173373 5953922 5914814 5799459 5905335 5751999 5467151 5590289 5511147
13176 5511147 5399424 5515174 5558843 5539083 5489050 5514941 5526708 5254152 5332588 5309379 5527099
13165 5527099 5584175 5897833 5882969 6279618 6407440 6292541 6476442 6900683 7169107 7018468
13155 7018468 7692953 7642728 7636306 7413036 7343087 7243008 7125803 7053177 6837348 6826763
13145 6826763 6601723 6714956 6900246 6511675 6639636 6629205 6532369 6247430 5865594 5702402
$$ packed form
13216H945769n62588J86858j12443j54435j58072P7468j54918j6636M5515M8690
13206H145208J11883k57482J47173j90285j4553K28484K425k49723j09021j2088
13196G802021k48123j82071k24179K36522l23390m52184O2537k02750l0932j71057
13186F266394r1796j225k19451l9108j15355J05876j53336k84848J23138p9142
13176E511147j11723J15750M3669j9760n0033K5891J1767k72556P8436k3209K17720
13165E527099N7076L13658j4864L96649J27822j14899J83901M24241K68424j50639
13155G018468O74485n0225o422k23270o9949j00079j17205p2626k15829j0585
13145F826763k25040J13233J85290l88571J27961j0431r6836k84939l81836j63192
$$ plain form
13135 5702402 5301427 4897273 4756614 4555810 4416716 4400328 4382321 4137328 4428669 4374953
13125 4374953 4429066 4544520 4403819 4513921 4483273 4042854 3889326 3797922 3525730 3566626
13115 3566626 3684350 3249001 3289174 3442297 3324934 3142740 3194779 3331499 3324262 3069123
13105 3069123 3236744 3034857 3153079 3250476 3332100 3257574 3229978 4022217 4297568 4263652
13095 4263652 4775271 5287387 5696797 5891996 6241710 6209482 6144077 6170555 6222294 5856597
13085 5856597 5867440 5526798 5652895 5790411 5745517 5354962 5604224 5462852 5384258 5005666
13075 5005666 4812323 4498536 3979541 3761863 3285563 3233359 3058076 2777861 2709666 2723960
13065 2723960 2766599 2732481 2634914 2444146 2590205 2727346 2750850 2860963 3048757 3021414
$$ packed form
13135E702402m00975m04154j40659k00804j39094j6388j8007k44993K91341n3716
13125D374953N4113J15454j40701J10102l0648m40419j53528r1404k72192M0896
13115C566626J17724m35349M0173J53123j17363j82194N2039J36720p237k55139
13105C069123J67621k01887J18222R7397Q1624p4526k7596P92239K75351l3916
13095D263652N11619N12116M09410J95199L49714l2228o5405K6478N1739l65697
13085E856597J0843l40642J26097J37516m4894l90555K49262j41372p8594l78592
13075E005666j93343l13787n18995k17678m76300n2204j75283k80215o8195J4294
13065B723960M2639l4118r7567j90768J46059J37141K3504J10113J87794k7343
$$ plain form
13055 3021414 2979249 3065610 2966973 2941597 2875869 2785371 2899523 2745424 2586260 2489685 2476294
13044 2476294 2666307 2644794 2430058 2470712 2709806 2574484 2742178 2479489 2595682 2801245
13034 2801245 2990031 2752572 2809649 2922992 3066892 2942024 3006381 2883324 3066493 3063828
13024 3063828 2980228 3067157 3285410 3387605 3321675 3251455 3219788 3481999 3483650 3253327 3329462
13013 3329462 3682605 3599631 3874247 3937000 4136462 4108197 4285702 4509430 4418622 4333825
13003 4333825 4661390 4568759 4404628 4844278 5078027 5046998 5292744 5324560 5444795 5539917
12993 5539917 6017138 5932041 5939665 6212783 6273224 6368874 6572235 6569514 6389371 6846805 6416859
12982 6416859 6550595 6688835 6850588 6607216 6808537 6662652 6649047 6576004 6530413 6359901
$$ packed form
13055C021414m2165Q6361r8637k5376o5728r0498J14152j54099j59164r6575j3391
13044B476294J90013k1513k14736M0654K39094j35322J67694k62689J16193K05563
13034B801245J88786k37459N7077J13343J43900j24868O4357j23057J83169k665
13024C063828q3600Q6929K18253J02195o5930p0220l1667K62211J651k30323P6135
13013C329462L53143q2974K74616O2753J99462k8265J77505K23728r0808q4797
13003D333825L27565r2631j64131M39650K33749l1029K45746L1816J20235R5122
12993E539917M77221q5097P624K73118O0441R5650K03361k721j80143M57434m29946
12982F416859J33736J38240J61753k43372K01321j45885j3605p3043m5591j70512
$$ plain form
12972 6359901 6115086 6228490 6384506 6087796 6242213 5964139 6079700 5914646 5648476
12963 5648476 5834908 5952643 5657602 5606935 5289296 5370671 5182985 5411230 5469541 5486777
12953 5486777 5354045 5104679 5280802 5456547 5276168 5137891 5203340 5052356 5177615 5045757
12943 5045757 5233660 5135614 5206819 5086936 5049613 5414072 5034009 5450155 5094100 5378334
12933 5378334 5655170 5717549 5750724 5977817 5908560 5812546 5774687 5952135 5880683 5833149 5713216
12922 5713216 5506333 5573201 5663107 5701441 5785966 5652278 5542921 6097521 5609643 5576667
12912 5576667 5406190 5106762 5064429 4972334 4840403 4622825 4705437 4635949 4583108 4615312
12902 4615312 4482533 4325997 4335071 3823037 3969670 3935011 3935416 3955496 3548223 3750207 3777946
$$ packed form
12972F359901k44815J13404J56016k96710J54417k78074J15561j65054k66170
12963E648476J86432J17735k95041n0667l17639Q1375j87686K28245N8311J7236
12953E486777j32732k49366J76123J75745j80379j38277O5449j50984J25259j31858
12943E045757J87903r8046P1205j19883l7323L64459l80063M16146l56055K84234
12933E378334K76836O2379L3175K27093o9257r6014l7859J77448p1452m7534j19933
12922E713216k06883O6868Q9906L8334Q4525j33688j09357N54600m87878l2976
12912E576667j70477k99428m2333r2095j31931k17578Q2612o9488n2841L2204
12902D615312j32779j56536R074n12034J46633l4659M05K0080m07273K01984K7739
$$ plain form
12891 3777946 3528472 3345147 3581723 3617253 3641644 3363341 3371375 3209775 3289324 3110928
12881 3110928 3302588 3433179 3112512 3203137 3282753 3139958 3026904 3229423 2794681 3044185
12871 3044185 2857926 2982339 3147868 2970894 2741642 2755541 2730605 2523142 2733469 2813983
12861 2813983 2858090 2723462 2644490 2683019 2784455 2626757 2390410 2606768 2533077 2565879
12851 2565879 2820332 2574133 2710608 2722681 2674149 2383408 2493979 2798083 2648876 2582633
12841 2582633 2327270 2775136 2639377 2675586 2507195 2848317 2757255 2731326 2943624 2717324
12831 2717324 2650961 2914268 2851838 2679365 2676605 2600185 2613320 2547881 2746619 2660826 2572768
12820 2572768 2680705 2725402 2744023 2573697 2422063 2591583 2453084 2729976 2639247 2472779
$$ packed form
12891C777946k49474j83325K36576L5530K4391k78303Q034j61600P9549j78396
12881C110928J91660J30591l20667R0625P9616j42795j13054K02519m34742K49504
12871C044185j86259J24413J65529j76974k29252J3899k4936k07463K10327Q0514
12861B813983M4107j34628p8972L8529J01436j57698k36347K16358p3691L2802
12851B565879K54453k46199J36475J2073m8532k90741J10571L04104j49207o6243
12841B582633k55363M47866j35759L6209j68391L41122r1062k5929K12298k26300
12831B717324o6363K63307o2430j72473k760p6420J3135o5439J98738q5793q8058
12820B572768J07937M4697J8621j70326j51634J69520j38499K76892r0729j66468
$$ plain form
12810 2472779 2438905 2531726 2563755 2557656 2615159 2510650 2791946 2767994 2750982 2878020 2659814
12799 2659814 2755036 2840333 2820150 2804745 2817009 2782434 2878725 2688072 2834744 2635081 2691738
12788 2691738 2768006 2855728 2935624 3023935 2684373 2891412 2680563 3110858 2943610 2790664
12778 2790664 2856535 2674524 2863688 2791993 2774130 2884078 2589171 2830514 2778311 2873927
12768 2873927 3016329 2891498 2566285 3007052 3025958 3078561 2924544 2858120 3031231 3084157
12758 3084157 2749431 3134495 3052681 3121862 3114139 3021830 2869673 2863074 3139864 2984022 2914296
12747 2914296 3035355 3029119 3073567 3112176 2963171 2950026 3026998 3075215 2860137 3166313 3011684
12736 3011684 2894486 3297579 2999323 3118565 3011382 3056594 3006303 3215921 3097826 3008541
$$ packed form
12810B472779l3874R2821L2029o099N7503j04509K81296k3952j7012J27038k18206
12799B659814R5222Q5297k0183j5405J2264l4575R6291j90653J46672j99663N6657
12788B691738P6268Q7722P9896Q8311l39562K07039k10849M30295j67248j52946
12778B790664O5871j82011J89164p1695j7863J09948k94907K41343n2203R5616
12768B873927J42402j24831l25213M40767J8906N2603j54017o6424J73111N2926
12758C084157l34726L85064q1814O9181p723r2309j52157o599K76790j55842o9726
12747B914296J21059o236M4448L8609j49005j3145P6972M8217k15078L06176j54629
12736C011684j17198M03093k98256J19242j07183M5212n0291K09618j18095q9285
$$ plain form
12726 3008541 3232950 3041203 3092680 3027942 3006390 3066796 3120301 3033259 3007143 3159088 3051630
12715 3051630 3048365 3004177 3088996 3284700 2953596 3252799 2893223 3125815 3275810 3520571
12705 3520571 3606479 3421185 3733315 3427371 3900377 3753431 3702096 3690434 4024081 3970156
12695 3970156 4124372 4140332 4047618 4637610 4987644 5458199 6622605 7084882 7647128 7925184
12685 7925184 8248517 8182504 8100576 7871202 7541512 6983071 6294749 5158355 5122151 4734681
12675 4734681 4587632 4453981 4391107 4106679 4178050 4482988 4702762 4545904 4619732 4758293
12665 4758293 4584915 4759419 4565151 4589540 5094850 4579849 4767723 4434548 4537544 4373140
12655 4373140 4470718 4608598 4764291 4919564 5112353 5293699 5597426 5966747 6021610 6463098
$$ packed form
12726C008541K24409j91747N1477o4738k1552O0406N3505q7042k6116J51945j07458
12715C051630l265m4188Q4819J95704l31104K99203l59576K32592J49995K44761
12705C520571Q5908j85294L12130l05944M73006j46946n1335j1662L33647n3925
12695C970156J54216J5960r2714N89992L50034M70555J164406M62277N62246K78056
12685G925184L23333o6013q1928k29374l29690n58441o88322j136394l6204l87470
12675D734681j47049j33651o2874k84428P1371L04938K19774j56858P3828J38561
12665D758293j73378J74504j94268K4389N05310n15001J87874l33175J02996j64404
12655D373140R7578J37880J55693J55273J92789J81346L03727L69321N4863M41488
$$ plain form
12645 6463098 6536424 6505303 6984313 6713275 6627125 6640160 6541898 6435728 6548345 6621236
12635 6621236 6475324 6348745 6366186 6308334 6177082 6450528 6732432 6698669 6965959 7055126
12625 7055126 6966861 7033732 6877562 6590572 6839300 6318108 6019329 6073907 5490999 5455873
12615 5455873 4991298 5004803 5270167 5865615 5967997 6703357 6853765 7380311 7872131 8140652
12605 8140652 8716452 8611871 8465534 8562314 8044215 7445879 7224473 6569221 6228299 5801020
12595 5801020 5434675 4851183 5148842 4843126 4978828 5147246 5384192 5624465 5691996 5788631
12585 5788631 6176854 6272853 6196758 6407873 6478822 6690762 6831033 6974278 7202267 7296828
12575 7296828 7347103 7312790 7172434 6933825 6700493 6172160 5904686 5397074 5114882 4742382
$$ packed form
12645F463098P3326l1121M79010k71038q6150J3035r8262j06170J12617P2891
12635F621236j45912j26579J7441n7852j31252K73446K81904l3763K67290Q9167
12625G055126q8265O6871j56170k86990K48728n21192k98779N4578n82908l5126
12615E455873m64575J3505K65364N95448J02382P35360J50408N26546M91820K68521
12605H140652N75800j04581j46337R6780n18099n98336k21406o55252l40922m27279
12595E801020l66345n83492K97659l05716J35702J68418K36946K40273O7531R6635
12585E788631L88223R5999p6095K11115P0949K11940J40271J43245K27989R4561
12575G296828N0275l4313j40356k38609k33332n28333k67474n07612k82192l72500
$$ plain form
12565 4742382 4541665 4834416 4606145 4585127 4821347 4756057 5102602 4768445 4758704 4874474
12555 4874474 4669199 4716087 4728300 4904040 4757219 4562080 4628695 4775390 5111989 4928573
12545 4928573 4876853 5151400 5207317 5360210 5709237 6010209 6042787 6045974 6272403 6316925
12535 6316925 6372175 6298684 6247898 5685759 5395522 5233866 5071682 5042668 4725670 4741835
12525 4741835 4792162 4955121 4923697 5217679 5029292 4958587 5170056 5375083 5250343 5275640
12515 5275640 5499838 5623766 6307749 6854711 7215717 7574496 8084966 8116295 8159114 8043479
12505 8043479 8232024 8019579 7451768 6916263 6296770 6090443 5533323 5426025 5497016 5484618
12495 5484618 5275281 5372010 5396814 5182686 5699048 5275787 5411792 5700200 5749725 5647580
$$ packed form
12565D742382k00717K92751k28271k1018K36220o5290L46545l34157r741J15770
12555D874474k05275M6888J2213J75740j46821j95139O6615J46695L36599j83416
12545D928573n1720K74547N5917J52893L49027L00972L2578L187K26429M4522
12535F316925N5250p3491n0786n62139k90237j61656j62184k9014l16998J6165
12525D741835N0327J62959l1424K93982j88387p0705K11469K05027j24740K5297
12515E275640K24198J23928O83983N46962L61006L58779N10470L1329M2819j15635
12505H043479J88545k12445n67811n35505o19493k06327n57120j07298P0991j2398
12495E484618k09337R6729K4804k14128N16362m23261J36005K88408M9525j02145
$$ plain form
12485 5647580 5742786 6153939 6468177 6460901 6979837 7109953 7249667 7180995 7306148 7271909
12475 7271909 7054340 6981979 6830517 6369973 6000017 5975561 5980335 5915825 5991928 6187191
12465 6187191 6245306 6025324 6095489 6281861 6189459 6432262 6801152 6738310 7111655 7050898
12455 7050898 6932206 7665226 7935645 7877255 8291384 8454997 8742067 9254008 9267240 9569672
12445 9569672 9824484 10125812 10103044 10550513 10315449 10276674 10435047 10570252 10359004 10085179
12435 10085179 10277773 10444299 10538437 10639476 10659520 10737902 11046329 11378502 11578678 11980745
12425 11980745 12332470 12572878 12890827 13374044 13792223 14244526 14546526 14915021 15413388
12416 15413388 15679830 16209363 16481635 16596658 16864353 16703132 16683772 16390197 16451952 15876881
$$ packed form
12485E647580R5206M11153L14238p276N18936J30116J39714o8672J25153l4239
12475G271909k17569p2361j51462m60544l69956k4456M774o4510P6103J95263
12465F187191N8115k19982P0165J86372r2402K42803L68890o2842L73345o0757
12455G050898j18692P33020K70419n8390M14129J63613K87070N11941J3232L02432
12445I569672K54812L01328k2768M47469k35064l8775J58373J35205k11248k73825
12435A0085179J92594J66526R4138J01039K0044P8382L08427L32173K00176M02067
12425A1980745L51725K40408L17949M83217M18179M52303L02000L68495M98367
12416A5413388K66442N29533K72272J15023K67695j61221j9360k93575O1755n75071
$$ plain form
12406 15876881 15736856 15328521 14943465 14634416 14402637 14160632 13976173 13915633 14119991
12397 14119991 14096325 13823002 14356844 14465572 14607454 14911013 15446948 15922642 16174567
12388 16174567 16819670 17154860 17623504 18096402 18192954 18373585 18393836 18429601 18387994 18439321
12378 18439321 18305347 18446845 18175355 18409156 18262419 17978168 17892302 17784968 17640540
12369 17640540 17876023 17716434 17418508 17451357 17450355 17256914 17200818 17385510 17075999 17055814
12359 17055814 17007767 16744277 16839129 16736990 16823257 16679702 16692971 16500939 16295489 16103578
12349 16103578 15910576 15992880 15569819 15523833 15457033 15147138 15688975 15605839 15791955 16090685
12339 16090685 16293451 16706699 17208755 17449380 17731416 18360996 18493524 18948284 19536490
$$ packed form
12406A5876881j40025m08335l85056l09049k31779k42005j84459o0540K04358
12397A4119991k3666k73323N33842J08728J41882L03559N35935M75694K51925
12388A6174567O45103L35190M68644M72898R6552J80631K0251L5765m1607N1327
12378A8439321j33974J41498k71490K33801j46737k84251q5866j07334j44428
12369A7640540K35483j59589k97926L2849j002j93441n6096J84692l09511k0185
12359A7055814m8047k63490R4852j02139Q6267j43555J3269j92032k05450j91911
12349A6103578j93002Q2304m23061m5986o6800l09895N41837q3136J86116K98730
12339A6090685K02766M13248N02056K40625K82036O29580J32528M54760N88206
$$ plain form
12330 19536490 19689562 19997470 20140563 20621297 20743659 20839751 21129621 21134123 21368042 21156964
12320 21156964 21223729 21239614 21346197 21014056 21217395 21157189 21303456 21242756 21315829 21563487
12310 21563487 21811133 21928861 22476240 22636863 23089220 23216902 23519524 23970145 24255587
12301 24255587 24382658 24129088 24009822 23421188 22994653 22568798 21850224 21516766 20931383
12292 20931383 20790380 20526628 19829570 19402242 19334486 18937807 18567199 18213827 17636349
12283 17636349 17018848 16586860 15824219 15621883 14910806 14501561 14096512 13968630 13736458
12274 13736458 13661198 13213966 13446289 13292602 13125653 13002399 12829802 13246854 12935716
12265 12935716 12978047 12573951 12802173 12775998 12934552 12693565 12882892 12915573 13031642 13401985
$$ packed form
12330A9536490J53072L07908J43093M80734J22362R6092K89870M502K33919k11078
12320B1156964O6765J5885J06583l32141K03339o0206J46267o0700P3073K47658
12310B1563487K47646J17728N47379J60623M52357J27682L02622M50621K85442
12301B4255587J27071k53570j19266n88634m26535m25855p18574l33458n85383
12292B0931383j41003k63752o97058m27328o7756l96679l70608l53372n77478
12283A7636349o17501m31988p62641k02336p11077m09245m05049j27882k32172
12274A3736458p5260m47232K32323j53687j66949j23254j72597M17052l11138
12265A2935716M2331m04096K28222k6175J58554k40987J89327L2681J16069L70343
$$ plain form
12255 13401985 13921107 14317142 15112607 15602070 16471535 17465334 18635384 19618687 20585211
12246 20585211 21895716 22875930 23978539 25104150 25556301 26135696 26578998 26784961 26736964
12237 26736964 26314655 26333289 25871388 25658623 25157719 24948055 24576484 24546529 23973747 23001715
12227 23001715 22762790 21612129 20512863 19467116 18124428 16974464 16228862 15156077
12219 15156077 14185306 13691637 12997885 12572817 12395465 12009654 11613649 11278054 11103602
12210 11103602 10775941 10388352 10094545 10217885 9776813 9547546 9829583 9488568 9584962
12201 9584962 9798617 9611623 9593985 9760853 9760180 9828852 10025705 9871665 10369228 10335241
12191 10335241 10562912 10943777 11032099 11357126 11416425 11705874 11748483 11650356 12228339 12248134
$$ packed form
12255A3401985N19122L96035P95465M89463Q69465R93799J170050R83303R66524
12246B0585211J310505R80214J102609J125611M52151N79395M43302K05963m7997
12237B6736964m22309J8634m61901k12765n00904k09664l71571k9955n72782r72032
12227B3001715k38925j150661j099266j045747j342688j149964p45602j072785
12219A5156077r70771m93669o93752m25068j77352l85811l96005l35595j74452
12210A1103602l27661l87589k93807J23340m41072k29267K82037l41015R6394
12201I584962K13655j86994j7638J66868o73O8672J96853j54040M97563l3987
12191A0335241K27671L80865Q8322L25027N9299K89449M2609r8127N77983J9795
$$ plain form
12181 12248134 12238183 12088816 12108181 11984656 11878985 11711801 11648099 11585941 11674204 11552025
12171 11552025 11185091 11622782 11511244 11526272 11744236 11746544 12091005 12074004 12443066 12926158
12161 12926158 13318809 13779623 14096038 14360582 14626956 14706023 15010143 14817840 14896159 14649604
12151 14649604 14507117 14577820 14789990 15131213 15763864 16436494 16997240 17879761 18590530
12142 18590530 19262291 19932723 20578655 21489275 22014243 23125724 23707028 24803385 25991015
12133 25991015 27086829 28710222 29933385 32006160 33961360 35847840 38006877 39763529
12125 39763529 41400095 43046619 43903395 44647934 44996641 45099290 45016760 44699411 43937905
12116 43937905 43366634 42425798 41548025 40794383 39424909 39332454 38490261 37738935 36942482
$$ packed form
12181A2248134r951j49367J9365j23525j05671j67184o3702o2158Q8263j22179
12171A1552025l66934M37691j11538J5028K17964K308L44461j7001L69062M83092
12161A2926158L92651M60814L16415K64544K66374P9067L04120j92303P8319k46555
12151A4649604j42487P0703K12170L41223O32651O72630N60746Q82521P10769
12142A8590530O71761O70432O45932R10620N24968J111481N81304J096357J187630
12133B5991015J095814J623393J223163K072775J955200J886480K159037J756652
12125C9763529J636566J646524Q56776P44539L48707J02649q2530l17349p61506
12116D3937905n71271r40836q77773p53642j369474r2455q42193p51326p96453
$$ plain form
12107 36942482 36332594 35422949 35138038 34512770 34661470 34711742 34721296 34732798 34509512 34596707
12097 34596707 34637735 34276455 34148411 33815548 33362275 32924212 32534513 32492731 32495430 32970246
12087 32970246 33662616 34439290 35316392 36012888 36884213 37725757 38210589 38500226 38721338
12078 38721338 38634898 38455771 38305594 38282201 38094462 38114260 37859656 37366728 36925704 35975351
12068 35975351 35141560 34118022 33206902 32185728 30948130 29743815 28939031 28215076 27651509
12059 27651509 26816220 26689368 26152207 25861549 25351416 24869206 24393515 23805351 23364447
12050 23364447 22663256 21935477 21670809 21187288 21217893 20507175 20289645 20246127 19662721 19007634
12040 19007634 18885493 18405800 17849878 17202210 16848637 16581150 16623129 16570278 16744001 16857028
$$ packed form
12107C6942482o09888r09645k84911o25268J48700N0272R554J1502k23286Q7195
12097C4596707M1028l61280j28044l32863m53273m38063l89699m1782K699M74816
12087C2970246O92370P76674Q77102O96496Q71325Q41544M84832K89637K21112
12078C8721338q6440j79127j50177k3393j87739J9798k54604m92928m41024r50353
12068C5975351q33791j023538r11120j021174j237598j204315q04784p23955n63567
12059B7651509q35289j26852n37161k90658n10133m82210m75691n88164m40904
12050B3364447p01191p27779k64668m83521L0605p10718k17530m3518n83406o55087
12040A9007634j22141m79693n55922o47668l53573k67487M1979n2851J73723J13027
$$ plain form
12030 16857028 17311776 17897005 18009493 18537593 18876780 18528245 18413671 17928203 17241733
12021 17241733 16699883 15933549 15078190 14501831 13851781 13306167 12783306 12642590 11972102
12012 11972102 11801140 11776639 11376160 11039321 10783713 10585098 10411685 9940744 10154952
12003 10154952 10223419 10504413 10542789 10979960 10865853 10905438 10793503 10719430 10526190 10256005
11993 10256005 10053756 9950037 9880929 9600169 9716815 9300363 9343990 9270152 9030659 9001765
11983 9001765 8846459 8546841 8222751 8087544 7923823 7865930 7620744 7554182 7435477 7617635
11973 7617635 7323461 7119737 7077656 6891022 6668074 6305630 6022964 6142314 5800614 5776682
11963 5776682 5436320 5622422 5503691 5526937 5636604 5767959 5808468 6047827 6052795 6022121
$$ packed form
12030A6857028M54748N85229J12488N28100L39187l48535j14574m85468o86470
12021A7241733n41850p66334q55359n76359o50050n45614n22861j40716o70488
12012A1972102j70962k4501m00479l36839k55608j98615j73413m70941K14208
12003A0154952O8467K80994L8376M37171j14107L9585j11935p4073j93240k70185
11993A0256005k02249j03719o9108k80760J16646m16452M3627p3838k39493k8894
11983I001765j55306k99618l24090j35207j63721n7893k45186o6562j18705J82158
11973G617635k94174k03724m2081j86634k22948l62444k82666J19350l41700k3932
11963E776682l40362J86102j18731K3246J09667J31355M0509K39359M968l0674
$$ plain form
11953 6022121 6031095 5983804 6225324 6294330 6294914 6213826 6073021 6392899 6311057 6335775 6731131
11942 6731131 7076467 7286883 7149772 7662626 7881903 8117051 8310633 8127557 7996603
11933 7996603 8348149 8340215 8370020 8233937 8134982 8198187 7832274 7864386 7530296 7188415
11923 7188415 7206956 7027960 6874280 6691405 6627898 6177586 6101489 6092619 5958882 5992940
11913 5992940 5797651 5960395 6307523 7871936 10468259 13606636 14920500 15868751 16613245
11904 16613245 16903095 17131975 16714936 16369994 15525380 12377757 8184427 6461964 5920357
11895 5920357 5534534 5136816 5066573 4987124 4992886 5113543 5451625 5393233 5904443 6632412
11885 6632412 7267463 7696870 8261369 8803311 9088917 9282457 9563306 9726985 9526399
$$ packed form
11953F022121Q974m7291K41520O9006N84q1088j40805L19878q1842K4718L95356
11942F731131L45336K10416j37111N12854K19277K35148J93582j83076j30954
11933G996603L51546p934K9805j36083r8955O3205l65913L2112l34090l41881
11923G188415J8541j78996j53680j82875o3507m50312p6097q870j33737L4058
11913E992940j95289J62744L47128J564413K596323L138377J313864R48251P44494
11904A6613245K89850K28880m17039l44942q44614l147623m193330j722463n41607
11895E920357l85823l97718p0243p9449N762J20657L38082n8392N11210P27969
11885F632412O35051M29407N64499N41942K85606J93540K80849J63679k00586
$$ plain form
11876 9526399 9183554 8804457 7976285 7543176 7085079 6697525 6315191 5761370 5428009
11867 5428009 5031528 5086281 5024108 4602181 4680826 4754395 4500377 4335975 4561354 4292175
11857 4292175 4293047 4397424 4337770 4411368 4529267 4426235 4846863 5417519 5336120 5208336
11847 5208336 5356788 5608728 5929922 6192341 6563256 7086039 7321121 7406405 7313833 7484598
11837 7484598 7534070 7168803 6996371 7011531 6404539 6552958 6318319 6226130 6120660 6085712
11827 6085712 6007143 5965401 5875034 5601724 5280980 4912527 4429822 4170936 4097667 3902671
11817 3902671 4069439 3852349 3648334 3761189 3598616 3638661 3621114 3419563 3469348 3421458
11807 3421458 3387228 3174591 3210646 3361669 2985696 3274553 2826642 2953399 3130129 3072377
$$ packed form
11876I526399l42845l79097q28172m33109m58097l87554l82334n53821l33361
11867E428009l96481N4753o2173m21927P8645P3569k54018j64402K25379k69179
11857D292175Q72J04377n9654P3598J17899j03032M20628N70656q1399j27784
11847E208336J48452K51940L21194K62419L70915N22783K35082Q5284r2572J70765
11837G484598M9472l65267j72432J5160o06992J48419k34639r2189j05470l4948
11827F085712p8569m1742r0367k73310l20744l68453m82705k58886p3269j94996
11817C902671J66768k17090k04015J12855j62573M0045j7547k01551M9785m7890
11807C421458l4230k12637L6055J51023l75973K88857m47911J26757J76730n7752
$$ plain form
11797 3072377 3286805 3145287 3076462 3368067 3290224 3353787 3545833 3917775 4249398 4658617
11787 4658617 4626950 4837748 4932789 4967128 5109220 5164686 4773091 4525986 4076141 3922933
11777 3922933 3581179 3421657 3000699 2919228 3094609 2816060 2738485 2799643 2835631 2856439
11767 2856439 2890971 2874086 2589574 2682716 2439742 2641136 2596633 2815508 2771679 2656464
11757 2656464 2621058 2497977 2670158 2713965 2510557 2500622 2514812 2567858 2423318 2807950
11747 2807950 2680606 2548486 2559323 2434758 2557145 2405246 2508375 2678123 2589094 2553882
11737 2553882 2154393 2654565 2500079 2489291 2497390 2489344 2524094 2518546 2524076 2469703 2506338
11726 2506338 2352537 2394802 2321245 2478563 2416631 2328991 2260608 2579367 2311954 2338879
$$ packed form
11797C072377K14428j41518o8825K91605p7843O3563J92046L71942L31623M09219
11787D658617l1667K10798R5041L4339J42092N5466l91595k47105m49845j53208
11777C922933l41754j59522m20958q1471J75381k78549p7575O1158L5988K0808
11767B856439L4532j6885k84512R3142k42974K01394m4503K18875m3829j15215
11757B656464l5406j23081J72181M3807k03408r935J4190N3046j44540L84632
11747B807950j27344j32120J0837j24565J22387j51899J03129J69748q9029l5212
11737B553882l99489N00172j54486j0788Q099q046L4750n548N530n4373L6635
11726B506338j53801M2265p3557J57318o1932q7640o8383L18759k67413K6925
$$ plain form
11716 2338879 2399586 2541412 2419395 2657157 2177441 2332877 2223390 2650706 2439295 2362746
11706 2362746 2498995 2276213 2673319 2472316 2632069 2816500 2574600 2570870 2363893 2449303
11696 2449303 2657996 2278890 2558527 2376329 2489049 2488964 2439197 2452813 2371644 2508764 2636551
11685 2636551 2588093 2576851 2612699 2621972 2788571 2657571 2757241 2815586 2728812 2736302 2788707
11674 2788707 2928657 2773925 2718906 2658224 2556730 2903584 2713249 2815879 2837362 2888854
11664 2888854 2720619 2613062 2778997 3187539 2727220 2830990 2627358 2844487 2774035 2706883
11654 2706883 2813237 2937686 2995293 2586655 2675370 2805231 2796030 2846869 2693189 2975070
11644 2975070 2599404 2788890 2585626 2668267 2687882 2625206 3028052 2895136 2694778 2885926
$$ packed form
11716B338879O0707J41826j22017K37762m79716J55436j09487M27316k11411p6549
11706B362746J36249k22782L97106k01003J59753J84431k41900l730k06977Q5410
11696B449303K08693l79106K79637j82198J12720q5m9767J3616q1169J37120J27787
11685B636551m8458j1242L5848R273J66599j31000R9670N8345q6774P490N2405
11674B788707J39950j54732n5019o0682j01494L46854j90335J02630K1483N1492
11664B888854j68235j07557J65935M08542m60319J03770k03632K17129p0452o7152
11654B706883J06354J24449N7607m08638Q8715J29861r201N0839j53680K81881
11644B975070l75666J89486k03264Q2641J9615o2676M02846j32916k00358J91148
$$ plain form
11634 2885926 2893845 2658695 2466521 2880565 2870028 2784109 3057818 2964940 3088793 2885406
11624 2885406 2875558 2758555 2909212 2809537 2826088 2806564 2669876 2724749 2829662 2705191
11614 2705191 2588635 2501552 2706771 2755788 2918304 2780717 2988735 3118470 2979633 2685737
11604 2685737 2960006 3025883 3019419 2938056 2976660 2999959 3186029 3173422 2994360 3057092 3232418
11593 3232418 3206565 3160108 3078095 3093747 3156743 3115807 2939909 2810553 3002669 3079851 2910934
11582 2910934 3009551 2979551 2882053 3013451 3011867 3319871 3171637 2981357 3310394 3275364
11572 3275364 3095837 3270627 3039353 3303847 3186355 3058400 3023838 3207080 3324002 3171930
11562 3171930 3605275 3257644 3059821 3255120 3100937 3014158 2984989 3075777 3031406 2975479
$$ packed form
11634B885926P919k35150j92174M14044j0537q5919K73709r2878J23853k03387
11624B885406r848j17003J50657r9675J6551j9524j36688N4873J04913j24471
11614B705191j16556q7083K05219M9017J62516j37587K08018J29735j38837k93896
11604B685737K74269O5877o464q1363L8604K3299J86070j2607j79062O2732J75326
11593C232418k5853m6457q2013J5652O2996m0936j75898j29356J92116P7182j68917
11582B910934R8617l0000r7498J31398j584L08004j48234j90280L29037l5030
11572C275364j79527J74790k31274K64494j17492j27955l4562J83242J16922j52072
11562C171930M33345l47631j97823J95299j54183q6779k9169R0788m4371n5927
$$ plain form
11552 2975479 3297424 3406605 3039785 3249147 3230003 2899101 3091044 2973715 3017335 3093385
11542 3093385 3186087 3090673 3171332 3069235 2823927 3064232 3095338 3041959 2793193 3059612
11532 3059612 2965037 3029319 2951432 3078436 2919902 3163854 3184919 2930635 3167481 2983622
11522 2983622 3107904 3202499 3052264 3039474 2910574 2967841 3097606 2684545 2978788 3049288
11512 3049288 3129570 3136910 3139780 3190588 3150447 3097372 3357546 3249246 3290179 3076378 3095546
11501 3095546 3423895 3122678 3068356 3050153 3096388 3129360 3105125 3108638 3056836 3374897 3154105
11490 3154105 3307605 3107054 3107860 3065612 3296015 3373234 3555061 3565730 3558331 3344885 3328294
11479 3328294 3449016 3375801 3407867 3270772 3580925 3446480 3188802 3355633 3525092 3479162
$$ packed form
11552B975479L21945J09181l66820K09362j9144l30902J91943j17329M3620P6050
11542C093385R2702r5414Q0659j02097k45308K40305L1106n3379k48766K66419
11532C059612r4575O4282p7887J27004j58534K43952K1065k54284K36846j83859
11522B983622J24282R4595j50235j2790j28900N7267J29765m13061K94243P0500
11512C049288Q0282P340K870N0808m0141n3075K60174j08300M0933k13801J9168
11501C095546L28349l01217n4322j8203M6235L2972k4235L513n1802L18061k20792
11490C154105J53500k00551Q06m2248K30403P7219J81827J0669p399k13446j6591
11479C328294J20722p3215L2066j37095L10153j34445k57678J66831J69459m5930
$$ plain form
11469 3479162 3368542 3208406 3351216 3416829 3317287 3245125 3212494 3147369 3112450 3133860 3393474
11458 3393474 3134466 3054477 3115427 3429670 3212639 3405742 3144736 3255166 3359882 3256973
11448 3256973 3287006 3359510 3358692 3345032 3602200 3089034 3345579 3405364 3550662 3452265 3389694
11437 3389694 3456081 3608303 3724151 3536586 3387338 3693650 3955256 3893165 3747344 3752662
11427 3752662 3931050 4080224 4009074 4267659 4281338 4216554 4323167 4480492 4644237 4615075
11417 4615075 4436633 4749247 4707985 4717962 4708848 4889811 5007263 5101281 5107749 5221678 5276620
11406 5276620 5388017 5434302 5676609 5632596 5759448 5914500 6010885 6116425 6195204 6227140
11396 6227140 6184216 6408718 6591090 6821905 6870943 6950245 6912285 7102541 7254258 7212199
$$ packed form
11469C479162j10620j60136J42810O5613r9542p2162l2631o5125l4919K1410K59614
11458C393474k59008p9989O0950L14243k17031J93103k61006J10430J04716j02909
11448C256973L0033P2504q18j3660K57168n13166K56545N9785J45298r8397o2571
11437C389694O6387J52222J15848j87565j49248L06312K61606o2091j45821N318
11427C752662J78388J49174p1150K58585J3679o4784J06613J57325J63745k9162
11417D615075j78442L12614m1262R977r114J80963J17452R4018O468J13929N4942
11406E276620J11397M6285K42307m4013J26852J55052R6385J05540P8779L1936
11396F227140m2924K24502J82372K30815M9038P9302l7960J90256J51717m2059
$$ plain form
11386 7212199 7529923 7614468 7756573 7700985 7942840 7917411 8269300 7950128 8058888 8376553
11376 8376553 8466127 8483833 8513889 8140941 8756632 8786019 8791863 8875872 8847510 9204206 9193789
11365 9193789 9288733 9061684 9079088 9267144 9231371 9430456 9273161 9381462 9399001 9591983
11355 9591983 9327083 9294371 9390664 9582570 9331389 9177190 9367827 9128789 9224006 9182737
11345 9182737 8724353 9132971 8863036 9074039 8590437 8851523 8747722 8569759 8324105
11336 8324105 8021129 8359514 8125155 8322904 8021029 8048751 7785105 7793421 7767226 7681256
11326 7681256 7418328 7423845 7311354 7350795 7002553 6729089 6921507 6893689 6689375 6678082
11316 6678082 6485391 6361929 6302511 5928874 5806160 5921426 5746689 5564812 5714569 5228292
$$ packed form
11386G212199L17724Q4545J42105n5588K41855k5429L51889l19172J08760L17665
11376H376553Q9574J7706L0056l72948O15691K9387N844Q4009k8362L56696j0417
11365I193789R4944k27049J7404J88056l5773J99085j57295J08301J7539J92982
11355I591983k64900l2712R6293J91906k51181j54199J90637k39038R5217m1269
11345I182737m58384M08618k69935K11003m83602K61086j03801j77963k45654
11336H324105l02976L38385k34359J97749l01875K7722k63646Q316k6195q5970
11326G681256k62928N517j12491L9441l48242k73464J92418k7818k04314j1293
11316F678082j92691j23462n9418l73637j22714J15266j74737j81877J49757m86277
$$ plain form
11306 5228292 5213082 5224669 5137866 4982520 4816768 4623196 4825217 4693094 4411013 4504221
11296 4504221 4415235 4312047 4193295 4388164 4146877 3960862 3910594 4310380 4029778 3915480
11286 3915480 3836144 3644198 3599216 3475792 3491343 3351128 3284075 3497380 3479370 3354137
11276 3354137 3385337 3162491 3375728 3344391 3071243 2852583 3137062 3159164 3015361 3231109
11266 3231109 3204535 3117166 2984071 2946204 2850180 3087316 2960483 2971750 2887311 2984162 2797647
11255 2797647 2818403 3078752 2818148 2713445 2855978 3039575 2653470 2867585 2870989 2856612
11245 2856612 2829340 2775538 2849525 2814687 2760836 2749945 2820841 2607572 2573853 2799076 2640225
11234 2640225 2757539 2665941 2818051 2784345 2846372 2979159 3010869 3208892 3345731 3916613
$$ packed form
11306E228292j5210J1587q6803j55346j65752j93572K02021j32123k82081R3208
11296D504221q8986j03188j18752J94869k41287j86015n0268L99786k80602j14298
11286C915480p9336j91946m4982j23424J5551j40215o7053K13305j8010j25233
11276C354137L1200k22846K13237l1337k73148k18660K84479K2102j43803K15748
11266C231109k6574q7369j33095l7867r6024K37136j26833J1267q4439R6851j86515
11255B797647K0756K60349k60604j04703J42533J83597l86105K14115L404j4377
11245B856612k7272n3802P3987l4838n3851j0891P0896k13269l3719K25223j58851
11234B640225J17314r1598J52110l3706O2027J32787L1710J98023J36839N70882
$$ plain form
11224 3916613 4817833 5549439 6175301 6138832 6728411 6977720 6989023 7011858 6682244 6282873
11214 6282873 5458121 4354732 3897987 3334596 3262085 3112575 2997137 3200730 2804808
11205 2804808 3078299 2906559 2954278 3142367 2905207 3223816 3151897 3375168 3602634 4259706
11195 4259706 5098489 5575510 6420176 6520694 6954158 6802929 7154095 7128453 6618696 6285610
11185 6285610 5493010 4448046 3690119 3502287 3258430 3079722 3058503 3064197 2885524 2897991
11175 2897991 2833584 3091864 2886376 2997648 2881719 3149409 3217452 3170397 3137494 3149590
11165 3149590 3057636 2963670 3194961 3215862 3021339 3182101 3178413 3099576 3102176 3376720 3039098
11154 3039098 3199143 3204238 3098961 2952946 3265773 3216097 3140120 3245731 3356853 3199586
$$ packed form
11224C916613R01220P31606O25862l6469N89579K49309J1303K2835l29614l99371
11214F282873q24752j103389m56745n63391p2511j49510j15438K03593l95922
11205B804808K73491j71740M7719J88089k37160L18609p1919K23271K27466O57072
11195D259706Q38783M77021Q44666J00518M33464j51229L51166k5642n09757l33086
11185F285610p92600j044964p57927j87832k43857j78708k1219N694j78673J2467
11175B897991o4407K58280k05488J11272j15929K67690O8043m7055l2903J2096
11165C149590r1954r3966K31291K0901j94523J60762l688p8837K600K74544l37622
11154C039098J60045N095j05277j46015L12827m9676p5977J05611J11122j57267
$$ plain form
11144 3199586 3189533 3318029 3250913 3540166 3619537 3426391 3394715 3317094 3434729 3477662
11134 3477662 3476989 3547376 3678116 3433557 3574508 3679050 3539453 3561450 3737346 3520246
11124 3520246 3579466 3817418 3583730 3455228 3586256 3800175 3967753 3838282 3633041 3636370
11114 3636370 3925920 3704777 3723688 4010346 3667492 4059663 3617876 3888509 3887215 3706272
11104 3706272 3904406 4091393 3711442 3959511 4047879 3887885 3789023 3697763 3761306 3905583
11094 3905583 3891003 3927000 3953383 3768964 3996796 3782054 3973889 3949010 3648344 3966193
11084 3966193 3663499 3724919 3897887 3898476 3996602 3792480 3761353 3692059 3993962 3865635 3766717
11073 3766717 4065365 3896680 4104563 4246378 4197830 4111531 4333821 4077557 4050157 4455308
$$ packed form
11144C199586j0053J28496o7116K89253P9371j93146l1676p7621J17635M2933
11134C477662o73P0387J30740k44559J40951J04542j39597K1997J75896k17100
11124C520246N9220K37952k33688j28502J31028K13919J67578j29471k05241L329
11114C636370K89550k21143J8911K86658l42854L92171m41787K70633j294j80943
11104C706272J98134J86987l79951K48069Q8368j59994r8862r1260O3543J44277
11094C905583j4580L5997K6383j84419K27832k14742J91835k4879l00666L17849
11084C966193l02694O1420J72968N89R8126k04122l1127o9294L01903j28327r8918
11073C766717K98648j68685K07883J41815m8548q6299K22290k56264k7400M05151
$$ plain form
11063 4455308 4490760 4453355 4720611 4906757 4899286 4761763 4936979 4850761 5065713 5142042
11053 5142042 5311914 5247420 5261372 5055513 5325002 5479825 5385221 5254473 5521983 5694308
11043 5694308 5576062 5746982 5736736 5812425 5874656 6179972 6530567 6461765 6377621 6851464
11033 6851464 6995496 7060452 7352245 7537312 7810996 7774472 7905793 7977169 8281146 8164755
11023 8164755 8190430 8298515 8305238 8839388 8511719 8799390 8992157 9076312 9184384 9173699
11013 9173699 9433130 9329251 9619233 9916546 10005477 10254702 10583867 11073738 11345491 11468929
11003 11468929 11708317 11778262 12165062 12407310 12311885 12536839 12540995 12590025 12733022 12790264
10993 12790264 13091756 13127231 13268802 13227824 13297827 13560573 13727129 14023706 14094705 14663827
$$ packed form
11063D455308L5452l7405K67256J86146p471j37523J75216q6218K14952P6329
11053E142042J69872o4494J3952k05859K69489J54823r4604j30748K67510J72325
11043E694308j18246J70920j0246P5689O2231L05316L50595o8802q4144M73843
11033F851464J44032O4956K91793J85067K73684l6524J31321P1376L03977j16391
11023H164755K5675J08085O723N34150l27669K87671J92767Q4155J08072j0685
11013I173699K59431j03879K89982K97313Q8931K49225L29165M89871K71753J23438
11003A1468929K39388O9945L86800K42248r5425K24954M156M9030J42997N7242
10993A2790264L01492L5475J41571m0978P0003K62746J66556K96577P0999N69122
$$ plain form
10983 14663827 14945317 15353428 15843088 16082833 16923109 17153806 17282922 17794894 18076486
10974 18076486 18222588 18445754 18394432 18440743 18659317 18751375 19174256 19566669 20025525 20385050
10964 20385050 20795371 21516908 21930529 22395841 22973633 23712320 24236329 24744776 25398606
10955 25398606 26276771 26739085 27449113 28248882 28310591 28991654 29449906 29936728 30113866
10946 30113866 30611344 31174154 31627482 31685175 32384766 32953072 33902396 34578404 35250303
10937 35250303 36123215 36971903 37669796 38408291 39094188 39916848 40416115 41236376 41778113
10928 41778113 42231067 42806442 43191909 43725070 43945824 44437814 44714861 44610383 44907095
10919 44907095 44857480 44900908 44617268 44430884 44677646 44501411 44408206 43932808 44184055 44032272
$$ packed form
10983A4663827K81490M08111M89660K39745Q40276K30697J29116N11972K81592
10974A8076486J46102K23166n1322M6311K18574R2058M22881L92413M58856L59525
10964B0385050M10321P21537M13621M65312N77792P38687N24009N08447O53830
10955B5398606Q78165M62314P10028P99769O1709O81063M58252M86822J77138
10946C0113866M97478N62810M53328N7693O99591N68306R49324O76008O71899
10937C5250303Q72912Q48688O97893P38495O85897Q22660M99267Q20261N41737
10928D1778113M52954N75375L85467N33161K20754M91990K77047j04478K96712
10919D4907095m9615M3428k83640j86384K46762j76235r3205m75398K51247j51783
$$ plain form
10909 44032272 44037426 44031211 44136179 44487785 44424787 44778503 45198948 45389540 45944697 46359825
10899 46359825 46836617 47307605 48297003 49216317 49948768 51110959 52144519 53754448 55431356
10890 55431356 57410461 59417191 61714131 64407006 67409792 70954916 74289416 78596330
10882 78596330 82956030 87519297 91929739 95990504 99825914 102930835 105161457 106880939
10874 106880939 107481579 107062352 105879692 104260835 101228984 98162295 94282985 90471466
10866 90471466 86008617 81903178 77928048 73737869 69805537 66001441 62353274 58753757
10858 58753757 55310482 52166598 48997597 46210242 43296814 40773497 38551281 36427507
10850 36427507 34191715 32257403 30280590 28702102 27206024 25713197 24502588 23152966
$$ packed form
10909D4032272N154o215J04968L51606o2998L53716M20445J90592N55157M15128
10899D6359825M76792M70988R89398R19314P32451J162191J033560J609929J676908
10890E5431356J979105K006730K296940K692875L002786L545124L334500M306914
10882G8596330M359700M563267M410442M060765L835410L104921K230622J719482
10874A06880939O00640m19227j182660j618857l031851l066689l879310l811519
10866I0471466m462849m105439l975130m190179l932332l804096l648167l599517
10858E8753757l443275l143884l169001k787355k913428k523317k222216k123774
10850C6427507k235792j934312j976813j578488j496078j492827j210609j349622
$$ plain form
10842 23152966 21909544 20674446 19933567 18655911 18053110 17276947 16369624 15507229 15052814
10833 15052814 14357279 13729805 13335115 12709943 12464195 11802094 11441993 11043533 10543646
10824 10543646 10391507 9854719 9681261 9373653 9133636 8528417 8531306 8451034 8106772 7990200
10814 7990200 7918826 7748386 7501315 7236709 7349412 6923799 6762737 6563567 6377731 6409240
10804 6409240 6255729 6130530 5803021 5809034 5803258 5753100 5662351 5383991 5347376 4914613 5170886
10793 5170886 5013138 4737448 4927425 4878337 4760906 4639575 4702846 4468700 4551579 4428771
10783 4428771 4440452 4254815 4157238 4367101 3981804 4175879 3664021 4141558 3875061 3820892
10773 3820892 3582590 3845355 3573043 3647365 3727543 3509858 3435659 3511575 3608043 3302983
$$ packed form
10842B3152966j243422j235098p40879j277656o02801p76163r07323q62395m54415
10833A5052814o95535o27474l94690o25172k45748o62101l60101l98460m99887
10824A0543646j52139n36788j73458l07608k40017o05219K889q0272l44262j16572
10814G990200p1374j70440k47071k64606J12703m25613j61062j99170j85836L1509
10804F409240j53511j25199l27509O013n776n0158r0749k78360l6615m32763K56273
10793E170886j57748k75690J89977m9088j17431j21331O3271k34146Q2879j22808
10783D428771J1681j85637r7577K09863l85297J94075n11858M77537k66497n4169
10773C820892k38302K62765k72312P4322Q0178k17685p4199P5916R6468l05060
$$ plain form
10763 3302983 3172060 3510773 3574570 3315705 3603549 3575465 3431515 3519903 3556262 3620619
10753 3620619 3591944 3475525 3465216 3357440 3414648 3225934 2914100 3075614 3372883 2960229
10743 2960229 2769535 2703171 2637276 2813829 2695255 2768372 2647238 2690851 2588501 2705601
10733 2705601 2975325 3143721 3355474 3465209 3288683 3193259 3503958 3490072 3301910 3419714
10723 3419714 3080283 2846818 2841532 2771857 2852952 2752316 2489506 2541274 2613006 2562401 2459473
10712 2459473 2630979 2631362 2489964 2468500 2826464 2470514 2634495 2797588 2970565 2864572
10702 2864572 2970495 2738635 2706410 2895100 2952084 2912017 2662630 2723293 2586651 2552536
10692 2552536 2426180 2479416 2367701 2450429 2494620 2661274 2344188 2716933 2347407 2276562
$$ packed form
10763C302983j30923L38713O3797k58865K87844k8084j43950Q8388L6359O4357
10753C620619k8675j16419j0309j07776N7208j88714l11834J61514K97269m12654
10743B960229j90694o6364o5895J76553j18574P3117j21134M3613j02350J17100
10733B705601K69724J68396K11753J09735j76526r5424L10699j3886j88162J17804
10723C419714l39431k33465n286o9675Q1095j00636k62810N1768P1732n0605j02928
10712B459473J71506L83j41398k1464L57964l55950J63981J63093J72977j05993
10702B864572J05923k31860l2225J88690N6984m0067k49387O0663j36642l4115
10692B552536j26356N3236j11715Q2728M4191J66654l17086L72745l69526p0845
$$ plain form
10682 2276562 2486258 2368438 2560868 2810158 2606265 2545039 2767008 2586989 2830495 2737679
10672 2737679 2833087 2846220 2805171 2700389 2436012 2481072 2436994 2416700 2102551 2309387
10662 2309387 2280195 1971462 2136723 2179686 2421788 2404745 2348705 2402744 2303686 2363135 2410857
10651 2410857 2307205 2449113 2614520 2383257 2453420 2462184 2322129 2286337 2074809 2101302
10641 2101302 2013575 1969372 1802421 1919427 1794495 1947466 1802369 1824179 1939982 1924516
10631 1924516 1757941 1840608 1791290 1811077 1597671 1665001 1810933 1729363 1799097 1765094 1702010
10620 1702010 1751578 1655563 1894047 1780561 1810174 1714675 2067218 1722699 1644313 1765863
10610 1765863 1668806 1699848 1819606 1791453 1639610 1959859 1737660 1670698 1679939 1890197
$$ packed form
10682B276562K09696j17820J92430K49290k03893o1226K21969j80019K43506r2816
10672B737679R5408J3133m1049j04782k64377M5060m4078k0294l14149K06836
10662B309387k9192l08733J65261M2963K42102j7043n6040N4039r9058N9449M7722
10651B410857j03652J41908J65407k31263P0163Q764j40055l5792k11528K6493
10641B101302q7727m4203j66951J17006j24932J52971j45097K1810J15803j5466
10631A924516j66575Q2667m9318J9787k13406O7330J45932q1570O9734l4003o3084
10620A702010M9568r6015K38484j13486K9613r5499L52543l44519p8386J21550
10610A765863r7057L1042J19758k8153j51843L20249k22199o6962R241K10258
$$ plain form
10600 1890197 1841780 1742190 1803935 1669091 1950035 1440579 1725416 1416644 1973252 1761937
10590 1761937 1788236 1870035 1661623 1580814 1711555 1737010 1575333 1738384 1774308 1634141
10580 1634141 1593093 1707832 1762366 1982357 1886027 2123197 1868065 1923302 2020647 1941537
10570 1941537 1895317 1639787 1643436 1796562 1686498 1699541 1735398 1639861 1601715 1467034 1498261
10559 1498261 1622205 1510161 1512472 1527137 1591673 1447740 1405906 1519723 1338879 1108505
10549 1108505 1458843 1369442 1348529 1402771 1366486 1330198 1404979 1084630 1301261 1356830 1323202
10538 1323202 1400017 1297106 1301169 1247989 1245466 1623146 1038030 1526282 1444543 1353963 1405587
10527 1405587 1496830 1481460 1479346 1620356 1548189 1711788 1727039 2002202 2205473 2220997 2426873
$$ packed form
10600A890197m8417r9590O1745j34844K80944n09456K84837l08772N56608k11315
10590A761937K6299Q1799k08412q0809J30741K5455j61677J63051L5924j40167
10580A634141m1048J14739N4534K19991r6330K37170k55132N5237R7345p9110
10570A941537m6220k55530L649J53126j10064J3043L5857r5537l8146j34681L1227
10559A498261J23944j12044K311J4665O4536j43933m1834J13817j80844k30374
10549A108505L50338q9401k0913N4242l6285l6288P4781l20349K16631N5569l3628
10538A323202P6815j02911M063n3180k523L77680n85116M88252q1739r0580N1624
10527A405587R1243j5370k114J41010p2167J63599J5251K75163K03271J5524K05876
$$ plain form
10516 2426873 2458813 2578343 2531936 2885175 2770952 2302914 2317168 2147109 1756478 1526178
10506 1526178 1633696 1692889 1610884 1601200 1603081 1707691 1528739 1795273 1893901 1635256 1745813
10495 1745813 1765972 1860450 1889241 2157117 2649007 2642898 2861614 2692047 2848000 2683452
10485 2683452 2630166 2876869 2601273 2453367 2341482 2306738 2001313 1994723 1843344 1907043
10475 1907043 1959272 1950158 1887282 2063554 2033747 1986325 2178778 2038983 2310148 2543227
10465 2543227 2483752 2425303 2475927 2793151 2632432 2717989 2357500 2534366 2385991 2245371
10455 2245371 2198576 2077876 2067086 2038330 2326848 2200135 2185021 2220083 2469559 2386233
10445 2386233 2066511 2441449 2214064 2306431 2616565 2971619 3035986 3471846 3502024 3941083
$$ packed form
10516B426873L1940J19530m6407L53239j14223m68038J4254j70059l90631k30300
10506A526178J07518N9193q2005r684J881J04610j78952K66534R8628k58645J10557
10495A745813K0159R4478K8791K67876M91890o109K18716j69567J55953j64548
10485B683452n3286K46703k75596j47906j11885l4744l05425o590j51379O3699
10475A907043N2229r114o2876J76272k9807m7422J92453j39795K71165K33079
10465B543227n9475n8449N0624L17224j60719Q5557l60489J76866j48375j40620
10455B245371m6795j20700j0790k8756K88518j26713j5114L5062K49476q3326
10445B386233l19722L74938k27385R2367L10134L55054O4367M35860L0178M39059
$$ plain form
10435 3941083 3694322 4157621 3936320 3796662 3900314 3559224 3037723 2896809 2436297
10426 2436297 2510525 2513101 2127658 2229720 2493917 2126094 2248829 2447884 2359568 2366165
10416 2366165 2173340 2273992 2296443 2322716 2488994 2847689 2899832 3063706 3082896 3461676
10406 3461676 3495277 3818848 3608739 3662143 3512974 3246108 3088258 2922744 3070845 3079098
10396 3079098 3461608 3430602 3305893 3591674 3540608 3969844 3730417 3592574 3917522 3961837
10386 3961837 3864569 3766493 3846127 3800269 3980177 4167201 3999007 3973410 4251115 4629861
10376 4629861 4717406 4586117 4687815 4548411 4642053 4895521 5205606 5274917 5182110 5324341
10366 5324341 5439845 5262146 5253803 5264891 5150184 5006446 4923484 4913631 4532438 4458770 4462039
$$ packed form
10435C941083k46761M63299k21301j39658J03652l41090n21501j40914m60512
10426B436297P4228K576l85443J02062K64197l67823J22735J99055q8316O597
10416B366165j92825J00652K2451K6273J66278L58695N2143J63874J9190L78780
10406C461676L3601L23571k10109N3404j49169k66866j57850j65514J48101Q253
10396C079098L82510l1006j24709K85781n1066M29236k39427j37843L24948M4315
10386C961837r7268r8076P9634m5858J79908J87024j68194k5597K77705L78746
10376D629861Q7545j31289J01698j39404R3642K53468L10085O9311r2807J42231
10366E324341J15504j77699q343J1088j14707j43738q2962r853l81193p3668L269
$$ plain form
10355 4462039 4295784 4692307 4308529 4385232 4564476 4501723 4425549 4569665 4601100 4369314
10345 4369314 4222406 4153818 4175368 4380515 4521447 4036581 4100390 4343651 4544990 4715228
10335 4715228 4689063 4766692 4882798 4793374 4936999 4834030 4758916 4540445 4644767 4486382
10325 4486382 4501257 4464927 4255468 4596542 4676056 4523560 4331749 4538187 4657166 4607220
10315 4607220 4581484 4611845 4804257 4869164 4728449 4956364 5436701 5320652 5379353 5489835
10305 5489835 5694966 5710673 5852293 5787612 5842768 5804171 5856707 5701257 5799153 5840832 6149504
$$ packed form
10355D462039j66255L96523l83778P6703J79244o2753p6174J44116L1435k31786
10345D369314j46908o8588K1550K05147J40932m84866O3809K43261K01339J70238
10335D715228k6165P7629J16106q9424J43625j02969p5114k18471J04322j58385
10325D486382J4875l6330k09459L41074P9514j52496j91811K06438J18979m9946
10315D607220k5736L0361J92412O4907j40715K27915M80337j16049N8701J10482
10305E489835K05131J5707J41620o4681N5156l8597N2536j55450R7896M1679L08672
$$ [...]
##END NTUPLES=NMR SPECTRUM
##END=
