##TITLE=Coffee green (M3-ROVE90 + 1.5mL buffer 50/50,  450uL extracto + 50uL (D2O+TMS))
without heating, vortex and centrifuged, temperature 0oC.
##JCAMPDX= 6.0         $$ Bruker NMR JCAMP-DX V2.0
##DATA TYPE= NMR SPECTRUM
##DATA CLASS= NTUPLES
##ORIGIN= Bruker BioSpin GmbH
##OWNER= Administrator
$$ 1.72 TOPSPIN		Version 2.1
$$ 2012-05-22 16:17:06.481 -0700  Administrator@X
$$ Compression mode = diff/dup
##.OBSERVE FREQUENCY= 400.13188198
##.OBSERVE NUCLEUS= ^1H
##.ACQUISITION MODE= SIMULTANEOUS (DQD)
##.ACQUISITION SCHEME= undefined
##.AVERAGES= 64
##.DIGITISER RES= 22
##SPECTROMETER/DATA SYSTEM= spect
##.PULSE SEQUENCE= noesygppr1d
##.SOLVENT NAME= H2O+D2O
##.SHIFT REFERENCE= INTERNAL, H2O+D2O, 1, 14.97969
##AUDIT TRAIL= $$ (NUMBER, WHEN, WHO, WHERE, PROCESS, VERSION, WHAT)
$$ ##TITLE= Audit trail, TOPSPIN		Version 2.1
$$ ##JCAMPDX= 5.01
$$ ##ORIGIN= Bruker BioSpin GmbH
$$ ##OWNER= Administrator
$$ $$ C:\Bruker\TOPSPIN/data/jwist/nmr/11-coffee-green-quantification-2/341/pdata/1/auditp.txt
$$ ##AUDIT TRAIL=  $$ (NUMBER, WHEN, WHO, WHERE, PROCESS, VERSION, WHAT)
(   1,<2011-11-18 16:27:39.747 -0500>,<Administrator>,<TOPSPIN>,<go>,<TOPSPIN 2.1>,
      <created by zg
	started at 2011-11-18 16:18:45.263 -0500,
	POWCHK enabled, PULCHK disabled,
       configuration hash MD5:
       DA 63 81 1B EF 4C B5 72 B4 DF EA D9 B4 DB 4C 08
       data hash MD5: 64K
       81 2D E2 E7 3E 31 B0 83 8A 61 99 66 B3 A7 56 39>)
(   2,<2011-11-18 16:28:28.700 -0500>,<Administrator>,<TOPSPIN>,<proc1d>,<TOPSPIN 2.1>,
      <Start of raw data processing
       efp LB = 0 FT_mod = 6 PKNL = 1 PHC0 = 0 PHC1 = 0 SI = 32K 
       data hash MD5: 32K
       BA 81 5C D4 D7 EC 2D 63 56 69 6F 0C 09 09 85 DA>)
(   3,<2011-11-18 16:28:29.060 -0500>,<Administrator>,<TOPSPIN>,<proc1d>,<TOPSPIN 2.1>,
      <pk PHC0 = 23.02185 PHC1 = 0 
       data hash MD5: 32K
       0C 99 ED 1B 58 EC D2 0B 7E A6 78 F6 3A 99 E6 65>)
$$ ##END=
$$ 
$$ $$ hash MD5
$$ $$ 12 DE 23 85 B7 4F E7 31 C3 B8 95 9F 8A C3 CE CD
##$RELAX= 
##$RELAX= 
##$RELAX= 
##$RELAX= 
##$RELAX= 
$$ Bruker specific parameters
$$ --------------------------
##$DU= <Z:>
##$EXPNO= 341
##$NAME= <11-coffee-green-quantification-2>
##$PROCNO= 1
##$TYPE= <nmr>
##$USER= <jwist>
##$ACQT0= -8.19451213338341
##$AMP= (0..31)
100 100 100 100 100 100 100 100 100 100 100 100 100 100 100 100 100 100
100 100 100 100 100 100 100 100 100 100 100 100 100 100
##$ANAVPT= -1
##$AQSEQ= 0
##$AQ_mod= 3
##$AUNM= <au_prof>
##$AUTOPOS= <>
##$BF1= 400.13
##$BF2= 400.13
##$BF3= 400.13
##$BF4= 400.13
##$BF5= 400.13
##$BF6= 400.13
##$BF7= 400.13
##$BF8= 400.13
##$BYTORDA= 0
##$CFDGTYP= 0
##$CFRGTYP= 9
##$CHEMSTR= <none>
##$CNST= (0..63)
1 1 145 1 1 1 1 1 1 1 1 1 1 1 1 1 1 1 1 1 1 1 1 1 1 1 1 1 1 1 1 1 1 1 1
1 1 1 1 1 1 1 1 1 1 1 1 1 1 1 1 1 1 1 1 1 1 1 1 1 1 1 1 1
##$CPDPRG= <>
##$CPDPRG1= <>
##$CPDPRG2= <>
##$CPDPRG3= <>
##$CPDPRG4= <mlev>
##$CPDPRG5= <mlev>
##$CPDPRG6= <mlev>
##$CPDPRG7= <mlev>
##$CPDPRG8= <mlev>
##$CPDPRGB= <>
##$CPDPRGT= <>
##$D= (0..63)
$$ [...]
##$TP= (0..7)
150 150 150 150 150 150 150 150
##$TP07= 0
##$TPNAME0= <>
##$TPNAME1= <>
##$TPNAME2= <>
##$TPNAME3= <>
##$TPNAME4= <>
##$TPNAME5= <>
##$TPNAME6= <>
##$TPNAME7= <>
##$TPOAL= (0..7)
0.5 0.5 0.5 0.5 0.5 0.5 0.5 0.5
##$TPOFFS= (0..7)
0 0 0 0 0 0 0 0
##$TUNHIN= 0
##$TUNHOUT= 0
##$TUNXOUT= 0
##$USERA1= <user>
##$USERA2= <user>
##$USERA3= <user>
##$USERA4= <user>
##$USERA5= <user>
##$V9= 5
##$VALIST= <valist>
##$VCLIST= <CCCCCCCCCCCCCCC>
##$VD= 0
##$VDLIST= <DDDDDDDDDDDDDDD>
##$VPLIST= <PPPPPPPPPPPPPPP>
##$VTLIST= <TTTTTTTTTTTTTTT>
##$WBST= 2048
##$WBSW= 25
##$XGAIN= (0..3)
0 0 0 0
##$XL= 0
##$YL= 0
##$YMAX_a= 5177845
##$YMIN_a= -1753925
##$ZGOPTNS= <>
##$ZL1= 120
##$ZL2= 120
##$ZL3= 120
##$ZL4= 120
##$ABSF1= 0
##$ABSF2= 0
##$ABSG= 0
##$ABSL= 0
##$ALPHA= 0
##$AQORDER= 0
##$ASSFAC= 0
##$ASSFACI= 0
##$ASSFACX= 0
##$ASSWID= 0
##$AUNMP= <proc_prof1d>
##$AXLEFT= 0
##$AXNAME= <>
##$AXNUC= <1H>
##$AXRIGHT= 0
##$AXTYPE= 0
##$AXUNIT= <>
##$AZFE= 0.1
##$AZFW= 0.1
##$BCFW= 0
##$BC_mod= 0
##$BYTORDP= 0
##$COROFFS= 0
##$CY= 15
##$DATMOD= 1
##$DC= 0
##$DFILT= <>
##$DTYPP= 0
##$F1P= 0
##$F2P= 0
##$FCOR= 0.5
##$FTSIZE= 32768
##$FT_mod= 6
##$GAMMA= 0
##$GB= 0
##$INTBC= 1
##$INTSCL= 1
##$ISEN= 128
##$LB= 0
##$LEV0= 0
##$LPBIN= 0
##$MAXI= 10000
##$MC2= 0
##$MEAN= 0
##$ME_mod= 0
##$MI= 0
##$NCOEF= 0
##$NC_proc= -7
##$NLEV= 6
##$NOISF1= 0
##$NOISF2= 0
##$NSP= 0
##$NTH_PI= 0
##$NZP= 0
##$OFFSET= 14.97969
##$PC= 1
##$PHC0= 23.02185
##$PHC1= 0
##$PH_mod= 1
##$PKNL= yes
##$PPARMOD= 0
##$PPDIAG= 0
##$PPIPTYP= 0
##$PPMPNUM= 2147483647
##$PPRESOL= 1
##$PSCAL= 4
##$PSIGN= 0
##$PYNMP= <proc.py>
##$REVERSE= no
##$SF= 400.13
##$SI= 32768
##$SIGF1= 0
##$SIGF2= 0
##$SINO= 400
##$SIOLD= 32768
##$SPECTYP= <>
##$SREGLST= <1H.CDCl3>
##$SSB= 0
##$STSI= 32768
##$STSR= 0
##$SW_p= 8223.68421052631
##$SYMM= 0
##$S_DEV= 0
##$TDeff= 65536
##$TDoff= 0
##$TI= <>
##$TILT= no
##$TM1= 0
##$TM2= 0
##$TOPLEV= 0
##$USERP1= <user>
##$USERP2= <user>
##$USERP3= <user>
##$USERP4= <user>
##$USERP5= <user>
##$WDW= 1
##$XDIM= 32768
##$YMAX_p= 536912958
##$YMIN_p= -90158739
##$CURPLOT= <Network HP LaserJet P1505>
##$CURPRIN= <$Network HP LaserJet P1505>
##$DFORMAT= <normdp>
##$LAYOUT= <+/1D_H.xwp>
##$LFORMAT= <normlp>
##$PFORMAT= <normpl>
##$SURQMSG= 1
$$ End of Bruker specific parameters
$$ ---------------------------------
##NTUPLES= NMR SPECTRUM
##VAR_NAME=  FREQUENCY,     SPECTRUM/REAL,   SPECTRUM/IMAG
##SYMBOL=    X,             R,               I
##VAR_TYPE=  INDEPENDENT,   DEPENDENT,       DEPENDENT
##VAR_FORM=  AFFN,          ASDF,            ASDF
##VAR_DIM=   32768,         32768,           32768
##UNITS=     HZ,            ARBITRARY UNITS, ARBITRARY UNITS
##FACTOR=    0.250966925370066, 1,           1
##FIRST=     8223.43324360094, 163391,       -505731
##LAST=      0,             300577,          169651
##MIN=       0,             -90158739,       0
##MAX=       8223.43324360094, 536912958,    0
$$ Real data points
##PAGE= N=1
##DATA TABLE= (X++(R..R)), XYDATA
$$ [...]
22996 422906 697002 405663 645563 648697 541142 539468 681881 606369 833980 252698
22985 722297 598025 677463 877053 500532 745153 1229755 909207 608658 625919 801310
22975 801310 636280 840649 911583 1417604 1051892 1199083 1294954 1240202 1222037 1484180
22965 1484180 1149965 1246489 1619968 1412797 816312 1122187 438094 1156738 1077290 930947
22955 930947 975551 1280556 1073983 1771097 1642114 1289419 1732453 1787537 2037739 2434743
22945 2434743 3269389 3881175 5366881 6653329 8154664 10752823 12447235 14332461
22937 14332461 16948528 19045323 21219249 23145073 23942191 24341607 24346539 24171431 23055695
22928 23055695 21910443 20203146 17696548 15330191 13104007 11214147 9370395 7713179
22920 7713179 6487367 5225410 4453633 4083089 3869667 4423854 4424039 5547598 6688641
22911 6688641 8140298 9852009 12249109 14926388 17548569 20817340 24220282 28376678
22903 28376678 32126349 35028708 37584654 39115185 40699458 42109878 41351924 40632369
22895 40632369 39227828 36143130 33672088 31519889 28240949 24514050 21614505 18524499
22887 18524499 16164665 14217615 12776406 11820764 11743091 11130838 11961115 12493589 13327720
22878 13327720 14574270 15438475 16362031 17353013 18662769 19314860 20100072 20068251 20497579
22869 20497579 19674676 18873843 17648391 16256326 14431567 13387862 11852590 10174303
22861 10174303 8905996 7495768 6532241 5701034 4574725 3809784 4009431 3027952 2361177
22852 2361177 2503514 2233177 2109633 1836398 1640150 1633774 1268436 1354649 1552298 1573324
22842 1573324 1229891 1216725 1291913 1335615 1391728 879118 1151531 963912 1212602 1191466
22832 1191466 1017331 573033 985307 946392 680941 1068331 713103 527065 762037 503962
22822 503962 1414982 994085 1123654 1030687 1123938 921846 814497 851138 1194518 1251918
22812 1251918 1190102 845650 553543 1067706 1215560 872457 505844 806146 862158 267505
22801 1031872 540028 717652 1106735 1081566 1035932 604320 524937 470830 1025391 928460
22791 928460 471034 714974 663296 928916 601671 1146907 440383 1279701 512762 638558
22781 638558 975063 1040786 944083 739022 963036 763760 567221 1084903 1110817 374513
22770 647062 536236 545712 967773 634884 48871 619096 782799 621451 671717 860627
22760 860627 600588 670479 405847 538123 483400 882337 782152 780838 836953 692359
22750 692359 659957 503714 659064 762563 411342 692764 -31017 849858 434355 866397
22740 866397 915539 620122 1207179 458816 542822 658113 493678 447788 431456 944677
22730 944677 491844 624397 589639 732530 97190 125827 477912 840538 559031 728639
22720 728639 366126 329112 936240 660816 849258 530296 872189 753827 956254 420143
22709 594621 457553 499862 630664 504226 659697 714453 142720 257768 239470 516406
22699 516406 444109 330488 878706 378658 641570 901667 384656 663281 786864 577242
22689 577242 765015 844106 342114 814793 394568 745556 407635 555744 761171 459967
22679 459967 618834 500540 378906 814863 775262 597712 898594 1291141 878971 439568
22669 439568 695852 514793 69969 695444 514882 1067318 989527 515376 1130648 475439
22658 523232 381914 214363 594257 482283 485885 1023723 698156 739205 1006943 1016314
22648 1016314 516703 887517 411143 539076 887162 688500 1044298 598830 242614
22638 799647 526937 596580 283166 1131848 789002 761607 787153 665753 749151 1025216
22628 1025216 822237 709586 1080113 804460 780118 971991 660057 858050 617807 803543
22618 803543 548058 872527 1062711 1151149 763279 1265912 1433604 1223771 803620 748093
22608 748093 1001676 1197054 775662 706860 1081907 983062 978144 1060407 884285 1350112
22598 1350112 1102226 1213501 1509896 1063595 976830 842283 1088721 1292612 642535 1113945
22588 1113945 1163983 1404990 971584 1006630 889641 1153562 928372 757223 698236 1087565
22578 1087565 1284807 1118238 756322 1198716 531448 537897 1315612 776951 817088 570253
22568 570253 846974 1008771 1176973 1275698 1040382 1158549 816369 832055 1191591 1351560
22558 1351560 1367686 941933 1079538 747238 985151 1299529 955177 1061817 1526325 1389108
22548 1389108 635620 1043034 579529 1404361 1090239 1454622 669414 975323 534054
22539 534054 1030849 717141 1375741 417743 1094182 804594 842897 837357 1107946 1014636
22529 1014636 656368 371329 578623 512827 603923 917808 889412 890872 1274769 922191
22519 922191 879439 549907 1581777 746852 992062 907316 590243 572622 1077730 1183381
22509 1183381 760867 1034899 863575 393109 903654 1210918 623826 854737 1207314
22500 1207314 729891 1087567 822559 1268658 1431050 1013561 995593 912924 1059614 904808
22490 904808 1048952 906484 1651743 937655 1027482 1673163 1181179 1224666 1632173 1137314
22480 1137314 748745 827622 1331164 1137652 839299 1067549 887618 1132373 1380890 958369
22470 958369 712580 1228628 813474 344999 705174 848731 534325 1039719 443113 1057395
22460 1057395 1149949 1360654 283649 1340860 1440813 772231 844773 1038035 1027396 462498
22449 1188938 1150738 800374 924054 1332549 1297055 931946 1293575 633375 1016569 247400
22438 989091 1213924 692546 1065838 968558 1516299 957290 898542 1181696 1023686 905813
22428 905813 1301762 922983 1166802 1041213 850093 763304 1309075 1260880 689247 1042532
22418 1042532 919491 608478 980063 823614 1222388 1140398 857358 1234182 782417 1087999
22408 1087999 1019289 792006 589515 879058 715627 1168539 556764 862835 610163 948129
22398 948129 787129 1276440 1065171 998178 866775 975064 1174993 955608 1726367 1115485
22388 1115485 1097250 1399748 1097856 975686 856089 1268900 1626837 542573 673797 1392654
22378 1392654 1222617 1005351 515433 579225 530172 1061938 483968 1151598 953637 1107979
22368 1107979 922058 776524 897323 411493 773560 875770 874702 1374469 876235 1201408
22358 1201408 1056925 1053561 1128982 1017806 1197455 906287 657876 590041 1080742 1143243
22348 1143243 1449195 1229933 867432 1007607 1321403 693509 943592 853418 1216011 779406
22338 779406 1143275 1044304 981227 1283252 1191330 1056173 1368158 1910277 2305038 2608477
22328 2608477 3359027 2750930 3210400 3193824 2268216 3051740 2086265 1931345 1513831 1585254
22318 1585254 1060878 1319705 1325327 1299319 1079913 936005 1477373 962804 1493590 1275840
22308 1275840 1446095 1057158 1552645 1565205 1310832 1415062 1513087 1321965 910216 1475634
22298 1475634 1197239 846796 1609823 1269851 1262666 1454747 1124709 1487707 1483030 954210
22288 954210 1363775 1252436 1063556 1298140 1523676 1123115 1510782 1293590 1403066 1407764
22278 1407764 1381280 1228197 1246662 1652197 1552477 1443577 1061766 1215281 1374427 1317958
22268 1317958 1523200 1749547 2024660 1266966 1408770 1265069 1821197 1942408 1401485
22259 1401485 1546013 1748641 1369851 1229250 1407950 1878505 1312461 1679818 1813212
22250 1813212 1493685 1416954 1558736 1425165 1491734 1704287 1589781 1707196 1931666 1937899
22240 1937899 1594818 1813521 1224091 1768143 1566493 2022144 1983495 1161145 1516130 1885758
22230 1885758 1421434 1234538 1423455 1314471 1137365 1550682 1455404 1637667 1446476 1706546
22220 1706546 1446058 1710178 1672702 1485560 1191201 1384245 1700605 1125394 1152334 1584432
22210 1584432 1691367 1884769 1370133 1283574 1462232 1507305 1454621 2043077 1634763 1633596
22200 1633596 1510834 1344999 1600931 1652440 1489097 1754831 1610396 1535941 1582108 1635559
22190 1635559 1638832 1484778 1521752 1318748 1304083 1758257 1317287 1871716 1523413 1746190
22180 1746190 1550453 1490467 1426351 1378034 1645838 1885948 1447116 1697710 1306794 1822863
22170 1822863 1529594 1476746 1425616 1727907 1765531 1217237 1298010 1103845 1736394 1408644
22160 1408644 1475438 1009328 1470426 1446405 1103804 1584681 1334212 1209976 1682445 1336286
22150 1336286 1152610 1251866 1300930 1686400 1134469 992226 1330415 1229256 1418464 922353
22140 922353 1271677 1666738 1192993 1156408 1590559 1491028 1314962 1241441 915229 1424747
22130 1424747 1455902 1294415 1323445 968803 1409288 1275195 1252119 1418406 1202100 1310516
22120 1310516 1030591 1334192 796691 1340587 923284 1469289 1481763 1225111 1148838 1136148
22110 1136148 1527703 1563379 1524400 1208820 1488442 801029 1721762 1626205 1622762 1176241
22100 1176241 1581694 1608976 1412991 1128683 1077256 1549740 980985 1565447 1583299 1435517
22090 1435517 1220920 1129751 752112 1835088 1302354 1735820 1743995 1254217 1751948 1661515
22080 1661515 1129144 1729298 1802139 1812012 1590479 1467265 1666800 1265188 1350198 1752215
22070 1752215 1495817 1433281 1363576 1615453 1177429 1479716 1754956 1694176 1331638 1538414
22060 1538414 1273719 1063889 2148686 1515359 2415161 1557180 1859406 1756818 2111650
22051 2111650 1980196 1732952 1765301 1508826 1724764 1814861 1416058 1420134 1694368 1700677
22041 1700677 1784020 1935020 2163784 1441206 1610505 1818478 1514896 1280185 1331654 1743682
22031 1743682 1572857 1774002 1553950 1758174 1961471 2120428 1845232 1747947 1438464 1711411
22021 1711411 1352661 1315167 1946453 1681673 2289837 2160473 1889595 1444164 1553607 1591125
22011 1591125 1787909 1139406 1717921 1754164 1832814 1736412 1559182 1823551 1398364 1783805
22001 1783805 1648231 1605209 2211119 1833570 1576785 1707070 1809494 2081434 1290691 1928159
21991 1928159 1084095 1387353 1632157 1755874 1901694 1781084 1430705 1843205 1508820
21982 1508820 1771597 1785948 1845410 1725974 1817990 1751152 2119626 1928314 2073164 1462139
21972 1462139 1811805 1891190 1514579 1737361 1663394 2145256 1849489 2230829 1648591 1837452
21962 1837452 1902120 1634471 1965541 1657087 1518685 2005436 1512479 1685223 2355636 1970662
21952 1970662 1445301 1599289 1679689 2214033 1855029 1547646 1813502 1483662 1210489 1834601
21942 1834601 1863601 1799580 1857233 1656285 1642645 1703063 2465952 1566376 2113222 1931832
21932 1931832 2149544 1781474 1942036 1675284 1652739 2195863 1637280 1369471 1370730 1655747
21922 1655747 1711477 1430346 1937750 1606763 2110568 1988126 1860413 1556401 1897013 2068619
21912 2068619 2277757 2029625 2152670 1544559 1851799 1682944 1971925 1846215 1903814 2107550
21902 2107550 1822797 1471083 1897466 1144454 1878387 1872924 1792658 1384974 1883427 1514484
21892 1514484 1500334 1515909 1923097 1698156 1569938 1867594 1611581 1855979 1699019 1605028
21882 1605028 1717653 1799464 2508893 1825697 1302258 1888123 1464235 1547039 1833358 1969095
21872 1969095 1460476 2080476 1884190 1938323 1955619 1698963 2134782 1284890 1769112 1952304
21862 1952304 2029893 1985401 2091900 1891924 1119802 1691698 1739612 2048201 1681037 1928124
21852 1928124 1725628 1085000 1495980 1560543 1936435 1636607 1890373 1626462 1571711 1327507
21842 1327507 1398804 1676633 1463052 1579532 1483259 2041147 1858382 1704076 1458521 1129040
21832 1129040 1571056 1951332 1938966 1465738 1603436 1183006 1605460 1253454 1570771 1415762
21822 1415762 1660401 2077872 1938294 1624957 1835820 1925887 1878648 1407370 1828301 1279153
21812 1279153 1885658 1974339 1239018 1246088 1543599 1539631 1480553 2089896 1466362 1543731 2173176
21801 2173176 2011420 1602216 1690643 1469522 1580253 1887084 1893871 1948983 1379441 2120256
21791 2120256 1279899 2114259 1219213 1837002 1428258 1644357 1906851 1770681 1936018
21782 1936018 1476191 1234473 1893347 1529307 1395745 1536110 1640146 1687386 1654587 1389156
21772 1389156 1824919 1704640 1508674 1363888 1678689 1736876 1852114 1739971 1793426 2040138
21762 2040138 1749495 1819916 1830140 2282871 1592114 1541574 1906980 1935706 1884470 1940727
21752 1940727 1808834 2075494 2455644 2072734 2683311 1921494 2816234 3082616 2858530
21743 2858530 3817029 4121629 4182955 4342657 5174579 6518927 7128978 8054029 9199862
21734 9199862 10624074 11741100 12664458 13330649 13753938 13182054 12959310 12540245 12543027
21725 12543027 11580893 9815179 8924423 8579521 7862324 7255442 7180066 6970603 6813745
21716 6813745 7663373 7656859 8059194 8902764 10219659 11666648 12434062 13535014 15228485
21707 15228485 16084730 17194117 18510803 18950775 18935200 19306019 19410652 18945962 18941357
21698 18941357 18421361 17530145 16605628 14737235 13607216 12305514 11205506 9915326
21690 9915326 8990408 8357735 7359497 6998260 6849828 7068324 6691475 7104313 7156224 8297407
21680 8297407 8477116 10319503 10531105 11235891 12240928 12234314 12564089 12675174 12618438 11558973
21670 11558973 11040946 10494869 8862539 7992401 6724829 6419839 5149162 4925330 4939071
21661 4939071 3838967 3646951 3126028 3275520 3134965 2856715 2775530 3012281 2695591
21652 2695591 2672197 2606201 2259633 2796263 2259129 2404040 2318343 2310005 2244353 1845007
21642 1845007 1968243 2063832 1861520 1385628 1904919 1344225 1919000 1598878 1509293 1627626
21632 1627626 1386097 1536142 1296820 1474104 1771329 1468369 1758062 1882399 1768506
21623 1768506 1685742 1933745 1391092 1789814 1543174 1546228 1576496 1655531 1660494 1622267 1770731
21612 1770731 1594380 1621639 1617276 1698562 1139024 1411293 1699335 1948780 1551758 1466492
21602 1466492 1385859 1464993 1217389 2121145 1868503 1579086 1280335 1389281 1944315 910606
21591 1534566 1747911 1548339 1821733 1621873 1713601 1697350 1457953 1963834 1795497 1682658
21581 1682658 2094952 1830411 1607902 1224253 1978541 1005388 2048660 1580483 2270217
21572 2270217 1477708 1891061 2008257 1744628 1621801 2018891 1500808 1435436 1486993 1570898
21562 1570898 1762621 2173886 1761756 1326888 1644188 1256794 1674229 1172920 1714879
21553 1714879 1867357 1192116 1541570 1506040 1654903 1728648 1449483 1463903 1693930 1785351
21543 1785351 1993620 1791484 1794478 1327999 1927719 1484281 1919137 1707017 1258456 1569878
21533 1569878 1463541 1982746 1304857 1505810 1619288 1500736 1741281 1953883 1404459
21524 1404459 1907383 1752419 2081760 1991489 2310602 1871907 1893246 1703598 1833805 2254092
21514 2254092 1648508 1651730 1915574 2067970 1649881 1715261 1853745 2011288 1950966 1920556
21504 1920556 1764918 2308305 1599733 1313521 1068858 1892905 1552512 1853689 1643547
21495 1643547 1747362 2179220 1832329 1917913 1790912 2234545 1933378 1983519 1688633 1850093
21485 1850093 1962057 1633012 2026336 2052198 2091121 2154619 1434070 1946283 2265486 1618532
21475 1618532 1695974 1819150 2041430 1759160 1851965 1653225 1928616 1853510 1859245 2007331
21465 2007331 1993678 1546790 1917550 1904502 2018357 1649844 1913445 2164461 1990984 1822339
21455 1822339 2183820 1968751 2039578 2147842 1856396 1731108 1864992 2093548 2222177 1964931
21445 1964931 2201269 2131071 1767850 2239776 1936758 2151286 2020125 2032123 1863300 1939987
21435 1939987 2052213 2357760 1597451 1870678 1982288 2190347 1954881 2154227 2176712 1886832
21425 1886832 1809058 1903234 1712315 1872039 1705440 1412409 2046260 1744785 2115271 1988901
21415 1988901 1976860 1824890 1714787 1583898 1539291 1537654 2059332 2110956 1819914 1699741
21405 1699741 1582354 2121173 1876518 1491832 1221953 1914432 2251050 2147976 2045392
21396 2045392 1739520 1872375 1878561 2002759 1733812 1890669 1517266 1597041 1740684 1921388
21386 1921388 1758375 1898204 2147334 1986580 2058515 1517823 2131411 2147384 2170704 1537671
21376 1537671 2032203 1571427 1969583 2111924 1969271 2386541 2263186 2176707 2151859 2192426
21366 2192426 2130050 1751400 2349105 1701580 2021603 2092994 2055747 1989982 1577951 2181726
21356 2181726 2221489 2499611 2155550 2189055 1774895 2501189 2519164 2147788 1935837 1868760
21346 1868760 2228098 2519954 2024815 1846436 2300253 1615857 2106304 2266258 1940751
21337 1940751 2344010 2189723 2283000 2138292 2705069 2264332 2591083 2125195 2239907 2630337
21327 2630337 2506265 3128261 2530785 2829646 2199843 2623493 2305880 2368607 2566922 2660590
21317 2660590 2952004 2871612 2919916 3016035 2640051 2995004 2895869 2826052 2974035 3079282
21307 3079282 3131232 3000742 2998112 3238881 2900198 3321334 3413594 3903526 3181261 3514383
21297 3514383 3975448 3803079 3670078 3895330 4006203 4194651 3747198 4654176 4481937
21288 4481937 4673872 5051679 4713784 5123569 6045192 5484159 6173923 6053318 6462943
21279 6462943 7103120 7138760 7945562 7931750 8678037 9064121 10124170 10566175 11427755 12155534
21269 12155534 13804161 14300220 15997155 17419499 19245669 21276303 24322498 27034946
21261 27034946 30217821 34674534 37741099 42201041 46052913 50798801 54218362 57640603
21253 57640603 60185840 60765093 61637419 60302978 58611033 55736576 52205323 48246285
21245 48246285 43764350 39418174 36065614 31968632 28789393 25723625 22410590 20838470
21237 20838470 18336818 16848183 14970340 13597691 12665288 11519626 10791099 9791864
21229 9791864 9063664 8807859 8085292 7862029 7581247 7255981 6728282 6612081 6410464
21220 6410464 5736742 5569740 5408683 4588863 5321824 4544013 4593819 3994010 4095444 3922487
21210 3922487 3680528 4177810 3551727 3822808 3833430 3406931 3256780 3766018 3312975 2966956
21200 2966956 2800653 3010650 3632679 2669132 2579047 2994864 3446529 2909694 2637423 2969199
21190 2969199 2740159 2493800 2645212 2668225 2315656 2782472 2735343 2707184 2579191 2972937
21180 2972937 2840121 2248329 2453438 2759155 2721719 2194057 2496470 2919305 2661255 2157562
21170 2157562 2521160 2416548 2633586 2522637 2391161 2567223 2374916 2358733 2522235 2790859
21160 2790859 2903486 2509685 2763873 2548530 2789515 2437932 2492693 2467119 2322908 2530907
21150 2530907 2029129 2626102 2188335 2500005 2854907 2382255 2146058 2136237 2360872 2403888
21140 2403888 2466301 2465010 2470289 2448664 2131061 2435743 2614527 2603462 2574030 2288471 2091994
21129 2091994 2263033 2332515 2439639 2220608 2246005 2770429 2357215 2095685 2284513 2159679
21119 2159679 2008927 2139193 2415748 2788800 2378438 2417092 1625899 2535252 1800550 2582136
21109 2582136 2109051 2011812 2275305 1941210 1818641 2720787 2429764 2123174 2086416 2325713
21099 2325713 2769800 2613446 3022103 2413339 2835260 2756491 2795862 3283014 2919461 2851035
21089 2851035 2952847 2917535 3215378 2644667 2471545 2750863 2867485 2887897 2710498 2942517
21079 2942517 2676719 2362657 2538170 2873543 2593251 2913571 3116778 2613673 2919112
21070 2919112 2835550 3156254 3354280 3126802 3985815 4242075 4561595 4414840 4994181 4957948
21060 4957948 4503953 4656398 4654582 4324170 4119937 3606673 3805536 3115149 3697127 3684246
21050 3684246 3818127 3315134 3005379 3172410 2785600 2886279 2589829 2968196 2795546
21041 2795546 3308134 2830185 2838997 2575393 2911622 2781567 3107006 2542145 2980405 2599654
21031 2599654 2788735 2587148 2984342 2711654 2999657 2645316 3324970 3281603 3702366 3532143
21021 3532143 3273253 3154364 3629219 3326608 3350814 3522676 4109026 3835656 4435529 4792504
21011 4792504 5712913 6462141 7799507 8918532 10124459 11009641 11546599 12043484 12073993
21002 12073993 11329900 10726421 10127401 9156270 8444380 7875237 7152873 6932713 6293777
20993 6293777 6349531 5888742 5347669 6006658 5311635 5333066 5145226 5483328 4962082 4717930
20983 4717930 4685646 5298243 5293865 5718899 5783030 6488882 7462493 8472075 9946346 11715608
20973 11715608 12728738 13849039 15022879 15654486 15805796 14946514 14290164 12748060 11579843
20964 11579843 9602347 8190080 7145510 6745917 5732038 5625257 5422590 5564304 5742179
20955 5742179 5223717 5005556 4916427 5670560 5861241 6092880 6732240 7622620 7607077 9556056
20945 9556056 10278714 12128215 13260799 13917334 14285244 15187948 15074314 15500545 15306881
20936 15306881 14903132 15073926 15365688 15763777 15720282 15543473 15499680 14533405 14269193 14278647
20926 14278647 13783882 14032035 15085121 16922871 18739981 22223394 26293721 30451084
20918 30451084 35948023 41244134 44953822 48973117 51114176 51702719 51331933 48608518
20910 48608518 46554964 42973373 39305233 35929408 32208004 28660077 26189714 22258971
20902 22258971 19513973 17337515 14393980 12501417 11107757 9177336 8931131 7778306
20894 7778306 7340828 6844776 6649064 6239278 6098150 5898137 6032545 5502429 5161212
20885 5161212 5526063 5353888 5513396 5472835 5262150 5823672 5817358 5795565 6390654 6955242
20875 6955242 7654401 9370435 9901639 10598782 12173493 12853140 13978099 13777018 13669387
20866 13669387 13567994 13158526 12519951 12502981 12667017 13886982 15242698 17055485 20150021
20857 20150021 23422699 27981887 33346700 38234076 43296566 46811626 48973474 49475338
20849 49475338 48830553 45587531 41797008 36752854 31015803 25704412 21485011 18366731
20841 18366731 14848577 12780915 11226248 9743840 8607988 8080297 8163759 6706934
20833 6706934 6180007 5815187 5506755 4871608 5308058 4602705 5038801 4456517 4616994
20824 4616994 4309353 4630638 4113197 3877873 3613007 3550777 4131875 3941772 3571070 3804218
20814 3804218 4032969 3275861 3905205 3597343 3395632 3788338 3728506 3954394 3982978 3836807
20804 3836807 3626967 3523776 3766408 3725320 3757869 3748878 3827231 3569928 3902167 3666863
20794 3666863 4057267 3823176 3890980 3509008 3953880 3650688 3830484 3528377 3983867 4020160
20784 4020160 3998474 3687119 3923702 3493314 3619545 2858883 3559113 3638245 2907966 3004785
20774 3004785 3160205 2887646 2995308 2761387 2736067 2562721 2825983 3077171 2844961 2916512
20764 2916512 3066735 3385834 3326054 3231877 3489518 3535105 3520481 3542137 3201394 3447024
20754 3447024 3504569 3678207 4007122 3882893 3462704 3341936 3574140 3059009 3406354 2898504
20744 2898504 3028871 3066252 2490069 2577375 2944698 2473591 2721671 2879444 2939492 2530470
20734 2530470 2711045 2770170 2533201 3035133 2856332 2669302 2891688 2667857 2596889 2796409
20724 2796409 2868145 2855729 2526520 2859617 2613595 2769120 2754266 3038292 2334601 3326118
20714 3326118 2825305 3191529 3167494 3194126 3274740 2968833 3221318 2969788 2706496 3734202
20704 3734202 3483021 3397408 3586365 3613980 4179757 3571993 3823903 3322316 3841404 4084098
20694 4084098 3827908 3742341 4101287 4191304 3539819 3694432 3715120 3142890 3463947 3483349
20684 3483349 3478753 3560425 3605311 3757523 3621763 3966508 3885932 3711972 3945233 4361659
20674 4361659 4142564 4441586 4949889 4709082 4916213 4567072 4950477 5075813 4677924
20665 4677924 4910112 4783369 4212340 4448792 4349574 4154693 4198733 3586347 3831434 3655990
20655 3655990 3943216 3446542 3147571 3639435 3677182 3931393 3996352 4263247 4009078 3793703
20645 3793703 4204930 4173122 4476843 4275262 5008472 5386327 4904165 4740588 4774738 4533796
20635 4533796 4429547 4334899 3986623 3566219 4100117 3499936 3870909 3817976 3602923 3286343
20625 3286343 3292036 3983673 3408497 2952107 3621985 3756988 3533158 3295336 3308464 3385737
20615 3385737 3359397 3650129 3251693 3763315 3700061 3480416 3778634 3698991 4253049 4305720
20605 4305720 3871592 3760520 3910317 3864340 3517903 3577190 3351376 3958412 3119649 3136918
20595 3136918 3272871 3892946 3200205 3154088 2735720 3505332 2970537 3063518 3212402 3215361
20585 3215361 3213745 3203384 3109530 3980937 3708943 3506503 3493808 3842301 3077707 3372468
20575 3372468 3497562 3066011 2620178 3394701 2869703 3357586 2376953 2673224 2731589 2965071
20565 2965071 2562414 2922994 2949332 3321670 2333586 3229917 3162677 3170171 2790209 3419388
20555 3419388 2926727 3498721 3689409 3573140 3288866 3279828 3114928 3034924 3554261 3899280
20545 3899280 3717601 3407580 3322785 3795019 3430493 3573206 3187108 3276437 3638219 3579184
20535 3579184 3250987 3731977 3716817 4149428 4015540 4170633 4279844 4560776 4460894 4465355
20525 4465355 5123979 4630751 4964491 4581391 4666605 4047448 4278069 4062262 4113178 3836508
20515 3836508 3762346 3264220 3461902 3502631 3037848 3697261 3333161 3262882 3078194 3360139
20505 3360139 2800155 3102909 3647411 3973139 3833761 3672040 4051317 4256865 4091369
20496 4091369 3642550 3640496 4129085 3877251 3504999 4301081 4031741 3277031 3925213 3245140
20486 3245140 3652508 3180167 3383881 3058314 3148199 3259370 3450066 2742580 3484803 3081074
20476 3081074 2918134 3059848 3715284 3214152 3514327 3585488 3827595 3646653 3422832 3547433
20466 3547433 3804257 3976195 3596573 3698718 4105533 4381263 4110698 4178266 3981478 4109234
20456 4109234 3655100 3895645 3599964 3670734 3581975 3801649 3199565 3432486 3326313 3896799
20446 3896799 3133792 3782519 3738952 3617306 3696941 4240714 3702490 3590588 3193515 4008141
20436 4008141 3635323 3404122 3671515 3262606 3551260 3688740 3278635 3761564 3587110
20427 3587110 2983754 3386420 3418660 3548459 3631251 3278645 3288332 3363801 3547198 3616505
20417 3616505 3956561 4035675 3196264 3283290 3124287 3150655 3456781 3581908 3287291 3561000
20407 3561000 3577319 3833894 4007626 3710572 3980768 3894720 3353957 3436880 3861034 4016072
20397 4016072 3198992 3353897 3722092 3279754 3383263 3308617 3522669 3180751 3175756 2916749
20387 2916749 3099313 3526197 3638732 3503526 3090434 3826129 3853134 3629900 4289663 4542231
20377 4542231 3977103 3943329 4234500 4164526 3587701 4199846 3885613 3953832 4047086 3594038
20367 3594038 4002228 3511245 3486440 3650677 3399862 2862586 3567547 3892557 2653285
20358 2653285 2890775 3187191 3423485 3587099 3622271 3162413 3318890 3597328 3874326 3769375
20348 3769375 3750488 3521851 3597292 3865372 3855370 3763884 4119303 3999683 3702825 4119834
20338 4119834 4023990 3948751 3855336 3968564 3718249 3539599 4020692 3799804 3562876 3737241
20328 3737241 3857500 3953442 3168671 2967551 3313501 3492047 3553013 3432619 3399314 3955334
20318 3955334 3577409 3820211 3799916 3294956 3671427 3249261 3819227 3064676 3920130 3856241
20308 3856241 3710353 3688973 3747403 3501821 3934039 3743990 4521071 4839434 4591307 5131799
20298 5131799 5170043 5056783 5548303 5758420 5156708 5524395 5688305 5096679 5649416 5868006
20288 5868006 5689033 5793919 5556094 5967800 6143661 6256533 6124604 6386706 6047099
20279 6047099 6123733 6182813 6606123 6381637 6303860 6666925 6673864 6508903 6561446 6025209
20269 6025209 6553436 5818138 6212072 5705456 5638067 5659368 5422911 5048334 4804839 4985739
20259 4985739 5293834 4924851 4506328 4461349 4632579 5262917 5259079 4901786 5315309 5097457
20249 5097457 5718377 5888122 5928672 6011861 6487540 6773832 7018458 7289397 8065674 8523544
20239 8523544 8841493 10180985 11111797 12793869 14147868 15744826 16373046 18015385 19482396
20230 19482396 20608845 21342427 21139578 21579964 21753256 21324829 20483846 20106583 19127776
20221 19127776 17558027 16416195 14774681 13108436 10888952 9757711 8673615 8490870
20213 8490870 8013024 7203852 6713372 6272150 6177499 6135202 6135807 6512984 5531582 5853215
20203 5853215 5326652 5434753 5101062 5189014 5133897 5000568 4994454 5225523 4918915 5191604
20193 5191604 4756437 5655471 5462195 5455787 5352112 5362220 5670888 6383978 6561212 7128902
20183 7128902 7521863 7760623 8412546 9931249 11746719 12942125 15556315 17415323 19001705
20174 19001705 21319591 22976938 23672413 24681189 25935554 26624301 26657509 26696903 27070675
20165 27070675 26269958 25961672 24248837 22608936 20812977 18413609 16471786 14676518
20157 14676518 12693246 12175001 10362393 10199188 9727890 9846362 9374494 9568205 9353325
20148 9353325 10152578 10721479 10651134 11547079 11862773 12941716 14003450 15074491 16924845
20139 16924845 18252197 20035723 22408094 25146443 28646483 32435369 36777673 40921459
20131 40921459 44985787 50073062 53786000 58169790 61339993 64504589 66982255 68426834
20123 68426834 69222365 69616443 68935359 67757701 65250683 62061960 58165079 53579716
20115 53579716 48378384 43182452 39014466 33963034 30530836 26929853 24177363 21666968
20107 21666968 19513272 17783752 16592891 15389105 14350536 13970692 13272744 12900370
20099 12900370 13044737 12855133 13015656 13384940 14238546 14848715 15499949 16405322 17557314
20090 17557314 18248543 19927050 21448381 22185476 23235892 22879332 23649464 23371937 23872144
20081 23872144 23308894 22657192 21963608 20484893 19533627 18336210 17006382 16049144 15190314
20072 15190314 13448520 12857695 12109032 11031204 10685788 9645968 9640007 9800172 9094331
20063 9094331 9549942 9822387 9663801 10323179 10835025 11275900 12667590 13907601 15428928
20054 15428928 16408768 17855037 19089340 20683688 21877167 23014799 24132154 26433688
20046 26433688 28003452 29803272 31774199 33435827 35737289 36950527 37891147 38351157
20038 38351157 38866908 37676212 37108578 36113174 34832100 33791636 32636701 30823150
20030 30823150 29487093 27275883 25178671 23469975 21357586 19546861 17997605 16570913
20022 16570913 15626881 15213055 14563142 14716386 14983797 15316223 16420740 17567531 19522499
20013 19522499 21526585 24293672 26483017 29322666 32340208 34589484 36421814 38411943
20005 38411943 39766263 39986328 40197557 40506818 39641814 38485525 37327045 34957784 33073897
19996 33073897 30083089 27587576 24988255 21653240 18976951 16422782 14319270 12635242
19988 12635242 11608461 10492193 9526471 8763252 8200056 7921247 7370800 6858295 6636025
19979 6636025 6370120 6152159 6091905 5667484 5661957 5497983 5537341 5540874 5284552 5371494 5285372
19968 5285372 4980330 4878836 4801581 5004553 4873554 4666942 4796869 4361772 4983627 4212346
19958 4212346 4915076 4925216 4812495 4511083 4284053 4534751 4064337 4287646 3535680 4599586
19948 4599586 4589849 4335907 4494616 4585286 4659191 4612763 4621611 4131374 4712101 4386044 4215927
19937 4215927 4534703 4374675 4420503 4550465 4958897 4464512 4527488 4297365 4623835 4507789
19927 4507789 4602532 4697512 5163226 4804884 4536432 4777238 4343085 5047096 4386642 4091159
19917 4091159 4902897 4566389 4355816 4055005 4201146 4258061 4615798 4519252 4420121 4198247
19907 4198247 3777524 4570016 4517567 4052593 4790636 4985752 4833863 4792937 4523278 4911517
19897 4911517 4862439 4727326 5035794 4903104 5398154 5199826 5134016 4947850 4633954 5106591
19887 5106591 4892758 4968545 5559980 5690632 5320140 5256909 5601380 5276531 5417818 5537564
19877 5537564 5450355 5703881 5293078 6115324 5201668 5854107 5912762 5917171 5500337 6188982
19867 6188982 5653733 6012303 6241810 6192660 5970101 6137724 6332211 6415183 6360918 6651483
19857 6651483 6476104 6335713 6604571 6451168 7298200 7077390 7206045 6900235 6727820
19848 6727820 6690068 7096075 6858079 7151108 7195501 7424560 7435500 8027711 7970087 8065645
19838 8065645 8362730 8549921 8485358 8839604 9144722 9664153 10188314 9923692 10598760 11386130
19828 11386130 11911388 13270074 14149384 15627434 16977519 19214320 21214876 23096013
19820 23096013 24358440 26721190 28488989 29490873 30561738 31260327 31673844 32552032
19812 32552032 33295155 34812103 36398587 39117623 42350646 45786378 48775243 51443544
19804 51443544 53805193 55914184 56200721 55856982 55085877 53214750 51284834 48389656
19796 48389656 45769642 43147469 40487438 37993854 36075960 35040191 33908385 32966893
19788 32966893 32614387 32433407 32260689 31835777 32168956 31590013 31193490 30845045 30871502
19779 30871502 30847709 31740927 33363106 34370941 36640639 37960432 41051727 42561406
19771 42561406 44207985 44989334 45324264 44098545 43150248 41246114 38615509 35908469
19763 35908469 33416587 31087887 28746290 26070919 23132551 20963826 18514349 16432950
19755 16432950 15799549 14583726 12968843 12123020 11478181 10868090 10049618 9661513 9339010
19746 9339010 9261902 8918917 8307096 8340596 7793958 8137179 7745780 7506397 7466547 7475332
19736 7475332 7309332 7052199 6716684 6256365 6927107 6749848 6694833 6941523 6726569 6502718
19726 6502718 6583469 6460200 6291685 6443770 6102022 6234193 6427055 6304877 6103831 6196130
19716 6196130 5646101 6287759 5942773 6112834 6037761 6068044 6017380 6139741 6492542 6094605
19706 6094605 5868300 6160348 6319372 6212794 5577328 5869436 6024032 5800160 5612038
19697 5612038 5678401 6210748 5493979 5604946 5670440 5601512 5704501 5755469 5268853 5568925
19687 5568925 5376894 5680869 5674480 5669876 5005426 4858526 5622030 5609123 5292467 5036769
19677 5036769 5632587 5014240 5539305 5597812 4971696 5005457 4888398 5024654 4681022 5011002
19667 5011002 4682527 5132865 4725998 5113477 4566138 4576369 4627572 4740322 4596701 4546667
19657 4546667 4447111 4763755 4890126 4584601 4545463 4441883 4596479 4598092 4460896 4500551
19647 4500551 4679366 5076452 4712923 4738489 4667661 4635800 5040533 4770575 4287138 4530748
19637 4530748 5024925 4575147 4482726 4886951 4402492 4649960 4502169 4727376 4748407 4431412
19627 4431412 4492382 4277168 4200110 4124634 4991903 4676353 4457261 4342824 4377344 4299487
19617 4299487 4416905 3760585 3962006 3789021 4154975 3915241 4456372 3824520 4046484
19608 4046484 4242030 4630941 3770579 3533328 3824562 4342002 3919930 3831632 3713372 3822715
19598 3822715 3803807 3469926 3672435 3790565 3529017 3524897 3766677 3625760 4179786 4094661
19588 4094661 4156170 3885220 4154595 4338136 3874637 4032835 3987166 3917891 3762166 3790363
19578 3790363 3984295 4501543 3470101 3615666 4347909 4152753 4324834 3902358 3811498
19569 3811498 4232805 4036507 4073849 4013413 4056235 3704805 4180105 4359474 4413822 3933464
19559 3933464 3956314 4169827 4062640 4103764 4092958 4388414 4539601 4652510 4323015 4296098
19549 4296098 4261588 4010946 4260668 3986502 3866011 3833684 4043774 3835830 4119098 4044756
19539 4044756 3933048 4013712 3973741 3711216 3558468 3098649 3541952 3941895 3653266 3230526
19529 3230526 3111909 3197484 3407073 4070295 3320347 3776756 3654342 3499527 3177660 3509363
19519 3509363 3207993 3556140 3621817 3477736 3813104 3371427 3724347 3278720 3797001 3312474
19509 3312474 3548587 3668758 3322152 3588145 3570578 3623487 3500252 3093869 3841913 3065986
19499 3065986 3239327 3186086 3189683 3684838 3894359 3680722 3517640 3377772 3329615 3409175
19489 3409175 3650774 3246788 3207308 3727960 3745249 3519606 3375504 3324045 3456159 3112143
19479 3112143 3159552 3170215 3341326 3406001 3279702 3152042 3475849 3033433 2879255 2858910
19469 2858910 3532218 2469647 2547296 2821635 3125810 2584451 2894432 2380246 2620316
19460 2620316 2494326 2851460 2732047 2409574 2768941 2821547 2636334 2397903 2559465 3120319
19450 3120319 2888246 2774649 2689467 2344583 2753255 2492834 2833345 2137616 2323854 2474471
19440 2474471 2076977 2089539 2427149 2531858 2581378 2508280 2249426 2425577 2171829 2234697
19430 2234697 2455218 2310756 2559647 2134434 2466825 1861194 2107544 2570491 2059794
19421 2059794 2663232 2065052 2146031 2501297 2113511 1984121 2223672 2041394 2388501 2200662
19411 2200662 1780012 2055620 1879470 2231750 2173093 2153128 2168653 2014683 2074633 2133381
19401 2133381 1872803 2343841 1692317 2282889 1700279 1975306 2242362 2515153 1928329
19392 1928329 1754490 1850543 2260438 1858658 2305177 1473227 1895954 1893767 1983828 2327679
19382 2327679 1837322 2272432 1552964 2078504 2373012 2056601 1933342 1852935 2062529 2030335
19372 2030335 1850463 1853829 2172482 2029368 2069558 1814819 2272075 1697842 1817594 1618467
19362 1618467 2057851 2230584 2303650 2064328 2072248 2192659 1939488 1590296 1787135 2458167
19352 2458167 1706344 1682392 2055959 1621538 1446440 1735067 1611006 1163757 1858370 1285395
19342 1285395 1832165 1740540 1813517 1877062 1407956 1539368 1410393 1823066 1524820 2011784
19332 2011784 1817548 1923557 1707202 1994225 1922586 1824428 2146845 1490268 2236530 2289390
19322 2289390 1861185 1549638 1972828 2047611 2048269 1678368 2204145 1948976 1627168 1707385
19312 1707385 2134903 2183978 1670055 1828760 1243755 1417412 1476566 1506548 1888515 1916426
19302 1916426 1518052 1688810 2014535 2065629 1633103 1937953 2022381 2099956 1865299 2141303
19292 2141303 2149474 1785598 2159757 2172749 1852515 2320715 1725954 2099914 1785758 1809018
19282 1809018 1815566 2075303 2182175 1719068 1984878 1983093 1770422 1838128 1947556 1742846
19272 1742846 2015018 2042416 1294576 2114158 1754624 1672011 1695756 1831173 1861175 1969880
19262 1969880 1944658 2140518 1753698 2136045 1559144 2056518 2014272 2409391 1690931 1581072
19252 1581072 2064686 1831868 1979332 1763319 1732077 1532705 2273661 1712193 1694099 2039736
19242 2039736 2272573 2623480 3179914 3042787 3189252 3053555 2941725 3040988 2573890 2450332
19232 2450332 1888743 1619937 1514731 1455930 1973853 1838053 1617550 1800864 2105387 1238265
19222 1238265 1562288 1508068 1324518 2247466 1785398 1327343 1314176 1811550 1483744 1459864
19212 1459864 1488839 1748190 1617544 1741252 1300376 1561611 1900212 1378074 1471888 1530285
19202 1530285 1544392 1919799 1275387 1487948 1635417 2043868 1794573 1665984 1423420 1273412
19192 1273412 1148480 1308073 1513537 1542516 1529722 1429843 1700617 1615242 1574234 1477653
19182 1477653 1536582 1582354 1441044 1547154 1453701 1305952 1795925 1297145 1345558 1897199
19172 1897199 1483442 1777799 1224371 1468093 1470269 1696577 1698461 1787341 1437905 1231619
19162 1231619 1883576 1653273 1697526 1448324 1640750 1643752 1429777 1961860 1515426 1636742
19152 1636742 1860504 1280434 1934737 1581892 1631765 1464299 1434398 1604844 1726782 1589930
19142 1589930 1534331 1488686 1738050 1930472 2024191 1542874 1883206 2085998 1488859 2729368
19132 2729368 2925193 2828007 3268947 3022626 3210282 3667805 3314710 3398363 3225150 3285875
19122 3285875 3675658 3221457 3477897 3623913 3486848 3561840 2900077 3612540 3135013 3145926
19112 3145926 2692769 2178956 2298122 1852226 2180437 2124691 2822064 2013025 2356986 2753582
19102 2753582 2280855 2078791 2166953 2478427 2373166 2386413 2248631 2265291 2363484 2774057
19092 2774057 2457642 2472426 2303709 2611331 2437313 2685282 2770748 2471459 2513619 2657056
19082 2657056 2121348 2668295 2621040 2205632 2163912 2577559 2545288 2613268 3127355 3229585
19072 3229585 2649538 3273599 3335548 3690134 3824997 4456713 4899399 5265705 6789405
19063 6789405 7808853 8510947 10093006 11499925 12421035 12477506 12927140 13099673 12785370
19054 12785370 11883714 10676686 8966076 7597789 6658278 5784402 5290029 4480480 4825933
19045 4825933 5353064 5653467 5945173 7075048 8224179 9460277 10321095 11059446 11066907
19036 11066907 10998270 10336573 9585456 8122642 7048249 5765482 5115689 4804416 4806787
19027 4806787 4677321 4844014 4192962 4372206 4219423 4997097 5077046 5643495 6378988 7108294
19017 7108294 8508362 9779297 11385976 12907866 14927250 15500411 15307350 15431989 15138290
19008 15138290 14035198 12920631 10799894 8784201 7875323 7477592 6549118 6476251 7207500
18999 7207500 8254055 8677218 10027530 10802262 11852975 11656792 11907260 11893066 11347753
18990 11347753 10180075 8804675 7394502 6362946 5493119 5198140 5576557 4846002 4347878
18981 4347878 5057489 5985278 6656714 7642711 8994660 9852326 10970603 11335942 11406568
18972 11406568 11567520 10549542 9678161 8453840 7173204 6464696 5944495 6013313 6658132
18963 6658132 5898420 6249067 6452846 6587486 7009082 7900264 8387249 9544664 10817010
18954 10817010 12997248 14969760 17658094 20605455 24131854 27910654 31251163 35633852
18946 35633852 40150711 43694897 47632657 50138211 51632713 51817978 50553764 47998297
18938 47998297 44614069 40015259 34516653 28994490 24204356 20161872 16611071 14544444
18930 14544444 12337433 10961547 9046623 8528980 7672749 6150549 6253585 5405191 5091831
18921 5091831 5216861 4721627 4302834 4279910 4062868 3954690 4109285 3721230 3866458 4034811
18911 4034811 4041239 3791225 3632183 4525432 4113145 4397274 4153776 4180518 4059834 4349991
18901 4349991 4517231 4179813 4164734 4781389 5243768 5059793 5404913 5501277 6305913 6869716
18891 6869716 7337217 7900979 9080355 10684439 11691711 14081440 16692691 19854463
18883 19854463 23802365 28367346 32678528 37612915 40889124 43487212 44221420 43532380
18875 43532380 41598818 38150242 33301032 28353526 23849493 19690480 16286207 13015214
18867 13015214 11503332 9852911 8092756 7433165 6670845 5804936 5590081 4966864 4278312
18858 4278312 4509596 3284818 3619116 3295331 3365914 2936349 2658503 3528665 2546354
18849 2546354 2583534 2787760 2902361 2478922 2665320 2015071 2352402 2293607 2483639 2013475
18839 2013475 2206470 1595985 2362233 2116387 2147147 1803144 2226575 2435145 2048407 2285049
18829 2285049 2049202 2096337 1920084 2182071 1347516 1577149 1252528 1656791 1655975 1276907
18819 1276907 1214530 1457999 1600807 1536818 1618196 1537500 1876441 1582555 1244332 1166668
18809 1166668 1082761 1834565 1639517 2139817 1234437 2099269 1675280 1747634 1631731 2162726
18799 2162726 1555909 1885472 1236222 1848191 1335568 1468951 1857550 2061619 1710125
18790 1710125 1685929 1818367 1469728 1466947 1580763 1834162 2093415 1646734 1801206 1990379
18780 1990379 1514418 1762229 1430118 1606463 1592168 1882386 2318508 1822469 2255614 2235538
18770 2235538 1729296 2448803 1767135 1968923 1666508 1875281 2100721 1791596 1963946
18761 1963946 1873733 2245648 1749064 2264671 1938400 2075783 1623292 1842455 2095275 1113580
18751 1113580 1970921 2043265 1982316 1319831 1788182 1743579 1530473 1602120 1496006 1546898
18741 1546898 1798318 1989577 1264506 1327520 1597716 1565702 1387221 1858122 1283460 1354288
18731 1354288 1885102 1385359 1462387 1976074 1718872 1452789 1694106 1756405 1610452 1236199
18721 1236199 1473098 1528695 1436749 1469566 1774934 1556015 1463195 1658846 1659811 1684447 1125114
18710 1125114 1739940 1335735 1751427 1311957 1612177 1612372 1858622 1667417 1939083 1970692
18700 1970692 1587980 1382832 1702763 1860379 1747067 1755229 1591760 1635375 1502241 1380063
18690 1380063 1835429 1553632 1607221 1760164 1544572 1195483 1885278 2232136 1318773 1123124
18680 1123124 2240430 1150635 1918245 1604597 1697023 1254242 1681965 1395300 1270284
18671 1270284 1427385 1087414 1322856 1485211 1200577 1330685 1437601 1055683 1319718
18662 1319718 1527673 1400941 1441839 1216452 1405969 1344006 1232282 682886 1733837 1320759
18652 1320759 642993 1175261 1394666 1495982 1186843 1132719 1707098 1535884 1380609 1326873
18642 1326873 966855 1651430 1066122 1141558 787913 1279239 1629632 1300121 1362478 1543435
18632 1543435 1529655 702629 1092842 1218290 1568227 1302489 1378112 1178035 1465950 1557710
18622 1557710 1353842 1341781 1474265 1547734 1652649 1672514 1511118 1625819 1642442 914733
18612 914733 1359425 1459005 1541749 1316640 1518674 1573496 1534523 1680814 1583345 1684974
18602 1684974 1411924 1390330 2068336 1828465 1829904 1292483 1371647 1484500 947629 1285024
18592 1285024 1940317 928815 1322886 1242183 1685971 1259927 1515349 1183449 1409494 1258687
18582 1258687 1385218 1147179 1444940 1082453 1361849 1099073 1087082 1495057 1456872 1564189
18572 1564189 1204405 1193916 1536746 1424484 1212381 1436938 1712704 1476932 1197587 2107216
18562 2107216 1853571 1310179 1170969 1294541 1528656 1567197 1429441 1787866 1196222 1299375
18552 1299375 1795002 1667716 1687615 884180 1671156 1590578 1700151 1869383 1456033 1538845
18542 1538845 1220084 1102120 1983870 1086649 1145553 1027167 1160503 1626098 1157674 1232435
18532 1232435 1176098 1130990 1024398 1569267 1100126 1376012 744157 1090916 1278343 1301448
18522 1301448 631638 825442 1346268 1458646 1282105 1006428 1351470 1166607 1027465
18513 1027465 1529145 1064867 1511794 1545771 1243987 1139815 1200458 1165866 1084219 1529821
18503 1529821 1114326 824244 1142922 1275960 1195142 1466873 1358595 1228984 831413 1371326
18493 1371326 999195 802212 866597 1113814 1301338 1458474 1222182 997626 1266591 1420906
18483 1420906 1001688 811389 1157653 1208597 1156460 1237421 1643354 800496 1223587 1136295
18473 1136295 1098139 938723 938607 1308017 1547054 1480434 1202539 953983 1692455 1156593
18463 1156593 1659638 1403274 1164954 1095834 1117682 890050 1009958 1476351 1094962 1557416
18453 1557416 1641325 1162688 1032242 701351 1091264 1233237 1242655 1017507 1393327 922944
18443 922944 1293486 1201518 1043221 1213617 1170969 1052361 991973 1229713 1329880 1354825
18433 1354825 993017 1006658 1509055 774224 674196 1136243 1240577 1327892 1117844 1146015
18423 1146015 1499871 1830594 1575702 1258790 1647651 1545925 1577005 1625623 1398896 1644706
18413 1644706 1076784 1367551 1142306 1497109 1151503 1361203 1093798 1474024 1191732
18404 1191732 920305 1202532 1243337 874003 1232438 1317380 1293687 1407037 1323633 1542180
18394 1542180 1388487 1748833 774816 1236933 1198185 1321303 1509280 1338651 1184562 1161981
18384 1161981 1394382 1228836 1043418 1515927 1160946 819375 1590871 1403692 1039721
18375 1039721 1031747 945647 1243477 1040074 1214983 952175 934463 914688 1087096 1338498
18365 1338498 1404539 1202692 1070579 1385353 1628866 1145138 1479745 1239159 1062459 860351
18355 860351 704609 912346 1048867 1409083 1157930 1318875 971125 1206391 717508 702135
18345 702135 1103809 1269314 1186750 1515304 1346512 876390 1406951 739271 1176265 1072025
18335 1072025 1129355 1117538 1313919 1324664 943804 905446 1258402 890221 935120 1028097
18325 1028097 730603 1055116 1655402 1231774 1225965 610030 1109290 575285 1498319 1197305
18315 1197305 1011526 1077993 1170259 1845130 1377751 1331405 981385 1135728 1448695 915254
18305 915254 671974 1288284 1127033 1088768 925380 1176067 1016405 829175 914625 1209613
18295 1209613 847448 893119 1178300 1029018 1119830 1340360 1162633 954571 1009846 1474591
18285 1474591 1383835 1327663 1370431 1495409 1362223 1212903 1119659 1406221 1683238 1374585
18275 1374585 1276258 1308863 851860 1124518 1442011 1136545 1038709 1139687 1398033 1163730
18265 1163730 1128623 1134666 967525 1229973 1201208 1008948 1025035 996456 1189394 1287161 854956
18254 854956 1507558 1198511 1226324 1003632 1044579 1144037 1351232 1267803 1615223 1445664
18244 1445664 1423667 1388274 1581998 1573284 1493313 1032231 1392027 1343486 1471180 1076758
18234 1076758 1038141 1132866 1264338 1246460 1746152 1534961 1547095 1357504 1145772 971278
18224 971278 884441 1390735 684937 1607160 1355974 790616 894717 1459387 1265952 1048331
18214 1048331 979604 1347958 1457544 1231278 1193120 1035443 808877 836076 1256985 910863
18204 910863 959772 1100166 861280 1362017 1290792 822800 1172679 1002567 1089837 1250615
18194 1250615 1170276 1326857 1101226 1185980 1212681 1192993 1007676 1242371 1124619 1312888
18184 1312888 1226909 807961 1057477 1303735 995521 785456 818604 705809 1495841 1179701
18174 1179701 1408046 1092044 1009987 1062182 868985 1033728 1266872 770490 900330 843117
18164 843117 1151059 937846 1247933 892164 1163353 881412 982571 1032094 1289773 775225
18154 775225 820323 1277369 694082 934366 1331337 799566 589579 829922 936569 1233153
18144 1233153 1139636 959498 1218941 887410 1323594 865222 1353236 1450874 559872 1239641
18134 1239641 1006651 1078310 1551953 623841 992028 1200756 903535 934926 1026150 1324399
18124 1324399 1118357 1179931 1055397 880448 936796 1100987 1252166 1261243 1278242 1032334
18114 1032334 919061 925698 1766971 1576883 1385560 1225580 832258 1097085 1213921 1526330
18104 1526330 1121392 1463563 1556414 1258033 1239144 1225706 1310280 1584061 1088132 997425
18094 997425 1114430 1018298 1542349 1649030 1519110 926568 1125256 693087 1521697 1250376
18084 1250376 1703000 1425263 983548 1295866 1313569 1094344 1071839 1226542 944702 1149111
18074 1149111 1142643 1247792 1217818 840433 1027962 1098826 1026639 1292261 983005 827773
18064 827773 815951 1372717 1070343 1191303 1230431 1186302 936253 799185 1218340 929264
18054 929264 884933 1306611 845738 968186 1040826 1241191 866836 1304950 1116854 667158
18044 667158 1025381 1369291 1233330 668670 906233 1085439 829901 909653 890283 956831
18034 956831 864945 1303038 941406 714616 1153179 1142742 1246552 872874 1505949 1165013
18024 1165013 1331910 564916 1080105 1490944 1100706 839532 1249993 1070689 942217
18015 942217 902256 1436842 702333 947527 1042353 731454 1254364 923349 1329952 1898428
18005 1898428 945794 987693 1198445 917149 667726 1403981 1376537 762077 927751 1022650
17995 1022650 1127342 998961 683417 916842 910077 778626 1006231 752423 911508 1279161
17985 1279161 1617999 1346099 1284589 1114163 928000 969894 653157 1220486 1101884 788519
17975 788519 1229283 1011849 1044841 1225675 1269131 1165313 736799 1608524 995944 1329488
17965 1329488 1304105 886573 860620 845815 1354206 1054409 1430217 745157 947702 1288909
17955 1288909 1032200 1136946 1304042 1294013 1462104 748926 828736 731546 966699 1186014
17945 1186014 1625029 1535591 969597 1438856 1410640 1085873 1239232 1333878 1007185 1138874
17935 1138874 1289413 1205750 1078952 863342 1439800 1676402 1096710 1049843 1469470 1095789
17925 1095789 1769303 1769944 1102646 1518542 1695417 1732857 1089782 1965215 1425946 1976077
17915 1976077 1890862 1874458 1530383 1502680 1197542 1886421 1849986 1503965 1159380 1378191
17905 1378191 1831963 1621072 1778097 1515921 2257301 1396588 1745323 1469646 1709322
17896 1709322 2149596 1648138 2112320 1514892 1671077 1784693 1598104 1784994 1238578
17887 1238578 1628701 1877692 1998567 1522815 1875897 1564858 1648454 2135500 1888104 1790377
17877 1790377 2055647 1571498 1636098 2141369 1880959 2045442 1624692 1541491 1672981 1864974
17867 1864974 2009478 1737711 2158060 1245827 1772419 2163232 1626707 1912113 2366407
17858 2366407 1671690 1738246 1922220 1511884 1919524 1645279 1768579 1279458 1928693 1623116
17848 1623116 1645908 2134673 1429601 1638098 2028382 1302509 1952922 1415541 1354480 1288036
17838 1288036 1699848 1093741 1797244 1679684 1904810 1209012 1495921 1814189 1655140
17829 1655140 1393819 1958115 1495421 1842275 1456844 1768269 1484357 1768630 1454787
17820 1454787 1891665 1343959 1778591 1550409 1856349 1639376 2037678 1947115 2090632 1955968
17810 1955968 1784179 2129090 1862379 2163819 2010207 1502691 1370046 1793197 1755304 1614846
17800 1614846 1917305 1509574 1475339 1768012 1975801 1667761 1902464 2399851 1906179 1307538
17790 1307538 1412590 1392079 1867013 1183733 1324115 1906346 1844175 1598697 1742124 1439094
17780 1439094 1566033 1414047 1350619 1624673 1274325 1452773 1328951 1511585 1753559 1565601
17770 1565601 1470820 1399288 1621475 1858957 1714293 1852785 1560913 1550372 1375389 1700101
17760 1700101 1701996 829360 1367562 1521402 1276966 1709326 1816607 1831947 1357932 951745
17750 951745 1260265 1802286 1049463 1618485 1607472 1155471 1073560 1388810 1578335 1361812
17740 1361812 1835563 1378695 1355113 1352499 1556657 1792992 1036896 1247675 1491793 1571727
17730 1571727 1213553 1600291 1695118 1298020 1147460 1248736 1291933 1591550 1449407 1064384
17720 1064384 1699906 1000772 1624111 1669063 1608334 1426534 1102958 1374746 1081026 1399707
17710 1399707 1286375 1416691 1176267 1254634 1682974 1486421 1480300 1715482 1527101 1351512
17700 1351512 1350548 1065238 1625034 1258933 1778433 1570525 1018740 1949492 1405595 1629841
17690 1629841 1286335 1349415 1389948 1399467 1484277 1279431 1405963 1711314 1419040 1757262
17680 1757262 1792840 1388491 1291015 1401888 1425457 1426064 1560111 1380631 1645337 1973699
17670 1973699 1438038 1556768 1815194 1302784 1502647 1136135 2064680 1399240 1776915
17661 1776915 1546235 1944169 1473266 1456431 1512511 1406506 1562622 1076027 1797571 1639679
17651 1639679 2001431 1929664 1851874 2012080 1727275 1909760 1788121 1579757 1875333 1792047
17641 1792047 1877375 2054730 1727509 1959762 1825699 1971108 1957810 1746506 2143591 2289535
17631 2289535 2156083 2168505 2396678 2112431 2464603 2276242 2384577 2128729 2591036 2082599
17621 2082599 2830381 2502091 2492242 2693153 2317810 2268713 2731864 2548732 2794561 2654985
17611 2654985 2509880 3080425 2725197 2769902 2793411 2488848 2406534 2508826 2760176 3140310
17601 3140310 2244919 2529668 3154851 2360303 2952107 2924010 2459477 2467096 2520709 2536097
17591 2536097 2675970 3212332 2904804 2429635 3364188 2652166 2604408 2796468 2543349 2378241
17581 2378241 3003985 2554040 2391387 3188116 2357299 3072291 2895611 2288429 2639588
17572 2639588 2756059 3076923 2564201 2251667 2657722 2569677 2367387 2329676 2793370 2988674
17562 2988674 2211022 3120389 2708188 2715645 2138485 2623716 2551432 2411783 2596536 2376314
17552 2376314 2464981 2450356 2580333 2168224 2445970 2680665 2178098 2734945 2297775 2439535
17542 2439535 2624097 2957154 2903796 2812777 2953884 2256671 2139914 2623387 2238133 2206242
17532 2206242 2511830 3055670 2647418 2512776 2748587 2933251 2510882 2475298 2610437 2189562
17522 2189562 2634374 2477734 2592007 2772457 2495624 3051359 2656456 2781413 3403254
17513 3403254 3303304 3570811 3195108 4151979 3685186 4403260 4548452 4362091 5108356 5074636
17503 5074636 4733390 4581622 4683647 4897262 4358057 4395879 4605072 4956905 5062968 5873040
17493 5873040 6390337 6628283 7734568 8113043 8688570 9916822 10892899 13701420 17736005
17484 17736005 24781842 35688696 50892834 68757748 87227637 101689490 111122663
17477 111122663 114644430 112403734 105823950 95285858 79818468 62933759 48607188
17470 48607188 39810846 37701282 43304257 53936664 68833602 86231221 101411931
17463 101411931 112151339 116767998 115306274 109474529 99034240 83811145 65478076
17456 65478076 46498262 32497425 22984103 16936378 13409847 11756260 10006128 8838389
17448 8838389 8398720 7618932 7389095 7621719 7217144 7907332 8525207 8226158 8958422
17439 8958422 9389093 9187425 9223230 8492664 8077813 7758405 6898861 6695707 6733259 6762686
17429 6762686 7277567 7783711 7865479 8039857 8270670 8007019 7233492 7217431 6260228 6560823
17419 6560823 5739259 5211385 5116022 5369232 5212491 4989666 5171820 5286103 4940705 5415416
17409 5415416 5286342 4739151 5185901 5385452 6023577 5087411 5876534 6321921 6708031
17400 6708031 6844645 7210843 7699799 7240493 7593994 8561905 8261795 8260498 9181182 8734919
17390 8734919 9881797 10292922 11472294 12032608 13485879 14385786 14801107 15098611 15746978
17381 15746978 16268062 15945938 15846972 15365145 14463245 13848648 13970334 12944527 13003987
17372 13003987 13084600 13500988 13917165 15148246 15744877 16842334 17308774 17970665 18784088
17363 18784088 18915554 19572523 19830702 19178308 19325071 19192263 18788036 18405262 18088247
17354 18088247 18514355 18692892 19228675 18911162 19687466 20468062 21837956 22788045 24082041
17345 24082041 25523176 27038513 27852120 28866428 30367295 30173210 31158265 30750581 30131385
17336 30131385 29602863 28937981 28111692 27281944 26695012 26493117 27144117 27079072 28299984
17327 28299984 29286962 30750302 31586491 33257301 33995149 34438158 34804662 34797020 34274128
17318 34274128 34401863 33579029 32328601 31689023 30437342 29190144 27820428 26361345
17310 26361345 25749973 25252780 24776351 24310572 24669390 24462032 25112294 25829121 26969878
17301 26969878 28690688 28636475 30308045 30408925 30644437 30628494 29797408 29217917 28148292
17292 28148292 26928129 25739211 24864931 23573954 22653178 22059222 21142274 20874170 20819681
17283 20819681 20296601 20968116 20573516 19871753 19598251 18748658 18229765 17615592 16747728
17274 16747728 15021240 14060195 13353486 12233565 11628748 10915050 10774734 10650943 9540346
17265 9540346 9384752 9267246 8722090 8870453 7870151 8319166 8240327 7815051 7808888 7540962
17255 7540962 7106676 7453333 7214812 7494413 7478011 7142306 6685491 6590788 6363127 6766315
17245 6766315 5889325 6036760 6082582 6288980 5770352 5873846 5566645 5661546 5658849 5224722
17235 5224722 5448685 5086493 5859353 5466380 5406778 5381521 5615646 5744938 5749072 5581070
17225 5581070 6192675 6015376 6128288 5693411 6270710 6428002 6024571 6033742 6094274 5953014
17215 5953014 6163583 5915248 6406949 5792473 6223658 5630622 6031139 6257164 6087570
17206 6087570 6064816 6188931 6797625 6774224 6640723 7508965 6901020 7163791 6660308 6651412
17196 6651412 6037537 5672337 5368788 5543240 5289462 4993113 4660190 5159690 4778507
17187 4778507 5033927 5044310 4644064 4672537 5124616 4589279 4489592 4485044 3991524 4327898
17177 4327898 3908662 4088586 3856761 3707435 3758765 3662169 3764082 4011966 4186030 4313413
17167 4313413 4418678 4526988 3988445 4271930 4074445 4316582 4270521 4212573 4783598 4485141
17157 4485141 4401532 4611248 4335761 4842056 5104373 4809401 5315015 4834176 4830665 5290308
17147 5290308 4655375 4985773 4612539 4970898 4764404 4698457 4889790 4454253 4704531 4672941
17137 4672941 4947571 4932153 4915855 5012298 5420713 5030554 5527285 4853169 5062307 5203559
17127 5203559 5124284 4938031 5222407 5504445 4967988 5795606 5643200 5867096 6095707 5684276
17117 5684276 5758941 5232788 5915013 4877761 4789130 5201131 4019092 4285053 4132622
17108 4132622 3801797 3847316 3758804 3500028 3652209 3826456 3639606 3158506 3353400 3052458
17098 3052458 3405125 2871404 3029393 3074960 3109777 2754978 2891978 3028349 2434156 2807320
17088 2807320 2293376 2638291 3062404 2657191 2411669 2805047 2754138 2369370 2405742 3072547
17078 3072547 3096017 3059148 2293807 2601874 2672436 2906348 2966989 2706649 3031826 2815255
17068 2815255 2796358 2721845 2751963 2978338 2759099 2448507 2791026 2598173 2549060 2822485
17058 2822485 2939481 2929828 3025538 3236991 3241584 3009355 3383502 2634921 3425761 3869387
17048 3869387 3581045 3146477 3502641 3110506 3081517 2967699 3257753 3416027 3937885 4076278
17038 4076278 3595013 3850458 3936788 3998823 4075293 3699546 3721200 3454953 3245722 3034764
17028 3034764 3362549 3113853 3283735 2969169 2810482 3118298 2740647 3285953 2830706
17019 2830706 2804475 2724506 2484353 2535125 2406116 2743226 2892688 2406253 2532440 2421802
17009 2421802 2642393 2402164 2705234 2536396 2596805 2477886 2350402 2076431 2579474 2682382
16999 2682382 2260095 2128472 2759976 2507449 2412799 2186604 2734916 2329990 2801707 2736809
16989 2736809 2521750 2763131 2382915 2975513 2573998 2526819 2353550 2662407 2931147 2546820
16979 2546820 2579791 3116581 2948994 3375217 3018608 2746648 3089672 3192336 3433751 3188375
16969 3188375 3636953 3810113 4156357 3675619 4175837 4750195 4834596 4793658 5145094 5569596
16959 5569596 6323999 5930865 5964808 6322154 6270657 6214008 6327157 6094923 6449338 6070675
16949 6070675 5921279 6022526 6235606 5362630 5775929 5524000 4783599 5162467 4649230
16940 4649230 3781349 3979849 3661367 3812672 3585623 3366682 3214854 3149772 3082169 3296927
16930 3296927 2799119 2917661 2666995 3212843 2948362 2551509 2690999 3272250 2630414
16921 2630414 2695093 2801654 2905974 2879657 2495996 2930783 2401626 2750613 1932899 2270405
16911 2270405 2578296 2440492 1831922 2111418 2083416 2189771 2207045 2264181 2168761 2255097
16901 2255097 2073368 2229621 1789217 2739964 2337772 2115905 1960144 1967401 2217648 1736540
16891 1736540 2521970 2243319 2331919 2379491 2330574 1902776 1968320 2079501 2120942 2085234
16881 2085234 1897729 2317750 2432779 2472490 1943965 2500819 2202507 2148118 2055479 2403000
16871 2403000 2408415 2237465 2473016 2650467 2363276 2217301 2659222 2564104 2770192 2324891
16861 2324891 2440032 2535111 2798060 2104837 2163296 2639281 2663362 2349938 2110703 2325228
16851 2325228 2753856 3000962 2212060 2460947 2442862 2403786 2555362 2393492 2126437 2195329
16841 2195329 2144186 2396828 2192440 2321393 2261926 2280745 2569441 2517827 2577410 2628540
16831 2628540 2532112 2492227 2706135 2367858 2534980 2513776 2653495 2813262 2760766 2918474
16821 2918474 2862826 2880611 3637572 3209289 3993927 3708186 4003938 3925940 4294471 4024289
16811 4024289 4276287 3928382 3803761 4233097 3390290 3652787 3698588 3736613 4169941 3961513
16801 3961513 3922942 3854384 3986236 3524046 3488048 3156880 3307199 3235401 3216793 3366112
16791 3366112 2686227 2640283 2575225 2389253 2382733 2241805 1967931 1949544 2359992 2683256
16781 2683256 1861854 1959971 1927017 1971414 1529419 2374509 2296495 2091984 1620958 2130052
16771 2130052 2344200 2187467 1915959 2048858 2306967 2491304 1998942 1885521 2138792
16762 2138792 2534907 2011381 2197385 1885616 2149217 1797203 2024075 2309661 2056274
16753 2056274 2573879 2396619 2533467 1997241 2277647 2233295 1880685 2344824 2170655 2328087
16743 2328087 2065443 2103017 1994678 2022534 2307093 2324194 1975606 2150087 2289709 1946823
16733 1946823 2777975 2360533 2239490 2401137 2864361 2448622 2441300 2325769 2238843 2429742
16723 2429742 2605280 2885661 2879972 2726043 2556079 3024121 2702047 2934283 3126899 2814564
16713 2814564 2775708 2858912 2506318 2464082 3188815 3421372 3525961 3471994 3896345 3998379
16703 3998379 4281844 4810738 4869317 4760094 5068021 4788384 4609687 4791985 5006536 4680451
16693 4680451 4438632 4663258 4198838 4660516 4261105 5228303 5217266 5325518 5362207 5140743
16683 5140743 4908059 5150853 4855125 4905526 4265726 4212462 4046347 3877845 4281288 4044012
16673 4044012 3655839 3342279 3888346 3900908 4049990 4376377 4748878 4772057 4587691 5045758
16663 5045758 5075251 5172908 5133972 5134577 4608895 4456427 4110214 4393638 4971403 5000143 4710574
16652 4710574 5175646 5144579 5278463 5079887 4555900 4532650 4443651 3799950 4033585 3809828
16642 3809828 3172778 3046701 2834992 2524711 2537242 2495927 2312697 2280272 2517822 2559979
16632 2559979 2613162 2921050 2476872 2811826 2348409 2777463 2837005 2719504 3032437 2584345
16622 2584345 3012274 2695100 2562061 3121384 2796466 3293156 3515175 3051275 2766572
16613 2766572 3053713 2815638 3057455 3357281 3236777 3369648 2497434 2961628 3047592 3335282
16603 3335282 3309783 3388587 3316919 3330410 3520210 3689801 3585547 3332667 3322289 3620460
16593 3620460 3541286 4249196 3896909 3635731 3927306 3851297 3078853 3416118 4009638 3831067
16583 3831067 3282068 3346218 3240833 3429366 2808207 3062798 3080469 3105045 2912758 3243949
16573 3243949 2869734 2884071 3023488 2511568 2933933 3501786 2960506 3054886 2836305 2611360
16563 2611360 2714635 2738500 3044727 2879115 2998269 2971300 2862965 2923976 2819995 2771762
16553 2771762 2748551 2795604 3330239 3119097 2989848 3742717 3163897 3281014 3496096 3691845
16543 3691845 3699615 3497793 3373120 3116911 3551736 3668502 3395064 3233499 3337127 3170158
16533 3170158 3025765 2931432 3282424 3322964 2689926 3222282 3302263 3548991 3440361 3069988
16523 3069988 3813354 3242409 3261412 3644991 3774928 4041129 3417531 3271123 3530741 3925769
16513 3925769 3633286 3620940 3988616 3762858 3465599 3872239 3892622 3915963 4217441 4009494
16503 4009494 3899858 4337277 4701704 4459257 4637866 3883979 4396474 4440173 3986837 4018008
16493 4018008 4361213 4132750 4383972 4720431 5248173 5155179 5021209 4987196 5472861 5427058
16483 5427058 5872146 6187091 6157749 6164455 6890362 6430694 6957658 6784776 7363741 7507354
16473 7507354 7628559 8018254 7541944 7940622 8481060 8654112 8532532 9230390 9804766
16464 9804766 9913726 10462386 10514180 11900909 11715414 12053460 12523767 13174753 13448085
16455 13448085 14583438 14878050 16002547 17267256 18629030 20385560 21759201 24604644
16447 24604644 27608335 30833609 33730807 35996012 38549832 41052704 43832240 46200101
16439 46200101 48861462 51961307 55551720 58473840 62099015 66258957 71319076 76344994
16431 76344994 81960612 88366805 95611038 103650604 113289798 123807493 134856171 145224695
16423 145224695 155109701 162450933 168537840 174923051 180479972 186548620 192548162 198844838
16415 198844838 204636371 208812542 210714693 211090694 210277491 208250520 206885657 203977104
16407 203977104 200581556 195985920 191364707 185327968 179376083 172085798 164138386 155248893
16399 155248893 146563067 136722681 125931446 114696379 103670358 92950173 82267369
16392 82267369 72454556 66079091 67035620 78272090 98055781 122003357 147420970 165603084
16384 165603084 173777616 171137262 157242431 128476024 91674322 49676789 -265443
16376 -49634038 -83381698 -90158739 -75756910 -53007014 -29663274 -10706678 3057095
16368 12348687 16973402 18535301 17453490 14959029 12473580 10484558 8459315 6772531
16360 6772531 5650685 4711918 4526073 4172712 4138639 4321669 4004895 4729778 4216939
16351 4216939 3593250 3857775 3669129 3278218 3489709 3163438 3554084 3030790 3432689
16342 3432689 2635448 3396485 2962273 2975506 2832098 3097234 2243168 2035131 2147922 2065760
16332 2065760 1846924 1320798 1488523 1430391 1275730 1382847 1543590 1699891 1263318 1696324
16322 1696324 1771787 1176230 1293149 1298181 1124368 1010336 893375 1023949 667429 1169824
16312 1169824 333097 496020 441748 702274 997161 1110782 717515 875222 631518 596561
16302 596561 1391961 1737357 1258076 1352986 1211875 897533 812831 933687 522067 587247
16292 587247 402463 511325 816455 301083 787691 545995 600696 472341 1585318 597384
16281 747124 1043959 1168088 683278 967458 989156 1174725 1011389 824221 881782 1179347
16271 1179347 1300729 1329628 1039452 1364818 1259497 994976 649455 551442 412799 468976
16261 468976 377624 289925 -132515 210417 687569 600662 506975 277637 726445 494078
16251 494078 233044 362094 680768 374873 456725 326775 663045 637595 897644 786427
16241 786427 732463 1038596 1118559 2026698 1367340 1698123 1167535 1335133 1460382 980263
16231 980263 713563 349440 370043 257862 153624 358924 998507 360811 281194 420922
16221 420922 300077 854855 257573 930422 1284778 865434 1102352 1396299 1457664 1264813
16211 1264813 1419091 1479324 1657557 1729009 1250280 1068940 1171489 916144 909831 1409262
16201 1409262 1411536 1167300 1306299 1322190 1527530 1309076 1506693 1138899 916594 1385405
16191 1385405 1549886 1078029 1348317 1665382 714231 1015894 716241 1116687 1471450
16182 1471450 785607 1003085 1280717 1276533 1521342 1318575 1363715 1526964 1719184 1708477
16172 1708477 1380612 1696514 1468219 1160700 1153421 1314063 1303197 1510625 1099264 1402944
16162 1402944 1773663 1327286 1561692 1605965 1421490 1304945 1175481 1450317 1577182 1784421
16152 1784421 1649785 1737084 1246577 1569911 1499660 1864755 1239073 1797705 1335062 1620004
16142 1620004 1904601 2162741 1739734 2180990 1881753 1787910 1614429 1926588 1647944 1756704
16132 1756704 977871 1457674 1590151 1370065 1416706 1011980 1216844 1714787 1307123 1758840
16122 1758840 1709597 1683553 1739528 1323685 1205993 1092979 1282108 1408158 1066389 1680014
16112 1680014 1966807 1843256 1640968 1771691 1292775 2191772 1513832 1946628 1164522
16103 1164522 1685078 1820253 2103580 1598427 1778352 1977077 1570832 1598972 1904055 1681823
16093 1681823 2350070 1895208 1998504 2004074 1386035 1567395 1708766 1867191 2141768 1794471
16083 1794471 1762530 2062635 1733921 1982495 1967994 2365098 2061523 2114580 2065270 2110777
16073 2110777 2715392 2655220 1934741 1948681 2153609 2299500 2157591 2690473 2425927 2412680
16063 2412680 2195046 2783817 2730345 2143300 2577038 2559976 2470107 2393505 2546327 2725974
16053 2725974 2805306 2720989 3302665 3123229 2687753 2628472 2789655 3296382 2894466 2573907
16043 2573907 3403820 2931784 3221884 2964469 3700670 3247985 3183589 3365318 2726888 3229816
16033 3229816 3574192 3273370 3552840 3394713 3321747 3383787 3336473 3493979 3834003 3357878
16023 3357878 3343317 3863165 3767947 3366186 3823496 4068581 3989435 3889299 4111085 4117187
16013 4117187 3821358 4334250 4146550 4000453 4056384 4459715 4339008 4350257 4553551 4245247
16003 4245247 4051897 4464794 4163617 4339651 4245417 3939090 4243957 4002707 4351471 4054609
15993 4054609 4023659 4246259 4282992 4262482 4328125 4273588 4377520 4118304 4650664 3805455
15983 3805455 4691496 4372722 4092142 4020464 4578915 4934258 4473946 4417380 4829131 4373057
15973 4373057 4604679 4670496 4577406 4431746 4464755 4532495 4746989 4137847 4078261 4016373
15963 4016373 3841954 3810127 3786993 4166844 3944432 4311584 3902874 4271544 4518794 4189930
15953 4189930 4095343 4346413 4005892 3860475 4290744 4108731 4666844 4020853 3857472 4297561
15943 4297561 4555685 4355734 4618766 4998201 4384638 4480822 4259049 4560902 4410961 4853028
15933 4853028 4707084 4766658 4785480 4573571 4818382 4767937 4973685 5424161 5320582 5140363
15923 5140363 5431803 5642437 5801504 5799354 5543913 6261671 6314757 6883086 6855255 7160087
15913 7160087 7892194 8020201 8828029 9482419 10457600 11495613 12747619 14788754 17899671
15904 17899671 22032667 27857643 36002516 46641100 61605260 77633746 94831208
15897 94831208 109764706 120829364 127876076 128621594 123865161 114701272 100626280 83802741
15889 83802741 67793205 52326195 39865486 30313995 23665996 18882135 15424955 13208377
15881 13208377 11253714 9541026 8966443 7773162 7329832 6515575 6582171 6415727 5927767
15872 5927767 5611051 5493392 5114834 5519461 5549898 5261376 5289197 4849733 4835022 4838072
15862 4838072 4807705 4906335 4957946 4654755 4477245 4566156 4375943 4248515 4233119 4451223
15852 4451223 4330344 4400372 4124787 4268329 4134513 4199137 4440295 4024929 4034721 4353231
15842 4353231 4558274 4139345 4480265 4343048 4436878 4492091 4310980 4756769 4815032 4462966
15832 4462966 4703968 4696629 4572240 4726624 4606231 4295186 4896840 4039527 4703046 4076606
15822 4076606 4616807 4354951 4120108 4354516 4383940 4165642 4768473 4134898 4160782 4878896
15812 4878896 5130970 4767455 5259916 4621172 4891544 5157095 5070059 5048376 5529939 4962133
15802 4962133 5027757 5463886 5563636 5618649 5843963 5887434 6300182 7027044 6877483 7040761
15792 7040761 7509809 7691778 7315314 7730726 7704537 7698141 8136565 7903837 7903293 8582355
15782 8582355 8645935 8858244 9392690 9482315 10491471 10576746 10720130 11116764 10953811 10376615
15772 10376615 10494556 10625690 10506425 10583691 10269768 9795818 10044667 10495007 11105515
15763 11105515 10985494 11191020 11283168 11164889 11464265 11213137 11020724 11141931 10710018
15754 10710018 10678672 10094535 10251802 9966568 10079660 10178562 10120155 10456833 10191876 10552726
15744 10552726 10760857 11108427 11457588 12305268 12679283 13505364 13552875 14362656 14372768 15215699
15734 15215699 14575801 14215975 13867581 14479303 14188685 14887899 14975054 15764102 16031813
15725 16031813 16579417 16121996 16085539 15082426 15043341 14393393 13682500 13387224 13269432
15716 13269432 13389137 13802914 13829615 13843556 13483650 13125537 12689069 12099520 12095820 11416535
15706 11416535 11520922 11411288 12022150 13091504 13370944 14166124 14650956 15076151 15446953
15697 15446953 15714366 15781605 15937748 15840570 15044940 15596128 15335897 15059986 15480992 15396382
15687 15396382 15530609 14992076 14990052 14660026 14400987 14619876 14281857 14431176 14286914 13792013
15677 13792013 13723458 13511629 12936721 12861368 12482225 12107560 12396718 11520833 12130997 12102393
15667 12102393 12535456 12494840 13018587 13303485 13971278 14540137 15505560 16398516 17602193
15658 17602193 18580469 19332317 20722071 21992522 22793337 24384451 26124202 27228731
15650 27228731 29193759 30639741 31847386 32862535 34977431 35471661 36506525 37823518
15642 37823518 38947980 40545945 42575529 44581938 46627020 48124804 49621036 51476736
15634 51476736 51730726 52323539 52053540 51395926 50440095 50031015 48234679 48287526 48571044
15625 48571044 47821970 48199249 48494718 48018574 46415213 45209930 42995924 40744308 38518590
15616 38518590 35824061 33731788 31690334 30347545 28950455 28298171 27130132 26064254
15608 26064254 25051469 24488205 23047650 22860049 22049459 21327730 21036986 20431186 19943657
15599 19943657 19534823 19426638 19030238 19105099 18781905 18956385 19876959 21242650 23846368
15590 23846368 28990129 38874813 54355517 73726687 95245129 112104094 118908567
15583 118908567 120545471 118477108 112041522 101149695 82809838 58736375 40183294
15576 40183294 29508557 24063396 20617172 18195369 17099854 16378191 15659815 15642234
15568 15642234 15643295 15959646 16271514 15836358 16143128 16084054 16439530 16928798 17300173 17451859
15558 17451859 18038369 20240247 24796777 33277163 48036725 70453331 96630193 124369854
15550 124369854 143064968 149579344 149643486 145753812 136191253 119045993 92809691 61938418
15542 61938418 40577678 29054122 22610767 18954108 15836717 14662477 13015669 13422607
15534 13422607 12221907 11943464 11814524 12330285 11679178 12022441 11110805 11183087 11098930
15525 11098930 10392534 10620621 10260442 9602638 9865425 9533828 9181015 9644764 9556831
15516 9556831 9411527 9562954 9875257 10004889 9739902 9941803 10207318 10646092 11038797
15507 11038797 11479403 10922108 11123088 10900726 11311358 10926592 10955616 10750611 10179145
15498 10179145 9955464 9432354 9977404 9715173 10007972 10276747 10294859 10040597 10423524
15489 10423524 10703663 11008997 11219519 11143139 11085465 11432604 11271296 12527242 12136476
15480 12136476 12648917 13038897 12582944 12585077 12527789 12823786 12487252 12948711 13103509 13843640
15470 13843640 15153084 16270224 17787499 19274463 20094732 21164813 21099905 20876182 20550064
15461 20550064 19593661 19843424 18211367 17937405 17522446 18118445 18902291 19515255 20838949
15452 20838949 21977478 22844950 23647212 23667963 23488952 23439308 22400896 22091666 21539407
15443 21539407 20973352 20517447 20796471 21480923 21717217 22374899 22637740 22822264 22739907
15434 22739907 22410826 22404754 22000414 21218486 20450813 19729987 18821334 18661210 17924606 17300207
15424 17300207 17320797 16159751 15462344 15339085 14654335 14076768 13662996 13302432 13038561
15415 13038561 12174687 12676671 12189396 12228494 11979953 11542609 11950319 11752150 11602258
15406 11602258 11879867 11938898 11592155 11998942 12022228 12355194 12395670 12827005 13239590 13123834
15396 13123834 13781472 14043881 14387579 14148449 13749378 13305194 13443149 13118004 12936736
15387 12936736 12616257 12963477 13308630 12883849 12923964 13433815 13197743 13173797 13257027 13205806
15377 13205806 13186743 13055304 13076595 12836044 12582806 12079617 12657075 12936591 12281867 12771885
15367 12771885 12965210 13657708 13696796 13990064 14371141 14951209 14447932 14791613 15011402
15358 15011402 15002336 15397424 14993770 14659779 15066606 15782087 16474109 17246774 18342553
15349 18342553 19522607 22906640 27452358 35462687 46066814 57894791 68591470 76256262
15341 76256262 79452299 79481856 77546692 73406827 65199422 54028612 42556604 36662592
15333 36662592 33172898 31356076 30280194 29724801 29697409 29021417 27218042 26339833 25138650
15324 25138650 24384243 24201744 24126645 24171184 24772590 25203997 26063010 27188411 29107373
15315 29107373 32299034 37806881 49022113 64006356 84051143 105108053 122521431
15308 122521431 133468056 136368493 135007395 127741181 115320539 96166063 75013746
15301 75013746 55188652 41529708 32871350 28022454 26111517 24641327 23174237 23176560
15293 23176560 22948009 22401328 22794774 23291922 23171734 23294634 23351181 22853255 23102271
15284 23102271 22551809 23292538 23192425 24089877 27136263 31575162 39079400 48891326 59932858
15275 59932858 69006710 74190061 76087081 75222622 72469129 67219712 58499054 47235195
15267 47235195 37043577 30202768 26976822 24738548 23624925 22819739 22395443 21012710
15259 21012710 20550095 19719763 19486917 19262897 19265517 19238666 19459628 19784389 19705389 20024562
15249 20024562 20894346 20775993 21607809 21268528 21843090 21485611 21303718 20846676 20430819
15240 20430819 20557676 20272333 20468950 20384141 21024111 22229241 23419314 24662961 25590101
15231 25590101 26635424 27174515 27273954 26554963 26127613 25131248 23870861 22482349 22242212
15222 22242212 21763720 21147556 20517044 21067899 21176317 21796187 22067464 22641152 22860117
15213 22860117 23532092 24171483 24021632 23998476 23184249 21807496 20238203 19136868 17902754
15204 17902754 16950204 15855082 14633689 14540838 14143733 13462753 13002770 12763785 12809030
15195 12809030 12644623 12764482 12768123 13303818 13592227 14005020 14284493 14700052 15408177 15636246
15185 15636246 15767898 15825308 15712228 15655570 16033194 16072506 16107565 16840481 17460301 17675195
15175 17675195 18220977 18183358 17993888 17832885 17885287 18007827 17667129 17346040 17145131 16966837
15165 16966837 16444251 16571811 16840927 16699484 17108623 17158934 17569665 17845626 17609576
15156 17609576 18068832 18437656 18683062 18365613 18505917 18030669 17836680 17611458 17661906
15147 17661906 17598225 17595652 17852176 17207199 17780032 17597148 17582962 18036339 18432671 18794529
15137 18794529 18722208 19139774 19171765 19451838 19083040 18975189 18498304 18266757 18860143 18794821
15127 18794821 18510933 18611075 18394969 18074592 17968156 17868437 17830896 17794984 16710477 17044265
15117 17044265 16294362 16280936 15793499 16121532 15719442 15404938 16000867 15446603 15663880
15108 15663880 15445773 15146019 15620353 15958883 15717837 16336519 16477891 16960151 17420136
15099 17420136 17642497 18092403 19235044 19520741 20216537 20748079 21731512 22939649 24723253
15090 24723253 26474038 29915500 33619860 38305043 43467548 46909813 49080523 49743594
15082 49743594 49106424 47726405 45939109 42306925 39249671 36554611 36922238 37913007
15074 37913007 40928915 45751277 50332318 54867995 57621539 58046407 58438516 57909110
15066 57909110 56513359 54010292 52398843 51905266 55598972 61565917 69418545 75094217
15058 75094217 78452013 80922154 83280563 85419141 86624126 84978674 82273186 82063354
15050 82063354 83355279 86218789 89589287 93166941 96510234 98128525 98424339 97913388
15042 97913388 97908709 97781372 97068058 95023030 90321469 85403194 81818037 77865268 74256284
15033 74256284 69886217 64517379 60199706 57486889 58601197 60852288 65203000 68049054
15025 68049054 69823253 69674325 69324701 68331132 66790274 64262631 60820653 59553111
15017 59553111 61335641 66456898 73572065 82966037 92936447 101735273 109182127 114115597
15009 114115597 117585422 120234308 120148685 117973148 114984264 112337893 112364354 114545739
15001 114545739 119555802 126248300 135820976 147058747 158444393 168663880 176385922
14994 176385922 180539753 181479298 179253246 173807997 166211911 159102994 153229241 151194855
14986 151194855 155466048 164764246 177294443 191763208 208714443 226558252 245435664
14979 245435664 261583845 273040533 278930154 279109663 274271098 266051170 251912502 234841198
14971 234841198 214221793 194338194 175170876 157040637 141661313 128459966 117052066
14964 117052066 108080784 99995811 94381706 89893455 86775822 85091706 85509797 87131079
14956 87131079 92088344 101143641 115562842 134438405 160764487 194583803 234038101
14949 234038101 278593477 325179636 373696966 421954831 465279523 501451774 526712734
14942 526712734 536912958 529597148 506788071 472174754 435386043 398199639 361149915
14935 361149915 322120806 286011821 259791079 243087072 231463900 219698792 205912252
14928 205912252 189002769 172425353 157003171 144549205 134163857 126489087 122211299
14921 122211299 120414016 119735574 117054120 111993114 105928067 99108068 91040892 79637773
14913 79637773 66429124 53670912 44034714 37516030 33950966 31120863 29667394 28760239
14905 28760239 28304380 28720242 28825064 30989918 31946978 33377674 35411043 37890742 41030030
14896 41030030 45590859 51342562 59287885 67850893 75570235 80222413 81994735 80843969
14888 80843969 78832046 73689143 67506844 57713879 49766997 43052520 39209084 37082980
14880 37082980 36827955 35176028 35048914 34865751 35503857 36002348 36965331 38193704 39921199
14871 39921199 41090920 41017838 41064200 42072091 42546809 43313689 42796851 43024118 43678902
14862 43678902 45077453 47342980 52499130 59715788 70066331 83838651 99296652 115069556
14854 115069556 129416227 141020109 147925776 148991005 142708966 130775357 116188399
14847 116188399 100936398 85079066 70694343 58416666 50175541 44801620 42000192
14840 42000192 39402476 37938957 36817211 36058671 34903687 34337490 33794525 32829242 32042588
14831 32042588 31511460 30929141 31223383 31211181 32037791 33336910 34045673 35134339 36710245
14822 36710245 39200631 43169857 49453144 58694585 70665076 84008758 95009065 102364433
14814 102364433 104847551 103441753 98429813 90193583 78104071 63736676 49689369
14807 49689369 39561247 33039688 29543002 27116911 25736203 24453581 24132540 23781186
14799 23781186 23624687 23043830 23407393 23077088 22826157 22546794 22063908 21639787 21462980
14790 21462980 21196959 20406578 19631746 19737856 19831875 19864865 20382215 20395264 20720562 20329193
14780 20329193 21388516 22275918 23114824 24800498 25653316 26881868 27180955 27444426 26997160
14771 26997160 26855247 25524111 24136173 21658185 20364828 18968998 19003538 18289682 18208727
14762 18208727 18415478 18621612 18661659 19519837 19312855 19674164 19558182 20337912 20819112
14753 20819112 21103607 21726978 22247099 22446473 23462514 23717071 24136194 24426806 24210154
14744 24210154 24414221 24745071 24403993 24501595 24464389 25037581 26725280 28605371 31009014
14735 31009014 33889953 37299541 44753809 52934077 66252203 86637492 116666741 157375249
14727 157375249 207885786 263297784 314924091 357076167 384911089 395400007 385977081
14720 385977081 359342500 316879834 264257762 210099934 159142650 116490223 86647554
14713 86647554 65954955 52970378 44242558 38807120 34844853 31992533 29645589 27710064
14705 27710064 25821514 24769573 23032512 22118115 20336341 19058291 18218645 17713011
14697 17713011 16895250 16650493 16362769 15960628 16098038 16437359 17512349 17786064 18122851
14688 18122851 17456321 17967353 17851624 17730549 17052788 17232584 17225538 18385742 19381951
14679 19381951 19804900 20343303 21052071 22288551 24153537 25226794 26884031 26667253 27097880
14670 27097880 25495577 24155791 23161894 20613537 19125666 17497085 16678222 17276725
14662 17276725 18461736 18692529 18981142 18509383 18134726 17854634 16877913 15391229 13629172
14653 13629172 13086610 12411057 12291353 12237717 12741154 13361943 14308007 14661198 15800576
14644 15800576 17187019 17862209 18138181 19151482 19390953 20043531 20568061 21409852 22646093
14635 22646093 24265612 25796888 27038648 27330519 26639390 25726186 23274444 20952315
14627 20952315 17882643 15475574 13354275 11172813 10605484 9527835 9161444 8595013
14619 8595013 8709141 8772072 8669593 8540218 8970917 8707889 8612905 8941169 8543517 8267106
14609 8267106 8521776 8280713 7416583 7532861 7767880 7781552 8046097 7763057 8901304
14600 8901304 10398065 12523839 14275185 16438150 18545782 19893400 20927182 21209986
14592 21209986 20190915 18483758 16530985 13743648 11540171 10027958 8968381 8494324
14584 8494324 7885438 8308241 8177652 8616865 8860133 7971998 8967364 8849610 9245151
14575 9245151 9307444 9148000 9615485 10450023 10432294 11217840 11789997 11933920 12453315 13353552
14565 13353552 15580901 17430407 18791740 20408341 21918088 25072166 30626039 38628720
14557 38628720 49438032 61083864 71834968 78728055 80327640 79898721 77044810 70990459
14549 70990459 61485573 48445892 36441345 29036134 27424282 30114418 36260922 46199524
14541 46199524 59261394 73747064 83867050 88604312 90044087 88190360 82698699 73930001
14533 73930001 60779142 45885606 35307989 28254308 24509691 23330509 22779223 22652158
14525 22652158 22456736 22604639 22081878 21728916 21750462 23654173 27679188 33856019 43239293
14516 43239293 52477463 61137628 65436249 66931370 66867603 64929214 61572594 54292607
14508 54292607 46823099 40654001 37615951 37496292 39735250 44458739 50560656 59112177
14500 59112177 65854045 70234561 71787406 71642861 69679409 65338609 59538759 50067308
14492 50067308 40840761 34774958 30631547 27263529 23747618 20754302 18739118 16968844
14484 16968844 14634520 12178134 10595516 9092881 8343630 7963149 7817335 7721182 7533252
14475 7533252 7408409 7823900 8043607 8089727 8631172 10050058 11338451 12736423 14079340
14466 14079340 15122230 15372554 15182778 15359169 14394573 13398070 12901772 12680437 13389798
14457 13389798 15141058 17771513 19115298 19870810 20353550 19442014 18567875 17581518 15239728
14448 15239728 13305768 11489273 10765979 11168409 10809073 10789123 10941009 11774244 12527484
14439 12527484 12378921 12559685 12968533 13902386 14612235 14422789 15569260 16230070 17761058
14430 17761058 19078206 22240648 26880255 33617318 41981054 52098808 61343806 67879628
14422 67879628 71698451 73541776 71953919 68168272 61590003 52967745 44168415 36237948
14414 36237948 30791097 26404445 23816428 21141597 19115278 17037969 15715168 14543500
14406 14543500 13519686 13179455 12543965 12583691 12533036 12202414 12434783 12368746 13103690 13433376
14396 13433376 14845094 16300814 18385792 22356423 29064655 38688562 51332671 66690269
14388 66690269 83174027 97421027 107894568 113471433 114108361 110479264 101582931 88501266
14380 88501266 72628208 57143363 43788758 34311160 27127926 22078191 18927218 16657976
14372 16657976 15451069 14543529 14368456 13456038 13542554 13598696 13569368 13633345 12821045 12545792
14362 12545792 11956581 12308127 12292649 12895026 13623500 15226014 17816966 20833804 24522659
14353 24522659 29577286 36004809 42051330 48093864 52300166 53994676 53258718 50997270
14345 50997270 46883876 40923628 34418739 28392723 22842498 18874091 16146258 15262251
14337 15262251 15955252 18211167 22339133 27815964 35156503 40451620 42666258 42892306
14329 42892306 42312641 41062953 37647553 32421160 23231490 17761253 14990369 13606254
14321 13606254 13235367 13107307 12608141 13031086 13017767 13168715 13602620 14335224 14967154
14312 14967154 16323960 17708099 19116630 20456789 22767095 24042125 26346665 28549396
14304 28549396 31495741 34524370 39349507 45260357 52745848 63120370 76383561 93677420
14296 93677420 116469050 145207571 178876351 217153459 254172517 284302331 302830841
14289 302830841 309562765 304728065 289896853 264380682 230368257 191605642 154388451
14282 154388451 123045025 97889492 79255865 64786195 54331438 45665089 39181183
14275 39181183 34251378 29883761 26592175 23910217 22094053 19232213 18096738 16182416
14267 16182416 14906684 13861840 13051047 11902426 11171099 10486052 10305910 10151314 9208724
14258 9208724 8963276 8642662 8333700 8228574 8157155 7798321 7625589 7392477 7412096 7041462
14248 7041462 6669844 6675961 6243774 6076847 6471788 6235015 5846818 5479351 5340565 5212100
14238 5212100 5657614 5595571 5534347 5787415 4989713 4995592 5363828 4828164 4376186 4369287
14228 4369287 4222209 4601471 4594889 4495345 4272664 5042687 4599353 4597353 4582674 5247125
14218 5247125 4465303 4888790 5174852 5619311 5293576 5436768 5561943 5786228 5635350
14209 5635350 5509444 5631405 6103102 7223162 8531849 8554883 8820296 8605086 8293687
14200 8293687 8752586 7087762 6485332 5130339 3708916 4302093 4142859 4430773 4176246
14191 4176246 4386829 4548291 4700806 4786175 5248567 4961783 4511046 4911196 4815360 4528292
14181 4528292 4147680 4271930 4159801 4583430 4342892 5187791 4653923 4607301 4788975 4841893
14171 4841893 4942150 4757523 4590208 4395230 4466745 4100800 4534032 4233771 3975613 3873658
14161 3873658 4178024 4223519 4312318 4413767 4611258 4653515 4390832 4599470 4972145 4776452
14151 4776452 5016005 4292269 4459620 4631254 4317746 4704878 4988073 4821430 5417637
14142 5417637 5190416 6267376 7923212 9181243 11166079 14043014 16749510 18056422
14134 18056422 19316019 19406124 19678094 18887372 16505246 14176803 11667520 9553009 8468272
14125 8468272 7080473 5948513 5645002 5810327 6114363 6779735 7284496 8334800 8554374
14116 8554374 8997973 9186390 8644740 8185308 8015008 6840274 6092663 5805272 5292246
14107 5292246 5480497 5334542 5319161 5491224 5064408 5096010 5163603 5482586 5878501 6547957
14097 6547957 7277692 8520695 9485977 10105895 10581868 10498751 10244598 10367194 9816497
14088 9816497 8224916 8138084 7229175 7650642 8318362 9142566 10144963 11732710 12147989
14079 12147989 12463933 12348531 11802101 11601195 10349558 8995989 7872314 6855625 6669051
14070 6669051 6196555 6386395 5944282 5943761 6566578 6463937 6114042 6491565 6659199 7768852
14060 7768852 7482533 8338795 9356951 10381718 10997607 11430135 11805760 12184520 11916534
14051 11916534 10987309 11037257 10525766 10714302 11466904 12415330 12943403 13606854 15485214
14042 15485214 16249094 17790129 18741978 20200999 20393548 21138801 21566867 21596879 22423376
14033 22423376 23533921 24628714 26502137 28245624 31909206 36076522 41138319 48580298
14025 48580298 57528393 68906283 84259406 105259595 131603504 165137958 203685158
14018 203685158 244001651 279998183 305386031 316789762 316200819 304839902 282407924
14011 282407924 250670299 211122434 170177365 134697232 106712047 85261322 69191997
14004 69191997 57132796 48021930 40419416 34588509 30486684 26951920 23888037 21655498
13996 21655498 19597492 17115652 15692956 14695305 14325775 13076222 12562795 12917359 12970376
13987 12970376 13256220 13359356 14452739 14865202 15895338 17161452 18125535 19548582 19554153
13978 19554153 19989972 19619484 19306084 18127187 16803888 14905104 12855594 11315210
13970 11315210 10045443 9829183 8745234 8070748 7851888 7195319 6816898 6971151 6774917
13961 6774917 6149082 5351502 5060666 4722562 4793110 5024739 4959490 5272380 4670558 5193871
13951 5193871 5335053 5402210 5651477 5820789 6796556 7302558 7006192 7761275 7547793 8211519
13941 8211519 8426840 9307614 10691004 13260287 16920527 23344657 30762368 38755904
13933 38755904 46281760 52755761 57686779 59740569 58962386 54853872 48033814 40445763
13925 40445763 32436375 24971864 18327799 13072716 9735703 7889037 6525260 5927149
13917 5927149 5381563 5374006 4042276 4043345 3916456 4006812 4081526 4250969 4196316 4306608
13907 4306608 3120016 3933037 4107537 3945286 3464344 3414318 3687698 3569951 3485050 3557096
13897 3557096 3548977 3446122 3636680 3215921 3683711 3295617 4086536 3883231 3875723 3566872
13887 3566872 3774934 3894996 3802382 3611407 3690738 4035301 3734438 3501097 3332964 3454483
13877 3454483 3255008 3321551 3384602 3756162 2514196 3444998 3297235 3379877 3045786 3187155
13867 3187155 3706325 3495589 3296505 3498686 4122636 3472552 3765771 3472832 3637540
13858 3637540 3715984 3511188 3999797 3521552 3607386 3659875 3504324 3626427 3681569 4141891
13848 4141891 3832417 4045992 3598739 3932220 3865422 3954777 4145072 3794678 3682472 3453814
13838 3453814 3534615 3358977 2919111 3316772 2859829 3235478 3492885 2312361 3031608
13829 3031608 2606539 2958148 3272842 2862227 3261462 3459301 3509079 2702855 3445159 3746253
13819 3746253 3218525 3720981 3242648 3242451 3236626 2281287 2898464 2512099 2811532 3018244
13809 3018244 2934342 2656648 2676982 2959067 3195444 2944367 3079926 2957959 3122119 2867545
13799 2867545 3213186 2988735 3154131 3391951 2994980 3203319 3142027 3425571 3689077 3728433
13789 3728433 2918462 3064633 3450784 2880148 2496417 3258792 2835283 2576044 2553117 2961050
13779 2961050 2558817 3138274 2871843 2259067 2402999 2831236 3459150 2867096 2799302 2720971
13769 2720971 3342126 2987483 3035548 3393832 3565587 3572207 3283498 3845703 3349575 3340706
13759 3340706 3285397 2858860 2849863 3268807 2845705 2863698 2688046 2687273 2843918 2775148 2341339
13748 2341339 2913827 3050438 3185765 2863844 2892238 3305154 2629845 2609222 2911682 3308805
13738 3308805 2726497 3202261 2806917 3386477 3243866 3158417 3459418 4069921 4056445 4599206
13728 4599206 4665629 4384643 4161798 4595611 4095958 4022125 3466731 3455252 3055672 3313050
13718 3313050 3166283 3410906 3469388 2886252 3449963 2962585 3076550 3160196 3367015 2815124
13708 2815124 3156497 3599624 3346481 3502070 3666016 3385179 3356287 3922547 3304410 3361764
13698 3361764 3628285 3422192 3995139 3564501 4724862 5438551 6030540 6242038 6691747
13689 6691747 6186403 6544218 6297139 6059764 5128076 4146200 3993846 4199963 3771405
13680 3771405 3336966 3726534 4069404 4199668 3757116 3968168 4274040 4695339 4173583
13671 4173583 4912855 5035497 4893838 4980529 5120731 5855070 6443967 6598630 7256617 7790552
13661 7790552 8115266 8209983 8869948 8394006 7955160 7193161 6233415 5832147 5562038 5797540
13651 5797540 4507762 4632583 4916615 4279155 4244061 3546240 4361044 3881714 3927971 4278376
13641 4278376 4477475 4345711 4127644 4362130 4526395 4967981 5134196 5601412 6263901
13632 6263901 6622838 7607616 7184942 7100091 7236782 6938355 5773013 5184048 4682637
13623 4682637 3852319 3906795 3969184 3986243 4173762 3703326 3696413 3853262 3763818 3358263
13613 3358263 4054852 4087459 3979368 4052252 4944888 4965961 4885632 5806657 5564449 4951701
13603 4951701 4933095 5149826 5104616 4434200 4353362 4051496 3617238 3785666 4207592 4136973
13593 4136973 4135881 4108830 4622129 5198725 5305954 5598277 5274676 5273463 4674568 4409478
13583 4409478 4466120 3844122 3612069 3663353 3753671 3236120 3372841 3580073 3595524 3339657
13573 3339657 3165564 3736115 3476546 2919480 2882529 3220350 3205709 3254343 2972473 3335418
13563 3335418 3391666 3242817 2974347 2934612 3382555 3395333 3091077 3369545 2815179 2876854
13553 2876854 3346237 3546074 3168711 2628925 3432201 3410127 3027947 3838457 3776658 4016915
13543 4016915 5004667 5574966 6385873 6537923 6742456 7237951 6943339 6669455 5735757
13534 5735757 5487830 5075709 4213644 4065420 3524473 3645582 3886306 3885863 4460550 5504967
13524 5504967 5397858 6269985 6668345 6906772 6604047 6648298 5690871 4633644 4292717
13515 4292717 3735109 3620257 3074966 3145494 3277935 2788972 2619061 2854317 2902798 2767305
13505 2767305 2244402 2692078 2070773 2548627 2654735 2565750 2279313 2520828 2599716 2734424
13495 2734424 2740238 2685521 2174674 2470947 2521115 2863084 2404145 2390895 2664932 2727396
13485 2727396 2620135 2584488 2375231 2548117 2931772 2662498 2672133 2375348 2741120 2468618
13475 2468618 2931410 2443111 2331807 2252293 2443898 3048229 2575186 2371655 2937238 2670352
13465 2670352 2190024 2045331 2778977 2225452 2450931 2778262 2487195 3076903 2815073
13456 2815073 2994985 3282171 3290897 3819793 4756177 4898008 5583480 6317831 6551591 6696141
13446 6696141 6452696 6355826 5830939 4841476 3959661 3877721 3309464 3241422 3674697 3112424
13436 3112424 3237749 2884016 3193397 2979181 2600682 2618946 2998928 2763176 2715639 2993594
13426 2993594 2620373 2908291 3432349 3801514 4565897 4764153 6023977 6544319 6747811
13417 6747811 6791064 6355124 6367338 6065449 5326255 4239334 4080454 3503729 3503459 2916567
13407 2916567 2957765 2887518 3003085 2779356 3176752 2440081 2134168 2922063 2485387 2701389
13397 2701389 2353556 2766890 2813034 3129470 2565966 3162847 3176103 3038374 3786090 4087350
13387 4087350 4433840 3973924 4359100 5159365 5093525 5643889 5505947 6037025 5912782 5610315
13377 5610315 5619178 4996465 4202446 4479421 3690363 3723426 3594056 3606178 4001438 3741296
13367 3741296 3613724 4313190 4037599 4211437 4489292 4054493 3742607 3766924 3733650 3423378
13357 3423378 3417450 3551209 3916609 4015236 4357625 4450624 5166450 5154714 5200407 5266909 4394473
13346 4394473 4440904 3757729 3719298 3465641 3279762 3172181 3349164 3392703 3020954 3181561
13336 3181561 3631987 3001775 3242687 3205709 3792737 3133618 3181986 2914551 3915868 3582433
13326 3582433 3428731 3761380 3687536 3890243 3650274 3919091 3833429 3237063 4142265 3934494
13316 3934494 3698466 4638412 4672946 5214895 5620626 5756514 6115447 6372522 6243906 5577666
13306 5577666 5520916 5489873 4896057 4677122 4770662 4942966 4818130 5557178 5544165 6087438
13296 6087438 6179518 5962674 6474244 6076871 6162509 5905922 6101687 5861651 4839587 5228982
13286 5228982 4864922 5217150 4903413 5318291 5125802 5481958 5436007 5474801 5492636 5301274
13276 5301274 5307630 5689579 6468901 5595856 5635054 6149072 6105272 6207052 5960886 6728874
13266 6728874 6833551 6808296 6901522 7338821 7266863 7956003 8106828 8260496 8729894 8589607
13256 8589607 9162825 10121777 9909014 10307381 10290721 10774782 10879172 10805469 11171151 11448357
13246 11448357 11349294 11253735 11502316 11412258 11832569 11834389 12456692 11863602 12623823 12966152
13236 12966152 13341545 13330667 13755824 14443074 15136653 15466289 16098981 16502640 16633984
13227 16633984 17285343 17342584 17028725 17378751 17860121 17795463 17317329 17069115 16999882 16321307
13217 16321307 15900924 15591919 15509447 15429975 15285420 15381636 14975102 15012737 15422143 14938817
13207 14938817 15403777 14910460 15228777 14856768 15034035 15132870 15053308 15361873 14820562 14448798
13197 14448798 14407585 13955690 13444471 13597528 13295749 12759668 12691504 12664532 12427311 12216371
13187 12216371 12246436 11997617 11827503 11480113 11799942 11494980 11498510 11100717 11232813 10898307
13177 10898307 10760960 11085390 11010587 10885682 11149717 11083965 10849224 10552864 11106653 10645586
13167 10645586 11162657 10846698 11185918 11273302 11328866 12281826 12259100 13123323 13491163 14190814
13157 14190814 13917854 14958881 14762160 15581273 15469701 15152992 14890899 14826104 14761816
13148 14761816 14330175 13851274 13795343 13571820 13132624 13510375 13422824 13607028 13531878 13456771
13138 13456771 13061743 12736602 12151714 11280388 10738685 9947534 9588441 9141318 8534924
13129 8534924 8706895 9192164 9062717 9310743 9454630 9839455 9458695 9474053 8456218
13120 8456218 8247699 8616566 7626020 7703477 7207348 7136898 6495064 6633816 6852417 6531472
13110 6531472 6633240 6450156 6275680 6530585 6517981 6025713 5997451 6490855 6564425 6616169
13100 6616169 6156515 6463933 7187254 7325611 8065226 8585733 9419254 10795732 10927014
13091 10927014 11675913 12308312 12579807 12644620 11828609 11839497 11368012 10582347 10625445 10033593
13081 10033593 10919514 10919433 10866524 11371020 11017269 10263164 9396487 9137982 8134549 7261536
13071 7261536 6454503 6356276 6000606 5666786 5498063 5084268 4988333 4601961 5128793 4828987
13061 4828987 4801967 5284063 5063797 5616501 5556117 5816257 5585385 5800711 5975129 5297096
13051 5297096 5835931 5607713 5271860 5437567 4738794 5418507 4880528 5099296 4859808
13042 4859808 5112843 4735758 5031127 5058130 4784625 5562314 4742926 5032672 5387437 5278434
13032 5278434 5438979 5327944 5880292 5641774 6070359 5547183 6065079 5820717 5051243
13023 5051243 5644241 5800767 5755264 5978685 6185791 6079683 6059696 7089652 6318802 6967081
13013 6967081 6705922 6806358 7301921 7599800 7698082 6961993 7480122 8420863 7950115 8495223
13003 8495223 8402107 8342175 9091319 9163633 9272155 9847682 9768959 10129905 9856284 10631666
12993 10631666 11048303 11409468 11675346 12101298 12798892 12719955 12804314 12471558 12598006 13034645
12983 13034645 12818296 13368794 13728708 13122293 13663673 13588347 13867088 13883510 13862755 13595642
12973 13595642 14277738 13569608 12606275 12639784 12648771 12782937 12241776 12133141 12441962 12191965
12963 12191965 12398991 11408053 11810158 11418545 11289426 11728420 11133907 11124709 11022662 10770299
12953 10770299 11125336 10259742 10383822 10564973 10541311 10388236 10504281 10409601 10692817 10551176
12943 10551176 10147639 10244702 9999938 9592501 10050808 10299527 10166495 10229274 10445117 10388101
12933 10388101 10801108 11094986 10852667 11405415 11697980 11956166 11863018 12090697 11787644
12924 11787644 11326922 11432917 11351285 11371887 11129876 11545690 12041918 12257899 11719137 11693771
12914 11693771 11856295 11446688 11401653 11209399 10642382 10537386 9798650 9543104 9978442
12905 9978442 9665890 9471423 9543737 9013777 9073217 8891155 8628577 8769146 8057750 7701487
12895 7701487 8514627 8146141 7553467 7654931 7024567 6859373 7180282 6800779 7322742
12886 7322742 6894205 6979252 7142241 6621541 6497620 6377386 6528956 6255941 6070245 6332317
12876 6332317 6277329 6469575 5670507 6449774 5912322 6011111 5623569 5571607 5567870 5408369
12866 5408369 5561580 5661651 5290549 5177374 5650802 5466358 5238850 4924606 5293646
12857 5293646 4879014 4957045 4647525 5186989 5266646 5211973 5392873 5567550 5044772 5221316
12847 5221316 5340351 4965506 5070467 5018528 5689730 4937223 5662736 5006691 5279208 4660994
12837 4660994 5677598 5177869 5105400 5670555 5599807 5861065 5141526 5595839 5198301 5459975
12827 5459975 5254254 5500178 5134699 5100395 5515814 5616486 5472376 5136440 5298695 4833458
12817 4833458 4829887 5484645 4837785 5048821 4652606 5598653 5036936 4909420 5211648 5219447
12807 5219447 4928242 5238719 5218283 5384985 4846192 5461805 5590343 5434049 5754050 5458981
12797 5458981 5374281 5268437 5529728 6000178 5490279 5207794 5931458 5723232 5455204 5774197
12787 5774197 5414471 5389643 5098537 5773264 5666170 5748584 5487605 5893264 5715520 5899237
12777 5899237 5537992 5592122 5046810 5676026 5587139 5288726 5430354 5673777 6207433 5921330
12767 5921330 6170068 5701765 5501909 6250123 5714943 6247987 6168306 6003336 6355099 5579993
12757 5579993 6131950 6290253 5889094 5850177 5441133 6075141 6190848 6067574 6042207 6000798
12747 6000798 5801993 5942124 5646766 5880888 5792260 5527584 6268732 5506441 5894069 6170856
12737 6170856 5928629 5825862 6156288 6174076 6134437 6062797 6126989 5737832 6105159 6528301
12727 6528301 5675871 6454294 6004048 6205804 6082464 6029696 5958418 6065866 5970490 5972795
12717 5972795 5900965 5911441 6153609 5798340 6079484 6325861 6211415 6550432 6630069 6753642
12707 6753642 6553889 7009226 6772906 6944360 6927290 7146374 7235007 7486140 7705319 7610802
12697 7610802 8334776 8007488 7988756 7927613 8068705 8058832 8828500 9078219 10943082 12680520
12687 12680520 14475204 16020035 17021180 17043181 17231122 17202814 16247161 15168445 13000849
12678 13000849 11155517 10191983 10086181 9561857 8873783 8590901 8369354 8714777 8617310
12669 8617310 9295037 9143186 9034913 9586710 9873959 9420520 9899002 9542871 9176368
12660 9176368 9010430 9140236 9081454 9149832 8762038 8965786 9007088 9088763 9447555 9698162
12650 9698162 10093811 10676452 11316490 11967588 12385176 13040155 12859179 13544913 13131018
12641 13131018 12780389 13185959 12872240 12555884 12553379 12393440 12774649 12614023 12721953 12706793
12631 12706793 12277775 12466070 12935602 13174767 13358937 13479146 13558403 14189843 13851951
12622 13851951 13404423 13778633 13340709 12634474 12137995 10955135 10591461 10289260 10282077
12613 10282077 9863724 10363064 10867177 11991906 12936329 14180109 15439337 16485041 17207669
12604 17207669 17703403 17862046 17312532 16232617 15363551 15267561 13920075 12683218 11823736
12595 11823736 11014949 9666904 9696496 9732862 9540236 10181103 9899418 10854562 11241304
12586 11241304 11450065 12514621 12171402 12467187 12602514 12513704 12970493 13543168 13409009
12577 13409009 14031723 14577980 14770730 14757156 14572458 14474234 13107932 13150808 11765547
12568 11765547 11478741 10063320 9619478 9218612 9177705 9192934 9389713 9439266 9511128 9412012
12558 9412012 9725215 9785761 9484325 9822575 9059591 9599916 8824852 9363923 9100456 9442139
12548 9442139 9626036 9377960 9358324 9685018 9294779 9861199 10501467 10825132 11473589 12156872
12538 12156872 12230377 12735407 13122812 12925230 12956068 12262585 12282604 11220516 10344274 10412320
12528 10412320 10253008 9488137 9583628 9630873 9884797 9512876 9778675 10095924 9860057 9641161
12518 9641161 10139609 9979255 10687386 10853836 11027570 11473918 11781767 13211043 14780989
12509 14780989 16110711 17158132 17010992 17776394 17532465 17381812 16049073 14274859 13145669
12500 13145669 11756468 11389260 11342776 10499922 10402939 10600869 10534753 10597292 10708433 10918487
12490 10918487 10527684 10656022 10647315 10732889 11250155 11264628 11533379 11758127 12781279 13126329
12480 13126329 13963522 14275630 15203044 15314494 14931091 14833405 14452860 13700489 13005091
12471 13005091 12541185 12261811 11305839 11289420 12140242 11852807 12194079 12101562 11973401 12366400
12461 12366400 12740029 12659819 12372747 13773852 13977098 13716626 14213207 13928083 14755805
12452 14755805 15272460 15751123 15887566 16977620 17237777 17853327 18569094 18537442 19460261
12443 19460261 19277279 20204474 20295729 20468685 20065558 19954148 19635259 20129050 19886671
12434 19886671 19218330 19554875 20025832 19682777 20586198 20871190 20985755 22255925 22333138
12425 22333138 23125785 23982298 24577731 25410280 25996577 27141187 27292967 28148646 29139474
12416 29139474 29930138 30174684 31255032 31466889 31485667 31304241 31066716 30739395 30553128
12407 30553128 30294871 29021707 29315783 28715537 27897232 27447769 27713086 26507374 26474764
12398 26474764 26127928 26485707 26667687 27171569 27618781 28362444 29360752 29088673 30389381
12389 30389381 31268728 31974722 33045585 34350846 34788752 35048583 35608319 35682541 36576224
12380 36576224 36402905 36096618 35690999 35909445 35527627 35820105 35471318 36032063 35444238
12371 35444238 35503667 35243145 35114203 35420866 35255518 35211348 34750311 35044292 34319367 35028230
12361 35028230 34213431 34469170 34406466 33736161 34104141 33737361 33349138 34015999 33715149
12352 33715149 34069727 33854981 33609933 33102740 32755442 31903623 31789857 31379842 30947914
12343 30947914 31520644 31520693 32186128 32478024 32790974 33722820 34523321 35405432 35798802 36585981
12333 36585981 37322161 38304685 39425219 39899276 40514178 41138194 41659078 42349145 42474172
12324 42474172 42891203 42867482 43317388 43230452 43569290 43709824 43470124 43210513 43361815 43314229
12314 43314229 43756933 44078516 43364405 43354975 44051901 44857220 44906003 45622201 46151855 47030259
12304 47030259 47950359 49186925 49666826 50109968 50016134 49246673 48614102 47535481 46514838
12295 46514838 44994303 43724820 42745692 41868722 41559555 40937860 40224943 40259566 39283908
12286 39283908 38372687 37653075 37138497 35234901 34715543 32772377 32200667 30674589 30360553
12277 30360553 29243141 29044908 28179079 27990243 27286637 27153915 26837629 27160075 27035890
12268 27035890 27100888 26788331 26617105 26403852 26593088 26313668 25234108 25924148 26000301
12259 26000301 25686264 26057710 26509933 26962064 27748609 28732064 30166226 31194003 32746553
12250 32746553 34582921 36645177 38471663 40820293 42805203 45809230 48368548 50463167
12242 50463167 52324452 53052123 54408296 55335308 54919718 54546114 53677540 53198340 52001128
12233 52001128 51936597 51314124 51089655 50082853 49791005 48821372 47179350 45820355 43322385
12224 43322385 41030464 38622081 35926124 34256477 31089400 29544256 28188378 26579908
12216 26579908 25546070 25006948 24631267 24090658 23269839 22875708 22474108 21983276 20845923
12207 20845923 20563224 19716134 19582075 19529739 19619191 19406922 19648927 19540765 19346121 19717914
12197 19717914 20037909 19674106 20009671 19544085 20035870 20986668 20744654 21358274 22077840
12188 22077840 22308679 22891199 23510249 23667855 23957957 24275246 24469244 24472355 24181627 24282603
12178 24282603 24771158 24741739 24130113 23689521 23748396 23182997 23144454 23291526 22991829 23057313
12168 23057313 23251849 23679959 23494758 23131357 24295216 24514442 24682594 25790209 26352186
12159 26352186 27451003 28391152 29007331 29918533 29904273 29380123 29378973 28559800 28017990 28513538
12149 28513538 29233319 29276868 30687500 31772550 33158591 34988159 36404737 37701283
12141 37701283 39445770 41096273 42528731 44046573 45000601 47184777 48726942 50263264
12133 50263264 53029614 55155034 58347661 61458347 65230304 69103200 73713525 77640574
12125 77640574 82107191 85005025 88173218 90097542 91706875 92185506 91290527 90819230
12117 90819230 88875486 87733460 85952977 84566737 83021776 80704160 78378667 76705471
12109 76705471 74668591 73132976 71461805 69874470 69117959 67627995 67081266 66163008
12101 66163008 66535733 66144379 67004203 67539671 67606026 67722477 67436740 66951202 66361697
12092 66361697 65125982 63789120 62907186 62897463 63122338 64299788 65701814 67870136 69827614
12083 69827614 71891672 73498083 74148901 75460621 75752508 75992126 75415365 75206973 75306082
12074 75306082 75489015 75212942 75335457 75203044 73960098 72652122 71287872 69544675 67597460
12065 67597460 65227817 62293037 60444510 58599390 56571330 55039364 54317476 53181698
12057 53181698 52584705 51556626 50643739 49934440 48638437 46984240 46277480 45142240 44134238
12048 44134238 43190402 42292826 41470676 41345130 40852346 39922197 39415979 39047638 37961471
12039 37961471 36999754 35968877 34742934 33740506 33241275 31938298 32473113 31968746 32668240
12030 32668240 33535069 34292700 35416162 36309987 36872092 37642582 37757561 37211792 36099231
12021 36099231 34639008 32546581 30894336 29055041 28193135 26632128 26478977 24934351
12013 24934351 24578912 24344939 23241753 22793478 22027908 21062495 20773230 20044638 19772661
12004 19772661 20034111 19868489 19955179 20597092 20974192 20900382 21487661 21409987 20940394 20434842
11994 20434842 20559638 19481675 19760565 18993913 19005078 18801984 18301238 18551908 19344995
11985 19344995 18927429 18549733 18571401 17279262 17177512 16686926 16330788 15491681 15649817
11976 15649817 15655443 15403710 14985830 15217250 14748059 14395784 13608477 13375544 13049349 12002326
11966 12002326 11941493 11424078 11346556 11315200 10681918 11069181 10958333 11110517 11386181 11145211
11956 11145211 11535884 11621259 11912123 12057281 13069915 12561389 12258996 12247562 12511937
11947 12511937 12095678 12368893 12039951 12713269 13146256 13629388 14068844 14809122 15333607
11938 15333607 15631035 15974290 16210266 16654011 17228768 16795338 16948250 16758046 16584488
11929 16584488 16423778 16277142 15987571 15954696 15023546 14537704 14594713 14231436 14163483 13782517
11919 13782517 13676784 12496598 12697613 12487631 12153946 11843095 11988124 11718204 11900157
11910 11900157 13204148 15959200 20299162 26263773 33862049 39005999 39883528 39685072
11902 39685072 39169407 36947771 34080573 28272880 19442180 14555167 12237816 11569736
11894 11569736 10682945 10720691 10232255 10375211 10255871 10312142 11281792 10998496 12027565
11885 12027565 13031555 14012188 15940440 16966372 18013914 18685731 19312611 19468831 19805746
11876 19805746 19149473 18187643 17160623 15941071 14897608 14055770 13193688 12225400 10889864
11867 10889864 10680799 10182414 9556347 9308463 9415877 9370003 9340167 8261567 8479097
11858 8479097 8424918 8682080 8409477 8694324 8995816 8686719 9229843 9652575 9865129 9947887
11848 9947887 9817612 10603833 11315674 11678182 12267287 12857070 12993557 13735576 14040246
11839 14040246 15025148 15186849 15409078 14594862 14160797 13698488 13128148 11962829 11737521
11830 11737521 11957041 11681105 12267541 12221448 12471720 11908262 11440410 10966083 9968557
11821 9968557 8963324 8447134 8389890 8130468 7577355 7814899 7605512 7907467 7354840
11812 7354840 7056886 7065223 7067420 6373206 6475644 6990771 6411629 6083712 6562491 5940614
11802 5940614 5857221 6258404 6280872 6122418 6257868 6396466 5833333 6010496 5867273 6252196
11792 6252196 6586445 6576267 7044116 7098322 8236695 8560160 9135248 9728384 10333832 10043245
11782 10043245 10115524 9750104 9036282 8550726 7632010 7000306 6461686 6385761 6023453 5522488
11772 5522488 5515250 5297483 5769089 5311104 5407654 5545128 5651044 5221610 5481875 5622828
11762 5622828 5015748 5436667 5523772 5212964 5080798 5126975 5097826 4888711 5193489 5209132
11752 5209132 5012136 4841464 4799977 4769702 5006495 5133272 4842634 4825673 4606181 5122896
11742 5122896 5297642 5228157 4736039 4764155 4850235 4830516 4834797 4722974 4621848 4317284
11732 4317284 4408723 4957946 4701280 4899290 4965932 4262348 4294282 4675028 4575294 4934636
11722 4934636 4532394 4407730 4914450 4670770 4243069 4601614 4680247 5161823 4565400 5059945
11712 5059945 4713740 4945766 4540877 4834955 4421320 4816803 5107476 5068530 4854391 4683489
11702 4683489 5088705 4691760 4640051 5137822 4824350 5121679 4581427 4719064 5067171 4398160
11692 4398160 4306342 4859083 4837048 4534557 4874611 4870935 4297719 5031241 4850471 5096882
11682 5096882 4713239 5199311 5255774 4854804 4972860 4965635 5232102 4984686 4837647 5115881
11672 5115881 5060107 4816475 5308661 5387655 5544035 5218638 5373922 5406692 5332221 4914827
11662 4914827 5459635 5253980 5707362 5253021 5508256 5044769 5491900 5365347 5416439 5320207
11652 5320207 5054246 5547074 5342729 4996226 5110933 4768131 4877460 5403746 4844687
11643 4844687 5515972 5385738 4792745 5535609 5392215 5571328 5537365 5285288 5278515 4939371
11633 4939371 5398110 5338766 5948470 5290010 5544824 5483784 5618664 5744054 5479843 5807981
11623 5807981 5359237 5016646 5709940 5399507 5344203 5186193 5302505 5579450 5247098 5410361
11613 5410361 5608113 5227979 5300343 5608587 5208255 5783642 5044447 5795960 5777408 5436955
11603 5436955 5404005 5816752 5630102 5873664 6024012 6192895 6322784 5913725 6295072 6353006
11593 6353006 6821373 6259836 6254942 6198494 6024706 5848679 6283581 5657548 5699716 5771991
11583 5771991 5313818 5989695 5912904 5749717 5822631 6198608 5776276 5868905 5664730 6574938
11573 6574938 6288273 6490539 6291004 6156257 5812983 6468901 6115535 6265454 6537203
11564 6537203 5699780 6697920 6409117 6168147 5917839 5621160 6395547 6189188 6060369
11555 6060369 5673743 5905784 6094111 5875230 5956335 5849280 6102485 6152451 6328759 6010209
11545 6010209 5681946 5964990 5752254 6040915 6023253 5371924 5814732 5699656 5394102 5935382
11535 5935382 5809745 5566807 5950543 5756028 5668245 5930306 5866684 5887129 5658680 5701501
11525 5701501 5933974 5544029 5293395 5971515 5673080 5711687 5694649 5652944 6152408 5949018
11515 5949018 6256707 5470891 5747808 6093668 5845523 5594694 5981347 5835203 5353691
11506 5353691 6316509 6024352 5853573 5928537 5894977 5826247 6180377 6246188 6039064 6113770
11496 6113770 6194671 5667327 5982210 6190814 5704996 5800406 6218401 5625145 5844236 6558799
11486 6558799 5855292 6087626 6367988 6018654 6715156 6593149 6181931 6136133 6426357 6575633
11476 6575633 6565074 6282788 6244856 6649562 6511531 6134306 6493621 6117659 6351193 5969302
11466 5969302 6675015 5856924 6276451 5993352 5971225 6042395 5897590 6184694 5673981 5757174
11456 5757174 6537709 5742985 6066431 6083138 5777845 6048259 6262585 5826230 5852917 6190063
11446 6190063 5857365 6594229 5875698 5885071 6189357 6343603 6292632 6330353 6535687 6489122
11436 6489122 6585438 6979000 6549873 6431716 6931885 6753720 6743872 6927884 7600544 7280112
11426 7280112 7229453 7142095 7233296 7821025 8047067 7688774 7896249 8158421 7897575 7989607
11416 7989607 8048322 8684071 8491666 8341827 8793722 9415144 9422643 9387728 9023849 9511177
11406 9511177 9865107 10304468 10348867 10288050 10389138 10549409 10762651 10789330 10863569 11570084
11396 11570084 11138660 11828726 12013872 11847094 12019388 12483975 12527933 13062570 12929241
11387 12929241 13502134 13745610 13826301 13968416 13625366 13976681 14133567 14307082 14631845
11378 14631845 14741293 15191760 15316889 15112699 15428459 15951377 15281614 15948447 15847920
11369 15847920 16161525 16181473 16154455 16172521 16333217 16015221 16603440 17215141 16451165 17449762
11359 17449762 17207591 16366800 16874733 16786431 16653759 16702120 16519459 17432130 16941796 16837130
11349 16837130 16774416 16464152 16823416 16570363 16172678 16521483 16057372 15739901 15996381
11340 15996381 15688229 15771804 15397275 15482102 14910951 14981343 15143965 14549362 14876473 14033393
11330 14033393 14493477 14150916 13670832 13377519 13350452 13446055 13254780 13455436 12522368 12938212
11320 12938212 12806454 12054183 11967896 11942988 11671311 11405963 11432709 11314856 10898923 10782297
11310 10782297 10386804 10090189 9823679 9961305 10107853 9434543 9332295 9410851 8727734
11301 8727734 9024342 8833813 8500020 8554441 8202229 7633914 7626773 7670300 7752625 7793639
11291 7793639 7863565 7832911 7011008 7325726 6861138 6515013 6843907 6550353 6562806 6229561
11281 6229561 6415953 6224611 6809732 6543785 6121381 5904366 6187945 5886569 5829042 5895923
11271 5895923 5912539 5678101 5802181 5921698 6024726 5599681 6062844 5258889 5676340 5504987
11261 5504987 5783241 5868128 5310387 5757938 4751485 4985344 5570717 5545524 5195914 5254551
11251 5254551 5406813 5120273 5059857 5095528 5339665 4799293 5230267 5397774 5387080 5330037
11241 5330037 5432787 5476489 5712773 5332430 4879051 5592519 5440173 5222342 5324077 5182266
11231 5182266 5658264 5834035 5689403 5111794 5755860 6148645 6793557 7919566 8955273
11222 8955273 10679619 12460230 14103595 15509874 15304244 14423641 14038919 13131427 11708023
11213 11708023 9521109 7856290 6802432 6512910 6080722 6157245 5855730 5632506 6060915
11204 6060915 5690304 5534082 5798995 5482124 5515751 5376046 6399321 6618271 7391887
11195 7391887 8030354 9753554 10845265 13273817 14355680 14883675 15372718 14915644 14267824
11186 14267824 13008662 11167243 9086981 7822829 6910076 6765594 5975567 6063236 6234392
11177 6234392 5990978 5345838 5392017 5627576 5730491 5937997 5515323 5685682 5959023 5766021
11167 5766021 5798751 5163299 5903758 5489341 6479746 6057390 5822675 5902227 5710194 5990921
11157 5990921 5958101 5888321 5992988 5867388 6101615 6203427 6215349 5784849 6116401 5805136
11147 5805136 6390824 6228232 6186068 6575785 6099194 6169061 6277734 6357849 6055943 6137903
11137 6137903 6788320 6408213 6522197 6789970 6278773 6840132 6434451 6477478 6601507 6926843
11127 6926843 6604285 6643923 6419881 6561717 6949810 6844576 7182343 6917421 6372817 7014186
11117 7014186 7039075 6755825 7266280 7124344 6853235 7317978 7025003 6971661 7237093 6934006
11107 6934006 7320049 7142437 7404105 6791548 7201915 7018100 7313431 7280065 7413653 7292052
11097 7292052 7609256 6956692 6669569 6842672 7321038 6991904 7453037 7201699 6980795
11088 6980795 7274075 6923889 7215812 7266586 6840737 7501587 6854422 7127369 6968190 7482773
11078 7482773 7478182 7178805 7628773 6851774 7048971 7357933 7824732 7487437 7348876 7640730
11068 7640730 7705430 7792219 7668216 8160863 8099530 8229581 8562441 8301806 8938293 8936718
11058 8936718 9124081 9060041 9343570 9306805 9895265 9723522 9540738 9855490 9896597 9633581
11048 9633581 10467647 10389988 10907959 10229021 10328113 10767401 10376364 10383679 10838674 11312315
11038 11312315 11364786 12350210 11792753 12289509 13136102 12928785 13716550 13346291 13682289
11029 13682289 14312131 14267095 14408425 14415482 14735509 14432570 15013044 14863563 15190034 15105795
11019 15105795 15055264 15678748 15673116 16217550 16478390 16933383 16604247 17362468 17993093 18124514
11009 18124514 18613190 18800507 19420917 20037422 20515724 20849008 21086389 21794187 21768551
11000 21768551 21713416 22248171 22377647 22630410 22654860 22967132 23446555 23504438 22944869 23563118
10990 23563118 23809057 23837768 24555252 24786462 25370899 25272590 26054890 26865574 26949098 28046658
10980 28046658 29104312 30492377 31351967 32291979 32440491 32836282 33294638 33044727 32989422
10971 32989422 32962482 33378215 33952861 34694315 34996266 35710032 36770608 37832269 38803350
10962 38803350 39605411 40902128 41699444 42755318 44126118 45125241 45936093 47492459 49143022
10953 49143022 50521370 51572323 52768589 53419162 54398491 55174031 55889199 55910951 56076766
10944 56076766 56645173 57575692 58628540 59826506 61387936 63052696 64108802 65538916
10936 65538916 66954978 68719866 70300733 71450499 72479038 74316554 75224388 76119270
10928 76119270 76793738 76874513 78363600 79113028 78970837 79427803 79412305 80540085 80139563
10919 80139563 79926971 79513029 80026885 79505721 79087688 78771261 78703024 78689909 78303237 77761530
10909 77761530 78368064 78594271 78293928 78887549 79353382 79950991 80295412 80953326 81531615
10900 81531615 82281923 83918115 84934792 86987663 88402062 89433693 91993181 94029569
10892 94029569 97296998 99919067 103922635 107207268 112389176 118196232 124181731 130957030
10884 130957030 137828207 145824260 154690512 162624913 171123640 178805240 185669786 190599825
10876 190599825 194057321 195836718 195057706 192975275 189275190 184013883 177739218 170560740
10868 170560740 163031111 155393403 147134117 139671508 132057125 125495235 117996639 111356149
10860 111356149 105159480 99458328 93487407 87774168 82537891 77631985 73301854 69137025
10852 69137025 65215138 61255604 58038613 54773609 51913185 49396657 46377165 44292020
10844 44292020 41666803 39939936 37629236 36215659 34361569 32855211 31065740 29455196
10836 29455196 28557867 27528987 26512780 25448317 24718888 23363246 22336437 20968155
10828 20968155 21347408 20733127 19240482 18916414 18203020 17718167 17636575 17579277 16488796
10819 16488796 16074108 14999782 15125268 14573406 14763706 14043379 13776289 13941168 12937570
10810 12937570 12618793 13032311 12576691 12283070 11832578 11274390 11542364 11599767 11310666
10801 11310666 10899949 10644373 10086873 10414294 10083707 9717099 9772773 9217475 9017881
10792 9017881 9082545 9049246 8916688 9332509 8729707 8836912 8443811 8753917 8604954 8495271
10782 8495271 8292303 8323968 8139599 7993022 7964730 8021761 7009972 7420263 7796589 7015502
10772 7015502 7814669 6884516 7420677 6583363 6604671 6599252 6176542 6684085 6473148 6080453
10762 6080453 6480313 6217534 6362288 6412369 6021111 5967605 6012916 6238544 6103853 6404785
10752 6404785 6138956 6691057 7060117 6083338 6295247 6471624 6083564 6306217 5847510
10743 5847510 5391736 5433244 5726285 5178006 5617720 5196434 5648515 4986594 4906488 5036823
10733 5036823 5050306 5201202 5528460 5028350 5566128 5778657 5615759 5510315 5701198 6124852
10723 6124852 5962266 5879674 5731838 5374314 5328322 5383632 4741045 4936945 4745431 5259492
10713 5259492 4684872 4915067 5274066 5080569 4764859 5032590 5146730 5217759 4938581 5416374
10703 5416374 5566522 5119070 4944360 5119271 4805184 4835254 4676496 5025379 4619540 4652974
10693 4652974 4871740 4555816 4793374 5125381 5017083 4737822 5127646 5000647 4865036
10684 4865036 5451083 4971041 4968115 4932025 5037096 4933944 4803592 4910173 5398589 5030884
10674 5030884 5231911 5565553 5653495 5169268 5682334 5563929 5131409 5446827 5100995 5148460
10664 5148460 4267268 4882445 4122481 4446031 4551079 4630278 4317936 4613119 4520855 4456474
10654 4456474 4666290 4588794 4629487 4953657 4770746 4907619 5223570 4918856 5500710 5116606
10644 5116606 5034033 4603525 4610454 4289051 3615785 3976602 3559232 3284409 3568614 3717272
10634 3717272 3873094 3471810 3180943 3706600 3537960 3154745 3625345 3765878 3442457
10625 3442457 3612318 3392373 3312320 3267280 3542975 3396190 3508564 3125344 3677014 3393755
10615 3393755 3626603 3134991 3834986 3337953 3774476 3299158 2984538 3039531 3289744 3506386
10605 3506386 3100771 3133922 3840261 2966928 3376525 3737286 3287779 3580606 3130763 3882448
10595 3882448 3583086 3852203 3613020 3580534 3864752 3236321 3754689 3597368 3430122 3053688
10585 3053688 3032333 3172962 3188476 3720124 3285728 3621617 3810218 3927746 3378031 4004086
10575 4004086 3593508 3940114 3177203 3660963 3851296 3681575 3164531 4028840 3739525
10566 3739525 3269701 3482330 3701329 3086209 3092377 3138643 3146673 3285644 3030806 3041421
10556 3041421 3573593 3181719 2914825 2952535 3092622 2870361 2901677 3058148 2896297 2992322
10546 2992322 3244115 2645345 2664424 3115473 2807042 2794415 2630865 2936200 2787778 3038015
10536 3038015 2822692 2860174 2725753 2644784 2172553 2854424 2861649 2779812 3012869 2701931
10526 2701931 2702105 3078563 3203004 2766293 3404760 3387163 3349792 3974704 4538127 4579962
10516 4579962 4595534 5475592 5256777 5160702 4996533 5080425 4475535 4497643 3857487 3798350
10506 3798350 3546368 3325850 3488674 3712341 3006924 3445085 3048703 3628487 2925485
10497 2925485 3444247 3202787 3864841 3333161 3605729 3819121 4371467 4282402 5160001 5990823
10487 5990823 5981009 6020839 6020609 5644289 5590452 5267538 4673830 4041042 4154943 4058096 3948418
10476 3948418 4295783 3985747 3649114 4407881 4273215 4068538 3951773 3687298 4322814
10467 4322814 4164075 4619787 4747422 5092543 5675206 5183790 5927697 5198731 5371002
10458 5371002 5587210 5428245 4782225 4866561 4459384 4389421 4934193 4335460 4266035 4481748
10448 4481748 4684311 4426079 4515979 4369417 4349822 4404321 4675938 4520360 4660953 5143907
10438 5143907 6112341 6379892 6952318 7743884 8330362 8153709 8446347 7675749 7664807 7257039
10428 7257039 6054865 5504257 4989430 4859095 4475496 4730945 4616367 4852744 4475574
10419 4475574 4554945 4653946 4405236 4032566 4565527 5126837 4297514 4909898 4950478 5871089
10409 5871089 5481108 6337333 6776515 6556672 7088697 7455730 6703481 6849962 6386125
10400 6386125 6151796 5768864 5875713 5980074 6171589 5989041 6348505 6500846 7080181
10391 7080181 6979377 7111543 6904877 7186432 7272916 7320144 6917449 6868178 6976035 7310525
10381 7310525 7011975 7637593 7014943 7256944 7532904 8117800 8279530 8629521 8661326 8892535
10371 8892535 8726187 8935782 9283707 9438170 9803751 9711640 10215361 10419005 10192053 10162218
10361 10162218 9955495 9445051 8780792 8806288 8327364 8698883 8352427 7983047 7980308 8021788
10351 8021788 8469074 8602589 8702421 8755045 8470595 8406968 8550525 8557422 8020652 8321031
10341 8321031 7886444 7791462 8177368 8748985 8195115 8550273 9776963 9489200 9919299
10332 9919299 9755705 9479272 9530078 9079084 8824033 8827864 8930193 9025559 8577686 8574490
10322 8574490 8761295 8890514 9286902 8826531 9021913 8675121 9436647 9183072 9188612 9148649
10312 9148649 9297146 8933623 9869185 9692419 10215587 10528876 10927505 10703393 11353691
10303 11353691 11244143 11529520 11273775 11448402 11630133 11564927 11426200 11917004 12145370
10294 12145370 12233279 12917534 13502723 14079283 15083716 15467027 16457567 16868854 17537756
10285 17537756 18189537 18730963 19037871 19739731 20329904 21237598 21864288 22697660 23086655
10276 23086655 23932610 24312662 25196936 25450656 26403669 26917637 27389040 28216986 28984632
10267 28984632 29579260 30933687 31975530 32965534 34289194 35194386 35885139 36762708 36955129
10258 36955129 36772888 36955556 36831872 37184853 37026516 37003043 37184979 37960412 38779283
10249 38779283 39470102 39792114 40102191 40427138 39933832 39644155 38686442 37461042 36341718
10240 36341718 34730985 34013348 32848618 32084114 31510857 30853899 30543983 29691001 29183789
10231 29183789 28327366 27726731 27498465 26731266 26042130 25923054 25425641 24848232 24527848
10222 24527848 24592226 24543542 24002717 23897587 23957946 23166542 22486577 21568920 21349319 19808673
10212 19808673 19447587 18716693 18210297 17201929 16505621 15780297 14873588 14334429 14196390
10203 14196390 13340302 12628669 12212294 12004492 11349833 11418033 11107201 10791713 10288820
10194 10288820 9815968 9531071 9419258 9208473 8895923 8797415 8431168 8450414 8525547 8689604
10184 8689604 8569626 7899484 8575959 8291281 8233966 7889555 7846692 7847741 7935286 7998978
10174 7998978 7775992 7212171 7066560 7318995 7152272 7216944 6559226 6896510 6903125 6950479
10164 6950479 6665241 6413851 6924431 6232506 6878950 6625832 6710090 6983349 6499990 6320256
10154 6320256 6411974 6546400 6528533 6571933 6569819 6819966 6464163 6345263 6671399 6477361
10144 6477361 6411897 6402316 6149282 5799384 5789729 5886955 5589436 5960705 6148290 5603619
10134 5603619 5760878 5278263 5586762 5017886 5502966 5428084 5661464 5318004 5217975 5351794
10124 5351794 5219483 4851394 5112093 5183441 4897327 4491214 4690216 4571268 5029973 4773205
10114 4773205 3960939 4353395 4694311 4475213 4420181 4027434 4039328 4627546 4524984 4567918
10104 4567918 4190727 4075707 4019321 4069151 4073769 4461567 4199709 4433282 4284654 4322476
10094 4322476 4196292 4187354 4319391 4089589 4073611 4278515 4487175 4164295 4651125 3997973
10084 3997973 3859714 3992568 4198950 4639054 3786045 4351380 4438929 4578185 4286863 3942013
10074 3942013 4131915 4465462 4369411 4624243 4560865 4281891 4562447 4453762 4231190 4700201
10064 4700201 4232478 5008620 4795255 4623872 4736611 4595895 4978418 5278739 4952689
10055 4952689 4709406 5045458 5137156 5113217 4951513 5157858 4665486 5062246 4934084 4747448
10045 4747448 5011610 4711979 5233671 4743376 4810849 4685878 4575103 5429257 5075212 5252936
10035 5252936 5108874 4657050 4753455 4763974 4387051 4979582 4928933 5129971 5303446 4818502
10025 4818502 4826736 5240863 4904319 5201743 4879338 4848098 4754867 5079097 4819169 5329720
10015 5329720 4832151 4454569 4652759 4294937 4901638 4541762 4600708 4166407 4131296 4089642
10005 4089642 4727844 4377092 4250310 4212226 4392256 4293612 4360870 4294538 4683803 4003165
9995 4003165 4215086 4241981 4059562 3588554 4212315 3918645 3686225 4179713 3762330 3796107
9985 3796107 3559373 3566875 3589200 3690555 3295338 3217556 3105028 3583212 3695876 3153435
9975 3153435 3605162 3487648 3215876 2965444 3171236 3024040 2917668 2784272 3247905 2769416
9965 2769416 2714152 3260015 2701836 3635965 2708442 2783300 2497140 2617691 2579937 2631106
9955 2631106 2963303 2563213 2457863 2257575 2595711 2255195 2194128 2425822 2592240 1958286
9945 1958286 2215449 2053119 1898519 2467106 1641837 2228833 1994089 1685618 1902706 2099052
9935 2099052 2565529 1742548 1723434 2240733 2015607 1970207 1934827 1921688 2173807 1808785
9925 1808785 1883370 1944820 2037721 2131619 1709332 1752539 1636514 2110353 1610378 2110044
9915 2110044 1973245 1878581 1876885 1621933 2115670 1359684 1794157 1612277 2003565 1994177
9905 1994177 1386405 1468594 1333133 1584671 2014297 1676145 2088269 1725313 1828798 1549538
9895 1549538 1588610 1912546 2012241 1307664 1727849 1872969 1440303 1635649 1941100 1564545
9885 1564545 2398227 2035194 1505055 1563302 1767051 1487667 1736083 1813832 1504823 1747921
9875 1747921 1198844 1632617 1755861 1754216 1776623 1639157 1538236 1789715 1510979 1648906
9865 1648906 1876247 1391753 1450568 1612223 1346558 1396756 1860105 1566168 1747465 979062
9855 979062 1813240 1496563 1948589 1550455 2038108 1116651 2085708 2107475 1227501 1901676
9845 1901676 1942110 1806321 1774807 1879795 2241144 1745094 1255862 1412227 1581330 1744196
9835 1744196 1673799 1413724 1507457 1437863 1715818 1291932 1981176 2136185 1786947 1727942
9825 1727942 1892747 1825859 1694175 2026888 1964938 2041456 1661057 1795043 1665076 1882865
9815 1882865 2011896 1682858 1963384 1703814 1891112 1296626 1674558 1236962 1611436 2006019
9805 2006019 1460733 1512589 1632756 1139141 1651510 1537932 1845540 1518637 1843178 1957227
9795 1957227 1558209 1317059 1095481 1373545 1744444 1989026 2151688 1581185 1969255 1394953
9785 1394953 1597500 1486701 1478244 1079614 1583928 1763845 1217624 1258209 1343614 1541998
9775 1541998 964980 1733992 1670578 1428250 1462774 1604062 1465798 1767075 1253688 1107173
9765 1107173 1603573 1825869 1306792 1112798 1284329 1258037 1103775 1259955 1110736 1106610
9755 1106610 1384308 1474249 941170 1398445 1784235 1686755 826748 1742386 946732 1163809
9745 1163809 1939269 1244404 951910 1620252 1073210 1359855 1071663 1424365 1096621 738991
9735 738991 1258184 1036565 648454 901608 1012022 713205 1010900 940042 1106948 1493455
9725 1493455 1031179 770595 958266 1168364 1106608 1028586 1139863 1247785 504559 742392
9715 742392 1020540 1009522 1080122 684880 506687 909206 649759 944433 904502 934146
9705 934146 1160477 852125 1089963 767389 1191799 1243197 227788 1100634 751081 981956
9695 981956 961656 1282953 1082581 927449 774311 1432815 807377 1041235 891383 489228
9685 489228 723194 781579 834244 735709 1116979 474295 745886 1062378 834692 654102
9675 654102 437825 988891 557848 991896 1022543 616280 727521 975841 1037976 984437
9665 984437 409160 612139 681535 638619 719578 1005958 903708 1446367 865484 1039221
9655 1039221 1071939 1266793 1287550 580340 975569 1136592 1023286 593659 1414914 1188224
9645 1188224 607515 937364 950372 922986 1133409 896053 752296 666519 833130 1171599
9635 1171599 771253 694473 925940 1152953 790838 942287 898885 1018741 371282 1168666
9625 1168666 458728 852964 880825 1324708 720470 847693 686610 748706 1074935 515310
9614 851118 965671 802630 723329 1105515 1066400 1325144 1118648 639812 917375 940247
9604 940247 768425 583535 768960 834674 994081 671146 643796 926644 1154429 1193837
9594 1193837 823454 927561 1243773 1104609 756576 461848 772714 1003574 1226130 768071
9584 768071 664558 524847 604808 669845 1017057 201770 1282294 699640 762520 887455
9574 887455 650401 463023 664643 858338 609244 707932 543180 869679 539687 1064866
9564 1064866 761655 1169142 759213 177597 1051115 717234 1256994 424790 881704 720424
9554 720424 567550 915101 929688 605086 759345 667919 587400 622281 653445 902772 651315
9543 651315 838999 806245 704978 859259 422706 571971 345465 466505 989035 584517
9533 584517 644726 1102585 621251 417517 441783 706344 271709 587125 655597 1008481
9523 1008481 615594 1280548 896863 707938 985072 796990 314082 511588 624273 738957
9513 738957 500546 919817 768077 771494 629368 449911 768207 538942 948644 269322
9502 465162 587290 659620 984991 805256 177563 771532 535233 1023898 946028 329969
9491 360433 814326 427516 840292 85946 889429 681153 1111396 486862 540262 327818
9481 327818 528873 598265 322072 566109 639390 514722 519050 654666 479513 649728
9471 649728 895817 364523 631086 710850 523562 526279 574598 281281 754211 495344
9461 495344 630625 743355 147991 591373 333299 725182 325239 751425 593236 684078
9451 684078 281533 564581 777847 324290 884850 761753 588743 959115 238766 365695
9441 365695 747373 864714 521756 466971 580414 702069 653956 610610 429919 373232
9431 373232 437078 861580 517473 391058 583216 820337 845037 616146 503032 239098
9420 670324 274501 612188 319228 467061 573832 728313 524307 498019 244716 971799
9410 971799 934513 455520 298664 870440 244495 735096 356395 168132 529730 594507
9400 594507 779047 71387 569577 344005 484692 769660 394652 569088 -48317 765600
9389 168373 486880 821751 198721 693576 166936 525382 741909 441729 444372 618810
9379 618810 131521 300094 294070 417687 407464 631025 586432 450371 404118 462911 267995
9368 267995 429932 543640 -22432 503446 921151 12267 285864 619538 607865 254455
9357 136735 851804 115591 36730 818704 733963 944141 465601 796752 758688 -68298
9346 501478 178917 453008 933250 516943 475065 320388 382875 547428 149885 130981
9336 130981 633082 186922 756396 623172 445943 106551 270011 -70761 418568 654479
9326 654479 465428 412762 220495 555978 559775 481298 298514 457719 500334 410833 101690
9314 411027 344443 841235 518224 402191 440276 682412 206281 680481 297300 717514
9304 717514 315913 359070 397305 285859 405413 -91344 498292 333034 150653 825305
9294 825305 865899 853773 388167 335382 440260 706723 527392 -150652 642668 508924
9284 508924 577229 479126 591302 436879 445172 394312 313102 180142 438194 213996 695213
9273 695213 530327 505204 450359 141391 59884 -91972 206877 1090947 833084 529388
9263 529388 461621 -40511 878232 604821 980459 200641 154498 384558 276690 586673
9253 586673 544035 342014 880938 513372 571932 644654 292899 357665 289679 539745 191219
9241 506564 741210 285565 584118 399216 577550 303116 438655 350159 273585 428103
9231 428103 290859 758204 559732 164673 200318 315829 604898 189304 384220 634467
9221 634467 247965 438913 685060 -15575 162622 383358 471644 67363 487050 262545
9211 262545 474177 565474 627847 377334 426377 496437 430715 569387 396326 107953 802737
9200 802737 608710 429413 378142 287370 307127 568672 -227988 607801 532643 -124111
9189 416787 301680 854669 214637 126178 264880 300088 87649 88595 557955 216546 487697
9178 487697 311473 -28287 381742 71478 296535 726868 879662 45772 571566 -56554
9167 365637 326058 153280 460040 367055 93540 525451 514750 580636 268078 -11337 382950
9155 441262 412055 437744 58034 426094 72167 568729 592083 489259 446275 724873 460427
9144 460427 290378 396323 166390 475949 325641 373369 111475 102397 400422 1070111
9134 1070111 348088 738372 326249 524215 465052 195560 450217 1012204 59025 643340
9124 643340 90920 172662 964530 646511 3534 405704 -157606 146507 431066 350451 268699
9113 268699 -194302 291797 548530 276129 183769 287752 504483 -22104 351843 737160
9103 737160 392277 439851 543422 712305 -38608 283635 592005 566395 963910 468865
9092 518330 217322 191428 698614 634129 519188 326082 185606 739237 808066 690067
9082 690067 227885 553853 468211 302749 233204 419473 105716 467715 762333 649451
9072 649451 245712 189602 215834 384658 512735 497836 408661 858852 498474 643805
9062 643805 12143 253900 -98455 463256 249870 239647 633607 509592 568161 98099 5650
9050 331272 77252 436551 74421 -100357 786246 624662 367766 177481 694194 54710
9039 65734 586726 779124 557912 526102 -105758 44203 374617 558330 537217 811930
9029 811930 424167 271124 216609 330637 92355 637655 -177643 596179 479287 527169
9019 527169 470734 391854 445124 398457 23876 441066 484026 110579 -30905 299866 211659
9008 211659 563609 274603 267575 181348 160895 541225 646625 216935 57946 151815 -1202
8996 529750 217183 262995 242321 156818 556167 455180 289752 582741 177154 429841
8986 429841 543075 274349 536436 592547 271882 310789 46628 16812 354694 342890 193136
8975 193136 601971 302557 -4578 364653 341299 439795 19658 350990 37045 8319 721306
8964 721306 98098 402440 360141 696745 290946 609777 503630 280070 503746 207566
8953 289788 383783 222006 438780 354672 -83304 772323 447019 277489 627212 895510
8943 895510 28548 371243 606550 805293 642709 20670 571271 197161 88684 462742
8933 462742 980360 710867 550863 610975 681100 482799 509022 270036 870730 618780
8923 618780 190765 404923 1003113 624371 533676 258786 454494 1126865 656550 601270
8913 601270 589698 823418 531106 742721 611706 584703 580897 728041 684617 268596 789079
8902 789079 527569 757690 504594 1089665 680093 936158 642527 996845 771653 846861
8892 846861 1100332 586257 633318 762244 607427 780782 817820 1033291 1034723 1251632
8882 1251632 1196609 1043523 1170965 1058037 1028989 823420 1316829 938836 821480 937504
8872 937504 1030722 1136188 966769 1080314 735231 1073510 1031449 1213277 539629 679721
8862 679721 969429 958564 629648 1023386 1410824 961386 591010 1134784 1015143 587753
8852 587753 857912 463457 888184 977123 1118010 890515 582333 919019 664668 797646
8842 797646 705930 732370 707012 451188 687545 662171 1088746 576129 118571 425677
8832 425677 392421 739813 401279 663346 810559 964074 488096 92019 483902 318537
8822 318537 642774 326108 234679 897426 164383 399632 548590 593659 447486 364382
8812 364382 684687 785065 364067 294457 776226 349931 380974 837143 384823 298386
8802 298386 517530 142799 140305 597723 1019025 1163 439302 117904 -101881 416337
8791 -155878 28256 449252 724047 683817 397196 590929 245967 164930 452674 108651
8780 342488 231328 174255 -110299 209530 369606 216859 511002 319195 354366 233185
8770 233185 204151 -126288 330057 209378 176674 391184 404077 508157 374935 517600
8760 517600 265527 632889 121547 156854 -58832 397501 -147537 452316 2574 316285
8750 316285 222839 355544 96989 431725 490861 -181634 65796 309712 206551 27554 515267
8739 515267 67769 281534 382197 201762 92432 -37635 412429 -16890 598509 706203
8729 706203 267898 492644 390443 302503 313229 -266946 537572 494153 670398 396000
8719 396000 672835 521480 293770 237368 595156 5897 157147 174952 486576 175689
8708 614100 47414 428704 371883 105126 417910 170826 59946 -275880 223482 377498
8698 377498 317946 -341795 151206 598538 370513 237789 813497 302894 548411 642624
8688 642624 66425 279708 443516 184510 349960 196086 223222 73924 396446 449586
8678 449586 359156 50607 361369 534302 777146 436477 327505 491422 614254 119879
8667 408005 241529 58169 92689 291881 218929 478956 125855 580030 -160253 323574
8656 344682 37246 47630 343704 126484 23381 188378 -42456 471008 -23670 329243 -13086
8644 50739 505733 335476 324567 599847 469749 470343 -257378 360040 267280 62427 -208623
8632 224439 -292244 545942 104357 340975 547411 285938 52805 288728 357227 155711
8621 455413 371506 273493 306001 75319 118586 274287 419901 501540 48960 -40167 790358
8609 -287835 407288 558708 -18710 299036 494395 335675 -72414 321275 118648 543858
8599 543858 206921 611728 296839 322549 50973 96341 451880 299563 -105691 108680
8588 -280339 300804 367442 676342 575620 140004 311682 -6687 490833 379186 207381
8578 207381 -130081 574282 373526 280500 215259 28206 667013 -247891 222964 -10861
8567 -119232 283259 140004 139328 215587 332144 -63944 500296 663393 378898 540375 207628
8555 154232 18201 677754 1072992 753688 52925 375884 475038 353743 666993 528618
8545 528618 -69279 327764 58116 446013 370544 44907 487434 347435 248251 544874 324273
8534 324273 336912 666043 92544 465582 409824 -394041 855023 71657 360425 436641 498138
8523 498138 145147 512168 570900 294990 140379 117562 598061 281044 444991 645758
8513 645758 329665 400510 141306 335538 45280 777135 374459 -133734 504611 455372
8503 455372 -109090 -71261 566209 338309 313175 301622 319698 607356 256898 106998
8492 120744 119912 68898 144058 50345 313923 602336 121068 431936 215823 307406 -13246
8480 660961 -483586 519433 146548 524452 371486 726197 230745 475359 572007 254307
8469 62884 -51493 114346 407288 55641 371703 -196743 436112 -158773 175064 162365
8459 162365 330616 354203 428329 137338 472081 242154 308236 911002 238621 152944
8449 152944 437280 -270412 214840 660025 158815 -138155 200015 57968 376575 67173
8438 74193 322537 486379 -349178 539343 262267 -158633 249982 44755 519144 145173
8427 405732 166461 -77262 642954 -228404 627124 17308 286900 238863 138712 649651
8417 649651 86489 483282 453988 448816 252297 -28109 560986 43772 179693 -21154 279641
8405 -541070 163107 -151867 105888 132875 198180 -46214 270890 156383 17713 190428
8395 190428 -177431 788531 363873 186625 358106 -388352 452722 -251296 -126363 185560
8384 416220 359434 110295 517772 344298 477058 77770 634534 318305 -171104 374819
8373 -149453 351315 622520 -296684 -262520 505599 -244199 305635 157673 217628 238580
8363 238580 171218 418662 -128295 29114 531560 4910 -19667 36285 -38453 210369 -105406
8351 474983 136310 258308 -154192 -127409 192936 192081 79211 252880 186718 376511 481375
8340 481375 -84176 334626 -8873 623582 437748 245341 -69836 383726 351373 403397 203037
8329 203037 -62378 169309 474168 32594 201362 640036 -12935 432368 479540 -169538
8318 661996 200072 -321550 165335 511573 380499 343646 563037 -126407 281557 185155
8308 185155 576067 229170 405673 806807 151370 499195 363485 216595 291252 367331
8298 367331 94934 523368 142037 -61415 132620 152188 156350 -285155 -51633 743542 25211
8286 246439 -77154 457674 -112085 66078 261221 297349 204235 263212 463568 587884 179612
8274 394030 170778 229451 -42314 410219 287289 358193 203759 746538 88972 308467
8264 308467 -68478 174206 268967 90177 122438 55792 -63231 388313 445205 -97162 -109847
8253 -109847 -8637 533433 277100 330117 182798 48397 357890 553664 238511 -119346
8242 -132727 -122399 204779 265773 482822 607285 -931 134318 342061 -4157 504481 -73836
8230 22872 299164 412720 -129472 909532 -150028 -210685 643563 247332 287557 -143106
8219 479157 -17006 440036 -239543 -52246 220126 608858 228460 247770 406174 161134
8208 374794 -330439 371262 -81706 -35887 249759 426521 69659 589784 31518 148056
8198 148056 -49806 477415 333459 506590 -43015 -122773 74092 249089 259238 147848 304693
8187 304693 7427 149479 602705 243186 503281 -112507 -60554 42259 913207 99207 435332
8176 435332 700130 378880 430933 420202 6862 -191900 984154 111471 257760 -84704 140586
8164 307152 114832 16023 -127265 -286192 508210 105804 215972 328278 -62062 198781
8153 -37463 79474 -305870 142447 -5340 161431 569365 394206 244236 355267 -311106
8142 139288 558788 492340 4013 736056 -222553 543696 211730 -233436 -204382 129696
8131 232981 781407 512272 440741 286849 -26244 -191215 114751 99997 95025 313800 -75891
8119 712242 246504 685066 -264427 217356 -532461 503338 124730 373518 159676 234222
8109 234222 226634 514111 760742 540248 262080 185972 218490 260616 371229 204251 108586
8098 108586 -92528 279057 202488 -248899 535811 390309 65946 322649 18725 621866
8088 621866 328620 266132 710919 -358700 631330 79786 321200 -152092 1334 119851
8078 119851 218708 588923 -125254 168692 80346 81914 108088 180644 -100073 301871 412400
8067 412400 740807 605855 -110122 153443 112796 479863 111928 -217354 315902 81179
8056 140964 -318593 574418 180760 -21265 123129 226385 41970 290641 286873 569414
8046 569414 298333 542952 -166772 389240 -180730 65429 419411 289271 212937 374944
8036 374944 -62062 312229 39110 535577 481097 412940 211631 -25623 274218 468983 295415
8025 295415 -186344 376932 589621 -64656 469965 214101 443242 451440 -3510 596759 -83272
8013 151151 177264 324252 -141550 494431 -57501 385231 -46661 790483 -14578 256915
8002 281254 171902 204368 408219 90860 -177698 234727 75290 -120890 -148896 51562 247918
7991 247918 285592 281732 400253 295395 185686 172978 172499 88582 194380 513839 313493
7980 313493 123114 214217 334414 60008 -10770 106213 121161 85187 230015 -240533 244305
7968 547124 561676 102370 155053 334768 340890 15237 210253 14874 373608 -293892 729873
7956 23361 604244 68456 316225 99955 200169 186449 130802 220394 -1995 222231 -519948
7944 279504 97391 172655 232610 227694 180459 103419 22305 227142 -153209 -24084 196474
7932 690716 213296 513700 316685 183060 67520 34870 359454 66638 23578 644277
7922 644277 -498482 -102212 -176906 625405 441943 39701 202208 269448 294611 -204582
7911 155228 -120031 557282 -104519 391460 141344 -178373 383269 -60231 215097 665620
7901 665620 166860 332725 496929 110759 106051 301167 -12009 119156 671122 -7191 142562
7889 53486 365159 135241 46918 -162977 404973 44640 165021 -429924 260150 463420
7879 463420 35692 1228 622554 445143 57942 28284 502632 185151 -32420 46928 -89453
7867 68697 -133946 -192201 -94810 558843 -76358 -193029 303120 -166603 293768 -159715
7856 152632 -75027 264057 -141420 -18660 322886 56061 63549 395416 339825 84132 -177144
7844 -301591 503224 19660 274803 422027 -84794 173528 538239 66386 497336 -26107
7833 25114 -82803 -219182 3772 248451 -108621 1556 508401 95846 -91620 -175320 231202
7821 41245 172989 125256 184136 -29992 -106881 -154604 162734 -49188 452504 26664 55993
7810 55993 -77970 342884 -276549 236392 -115907 34062 -125636 107828 -114871 -48989
7799 131689 224450 425042 300851 359694 347951 -178022 282254 150279 176302 -88799 351471
7787 -222586 43802 -101213 -183455 -177144 113145 196971 267883 103489 627697 317798 24358
7775 -130036 276194 257625 292585 657630 446712 -25001 209462 220923 510300 635213
7765 635213 243402 286319 219877 66859 -30996 396311 156585 75735 551311 197648 416976
7754 416976 -89871 179447 528495 171665 -287124 309656 111921 -170813 -36180 -134374
7744 -134374 231961 366731 185651 325392 -95517 58641 -149198 -39516 124811 6396 391593
7733 391593 110125 -149296 479850 47825 306573 -175515 96217 199092 -133743 29558
7722 536719 144729 156662 -221569 -78219 -209741 113041 54435 436316 7648 -119268 333107
7710 -207333 268141 158683 242493 180483 64870 -21178 553016 -168216 -119117 -581088 -63651
7698 -18620 379360 165115 674062 334259 499883 280414 -175075 249752 125624 -7103
7687 368519 234206 88959 306222 -312968 476352 77241 51252 71445 135581 299721 485796
7676 485796 63829 383837 451793 326804 191197 -151818 266800 651974 462726 310523
7666 310523 423707 -90245 -136035 262439 295817 170551 -162338 205383 184927 267712 386952
7655 386952 176274 585628 188913 127236 319977 183762 35559 -93375 454610 219675
7644 -101562 463802 -150627 18258 -63539 18443 93480 12912 122963 444658 221882 465137
7633 465137 502790 540726 -59239 -121211 98450 -278909 187956 197729 459097 114570 153291
7622 153291 190059 346140 -184225 596263 -227409 97064 -108094 152124 118889 512841
7612 512841 -12290 -210958 423344 208448 110671 530894 -115840 654004 -202777 185175
7601 284718 205747 -341565 180530 -165141 407366 266457 532643 -70101 247815 72682
7590 437935 93246 11759 345719 281990 399978 -118431 -144186 -22105 245167 432567 346414
7579 346414 196435 236162 334584 12560 -52248 -58486 323299 416862 480921 432073 254527
7568 254527 263855 362499 -81892 285679 196152 -490238 402882 -1687 246718 228173 418112
7557 418112 128660 -126676 327882 240302 306974 89546 122275 96101 -37555 -24656 409816
7545 14818 22446 11095 -200813 9024 -142823 190068 -66525 356337 47738 -72256 344043
7533 52343 108079 -103396 205833 238679 317685 352140 -199350 418435 261979 306508 -60724
7521 169807 285521 127252 -432487 -101646 411719 -153055 156665 227863 84411 343582
7511 343582 210371 166919 80947 296917 759039 361224 71641 4855 -208275 -42788 421127
7499 -127002 337703 17920 -47603 -202016 12284 269583 -198945 72155 194900 -282411
7488 201110 842284 12806 218228 -255223 -2022 -244324 363584 205456 -312988 348474
7477 94607 -74788 395092 158184 112264 44872 155516 130889 -236916 128782 228632 288518
7466 288518 339842 123457 222496 462323 326632 103003 183287 249106 -147568 -297045
7456 -297045 275209 351101 -257237 81879 57497 486085 111247 326354 35301 168203
7446 168203 46364 448399 269692 215287 396055 25548 62718 133253 -172150 3087 124993
7435 124993 280559 314282 -35656 -589075 -72943 132270 176756 184647 129613 -95082 323671
7423 380896 -134865 -86594 387606 225832 200623 -103509 -76562 -248532 134781 254121
7413 254121 -250902 -145519 -165023 157460 465752 -101871 197073 -237064 399355 62082
7402 -198913 43920 279933 423423 -45168 -34117 -42674 135716 -79914 -51385 336081 218252
7391 218252 537837 -229491 306278 176997 195569 193614 106433 255622 390826 450304 88166
7379 17071 123219 -216442 307200 17806 376049 -94910 50716 310279 270602 124584 234056
7368 234056 306779 -57798 308271 340841 -214933 -13078 65283 -154526 147994 177055 -130129
7356 158913 888689 -132022 311190 214511 623855 503896 -170687 424491 121328 435294
7346 435294 -139128 -119327 25289 593783 191693 411540 -229988 105039 309335 -112697
7335 81473 271780 101668 -115949 159087 45469 76680 -25863 111073 314326 154016
7324 85765 -128450 -189437 -235223 542930 50307 305990 -232480 248498 262720 -132017 200678
7312 197170 149727 148043 13087 -220923 91834 287736 -260493 90995 373954 -41157 183307
7300 328602 88056 91609 178523 195914 312024 -286061 -543609 -52335 -154094 403057 43977
7288 -19666 -83947 -123476 112759 121706 156744 -10665 -359669 150514 -184199 61089 95183
7277 95183 196966 -127990 29563 404583 87195 588363 428794 110618 219366 101569
7266 187974 328101 -79284 137974 325247 377593 68240 97776 308630 249575 77204 -110531
7254 223104 157932 498079 -114880 279221 424293 -116177 96512 63689 185661 -206266
7243 71094 33705 -45049 233901 -368726 -249870 253869 -25775 417213 368240 360537 304774
7232 304774 -304704 -294568 113650 -141730 10688 134340 200723 527714 102026 209598
7222 209598 259741 236712 141748 -100090 463359 175311 -80234 114091 433126 274631
7212 274631 179752 328969 -158692 193906 106030 123415 -102325 -281970 77809 539726
7202 539726 698666 213830 9770 176555 -64707 119189 -187308 -96977 181095 81685 165869
7191 165869 -99390 327135 74309 744198 533057 155860 473302 6095 41488 399536 -492717
7179 -371928 -134584 -40790 542429 268280 -114528 252926 103160 -58462 -262298 116021
7168 4100 -5729 19767 -146515 -209878 234890 59907 300503 242114 378313 31223 370584
7157 370584 467570 152212 -106328 575603 342242 80863 287025 401247 487716 617786
7147 617786 119022 60380 92357 -44096 -180644 242190 -83903 108076 153102 -82410 567007
7135 119284 214600 -89257 108602 79428 230528 468180 -80058 181892 -189829 319999
7124 229679 -155511 217345 190432 181498 -150140 287943 303127 169776 29414 47311 371437
7113 371437 -353202 219718 270165 372200 223168 -103298 -310908 -123369 -134666 -43978
7102 94696 20488 -217113 -102409 -344190 -282875 -87372 431093 310790 39751 167027 383332
7091 383332 262925 13064 178613 17045 -219626 437719 -57237 -29520 274453 80002 -5342
7079 678622 -399189 678055 -211143 146931 500536 283159 303939 193235 -122049 26715
7068 422628 283088 -3099 -60828 -57221 529219 412407 82202 46791 122812 -150783 -26390
7056 94342 -27874 317153 444911 261142 -339468 170514 -303358 61097 98663 -59986 308265
7044 423856 291088 189824 167602 154241 -228855 -386042 198110 160457 23628 -303964
7033 -171773 -33119 -7608 -460 407358 343908 414741 35670 -167248 -194394 -87176 81824 314294
7021 314294 157082 82184 480397 153397 74064 61233 -144984 240072 181199 -69924 258158
7009 335350 270125 212579 -222609 156225 -271954 289666 165344 -47306 106094 252413
6999 252413 126245 245152 797452 249859 159239 310262 89813 221859 28151 203648
6989 203648 435540 273669 130454 294840 250771 -39162 -108614 165303 -52883 180645
6978 67003 116986 108514 -135746 379741 91540 20101 280807 9829 -256 -246958 203413 -30944
6965 183169 236490 127306 320275 231055 359266 274857 150790 400304 -327975 388767
6954 213473 117705 25232 604853 406207 127669 505120 -299572 -27938 404934 357138
6944 357138 -107443 -282155 -86633 218001 78622 44184 76192 364703 -182736 -411481
6934 -411481 228891 139885 65392 -265812 -22075 -69319 -38647 418699 -8598 288740 358081
6923 358081 360064 124630 95856 3592 383385 202366 -126577 127212 200625 393249 -109337
6911 424721 -238137 -208992 -251833 -40753 75661 15058 160 385598 366205 -255780 -28211
6899 221292 316209 340962 222806 -151911 38581 397545 107019 377843 -226329 214562
6888 -141948 62998 266324 510549 190613 208857 236616 426980 38617 64801 -136831 8976
6876 209731 116469 376701 9576 98650 260724 488451 168852 481010 -30861 -134848 484017
6864 249231 -116724 276660 3816 82180 226309 131514 328306 -34494 326375 -95305 189923
6852 -90601 84553 -215959 559128 156117 20340 -171182 -90361 486684 242205 596302
6842 596302 502981 -130394 -34923 -29006 339821 724735 -326680 147639 107411 -88294 305132
6830 -107231 167511 594017 -163243 142022 242622 -95779 -155258 -288491 -26994 -321556
6820 -321556 -175319 10569 192059 282652 -347269 162562 233249 -115046 134108 434937
6810 434937 81052 -539629 -30604 116745 255942 155593 336448 332499 334331 179075 -466966
6798 99077 -59812 36787 82134 504263 -241820 -21115 276153 -490148 204184 366141 131341
6786 -258499 475538 364949 439685 230463 43649 35469 115823 592774 163837 313978 142051
6774 333073 -252701 -49066 -84073 586537 -127999 542767 -71590 253600 464066 -56327
6763 219183 271184 658320 -427058 228807 198890 527579 387658 122467 -334048 -76176
6752 -351229 6233 435580 79722 295874 92627 3492 -90015 -354050 81805 390416 348286
6741 348286 136507 -63584 -177883 565607 226014 -157383 223878 167179 519134 -6622
6730 -80690 48652 101147 -162937 -463713 -77234 -51433 128866 28518 247545 320016 218993
6719 218993 -76233 230594 468225 -172979 565789 103929 -89477 279769 154026 429498
6709 429498 45699 39296 105239 -38311 266207 85047 172117 115242 387499 -254226 333562
6697 244324 174466 -39173 122612 352892 140195 247161 -99382 -96103 -216718 -197213 290183
6685 185162 -202079 1702 187940 -138889 50648 245432 721279 -47229 20167 229788 150363
6674 150363 143593 383868 272408 52835 -103565 -76444 9900 -49834 99748 496037 209814
6662 385884 -83734 -237673 173333 531589 20059 -212602 129205 -362643 -206712 8006
6651 -289584 -84099 -242722 -62295 321855 -201420 274837 -67300 -361899 760779 315223
6640 300009 -296608 197925 225929 502403 -134865 -53844 128453 415884 -92205 262943
6629 146586 -154667 7010 413867 -302008 352699 192301 33172 248600 -256773 138774
$$ [...]
##END NTUPLES=NMR SPECTRUM
##END=
