##TITLE=Coffee green (M4-ROVE10 + 1.5mL buffer 50/50,  450uL extracto + 50uL (D2O+TMS))
without heating, vortex and centrifuged, temperature 0oC.
##JCAMPDX= 6.0         $$ Bruker NMR JCAMP-DX V2.0
##DATA TYPE= NMR SPECTRUM
##DATA CLASS= NTUPLES
##ORIGIN= Bruker BioSpin GmbH
##OWNER= Administrator
$$ 1.72 TOPSPIN		Version 2.1
$$ 2012-05-22 16:11:24.747 -0700  Administrator@X
$$ Compression mode = diff/dup
##.OBSERVE FREQUENCY= 400.13188195
##.OBSERVE NUCLEUS= ^1H
##.ACQUISITION MODE= SIMULTANEOUS (DQD)
##.ACQUISITION SCHEME= undefined
##.AVERAGES= 64
##.DIGITISER RES= 22
##SPECTROMETER/DATA SYSTEM= spect
##.PULSE SEQUENCE= noesygppr1d
##.SOLVENT NAME= H2O+D2O
##.SHIFT REFERENCE= INTERNAL, H2O+D2O, 1, 14.97961
##AUDIT TRAIL= $$ (NUMBER, WHEN, WHO, WHERE, PROCESS, VERSION, WHAT)
$$ ##TITLE= Audit trail, TOPSPIN		Version 2.1
$$ ##JCAMPDX= 5.01
$$ ##ORIGIN= Bruker BioSpin GmbH
$$ ##OWNER= Administrator
$$ $$ c:\Bruker\TOPSPIN/data/jwist/nmr/11-coffee-green-quantification-2/51/pdata/1/auditp.txt
$$ ##AUDIT TRAIL=  $$ (NUMBER, WHEN, WHO, WHERE, PROCESS, VERSION, WHAT)
(   1,<2011-11-17 14:22:12.075 -0500>,<Administrator>,<TOPSPIN>,<go>,<TOPSPIN 2.1>,
      <created by zg
	started at 2011-11-17 14:13:14.638 -0500,
	POWCHK enabled, PULCHK disabled,
       configuration hash MD5:
       DA 63 81 1B EF 4C B5 72 B4 DF EA D9 B4 DB 4C 08
       data hash MD5: 64K
       94 F6 BD 44 5F 9D A7 58 8E 2C 3F F2 DC A9 95 6A>)
(   2,<2011-11-17 18:14:59.200 -0500>,<Administrator>,<TOPSPIN>,<proc1d>,<TOPSPIN 2.1>,
      <Start of raw data processing
       efp LB = 0 FT_mod = 6 PKNL = 1 PHC0 = 0 PHC1 = 0 SI = 32K 
       data hash MD5: 32K
       82 D1 6B 1E 32 CE F9 83 9E 87 2B 2C 47 00 BE 47>)
(   3,<2011-11-17 18:14:59.560 -0500>,<Administrator>,<TOPSPIN>,<proc1d>,<TOPSPIN 2.1>,
      <pk PHC0 = 19.56665 PHC1 = 0 
       data hash MD5: 32K
       E8 D6 EF 0E 06 34 6C 4D 4C 14 54 EB 16 9D C3 48>)
$$ ##END=
$$ 
$$ $$ hash MD5
$$ $$ 45 E8 F9 EF 16 BD D7 E2 6B 52 D5 7C AD F1 1C BF
##$RELAX= 
##$RELAX= 
##$RELAX= 
##$RELAX= 
##$RELAX= 
##$RELAX= 
$$ Bruker specific parameters
$$ --------------------------
##$DU= <Z:>
##$EXPNO= 51
##$NAME= <11-coffee-green-quantification-2>
##$PROCNO= 1
##$TYPE= <nmr>
##$USER= <jwist>
##$ACQT0= -8.18042376280013
##$AMP= (0..31)
100 100 100 100 100 100 100 100 100 100 100 100 100 100 100 100 100 100
100 100 100 100 100 100 100 100 100 100 100 100 100 100
##$ANAVPT= -1
##$AQSEQ= 0
##$AQ_mod= 3
##$AUNM= <au_prof>
##$AUTOPOS= <>
##$BF1= 400.13
##$BF2= 400.13
##$BF3= 400.13
##$BF4= 400.13
##$BF5= 400.13
##$BF6= 400.13
##$BF7= 400.13
##$BF8= 400.13
##$BYTORDA= 0
##$CFDGTYP= 0
##$CFRGTYP= 9
##$CHEMSTR= <none>
##$CNST= (0..63)
1 1 145 1 1 1 1 1 1 1 1 1 1 1 1 1 1 1 1 1 1 1 1 1 1 1 1 1 1 1 1 1 1 1 1
1 1 1 1 1 1 1 1 1 1 1 1 1 1 1 1 1 1 1 1 1 1 1 1 1 1 1 1 1
##$CPDPRG= <>
##$CPDPRG1= <>
##$CPDPRG2= <>
##$CPDPRG3= <>
##$CPDPRG4= <mlev>
##$CPDPRG5= <mlev>
##$CPDPRG6= <mlev>
##$CPDPRG7= <mlev>
##$CPDPRG8= <mlev>
##$CPDPRGB= <>
##$CPDPRGT= <>
$$ [...]
150 150 150 150 150 150 150 150
##$TP07= 0
##$TPNAME0= <>
##$TPNAME1= <>
##$TPNAME2= <>
##$TPNAME3= <>
##$TPNAME4= <>
##$TPNAME5= <>
##$TPNAME6= <>
##$TPNAME7= <>
##$TPOAL= (0..7)
0.5 0.5 0.5 0.5 0.5 0.5 0.5 0.5
##$TPOFFS= (0..7)
0 0 0 0 0 0 0 0
##$TUNHIN= 0
##$TUNHOUT= 0
##$TUNXOUT= 0
##$USERA1= <user>
##$USERA2= <user>
##$USERA3= <user>
##$USERA4= <user>
##$USERA5= <user>
##$V9= 5
##$VALIST= <valist>
##$VCLIST= <CCCCCCCCCCCCCCC>
##$VD= 0
##$VDLIST= <DDDDDDDDDDDDDDD>
##$VPLIST= <PPPPPPPPPPPPPPP>
##$VTLIST= <TTTTTTTTTTTTTTT>
##$WBST= 2048
##$WBSW= 25
##$XGAIN= (0..3)
0 0 0 0
##$XL= 0
##$YL= 0
##$YMAX_a= 5559059
##$YMIN_a= -2324073
##$ZGOPTNS= <>
##$ZL1= 120
##$ZL2= 120
##$ZL3= 120
##$ZL4= 120
##$ABSF1= 0
##$ABSF2= 0
##$ABSG= 0
##$ABSL= 0
##$ALPHA= 0
##$AQORDER= 0
##$ASSFAC= 0
##$ASSFACI= 0
##$ASSFACX= 0
##$ASSWID= 0
##$AUNMP= <proc_prof1d>
##$AXLEFT= 0
##$AXNAME= <>
##$AXNUC= <1H>
##$AXRIGHT= 0
##$AXTYPE= 0
##$AXUNIT= <>
##$AZFE= 0.1
##$AZFW= 0.1
##$BCFW= 0
##$BC_mod= 0
##$BYTORDP= 0
##$COROFFS= 0
##$CY= 15
##$DATMOD= 1
##$DC= 0
##$DFILT= <>
##$DTYPP= 0
##$F1P= 14.9796104431152
##$F2P= -5.57292051064055
##$FCOR= 0.5
##$FTSIZE= 32768
##$FT_mod= 6
##$GAMMA= 0
##$GB= 0
##$INTBC= 1
##$INTSCL= 1
##$ISEN= 128
##$LB= 0
##$LEV0= 0
##$LPBIN= 0
##$MAXI= 10000
##$MC2= 0
##$MEAN= 0
##$ME_mod= 0
##$MI= 0
##$NCOEF= 0
##$NC_proc= -6
##$NLEV= 6
##$NOISF1= 0
##$NOISF2= 0
##$NSP= 0
##$NTH_PI= 0
##$NZP= 0
##$OFFSET= 14.97961
##$PC= 1
##$PHC0= 19.56665
##$PHC1= 0
##$PH_mod= 1
##$PKNL= yes
##$PPARMOD= 0
##$PPDIAG= 0
##$PPIPTYP= 0
##$PPMPNUM= 2147483647
##$PPRESOL= 1
##$PSCAL= 4
##$PSIGN= 0
##$PYNMP= <proc.py>
##$REVERSE= no
##$SF= 400.13
##$SI= 32768
##$SIGF1= 0
##$SIGF2= 0
##$SINO= 400
##$SIOLD= 32768
##$SPECTYP= <>
##$SREGLST= <1H.H2O+D2O>
##$SSB= 0
##$STSI= 32768
##$STSR= 0
##$SW_p= 8223.6842105263
##$SYMM= 0
##$S_DEV= 0
##$TDeff= 65536
##$TDoff= 0
##$TI= <>
##$TILT= no
##$TM1= 0
##$TM2= 0
##$TOPLEV= 0
##$USERP1= <user>
##$USERP2= <user>
##$USERP3= <user>
##$USERP4= <user>
##$USERP5= <user>
##$WDW= 1
##$XDIM= 32768
##$YMAX_p= 387941255
##$YMIN_p= -419765
##$CURPLOT= <Network HP LaserJet P1505>
##$CURPRIN= <$Network HP LaserJet P1505>
##$DFORMAT= <normdp>
##$LAYOUT= <+/1D_H.xwp>
##$LFORMAT= <normlp>
##$PFORMAT= <normpl>
##$SURQMSG= 1
$$ End of Bruker specific parameters
$$ ---------------------------------
##NTUPLES= NMR SPECTRUM
##VAR_NAME=  FREQUENCY,     SPECTRUM/REAL,   SPECTRUM/IMAG
##SYMBOL=    X,             R,               I
##VAR_TYPE=  INDEPENDENT,   DEPENDENT,       DEPENDENT
##VAR_FORM=  AFFN,          ASDF,            ASDF
##VAR_DIM=   32768,         32768,           32768
##UNITS=     HZ,            ARBITRARY UNITS, ARBITRARY UNITS
##FACTOR=    0.250966925370065, 1,           1
##FIRST=     8223.43324360093, 120473,       -361771
##LAST=      0,             133807,          -410164
##MIN=       0,             -419765,         0
##MAX=       8223.43324360093, 387941255,    0
$$ Real data points
##PAGE= N=1
##DATA TABLE= (X++(R..R)), XYDATA
$$ [...]
19676A671419J43903N0301m5784J33385p4938J10942j79267n3l6613J41020l36379
19665A577936K10371J34157j9425m4932L00917k90694l8477J539J41567j91065
19655A781894k11663J26500k8459M4059J80644o7485j42726j06425K77055p8557
19645A774837k38254L07100j87423p0733K12995j26611K49604j64778J04188j773
19635A859152j17427M1259r7747R4621q9590K9679q2328o6757K21286r3335O324
19624A705137l4019O5311j41178M4509o3871P1839J26425k76585j3760J53631
19614A637439Q5743l07095J79503j34040q7669K14639o419o94j45267J56261l4808
19603A557593k25242M3813N7358p0566J32706k82585J51663K9259J33076p042
$$ y = [1671419, 1815322, 1865623, 1819839, 1953224, 1878286, 1989228, 1809961, 1809908, 1773295, 1914315, 1577936, 1788307, 1922464, 1903039, 1858107, 2159024, 1868330, 1829853, 1831392, 1972959, 1781894, 1570231, 1696731, 1668272, 1712331, 1892975, 1825490, 1682764, 1576339, 1853394, 1774837, 1536583, 1843683, 1656260, 1585527, 1798522, 1671911, 1921515, 1756737, 1860925, 1859152, 1741725, 1782984, 1685237, 1779858, 1690268, 1719947, 1637619, 1570862, 1792148, 1698813, 1705137, 1671118, 1736429, 1595251, 1639760, 1575889, 1647728, 1774153, 1497568, 1483808, 1637439, 1723182, 1416087, 1595590, 1461550, 1373881, 1588520, 1582101, 1581407, 1436140, 1592401, 1557593, 1332351, 1376164, 1433522, 1362956, 1495662, 1213077, 1364740, 1393999, 1527075, 1520033]
19593A520033r3482n9093J62380k74595J50863j05187J09105P8745M8673n9545
19583A477897k39947M6583J71477k28705K68117k82471J42230Q981l01244J00735
19573A163653Q6220J62527k95006J86782l1666Q0933J7334l3710j06353R1262
19563A321976o6011M0759k2750K9513r0002q878q9240K58355m6639J8301J5404
19552A360788Q0666l06658K09776j02009p8335J24532o4997k36963M33343m8023
19542A372120j34985J95422k44015K94698K601p0865M5646j55572k08233L95503
19532A492320q0132j02905q9158J64003J00888k38615M0188j41049J78636Q307
19522A332483k13379K40790j2769K8735l05707J06139J41827J56241k03236j160
$$ y = [1520033, 1426551, 1367458, 1529838, 1255243, 1406106, 1300919, 1410024, 1488769, 1537442, 1477897, 1237950, 1284533, 1456010, 1227305, 1495422, 1212951, 1355181, 1364162, 1062918, 1163653, 1249873, 1412400, 1117394, 1304176, 1272510, 1353443, 1370777, 1337067, 1230714, 1321976, 1255965, 1296724, 1273974, 1303487, 1213485, 1204607, 1115367, 1373722, 1327083, 1345384, 1360788, 1441454, 1134796, 1344572, 1242563, 1164228, 1288760, 1223763, 986800, 1420143, 1372120, 1237135, 1432557, 1188542, 1483240, 1485841, 1414976, 1460622, 1305050, 1096817, 1492320, 1412188, 1309283, 1220125, 1384128, 1485016, 1246401, 1286589, 1145540, 1324176, 1332483, 1119104, 1359894, 1347125, 1375860, 1070153, 1176292, 1318119, 1474360, 1271124, 1269964]
19512A269964P113j01145K18977k12151J10615M109q7412Q703r1356j89047M24295
19501A362665k72239P3102j01116K76878l50612K09530L1836O1462j43265L5494
19491A183735J30124m137j2273j32101j36662K27616j07810O3886O641J8940J1073
19480A249032R0255j41476m0038j03475n552J14535j00286o118P143m9998j4071
19469I99951M0716K0416r4152j09668K49481k94368K1343j2757J83330j09358
19459H94934j86047J58219k79353K09714J69609k59237K50651j54431J87430k17468
19449G74021j9998R9940J7897j0440j25718n740K64697l26697J26780J13530r660
19438H98612J90776k70326N6881J71879j73042j91467R3867o5661j15808K54572
$$ y = [1269964, 1277077, 1175932, 1394909, 1182758, 1293373, 1297482, 1210070, 1218773, 1127417, 938370, 1362665, 1090426, 1163528, 1062412, 1339290, 988678, 1198208, 1230044, 1291506, 1148241, 1183735, 1313859, 1309722, 1297449, 1165348, 1028686, 1256302, 1148492, 1212378, 1219019, 1237959, 1249032, 1339287, 1197811, 1157773, 1054298, 1048746, 1163281, 1062995, 1056877, 1064020, 1014022, 999951, 1040667, 1061083, 966931, 857263, 1106744, 812376, 833719, 820962, 1004292, 894934, 708887, 867106, 587753, 797467, 967076, 707839, 958490, 804059, 991489, 774021, 754023, 853963, 871860, 861420, 735702, 729962, 994659, 667962, 794742, 908272, 898612, 1089388, 819062, 875943, 1047822, 874780, 683313, 777180, 711519, 595711, 850283]
19428H50283M9370j1645j27868J44492j17011O8949J29924l64423R9390O9837
19418G91298Q342j48667q216J02894j08541K38396m182q4490j71914K49077k45889
19407F18108L71084j52507l7268q7992O061J47177K2298J5366r4787K9042K6892
19396H63474j88463K31801M01Q2610j36325m1091O3069L8177j45739K11410J3225
19385I92549l1181j26521J38285j76212P7934j01544J1974J88524M2383j39588
19375H76603O9569K35480k92338p2995J45857n0853j63210J22355N9970j63636
19365G66802K30171r933k09722J87805k28983J93598n9099m2960j7152j41742
19355F68785M93556l55476M4055k81692K23492J36606j36810R0809P4032k92192
$$ y = [850283, 899653, 888008, 760140, 904632, 787621, 856570, 986494, 622071, 721461, 791298, 799640, 650973, 642757, 745651, 637110, 875506, 871324, 786834, 614920, 863997, 618108, 989192, 836685, 799417, 711425, 717486, 864663, 886961, 902327, 807540, 836582, 863474, 675011, 906812, 907213, 989823, 853498, 812407, 875476, 913653, 767914, 979324, 992549, 961368, 834847, 973132, 796920, 874854, 773310, 785284, 973808, 1016191, 876603, 946172, 1181652, 889314, 816319, 962176, 911323, 748113, 870468, 930438, 766802, 996973, 987040, 777318, 965123, 736140, 929738, 870639, 827679, 810527, 668785, 1162341, 806865, 850920, 569228, 792720, 929326, 792516, 883325, 957357, 665165]
19345F65165L10497p7206K3535k00067K41661L3878k95434L689J36238m7927J84926
19334I78955Q0369j77883Q5890K22334k63607m1268K85266k60940p4967K62500
19324A096649j21731j63827J44278k43570J90429j07875L29837m74917K19588
19315H68861N4136M7436m4390k07459J19375N458o7438K77177l73104N7542l6011
19304G01583K9129J43629J4779j86358O5765P7583j34028N7548L5980M6504m3640
19293H08474n717k10940Q9817Q745m8375N5012q8341L42244k62708k5888R6051
19282G58374P1402j37493J68677j49243J36405p8469J3667K0116q4881p4889M50433
19271A094099m59377l7536K27587l12145L67847j26104J11402m4986n9979L9253
$$ y = [665165, 975662, 898456, 921991, 721924, 963585, 997463, 702029, 705718, 841956, 794029, 978955, 1059324, 881441, 967331, 1189665, 926058, 884790, 1170056, 909116, 834149, 1096649, 974918, 811091, 955369, 711799, 902228, 794353, 1124190, 649273, 868861, 922997, 970433, 926043, 718584, 837959, 843417, 775979, 1053156, 680052, 737594, 701583, 730712, 874341, 889120, 702762, 768527, 846110, 712082, 769630, 805610, 852114, 808474, 802757, 591817, 681634, 690379, 642004, 697016, 608675, 950919, 688211, 662323, 758374, 829776, 692283, 860960, 711717, 848122, 769653, 783320, 803436, 718555, 643666, 1094099, 634722, 597186, 824773, 512628, 880475, 754371, 865773, 820787, 760808, 800061]
19261H00061j35957q2819L07466j41252K1806j60628L84791j51642l3299R583
19251H18110p472j79489J70613r4712K8978M3588Q0688l7254K35396M52217m08296
19240A102367N35579m8187J53797j42085o4696l28449j48882N4833k17394r6627
19230H00256N7679j62014J75411k60652J06470K56370m81450N6461K54908Q3954
19220H87393k27389j40234J56024k2977j86277K20705K0896j84758K86661p9598
19210G30446m2260O5699l0536R762k60915K01436J72304m8370o3866j27017J84204
19199G90887P8961k85506N2201K19490K23725m31545L21232j42642k04981o5846
19189E55976J76385K6727j31259K10819j94325K88081k98869Q0782N0877K43377
$$ y = [800061, 664104, 581285, 888751, 747499, 769305, 608677, 993468, 841826, 808527, 818110, 810638, 631149, 801762, 707050, 736028, 779616, 860304, 823050, 1058446, 1510663, 1102367, 1637946, 1589759, 1743556, 1601471, 1536775, 1208326, 1059444, 1114277, 896883, 800256, 857935, 695921, 871332, 610680, 717150, 973520, 492070, 548531, 803439, 887393, 660004, 519770, 675794, 652817, 466540, 687245, 708141, 523383, 810044, 730446, 688186, 753885, 723349, 733111, 472196, 673632, 845936, 797566, 733700, 606683, 790887, 869848, 584342, 636543, 856033, 1079758, 648213, 969445, 826803, 621822, 555976, 732361, 759088, 627829, 838648, 644323, 932404, 633535, 714317, 765194, 1008571]
19179A008571n0624J43803K88039k26871J53115k83377K64822j10993k34444n6152
19169H95889J362l412k28856L42198r5203k40404J58436P3662J60921Q2917j53737
19158I93773R7786q9212n2007Q9025k01282K34804o6218j6510r5635m7149O1652
19147I09027N3022j41528O0204O6229J32406k28311N4750K2760K05083p7810k44061
19136H11771M4915j87109L08345K67229l09135K16748q364j1733j09730l9947
19126I82990R9844j90402o032P495M72814k51040Q3282j02014L22591j96712K03676
19115A426492K652q396J59187P6111L91918P1008l019K85373J53078N29718K80016
19104C364138L73974k2802M32737o0218J8753p03419l24717j91877n47297r3929
$$ y = [1008571, 957947, 1101750, 1389789, 1162918, 1316033, 1032656, 1297478, 1186485, 952041, 895889, 897251, 893839, 664983, 1007181, 911978, 671574, 830010, 903672, 1064593, 1147510, 993773, 1091559, 1002347, 950340, 1039365, 838083, 1072887, 1006669, 990159, 894524, 847375, 909027, 962049, 820521, 880725, 946954, 1079360, 851049, 905799, 928559, 1133642, 1055832, 811771, 856686, 669577, 977922, 1245151, 936016, 1152764, 1144400, 1132667, 1022937, 982990, 1082834, 892432, 886400, 893895, 1366709, 1115669, 1198951, 1096937, 1419528, 1222816, 1426492, 1429144, 1420748, 1579935, 1656046, 2047964, 2118972, 2115953, 2401326, 2554404, 3084122, 3364138, 3738112, 3715310, 4148047, 4087829, 4106582, 3403163, 3078446, 2886569, 2339272, 2245343]
19094B245343p3798l86806l8923j58568P6149j91731j38339J44115q004j5569
19084A453869j8718R4793J19192L95112J79234M06603L35504J52317M54956J91645
19074C764507K63814k96108n0616l72901O9400k1615J27821K79071M64364k80912
19064C946825k3857J50702k42658n06191m07476j29338m24570j58035o8333j81381
19054A955688N7447l0062k59543K45904l29100J60385L67354l44035M79655q0189
19044B223504K88382K88444M59117P04211K68089K0838k14422j9469k68074k85646
19034C464974o01095m35000l37632L5080k21281P9776l63425j4299P1550L38814
19024B017462j81564j8042K5209K79470J26012J07224j32407O18849J60546L27730
$$ y = [2245343, 2171545, 1784739, 1745816, 1587248, 1663397, 1471666, 1333327, 1477442, 1469438, 1453869, 1435151, 1529944, 1649136, 2044248, 2223482, 2630085, 2965589, 3117906, 3572862, 3764507, 4028321, 3732213, 3681597, 3308696, 3378096, 3356481, 3484302, 3763373, 4227737, 3946825, 3922968, 4073670, 3831012, 3324821, 2917345, 2788007, 2363437, 2205402, 2137069, 1955688, 2013135, 1983073, 1723530, 1969434, 1640334, 1800719, 2168073, 1824038, 2303693, 2223504, 2511886, 2800330, 3259447, 3963658, 4231747, 4252585, 4038163, 4018694, 3750620, 3464974, 2863879, 2428879, 2091247, 2126327, 1905046, 1984822, 1621397, 1607098, 1678648, 2017462, 1835898, 1817856, 1843065, 2122535, 2248547, 2355771, 2223364, 2842213, 3002759, 3330489]
19014C330489M81673M06219J78550K45632M3507J81848j12210J99700J3860M52176
19004E421444K63305Q05668N76791K71276O63898P77485O32827J139311J391924
18995A1943929J334646J572830J738468J002584R32304M47983l03838q27400j270107
18986A6571399j942088j788259k152427j279932j371224j390819p77391o73781
18978E195478p01136m45950m10959m25633k19658k6222l71920j29219j35459n4627
18968B274695k60331j09925k1232j3482m2669j09742K36381j20675l474j27761
18958A701785J22364r9941J51641J15975k11686J41447L32425m08462K45132K12688
18948B303368j99435J23487K5383K70926N0727J37509M39617M0784J38750Q14747
$$ y = [3330489, 3812162, 4218381, 4396931, 4642563, 4686070, 4867918, 4755708, 4955408, 4969268, 5421444, 5684749, 6490417, 7067208, 7338484, 8002382, 8779867, 9412694, 10552005, 11943929, 13278575, 14851405, 16589873, 17592457, 18524761, 18972744, 18668906, 17841506, 16571399, 14629311, 12841052, 10688625, 9408693, 8037469, 6646650, 5869259, 5195478, 4494342, 4048392, 3637433, 3211800, 2992142, 2965920, 2594000, 2464781, 2329322, 2274695, 2014364, 1904439, 1883207, 1869725, 1827056, 1717314, 1953695, 1833020, 1829546, 1701785, 1824149, 1724208, 1875849, 1991824, 1780138, 1921585, 2254010, 1845548, 2090680, 2303368, 2103933, 2227420, 2252803, 2523729, 2574456, 2711965, 3151582, 3192366, 3331116, 4145863]
18938D145863j547P04500R42919O65406R86264J305897J485888J653780J682631
18929A3571601J535137J222204P73075K26544n09485j060626j334122k127637
18921A2296691j512062j691031j390959j502076q05167p06127o43364o20958k00795
18912C224152m07287k90434k76433j13484k20368q8128j81168m4251l99922R3963
18902A296640p2347j41052k6844K45305K0459k54632k24404J37926r91M5730j18926
18891I06864J11019j15838k5386K6736Q2256m67297K74275K04844m2619m9556
18881I05298j48006l9438K25819j33867j8829M0803J0651j73172j94212J96121
18871F71168M027Q0450n9811J73102L752k94375R3110J76990J8807o5409r0400
$$ y = [4145863, 4144316, 4848816, 5791735, 6457141, 7443405, 8749302, 10235190, 11888970, 13571601, 15106738, 16328942, 17102017, 17328561, 16819076, 15758450, 14424328, 12296691, 10784629, 9093598, 7702639, 6200563, 5395396, 4689269, 4045905, 3424947, 3224152, 2816865, 2526431, 2249998, 2136514, 1916146, 1828018, 1646850, 1602599, 1202677, 1296640, 1224293, 1083241, 1056397, 1301702, 1322161, 1067529, 843125, 981051, 980060, 1025790, 906864, 1017883, 902045, 876659, 903395, 985651, 518354, 792629, 997473, 954854, 905298, 757292, 717854, 943673, 809806, 790977, 831780, 842431, 669259, 475047, 671168, 675195, 755645, 695834, 868936, 872688, 578313, 671423, 848413, 867220, 801811, 711411]
18860G11411j07566K14018k94829j5785K14599J53317k30098J95680r3954j18898
18850F27895J5610R3568k55982O8981M7871P2624m5896r0610J24496K1005j9479
18839F60083K7813j32548J15045m319J88930j00258k8911K184j28929K66394k80150
18828E85334J08488k26594K24554R658k23183K3296q8436J51162K05563j18024
18818F51818J71108M5348l17348N2810L66442l83278P2409j37699O7966K84175
18808H73751l71350J66528J46739q255o7208l20929R6818N04956l72583J98281
18798H46748j76462N2763K68803j78445k91595J04718J44610k0469L58674k13033
18788H96312P7297p3791N7414k25389J92260K02155k10299j98583J57243K75378
$$ y = [711411, 603845, 817863, 523034, 507249, 721848, 875165, 645067, 840747, 746793, 627895, 643505, 737073, 481091, 550072, 597943, 670567, 624671, 534061, 658557, 679562, 660083, 687896, 555348, 670393, 666074, 855004, 754746, 725835, 728019, 599090, 865484, 585334, 693822, 467228, 691782, 701440, 478257, 501553, 413117, 564279, 769842, 651818, 822926, 868274, 550926, 603736, 970178, 586900, 659309, 521610, 589576, 873751, 502401, 668929, 815668, 807413, 740205, 419276, 516094, 1021050, 648467, 846748, 670286, 723049, 991852, 813407, 521812, 626530, 771140, 750671, 1109345, 896312, 973609, 899818, 957232, 731843, 924103, 1126258, 915959, 717376, 874619, 1149997]
18778A149997m11518J36579J21381k34320l0500J25676j28247J21682j06403J72154
18768I16481o3140k24312m3815K80705j77904O1487k68261L93708r7145L8121
18758H15925q9501R3540R9288l42934K2041J09406k05608K15032l3490k9777J15277
18747G69199N1686l52403J29417J5280n8652p4575J07603O0322o5626l8750J98489
18736G41990m2654J89727m19636L17135j93382N1421q5858L3059Q4347L34032
18726A010181k55581j19728O2601j2829q0751j42384M52872k78266P1202K41052
18716I48369k49238j2601o4022J29060l63209J84349K54335M3076p4956k78132
18706E17031K61634k335M5785k40552j00419J85076l9661n4207L32747k71137
$$ y = [1149997, 738479, 875058, 996439, 762119, 731619, 857295, 729048, 850730, 744327, 916481, 853341, 629029, 585214, 865919, 688015, 749502, 481241, 874949, 777804, 815925, 726424, 819964, 919252, 576318, 598359, 707765, 502157, 717189, 683699, 653922, 769199, 820885, 468482, 597899, 613179, 554527, 479952, 587555, 647877, 582251, 543501, 741990, 699336, 889063, 469427, 786562, 593180, 644601, 558743, 591802, 676149, 1010181, 754600, 634872, 697473, 684644, 603893, 461509, 914381, 636115, 707317, 948369, 699131, 686530, 622508, 751568, 388359, 572708, 827043, 870119, 795163, 517031, 778665, 776330, 822115, 581563, 481144, 666220, 626559, 572352, 905099, 633962]
18696F33962J86855m5458k31162L3727J74734O7918q2174l9512R9841k87384o5981
18685D45366K52232J03024J21012K9424l83733K86577j68803l6016J04869p5006
18675F78946M5767j49201J86360J22127l57851K96741J6983J57354l86538J83829
18665G94517j88859p7526K86113j82778Q1979j49458J02994J09195o8713j94430
18655E13034J06706R3318m4134N4953j21754J11599o3696R3210k57281P9882J16262
18644F82099J48353k2113k38478k19493L36879j77578n130j41136J39685R4893
18634E97981j69468K01480j43441L028J82432j03225K24121C86453K96636r0495
18624E92594Q8451l25921J67885k33640K29815R412R2297o6974l9852J88221q737
$$ y = [633962, 820817, 775359, 544197, 577924, 752658, 820576, 738402, 698890, 798731, 511347, 445366, 697598, 800622, 921634, 951058, 567325, 853902, 685099, 649083, 753952, 678946, 724713, 575512, 761872, 883999, 526148, 822889, 839872, 997226, 610688, 794517, 605658, 528132, 814245, 631467, 713446, 563988, 666982, 776177, 707464, 513034, 619740, 713058, 668924, 723877, 602123, 713722, 650026, 743236, 485955, 565837, 682099, 830452, 808339, 569861, 350368, 687247, 509669, 504539, 363403, 503088, 597981, 428513, 629993, 486552, 489580, 672012, 568787, 792908, 386453, 683089, 592594, 681045, 355124, 523009, 289369, 519184, 528596, 620893, 553919, 514067, 702288, 693551]
18613F93551j76589O4693j0711J57535q8943O1501J24384J8819q7403o1574R2602
18602G87865j42844L380Q0176j3079J45020K35689k81662M7735l83673K37750
18592G16357K53903j93812J40534j32259K42013l27562Q6808L53152m0104l16957
18582G82073J6634m618L6357l9516j75027J57087l5555K12196j68058J4432l742
18571G92263J7644k04814J3013Q3633l1467j14269K82849l29004J48985l5821
18561F23012L6752k33954K32432j66289J63820K4502J27451k19276J35134k59019
18551D64565J636K40555l3655k95895M85874l18806O201K63031j66638K0537j64031
18540E03374L9050L12176k91320J32662m7227k56354K54769L2854Q0161k46430
$$ y = [693551, 516962, 581655, 570944, 728479, 639536, 701037, 825421, 844240, 756837, 695263, 787865, 645021, 648401, 728577, 715498, 860518, 1096207, 814545, 862280, 478607, 716357, 970260, 776448, 916982, 784723, 1026736, 699174, 785982, 1139134, 1099030, 782073, 798707, 794089, 830446, 790930, 615903, 772990, 737435, 949631, 781573, 796005, 792263, 809907, 605093, 618106, 701739, 670272, 556003, 838852, 509848, 658833, 623012, 659764, 425810, 658242, 491953, 655773, 680275, 807726, 588450, 723584, 464565, 466201, 706756, 673101, 377206, 863080, 544274, 550475, 813506, 646868, 667405, 503374, 542424, 854600, 563280, 695942, 648715, 392361, 647130, 679984, 760145, 513715]
18530E13715O455L33287D18238J56302j29654M8019K08214M3136k10947O1008
18520E94316j39989j65708K77346j23809J23330J4469j43637K35156j14794A46072
18509G09944k04947J65676j87205O3748K43801j64034p6726l7264J26297j69542
18499D69748j11582L43700k06310J73160K11888l68999J78176j17827O908j23724
18489D55138N662O6792K00434j02368n2480k43467R3840J83220J59251C11737
18478G19402k06912K51186l45624J99867n5037R3572r8071L9916k22011L15201
18468F91489j06617j1353K0655J02267r8882J49918k03559K10005j48103m2234
18458E63586L51917j7745l7388j31974J45091K3791j05307o8368j0290J61728
$$ y = [513715, 520170, 853457, 418238, 574540, 444886, 492905, 701119, 744255, 533308, 594316, 454327, 288619, 565965, 442156, 565486, 579955, 436318, 671474, 556680, 146072, 709944, 504997, 670673, 483468, 547216, 791017, 626983, 550257, 512993, 639290, 469748, 358166, 701866, 495556, 668716, 880604, 511605, 689781, 571954, 578862, 455138, 460800, 527592, 728026, 625658, 573178, 329711, 423551, 606771, 766022, 311737, 719402, 512490, 763676, 418052, 617919, 562882, 656454, 558383, 598299, 376288, 691489, 584872, 573519, 594174, 696441, 597559, 747477, 543918, 753923, 605820, 563586, 915503, 897758, 860370, 728396, 873487, 897278, 791971, 723603, 713313, 875041]
18448H75041l45286J38623J42142k11565J08581j33870J96664l8990k36699J10484
18438F05125n2281j91560L24238j68835J37329k50008K43724Q3939j47178P6142
18428F60635m7633L94142j86745o5853j51789K10308J8601k11830k54591L86392
18418G51637k17197J3635M0696k65652L45284m4159K5367j65975J44943q1872
18408E46707K088o6299N1317k49463o26J32383Q1775L11527j95538l6655l3828
18397E43388Q4252J073j24077L67548l91368R9814J0053B52198L95706k50973
18387C96931K00328Q8494k54528O8258N2296J02958k07385L77136l76668P4521
18377E22341O8899n6968K5402k5003K01755q563K9111j90993O3867j81685J20884
$$ y = [875041, 529755, 668378, 810520, 598955, 707536, 573666, 770330, 731340, 494641, 605125, 552844, 361284, 685522, 516687, 654016, 404008, 647732, 731671, 584493, 660635, 613002, 1007144, 820399, 754546, 602757, 813065, 831666, 619836, 365245, 751637, 534440, 548075, 588771, 323119, 668403, 624244, 649611, 483636, 628579, 546707, 548795, 482496, 533813, 284350, 283724, 416107, 497882, 809409, 613871, 577216, 543388, 627640, 628713, 504636, 872184, 480816, 580630, 590683, 252198, 647904, 396931, 597259, 685753, 431225, 499483, 551779, 654737, 447352, 824488, 447820, 522341, 591240, 534272, 559674, 534671, 736426, 727863, 756974, 565981, 629848, 448163, 569047]
18366E69047j38145J72782j84795k2177j03388L1168K38641k2232J93467L4685
18356G69053m9727p8890j8633o6046J87194k52851Q916L07728l6301J07791k61132
18345F17102K14195j13718q1002k3215j2423j74921L0061K21878j32043J21175
18335F67089k57156K10562j25729K00252l37968J07359J26129j28619J95633k50273
18325D07279K55890j80549M29180m30032J06710J36906J60018j66237k29655K67383
18315G56893j68145J22375k36239L24445l34879K8301M2382o0179K2721J13646
18305F11321o2100L6103k11330q0421K98397j75831P7022O9240j71114K81980
18295F73267k49961K51391j21795O3806j10028O9556j31538j43967L60979N3081
$$ y = [569047, 430902, 603684, 418889, 396712, 293324, 324492, 563133, 540901, 734368, 769053, 719326, 640436, 621803, 555757, 742951, 490100, 499016, 806744, 770443, 878234, 617102, 831297, 717579, 636577, 613362, 600939, 426018, 456079, 677957, 545914, 667089, 409933, 620495, 494766, 695018, 357050, 464409, 590538, 461919, 657552, 407279, 663169, 482620, 911800, 481768, 588478, 725384, 885402, 719165, 489510, 756893, 588748, 711123, 474884, 799329, 464450, 492751, 535133, 474954, 497675, 611321, 549221, 585324, 373994, 293573, 591970, 416139, 493161, 562401, 391287, 673267, 423306, 674697, 552902, 616708, 506680, 576236, 444698, 300731, 661710, 714791]
18285G14791j27792j51038J57201j13671M8996J52205j28514r2m8249J38720B90974
18273D70644N8774p7786N5955l7127p8041j39308K75388j24360J80252K2102B72067
18261C75239j2570K07063M0028P8157m1158j91497J35845K35282j67713r7473
18251E61203M4183r1868p4305l11O8398J89541k8875j74406j6689K21924M3989
18240G42784j07831q4373J02711j47572O6095m6613Q5869j41066J5854J19068
18230F04926j30625L097K29619p3131j45152m6335J90320j1101o7812M9737K28833
18219H32376j76214j83300J92943k28036K04103p3549j03489O5015K5042J04079
18209F58970j54049J44921K5001k65862L23725k76633J75834J26854r2761J3061
$$ y = [714791, 586999, 435961, 593162, 479491, 528487, 680692, 552178, 552086, 503837, 642557, 290974, 470644, 529418, 451632, 507587, 470460, 392419, 253111, 528499, 404139, 584391, 606493, 272067, 375239, 362669, 569732, 609760, 687917, 646759, 455262, 591107, 826389, 658676, 561203, 605386, 513518, 439213, 438902, 507300, 696841, 667966, 493560, 476871, 698795, 742784, 634953, 550580, 653291, 505719, 571814, 525201, 611070, 470004, 485858, 604926, 474301, 477398, 707017, 633886, 488734, 442399, 632719, 621618, 553806, 603543, 832376, 656162, 472862, 665805, 437769, 641872, 568323, 464834, 529849, 554891, 658970, 504921, 649842, 674843, 408981, 732706, 456073, 631907, 758761, 666000, 679061]
18199F79061J09639k64895q4474L63313l10865r793M99242l12332q6764J1591
18189E93723n2950K42665q2036q2846K063K9993l2394J42460o9244j9380k45076
18178D26978K51325j14183l1523q6979j1413J45985j4959l1717J92169k69299
18168D56384M28005l88508J06218J70879n7198j4211p662n5065m336K07579j13488
18157G28597k50164J65412O4151P3717l4807k35635Q0791J23814L0717j93587
18147E53006k5484J19414P8640j07929q166P5165p7069M9539J62939r7443j76154
18136E46458J54910O0249O2948j68724k15916K88058j81771L08168k01863m5166
18126F07351k60549J52224N7568K12655M1246j11564o073j02073J29475O2568
$$ y = [679061, 788700, 523805, 439331, 802644, 491779, 481986, 981228, 668896, 582132, 593723, 540773, 783438, 701402, 618556, 620619, 650612, 618218, 760678, 691434, 672054, 426978, 678303, 564120, 532597, 445618, 434205, 580190, 565231, 533514, 725683, 456384, 884389, 495881, 602099, 772978, 715780, 701569, 693907, 638842, 634506, 842085, 728597, 478433, 643845, 707996, 781713, 746906, 511271, 592062, 715876, 746593, 553006, 527522, 646936, 725576, 617647, 609481, 684646, 607577, 657116, 820055, 722612, 546458, 701368, 761617, 824565, 655841, 439925, 727983, 546212, 854380, 652517, 607351, 346802, 499026, 556594, 769249, 810495, 698931, 692858, 590785, 720260, 782828]
18116G82828l63029R0222K3524K950K06373j46173J49930o7297q9002J12479M4083
18105G46888j04302J999J471q1969p1467J70031k24403J89724Q4366j03116k9460
18094E79762p8320j52324L30484O3068q9099N4218j07949l5466J713j60474J28193
18083E33806O9185L63977m07583J38173m481j29892J03284j65262Q9063J95268
18073G85538l61235l2198J17806j734K17472j81538j23201J38760l7163M0234
18063E62741j07348j37200L09395j9188j58230l8475K61074k63381O1310J19971
18053E90669j01087N3587L506q5389K97406k51702K0849J31736J76640C22748
18042E26483j62530R8022j32808J66018J7726Q3555j22702m7878K30103j69567
$$ y = [782828, 419799, 510021, 533545, 536495, 742868, 596695, 746625, 679328, 590326, 702805, 746888, 642586, 644585, 646056, 564087, 492620, 662651, 438248, 627972, 712338, 609222, 579762, 501442, 349118, 679602, 742670, 653571, 707789, 599840, 564374, 566087, 405613, 533806, 602991, 966968, 559385, 697558, 693077, 563185, 666469, 501207, 590270, 785538, 424303, 392105, 509911, 508177, 725649, 544111, 420910, 559670, 522507, 562741, 455393, 318193, 627588, 608400, 450170, 411695, 672769, 409388, 470698, 590669, 489582, 543169, 546675, 461286, 758692, 506990, 527839, 659575, 836215, 322748, 526483, 363953, 461975, 329167, 495185, 512911, 596466, 473764, 425886, 655989, 486422]
18032D86422j45179j08002L87582J32974l12018p5704M31163l15880k6200j668
18022D53490L0572N6144p5521K0067j73182K43238j73006l7259K48465j71347
18012D21661P8660j45862L49540k09357B27010M11676B11391K52912J42562j72774
18002D34091n6348J09871j49976J48467K60695k52296N9052O2254r5893p9752
17992D40165O1078n0322j645K23395k16978N733J31991k23036K54610K0169j58567
17981D86593K53158k65419j28858K80514j36171l0600J08534r2317P860K74917
17971G58211k26737K08921l03047J35204J70684j34675j76349O5303j26789K46083
17961F16809K5784J2655J27647k12527j5692l0000k0714r2492k5092J76105K6120
$$ y = [486422, 341243, 233241, 620823, 753797, 441779, 366075, 797238, 481358, 455158, 453490, 484062, 540206, 464685, 484752, 311570, 554808, 381802, 344543, 593008, 421661, 500321, 354459, 703999, 494642, 227010, 638686, 211391, 464303, 606865, 434091, 377743, 487614, 337638, 486105, 746800, 494504, 553556, 615810, 519917, 440165, 501243, 450921, 449276, 672671, 455693, 461426, 593417, 370381, 624991, 645160, 486593, 739751, 474332, 345474, 625988, 489817, 459217, 567751, 475434, 483294, 758211, 531474, 740395, 437348, 572552, 743236, 608561, 432212, 497515, 370726, 616809, 642593, 655248, 782895, 570368, 554676, 524676, 503962, 411470, 386378, 562483, 588603]
17950E88603j24396j51141K26556j8631Q9542j06669j18592K95300j35005j29379
17940D16188O8283Q8576K8317K27822k37541k6792k26867J19525O2096n8290J80595
17929F41912n6696n623j64455J95065j07169J96595k00698J43024k5428M2182
17919F58709p2474n9989J9865J17450r2978j08165O842r843K0335j27131K63824
17908F16445o1824N6958j65456J67925p4722J45053j36201r0940K08096j15386
17898E49948K8152K87451k99090j9645p523j68768M31441j67204Q3985M0884l920
17887G55711C53746J99777L5519J18053J72765n7528l24195K18602q9020K5669
17877F53388R5820k74017J15665J89906N6742k92948L14520k81761r6395L73394
$$ y = [588603, 464207, 313066, 539622, 520991, 610533, 503864, 385272, 680572, 545567, 416188, 484471, 573047, 601364, 829186, 591645, 564853, 337986, 457511, 519607, 461317, 641912, 585216, 579593, 415138, 610203, 503034, 699629, 498931, 641955, 616527, 658709, 586235, 526246, 546111, 663561, 570583, 462418, 469260, 459417, 479752, 352621, 616445, 554621, 611579, 446123, 614048, 539326, 684379, 548178, 457238, 665334, 549948, 578100, 865551, 566461, 546816, 539293, 370525, 801966, 634762, 718747, 759631, 755711, 353746, 553523, 589042, 707095, 879860, 822332, 498137, 716739, 627719, 653388, 749208, 475191, 590856, 780762, 837504, 544556, 859076, 577315, 480920, 854314]
17867H54314m19920J07345K28735J0780j89339J04349j32225O7666j46514J25149
17857F10340O8172L4424k11151O00J51566j04914N0839P5453J70202j68920j23999
17846E52612J72371p0989r5105M5937N1829l8657l2872K41575k19955J11296P1599
17835G89641j99893M3022m838K3221l3144n5322J25074j28308l2038K51506l70290
17824D08631L88163k77312M69298k21192J97238p719M1550j60372Q2708J71745
17814A092738m5700j17568J49614j32408K08939k28174M4198j41921J35100j84418
17804G80400m2262J66485K8307R2577P5202k6280j78711R2909J25394j46819j64301
17793H02901j6782p4066R5509K8733j31043N1470j09687J65893q7912k47847J94970
$$ y = [854314, 434394, 541739, 770474, 781254, 591915, 696264, 564039, 631705, 485191, 610340, 678512, 712936, 501785, 502385, 653951, 549037, 599876, 675329, 845531, 676611, 552612, 724983, 653994, 558889, 604826, 656655, 617998, 585126, 826701, 606746, 718042, 789641, 589748, 632770, 627932, 651153, 618009, 562687, 687761, 559453, 527415, 778921, 408631, 796794, 519482, 988780, 767588, 964826, 957107, 998657, 838285, 920993, 1092738, 1047038, 929470, 1079084, 946676, 1155615, 927441, 971639, 829718, 964818, 780400, 738138, 904623, 932930, 1025507, 1100709, 1074429, 895718, 988627, 1114021, 967202, 802901, 786119, 712053, 807562, 836295, 705252, 756722, 647035, 812928, 725016, 477169, 672139]
17782F72139J10915j75118J07269J08912q4969k75312K25950p0380j9588K1439
17772F21257L68476l26050l3536R7648R594J52198l08863J59761j12428J89619
17762H17676j83032J9723R2113k3879j70106M7634J16170K8227l597j1672N9855
17751G89112j08772j92786K33679p1699K529j51522K61398k33679O6811J22553
17741G17624J16280k22686j9792J89223l12716K46557K10799j95497j7456P0521
17731G82857j20643O6157J23301r3738p0868j65271O0222K29456l37640K05117
17721F78950j53932L2017J34182M154l9083q3333O1820J98531k07039L13488q2531
17710H57224k58473J64891M7603J20720k51000J13460p0520m8277J05391R544
$$ y = [672139, 783054, 607936, 715205, 824117, 739148, 463836, 689786, 619406, 599818, 621257, 989733, 663683, 630147, 727795, 737389, 889587, 580724, 740485, 628057, 817676, 634644, 654367, 746480, 722601, 552495, 600129, 716299, 744526, 740929, 729257, 789112, 680340, 487554, 721233, 649534, 652063, 500541, 761939, 528260, 595071, 717624, 833904, 611218, 591426, 780649, 467933, 714490, 925289, 729792, 712336, 782857, 662214, 728371, 851672, 757934, 687066, 521795, 582017, 811473, 473833, 678950, 525018, 557035, 691217, 695371, 656288, 572955, 634775, 833306, 626267, 939755, 857224, 598751, 763642, 811245, 931965, 680965, 794425, 723905, 675628, 781019, 790563]
17700G90563R2105j11710K240J0025l3960Q6248k778j29625N5045J1148j78227
17689E91074J6366M94394l11577j63692K94114j79947J02177m9552k82010L16777
17679H28124q3989q9489K2404K65618l11350P9440l6939K60463m2201k8602j33587
17668G29892J17124O1544j15749o4255r4543L01858l86720L90453j95417n185
17658G39002J45801r2585K5842j72568J63538n5020J4920K8984J69878k1305n8359
17647H88128J07082k26752J64668j35109J67528J6904j62768K66794j97209R2905
17637I82171L0604r9782J65977j40562K334l7559l3689J22101J30359n6592l5009
17626A030353j5352j11808J02935M5546k04828K14216O6464K62840k16366k10649
$$ y = [790563, 882668, 770958, 773198, 783223, 749263, 835511, 832733, 703108, 758153, 769301, 591074, 607440, 1101834, 790257, 626565, 920679, 740732, 842909, 793357, 511347, 828124, 744135, 654646, 677050, 942668, 631318, 710758, 673819, 934282, 892081, 863479, 729892, 847016, 908560, 792811, 728556, 634013, 935871, 549151, 939604, 744187, 739002, 884803, 792218, 818060, 645492, 809030, 754010, 768930, 797914, 967792, 946487, 888128, 995210, 768458, 933126, 798017, 965545, 982449, 819681, 1086475, 889266, 982171, 1012775, 912993, 1078970, 938408, 940742, 903183, 869494, 991595, 1121954, 1065362, 1030353, 1015001, 903193, 1006128, 1051674, 846846, 1061062, 1127526, 1390366, 1174000, 963351]
17616I63351K95155j74459J90588l76718L44884j33212J25177j28882L5529k2299
17606A119114R2451j13924k552K05483j29313O1439J3851J35850j91792J0132
17596A200739j42557J21646k10539M25736o2333J0522r7082k29474K12692K9067
17586A258417K16350k51877J04244J48398n0649P0298l71570K86606j84970K43649
17576A468896j90307J25762j7295P4340O3977k12292k2033J82168p1498k03233
17566A198485K66131l33574K58920n3461j17022P4793k32002P0120J36209n7394
17556A211205P6713J21045j02965m2667j22555P9287L4021K32009m6106k0755
17546A419232m1735R4207j11571J49299r9571Q8899K8514l2123J9447j6773l3298
$$ y = [963351, 1258506, 1084047, 1274635, 897917, 1242801, 1109589, 1234766, 1105884, 1141413, 1119114, 1211565, 1097641, 1095089, 1300572, 1171259, 1232698, 1246549, 1382399, 1190607, 1200739, 1058182, 1179828, 969289, 1395025, 1332692, 1343214, 1246132, 1016658, 1229350, 1258417, 1474767, 1222890, 1327134, 1475532, 1424883, 1495181, 1123611, 1410217, 1225247, 1468896, 1278589, 1404351, 1387056, 1461396, 1525373, 1313081, 1291048, 1473216, 1401718, 1198485, 1464616, 1131042, 1389962, 1336501, 1219479, 1294272, 1062270, 1132390, 1268599, 1211205, 1287918, 1408963, 1305998, 1263331, 1140776, 1220063, 1254084, 1486093, 1439987, 1419232, 1377497, 1471704, 1360133, 1509432, 1409861, 1498760, 1527274, 1495151, 1514598, 1497825, 1464527]
17535A464527n0181O657p2741m261J05650N5586R9718p2453o7022Q638j71627
17524A302491J70691J30026j45243N5647n7100Q2109J38075P1737k13741J09780
17514A644472J14762J36280M8340J07798n831L57989L4771O8268n3135J72334
17504B626048K8499p3807l5850K56358q8448R6354L62606J67886J68363K3439
17494C531448M80346N81525L82070M99180Q94132P27167J738742K601903M810523
17485A6247036P684277J0719761J3423486J4429403J2619339Q824242N103131
17478H9050675l47252o165154j1535092j4466705j3769539j0431979n692856j235644
17470B5406454L346839P860418J1133666J3301570J2536467R849333N529350J025473
$$ y = [1464527, 1414346, 1421003, 1348262, 1344001, 1449651, 1505237, 1604955, 1532502, 1465480, 1474118, 1302491, 1473182, 1603208, 1457965, 1513612, 1456512, 1538621, 1676696, 1748433, 1534692, 1644472, 1759234, 1895514, 1943854, 2051652, 2045821, 2403810, 2438581, 2506849, 2453714, 2626048, 2654547, 2580740, 2544890, 2801248, 2712800, 2809154, 3171760, 3339646, 3508009, 3531448, 4011794, 4593319, 4975389, 5474569, 6368701, 7095868, 8834610, 11436513, 16247036, 23931313, 34651074, 48074560, 62503963, 75123302, 83947544, 89050675, 88703423, 82538269, 71003177, 56536472, 42766933, 32334954, 26642098, 25406454, 28753293, 36613711, 47747377, 61048947, 73585414, 83434747, 88964097, 89989570]
17462H9989570n174175j0772658j4953540j5639460j3713400r826085o443091
17455A3467161l861150k428322j410785p90930p19494p30105m2179j38552k69798
17446C075846M4078J71759l26244K22443j44832J07539o5518k02372r3093N4244
17436B843850j69425O8404p8229M2513k8577M9489K54029k45633M11789j78240
17426B969970K9074j41901k06440l28434Q0090l7468j54611K853K0786O9118k34508
17415B068529N1161J34858K2812l9922N0984K5624J29383P4985j69541P7684L48992
17404B775549M1492j37880L17329j11730K05005K93015J95634J80132M9086K67327
17394D074959K27959K67466K97461N91257L70265L04280N06773K51326L04129
$$ y = [89989570, 84815395, 74042737, 59089197, 43449737, 29736337, 19910252, 13467161, 9606011, 7177689, 5766904, 4975974, 4256480, 3526375, 3484196, 3345644, 3075846, 3119924, 3291683, 2965439, 3187882, 3043050, 3150589, 3085071, 2882699, 2789606, 2843850, 2674425, 2742829, 2664600, 2707113, 2678536, 2728025, 2982054, 2736421, 3148210, 2969970, 2999044, 2857143, 2650703, 2322269, 2402359, 2364891, 2210280, 2213133, 2233919, 2303037, 2068529, 2119690, 2254548, 2277360, 2237438, 2288422, 2314046, 2443429, 2518414, 2348873, 2426557, 2775549, 2817041, 2679161, 2996490, 2884760, 3089765, 3382780, 3578414, 3758546, 3807632, 4074959, 4302918, 4570384, 4867845, 5459102, 5829367, 6133647, 6640420, 6891746, 7195875]
17385G195875K18789k08474K4367j49229j4121j30885m80311k6917l27851M7271
17375F148514J06256K45625J80192K59232L40868K13396M20811K28849L77203
17366H520946L4316J03218J64598j32561K63323m7967j87002P9712p7362k1406
17356H699815J06653K87136M44263K92642K58309O30739M31915K29262Q72603
17347A2253337M74947M50681Q87845J17561K07476M05354l09705j14529l06437
17338A4066530r9963n49249k77287n2489k89356K73582m7904K53670P6788L77207
17328A3731529M34520M79268M36714L15288O56513m2634M77944K73984J64275
17319A6927401O0636L45290l4774R6658K0023j82190J07078p4888k92591J33009
$$ y = [7195875, 7414664, 7206190, 7230557, 7081328, 7067207, 6936322, 6456011, 6429094, 6101243, 6148514, 6254770, 6500395, 6680587, 6939819, 7280687, 7494083, 7914894, 8143743, 8520946, 8555262, 8658480, 8823078, 8690517, 8953840, 8905873, 8718871, 8798583, 8721221, 8699815, 8806468, 9093604, 9537867, 9830509, 10088818, 10719557, 11151472, 11380734, 12253337, 12728284, 13178965, 14066810, 14184371, 14391847, 14797201, 14487496, 14372967, 14066530, 13966567, 13417318, 13140031, 13087542, 12798186, 13071768, 13023864, 13277534, 13354322, 13731529, 14166049, 14645317, 15082031, 15397319, 16053832, 16011198, 16489142, 16763126, 16927401, 16988037, 17333327, 17298553, 17395211, 17415234, 17233044, 17340122, 17265234, 16972643, 17105652]
17309A7105652N1468J31364Q4436J11512L03264q5301K96794o6346J5322L7712
17299A7985877n6939m32658P0082m41305j00289l3646j23522K27382m4573N2155
17289A7102564K86304K05028j55244J27958l67704k91355m33670m54080r68883
17280A5050918q74266o03751j005022o96859j036665o71424q10140p33272l20826
17271H298693k63028j45402m08454l90400J29267l34536J82885l24078J11592
17262F856539r2820o4559p6596K0229l66370k5627l00927j12604m78240n6366
17252E302659L92087l92437k78763R0634j54748R4731j96643J80418l05263J82058
17242D914733j63818j37479J12245m11j34437k85551Q1799m14713k4667k20665
$$ y = [17105652, 17157120, 17288484, 17372920, 17484432, 17787696, 17702395, 17999189, 17932843, 17948165, 17985877, 17928938, 17496280, 17566362, 17125057, 17024768, 16991122, 16867600, 17094982, 17050409, 17102564, 17388868, 17593896, 17438652, 17566610, 17198906, 16907551, 16473881, 16019801, 15050918, 14176652, 13572901, 12567879, 11871020, 10834355, 10162931, 9352791, 8619519, 8298693, 8035665, 7890263, 7481809, 7091409, 7220676, 6886140, 7069025, 6744947, 6856539, 6763719, 6699160, 6622564, 6642793, 6276423, 6250796, 5949869, 5837265, 5359025, 5302659, 5694746, 5302309, 5023546, 5114180, 4959432, 5054163, 4857520, 5037938, 4732675, 4914733, 4750915, 4613436, 4725681, 4725270, 4590833, 4305282, 4387081, 3972368, 3947701, 3727036]
17232C727036k51832J5701J4893j52854J85015j82038J84888j41414K69111j99349
17222C469157J10079j003k9416N6855p4628L07448r5974k11502L3478J3476P7621
17211C655591j18068o0288j42274p9234q72j19195n6734K42358j92495p0047P4903
17200C133645j95102K7121j74713k03010J47594k30575j69131J40165l13689L48699
17190B511004l17645J93176n773p0330j49257J70842O6214q2184p5500J3960Q4331
17179B338838j27961J25931M03734k00106J86646j06879m8366J19848O5093J0808
17169B767586J91201m26397J43834L37470j38067j80429K65298l32317K58797
17160B886976M9873n152J68462j88033L87283o5820J01115Q3596L4034k05840
$$ y = [3727036, 3475204, 3490905, 3505798, 3352944, 3537959, 3355921, 3540809, 3399395, 3668506, 3469157, 3579236, 3578233, 3548817, 3605672, 3531044, 3838492, 3742518, 3531016, 3564494, 3577970, 3655591, 3537523, 3477235, 3334961, 3255727, 3254855, 3135660, 3078926, 3321284, 3128789, 3058742, 3133645, 2938543, 2965664, 2790951, 2587941, 2735535, 2504960, 2335829, 2475994, 2162305, 2511004, 2193359, 2386535, 2380762, 2310432, 2161175, 2332017, 2398231, 2316047, 2240547, 2254507, 2338838, 2210877, 2336808, 2740542, 2540436, 2727082, 2620203, 2571837, 2691685, 2756778, 2767586, 2958787, 2532390, 2676224, 3013694, 2875627, 2695198, 2960496, 2628179, 2886976, 2936849, 2931697, 3100159, 2912126, 3299409, 3233589, 3334704, 3418300, 3452334, 3246494]
17150C246494j26311J60140k34489J1007K13976k22532J09801j69085L1615j099
17140C019517N199P6873n9876m1733O4291R7898q902r1114k23073j29575N2407
17129B761912k8579N654n3179R2314j05245O2911k05627K19580j79813N7894j10384
17118B517438j56669K12608L0370j75954K33326J09398K6769r0149L36174j14436
17108B928875J83455O2295k55162P0315r0809j81561J13342m05608j16146l6539
17098B272457j45922o2985p1274k07310K6163n33820L37997j75322O5738j08827
17088A396895k08566J5417K39231l89752K28940k00734J33728J24633j74814J02470
17078A267448k36985L0041Q8964M059R9424J71712k61522p3891J57228K67314
$$ y = [3246494, 3120183, 3280323, 3045834, 3056841, 3270817, 3048285, 3158086, 2989001, 3020616, 3019517, 3024716, 3101589, 3041713, 2999980, 3064271, 3162169, 3153267, 3062153, 2839080, 2709505, 2761912, 2733333, 2738987, 2685808, 2778122, 2672877, 2735788, 2530161, 2749741, 2569928, 2627822, 2517438, 2360769, 2573377, 2603747, 2427793, 2661119, 2770517, 2797286, 2707137, 3043311, 2928875, 3112330, 3174625, 2919463, 2989778, 2898969, 2717408, 2830750, 2425142, 2308996, 2272457, 2126535, 2063550, 1992276, 1784966, 1811129, 1277309, 1615306, 1439984, 1505722, 1396895, 1188329, 1203746, 1442977, 1053225, 1282165, 1081431, 1215159, 1339792, 1164978, 1267448, 1030463, 1060504, 1149468, 1153527, 1252951, 1424663, 1163141, 1089250, 1246478, 1513792]
17068A513792j09510k01020R2789J19717n6540j94972J67408r4984K16532j65702
17058A287510M53467P3206J31003J61832N20953K62024k2332J35473Q7155q6270
17048C004021J19855j4633j91667K0757Q320Q2506K99467j66794L48666l6928
17038C473570k3585J41414l38280k02014l1766k64928m03770L955n69734J42957
17028A927819k06245Q0758j56036J8832j78146P5621j02898j05444J34554j46379
17018A342436j4717j92109J61587N4205O0286k15372J47275j55411J06490l0513
17008A264157k1206R6549k3501J268k20411m1919J76346K26300j44634J4745j90654
16997A137040L61079k95169J02225k76939K26791j8188q9156J52045p1311J34765
$$ y = [1513792, 1404282, 1203262, 1296051, 1415768, 1359228, 1164256, 1331664, 1236680, 1453212, 1287510, 1740977, 1814183, 1945186, 2107018, 2627971, 2889995, 2867663, 3003136, 3090291, 3004021, 3123876, 3109243, 2917576, 2938333, 2946653, 3029159, 3328626, 3161832, 3510498, 3473570, 3449985, 3591399, 3253119, 3051105, 3019339, 2754411, 2350641, 2354596, 1784862, 1927819, 1721574, 1802332, 1646296, 1665128, 1486982, 1562603, 1459705, 1354261, 1488815, 1342436, 1327719, 1135610, 1297197, 1351402, 1411688, 1196316, 1343591, 1188180, 1294670, 1264157, 1242951, 1339500, 1315999, 1317267, 1096856, 1054937, 1231283, 1457583, 1312949, 1327694, 1137040, 1498119, 1202950, 1305175, 1028236, 1255027, 1236839, 1147683, 1299728, 1228417, 1363182]
16987A363182j15424M2183r1776r8274J75154L896j58623K31276k7997J28542
16977A452139o6754j18131N6717o6993K47519j79643L14924P7771r3666L9767
16967A663650J21150L02883m48j21319J18887L6906L44509o3976Q5848n9865p7552
16956B350673J91409k9409n5254k7326j65175j49703L91387l21837J4291q7914
16946B111142j59470r6432j58033Q4125j24344k75188J99359j53330j96136K3849
16936A255542O9925j96948K06942Q060m6425J46740l08747J6859k5212j84732
16926I42004K51633j33597q9209J05079j80441J13560O2266j54082J48733l63272
16916G02674L27238q6138K41762k18063j48267K29989k61785L17562l54456J17528
$$ y = [1363182, 1247758, 1289941, 1198165, 1099891, 1275045, 1278941, 1120318, 1351594, 1323597, 1452139, 1385385, 1267254, 1323971, 1256978, 1504497, 1324854, 1639778, 1717549, 1623883, 1663650, 1784800, 2087683, 2087235, 1965916, 2084803, 2121709, 2466218, 2402242, 2488090, 2428225, 2350673, 2542082, 2512673, 2457419, 2430093, 2264918, 2115215, 2506602, 2184765, 2199056, 2111142, 1951672, 1855240, 1697207, 1781332, 1656988, 1381800, 1581159, 1427829, 1231693, 1255542, 1325467, 1128519, 1335461, 1343521, 1297096, 1443836, 1135089, 1151948, 1126736, 942004, 1193637, 1060040, 970831, 1075910, 895469, 1009029, 1071295, 917213, 1065946, 702674, 1029912, 943774, 1185536, 967473, 819206, 1049195, 787410, 1104972, 750516, 868044]
16906H68044M0533j95485J08750r799J49393l3305J14688j9188j00685k21581
16896G01365J75983j94792J78643j09845j94260J50703K01530j17798p5051P7386
16886G93864R0105O945j35874N4893K5334j62128K96792j44833M2552K04395k43310
16875H28735Q6151N4990O1437q3476j14264J13115k63475K19026Q743j06538J22229
16864I26673k2504M6032j75474L9478q8139J48845N1283K2795j83863J92547m3561
16853I14112n5258L5516n9429m6093J756J51194m9716l8013k3920j75136L08781
16842I63794m4412j30083L39650l52262q4375R5565O0273J05169O0919m2870o8381
16831I02987K67704n162j5657j73986o5780K96772j14277r1497J3399L01668o0045
$$ y = [868044, 908577, 713092, 821842, 812043, 961436, 928131, 1042819, 1023631, 922946, 701365, 877348, 682556, 861199, 751354, 557094, 707797, 909327, 791529, 716478, 793864, 883969, 890914, 755040, 809933, 835267, 673139, 969931, 825098, 867650, 1072045, 828735, 914886, 969876, 1031313, 947837, 833573, 946688, 683213, 902239, 910982, 804444, 926673, 904169, 950201, 774727, 814205, 726066, 874911, 926194, 948989, 765126, 957673, 914112, 858854, 894370, 834941, 788848, 790604, 941798, 892082, 854069, 830149, 655013, 963794, 919382, 789299, 1128949, 776687, 692312, 787877, 848150, 953319, 1014238, 971368, 902987, 1170691, 1165529, 1149872, 975886, 910106, 1206878, 1092601, 1001104, 1014503, 1316171, 1256126]
16820A256126L09946j59066M2797K59295k3220m3648J59898m272j41352K07438
16810A863942l37619R2129q5179J12170K38141m7919j81803n2558O5455l47906
16800A318853K06952k6625p7133J14873j44955J11117k12857J58397k01592k69350
16790I77680j33950N1287J47941j13644R075j8855n1268n1993J00811j05015m1376
16779G70693P1974n8886n5829J77210k11425J79233q9518J03203k9976k46363
16769F10316L55908k41440j96971L91357k66433J41246j85301J70184J45891j58719
16759G66038L5097J45932k39417O3977l6039k42445M46134j21018m9258L035N4208
16748H26244k52099N02475l09180J5702p3312K93251k54017P7082J59963j99660
$$ y = [1256126, 1566072, 1407006, 1449803, 1709098, 1685878, 1642230, 1802128, 1797856, 1656504, 1863942, 1526323, 1618452, 1533273, 1645443, 1883584, 1835665, 1653862, 1601304, 1666759, 1318853, 1525805, 1499180, 1422047, 1536920, 1391965, 1503082, 1290225, 1448622, 1247030, 977680, 843730, 895017, 1042958, 929314, 938389, 919534, 868266, 816273, 917084, 812069, 770693, 842667, 783781, 727952, 905162, 693737, 872970, 783452, 886655, 856679, 610316, 966224, 724784, 527813, 919170, 652737, 793983, 608682, 778866, 924757, 766038, 801135, 947067, 707650, 771627, 735588, 493143, 939277, 818259, 769001, 772036, 826244, 574145, 1076620, 767440, 783142, 709830, 1003081, 749064, 826146, 986109, 786449]
16738G86449k20016K27626K24709k16968p5799K79861l52168O3248J23071m6695
16728G93318q3224N4270L6790L2090K04548q7031o9516P8766P424J75311k63750
16717H78996l0120J00408J06235j38622K06149k26320j55969K23481L3290J66614
16707A164142L5258n2454k9413K89214J21922j68229J78347o4978j10663O2523
16697A425669l7812J0501n5107j7188j96297N24243k26586J41276j06402O6589
16687A528886l06465K04989Q4540j32460J07084j02461j83361R2632k79017K9652
16677A044019K91898k89550L07646l28539M74343k58737J59162j31276J92034
16668A461000K68847K0387k54797L92417j92184P5085j68263k00099m0037J32460
$$ y = [786449, 566433, 794059, 1018768, 801800, 726001, 1005862, 653694, 716942, 840013, 793318, 710094, 764364, 801154, 833244, 1037792, 950761, 881245, 960011, 967435, 1142746, 878996, 848876, 949284, 1055519, 916897, 1123046, 896726, 740757, 964238, 997528, 1164142, 1199400, 1146946, 1117533, 1406747, 1528669, 1360440, 1538787, 1473809, 1363146, 1425669, 1387857, 1398358, 1343251, 1326063, 1129766, 1654009, 1427423, 1568699, 1462297, 1528886, 1222421, 1427410, 1511950, 1379490, 1486574, 1384113, 1200752, 1293384, 1014367, 1044019, 1335917, 1046367, 1354013, 1025474, 1499817, 1241080, 1400242, 1268966, 1461000, 1729847, 1750234, 1495437, 1887854, 1695670, 1770755, 1602492, 1402393, 1362356, 1494816]
16658A494816K7729J32530J3695J7296J42101m14865J49657q8806r9659N1826
16648A426320k33296k13934L1314J59966m12286J35298n1512L8535k34752j11630
16638E34023K9484M01800p8017q3014j85475J68851l5321O0673J2573j94491R8775
16627G29861p7288j33320J75484k11228N6256J54339j2589J5868k84532J45110
16617E57961J3732k10183K78394l1237k4984j05329K29854J25593j56270J72679
16607H50210j36657Q1785j6135j39562j7663K76141k5863L2058l1845J03610J3131
16596I89210N0131M4706j29690O2025M3932k60986q5058J41011j52172L48479
16586A051588m67442J88421Q0304n2118K9351J77261k50411J84188L7247p0959
$$ y = [1494816, 1522545, 1655075, 1668770, 1686066, 1828167, 1413302, 1562959, 1474153, 1374494, 1426320, 1193024, 979090, 1010404, 1170370, 758084, 893382, 841870, 880405, 645653, 534023, 563507, 965307, 887290, 804276, 618801, 787652, 752331, 813004, 825577, 631086, 729861, 652573, 519253, 694737, 483509, 539765, 694104, 681515, 697383, 412851, 557961, 571693, 361510, 639904, 608667, 583683, 478354, 708208, 833801, 677531, 850210, 713553, 795338, 779203, 639641, 621978, 898119, 872256, 904314, 872469, 976079, 989210, 1039341, 1084047, 954357, 1016382, 1060314, 799328, 714270, 855281, 703109, 1051588, 584146, 772567, 852871, 800753, 830104, 1007365, 756954, 941142, 978389, 907430]
16576I07430N5826R2210J36625m7471j00851J69231k85090P820j84174K02478
16566I54034P4484k91847J70921J10741j87447R5567J47849j60898R3332j22291
16556H84445k7339L7830K95J80077k26040J4881K60426n6799j48608j658j78749
16545G38761K60035k40340J67155m29796J22173L3676m1176K18543r4171J01628
16535H36488k37295K26495j52654K24192N9838j06810r7378J49052J62364J6723
16525A081015j26077k4887O5514l2992l7894O2996L3966k9686j95421k0722L73019
16514A148831K06518k52210K58812n1943j90484K09387N1721M9201l8655K58411
16504A649589j86972r4711R7629j68471K47772k11778J8048k6709q4154j8049
$$ y = [907430, 963256, 1055466, 1192091, 1144620, 1043769, 1213000, 927910, 935730, 751556, 954034, 1028518, 736671, 907592, 1018333, 830886, 926453, 1074302, 913404, 1006736, 884445, 857106, 894936, 895231, 1075308, 849268, 864149, 1124575, 1067776, 919168, 917510, 738761, 998796, 758456, 925611, 495815, 617988, 651664, 610488, 829031, 734860, 836488, 599193, 825688, 673034, 897226, 957064, 850254, 752876, 901928, 1064292, 1081015, 954938, 930051, 995565, 962573, 924679, 987675, 1021641, 991955, 796534, 775812, 1148831, 1355349, 1103139, 1361951, 1310008, 1119524, 1328911, 1380632, 1429833, 1391178, 1649589, 1462617, 1367906, 1465535, 1297064, 1544836, 1333058, 1351106, 1324397, 1240243, 1222194]
16494A222194p5819N101j92939M9116O9546o1984J97238k09376p2601q5727J47564
16483I92313p5265j310k63379K23425J69032q1353L44940j02374j38584J71532
16473A238977Q3465l23656M13315l65593L01441j32907J45474k1636N6498k96706
16463A098672K39929K6963j40173R692P1056j22430o1914k3349R7873m0215r7321
16452A058783P4142K47940m8943L34283M5438J85434m736J41271L01617K04708
16442B539937j8852o7723J28937M5307R1444L1324k46884m4229n4517O1070Q8355
16431B554169J48741K0856j01277K25529J70341O6151L19105L03873L76908O91422
16421D775818Q35310O36487J291163R79714J275029J006967J598200J217412J070201
$$ y = [1222194, 1146375, 1151476, 958537, 1007653, 1077199, 1015215, 1212453, 1003077, 930476, 844749, 992313, 917048, 915738, 652359, 875784, 1044816, 963463, 1308403, 1206029, 1067445, 1238977, 1322442, 998786, 1412101, 1046508, 1347949, 1215042, 1360516, 1338880, 1395378, 1098672, 1338601, 1365564, 1225391, 1235083, 1306139, 1183709, 1121795, 1098446, 1196319, 1156104, 1058783, 1132925, 1380865, 1331922, 1666205, 1711643, 1897077, 1892341, 2033612, 2335229, 2539937, 2521085, 2453362, 2582299, 2627606, 2719050, 2750374, 2503490, 2459261, 2404744, 2465814, 2554169, 2702910, 2723766, 2622489, 2848018, 3018359, 3084510, 3403615, 3707488, 4084396, 4775818, 5611128, 6247615, 7538778, 8518492, 9793521, 10800488, 12398688, 13616100, 14686301]
16412A4686301J573967J220202J323479J169506J522645J462552J972832J976691
16404B6908175K356506K383369K476484K709957K525681K431420J508271O66204
16396D3966067l77624m68112j037193m46307J811513N642244J0698633J3177919
16388G2967140J0671845N527781J788775j626411l793250m142362m264463m024786
16380G3104269l266860m475247o389431o690710n031691k914668j730603j923036
16372D0682023k848241l271524l183324k506559j892654j729154j661945j736223
16364B1852399j971221j752563k127427j265095j510086j518067j561217j441740
16356H704983o72715p62078p44088n27907o68656n56876n78437n92971j67189
$$ y = [14686301, 16260268, 17480470, 18803949, 19973455, 21496100, 22958652, 24931484, 26908175, 29264681, 31648050, 34124534, 36834491, 39360172, 41791592, 43299863, 43966067, 43588443, 43120331, 42083138, 41636831, 43448344, 49090588, 59789221, 72967140, 83638985, 89166766, 90955541, 89329130, 85535880, 81393518, 77129055, 73104269, 69837409, 65362162, 58972731, 52282021, 47250330, 44335662, 42605059, 40682023, 37833782, 34562258, 31378934, 28872375, 26979721, 25250567, 23588622, 21852399, 19881178, 18128615, 16001188, 14736093, 13226007, 11707940, 10146723, 8704983, 8032268, 7270190, 6526102, 5998195, 5329539, 4772663, 4194226, 3601255, 3434066]
16347C434066n84907m67859k64603n87941k36295j93434k62494k39903j62949
16338D33681J16306B70007J20748j86323N1468b25253a09754m6401r2161a11283
16327a33504b3493k0576A77509P5096M849K97459M9039q3587J10967K16355n1965
16316G95722L90757j98387N5196j14981J39190k86073j37719Q6097k62276N6841
16306E24367j93220J8400l1839J97768j68901J47477J5174j4753J09259q7583
16296E16149J51077r9285K19588l18836J24086J37844Q7206O6676J26720j20771
16286H90454j74568K21960J55254k65597r1140k70885M9273l2792j88904n7224
16276B35831a40308A82438o1721N508K59738j02143J940K45168q0076A88375L6596
$$ y = [3434066, 2849159, 2381300, 2116697, 1528756, 1292461, 1099027, 836533, 596630, 433681, 549987, 270007, 390755, 204432, 255900, -225253, -109754, -156155, -248316, -111283, -133504, -23493, -44069, 177509, 252605, 257454, 554913, 603952, 520365, 631332, 847687, 795722, 1186479, 988092, 1043288, 928307, 1067497, 781424, 643705, 729802, 467526, 524367, 331147, 349547, 317708, 515476, 346575, 494052, 509226, 494473, 603732, 516149, 667226, 567941, 787529, 468693, 592779, 730623, 817829, 884505, 1011225, 890454, 715886, 937846, 1093100, 827503, 736363, 465478, 514751, 481959, 293055, 235831, -140308, 182438, 120717, 126225, 385963, 283820, 285760, 530928, 450852, 188375, 224971]
16265B24971j05202J25879j9382o1924J67845j4222L1580n232L63649j67119J85367
16254G26210j1961r7428O8052J36864k91472K08503R9050k76412J50489j51018
16244E60877n0794J33017L043J50777m7471o243p1373K00103j55460J72981l27183
16233E62274J71906m542j85878J39291j16663J03813p2599A46064N45308j78274
16223E13098j71863J58354j99075N7848L05843r9962R8008J87006q7034o8803
16213F93420l2262J55287P8583j43130Q1687J0520J62964j82670r9521N0975m4566
16202G31287J7751Q9965m8083m3980n5584Q7667q4527J88276j67424K12217j11077
16191H16488k7887K8519k79L8012Q6418m6192q1712K3631M4645k74042K50077
$$ y = [224971, 119769, 245648, 226266, 164342, 332187, 317965, 349545, 344313, 707962, 540843, 726210, 714249, 616821, 684873, 821737, 530265, 738768, 837818, 561406, 711895, 560877, 510083, 643100, 646143, 796920, 749449, 743206, 671833, 871936, 716476, 889457, 562274, 734180, 729638, 543760, 683051, 566388, 670201, 597602, 146064, 691372, 513098, 341235, 499589, 300514, 358362, 664205, 564243, 662251, 849257, 762223, 693420, 661158, 816445, 895028, 751898, 833585, 844105, 1007069, 824399, 724878, 775853, 731287, 749038, 839003, 790920, 746940, 691356, 779023, 694496, 882772, 715348, 927565, 816488, 788601, 817120, 816841, 854853, 941271, 895079, 813367, 836998, 881643, 607601, 857678]
16180H57678n2526p1434R1376J25353k97960P8249k54435K55930N5680M5835Q5917
16169I19663j45162j13638p3421L7795R6431P0114l9578j75084m5068N22421l35016
16158G19457q8014k0039K26641R159N3378K790l7173k42312K83157k00251L2137
16147G38930j88933M36257m02411j16786J01994k8622q850L33617j82016R8537
16137G81717j85200K4895K00093M1639j86196J79326j51434j58204J93955J03416
16127H44007j49899K02309j09261j2981M9517N9739j13070Q9388p7212j38631
16117F43906L35158q5990m5965K42187k64113r435r2316K26961k00926J84082
16107I33549L0982j49833j0424m1258J50346q9334J59952j85683L01986j14110
$$ y = [857678, 805152, 733718, 825094, 950447, 652487, 730736, 476301, 732231, 787911, 833746, 919663, 774501, 660863, 587442, 625237, 721668, 791782, 752204, 577120, 532052, 1054473, 719457, 631443, 611404, 838045, 847204, 900582, 903372, 866199, 623887, 907044, 706793, 738930, 549997, 986254, 583843, 467057, 569051, 540429, 531579, 865196, 683180, 781717, 596517, 621412, 821505, 863144, 676948, 856274, 704840, 546636, 740591, 844007, 694108, 896417, 787156, 774175, 823692, 883431, 770361, 859749, 782537, 643906, 979064, 893074, 847109, 1089296, 825183, 815748, 723432, 950393, 749467, 933549, 964531, 814698, 804274, 763016, 913362, 824028, 983980, 798297, 1100283, 986173]
16097I86173k6694N8303J12105l50638K53280P6268j63034K11042j94793J35235
16087A097247R0923j02625J2019J35712o9993j35134m9200Q8941J15120m7291
16077A135719k7763M9282j94153J36490J01997q6765L4408r051M2865N9871j5698
16066A227202j2320J2078J8348o9073o7245l0118J01759J77225j65085J86234
16056A379005r8062K08322q2990k00753O8922K99185n6281Q1003k17368L41487
16046A722470j61968O1056O908p9916M3779m7497K08138o9025j6814R1446k1903
16035A736674q2960l933K40190k43170j44774K52662r8671o0714J23046k3433
16025A694917J68621j20939J14887k12130K61690J18846k58821L42719l45929
$$ y = [986173, 959479, 1017782, 1129887, 779249, 1032529, 1108797, 945763, 1156805, 962012, 1097247, 1188170, 1085545, 1097564, 1233276, 1163283, 1028149, 978949, 1067890, 1183010, 1135719, 1107956, 1157238, 963085, 1099575, 1201572, 1114807, 1149215, 1140164, 1183029, 1242900, 1227202, 1214882, 1226960, 1245308, 1176235, 1108990, 1078872, 1180631, 1357856, 1192771, 1379005, 1280943, 1489265, 1406275, 1205522, 1274444, 1573629, 1517348, 1598351, 1380983, 1722470, 1560502, 1621558, 1628466, 1548550, 1592329, 1544832, 1752970, 1683945, 1667131, 1758577, 1736674, 1653714, 1649781, 1889971, 1646801, 1502027, 1754689, 1656018, 1595304, 1718350, 1694917, 1863538, 1742599, 1857486, 1645356, 1907046, 2025892, 1767071, 2109790, 1763861]
16016A763861K48083M7335k2389j08870L5n2152K2060Q1780j7362j69861L79598
16005B172118j72521O7723k22803J51703j27277K72956j3426k84487K66885j70255
15995A940616j07787K02597k07185K58159p7850Q460j13096k8771L86509k29342
15985B032310J03643O699K0211j2192l707R1023q9836O7755K7949p9637p3273
15974B090945K19315k04632J40118j35494K3168N4679M5499j39713q2689K0701
15964B031897K66663l4631l31550K97140q0061K80837j37568j3113k38730K35470
15954B276354p9722k60319L80000k9124J5694l6219J68519l13743J15891J39318
15944B376649j40334J08994m1976j36680K65730k96121J36699K24046Q6793q3165
$$ y = [1763861, 2011944, 2059279, 2036890, 1928020, 1928055, 1875903, 1897963, 1979743, 1962381, 1792520, 2172118, 1999597, 2067320, 1844517, 1996220, 1868943, 2141899, 2128473, 1843986, 2110871, 1940616, 1832829, 2035426, 1828241, 2086400, 2008550, 2017010, 1903914, 1875143, 2261652, 2032310, 2135953, 2142652, 2162863, 2150671, 2146964, 2237987, 2148151, 2215906, 2243855, 2164218, 2090945, 2310260, 2105628, 2245746, 2110252, 2133420, 2188099, 2233598, 2093885, 2011196, 2031897, 2298560, 2263929, 1932379, 2229519, 2149458, 2430295, 2292727, 2279614, 2040884, 2276354, 2196632, 1936313, 2316313, 2287189, 2302883, 2266664, 2435183, 2121440, 2237331, 2376649, 2236315, 2345309, 2303333, 2166653, 2432383, 2136262, 2272961, 2497007, 2583800, 2500635]
15934B500635J64529J04867m0005J69257j33707L5226M71478r5635n6926K8219
15924C147938L00769J13854L37423k1846K24644J50506N88928L45159O40053Q58071
15914F685499J022578J251245K133559K800200L747832N646032O471181Q149951
15906C7908077Q182705P521767O606923M041242J183516k362411n113451p575581
15898E0392787q591966q759524p394406o065395m662442l210012k252037j691256
15890G765749j160137r23104q10262l88485n07518l92153p5859l37490r4553j1051
15880C065137n23311J8354Q8881p8806p6232K24453l25667Q919L00918j24354
15870B578292k32018L97589r9853j96003K255p8924m0949L9331k0027o3310j47997
$$ y = [2500635, 2665164, 2770031, 2730026, 2899283, 2765576, 2800802, 3272280, 3176645, 3119719, 3147938, 3448707, 3562561, 3899984, 3878138, 4102782, 4253288, 4842216, 5187375, 5827428, 6685499, 7708077, 8959322, 11092881, 13893081, 17640913, 23286945, 29758126, 37908077, 46090782, 53612549, 60219472, 64260714, 65444230, 63081819, 57968368, 50392787, 41800821, 33041297, 25646891, 19581496, 14919054, 11709042, 9457005, 7765749, 6605612, 5682508, 4872246, 4483761, 3976243, 3584090, 3508231, 3170741, 3076188, 3065137, 2541826, 2560180, 2649061, 2570255, 2494023, 2718476, 2392809, 2401728, 2702646, 2578292, 2346274, 2743863, 2644010, 2448007, 2450262, 2371338, 2330389, 2369720, 2349693, 2286383, 2138386]
15859B138386j26986r83K57794j82987M2792j8363r218j5529j36348M2073K42903
15848B233534j84405k37096L09479o5914j0944j10984P9728K70662M0003k59979
15838B064084j13513N36894j57408P9407K66487j83575j874k2567j02450m9636
15828B315849j82302j1506J68136M0822l22639j5030J34688M6951J79835l75649
15818A979155J39919j91217R8753R9289m4967j29081J63431J79884j74065J82803
15808B303904K8029o9941l1639J30583m7553L1976J53942J01222p505K1269N2798
15797B667085J41209J61514J34776K2994N6784O2492l7730K8567L51478l81993
15787C207176J25116R8979Q3074O2814R2731k0802p2191M89591J58879r5970M6334
$$ y = [2138386, 2011400, 2010417, 2268211, 2085224, 2128016, 2109653, 2100435, 2084906, 1948558, 1990631, 2233534, 2049129, 1812033, 2121512, 2055598, 2044654, 1933670, 2013398, 2284060, 2324063, 2064084, 1950571, 2487465, 2330057, 2409464, 2675951, 2492376, 2490502, 2467935, 2365485, 2315849, 2133547, 2122041, 2290177, 2330999, 2008360, 1993330, 2128018, 2174969, 2354804, 1979155, 2119074, 1927857, 2026610, 2125899, 2080932, 1951851, 2115282, 2295166, 2121101, 2303904, 2331933, 2261992, 2230353, 2360936, 2313383, 2345359, 2499301, 2600523, 2593018, 2614287, 2667085, 2808294, 2969808, 3104584, 3127578, 3184362, 3246854, 3209124, 3237691, 3589169, 3207176, 3332292, 3431271, 3514345, 3577159, 3669890, 3649088, 3576897, 4066488, 4225367, 4129397, 4175731]
15776D175731K58042N1225l41964K26214p4090K4721l6847r7048L72870l38327
15766D220527K15574k65056N12961k46999K11943J61668q5923l8799n4314O7250
15756D698832r9542K66295m29005K27737P3560n6633J72473K73433K2258J31786
15746E281194m1411M35790P5102J29301P8985M24499J72239L89331p4365J13996
15736F984661r9923j1332M6707L8166j11392J85682K44709k24509M09014r5259
15726G366524J61600k82088k12910j93761m63369P1997l80463o7063L91539J05830
15716F497836K91082k28656J40780p4453j58088M0711l35472L17773K6646k6613
15706F491546L25128K04886J84739K48276K48312J50526J42573R2022K02700J18878
$$ y = [4175731, 4433773, 4484998, 4143034, 4369248, 4295158, 4319879, 4283032, 4185984, 4558854, 4220527, 4436101, 4171045, 4684006, 4437007, 4648950, 4810618, 4724695, 4685896, 4631582, 4698832, 4599290, 4865585, 4436580, 4664317, 4737877, 4681244, 4853717, 5127150, 5149408, 5281194, 5239783, 5675573, 5750675, 5879976, 5958961, 6383460, 6555699, 6945030, 6870665, 6984661, 6884738, 6873406, 6920113, 6958279, 6846887, 7032569, 7277278, 7052769, 7461783, 7366524, 7528124, 7246036, 7033126, 6839365, 6375996, 6447993, 6067530, 6000467, 6392006, 6497836, 6788918, 6560262, 6701042, 6626589, 6468501, 6509212, 6173740, 6491513, 6518159, 6491546, 6816674, 7021560, 7206299, 7454575, 7702887, 7853413, 7995986, 8088008, 8290708, 8409586]
15696H409586J59355j26497N44380k75148J81868n0508k31117p3506k12566O6164
15686H392011k94907q2859J71683O908K98882k5314O2826j95278l3408q936o83156
15675G608452N4608k87359o5595j81149K17231j00575P6613p6104P4894j63191
15665G157825j57100L37377M58160J46183N5496M39825K84876M80376K08454M37631
15655I849103N72568O45560N08734N09250P18602O02681N42400Q90081M55405
15646A5294384L76299K12359O15954N57326O97648M76994P49547R91491N48440
15637B0520442Q98148N72611L90192K8842N7012k41279k71912j30410l57508j99027
15627B1267111k37286m3835J98591j87780K83953m06836o51592o74602p41981
$$ y = [8409586, 8568941, 8442444, 8986824, 8711676, 8893544, 8843036, 8611919, 8538413, 8325847, 8392011, 8097104, 8014245, 8185928, 8192836, 8491718, 8466404, 8529230, 8333952, 8300544, 8291608, 7608452, 7663060, 7375701, 7310106, 7128957, 7346188, 7245613, 7322226, 7246122, 7321016, 7157825, 7000725, 7338102, 7796262, 7942445, 7997941, 8437766, 8722642, 9203018, 9411472, 9849103, 10421671, 11067231, 11575965, 12085215, 12803817, 13406498, 13948898, 14838979, 15294384, 15670683, 15883042, 16498996, 17056322, 17753970, 18230964, 18980511, 19972002, 20520442, 21418590, 21991201, 22381393, 22410235, 22467247, 22225968, 21954056, 21823646, 21466138, 21267111, 21029825, 20985990, 21184581, 20996801, 21280754, 20873918, 20222326, 19547724, 18805743]
15618A8805743j006350r40504p44946j067197n26665m68415m70265l17143m44982
15609A2819276l08693l49955m41424k12134l46145m32822k08437m3011J2412k33150
15599A0255917j18992l51920J07025K37251J90645M81058J304122K072297M059763
15590A8237166P686509J1993212J5924565J5390079J0784634P225619L653388
15583I0895172L18154r437893j6346330j8390169j4954775j0481661n976549l413880
15575A2212069j558123r24604p67202n24700K1865N6338o2237O8162J89559L06711
15565I017838K99854j41161L52176M4665K31656N96207Q98361J593800L474097
15556A6367493N999165J1518741J7292111K1767570J8469918J2508517P882689
$$ y = [18805743, 17799393, 16858889, 16113943, 15046746, 14520081, 14051666, 13581401, 13264258, 12819276, 12510583, 12160628, 11719204, 11507070, 11160925, 10728103, 10519666, 10476655, 10489067, 10255917, 10136925, 9785005, 9892030, 10129281, 10319926, 10800984, 12105106, 14177403, 18237166, 25923675, 37916887, 53841452, 69231531, 80016165, 87241784, 90895172, 91213326, 81775433, 65429103, 47038934, 32084159, 21602498, 15625949, 12212069, 10653946, 9729342, 8962140, 8437440, 8459305, 8515643, 8453406, 8521568, 8711127, 9017838, 9317692, 9176531, 9528707, 9573372, 9805028, 10401235, 11299596, 12893396, 16367493, 22366658, 33885399, 51177510, 72945080, 91414998, 103923515, 111806204]
15549A11806204M372753k629267j5814889k2645874k2806527j8677042j1833051
15542B1772307o698321l930258j860514j400380o71539m09924l16836k35218l12947
15533E936370k52711p5609q6828j19635O3699m46674J426k19258r6986j75932
15523D527862L2951l76316k32840m9295J29956J72873k0936K8538P2652K8600
15513D314045K19055O6214K240N1380Q5857J96855j8697p3785r7524j35524j46606
15502D463510N3431k91352J58079j00634M5700p4957j84775j3630R6674K37347
15492D389393K26174J4737O7924l13083L61297m2050K63483k9007L37669N67297
15482E843834L09954O3894K73838J0695r3568K5214p1127j29755J15309L82584
$$ y = [111806204, 116178957, 113549690, 97734801, 75088927, 52282400, 33605358, 21772307, 15073986, 11143728, 9283214, 7882834, 7211295, 6801371, 6484535, 6249317, 5936370, 5683659, 5608050, 5521222, 5401587, 5465286, 5018612, 5020038, 4800780, 4703794, 4527862, 4560813, 4184497, 3951657, 3902362, 4032318, 4205191, 4184255, 4212793, 4285445, 4314045, 4533100, 4599314, 4601554, 4652934, 4738791, 4935646, 4916949, 4843164, 4745640, 4610116, 4463510, 4516941, 4225589, 4383668, 4283034, 4328734, 4253777, 4069002, 4055372, 4152046, 4389393, 4615567, 4630304, 4698228, 4385145, 4746442, 4704392, 4967875, 4938868, 5276537, 5843834, 6153788, 6217682, 6491520, 6502215, 6408647, 6433861, 6362734, 6232979, 6348288, 6730872]
15472F730872R4866P17627J011077O30306J024951O59102N87314J96593l00100
15463A1352608m64041o15181n18303p20683k87267R9401L72180N27969P08402
15454A0455085P79830N38396M83455M23332k41954o43111m97518q01526o77453
15445I818536o77633j62330j69619J49693o6700L38343J32502L11331j09228Q1678
15435I646573o13393j20016m35093l38917n95634k33558l065l48617j09211K7740
15425F876809j9662m79751n3469M6561l65136n0319l16400K5980k71373J35362
15415E528602l32595o4635l5579J87480m2221j3840o4790k8315L53970j74003
15405E314074j23493L67452m5290q130L24042l0452J74683L7913m2878K02729
$$ y = [6730872, 6825738, 7543365, 8554442, 9184748, 10209699, 10868801, 11456115, 11652708, 11352608, 10888567, 10273386, 9755083, 9034400, 8747133, 8846534, 9218714, 9746683, 10455085, 11234915, 11773311, 12256766, 12680098, 12438144, 11795033, 11297515, 10495989, 9818536, 9140903, 8978573, 8808954, 8958647, 8891947, 9230290, 9362792, 9674123, 9564895, 9646573, 9033180, 8913164, 8478071, 8139154, 7543520, 7309962, 7306897, 6958280, 6849069, 6876809, 6857147, 6377396, 6323927, 6370488, 6005352, 5955033, 5638633, 5664613, 5393240, 5528602, 5196007, 5131372, 5095793, 5283273, 5241052, 5227212, 5162422, 5134107, 5488077, 5314074, 5190581, 5558033, 5512743, 5504613, 5828655, 5798203, 5972886, 6010799, 5967921, 6170650]
15395F170650M8555O1298J80522l22514J82747j60418q6769K96875O3450J03825
15385F538221j1709K32098M8649o3429q1064K19984K01481l48989J95387m6243
15375F884386j16057k01367K89732J70135o4599p4991j4536J91694R6205Q3929
15365G244531R2613M1101K67892J34387K84320J40762J40042J28601J98861L468
15355H676578K37492K85398L43730P2748Q12906N35207J756025K883628N122084
15346B0725796P108026R021987Q367791O110476M154659J801620j043524n710050
15338E0536781q750923r280992p346139m946089k814512r25161q82903j99381
15330A5390681l36875l30308q34550m63932k12662l53526j73764j52788M61320
$$ y = [6170650, 6219205, 6280503, 6461025, 6138511, 6321258, 6160840, 6074071, 6370946, 6434396, 6538221, 6526512, 6758610, 6807259, 6743830, 6662766, 6882750, 7084231, 6735242, 6930629, 6884386, 6768329, 6566962, 6856694, 7026829, 6962230, 6887239, 6872703, 7064397, 7160602, 7244531, 7337144, 7378245, 7646137, 7780524, 8064844, 8205606, 8345648, 8474249, 8673110, 8676578, 8914070, 9199468, 9543198, 9615946, 10428852, 10964059, 12720084, 15603712, 20725796, 27833822, 36855809, 45223600, 51334076, 55488735, 57290355, 56246831, 50536781, 41785858, 32504866, 25158727, 20212638, 17398126, 16472965, 15590062, 15390681, 15053806, 14723498, 13888948, 13425016, 13212354, 12858828, 12685064, 12532276, 12993596]
15321A2993596J41057O64394J28268R76706J151571K503379M223511P224058J1373883
15312D1380423J4828704J5820883J4030454J0221570N575318P32574o731175j3536965
15304H2321786j7285059j6922827j3599116r301513n738877l122375j718731j010020
15296A3623268o49435o08752J55312o349J71812r631q2065j29813k06348j38258
15286A2119741j17216o9558r7368N90329Q24153J909880L394748M955117P754399
15277C1264225Q255316P422861N157739K893491J288976k520137o769404q846813
15269C8146254q970276o765357m663695k663197j643763q84886j041627p09888
15261A0803565p03635q55246m19013k93079J30058J7097M92913J09384M25129
$$ y = [12993596, 13134653, 13799047, 13927315, 14904021, 16055592, 18558971, 22782482, 30006540, 41380423, 56209127, 72030010, 86060464, 96282034, 101857352, 102589926, 95858751, 82321786, 65036727, 48113900, 34514784, 25213271, 19474394, 16352019, 14633288, 13623268, 12973833, 12365081, 12520393, 12514044, 12685856, 12676225, 12594160, 12464347, 12257999, 12119741, 12002525, 11932967, 11835599, 12425928, 13250081, 15159961, 18554709, 23509826, 31264225, 39519541, 46942402, 52100141, 54993632, 56282608, 53762471, 46993067, 38146254, 29175978, 22410621, 17746926, 15083729, 13439966, 12555080, 11513453, 10803565, 10099930, 9244684, 8825671, 8532592, 8662650, 8679747, 9172660, 9282044, 9707173]
15252I707173M02507q9559K70246m8206k02667N7351j29244j02415n34593n90820
15242H739773R2094m32827l39495L962J19572K66073N18144O02815O05787N52049
15232A0727947N74665J45829K0000o1696k11684k90471o92668k14677o89802j16704
15222I190739k52103j59759K66809j54791K44412M16146J84326L36744O98447
15213A0770970K44140J52410J72390m28045m27804p07982l41477n80164n18239
15204H336199o40337j02674l57737m19283N3226m81841O4536l5j08797j52492
15194F190765J74622j58694L73386J11700N359M35390n7777j6088L16038j06793
15184G267908J5547j34525k19750M63217q3145M34005J17543O3139K64706J782
$$ y = [9707173, 10109680, 10020121, 10290367, 10242161, 10039494, 10096845, 9967601, 9865186, 9330593, 8739773, 8831867, 8399040, 8059545, 8063507, 8183079, 8449152, 8967296, 9570111, 10175898, 10727947, 11302612, 11448441, 11468441, 11406745, 11195061, 10904590, 10211922, 9997245, 9307443, 9190739, 8938636, 8778877, 9045686, 8890895, 9135307, 9551453, 9735779, 10072523, 10770970, 11015110, 11167520, 11339910, 10911865, 10484061, 9776079, 9434602, 8854438, 8336199, 7695862, 7593188, 7235451, 6816168, 6869394, 6387553, 6452089, 6452054, 6343257, 6190765, 6365387, 6206693, 6580079, 6691779, 6697138, 7132528, 7074751, 7058663, 7374701, 7267908, 7283455, 7148930, 6929180, 7392397, 7309252, 7743257, 7860800, 7923939, 8188645, 8190427]
15174H190427M950q9796j96259J47237m6495q7469j13454K45071j65687P0173
15164G958698l13408K02184J64202J02875L02239L43027K0820J38548O2761J02765
15154I084711M8737N4261j94366k23890j81652J24859m6482k39208J63927k39981
15144H350916j03356K85338l07611K13840k15377l0297J64231j23352k27399K99827
15134H306760l27347P6965j05180J98682k04766K7745p1574K46527K52490N6759
15124H457061m36125j96002K97499k25831j42338l1871j48705l1962K40191k12519
15114G569398L34239l43184q7090L61823R6216j5270K49106J23177m6283L28615
15104H570747R2898K43107J17157M08631J62695K06452K78725J80164K53005L37194
$$ y = [8190427, 8195377, 8105581, 7909322, 8056559, 8010064, 7922595, 7809141, 8054212, 7888525, 7958698, 7645290, 7847474, 8011676, 8114551, 8416790, 8759817, 8780637, 8919185, 8981946, 9084711, 9133448, 9187709, 8993343, 8769453, 8587801, 8712660, 8666178, 8426970, 8590897, 8350916, 8247560, 8532898, 8225287, 8439127, 8223750, 8193453, 8357684, 8234332, 8006933, 8306760, 7979413, 8056378, 7951198, 8149880, 7945114, 7972859, 7901285, 8147812, 8400302, 8457061, 8020936, 7824934, 8122433, 7896602, 7754264, 7722393, 7573688, 7541726, 7781917, 7569398, 7903637, 7560453, 7473363, 7835186, 7931402, 7916132, 8165238, 8288415, 8242132, 8570747, 8663645, 8906752, 9023909, 9432540, 9595235, 9801687, 10080412, 10260576, 10513581, 10850775]
15094A0850775N68883N92566R83031J307355K470436L369262L385406L339131
15086B6866845K109646J439279P47153p39989j770109k768793k933490k081187
15078B0869355q47098O9267J479078K557532L507561L191264K467915J793806
15070C5088680J067244q5704j703666k202892k468860p52516J217145M328702
15062C4488133N434808M880558L729368K775163K480715N81121j976338k878921
15054D9514607k405853j225991L99771J587627K514925K852837K904496K730183
15046E8872602K130895J509812J038763P64353p97287k353721k482010k129122
15038E6554285j174177j305540j490753j894427j731057r66142k9424K365161
$$ y = [10850775, 11419658, 12012224, 12995255, 14302610, 16773046, 20142308, 23527714, 26866845, 28976491, 30415770, 31162923, 30422934, 28652825, 25884032, 22950542, 20869355, 20022257, 20091524, 21570602, 24128134, 27635695, 30826959, 33294874, 35088680, 36155924, 36070220, 34366554, 32163662, 29694802, 28942286, 30159431, 34488133, 39922941, 44803499, 48532867, 51308030, 53788745, 54369866, 52393528, 49514607, 47108754, 45882763, 46282534, 47870161, 50385086, 53237923, 56142419, 58872602, 61003497, 62513309, 63552072, 64316425, 63519138, 61165417, 58683407, 56554285, 55380108, 54074568, 52583815, 50689388, 48958331, 47992189, 47962765, 50327926]
15030E0327926M833218P478141P778397P558579O506777O043540M618108J952703
15022I7097389r83989k020914k184210j505950n82844J33591K67009N98065n13386
15013I0304761q19187j990658k508184l726494n256258n798548o388622n055405
15005E8761405m516022l403447k205381k205110o93595K89917J283902K121570
14997D9433239K182528J916544J347660N52404k59820j215464k547978k907854
14989D8501259k772330j052220P2240N62234J417489J164924J494224J518202
14981E0906022J93270j753564l220680l957393l490410l419644l437466k815212
14973B9004923k212692j323019o51705j4106R3795M94462O09248O28252O94221
$$ y = [50327926, 55161144, 62639285, 70417682, 77976261, 84483038, 90526578, 95144686, 97097389, 96113400, 94092486, 91908276, 90402326, 89819482, 89953073, 90220082, 90818147, 90304761, 89485574, 87494916, 84986732, 81260238, 76003980, 70205432, 63816810, 58761405, 54245383, 50841936, 48636555, 46431445, 45737850, 46027767, 47311669, 49433239, 51615767, 53532311, 54879971, 55432375, 55172555, 53957091, 51409113, 48501259, 45728929, 44676709, 44748949, 45311183, 46728672, 47893596, 49387820, 50906022, 51099292, 49345728, 46125048, 42167655, 38677245, 35257601, 31820135, 29004923, 26792231, 25469212, 24817507, 24803401, 24897196, 25391658, 26000906, 26629158, 27323379]
14964B7323379M70025J122629R84032J353260J991686K031444M020457O082293
14956D5379205Q841598J2582287J6847111K2635294K8416206L1884887L5130007
14949B01716595L7553499L8226765L5787109L0901135K4973611J6287643K494898
14942C87941255j1612974k0840083k6532424l1669878l4830613l3354143k7875124
14935B01226016j9316119j1897895q474597q856851j1173000j1766670j2571260
14928A17169624j1377409j0295439q662188o893819l998727j273659K96753M60144
14920G5425280r31816j554982k912542n934549r466873j0501809r659159p860301
14912B6603249n232976l372697k117657j160769j212543l99745n2759J33617P44647
$$ y = [27323379, 27793404, 28916033, 29900065, 31253325, 33245011, 35276455, 39296912, 45379205, 54220803, 66803090, 83650201, 106285495, 134701701, 166586588, 201716595, 239270094, 277496859, 313283968, 344185103, 369158714, 385446357, 387941255, 376328281, 355488198, 328955774, 297285896, 262455283, 229101140, 201226016, 181909897, 170012002, 161537405, 152680554, 141507554, 129740884, 117169624, 105792215, 95496776, 86834588, 79940769, 75942042, 74668383, 74965136, 75425280, 74493464, 72938482, 70025940, 64091391, 54624518, 44122709, 34463550, 26603249, 21370273, 17997576, 15879919, 14719150, 13506607, 13106862, 13054103, 13187720, 13932367]
14903A3932367R52723R43007J428467J681118J234968J505399K682632L673017
14895B8033698N566481N723105N541039M177040K431957Q15303j573863m472634
14887D6242126p034741p363393o352032m751517k753647j745346j095076k46607
14879A4899767k16301o3817N64715Q61142R03558J361067R29714R88423L45583
14870B0573851K08389K43986q24139m95114m75801J99791r2868J142433J818780
14861B2299308K653402M612637P417426R981789J1655255J1882696J2116169J0988885
14853I3607567P039266J462338m091475q261759j0840516j3165223j3148246j1524875
14845D1077077r040450o315482l828717k893917j762391o68347r14991l32676
$$ y = [13932367, 14885090, 15828097, 17256564, 18937682, 20172650, 21678049, 24360681, 28033698, 33600179, 39323284, 44864323, 49041363, 51473320, 52288623, 50714760, 46242126, 39207385, 31843992, 25491960, 20740443, 17986796, 16241450, 15146374, 14899767, 14683466, 14619649, 15184364, 16045506, 16949064, 18310131, 19239845, 20228268, 20573851, 20782240, 21026226, 20202087, 19706973, 19231172, 19430963, 19338095, 20480528, 22299308, 24952710, 29565347, 36982773, 46964562, 58619817, 70502513, 82618682, 93607567, 100646833, 102109171, 98017696, 89755937, 78915421, 65750198, 52601952, 41077077, 32036627, 25721145, 21892428, 18998511, 17236120, 16567773, 15652782, 15320106]
14837A5320106m47955P5029n51079m6970m2912j20703K9856K69858O70606M82539
14827A5638375O55545R66328Q74207Q34482J447235K483467L612165N946579Q148047
14818D0606430R516167R497996O838934M185086J064734k973671p133665j0932599
14810E0669412j1392545r666442p244193m714652k444965j864117p66191p89452
14802A1786855l13214k34180l45958k52094k87020l36557m46082j10710n00594
14793H960446k02661k42308m85409J23180l60196k26794J3935M9909M65385K0214
14783H115701K69668K57148M82144P11054P07128J348466O40991N75422J37564
14774A3245286N8221j76663p54189j470564p06581j000644m74119l60444k46896
$$ y = [15320106, 14872151, 14947180, 14396101, 14349131, 14306219, 14185516, 14215372, 14485230, 15155836, 15638375, 16293920, 17260248, 18134455, 18968937, 20416172, 22899639, 26511804, 32458383, 40606430, 50122597, 59620593, 66459527, 70644613, 71709347, 68735676, 61602011, 50669412, 39276867, 29610425, 22366232, 17651580, 15206615, 13342498, 12576307, 11786855, 11473641, 11239461, 10893503, 10641409, 10354389, 10017832, 9571750, 9461040, 8960446, 8757785, 8515477, 8030068, 8153248, 7793052, 7566258, 7580193, 7630102, 8095487, 8115701, 8385369, 8642517, 9124661, 9835715, 10542843, 11891309, 12532300, 13107722, 13245286, 13303507, 13126844, 12372655, 10902091, 10195510, 9194866, 8720747, 8360303, 8113407]
14765H113407j47706J60846N8142K35901M25708J98674K01262J83937L80968Q3018
14755I894157K66077k1169L98245K09787l30632M21971J7480R3528K24123K04497
14745A1378064J47244L51432N10965J51918N99682R97196Q21493J462790J832579
14736A8253363K605904L174891M783020P136535J0723127J6563110K4093023L3252897
14728A20585870M0252282M2560184M0129693L2894836K0534933K864471j5824247
14721B83998022l0521570m1606737m5979659m2403189l4678939k5488362j6835930
14714D6483636j0927434p048623m628695k888534k255631j702569j509401j027361
14706A4495388j028889j096586j255368r03590q00629p76019l52626j78475l08909
$$ y = [8113407, 7965701, 8126547, 8184689, 8420590, 8846298, 9044972, 9246234, 9430171, 9811139, 9894157, 10160234, 10139065, 10537310, 10747097, 10416465, 10838436, 10855916, 10949444, 11173567, 11378064, 11525308, 11876740, 12387705, 12539623, 13139305, 14136501, 14957994, 16420784, 18253363, 20859267, 24034158, 28817178, 35953713, 46676840, 63239950, 87332973, 120585870, 160838152, 203398336, 243528029, 276422865, 296957798, 299822269, 283998022, 253476452, 211869715, 165890056, 123486867, 88807928, 63319566, 46483636, 35556202, 28507579, 23878884, 20990350, 18734719, 17032150, 15522749, 14495388, 13466499, 12369913, 11114545, 10210955, 9410326, 8634307, 8281681, 8103206, 7794297]
14697G794297o91825J85707l8082L25243J29992J66207L27652J58471m1964m2247
14687H273451r2186m38455J30965m5732N06719J39205J21271K47577J85739J49138
14677I177692R08962P26831P97663P83790J33486J54728n61204l67928j351931
14668A0402089j093657j010776m12130R5789M70460L69122M77322k2014J34059
14659I410264j67919o81474j239335p42928k66755m38148M8340j5508J03784J70742
14649F181063L62485K04991N97704M24810M01077J79986L87571q7336K1101k88826
14639H384626n76469L09895L15276M52493M30855O13778K57404J3212k88285q28763
14629I084022n93529j202760r07232o30983j011499r075O7437j92378k0853J47138
$$ y = [7794297, 7102472, 7288179, 7250097, 7575340, 7705332, 7871539, 8199191, 8357662, 8315698, 8273451, 8181265, 7742810, 7873775, 7828043, 8334762, 8473967, 8595238, 8842815, 9028554, 9177692, 10086654, 10813485, 11611148, 12394938, 12528424, 12683152, 12121948, 11754020, 10402089, 9308432, 8297656, 7885526, 7981315, 8451775, 8820897, 9298219, 9276205, 9410264, 9242345, 8560871, 7321536, 6578608, 6311853, 5873705, 5922045, 5906537, 6010321, 6181063, 6543548, 6748539, 7346243, 7771053, 8172130, 8352116, 8739687, 8652351, 8673452, 8384626, 7808157, 8118052, 8433328, 8885821, 9316676, 9930454, 10187858, 10201070, 9912785, 9084022, 8490493, 7287733, 6380501, 5749518, 4738019, 4728944, 4796381, 4604003, 4583150, 4730288]
14619D730288Q256k25370L9084r0382n4020J07209m43522J19645l3250j47378
14609D010560j86019j00619k05599L0599j31316k2796O1132J39921M79644K96095
14599D371602Q94537Q46651N78059Q57400K46474p992n1931o46211l70425j219182
14589E498982n96727p31804k78461j60881j38037k7088J34313J80358K5676J93609
14579D099940r6717K15909l7829J13305n6967J5875J88694L34783J5534O6551
14569D859078M55408P79208N52223J248225J027536R55157J026947J851502K669346
14560A5424630M506683O735460R167879R158839P183179M700830K579686l28993
14552E9128193n713616r393780j0477606q397554n714508k665801O94055L077239
$$ y = [4730288, 4738544, 4513174, 4552258, 4461876, 4407856, 4515065, 4071543, 4191188, 4157938, 4010560, 3824541, 3723922, 3518323, 3548922, 3417606, 3394810, 3455942, 3595863, 4075507, 4371602, 5266139, 6112790, 6690849, 7548249, 7794723, 7786731, 7734800, 7088589, 6718164, 5498982, 4902255, 4170451, 3891990, 3731109, 3593072, 3565984, 3700297, 3880655, 3906331, 4099940, 4003223, 4219132, 4181303, 4294608, 4237641, 4253516, 4442210, 4776993, 4792527, 4859078, 5314486, 6093694, 6645917, 7894142, 8921678, 9876835, 10903782, 12755284, 15424630, 19931313, 26666773, 35834652, 44993491, 52176670, 56877500, 59457186, 59128193, 53414577, 44020797, 33543191, 25145637, 19431129, 16765328, 17459383, 20536622]
14544B0536622N971087R146101J0586528Q979332O819190L449895R50240l596996
14536F2841999q682273j1339059j1213685q574118n651252k942349j201754j60261
14528A3077248P602N78477K37736j76848k55810K00215P8247J575461L661627
14519A8983955O100189P226056O495839N251991K959302J307778j210094m909399
14511D2205617p426529o870834m842311k564404o84959J325929L389006M903329
14503B9434844O208553O272660M911322K481561J266796n46085m080453p417814
14495C8531384p566107o661567m433440l037993j797582j067267j272813j065772
14487A1628843j261214j553860j589767j353746o70679n93719k14237k49446P1910
$$ y = [20536622, 26507709, 35653810, 46240338, 55219670, 62038860, 65488755, 66438995, 62841999, 54159726, 42820667, 31606982, 23032864, 17381612, 14439263, 13237509, 13077248, 13084850, 13663327, 13901063, 13724215, 13468405, 13668620, 13746867, 15322328, 18983955, 25084144, 32310200, 38806039, 44058030, 47017332, 48325110, 47115016, 42205617, 34779088, 27908254, 23065943, 20501539, 19816580, 21142509, 24531515, 29434844, 35643397, 41916057, 46827379, 49308940, 50575736, 50029651, 45949198, 38531384, 30965277, 24303710, 19870270, 16832277, 15034695, 13967428, 12694615, 11628843, 10367629, 8813769, 7224002, 5870256, 5199577, 4605858, 4391621, 4142175, 4214085]
14478D214085j75790J37314k85330J99824j61396J42826L73022L68121P58553
14469E571229K90335N19070L13053J44768K13988k54842l77339n95983k32371
14460E591908M17633O18399M67622N83372L52784O40691k57116m00804o07746
14451G406743q75519l56158l88093N4598j827M14725M47728J72130M77229L07672
14441G659228K79609J06158l6649n91L23456K5090L22041L23023K93598Q02941
14431A0097904J360446K444607L844432M959443O885303P190498O477059N542616
14423D8802308L373291O61716j860577n131884o935657p181756o602517n079774
14415B0045150l537316k498002k015626j685606q08439n80954m48163m56495J01738
$$ y = [4214085, 4038295, 4175609, 3890279, 4090103, 3928707, 4071533, 4444555, 4812676, 5571229, 5861564, 6380634, 6693687, 6838455, 7052443, 6797601, 6420262, 5824279, 5591908, 6009541, 6627940, 7095562, 7678934, 8031718, 8672409, 8415293, 8014489, 7406743, 6531224, 6175066, 5786973, 5841571, 5839744, 6254469, 6702197, 6874327, 7351556, 7659228, 7938837, 8044995, 8008346, 8007755, 8331211, 8356301, 8678342, 9001365, 9294963, 10097904, 11458350, 13902957, 17747389, 22706832, 29592135, 36782633, 43259692, 48802308, 52175599, 52837315, 50976738, 45844854, 38909197, 31727441, 25124924, 20045150, 16507834, 14009832, 11994206, 10308600, 9500161, 8919207, 8471044, 8014549, 8116287]
14406H116287Q2202J38339m042j92075N5830N1608K29256L31449K91666J085085
14396A0185605J017690J928679L480413N102045P349230J0118943J1761239J2392136
14388F3335980J0242876P820038M274683l67314n737648r948139j2422373j2366549
14380D4831554j1125621q132947n924417m393767k268061j783567j290414m56033
14372I456727m51672l52337m65976p5664J1827l25535P6733J14149r625M20719
14362H399346P8204K73544O06667J159177J482201J989956K807502L795752M521245
14353B5113594N542950N408842N027609L511133K602353O60365j010064k155079
14345D4701703k050160j628755K54334L022233N785204P741980R263694R579081
$$ y = [8116287, 8198489, 8336828, 8332786, 8140711, 8196541, 8248149, 8477405, 8808854, 9100520, 10185605, 11203295, 13131974, 16612387, 21714432, 29063662, 39182605, 50943844, 63335980, 73578856, 81398894, 85673577, 85306263, 79568615, 69620476, 57198103, 44831554, 33705933, 25572986, 19648569, 15254802, 12986741, 11203174, 9912760, 9456727, 9005055, 8652718, 8186742, 8111078, 8122905, 7797370, 7874103, 7988252, 7978627, 8399346, 8477550, 8751094, 9357761, 10516938, 11999139, 13989095, 16796597, 20592349, 25113594, 30656544, 36065386, 41092995, 44604128, 47206481, 47866846, 46856782, 44701703, 42651543, 41022788, 41277122, 44299355, 50084559, 57826539, 67090233, 76669314]
14337G6669314R012877P067045M768073Q43901m459689p966995r884818j1281990
14329F4767718j2067666j1099501r219758o848574m938427l780564k456413j934308
14321A2422507j550104j333816j076600r25796n22386p75588m03034k87505m66444
14312E081234j02373j65280k27744l68490p7946k03251j37439k33851l08693J17738
14302C373905k28537J11437j65692L8632O2727k95008K7802j27311M4198o9624
14292B772529o332j52426J3059k11328N1912L2804O1165M2118M3275J67322m1744
14281B772354R8371j44858N0394J9867p6795K6548L07142L7911J31296j49137
14271C073093L499j06374n406o6143k21703N1293l4069k13821J05958k06208J30944
$$ y = [76669314, 85682191, 92749236, 97517309, 98361210, 93901521, 85934526, 76049708, 64767718, 52700052, 41600551, 32380793, 25532219, 20593792, 16813228, 14356815, 12422507, 10872403, 9538587, 8461987, 7536191, 7013805, 6238217, 5835183, 5547678, 5081234, 4978861, 4813581, 4585837, 4217347, 4139401, 3936150, 3798711, 3564860, 3256167, 3373905, 3145368, 3256805, 3091113, 3129745, 3192472, 2897464, 2925266, 2797955, 2842153, 2772529, 2766197, 2613771, 2626830, 2415502, 2467414, 2500218, 2561383, 2603501, 2646776, 2814098, 2772354, 2870725, 2725867, 2776261, 2796128, 2719333, 2745881, 3053023, 3090934, 3222230, 3073093, 3076592, 2970218, 2964812, 2898669, 2676966, 2728259, 2694190, 2480369, 2586327, 2380119, 2511063]
14260B511063m81469J08742L96399n30598K53776k07108j69946L51751k81549
14251A951061K5631K62286j04850n5850M1739J23672k47770q3524J61311k31900
14241A841806j23008M49102M8088l37293K71957J49255j7969j45151L07228m50518
14231A993497J03216O2034q7329Q0280l42715P8647k2131J7244L9940m9779P1025
14220A943929J14370J03733j16870K67545j8859J54089L44090k62034K69919l05510
14210B494402M13955m1262M48551O79584M75404K60034j51263N92468j56420p26581
14200D288872o87788j003764m90833Q7138l60981J82960j69215J11527O3407R0459
14190B111782k9842j2565K8541K17693l23245j52442J74524k65072J83730L985
$$ y = [2511063, 2029594, 2138336, 2534735, 2004137, 2257913, 2050805, 1880859, 2232610, 1951061, 1976692, 2238978, 2134128, 2078278, 2120017, 2243689, 1995919, 1912395, 2073706, 1841806, 1718798, 2167900, 2215988, 1878695, 2150652, 2299907, 2281938, 2136787, 2444015, 1993497, 2096713, 2158747, 2071418, 2151698, 1808983, 1887630, 1865499, 1882743, 1922683, 1872904, 1943929, 2058299, 2162032, 2045162, 2312707, 2293848, 2447937, 2792027, 2529993, 2799912, 2494402, 2908357, 2867095, 3315646, 3995230, 4470634, 4730668, 4579405, 5171873, 5015453, 4288872, 3601084, 2597320, 2106487, 2193625, 1832644, 2015604, 1846389, 1957916, 2021323, 2111782, 2081940, 2069375, 2097916, 2315609, 1992364, 1839922, 2014446, 1749374, 1933104, 1937089]
14180A937089K95615N93819k34145J17011L11902O3604J60329J396l96679m05719
14170B444222K23990l18671k08011J6488j81829r5166j67334J37053K29369k04038
14160A876073j29911K25876J71338r046M0276K06270k8507J53076k22855J51305
14150B433895j51397j42303L00495n311Q956K13495K79318M11927L62555R26827
14140D638457J147064R85545J213355J187601Q19202R7035L90389o45277j146456
14131H686915j166120j203563j014054q44847o39398j32156p01499O7003j06294
14122B945987O8141L5386K47151L30679K90730L6529K88776J38234l69806m29779
14112C582028m4149n95803J18252j89204j61006M6391m2105M9744j19341j2576
$$ y = [1937089, 2232704, 2826523, 2592378, 2709389, 3021291, 3084895, 3245224, 3246620, 2849941, 2444222, 2668212, 2349541, 2141530, 2158018, 1976189, 1881023, 1713689, 1850742, 2080111, 1876073, 1746162, 1972038, 2143376, 2134330, 2174606, 2380876, 2352369, 2505445, 2282590, 2433895, 2282498, 2140195, 2440690, 2435379, 2444335, 2657830, 2937148, 3349075, 3711630, 4638457, 5785521, 6771066, 7984421, 9172022, 9991224, 10088259, 10478648, 9833371, 8686915, 7520795, 6317232, 5303178, 4458331, 3818933, 3686777, 2985278, 3052281, 2945987, 3014128, 3049514, 3296665, 3627344, 3918074, 3954603, 4243379, 4381613, 4011807, 3582028, 3537879, 2942076, 3060328, 2871124, 2710118, 2756509, 2714404, 2764148, 2644807, 2632231]
14102B632231o049K08770K80420N00539M00895P46751N98377K8125N48785p9961
14092E858883R6473j20479o98508j64839j06830O15R821K61136P73833M80586
14082F390691M98195N60197N55084O57607n5368K95380p3555N4340N83119N68899
14072A0034589J081985J403084J799602K148497K862935M016070N387559O520941
14064C5255262Q715494R629050J0951230J0281541Q363151N713734K237650j811262
14056H9335850o330025r518609j1098366j1227942j0245417q248916o356863m621647
14048B1688065l505677k618397j834766j391330p80976j063807n23916r45493
14040I023703r46368j86435j173010m80917n32408o02779k02467l43467k35192
$$ y = [2632231, 2626182, 2834952, 3115372, 3615911, 4016806, 4763557, 5361934, 5390059, 5938844, 5858883, 5955356, 5834877, 5136369, 4971530, 4864700, 4865315, 4875136, 5136272, 5910105, 6390691, 6888886, 7449083, 8004167, 8661774, 8606406, 8901786, 8828231, 8882571, 9465690, 10034589, 11116574, 12519658, 14319260, 16467757, 19330692, 23346762, 28734321, 35255262, 43970756, 53599806, 64551036, 74832577, 83195728, 88909462, 91147112, 89335850, 83005825, 73487216, 62388850, 51160908, 40915491, 32666575, 26309712, 21688065, 18182388, 15563991, 13729225, 12337895, 11556919, 10493112, 9969196, 9023703, 8077335, 7890900, 6717890, 6236973, 5704565, 5101786, 4899319, 4555852, 4320660]
14031D320660j81581k64616j29529j60968j11738J23703k39783j87953N9943l14346
14021B913792K04743j02000m95797L42232j34592J504k04979j02712m8053J6106
14011B390244M11390m93234r713K72164j45788j6760j12509m4410l02560Q8638
14001B037462K21037k64557J90291K15376k14103K53111L52372k61489M2265J21490
13991B693255J78522N56777J02110O71674P36158J129323J345799J342395J370152
13982A0126165R43891K87601L40637l33207j182495j085566j414603j420303r08089
13973E354031q66878p14297m5396l76533k12982r6961j45242K61625k1621l6018
13963C099728m48756J25882j83118j43064p9016j87881J02326j011k39600K02554
$$ y = [4320660, 4139079, 3874463, 3744934, 3583966, 3472228, 3595931, 3356148, 3168195, 3228138, 2913792, 3118535, 3016535, 2520738, 2862970, 2728378, 2729882, 2524903, 2422191, 2374138, 2390244, 2801634, 2308400, 2298687, 2570851, 2425063, 2408303, 2295794, 2251384, 1948824, 2037462, 2258499, 1993942, 2184233, 2399609, 2185506, 2438617, 2790989, 2529500, 2571765, 2693255, 2871777, 3428554, 3530664, 4202338, 4938496, 6067819, 7413618, 8756013, 10126165, 11070056, 11357657, 11698294, 11365087, 10182592, 9097026, 7682423, 6262120, 5354031, 4487153, 3772856, 3727460, 3350927, 3137945, 3040984, 2895742, 3157367, 3135746, 3099728, 2650972, 2776854, 2593736, 2450672, 2371656, 2183775, 2286101, 2285090, 2045490, 2248044]
13953B248044k35522J01499M6186K79985M60380j55357L05681J86350M28083k33217
13943C432112N73869K99674J150200J675584K266478L022587K524214K770559
13935A7715277K340815J124343l89138j114909k482828k590170l058975k709361
13927H835054k409145j546890q29404q86492l95727l39389j76205m52806k3198
13918A775798j2847j2685j54741P9502O9843J0704j62762r3537p5302J27371P6892
13907A628236j6560m30394K87344L3349p0430k26766K71211K00413j96794k9115
13897A450494l6240K37227l1521J10119k08094k86833J98975J77908j99966J63708
13887A575777J7301k22493n4587R6558J64618n6032K4261k70477L97991o6840
$$ y = [2248044, 2012522, 2114021, 2160207, 2440192, 2900572, 2745215, 3050896, 3237246, 3665329, 3432112, 4005981, 4305655, 5455855, 7131439, 9397917, 12420504, 14944718, 17715277, 20056092, 21180435, 20791297, 19676388, 17193560, 14603390, 11544415, 8835054, 6425909, 4879019, 4049615, 3163123, 2767396, 2428007, 2251802, 1798996, 1775798, 1762951, 1750266, 1595525, 1675027, 1744870, 1755574, 1592812, 1499275, 1423973, 1551344, 1628236, 1611676, 1181282, 1468626, 1501975, 1431545, 1204779, 1475990, 1676403, 1479609, 1450494, 1414254, 1651481, 1619960, 1730079, 1521985, 1235152, 1434127, 1612035, 1412069, 1575777, 1593078, 1370585, 1315998, 1412556, 1577174, 1521142, 1545403, 1274926, 1672917, 1606077]
13877A606077l61497J96341O1157J35052k00676M1723L7516J7782L0574P4831
13867A638880L8829j35020L5897N484J00880J71081K85037n43018K11935k74929
13857A535056K48005L6791k75211J39952L2045j45479J8099R7828J30365k60362
13847A557089K92843k28465N6513p5866Q0949J0554n4549p0635k67051m3654J51412
13836A409140P8195j62316J52640o2418r0566N319J09073n2788O8986J0547n6984
13825A408828o4038n1539J25250j16567K8701j30209q4113M70759l14528j24089
13815A148455q143O8265N4783p8027O5226j25114q197P1631J41726j4069j40163
13804A176373K53407k25684J40466P8810J88218j94873N3274l1760n7456Q1609
$$ y = [1606077, 1244580, 1440921, 1502078, 1637130, 1436454, 1478177, 1515693, 1533475, 1564049, 1638880, 1677709, 1542689, 1578586, 1584070, 1684950, 1856031, 2141068, 1598050, 1809985, 1535056, 1783061, 1819852, 1544641, 1684593, 1716638, 1571159, 1589258, 1687086, 1817451, 1557089, 1849932, 1621467, 1677980, 1602114, 1683063, 1693617, 1639068, 1568433, 1301382, 1257728, 1409140, 1487335, 1325019, 1477659, 1415241, 1324675, 1329994, 1439067, 1386279, 1455265, 1465812, 1408828, 1344790, 1293251, 1418501, 1301934, 1330635, 1200426, 1116313, 1587072, 1272544, 1148455, 1140312, 1208577, 1263360, 1185333, 1250559, 1125445, 1117248, 1188879, 1330605, 1316536, 1176373, 1429780, 1204096, 1344562, 1423372, 1611590, 1416717, 1469991, 1438231, 1380775, 1462384]
13794A462384j22003J12357J22142j87807r3327L1494J7690m9179K2394J01888
13784A418033k30250j99041K18093o7705K08469l7804J27535j64908J71317J18736
13774A562475K7290r3429r1680M32155j48476k906L5603J81632k88307J1705k15513
13763A410549R6753j37007J30224j61450l9408J13200p6601j252R9523j43439
13753A291092O7016K317R4649j19386o5280J8370J39035l0681K82555l21244J59035
13742A517478k81799M08243j27826J94580N217q9832k9269J08078m7543J35667
13732A792994n3712k17463J06139l0640n1806K00576p8255n0829K23621j56708
13722A683917l8610J94069j68873K30434r705J00665O544J30793k94930J74057
$$ y = [1462384, 1340381, 1452738, 1574880, 1387073, 1293746, 1325240, 1342930, 1293751, 1316145, 1418033, 1187783, 988742, 1206835, 1139130, 1347599, 1309795, 1437330, 1272422, 1443739, 1562475, 1589765, 1496336, 1404656, 1836811, 1688335, 1685429, 1721032, 1902664, 1614357, 1626062, 1410549, 1507302, 1370295, 1500519, 1339069, 1299661, 1412861, 1336260, 1335008, 1434531, 1291092, 1358108, 1360425, 1455074, 1335688, 1270408, 1288778, 1427813, 1397132, 1679687, 1358443, 1517478, 1235679, 1643922, 1516096, 1710676, 1715893, 1626061, 1596792, 1704870, 1657327, 1792994, 1739282, 1521819, 1627958, 1597318, 1545512, 1746088, 1667833, 1617004, 1840625, 1683917, 1645307, 1839376, 1670503, 1900937, 1891232, 1991897, 1998441, 2129234, 1834304, 2008361]
13712B008361p2801K46463J67457k8191j15242r9871O0362K3718l74788J4554
13702A830022K14329j58326k7500P5701J88025m9666n0137L90587J98826p1237
13692B540624l3912K58412n914P1602k3096m11853j70774n5709j31672O8702j31530
13681A974880j83712J26071O4552J51433j67052O2508j64675K91943l77108J99095
13671A977935p9224O9990J2562J01355J38683M7943K83075J482L60360K0953j65973
13660B769141N0821J85772k46022R2062l27384k84692K20993k18588j19477j90661
13650A931965r8866k7086R0975m6956J29866j59927J21662j00985k18268N19980
13640B142360k4033n8581j4941O0649K11893m283L49758J7515M56791l37266N3260
$$ y = [2008361, 1935560, 2182023, 2349480, 2321289, 2206047, 2106176, 2166538, 2190256, 1815468, 1830022, 2044351, 1886025, 1858525, 1934226, 2122251, 2072585, 2022448, 2413035, 2611861, 2540624, 2506712, 2765124, 2759210, 2830812, 2807716, 2395863, 2225089, 2169380, 2037708, 2106410, 1974880, 1791168, 1917239, 1981791, 2133224, 1966172, 2028680, 1864005, 2155948, 1778840, 1977935, 1898711, 1968701, 1981263, 2082618, 2221301, 2269244, 2552319, 2553801, 2914161, 2935114, 2769141, 2819962, 3005734, 2759712, 2851774, 2524390, 2239698, 2460691, 2242103, 2122626, 1931965, 1833099, 1806013, 1896988, 1850032, 1979898, 1819971, 1941633, 1840648, 1622380, 2142360, 2118327, 2059746, 2044805, 2105454, 2317347, 2313064, 2662822, 2680337, 3137128, 2799862, 2853122]
13629B853122j87961j60879j56516M2719l61096j81648j47931J07158L6637j25865
13619A717740l57j14856K88752j24597J22937p5298J61465p4248P3242K1366J93609
13608B189755J23092O3912r301n2808k51929P1122J9599k35484K4370N6143M597
13597B003068l2384r0795p2602K87195J08701j22437P4253k5366q7582J70747
13587B212798K7842k32290p2887j44132r3490R1193j00864n7672L17215j36188
13577A811525j53861J17286j97895J90701k54402k94256L71165j12498K13902
13568A691667k9787o7784K327K14479j93097j4910J17043P218j30089n4113N5219
13557A598173K1735k01675P2697M2662m6540j8471R6912k9740k0758j09099J20457
$$ y = [2853122, 2665161, 2504282, 2347766, 2390485, 2029389, 1847741, 1699810, 1806968, 1843605, 1717740, 1717383, 1602527, 1891279, 1766682, 1889619, 1814321, 1975786, 1901538, 1974780, 1996146, 2189755, 2312847, 2376759, 2367458, 2314650, 2062721, 2133843, 2153442, 1917958, 1942328, 1998471, 2003068, 1970684, 1879889, 1807287, 2094482, 2203183, 2080746, 2154999, 2129633, 2042051, 2212798, 2240640, 2008350, 1935463, 1791331, 1697841, 1789034, 1688170, 1630498, 1947713, 1811525, 1657664, 1774950, 1577055, 1767756, 1513354, 1219098, 1590263, 1477765, 1691667, 1661880, 1594096, 1596423, 1810902, 1617805, 1602895, 1719938, 1727156, 1597067, 1542954, 1598173, 1619908, 1418233, 1490930, 1533592, 1487052, 1468581, 1565493, 1535753, 1514995, 1405896, 1526353]
13546A526353m2269L01617M09507L6822P3450N00913k02727M1398k08696L2211
13536B468579k59588j10767j9734k98386k25008J97822J09014j31870K68656M0336
13526B039054M1107K45692l46j4058J94244m9165Q3062n39090n0209k02237K041
13515A750095l48267J32358J09874k18916M4873K53566k42934N3587j60918R0047
13505A463365n6131R8579L1722j70047K7469L0304j77794J82729j31219j44873
13495A154104J13148j4828N3351j07117L11097j43219j99167P9229K33488L8586
13485A518672J12135p2446k73799J59117P4246l03176j2103L11407j96999Q3472
13475A400526J04691k1307j59088j48172L42823m5480j99602J22873k09718Q9133
$$ y = [1526353, 1484084, 1785701, 2195208, 2232030, 2305480, 2806393, 2603666, 2645064, 2436368, 2468579, 2208991, 2098224, 2078490, 1780104, 1555096, 1752918, 1861932, 1730062, 1998718, 2039054, 2080161, 2325853, 2325507, 2311449, 2505693, 2456528, 2539590, 2000500, 1950291, 1748054, 1750095, 1401828, 1534186, 1644060, 1425144, 1470017, 1723583, 1480649, 1534236, 1373318, 1463365, 1407234, 1505813, 1537535, 1367488, 1394957, 1425261, 1247467, 1430196, 1298977, 1154104, 1267252, 1252424, 1305775, 1198658, 1509755, 1366536, 1167369, 1246598, 1480086, 1518672, 1630807, 1558361, 1284562, 1443679, 1517925, 1214749, 1202646, 1514053, 1317054, 1400526, 1505217, 1483910, 1324822, 1176650, 1519473, 1473993, 1274391, 1397264, 1187546, 1276679]
13465A276679K41650P759j1546j57817K32239n7635j89504L70639l36911L57724
13455A733277k3101J67476J05202L2101K81286J52410k9296K04472k7549o8644
13445B527634k84227J29879m75320k45179R0161j85473J01168J03439n1382q1797
13435A628903j83607L2446j51436N6475K60733m4136K15105k52927P7624J29525
13425A768705L9311J5863L59755K85764o2920Q2077J04690r79J32044k73008M4412
13414B495714l02522j78799k02920k2895K47612k98398K2323N2346n4225l8014
13404A720222K7125N2531J8763j14933k468j98086L64380m9191P7855j09524J67122
13393A953796k55056L76829J11259n3906K87434j7318l0437n754J95786p2440
$$ y = [1276679, 1518329, 1526088, 1514542, 1356725, 1588964, 1531329, 1341825, 1712464, 1375553, 1733277, 1710176, 1877652, 1982854, 2014955, 2296241, 2448651, 2419355, 2623827, 2596278, 2527634, 2243407, 2373286, 1897966, 1652787, 1742948, 1557475, 1658643, 1762082, 1710700, 1628903, 1445296, 1477742, 1326306, 1382781, 1643514, 1599378, 1814483, 1561556, 1639180, 1768705, 1808016, 1823879, 2183634, 2469398, 2406478, 2488555, 2593245, 2592266, 2724310, 2451302, 2495714, 2193192, 2014393, 1811473, 1788578, 2036190, 1737792, 1760115, 1812461, 1758236, 1720222, 1747347, 1799878, 1818641, 1703708, 1701240, 1503154, 1867534, 1818343, 1896198, 1786674, 1953796, 1698740, 2075569, 2186828, 2132922, 2420356, 2403038, 2372601, 2366847, 2562633, 2490193]
13383B490193J53885J05950N2320K865k04376q5087k90969m9377j25643J14664
13373B164425q9246K5923j2980M0308L18888q7914J09738n8239j90874K3716L97834
13362B641579l80880P93J4592K221j23267k60Q9327j27666N03050j01624n052
13351B512813J82623j36177J85922m60693K94298j95492J77823j8765m38200K47772
13341B351924j00949K10825m29704M12530q9908R3191N7819L3197k92822J91710
13331B437813j02359J47192l2142p0877j4691N2690l9397J94977K23291k45659
13321B550838J17538j61023L82375j04857j66448L92413k0541j03926L52034J51231
13311C389634N1429j17742o6059O2052j86153M10247k06424j86190m982q0687
$$ y = [2490193, 2644078, 2750028, 2802348, 2805213, 2600837, 2515750, 2224781, 2175404, 2049761, 2164425, 2075179, 2101102, 2088122, 2128430, 2447318, 2359404, 2469142, 2410903, 2220029, 2243745, 2641579, 2260699, 2261492, 2276084, 2278305, 2155038, 2154778, 2244105, 2116439, 2619489, 2517865, 2512813, 2695436, 2559259, 2745181, 2284488, 2578786, 2383294, 2561117, 2542352, 2104152, 2351924, 2250975, 2461800, 2032096, 2444626, 2354718, 2447909, 2505728, 2538925, 2246103, 2437813, 2335454, 2482646, 2450504, 2379627, 2364936, 2417626, 2378229, 2573206, 2796497, 2550838, 2668376, 2507353, 2889728, 2784871, 2618423, 3010836, 2990295, 2886369, 3238403, 3389634, 3441063, 3323321, 3257262, 3319314, 3133161, 3543408, 3336984, 3150794, 3145812, 3065125]
13301C065125K77855k0231N0676L27947j62750L27114N4269O1252K2997p1558
13291C932696j68154n6813J70270j18391q599j48479K74997J10698l09434J39540
13281C818331J10290l1195J02954m7653J59786J04675J66737n4116m6558K92769
13271D576020J1745k9495j80977J78213j0393J88559J24882o6646K69115k8616
13261E032407J58884K33708l4056J84806L6121L42482k1850L1305K92071K30409
13251F486287N39286R2912J21359L19232L75578l0041L49221J29816J31816J34696
13241H650162K04055j31569L4410l0988J67840K81806o1869m3641k5765K42304
13231I286745N32185j490K11695L64106L79161M57325K01550M33749L61757L17664
$$ y = [3065125, 3342980, 3322749, 3373425, 3701372, 3538622, 3865736, 3920005, 3981257, 4004254, 3932696, 3764542, 3707729, 3877999, 3759608, 3751009, 3602530, 3877527, 3988225, 3678791, 3818331, 3928621, 3897426, 4000380, 3952727, 4112513, 4217188, 4383925, 4329809, 4283251, 4576020, 4587765, 4558270, 4377293, 4555506, 4545113, 4733672, 4858554, 4791908, 5061023, 5032407, 5191291, 5424999, 5390943, 5575749, 5611870, 5954352, 5932502, 5963807, 6255878, 6486287, 7025573, 7118485, 7239844, 7559076, 7934654, 7904613, 8253834, 8383650, 8515466, 8650162, 8854217, 8722648, 8757058, 8726070, 8893910, 9175716, 9113847, 9070206, 9044441, 9286745, 9818930, 9817440, 10029135, 10393241, 10772402, 11229727, 11431277, 11865026, 12226783, 12544447]
13221A2544447K82443K82013k1342Q9657P696r7800J477l14890q5690l66742j16628
13210A2204641l26756l90023m4282l89943m29389j38547J60789l17353J454l10169
13200A0020422O2533J92937j5421j91263k0075m1991o8000m4192m19484l16699
13190I158767J4235n33480p7910l25679k61073k65693r9782l26872k46231k67816
13180F768466j53732l92733R3294l29327k19275J29654l67675Q179N3416m29901
13170E160366J75652j83775j72979L32635j94297K54059m6821Q3126M45114n0797
13160E802283K49642K14793R5660K76636J88471r1042r7528o6910K88596k16982
13150F643619l51996j43085J21540j31085o4368K93850p6669M5925k42081k57493
$$ y = [12544447, 12826890, 13108903, 13087561, 13177218, 13184914, 13087114, 13088591, 12773701, 12688011, 12321269, 12204641, 11877885, 11487862, 11443580, 11053637, 10624248, 10485701, 10646490, 10329137, 10330591, 10020422, 10082955, 10275892, 10260471, 10069208, 10049133, 10007142, 9939142, 9894950, 9475466, 9158767, 9173002, 8639522, 8561612, 8235933, 7974860, 7709167, 7609385, 7282513, 7036282, 6768466, 6614734, 6222001, 6315295, 5985968, 5766693, 5896347, 5528672, 5536851, 5590267, 5160366, 5336018, 5152243, 4979264, 5311899, 5117602, 5371661, 5324840, 5407966, 5853080, 5802283, 6051925, 6266718, 6362378, 6639014, 6827485, 6736443, 6638915, 6572005, 6860601, 6643619, 6291623, 6148538, 6270078, 6138993, 6074625, 6368475, 6291806, 6337731, 6095650, 5838157]
13140E838157k61961k10785l96728m3259j90835k58010l5568m78944P5605j41999
13130C895673k466l60786L13774N0211R9569J16167j91313N0289J787r1692k13980
13119C667233L2846j92721r2641k29354J96214R6341j55870j43420J13436P6393
13109C368457j79074L11171j30250J14421J30655n6846K82626o7054J69993K58420
13099D202519M62327K53392L62773K94670L53047K62899J07433L23004l01363
13090F320701P4663R6739j86361m9560j76099K72100k5684J24885k80631r0772
13080F079981j48038N6317m00340m58645k04430m91691m3560l63118L2485j17919
13070C941042k70231q0987o1888R3757k47465L8544j9757N3698j5833L6360j29672
$$ y = [5838157, 5576196, 5365411, 4968683, 4925424, 4734589, 4476579, 4441011, 3962067, 4037672, 3895673, 3893207, 3532421, 3846195, 3896406, 3995975, 4112142, 3920829, 3971118, 3972905, 3881213, 3667233, 3700079, 3507358, 3414717, 3185363, 3381577, 3477918, 3322048, 3178628, 3292064, 3368457, 3189383, 3500554, 3370304, 3484725, 3615380, 3558534, 3841160, 3774106, 3944099, 4202519, 4664846, 4918238, 5281011, 5575681, 5928728, 6191627, 6299060, 6622064, 6320701, 6395364, 6492103, 6305742, 6256182, 6080083, 6352183, 6326499, 6451384, 6170753, 6079981, 5931943, 5988260, 5587920, 5129275, 4924845, 4433154, 4389594, 4026476, 4058961, 3941042, 3670811, 3589824, 3527936, 3621693, 3374228, 3412772, 3393015, 3446713, 3430880, 3467240, 3337568]
13059C337568K13278n7910K02469L43354l26740J73375k07921J66308j04129J96824
13049C936476l51401m3348J20490J50285n0943r9306R6099k0421J00242J207L17041
13038D156421j60979o3760J58550L9216n3296O2090N2147K29700r8950J66373
13028D487512j40248K15253p661P6460O5845n6884k03307Q9302K7747J02966K1255
13017D678240K43936n2656J70065k33225J93753J4690J31509j84861K89589j94800
13007E056240K85198r5097N0615j02492N0409O9071j73964K95569J24206k52057
12997E307698J46966K35622P302j0498J52899N2563M939J83147o1568J95590m17928
12986E796732L5779l5185k28647O6710K10456Q4424j23458J53421n3165j97517
$$ y = [3337568, 3550846, 3492936, 3695405, 4038759, 3712019, 3885394, 3677473, 3843781, 3739652, 3936476, 3585075, 3541727, 3662217, 3812502, 3761559, 3662253, 3758352, 3737931, 3838173, 3839380, 4156421, 3995442, 3931682, 4090232, 4129448, 4076152, 4138242, 4190389, 4420089, 4321139, 4487512, 4347264, 4562517, 4554856, 4631316, 4697161, 4640277, 4436970, 4526272, 4554019, 4656985, 4678240, 4922176, 4869520, 5039585, 4806360, 5000113, 5014803, 5146312, 4961451, 5251040, 5056240, 5341438, 5246341, 5296956, 5194464, 5244873, 5313944, 5139980, 5435549, 5559755, 5307698, 5454664, 5690286, 5697588, 5687090, 5839989, 5892552, 5897491, 6080638, 6019070, 6214660, 5796732, 5832511, 5797326, 5568679, 5635389, 5845845, 5930269, 5806811, 5960232, 5907067, 5709550]
12976E709550O3891n564j49042j49519J75770o1856k86826O9942k02029j19721
12966E044596K78945j11637R0911j41174K5897j1476k8451j34037K54571q7008
12956E181137o6129K03413j1764o3144n2692p7138J89232j40504J05452J75787
12946E443650j18211q3640k40758J94460j0428J05224J43514k75406o9358J89787
12936E278834J7806l5069j35019M42616k02262O1606j35542K86313l34521K32885
12926E477647l67024j48097p1628J12190k01549j02325L55341k23786o6311J78549
12916D943007O302l73882J49042k62159l80576L7112j99469o5037P8741q4570
12906C848511N0558J95273l49040o8289J20746l24398J64642k36424J68610n3105
$$ y = [5709550, 5773441, 5767877, 5618835, 5469316, 5645086, 5583230, 5296404, 5366346, 5164317, 5044596, 5323541, 5211904, 5302815, 5161641, 5187538, 5176062, 5147611, 5013574, 5268145, 5181137, 5115008, 5318421, 5306657, 5243513, 5190821, 5113683, 5302915, 5162411, 5267863, 5443650, 5325439, 5241799, 5001041, 5195501, 5185073, 5290297, 5433811, 5158405, 5089047, 5278834, 5296640, 5261571, 5126552, 5569168, 5366906, 5428512, 5292970, 5579283, 5244762, 5477647, 5110623, 4962526, 4890898, 5003088, 4801539, 4699214, 5054555, 4830769, 4764458, 4943007, 4949309, 4575427, 4724469, 4462310, 4081734, 4118846, 3919377, 3854340, 3933081, 3848511, 3899069, 4094342, 3745302, 3677013, 3797759, 3473361, 3638003, 3401579, 3570189, 3517084]
12896C517084j2700l55349K62805m9235p2409J06877k17211J14386j5490Q6487
12886C365245K05079r6460l58624L15196j07832p2557J57570j79239k39960L82151
12876C370569k7501k52344J69621k62268J2240R0998j34752j8234N8203k16540
12866B789992K20832O8186j86506q8552J80668k17438j2341O2269J90655n5787
12856B951978K33657r2725j2249Q094J155j41819q3009l6030K05889j90219k2259
12845B822463l739J24377j20084O1019J75872m93388J55128K3026J4879J77961
12835B937514O3015m5075j73019k226J37392k5189l2199Q6879j72949j42409J46913
12824B778647k1843K863l4819K68790k45032M7296J23427l8010m0883Q1944q5121
$$ y = [3517084, 3504384, 3149035, 3411840, 3362605, 3290196, 3397073, 3179862, 3294248, 3278758, 3365245, 3570324, 3473864, 3115240, 3430436, 3322604, 3250047, 3407617, 3228378, 2988418, 3370569, 3343068, 3090724, 3260345, 2998077, 3010317, 3101315, 2966563, 2948329, 3006532, 2789992, 3010824, 3079010, 2892504, 2803952, 2984620, 2767182, 2754841, 2817110, 3007765, 2951978, 3185635, 3092910, 3080661, 3088755, 3089910, 2948091, 2865082, 2829052, 3034941, 2844722, 2822463, 2818724, 2943101, 2823017, 2884036, 3059908, 2566520, 2721648, 2744674, 2759553, 2937514, 3000529, 2955454, 2782435, 2780209, 2917601, 2892412, 2860213, 2947092, 2774143, 2631734, 2778647, 2756804, 2759667, 2724848, 2993638, 2748606, 2795902, 2919329, 2881319, 2840436, 2922380, 2837259]
12813B837259r4853J06792j49856O3648P7430Q5336k20288K88172j74727k1607
12803B797306k02226L59685O3140m22648M66141j11816J37335N6411j3142l97032
12793B733154K01663q9689J9550n1641K80771k75933K31028k64206J84304J00950
12783C069951R7118n8538j84085j05267J57585n8363k8249j8118J61836J02071
12773C135941k83787K00791k0793j6596K10810o2606k85676K87403j24893j1132
12763C029462K4844L3785O7073q0711L16520m4260k52997Q5867N7576j92047J45077
12752C190189j57412J9678J26168M6182k31371J27876j4731p2488n0912J14371
12742C097550j0618J42294j06005P7791K20246l2934k98217J37401K46434j18321
$$ y = [2837259, 2742406, 2849198, 2699342, 2762990, 2840420, 2925756, 2705468, 2993640, 2818913, 2797306, 2595080, 2954765, 3017905, 2595257, 3061398, 2949582, 3086917, 3143328, 3130186, 2733154, 2934817, 2845128, 2864678, 2813037, 3093808, 2817875, 3048903, 2784697, 2969001, 3069951, 3167069, 3108531, 2924446, 2819179, 2976764, 2918401, 2890152, 2872034, 3033870, 3135941, 2852154, 3052945, 3032152, 3015556, 3226366, 3163760, 2878084, 3165487, 3040594, 3029462, 3054306, 3088091, 3155164, 3074453, 3390973, 3346713, 3093716, 3179583, 3237159, 3045112, 3190189, 3032777, 3052455, 3178623, 3224805, 2993434, 3121310, 3106579, 3034091, 2983179, 3097550, 3086932, 3229226, 3123221, 3201012, 3421258, 3388324, 3090107, 3227508, 3473942, 3355621]
12732C355621J6289n3541p1107l3347Q0211k28765J57302J41035j1941j58034
12722C193723K35574j22412M3306o8403N8327j75245L59858k14185m0988L18505
12712C588060k44430J80633k9032j8332K75677l8295j68192L8321L75911o3882
12702C896439J98119J15943K03282q7079m0046K65141J02272M5140J38627J76375
12692E014213M20679K02410N25042L04202N01359M60064J22435k91363M2158k40501
12682G060698m27509p05411n27619k93027k92500l90357m0692Q8874k96105L46487
12672D522839j28763M6909J66582Q2249L3705J21723J69526L13860l40824J12632
12662E100438o2753j7226j300k20171L46890k14457J67396m5708K78415K78657
$$ y = [3355621, 3371910, 3318369, 3247262, 3213915, 3294126, 3065361, 3222663, 3363698, 3351757, 3193723, 3429297, 3306885, 3350191, 3281788, 3340115, 3164870, 3524728, 3310543, 3269555, 3588060, 3343630, 3524263, 3495231, 3476899, 3752576, 3714281, 3546089, 3584410, 3960321, 3896439, 4094558, 4210501, 4413783, 4326704, 4286658, 4551799, 4654071, 4699211, 4837838, 5014213, 5434892, 5637302, 6162344, 6466546, 6967905, 7427969, 7550404, 7259041, 7301199, 7060698, 6633189, 5927778, 5400159, 5107132, 4814632, 4424275, 4383583, 4472457, 4176352, 4522839, 4394076, 4440985, 4607567, 4689816, 4723521, 4845244, 5014770, 5328630, 4987806, 5100438, 5037685, 5020459, 5019159, 4798988, 5145878, 4931421, 5098817, 5053109, 5331524, 5610181]
12652E610181P8292J19952K89711m8351K20699p3925L8599q9841j13096K27341
12642F259562n726R051J44727K73472J35412Q7297J20716L6762k85424L83454
12632G159303l19733M32131p4313J1620L2108m02555K5498j66420j62078k43653
12622F291908j58022m3617m48218j95263j43916K2220l05598K6836J48031R7574
12612E291935M02154N90851O85343P21926J59071R40032M93170J32306O461q6626
12602I336623l91980k85922p63115o80029n02900n66450n90718j49289K1529J09338
12592E537087Q400R5242P9733K58796J0070J60221J0611k08083L7715n4095L572
12581E939269Q5813J95819M51343M20471K51911K87499K18282R1832l70955k69500
$$ y = [5610181, 5688473, 5808425, 6098136, 6049785, 6270484, 6196559, 6235158, 6145317, 6032221, 6259562, 6253836, 6262887, 6407614, 6681086, 6816498, 6903795, 7024511, 7061273, 6775849, 7159303, 6839570, 7271701, 7197388, 7209008, 7241116, 6838561, 6864059, 6697639, 6535561, 6291908, 6133886, 6090269, 5642051, 5446788, 5302872, 5325092, 5019494, 5046330, 5194361, 5291935, 5694089, 6284940, 6970283, 7692209, 7851280, 8791312, 9284482, 9416788, 9423249, 9336623, 8944643, 8658721, 7895606, 7215577, 6712677, 6146227, 5555509, 5406220, 5427749, 5537087, 5545487, 5640729, 5720462, 5979258, 5989328, 6149549, 6160160, 5952077, 5989792, 5935697, 5939269, 6025082, 6220901, 6672244, 7092715, 7344626, 7632125, 7850407, 7942239, 7571284, 7301784]
12571G301784o48484m97177k68345n30886o1101k20984p1280k70438M39197j46562
12561E025724Q9600j50578J50147K06814q0711n4802Q8294j20635R6430n3972
12551E196311j01216P9194M8394j51088K02518l8589j62762J73589L09346j83361
12541E372336M12142K27233j75354M57158k22122Q0112J6131m37309O4018k82070
12531E512275k5721k31184j27055n5418L95873j39634K8044J92304J33946l8541
12521E644889l64532K40506L0140N8315j61865L84941L68168R2172l03068P28897
12511F718563L81381R7404L99743J77113J38534k90250j37865n02179l60804l31442
12501F290198L3654k39877k05874K38801j63728M78712k45933j43187J16265O6815
$$ y = [7301784, 6653300, 6156123, 5887778, 5356892, 5295791, 5074807, 5003527, 4733089, 5172286, 5025724, 5115324, 4964746, 5114893, 5321707, 5240996, 5186194, 5274488, 5153853, 5250283, 5196311, 5095095, 5174289, 5222683, 5071595, 5274113, 5235524, 5072762, 5246351, 5555697, 5372336, 5784478, 6011711, 5836357, 6293515, 6071393, 6151505, 6167636, 5730327, 5794345, 5512275, 5486554, 5255370, 5128315, 5072897, 5468770, 5329136, 5357180, 5549484, 5683430, 5644889, 5280357, 5520863, 5551003, 5609318, 5447453, 5832394, 6200562, 6292734, 5989666, 6718563, 7099944, 7197348, 7597091, 7774204, 7912738, 7622488, 7484623, 6982444, 6621640, 6290198, 6323852, 6083975, 5878101, 6116902, 5953174, 6431886, 6185953, 6042766, 6159031, 6225846]
12491F225846r4095L61508l49422J35665J94519p6258Q1235K88765r6437J90766
12481F862092J73033J15944K25367J33494k11788r1338r0930l04066k5237j77910
12471F608661K55313j68552r1402p9737K24006J48038M8205M3040j22084P5430
12461F940918J09688M31381m8240L36324J08899L7156o720Q0458L16607L79979
12451H686450p7088M97364K52435N1531N01740M14958N25817J74869L71236M58279
12441A1857591L12862L46869R9782L52237K10285R6817J20333k92845N7027q7787
12431A3073171r0165J45775J23568j24619L75659k83815K77891N4320J40279K57805
12421A3949869N06393L55916Q5260P47200P64512O02507N44477Q62226O43139
$$ y = [6225846, 6131751, 6493259, 6143837, 6279502, 6474021, 6397763, 6478998, 6767763, 6671326, 6862092, 7035125, 7151069, 7376436, 7509930, 7298142, 7206804, 7115874, 6811808, 6786571, 6608661, 6863974, 6695422, 6604020, 6524283, 6748289, 6896327, 6944532, 6987572, 6865488, 6940918, 7050606, 7481987, 7433747, 7770071, 7878970, 7916126, 7909406, 7989864, 8306471, 8686450, 8609362, 9106726, 9359161, 9410692, 9912432, 10327390, 10853207, 11028076, 11399312, 11857591, 12170453, 12517322, 12617104, 12969341, 13179626, 13276443, 13396776, 13103931, 13160958, 13073171, 12983006, 13128781, 13252349, 13127730, 13503389, 13219574, 13497465, 13551785, 13692064, 13949869, 14456262, 14812178, 14897438, 15644638, 16409150, 17011657, 17556134, 18418360, 19061499]
12412A9061499P14633L14727M62976J38153K97797k56984k79595k57148j80674
12403B0015384o84098m83102m81121k31895k08240m98588l72195j34933m97444
12394A6423768k8889k2551k5892J6856L95846L2402M02415M95170K20728N59410
12384A8469263L19905J63294M58379M47652P1312k7864J20748k07373P0861l41012
12374A9545165j93346k76356k0298n98565P0282l06585l08668l66268j14321m30839
12364A7000201n2606j82066m60267K21593n07110r4900j74286r7351k55994j92582
12354A5204632q0411m7143j55435j92298n69479J28661j21191l42953q0197j73935
12344A3570251j02865J12959K8753L10003R9914J88302K21287J58963O0613L77249
$$ y = [19061499, 19776132, 20090859, 20553835, 20691988, 20989785, 20732801, 20453206, 20196058, 20015384, 19331286, 18848184, 18367063, 18135168, 17926928, 17428340, 17056145, 16921212, 16423768, 16394879, 16372328, 16346436, 16363292, 16759138, 16791540, 17193955, 17689125, 17909853, 18469263, 18789168, 18952462, 19410841, 19858493, 19929805, 19901941, 20022689, 19815316, 19886177, 19545165, 19351819, 19075463, 19055165, 18456600, 18526882, 18220297, 17911629, 17545361, 17431040, 17000201, 16947595, 16765529, 16305262, 16526855, 16019745, 15924845, 15750559, 15653208, 15397214, 15204632, 15124221, 15077078, 14921643, 14729345, 14159866, 14288527, 14167336, 13824383, 13744186, 13570251, 13467386, 13580345, 13609098, 13919101, 14019015, 14207317, 14428604, 14587567, 14648180, 15025429]
12334A5025429K66911K75963L81581L38138L33566J60635J26204L08699J74925
12325A7392051N7242M95989N3M60991j65341J50233k1618k51562J6559K30940
12315A8365537k00023K16276K05507r8795R2536R6850M37823J92702J40533L25081
12305A9774027L04783J00161N58277j66155J12368R6232l22821k78099m03260
12296A9775513n47504l32025m64366j30814n18333Q520j27605j84589j91212k96351
12286A6991234m94877m67440m01042n81917m77281m86378j57333p73164j50257
12277A3001545l56626k90695N2393k11679k64404q1145J49391j59073K3226l55054
12267A1507879J08639R5385j26529k8216R7646j299m1535J34354j48084J13891
$$ y = [15025429, 15292340, 15568303, 15949884, 16288022, 16621588, 16782223, 16908427, 17217126, 17392051, 17449293, 17945282, 17945335, 18406326, 18240985, 18391218, 18369600, 18118038, 18134597, 18365537, 18165514, 18381790, 18587297, 18488502, 18581038, 18677888, 19115711, 19308413, 19448946, 19774027, 20078810, 20178971, 20737248, 20571093, 20683461, 20779693, 20456872, 20178773, 19775513, 19228009, 18895984, 18431618, 18300804, 17782471, 17790991, 17663386, 17478797, 17287585, 16991234, 16496357, 16028917, 15627875, 15045958, 14568677, 14082299, 13924966, 13151802, 13001545, 12644919, 12354224, 12406617, 12194938, 11930534, 11849389, 11998780, 11839707, 11862933, 11507879, 11616518, 11711903, 11585374, 11557158, 11654804, 11653505, 11611970, 11746324, 11598240, 11712131]
12257A1712131K34086N8421M00638L17900K56238O38257L84302N15767R85235
12248A5502975P13606M78072R00979R89261R31168J116212N85840N94564K13667
12239B2026344L20681k44818Q7679k94326m96631O4102j13923l5673Q1382l68223
12229B1026594k73288k50167o23488p38849j028743q29489j009019o01995j003515
12220A4668041q12035l83085m63336o54852j49948l75370o4173l98776o4464K5344
12210A1327346n86479p3499l38110o6454m86649j08969K82063k60008N6498K67014
12200A0012753j01989j45870J00571j19757l03752L11375j65414K93976j16113
12191I765780L10690l5934L07743J13340K18131L75602L91019n1903P2066k8211
$$ y = [11712131, 11946217, 12004638, 12405276, 12723176, 12979414, 13617671, 14001973, 14517740, 15502975, 16216581, 16694653, 17595632, 18584893, 19516061, 20632273, 21218113, 21812677, 22026344, 22347025, 22102207, 22189886, 21895560, 21398929, 21463031, 21349108, 21313435, 21394817, 21026594, 20753306, 20503139, 19879651, 19140802, 18112059, 17282570, 16273551, 15671556, 14668041, 13856006, 13472921, 13009585, 12354733, 12204785, 11829415, 11765242, 11366466, 11302002, 11327346, 10740867, 10667368, 10329258, 10262804, 9776155, 9667186, 9949249, 9689241, 9745739, 10012753, 9910764, 9764894, 9865465, 9745708, 9441956, 9753331, 9587917, 9881893, 9765780, 10076470, 10040536, 10348279, 10461619, 10679750, 11055352, 11446371, 11394468, 11466534, 11438323]
12181A1438323K83378N7303M15702j79092J5988k62693q975J00435q1297m4082
12171A1734990m0625J99275K67335K57693l3258K88466K96185J16583M55464P14884
12161A4256992M54400O60916P95379K01228N24619m41114O6812m64641n56280
12152A5498311o5447k81167K21192K57587M36349N06874O48210N41058N5441O09028
12142A8427436j51587K54393M27830L42817K48115P47007O92738J256583J241269
12133B3486601J077184J244952J684324J798138J651138K145133J680382J556876
12125C6324728J399279J358361Q39413N17851j52404K11345j8058j33259j19284
12116D0227972j23441m71425l02115l91551n8274k84849n08048l24951P6749k13587
$$ y = [11438323, 11721701, 11779004, 12194706, 12015614, 12031602, 11768909, 11759934, 11860369, 11779072, 11734990, 11694365, 11893640, 12160975, 12418668, 12385410, 12673876, 12970061, 13086644, 13542108, 14256992, 14711392, 15372308, 16167687, 16368915, 16893534, 16452420, 16519232, 16054591, 15498311, 15432864, 15151697, 15372889, 15630476, 16066825, 16573699, 17221909, 17762967, 17818408, 18427436, 18275849, 18530242, 18958072, 19300889, 19549004, 20296011, 20988749, 22245332, 23486601, 24563785, 25808737, 27493061, 29291199, 30942337, 33087470, 34767852, 36324728, 37724007, 39082368, 39921781, 40439632, 40287228, 40498573, 40480515, 40347256, 40227972, 40104531, 39633106, 39330991, 38939440, 38881166, 38596317, 38088269, 37763318, 37840067, 37626480]
12106C7626480K64466P8055N96003N84053M40828Q17360M76729o257M89599j14490
12096D1252826m52489q85620j255242j151554r71847o06648m44822M71489J19295
12087C6075388Q13146Q47700Q47086N00940L05746K60834l19429M18099m40059
12078C9309451j3840J7850K09558Q6121M0642k84309m6940m86349o21947m03844
12068C7806393q42319r92742j124205j235940j294075j053083q88600p46868p08376
12059B8920185p24754m47726l60189m43245l92377l73564n83115k62828m35205
12050B4897182n05456l60299k44651j67899n13579j00276l80503p05469l66135
12041B1552915n86728l46212m57539m25650n27565m76799n21141n8703p4995j83357
$$ y = [37626480, 37890946, 37969001, 38565004, 39149057, 39589885, 40407245, 40883974, 40877717, 41367316, 41252826, 40800337, 39914717, 38659475, 37507921, 36536074, 35929426, 35484604, 35956093, 36075388, 36888534, 37736234, 38583320, 39084260, 39390006, 39650840, 39331411, 39749510, 39309451, 39295611, 39313461, 39523019, 39609140, 39649782, 39365473, 39318533, 38832184, 38210237, 37806393, 36964074, 35971332, 34847127, 33611187, 32317112, 31264029, 30375429, 29628561, 28920185, 28195431, 27747705, 27387516, 26944271, 26551894, 26178330, 25595215, 25332387, 24897182, 24391726, 24031427, 23786776, 23618877, 23105298, 23005022, 22624519, 21919050, 21552915, 20966187, 20619975, 20162436, 19736786, 19209221, 18732422, 18211281, 18152578, 18077583, 17894226]
12031A7894226L09247J81383q0802M49297J64016j55841K28893m38360k87765
12022A8264294o66286n40495m84596p28803j36590k02594n37475j73405J07882
12013A4901932j64745k10325m05246n48305o33043k26277k69350m5347L23645
12004A2722939M0195L00836J63171J68978J6168K84318o94591J0985n09855o12806
11994A1890338l15102l31435k97427o23905L50237K7322R2166j28064m27k85580
11984A0378123l95877m30798l06368n33661k34151k64179j21087q9118l47149
11975G655735R6071J5473j66596j87127l081k58331k71635r1243l24055q5895
11965F379316k05172J54968k06118J1766l2300K75626J18051J26703K3377P0070
$$ y = [17894226, 18203473, 18384856, 18304054, 18753351, 18917367, 18761526, 18990419, 18552059, 18264294, 17598008, 17057513, 16572917, 15844114, 15707524, 15504930, 14967455, 14794050, 14901932, 14737187, 14526862, 14121616, 13573311, 12940268, 12713991, 12444641, 12399294, 12722939, 12763134, 13063970, 13227141, 13396119, 13412287, 13696605, 13002014, 13012999, 12503144, 11890338, 11575236, 11243801, 10946374, 10322469, 10672706, 10700028, 10792194, 10664130, 10663703, 10378123, 9982246, 9551448, 9245080, 8711419, 8477268, 8213089, 8092002, 8002884, 7655735, 7751806, 7767279, 7600683, 7413556, 7410475, 7152144, 6880509, 6789266, 6465211, 6379316, 6174144, 6329112, 6122994, 6134760, 6102460, 6378086, 6496137, 6622840, 6646217, 6716287]
11955F716287L96217j36942J54674K09824j23094m52438L8759k2634L954K01829
11945F986436K24323L27707Q3252K03896q0101M73507k91966J26194N1918J7068
11935H122234J35424j24129j03618K15247N9611J80812l01718K4949k6294j76907
11925H005611l47399P37k42707l81717L1555l62388j99846Q3231k83846P301K5390
11914F335922j37076J10324L42509q6991O88630J337562K056345J897541J106954
11905A3651720O40543J86143M62389j424451k159500k424733j640260j141996
11897F149855l40001j93604l9612K09935n7057j81241K69305K53604K40735N19568
11887F831487M77311P68362P28085P37520M53963O29147J42791o6685m08187k89189
$$ y = [6716287, 7112504, 6975562, 7130236, 7340060, 7216966, 6764528, 6803287, 6780653, 6784607, 6986436, 7210759, 7538466, 7621718, 7825614, 7745513, 8219020, 7927054, 8053248, 8105166, 8122234, 8257658, 8133529, 8029911, 8245158, 8304769, 8485581, 8183863, 8208812, 8182518, 8005611, 7658212, 7658949, 7416242, 7034525, 7066080, 6703692, 6503846, 6587077, 6303231, 6310532, 6335922, 6198846, 6309170, 6651679, 6564688, 7253318, 8590880, 10647225, 12544766, 13651720, 14292263, 14478406, 14940795, 13516344, 11356844, 8932111, 7291851, 6149855, 5809854, 5616250, 5576638, 5786573, 5729516, 5548275, 5817580, 6071184, 6311919, 6831487, 7308798, 8077160, 8805245, 9542765, 9996728, 10625875, 10768666, 10701981, 10293794, 10004605]
11877A0004605o73074n75755m98684m87089r54807J01929l27705n88664k30425
11868E770331k80250j11652m01388J6746N0123o4296j63037M7049j33684J37521
11858D867463o4532P8094J18833j58158j69042J91317K31259Q7519J10253J87697
11848E480703K59498j65163O58897L30317L95556O02361M99289O18107K68216
11839H947781K97029K88473m55532k8919m78359o19481j97607m7988m2662K31069
11829G893804L48840j83578k7207k13585o34965m24151q55036m93372m61204j89866
11819D759680j76781N5851l48408O4632O547k37028k3844M5312o0314M2538n9172
11808D069013O1458j16824m6000q0794J9697J42207k22661L40450k37214J40449
$$ y = [10004605, 9331531, 8755776, 8257092, 7770003, 6815196, 6917125, 6589420, 6000756, 5770331, 5490081, 5378429, 4977041, 4993787, 5043910, 4979614, 4816577, 4863626, 4729942, 4867463, 4802931, 4881025, 4999858, 4841700, 4672658, 4863975, 5095234, 5182753, 5293006, 5480703, 5740201, 5575038, 6233935, 6564252, 6959808, 7562169, 8061458, 8679565, 8947781, 9244810, 9533283, 9077751, 9048832, 8570473, 7950992, 7753385, 7705397, 7662735, 7893804, 8242644, 8059066, 8031859, 7818274, 7183309, 6759158, 5904122, 5410750, 4949546, 4759680, 4582899, 4638750, 4290342, 4354974, 4361521, 4124493, 4100649, 4145961, 4085647, 4128185, 4069013, 4130471, 4013647, 3967647, 3886853, 3906550, 4048757, 3826096, 4166546, 3929332, 4069781]
11798D069781j28215L06377j06227P8276m1984K13771K64873K86037L34665N55777
11788E833131M26060K89393M97114k05723J67603k45005o04443j97038p86346
11779E174746l28632j44425n33467j99463j81507Q6879k39384m8711p7749O0528
11769C568815l7028N1151k18788Q2840j40238j468M3251L8624J00529l06958J21643
11758C302373M0708k82519J28451J46976l27602J44676N8608K15956m1727k24213
11748C161687L38165j44645j72533J70881J0234j80519J05247n1582p4708J04034
11738C266261l3071m0405k62730K04715k54546L51304k99491K21165k8796j80301
11728B944105r975o3310j071k282R8461j15096J78102N2207j46170J01658K12272
$$ y = [4069781, 3941566, 4247943, 4141716, 4219992, 4178008, 4391779, 4656652, 4942689, 5277354, 5833131, 6259191, 6548584, 7045698, 6839975, 7007578, 6762573, 6158130, 5961092, 5174746, 4846114, 4701689, 4168222, 3968759, 3787252, 3874131, 3634747, 3586036, 3508287, 3568815, 3531787, 3582938, 3364150, 3446990, 3306752, 3305284, 3348535, 3387159, 3487688, 3180730, 3302373, 3343081, 3060562, 3189013, 3335989, 3008387, 3153063, 3211671, 3427627, 3385900, 3161687, 3499852, 3355207, 3182674, 3353555, 3363789, 3183270, 3288517, 3236935, 3162227, 3266261, 3233190, 3192785, 2930055, 3134770, 2880224, 3231528, 2932037, 3153202, 3124406, 2944105, 2934130, 2870820, 2869749, 2867467, 2965928, 2850832, 3028934, 3081141, 2934971, 3036629, 3248901]
11717C248901k50995J15516k16917N8555j31678k8934P7839m5395J97754k25289
11707B799357L33689l7648k71794J06144K79990P137j18400j11923J17669J46098
11697C250319l64888L83337j59399j8583J47313J68292m69679L31188m9154J05679
11687C324425m9489K23009J49701p8338J15721N8793n6306m3793M5289O3597J05401
11676C858010R1284j33475M3702J16935k34056m314j47129J13128K57489l95914
11666C565660J54323J72922m7377p609k23567K85499N822n6148l6904K5340j67114
11655C670847Q3902O6924j21069n8934J02645J25410j74454o2938Q6338O3709
11645C782380k03106J01411r4322j06369o3789K69836l26852M82117l49405K67594
$$ y = [3248901, 2997906, 3113422, 2896505, 2955060, 2823382, 2794448, 2872287, 2826892, 3024646, 2799357, 3133046, 3095398, 2823604, 2929748, 3209738, 3216875, 3098475, 2986552, 3104221, 3250319, 2885431, 3268768, 3109369, 3090786, 3238099, 3406391, 2936712, 3267900, 3218746, 3324425, 3274936, 3497945, 3647646, 3569308, 3685029, 3743822, 3687516, 3643723, 3689012, 3752609, 3858010, 3949294, 3815819, 3859521, 3976456, 3742400, 3738086, 3590957, 3704085, 3961574, 3565660, 3719983, 3892905, 3845528, 3837919, 3614352, 3899851, 3905673, 3849525, 3812621, 3837961, 3670847, 3754749, 3821673, 3700604, 3641670, 3744315, 3869725, 3695271, 3632333, 3718671, 3782380, 3579274, 3680685, 3586363, 3479994, 3416205, 3686041, 3359189, 3841306, 3491901, 3759495]
11635C759495j43752K2724M7294J05916j80366j44454k3093L68774l11495J20
11625C501163o582M3816J0898J44560l46024J32707K4693M8242l12074K81528
11615C522927J2295r3041K04535J08655q9885j3443p1344j74150K80723k9081
11605C658191N4346J24223j62270J57509j77364J58575N9341q4860n4396K36577
11595C969872J01484R71j04839j09685L3299j05650o7805K90786j86386j47981
11585C674066l9493L44570j59112K29842k30391J34099K89305j27410q7003k5501
11575D002972L35492m31210N06742k06248Q0383q4557j11959m1496q4634J23780
11565D089265o3263K54132o0755j70074R3220N00198l48065p0543m0798K38328
$$ y = [3759495, 3615743, 3638467, 3685761, 3791677, 3611311, 3466857, 3443764, 3812538, 3501043, 3501163, 3494581, 3538397, 3549295, 3693855, 3347831, 3480538, 3505231, 3553473, 3241399, 3522927, 3535222, 3442181, 3646716, 3755371, 3665486, 3652043, 3580699, 3406549, 3687272, 3658191, 3712537, 3836760, 3674490, 3831999, 3654635, 3813210, 3872551, 3787691, 3733295, 3969872, 4071356, 4072327, 3967488, 3857803, 3891102, 3785452, 3717647, 4008433, 3822047, 3674066, 3634573, 3979143, 3820031, 4049873, 3819482, 3953581, 4242886, 4115476, 4028473, 4002972, 4338464, 3907254, 4413996, 4207748, 4288131, 4203574, 4091615, 4050119, 3965485, 4089265, 4026002, 4280134, 4219379, 4049305, 4142525, 4642723, 4294658, 4224115, 4183317, 4421645]
11555D421645r7880k1092r6823J44946k44239K43222l03815L41171k95145j61904
11545C930086J02145j8874j72917K22859j03401j47445J11096J62535j63338Q1155
11535D003901P6250k29127K07112n3916k13888R046K60179N1027k45085J18297
11525C983796J07840J21067k79620R360L06940m16348K97093K4835N9459k79172
11515C935250L95330k26415K00796O2701j3599J00145r2503L51208m82803L28284
11505D558394p7457r4046Q4372p1371K10068j07956j44305K61324j42122j43474
11495D333427L7336L4581J44081j89240K85221q1499j24080K29403K462j09349
11485D562343M8775K35423O3527j75984J16302m6062K29189j63985J87184j15266
$$ y = [4421645, 4323765, 4302673, 4205850, 4350796, 4106557, 4349779, 4045964, 4387135, 4091990, 3930086, 4032231, 4013357, 3840440, 4063299, 3959898, 3812453, 3923549, 4086084, 3922746, 4003901, 4080151, 3851024, 4058136, 4004220, 3790332, 3799378, 4059557, 4110584, 3865499, 3983796, 4091636, 4212703, 3933083, 3942443, 4249383, 3833035, 4130128, 4154963, 4214422, 3935250, 4330580, 4104165, 4304961, 4367662, 4354063, 4454208, 4361705, 4712913, 4230110, 4558394, 4480937, 4386891, 4471263, 4399892, 4609960, 4502004, 4357699, 4619023, 4476901, 4333427, 4370763, 4405344, 4549425, 4360185, 4645406, 4563907, 4439827, 4669230, 4671692, 4562343, 4611118, 4846541, 4910068, 4734084, 4850386, 4804324, 5033513, 4869528, 5056712, 4941446]
11475D941446j97900K38547j91525K91503k00810j61875n4346K73561r562k42558
11465D686481J10585m9654q9374L7930J25659r7636j08200r4277K03884q155p6420
11454D640823J04172m1884J92665j44320J19778j49481O1582K17480q1040L04001
11444E223776j15083j0102K73293o0863j17945J36810K71799j15104o8281J84516
11434E602816J57291L4564J40558K91778J790j39278J37687P426J73288j26733
11424F281187J56161N3081k18364O6707J84656M0442o216K94425l54844L35779
11414F833014K6952L9817J46639J01859J53477l5828L31688k01303K08604J60022
11404G764941J93430J45965J03472J79933K9175J80683J97602K0162K72446m4156
$$ y = [4941446, 4743546, 4982093, 4790568, 5082071, 4881261, 4719386, 4665040, 4938601, 4929039, 4686481, 4797066, 4747412, 4658038, 4695968, 4821627, 4723991, 4615791, 4521514, 4725398, 4717243, 4640823, 4744995, 4703111, 4895776, 4751456, 4871234, 4721753, 4783335, 5000815, 4919775, 5223776, 5108693, 5098591, 5371884, 5311021, 5193076, 5329886, 5601685, 5486581, 5418300, 5602816, 5760107, 5794671, 5935229, 6227007, 6228797, 6089519, 6227206, 6234632, 6407920, 6281187, 6437348, 6490429, 6272065, 6338772, 6523428, 6563870, 6557654, 6852079, 6497235, 6833014, 6859966, 6899783, 7046422, 7148281, 7301758, 7265930, 7597618, 7396315, 7604919, 7764941, 7958371, 8104336, 8207808, 8387741, 8416916, 8597599, 8795201, 8815363, 9087809, 9043653]
11394I043653M80606J24327r8721K53428K92298j54900L83392K77537J46697l8816
11384A0709501K75901K86619j5134L51707J24742q6957J69050J45048L05473l5988
11374A2229962N9537J30747M0902K95674m2967K8016K9608K95938j1510N929J49615
11363A3211451m0606n1358M87245k45946K10485M9085r3747P9906m3960P6467
11353A3639022Q2131r569J06475K9270k93984Q1757j283k20791K32437l3301K43915
11342A3856079j92129k52703Q2688q1987k05050j88957p8586k1325k98006k1913
11332A2598111j49180L4010j10399n82108K02640k02971M6085m02879p7326k96654
11322A1059329j84056p9442J41298m11264j43458J00879m22888k19798L4487l24439
$$ y = [9043653, 9524259, 9648586, 9549865, 9803293, 10095591, 9940691, 10324083, 10601620, 10748317, 10709501, 10985402, 11272021, 11256887, 11608594, 11733336, 11646379, 11815429, 11960477, 12265950, 12229962, 12289499, 12420246, 12461148, 12756822, 12713855, 12741871, 12771479, 13067417, 13055907, 13061836, 13211451, 13170845, 13119487, 13606732, 13360786, 13571271, 13620356, 13526609, 13606515, 13562555, 13639022, 13721153, 13711584, 13818059, 13847329, 13553345, 13635102, 13633819, 13413028, 13645465, 13612164, 13856079, 13663950, 13411247, 13493935, 13411948, 13206898, 13017941, 12939355, 12918030, 12620024, 12598111, 12448931, 12482941, 12372542, 11790434, 11993074, 11790103, 11836188, 11433309, 11355983, 11059329, 10875273, 10795831, 10937129, 10525865, 10382407, 10483286, 10060398, 9840600, 9875087, 9550648]
11312I550648l74135P2344j86908m10771j01453j67657l27895J95449l25265r2549
11302G831808k38449o9900j64329j72127j53134k54820j8813j84122N5345j62064
11292F469395l00013j85795M5045j29639l2424j30195j14016j79170J26970l41812
11282E228346K6178j07144j88010O6919k67011J11464j73541n2016J4488K2955
11272D682628j02275k36216k2572n9408r0304L15398l18490K402K2680o719q8382
11261D098742j07464K0843J08596j78714j18770O6350m3759R5226j84576k08125
11251C548349L53588k67886L61023k85280R253K23237j75214k75097J57388Q7034
11241C736395Q8666K650m8318J93570k06194Q8984k39396J31649j89317J18988
$$ y = [9550648, 9176513, 9248857, 9061949, 8651178, 8549725, 8382068, 8054173, 8249622, 7924357, 7831808, 7593359, 7523459, 7359130, 7187003, 7033869, 6779049, 6760236, 6576114, 6631459, 6469395, 6169382, 5983587, 6028632, 5898993, 5866569, 5736374, 5622358, 5443188, 5570158, 5228346, 5254524, 5147380, 4959370, 5026289, 4759278, 4870742, 4697201, 4645185, 4659673, 4682628, 4580353, 4344137, 4321565, 4262157, 4171853, 4487251, 4168761, 4171163, 4193843, 4187124, 4098742, 3991278, 4012121, 4120717, 3942003, 3823233, 3889583, 3845824, 3941050, 3756474, 3548349, 3901937, 3634051, 3995074, 3709794, 3719047, 3942284, 3767070, 3491973, 3649361, 3736395, 3825061, 3827711, 3779393, 3972963, 3766769, 3855753, 3616357, 3748006, 3558689, 3677677]
11231C677677J4167O6000K037K46668j98366L59217M06508P14302N64164Q81063
11221F733437P20973L57955K08699R5587j21066q51375j081238o85841p99521
11212D577610k21816l30504o1772k23147N6930N2095J31385j87740o9273r1756
11202C632012m6582K88096J55811Q5802L7857j01259P72233L25526Q98822Q97636
11192F945954P72263K18520L95486M5673m96493q22880q24902j017468j95243
11183E020910o63744p103k73268k85418J22314j0323k0259L15606l19556J70426
11173D049585K8002K00468J049j10882j2974m3942q4778K23467N7708j41766p2149
11162D093788K12653l17914R9747K85765j06959K71191l98754J15187p4238n8440
$$ y = [3677677, 3691844, 3757844, 3759881, 4006549, 3808183, 4167400, 4573908, 5288210, 5852374, 6733437, 7454410, 7812365, 8021064, 8116651, 7995585, 7144210, 6062972, 5377131, 4577610, 4355794, 4025290, 3963518, 3740371, 3797301, 3849396, 3980781, 3793041, 3723768, 3632012, 3585430, 3873526, 4029337, 4115139, 4152996, 4051737, 4823970, 5149496, 6048318, 6945954, 7718217, 7936737, 8332223, 8377896, 7881403, 7058523, 6233621, 5216153, 5020910, 4357166, 4350063, 4076795, 3791377, 3913691, 3903368, 3883109, 4198715, 3879159, 4049585, 4077587, 4278055, 4279104, 4168222, 4155248, 4111306, 4026528, 4249995, 4307703, 4165937, 4093788, 4306441, 3988527, 4088274, 4374039, 4267080, 4538271, 4139517, 4254704, 4180466, 4122026]
11152D122026J07828J63836J4240l98320M93907q6695M1201r164j48087M81315
11142D782087l64095K02363q4538J6549M8886J74116j58927O2247Q0909k4628
11132D734969K5703q2185J83696L48324n27620J98322J1341J98362l23158M42918
11122E210672k28745J01238j60936K71441j96997L20151p4118J65980l10221j10312
11112D988153M71226j33767P8279j49665K45939k46776R5286k9706L487l93835
11102D928621L91711k12059j06382j25223K07226j307J48955j33043m00628L80898
11092E078769j19010M7516j29132L03943k55676J11408j37302J49974K3636j50756
11082D923370J40719J28407j21858Q9181j14644L3321K93611n33590N73886k33443
$$ y = [4122026, 4229854, 4393690, 4407930, 4009610, 4503517, 4416822, 4458023, 4448859, 4300772, 4782087, 4417992, 4620355, 4535817, 4552366, 4601252, 4775368, 4616441, 4678688, 4759597, 4734969, 4760672, 4678487, 4862183, 5210507, 4682887, 4881209, 4892550, 5090912, 4767754, 5210672, 4981927, 5083165, 4922229, 5193670, 4996673, 5316824, 5242706, 5408686, 5098465, 4988153, 5459379, 5325612, 5403891, 5254226, 5500165, 5253389, 5348675, 5318969, 5322456, 4928621, 5320332, 5108273, 5001891, 4876668, 5083894, 5082587, 5231542, 5098499, 4697871, 5078769, 4959759, 5007275, 4878143, 5182086, 4926410, 5037818, 4900516, 5050490, 5074126, 4923370, 5064089, 5192496, 5070638, 5159819, 5045175, 5078496, 5372107, 4838517, 5412403, 5178960]
11072E178960L4287L14021j89235J65064K9446M5628o3001M10568q792j9423o2320
11061E835203J21751K7683L01503J9329K3410J03760J847N3319K82008o9308J71609
11050F872114j45446J08125J96837j87683L37339r72Q4539K8319J12115K3939
11040G429226K02494J62618L3491L9093K47751J59627L12898Q6719K99478K32498
11030I205893K11590q761O43246J76730K51088L93456K14606R3253M20922K22215
11020A1824238K23806K58110K06844M548J57160J90540J50501M23022n2346K47565
11010A3633988o6175K19223K83498J16908K27399J87211L39577M62534L48156
11001A5752319L30670L26924L91887O2604K96246P22504M36968L61533K93626
$$ y = [5178960, 5213247, 5527268, 5338033, 5503097, 5532543, 5578171, 5515170, 5925738, 5916946, 5897523, 5835203, 5956954, 5984637, 6286140, 6305469, 6328879, 6432639, 6434486, 6487805, 6769813, 6700505, 6872114, 6726668, 6834793, 7031630, 6843947, 7181286, 7180314, 7264853, 7293172, 7405287, 7429226, 7631720, 7794338, 7827829, 7866922, 8114673, 8274300, 8587198, 8673917, 8973395, 9205893, 9417483, 9408722, 10051968, 10228698, 10479786, 10873242, 11087848, 11181101, 11602023, 11824238, 12048044, 12306154, 12512998, 12517546, 12674706, 12865246, 13015747, 13438769, 13386423, 13633988, 13567813, 13787036, 14070534, 14187442, 14414841, 14602052, 14941629, 15404163, 15752319, 16082989, 16409913, 16801800, 16864404, 17160650, 17883154, 18320122, 18681655, 18975281]
10992A8975281K33470J89534J39029R061L70927L25378k44884O19883J86828K38360
10982B1042867N39699M37125L95230M68840L71942M26836M85887N2033k8468L01190
10972B4493181J90763J92467L54688O57583M13934M19630J82735Q46965K72440
10963B8024386M68816M64046O37539L78263K79768O56323O16928M07447P64459
10954C2697975N96892Q09666Q71171P55896N94782O23296O85352K70052P72460
10945C8677542M22200O27056J004518N88353O17722R89963J088904N40267O98633
10936D5255158P06057R35294R57292J124619P70698R26954J070586J128557Q67792
10927E3743007J103781J367936J205187J302987J263548J069910J090080O81519
$$ y = [18975281, 19208751, 19398285, 19537314, 19546375, 19917302, 20242680, 19997796, 20617679, 20804507, 21042867, 21582566, 22019691, 22414921, 22883761, 23255703, 23682539, 24168426, 24220459, 24191991, 24493181, 24683944, 24876411, 25231099, 25888682, 26302616, 26722246, 26904981, 27751946, 28024386, 28493202, 28957248, 29594787, 29973050, 30252818, 30909141, 31526069, 31933516, 32697975, 33294867, 34104533, 34975704, 35731600, 36326382, 36949678, 37635030, 37905082, 38677542, 39099742, 39726798, 40731316, 41319669, 41937391, 42927354, 44016258, 44556525, 45255158, 45961215, 46896509, 47853801, 48978420, 49749118, 50676072, 51746658, 52875215, 53743007, 54846788, 56214724, 57419911, 58722898, 59986446, 61056356, 62146436, 62827955]
10919F2827955J112509O99932M64474N54704N24419M55104k2099M35605K5795
10910F7078398j9200J23126n9554r4401J76147m75863L63159J80776o7101L17484
10900F7522971o2619L38692k6392L41421O65556N40156M48875N29961O95115P35828
10890G1729564Q20734J153483J230074J339536J644252J520994K137009K258442
10882H3834088K279282L140398L214932L770473M219169M419062N314796N368922
10874A15561122N621545O250058N915613N567289N319784M242330L304749K326702
10866A54109192R42700P0729j498536k297226l446595m514691m981273n354213
10858A33030087n872079n955702o399376n976131n997128n978286n665588n696440
$$ y = [62827955, 63940464, 64640396, 65104870, 65659574, 66183993, 66639097, 66616998, 67052603, 67078398, 67059198, 67182324, 67122770, 67028369, 67204516, 66728653, 67091812, 67272588, 67205487, 67522971, 67460352, 67799044, 67772652, 68114073, 68779629, 69319785, 69768660, 70298621, 70993736, 71729564, 72550298, 73703781, 74933855, 76273391, 77917643, 79438637, 81575646, 83834088, 86113370, 89253768, 92468700, 96239173, 100458342, 104877404, 110192200, 115561122, 121182667, 127432725, 133348338, 138915627, 144235411, 148477741, 151782490, 154109192, 155051892, 155122621, 153624085, 151326859, 147880264, 143365573, 138384300, 133030087, 127158008, 121202306, 114802930, 108826799, 102829671, 96851385, 91185797, 85489357]
10850H5489357m844626m866468m680042m395558m009400l987206l670249l384941
10842E1650867k908462k729630k959662k473573k127695k149158j700481j679651
10834C2922555j826503j692787j369422j358432r28043j555696r88023q03649
10826B2400000j017121j114745r22761n45719n92058o88668m96189o19366n43251
10817A5860122l58477l17602o99870j87015j53344k88262k73639n09330M954o26511
10807A2451026m24837m02933l73138k57975m50671n21611k35996k74458k17910
10798I291497m16164m9086p8324l89441k40413k38303K94376j00389n29943M5527
10788G589337l07867j97580q1931r6445J19772l95858N5946j65235j0103l04323
$$ y = [85489357, 80644731, 75778263, 71098221, 66702663, 62693263, 58706057, 55035808, 51650867, 48742405, 46012775, 43053113, 40579540, 38451845, 36302687, 34602206, 32922555, 31096052, 29403265, 28033843, 26675411, 25747368, 24191672, 23203649, 22400000, 21382879, 20268134, 19345373, 18799654, 18207596, 17518928, 17022739, 16403373, 15860122, 15501645, 15184043, 14484173, 14297158, 14143814, 13855552, 13581913, 13072583, 13077537, 12451026, 12026189, 11623256, 11250118, 10992143, 10541472, 10019861, 9783865, 9509407, 9291497, 8875333, 8826247, 8747923, 8358482, 8118069, 7879766, 8174142, 8073753, 7543810, 7589337, 7281470, 7083890, 7001959, 6905514, 7025286, 6629428, 6685374, 6520139, 6510036, 6205713]
10778F205713j59916k01284k54828K33815j72809j72945j49634J00436l23171
10769E105377O8081j93483K25999r9269j55426j60120j32597R4454j45926J5642
10759D622732m3002o2778O11J26609L0958k71245J83130J0974j90769P2054K08875
10748D688149l4593l10970k3440j16444j59883r0329k28029K00096k37415J97196
10738C884338j88221J71861q1631o0124L22401j47549j4000P1474j6539j0645
10728C931365J5370J37149n8467j90487J67842J07898k32872k698J16929M5186
10718D037215k87510M7263k04025L05519j13580N9609l7362J08227j8173J07317
10708D004500j44543j8175O3114L5606q1466J70431j44386r8283K52789m88905
$$ y = [6205713, 6045797, 5844513, 5589685, 5823500, 5650691, 5477746, 5328112, 5428548, 5105377, 5173458, 4979975, 5205974, 5106705, 4951279, 4791159, 4658562, 4753016, 4607090, 4622732, 4579730, 4516952, 4517563, 4644172, 4675130, 4403885, 4587015, 4597989, 4407220, 4479274, 4688149, 4653556, 4342586, 4319146, 4202702, 4042819, 3952490, 3724461, 3924557, 3687142, 3884338, 3696117, 3867978, 3786347, 3726223, 4048624, 3901075, 3887075, 3958549, 3942010, 3931365, 3946735, 4083884, 4025417, 3834930, 4002772, 4110670, 3877798, 3875100, 3992029, 4037215, 3749705, 3796968, 3592943, 3898462, 3784882, 3844491, 3807129, 3915356, 3897183, 4004500, 3859957, 3841782, 3904896, 3940502, 3859036, 4029467, 3885081, 3786798, 4039587, 3550682]
10698C550682J12307o1643J09892j11432k44277K73428k34503L2448J36940m8465
10688C515377P3545q7255j14418L522Q4503j01374J07547J8951k40001l202P8573
10677C335768J08967l19982K48268J91406l74023M6970K97287j85866j59887k4564
10667C164344n6817k20617J57184R7043j8830j02471j70965m5229k22970L22650
10657B903322k00830r094J34683m0871N195J13588j65364K96063k75835K54994
10647C015851j23676j77187q7375K83616l64822l7626n7691J82750j10352q2388
10637B441100l0596l136n920K51962j58755J38964l78023J32065q6988J2288m4682
10626B268279J77158l2290j12708J34778k51790J15727J55162k64749J39065o7508
$$ y = [3550682, 3662989, 3601346, 3711238, 3599806, 3355529, 3628957, 3394454, 3426902, 3563842, 3515377, 3588922, 3501667, 3387249, 3390771, 3475274, 3373900, 3481447, 3500398, 3260397, 3257195, 3335768, 3444735, 3124753, 3373021, 3564427, 3190404, 3237374, 3534661, 3348795, 3188908, 3164344, 3107527, 2886910, 3044094, 3141137, 3122307, 3019836, 2848871, 2803642, 2580672, 2903322, 2702492, 2693398, 2828081, 2787210, 2792405, 2905993, 2740629, 3036692, 2760857, 3015851, 2892175, 2714988, 2627613, 2911229, 2546407, 2508781, 2451090, 2633840, 2523488, 2441100, 2410504, 2407368, 2401448, 2653410, 2494655, 2633619, 2255596, 2387661, 2300673, 2312961, 2268279, 2445437, 2413147, 2300439, 2435217, 2183427, 2299154, 2454316, 2189567, 2328632, 2261124]
10616B261124N2102J26799k13507K89320j11610j22801K46316k85318J78470k29737
10606B191158K40364j99384k6751n3992J71683k24301J05655J85915p2674j53282
10596B164391k8850J76966J42542k15716j12044j07494J83226J12587l44674K38642
10586B209576L7101k17233J47958P4743N8387m8895m5483J85499l21663L13874
10576B393864j58816P5754k77510O6093N8363L5401k79646K7816J11651j01575
10566A951395L9106R5063j85691q8691J05900j21930K6967J28766N4233o0960
10556A944158j95151p8665R3242r8437K0732n5642J49993K33290j08675j24507
10546A780338J501o1643N8515Q2420J1753N0664k53685K15461k18815j03522J35247
$$ y = [2261124, 2313226, 2440025, 2226518, 2515838, 2404228, 2281427, 2527743, 2242425, 2420895, 2191158, 2431522, 2232138, 2205387, 2151395, 2323078, 2098777, 2204432, 2390347, 2317673, 2164391, 2135541, 2312507, 2455049, 2239333, 2127289, 2019795, 2203021, 2315608, 1970934, 2209576, 2246677, 2029444, 2177402, 2252145, 2310532, 2261637, 2216154, 2401653, 2079990, 2393864, 2235048, 2310802, 2033292, 2099385, 2157748, 2193149, 1913503, 1941319, 2052970, 1951395, 1990501, 2085564, 1899873, 1811182, 1917082, 1795152, 1822119, 1950885, 2005118, 1944158, 1749007, 1670342, 1763584, 1665147, 1685879, 1630237, 1780230, 2013520, 1904845, 1780338, 1781839, 1720196, 1778711, 1861131, 1872884, 1923548, 1669863, 1885324, 1666509, 1562987, 1698234]
10535A698234k0156J73264Q999R1446j45928J24585m1076j93474K15343O8957
10525A980194k37998M26683j80311M2582j1825K26227K25830J51695o0301L17267
10515B880043j18919K28077l41825j39019j58739N8657k51509o099p8847o1665
10505B010155n4912L59167l36574P1716J36794M2059l03107L75329r0229J43592
10495B353990l9893k44757P9033L11873L65183j97889K98924M9071l0294m7049
10485B898192j23720q3835j63630p9098j56372Q1107k32539j9243J83125j92878
10475B111109K79352J31477o8228r1626J38368k14198J60293J92389k8055P3484
10465B684365K13833J14792J36861j62931K6314j25895j74143K16823l0517N2255
$$ y = [1698234, 1678078, 1851342, 1860341, 1951787, 1805859, 1930444, 1889368, 1695894, 1911237, 1980194, 1742196, 2168879, 1988568, 2031150, 2019325, 2245552, 2471382, 2623077, 2562776, 2880043, 2761124, 2989201, 2647376, 2508357, 2349618, 2408275, 2156766, 2150667, 2071820, 2010155, 1955243, 2314410, 1977836, 2049552, 2186346, 2228405, 1925298, 2300627, 2210398, 2353990, 2314097, 2069340, 2148373, 2460246, 2825429, 2627540, 2926464, 2975535, 2945241, 2898192, 2774472, 2690637, 2527007, 2447909, 2291537, 2372644, 2140105, 2120862, 2303987, 2111109, 2390461, 2521938, 2453710, 2362084, 2500452, 2286254, 2446547, 2638936, 2610881, 2684365, 2898198, 3012990, 3149851, 2986920, 3013234, 2887339, 2713196, 2930019, 2899502, 2951757]
10455B951757j13317K72184J23372j58646K72214j02498n8188j5865p1882n8640
10445C040491K84745l79752M8955j30205L2120M6605L20950K25314L62345N4851
10435C906419J96953R4292o1623n39633k74605n61321j4437j05262j64884j12744
10425B363155J11355J2802r0761J96525L095Q0638o0617J18550j41106J04211
10415B697847J64878n1142j20599L39190J53731M71070J2897K97635N0666M70506
10405D486679j06231L37593k56062l6576J0679o612p8670J02280M54967K03190
10395E111237P29886L01214K31180M74790M70327M36400J25921J12992j43876
10386G850071J32957j2301j54826k07912n53951j04112m765k91237m2810r3775
$$ y = [2951757, 2838440, 3110624, 3233996, 3075350, 3347564, 3245066, 3186878, 3171013, 3099131, 3040491, 3325236, 2945484, 2994439, 2864234, 2896354, 2942959, 3263909, 3489223, 3851568, 3906419, 4103372, 4197664, 4136041, 3596408, 3321803, 2760482, 2746045, 2640783, 2475899, 2363155, 2474510, 2487312, 2396551, 2593076, 2596171, 2676809, 2616192, 2734742, 2593636, 2697847, 2862725, 2811583, 2690984, 3030174, 3183905, 3654975, 3667872, 3965507, 4016173, 4486679, 4380448, 4718041, 4461979, 4425403, 4436082, 4429470, 4350800, 4453080, 4908047, 5111237, 5841123, 6142337, 6373517, 6848307, 7318634, 7755034, 7880955, 7993947, 7850071, 7983028, 7970727, 7815901, 7607989, 7054038, 6949926, 6945161, 6653924, 6611114, 6517339]
10376F517339j13643P1379k06526o6653M45413r2571J76085m5717J95394K55757
10366G136257n157j85186K5357j69355N5650n22777J60333j34403j14649K20354
10356F466424m24408J55677j83582J10031k13082q3526j44591k16750l08633M3419
10346E200979o3959n7475j31519j49418j01752K07502K9679Q6254J25730o0379
10336E085642l7020K61619r8813J25699j50238L6284o4678k23561O7664o3685
10326D938913k76102N38841j1603j7369j32678r5120J21844J41793n6745J30510
10316E282284O0088N2855q4612j20740O5729J09093K89860K43042L46174N0898
$$ y = [6517339, 6403696, 6475075, 6268549, 6201896, 6647309, 6554738, 6730823, 6685106, 6880500, 7136257, 7131100, 6945914, 6971271, 6801916, 6857566, 6334789, 6495122, 6360719, 6246070, 6466424, 6042016, 6197693, 6014111, 6124142, 5911060, 5827534, 5682943, 5466193, 5157560, 5200979, 5137020, 5079545, 4948026, 4798608, 4696856, 4904358, 4934037, 5020291, 5146021, 5085642, 5048622, 5310241, 5211428, 5337127, 5186889, 5223173, 5158495, 4934934, 5002598, 4938913, 4662811, 5201652, 5190049, 5172680, 5040002, 4944882, 5066726, 5208519, 5151774, 5282284, 5342372, 5395227, 5310615, 5189875, 5255604, 5364697, 5654557, 5897599, 6243773, 6294671]
$$ [...]
##END NTUPLES=NMR SPECTRUM
##END=
