##TITLE=Coffee green (M4-ROVE20 + 1.5mL buffer 50/50,  450uL extracto + 50uL (D2O+TMS))
without heating, vortex and centrifuged, temperature 0oC.
##JCAMPDX= 6.0         $$ Bruker NMR JCAMP-DX V2.0
##DATA TYPE= NMR SPECTRUM
##DATA CLASS= NTUPLES
##ORIGIN= Bruker BioSpin GmbH
##OWNER= Administrator
$$ 1.72 TOPSPIN		Version 2.1
$$ 2012-05-22 16:12:36.715 -0700  Administrator@X
$$ Compression mode = diff/dup
##.OBSERVE FREQUENCY= 400.13188198
##.OBSERVE NUCLEUS= ^1H
##.ACQUISITION MODE= SIMULTANEOUS (DQD)
##.ACQUISITION SCHEME= undefined
##.AVERAGES= 64
##.DIGITISER RES= 22
##SPECTROMETER/DATA SYSTEM= spect
##.PULSE SEQUENCE= noesygppr1d
##.SOLVENT NAME= H2O+D2O
##.SHIFT REFERENCE= INTERNAL, H2O+D2O, 1, 14.97969
##AUDIT TRAIL= $$ (NUMBER, WHEN, WHO, WHERE, PROCESS, VERSION, WHAT)
$$ ##TITLE= Audit trail, TOPSPIN		Version 2.1
$$ ##JCAMPDX= 5.01
$$ ##ORIGIN= Bruker BioSpin GmbH
$$ ##OWNER= Administrator
$$ $$ c:\Bruker\TOPSPIN/data/jwist/nmr/11-coffee-green-quantification-2/111/pdata/1/auditp.txt
$$ ##AUDIT TRAIL=  $$ (NUMBER, WHEN, WHO, WHERE, PROCESS, VERSION, WHAT)
(   1,<2011-11-17 16:16:25.310 -0500>,<Administrator>,<TOPSPIN>,<go>,<TOPSPIN 2.1>,
      <created by zg
	started at 2011-11-17 16:07:30.872 -0500,
	POWCHK enabled, PULCHK disabled,
       configuration hash MD5:
       DA 63 81 1B EF 4C B5 72 B4 DF EA D9 B4 DB 4C 08
       data hash MD5: 64K
       7D 3B 1A 01 7B F8 94 B9 D4 01 52 7A 94 4B 96 7D>)
(   2,<2011-11-17 18:21:09.654 -0500>,<Administrator>,<TOPSPIN>,<proc1d>,<TOPSPIN 2.1>,
      <Start of raw data processing
       efp LB = 0 FT_mod = 6 PKNL = 1 PHC0 = 0 PHC1 = 0 SI = 32K 
       data hash MD5: 32K
       7B 16 F9 3C D8 CC 6A DB BC A9 22 C2 63 0A CB B4>)
(   3,<2011-11-17 18:21:10.060 -0500>,<Administrator>,<TOPSPIN>,<proc1d>,<TOPSPIN 2.1>,
      <pk PHC0 = 21.10474 PHC1 = 0 
       data hash MD5: 32K
       16 BA C0 37 29 27 B3 3F 25 A7 D1 14 0F 4F D6 14>)
$$ ##END=
$$ 
$$ $$ hash MD5
$$ $$ 50 5A 92 2B 16 C4 E8 D8 F9 17 BB 2E 06 0F AA 8F
##$RELAX= 
##$RELAX= 
##$RELAX= 
##$RELAX= 
##$RELAX= 
##$RELAX= 
$$ Bruker specific parameters
$$ --------------------------
##$DU= <Z:>
##$EXPNO= 111
##$NAME= <11-coffee-green-quantification-2>
##$PROCNO= 1
##$TYPE= <nmr>
##$USER= <jwist>
##$ACQT0= -8.16572462295132
##$AMP= (0..31)
100 100 100 100 100 100 100 100 100 100 100 100 100 100 100 100 100 100
100 100 100 100 100 100 100 100 100 100 100 100 100 100
##$ANAVPT= -1
##$AQSEQ= 0
##$AQ_mod= 3
##$AUNM= <au_prof>
##$AUTOPOS= <>
##$BF1= 400.13
##$BF2= 400.13
##$BF3= 400.13
##$BF4= 400.13
##$BF5= 400.13
##$BF6= 400.13
##$BF7= 400.13
##$BF8= 400.13
##$BYTORDA= 0
##$CFDGTYP= 0
##$CFRGTYP= 9
##$CHEMSTR= <none>
##$CNST= (0..63)
1 1 145 1 1 1 1 1 1 1 1 1 1 1 1 1 1 1 1 1 1 1 1 1 1 1 1 1 1 1 1 1 1 1 1
1 1 1 1 1 1 1 1 1 1 1 1 1 1 1 1 1 1 1 1 1 1 1 1 1 1 1 1 1
##$CPDPRG= <>
##$CPDPRG1= <>
##$CPDPRG2= <>
##$CPDPRG3= <>
##$CPDPRG4= <mlev>
##$CPDPRG5= <mlev>
##$CPDPRG6= <mlev>
##$CPDPRG7= <mlev>
##$CPDPRG8= <mlev>
##$CPDPRGB= <>
##$CPDPRGT= <>
$$ [...]
##$TP= (0..7)
150 150 150 150 150 150 150 150
##$TP07= 0
##$TPNAME0= <>
##$TPNAME1= <>
##$TPNAME2= <>
##$TPNAME3= <>
##$TPNAME4= <>
##$TPNAME5= <>
##$TPNAME6= <>
##$TPNAME7= <>
##$TPOAL= (0..7)
0.5 0.5 0.5 0.5 0.5 0.5 0.5 0.5
##$TPOFFS= (0..7)
0 0 0 0 0 0 0 0
##$TUNHIN= 0
##$TUNHOUT= 0
##$TUNXOUT= 0
##$USERA1= <user>
##$USERA2= <user>
##$USERA3= <user>
##$USERA4= <user>
##$USERA5= <user>
##$V9= 5
##$VALIST= <valist>
##$VCLIST= <CCCCCCCCCCCCCCC>
##$VD= 0
##$VDLIST= <DDDDDDDDDDDDDDD>
##$VPLIST= <PPPPPPPPPPPPPPP>
##$VTLIST= <TTTTTTTTTTTTTTT>
##$WBST= 2048
##$WBSW= 25
##$XGAIN= (0..3)
0 0 0 0
##$XL= 0
##$YL= 0
##$YMAX_a= 5478341
##$YMIN_a= -2283608
##$ZGOPTNS= <>
##$ZL1= 120
##$ZL2= 120
##$ZL3= 120
##$ZL4= 120
##$ABSF1= 0
##$ABSF2= 0
##$ABSG= 0
##$ABSL= 0
##$ALPHA= 0
##$AQORDER= 0
##$ASSFAC= 0
##$ASSFACI= 0
##$ASSFACX= 0
##$ASSWID= 0
##$AUNMP= <proc_prof1d>
##$AXLEFT= 0
##$AXNAME= <>
##$AXNUC= <1H>
##$AXRIGHT= 0
##$AXTYPE= 0
##$AXUNIT= <>
##$AZFE= 0.1
##$AZFW= 0.1
##$BCFW= 0
##$BC_mod= 0
##$BYTORDP= 0
##$COROFFS= 0
##$CY= 15
##$DATMOD= 1
##$DC= 0
##$DFILT= <>
##$DTYPP= 0
##$F1P= 14.9796895980835
##$F2P= -5.57284135567231
##$FCOR= 0.5
##$FTSIZE= 32768
##$FT_mod= 6
##$GAMMA= 0
##$GB= 0
##$INTBC= 1
##$INTSCL= 1
##$ISEN= 128
##$LB= 0
##$LEV0= 0
##$LPBIN= 0
##$MAXI= 10000
##$MC2= 0
##$MEAN= 0
##$ME_mod= 0
##$MI= 0
##$NCOEF= 0
##$NC_proc= -6
##$NLEV= 6
##$NOISF1= 0
##$NOISF2= 0
##$NSP= 0
##$NTH_PI= 0
##$NZP= 0
##$OFFSET= 14.97969
##$PC= 1
##$PHC0= 21.10474
##$PHC1= 0
##$PH_mod= 1
##$PKNL= yes
##$PPARMOD= 0
##$PPDIAG= 0
##$PPIPTYP= 0
##$PPMPNUM= 2147483647
##$PPRESOL= 1
##$PSCAL= 4
##$PSIGN= 0
##$PYNMP= <proc.py>
##$REVERSE= no
##$SF= 400.13
##$SI= 32768
##$SIGF1= 0
##$SIGF2= 0
##$SINO= 400
##$SIOLD= 32768
##$SPECTYP= <>
##$SREGLST= <1H.H2O+D2O>
##$SSB= 0
##$STSI= 32768
##$STSR= 0
##$SW_p= 8223.68421052631
##$SYMM= 0
##$S_DEV= 0
##$TDeff= 65536
##$TDoff= 0
##$TI= <>
##$TILT= no
##$TM1= 0
##$TM2= 0
##$TOPLEV= 0
##$USERP1= <user>
##$USERP2= <user>
##$USERP3= <user>
##$USERP4= <user>
##$USERP5= <user>
##$WDW= 1
##$XDIM= 32768
##$YMAX_p= 354540812
##$YMIN_p= -69341745
##$CURPLOT= <Network HP LaserJet P1505>
##$CURPRIN= <integrals_lipp.txt>
##$DFORMAT= <normdp>
##$LAYOUT= <+/1D_H.xwp>
##$LFORMAT= <normlp>
##$PFORMAT= <normpl>
##$SURQMSG= 1
$$ End of Bruker specific parameters
$$ ---------------------------------
##NTUPLES= NMR SPECTRUM
##VAR_NAME=  FREQUENCY,     SPECTRUM/REAL,   SPECTRUM/IMAG
##SYMBOL=    X,             R,               I
##VAR_TYPE=  INDEPENDENT,   DEPENDENT,       DEPENDENT
##VAR_FORM=  AFFN,          ASDF,            ASDF
##VAR_DIM=   32768,         32768,           32768
##UNITS=     HZ,            ARBITRARY UNITS, ARBITRARY UNITS
##FACTOR=    0.250966925370066, 1,           1
##FIRST=     8223.43324360094, -132068,      -182474
##LAST=      0,             6756,            -273824
##MIN=       0,             -69341745,       0
##MAX=       8223.43324360094, 354540812,    0
$$ Real data points
##PAGE= N=1
##DATA TABLE= (X++(R..R)), XYDATA
$$ [...]
19694A891196L33448m05702R5967J94454j22000j45363Q9731J27714l19693J40127
$$ 1891196 2224644 1818942 1914909 2109363 1987363 1842000 1931731 2059445 1739752 1879879
19684A879879q7818J54328j64877J27473L202l82066K45046K40634k15287J1328
$$ 1879879 1792061 1946389 1781512 1908985 1912187 1530121 1775167 2015801 1800514 1811842
19674A811842J27103r4280P616M9463P9394j72931k14151J46380J23938q4242
$$ 1811842 1938945 1844665 1852281 1901744 1981138 1808207 1594056 1740436 1864374 1780132
19664A780132k7694J43811j91287K93485Q361k65938K77519k59896N8330K30050
$$ 1780132 1752438 1896249 1704962 1998447 2006808 1740870 2018389 1758493 1816823 2046873
19654B046873j62340j31825L1948O8224l124j28266K04805q4241J25587p8048
$$ 2046873 1884533 1752708 1784656 1852880 1849756 1721490 1926295 1842054 1967641 1889593
19644A889593j54670n9854J53568j79304L20909o8455j23009L237n6120p3593
$$ 1889593 1734923 1675069 1828637 1649333 1970242 1901787 1778778 1782015 1725895 1652302
19634A652302L2705J54314l7911j9550J07476j08802o4541r563m3576J67845j43343
$$ 1652302 1685007 1839321 1801410 1781860 1889336 1780534 1715993 1706430 1662854 1830699 1687356
19623A687356J37996J14513k25897j00962R7624J11340j13597k05523P0272K6123
$$ 1687356 1825352 1939865 1713968 1613006 1710630 1821970 1708373 1502850 1573122 1599245
19613A599245M2249q700k24702K11246Q9924k61329J32804M6214J948j56857K2551
$$ 1599245 1641494 1632794 1408092 1619338 1709262 1447933 1580737 1626951 1628899 1472042 1494593
19602A494593N4796J0989r6752r0715p913m088R3419J36205m2253r0220J19861
$$ 1494593 1549389 1560378 1463626 1372911 1364998 1360910 1454329 1590534 1548281 1458061 1577922
19591A577922r9723m6394n4939J72637j50859k8768J58541q3668j1324R845m7406
$$ 1577922 1478199 1431805 1376866 1549503 1398644 1369876 1528417 1444749 1433425 1443270 1395864
19580A395864J9997K945P6892k11256K20864J3322p4975j26455J24227L1474j9132
$$ 1395864 1415861 1418806 1495698 1284442 1505306 1518628 1443653 1317198 1441425 1472899 1453767
19569A453767J6924R443j96527K262j36328J20527J34699j91077m1863K01972
$$ 1453767 1470691 1480134 1283607 1285869 1149541 1270068 1404767 1213690 1171827 1373799
19559A373799J07263l08408K41961r1079n3502J51053n5885p1999J862M0031q1557
$$ 1373799 1481062 1172654 1414615 1323536 1270034 1421087 1365202 1293203 1295065 1335096 1253539
19548A253539J23436j77307K43048j0582j91847n4188K72282O3438j40953r6822
$$ 1253539 1376975 1199668 1442716 1432134 1240287 1186099 1458381 1521819 1380866 1284044
19538A284044J15528l27901K89407j40309J3578N8011m9706L33747k32476L5238
$$ 1284044 1399572 1071671 1361078 1220769 1234347 1292358 1242652 1576399 1343923 1379161
19528A379161p8392j8933j16604O7026l5028J44725j98526L32404k25548P8132
$$ 1379161 1300769 1281836 1165232 1232258 1197230 1341955 1143429 1475833 1250285 1328417
19518A328417q4965J77138k39071J75799M4198n4928k28149J6950K11969o6503
$$ 1328417 1243452 1420590 1181519 1357318 1401516 1346588 1118439 1135389 1347358 1280855
19508A280855q3706l2206O1712J20486L4127m1500j46495J00597k36421R1660
$$ 1280855 1197149 1164943 1226655 1347141 1381268 1339768 1193273 1293870 1057449 1149109
19498A149109j08826K67771j97388J32648k04859K10881Q660L200k20988K00955
$$ 1149109 1040283 1308054 1110666 1243314 1038455 1249336 1257996 1261196 1040208 1241163
19488A241163m8389J14104P3008j5399j99032n8235m5607L3703M7833Q213J58918
$$ 1241163 1192774 1306878 1379886 1364487 1165455 1107220 1061613 1095316 1143149 1151362 1310280
19477A310280O7215l22565O7640j61242J59020N4417j31914p5111L04221j48637
$$ 1310280 1377495 1054930 1122570 961328 1120348 1174765 1042851 967740 1271961 1123324
19467A123324N2435L5608m3705k68970J04622k00789K39831k4916j01082O235
$$ 1123324 1175759 1211367 1167662 898692 1003314 802525 1042356 1017440 916358 922593
19457I22593J94776k09694J36286l02177P1792Q4159L975L0804j04098R5385j39314
$$ 922593 1117369 907675 1043961 741784 813576 897735 901710 932514 828416 923801 784487
19446G84487k72R1384o0475J4914k6866K08507j55257j41562L78419o6038j78062
$$ 784487 784215 875599 815124 830038 803172 1011679 856422 714860 1093279 1027241 849179
19435H49179J22258l2899k79209K09360J47699n2600j45783j91585J63659K3960
$$ 849179 971437 938538 659329 868689 1016388 963788 818005 626420 790079 814039
19425H14039j49027q387K17246P6451k99136M03389k35819J26310j1013M8626
$$ 814039 665012 656625 873871 950322 651186 1054575 818756 945066 934053 982679
19415I82679r6472k17017p919k344K58891k54886J47051J64121l86027J66818
$$ 982679 886207 669190 661271 658927 917818 662932 809983 974104 588077 754895
19405G54895L22096j43400j71492R1927j65371q0665K34307K40273k41887M7697
$$ 754895 1076991 933591 762099 854026 688655 607990 842297 1082570 840683 888380
19395H88380J81177k10494j14866J40143j32804J85759K8748k63926K3783J41264
$$ 888380 1069557 859063 744197 884340 751536 937295 966043 702117 725900 867164
19385H67164L3010Q7918O5017j35030j49801O1306N0260j39627L17839k19703
$$ 867164 900174 988092 1053109 918079 768278 829584 879844 740217 1058056 838353
19375H38353j44449M3894M2812J16867N8784l8934q7485m7226J91884n7194q9436
$$ 838353 693904 737798 780610 897477 956261 917327 829842 782616 974500 917306 827870
19364H27870M2135M8510q0853K1033k3389J28500j66777j76532J81005r7123N0619
$$ 827870 870005 918515 837662 858695 835306 963806 797029 620497 801502 704379 754998
19353G54998n0024j0044J09132J05649j25957j79562J54196J60066o1027r0306
$$ 754998 704974 694930 804062 909711 783754 604192 758388 918454 857427 767121
19343G67121L30950l54340K10311q3148J4973j13079j443P8160n1749k529K47339
$$ 767121 1098071 743731 954042 870894 885867 772788 771345 849505 797756 795227 1042566
19332A042566k13674R3066Q1223N1689j4272N4605j39328K6636Q4381j35664j13356
$$ 1042566 828892 921958 1003181 1054870 1040598 1095203 955875 982511 1066892 931228 817872
19321H17872O2652J35007j39606o4207m5507L67555o1937o1596N9455m23768J74489
$$ 817872 880524 1015531 875925 811718 766211 1133766 1071829 1010233 1069688 645920 820409
19310H20409J58799j16335J30440q7141R0646j02193k1568l4833o9009L09374
$$ 820409 979208 862873 993313 906172 996818 894625 873057 838224 769215 1078589
19300A078589j67185k33129L7641R1079j77293J15670j00684J22227m8719J18199
$$ 1078589 911404 678275 715916 806995 629702 745372 644688 766915 718196 836395
19290H36395j9597r5938J38014j10774j05959R9142l01815K36166P6187O6483
$$ 836395 816798 720860 858874 748100 642141 741283 439468 675634 751821 818304
19280H18304Q1107p7097j61005J47911J5010o1945k22415J07042R6845K266J15938
$$ 818304 899411 822314 661309 809220 824230 762285 539870 646912 743757 746023 861961
19269H61961J473k10346J30691j24067K04694k05907K11977j85736K46466k67015
$$ 861961 863434 653088 783779 659712 864406 658499 870476 684740 931206 664191
19259F64191Q3978k9572O8593R238N9166k43890K04886L2151O375J7275j12260
$$ 664191 748169 718597 787190 796428 855594 611704 816590 848741 855116 872391 760131
19248G60131Q9011j16635q2050o42Q1687J28366J61152J39204K02788q6447L08809
$$ 760131 849142 732507 650457 649815 731502 859868 1021020 1160224 1363012 1276565 1585374
19237A585374j33791r7911J56815j00423K2155n14202J19137J40542k28278k03814
$$ 1585374 1451583 1353672 1510487 1410064 1432219 918017 1037154 1177696 949418 745604
19227G45604j9550l0946K7762J35778k02772J87588r3924j76915J36329n4735
$$ 745604 726054 695108 722870 858648 655876 843464 749540 572625 708954 654219
19217F54219K60405l738k85549K3174m6819K37948J67843m40893M1924K17316
$$ 654219 914624 910886 625337 648511 601692 839640 1007483 566590 608514 825830
19207H25830J59710k74117r1935o498O7960M0249N5621j04711J0531o5610j75602
$$ 825830 985540 711423 619488 612990 680950 721199 776820 672109 682640 617030 441428
19196D41428K45306p329Q6977l1752P349o9376Q527q6797J60977j88057J42886
$$ 441428 686734 679405 766382 734630 741979 672603 681130 594333 755310 567253 710139
19185G10139K95096l06238R0648l535r2335J57287j23028J01222K3164Q8240q3477
$$ 710139 1005235 698997 789645 786110 693775 851062 728034 829256 852420 940660 857183
19174H57183M6010j70919K84235M8965k08342L49183j87995J65505p9204J51668
$$ 857183 903193 732274 1016509 1065474 857132 1206315 1018320 1183825 1104621 1256289
19164A256289l03204K47646l31333l2511L93863l80033O0457R2143l37936K88178
$$ 1256289 953085 1200731 869398 836887 1230750 850717 911174 1003317 665381 953559
19154I53559J22079j10683J23705j7861J35295n3653q2031j01970J97188l36550
$$ 953559 1075638 964955 1088660 1070799 1206094 1152441 1070410 968440 1165628 829078
19144H29078L39435j47801j99141k738J63598N94L0751k57964J44085Q9086m12843
$$ 829078 1168513 1020712 821571 818833 982431 983025 1013776 755812 899897 988983 576140
19133E76140O00010p956j75835r2685N7330J24553j30076L72519k6217k82863
$$ 576140 1176150 1168194 992359 899674 957004 1081557 951481 1324000 1297783 1014920
19123A014920K01791l92032L77583j79106q917j67900M34590j05392J8186O669
$$ 1014920 1216711 824679 1202262 1023156 1014239 846339 1280929 1175537 1193723 1200392
19113A200392K24212j53593j14647L4890J58687K97206M5815K00202o7415K81536
$$ 1200392 1424604 1271011 1156364 1191254 1349941 1647147 1692962 1893164 1825749 2107285
19103B107285k47247M81070M17877J89304N28806L47569L86529J27494n0436k62647
$$ 2107285 1860038 2341108 2758985 2948289 3477095 3824664 4211193 4338687 4288251 4025604
19093D025604o4431k34250n30741k87716k76992k67525m23827O5789k11166j56894
$$ 4025604 3961173 3726923 3196182 2908466 2631474 2363949 1940122 2005911 1794745 1637851
19083A637851J4786O4934K8408l05467J83608L35275l25497K62378J68715L57195
$$ 1637851 1652637 1717571 1745979 1440512 1624120 1959395 1633898 1896276 2064991 2422186
19073B422186N60667L59206K34603K10055J89185m5200k21735l94958P5660k8102
$$ 2422186 2982853 3342059 3576662 3786717 3975902 3930702 3708967 3314009 3389669 3361567
19063C361567p0486J45139K55140M00243K47787j1729J23864j0417j71467l74609
$$ 3361567 3291081 3436220 3691360 4091603 4339390 4327661 4451525 4441108 4269641 3895032
19053C895032l64070l16741l35987k38036j35920j86227m11105J56792r1148k80592
$$ 3895032 3530962 3214221 2878234 2640198 2504278 2318051 1906946 2063738 1972590 1691998
19043A691998L70707j01093J58834l55592L76244L64357O12039J40149M44103
$$ 1691998 2062705 1961612 2120446 1764854 2141098 2505455 3117494 3257643 3701746
19034C701746M69536K82074r6223j15684k57785j92331m11029m46846r2106m06415
$$ 3701746 4171282 4453356 4357133 4241449 3983664 3791333 3380304 2933458 2841352 2434937
19024B434937j46729k52924k4405k40358L28198r9213O9661k67149L94744m12648
$$ 2434937 2288208 2035284 2010879 1770521 2098719 1999506 2069167 1802018 2196762 1784114
19014A784114K93027L81373K05444L90826J31839L25291O84716J02708K9190M38679
$$ 1784114 2077141 2458514 2663958 3054784 3186623 3511914 4196630 4299338 4328528 4767207
19004D767207J9703J49538q8380L369j76520L30190M53778N83351L16083Q37906
$$ 4767207 4786910 4936448 4848068 4851437 4674917 5005107 5458885 6042236 6358319 7196225
18994G196225Q33698O09203N42423J067749J145349J525522J633574J637500J432787
$$ 7196225 8029923 8639126 9181549 10249298 11394647 12920169 14553743 16191243 17624030
18985A7624030J306513P74195J67992l88023j032870j332596j706146j897743
$$ 17624030 18930543 19704738 19872730 19484707 18451837 17119241 15413095 13515352
18977A3515352j530555j756879j155645j569151p19427j006874p74746l25948
$$ 13515352 11984797 10227918 9072273 7503122 6783695 5776821 5002075 4676127
18969D676127o72336l05565m26864l89466Q7204j30632m47970o0871j33769Q4994
$$ 4676127 4003791 3698226 3271362 2881896 2969100 2838468 2390498 2329627 2195858 2280852
18959B280852l89702O1848J40325j18957l21307L84912k23590j79513L75764r6904
$$ 2280852 1891150 1952998 2093323 1974366 1653059 2037971 1814381 1634868 2010632 1913728
18949A913728J2322m62847L21555L72415k14377J68137J08971j99272J74676K4164
$$ 1913728 1926050 1463203 1784758 2157173 1942796 2110933 2219904 2020632 2195308 2219472
18939B219472l5857K7381K59103J47297L34009K23620L74610K23734K59128R12939
$$ 2219472 2183615 2210996 2470099 2617396 2951405 3175025 3549635 3773369 4032497 4945436
18929D945436P67209J060736J037306J631110J450377J721276J769549J431723
$$ 4945436 5712645 6773381 7810687 9441797 10892174 12613450 14382999 15814722
18921A5814722J293142N40946K82236o49174j097566j404643j334092k118701
$$ 15814722 17107864 17648810 17931046 17281872 16184306 14779663 13445571 11326870
18913A1326870j425150j619498j236449q32779p26238q51870m90006n98377l24495
$$ 11326870 9901720 8282222 7045773 6212994 5486756 4634886 4144880 3546503 3222008
18904C222008o60520l166k82601j89800M1899m28477P135k15308J07755l15722
$$ 3222008 2561488 2558322 2275721 2085921 2127820 1699343 1706478 1491170 1598925 1283203
18894A283203J09135l16555K55328m27262J65076L5343k7803j27279j39797N03616
$$ 1283203 1392338 1075783 1331111 903849 1068925 1104268 1076465 949186 809389 1313005
18884A313005k85581j96744r7896K25295k23894j06888l905L24864p2581j69804
$$ 1313005 1027424 830680 732784 958079 734185 627297 623392 948256 875675 705871
18874G05871L2414m1809J62232m7504k93834J99977J88543k00756J5302r4445
$$ 705871 738285 696476 858708 811204 517370 717347 905890 705134 720436 625991
18864F25991J15350k0219n4939J83261j45790o8385l8210K56609k05145J28044
$$ 625991 741341 721122 666183 849444 703654 635269 597059 853668 648523 776567
18854G76567j93822L1836J43655q4146n5039j22514L17284k44044K47387j18733
$$ 776567 582745 614581 758236 674090 619051 496537 813821 569777 817164 698431
18844F98431r8386K40809K1932r1819J5759k19689J20972n0289j4469L6370J67823
$$ 698431 600045 840854 862786 770967 786726 567037 688009 637720 623251 659621 827444
18833H27444m3417j51021j82315K72667o218j53848j4583M799J45036o3246K5524
$$ 827444 784027 633006 450691 723358 717140 563292 548709 553508 698544 635298 660822
18822F60822J59424n0729l7715l03020J52510K24843j82004Q8147J33027j53271
$$ 660822 820246 769517 731802 428782 581292 806135 624131 712278 845305 692034
18812F92034j08800J47002O4548J0658j55409J84806k11974J01930j87314R8991
$$ 692034 583234 730236 794784 805442 650033 834839 622865 724795 537481 636472
18802F36472k8006K97245j45916l8331R5078p447k51998K88950K3320n4485k15131
$$ 636472 608466 905711 759795 721464 816542 809095 557097 846047 869367 814882 599751
18791E99751K66018l4832l4091O3634r6881P1469M8294m555l902k22960L33774
$$ 599751 865769 830937 796846 860480 763599 835068 883362 878807 874905 651945 985719
18780I85719j03897j0075M4291J11844j49667N573m2234M8141j24719q5245J62686
$$ 985719 881822 871747 916038 1027882 878215 883788 841554 889695 764976 679731 842417
18769H42417q868q1516k98361L39795j61170O8407m393m0282m2669P2958k19439
$$ 842417 833549 752033 453672 793467 632297 700704 696311 656029 613360 686318 466879
18758D66879L23575j47956j00767J83261j09900j06749K82473r5261R5935q9076
$$ 466879 790454 642498 541731 724992 615092 508343 790816 695555 791490 702414
18748G02414l9105K87077j61021k67119K38125m4804k39310K06503j00033M2864
$$ 702414 663309 950386 789365 522246 760371 715567 476257 682760 582727 625591
18738F25591q3179K90907j85045k7059J53120n1531J16922k67839K18398j31829
$$ 625591 542412 833319 648274 621215 774335 722804 839726 571887 790285 658456
18728F58456K63250k57959J55306M0134j63109j69930J63016N10J47668l79862
$$ 658456 921706 663747 819053 859187 696078 526148 689164 689674 837342 457480
18718D57480j27662L41109K5353K23072C37723M58652N430J06068k50609o2339
$$ 457480 329818 670927 696280 919352 337723 796375 801805 907873 657264 594925
18708E94925R9199p6186L6196R5786q9085l7679P4296j05472J48650J54698j76626
$$ 594925 694124 617938 654134 749920 660835 623156 697452 591980 740630 895328 718702
18697G18702O1572j47466O283l2327K97894k54799r3685J62412l49513M09716
$$ 718702 780274 632808 639091 606764 904658 649859 556174 718586 369073 778789
18687G78789q4339r5674l5141K12195j07529K76772k31066l9887M4075j9121K03392
$$ 778789 694450 598776 563635 775830 668301 945073 714007 674120 718195 699074 902466
18676I02466l69277M67536l20254J01161k15436J40849J48310J6815k07114M3006
$$ 902466 533189 1000725 680471 781632 566196 707045 855355 872170 665056 708062
18666G08062p9124R2585l6687k2604q4409K06593L603k28731J41143j87541J98352
$$ 708062 628938 721523 684836 662232 577823 784416 788019 559288 700431 512890 711242
18655G11242O1774k6756k02836N3320J20801k61981N7842j12022L2317L40613
$$ 711242 773016 746260 543424 596744 717545 455564 513406 401384 433701 774314
18645G74314M2761j74322P8850j15909L3551j42892L4981Q1654B90593M55637
$$ 774314 817075 642753 721603 605694 639245 496353 531334 612988 290593 746230
18635G46230k57827K67078j34895k822n8997K11068l21292q9987P6393R8442j81042
$$ 746230 488403 755481 620586 617764 558767 769835 448543 358556 434949 533391 352349
18624C52349K02770M4116M0697j19442O0138j08349q4906L37192j63595L4012
$$ 352349 555119 599235 639932 520490 580628 472279 387373 724565 560970 594982
18614E94982O3714j0481p7770m220J59432O6557j08303j1663j64523K99525M9251
$$ 594982 658696 648215 570445 566225 725657 792214 683911 672248 507725 807250 856501
18603H56501j10989o6954j0734K7960J4779K4608m3275K38414l91837L17932Q5966
$$ 856501 745512 678558 667824 695784 710563 735171 691896 930310 538473 856405 942371
18592I42371j6472j41246J84080k08597J45038P9719r2358j08782j21163K84864
$$ 942371 925899 784653 968733 760136 905174 984893 892535 783753 662590 947454
18582I47454j37936j7276j00526R4694r3046J36168j0121l0625j90058k3773J94643
$$ 947454 809518 792242 691716 786410 693364 829532 819411 788786 598728 574955 769598
18571G69598L1364J3949j21998K39J02385k3161J84830k24795j20677N2157J11355
$$ 769598 800962 814911 692913 693152 795537 772376 957206 732411 611734 663891 775246
18560G75246l79881J342K13850j2302J69861j58598J07425l1580j66036J72853
$$ 775246 395365 396707 610557 598255 768116 609518 716943 685363 519327 692180
18550F92180N3533M914k15632K09878C50221L7754K64475j33946J21785k7062
$$ 692180 745713 750627 534995 744873 350221 387975 652450 518504 640289 613227
18540F13227L5332p2319l6686L0858j06144N0344R5591j50683J91281C17788J51447
$$ 613227 648559 576240 539554 570412 464268 514612 610203 459520 650801 317788 469235
18529D69235J12121J7821K7592m6096n8398L1842J76508l53716M5021K70985l18593
$$ 469235 581356 599177 626769 580673 522275 554117 730625 376909 421930 692915 374322
18518C74322L52376k63627K22942j29950J42946l34093J77772Q3896K37369m01382
$$ 374322 726698 463071 686013 556063 699009 364916 542688 626584 863953 462571
18508D62571J2748m1452L8094J20815j09586R0861o1187M7453R0872q0951l7236
$$ 462571 475319 433867 471961 592776 483190 574051 512864 560317 651189 570238 533002
18497E33002j12280L4696J04983q7655J23933P7028J96396D00067J99906O9822
$$ 533002 420722 455418 560401 472746 596679 673707 870103 400067 599973 669795
18487F69795k58315J82004R4293O4423j16514R798k36626P8429O7318j22705Q5599
$$ 669795 411480 593484 687777 752200 635686 645484 408858 487287 554605 431900 517499
18476E17499K52815J9108l61458J42629K08879j45051Q1822j48530j09182J50021
$$ 517499 770314 789422 427964 570593 779472 634421 716243 567713 458531 608552
18466F08552j17497j10755L08618k21830J15252J50341k27170K52219k61766K39317
$$ 608552 491055 380300 688918 467088 582340 732681 505511 757730 495964 735281
18456G35281m6190J07694M700j54106R7658j40691K66264j17582M5534L876j42273
$$ 735281 689091 796785 801485 647379 745037 604346 870610 753028 798562 802438 660165
18445F60165k4238m0941J17123J03550j64550j08000J12819j55361J32604o1372
$$ 660165 635927 594986 712109 815659 651109 543109 655928 500567 633171 571799
18435E71799k84452M19768j51167Q178J69338l00363L93044k0911j34942J6986
$$ 571799 287347 707115 555948 564126 733464 433101 826145 805234 670292 687278
18425F87278n2826k6516J51390l0689k6278N3710j66918O2929K01855l18905J99300
$$ 687278 634452 607936 759326 728637 702359 756069 589151 652080 853935 535030 734330
18414G34330L9551j20123j05672j17855M21283l83626J1554l1415K499Q7711J48588
$$ 734330 773881 653758 548086 430231 851514 467888 479442 448027 450526 538237 686825
18403F86825m3547j27390K9342m1605K39372j16305J15490j59429j03578o3940
$$ 686825 643278 515888 545230 503625 742997 626692 742182 582753 479175 415235
18393D15235M5321j14914J65891q9753Q3371p4892K05839r0072k7818Q6275j81842
$$ 415235 460556 345642 511533 421780 505151 430259 636098 546026 518208 604483 422641
18382D22641J05753K49011j99588p7980L2974K8316j51672K20653B40982L61560
$$ 422641 528394 777405 577817 499837 532811 561127 409455 630108 240982 602542
18372F02542A75846M76591l9118k28614K90108B75507L95632k54408K29468k94337
$$ 602542 175846 652437 613319 384705 674813 275507 671139 416731 646199 351862
18362C51862N1207m6008L39153n6398k14828J42129n0017J20907P7313q1982J72810
$$ 351862 403069 357061 696214 639816 424988 567117 517100 638007 715320 633338 806148
18351H06148j33979l02128N63394l54173J35857N3528q0226R4092q9277j759n3551
$$ 806148 672169 370041 933435 579262 715119 768647 688421 782513 693236 691477 637926
18340F37926o9378j85071K28966M2239K40671j10868j04758r4187K1736m5621
$$ 637926 568548 383477 612443 654682 895353 784485 679727 585540 607276 561655
18330E61655B68760K27964K08661k27555K50376l23067J88019m7275K5419O8586
$$ 561655 268760 496724 705385 477830 728206 405139 593158 545883 571302 639888
18320F39888j37875R5454m5677o3672K70166q5320M7865j75797Q3538J36372J28925
$$ 639888 502013 597467 551790 488118 758284 672964 720829 545032 628570 764942 893867
18309H93867l46905K7158j19036q1024L28759o8413l02181J50601K28461j85823
$$ 893867 546962 574120 455084 374060 702819 634406 332225 482826 711287 525464
18299E25464l2025O9031m6259j18998r452L9814J15524k3639j57594K83046o4738
$$ 525464 493439 562470 516211 397213 387761 427575 543099 519460 361866 644912 580174
18288E80174j1377k62688J1239J11119k4758J30519L7157B10625M92120k48030
$$ 580174 568797 306109 317348 428467 403709 534228 571385 210625 702745 454715
18278D54715J8940R4431k56540J98588J15062j4433p376q7557J31085k9871j4870
$$ 454715 473655 568086 311546 510134 625196 610763 603387 515830 646915 617044 602174
18267F02174j05168L8799O3389p6662o1502p2772L20718j75190N4195o419r1208
$$ 602174 497006 535805 599194 522532 461030 388258 708976 533786 587981 581562 490354
18256D90354K75632j48078J35274j07937l1699O0322N7699j27357k2102n5691
$$ 490354 765986 617908 753182 645245 613546 673868 731567 604210 582108 526417
18246E26417k9173j0998J35298o7610j38104J20890j02215J18493r7827J10810
$$ 526417 497244 486246 621544 553934 415830 536720 434505 552998 455171 565981
18236E65981J09447C07207K36711M8228M5115j10795n6525N9103J41876r2976
$$ 565981 675428 307207 543918 592146 637261 526466 469941 529044 670920 577944
18226E77944j45857L7986J16728p1120j35516L04167k2681R9780j54899J19257
$$ 577944 432087 470073 586801 515681 380165 684332 661651 761431 606532 725789
18216G25789l31851J99725J17809j41129K43079j36440m3254j58828j03641k385
$$ 725789 393938 593663 711472 570343 813422 676982 633728 474900 371259 368874
18206C68874L62512j85599R7820J51744B81142L42826o5125M9401K31292j59809
$$ 368874 731386 545787 643607 795351 281142 623968 558843 608244 839536 679727
18196F79727J23826p1112k52955K02498j62917P9526R2670O4916r4903N6942j26673
$$ 679727 803553 732441 479486 681984 519067 598593 691263 756179 661276 718218 591545
18185E91545K29196j69687J49220j23568J09618j08953j11342N5602R8431L9327
$$ 591545 820741 651054 800274 676706 786324 677371 566029 621631 720062 759389
18175G59389M4309j87433m8964j97702K2699K58935J2090j67315n0609k299J73614
$$ 759389 803698 616265 567301 369599 392298 651233 663323 496008 445399 443100 616714
18164F16714j40807R2094R9974j43768Q2460J14164N8028k77138J82845M6617
$$ 616714 475907 568001 667975 524207 606667 720831 778859 501721 684566 731183
18154G31183k26941P5834m3432J489O3330J12076k97061K59615k53929K65039
$$ 731183 504242 580076 536644 538133 601463 713539 416478 676093 422164 687203
18144F87203R9844k00482K3049P3214k57111K02527q6870l1674J32418o9449K56634
$$ 687203 787047 586565 609614 682828 425717 628244 541374 509700 642118 572669 829303
18133H29303k63333P4963J6572K576j02737q2382L56901j77048j68016M9127k8289
$$ 829303 565970 640933 657505 660081 557344 474962 831863 654815 486799 535926 507637
18122E07637K14007j77024J07056j57372O1259Q9775J5381j59766Q1236K0139
$$ 507637 721644 544620 651676 494304 555563 645338 660719 500953 582189 602328
18112F02328L4247m1703K1195j9936j63101P9924k2685J11369n2384m3716M349
$$ 602328 636575 594872 616067 596131 433030 512954 490269 601638 549254 505538 509887
18101E09887M7519j08028O8905K28484m1129j50567K4631j33937L15463K07474
$$ 509887 557406 449378 518283 746767 705638 555071 579702 445765 761228 968702
18091I68702m44203L2192J43371J35822D03994J23567p3665O6073K7O9144R2047
$$ 968702 524499 556691 700062 835884 403994 527561 453896 519969 519996 589140 681187
18080F81187k19860K3420J32907j70497J65028k42831L3406J69812N1484C05138
$$ 681187 461327 484747 617654 447157 612185 369354 402760 572572 624056 305138
18069F07434j82116K31929j86545j12594J89907q5327B23580J20162L41555N5449
$$ 607434 425318 657247 470702 358108 548015 462688 223580 343742 685297 740746
18059G40746j88757k62583L1181J18490j81165O0401J82139j06473K00652j43100
$$ 740746 551989 289406 320587 439077 257912 318313 500452 393979 594631 451531
18049D51531M6804J19988j78214O9953L5092J91793k54169K0852J41052j34580
$$ 451531 498335 618323 440109 510062 545154 736947 482778 503630 644682 510102
18039E10102Q7896m6718K9667J056q2292q9703O5391J63037j49847o312P670l9848
$$ 510102 597998 551280 580947 582003 499711 410008 475399 638436 488589 482277 489947 450099
18027D50099P4771J55792C26672K63311k20274J52712k47038M26741j99525j24051
$$ 450099 524870 680662 326672 589983 369709 522421 275383 702124 502599 378548
18017C78548P8779J66793k89438J61552J27634k26896J67754j09684k7021j970
$$ 378548 457327 624120 334682 496234 623868 396972 564726 455042 428021 426051
18007D26051L52492k40472j05772J59525O4062m5052j91988J53105q0606j2026
$$ 426051 778543 538071 432299 591824 655886 610834 418846 571951 491345 479319
17997D79319j0429r8961Q5383J38010m6009j27515J7672K0977m735O9874n9279
$$ 479319 468890 369929 455312 593322 547313 419798 437470 458447 453712 523586 464307
17986D64307J23906j55867L00925j64819j6294n2272J38929Q1036k83523K9876
$$ 464307 588213 432346 733271 568452 552158 499886 638815 719851 436328 466204
17976D66204o5105o8968J36607k4692N3588Q9991r8249J45098J00429k46342K82115
$$ 466204 401099 332131 468738 444046 497634 587625 489376 634474 734903 488561 770676
17965G70676C39554J97374k5481M3825q6094k7058J28180q2246J68791r1622M7186
$$ 770676 339554 536928 511447 555272 469178 442120 570300 488054 656845 565223 612409
17954F12409n2277j07281O4767J61238j30078k4446j9243J46755j80850L04076
$$ 612409 560132 452851 517618 678856 548778 524332 505089 651844 470994 775070
17944G75070l46913J04965o011J03303q5299K78322C76540J24738J61319k29069
$$ 775070 428157 533122 527111 630414 545115 823437 376540 501278 662597 433528
17934D33528M929K35624j97063J03680J53618j61894m4268K15908r6757J2299
$$ 433528 438457 674081 477018 580698 734316 572422 528154 744062 647305 659604
17924F59604k51750N8676j23669L86947k05976K34467O0558k24644R8942L2353
$$ 659604 407854 466530 342861 729808 523832 758299 818857 594213 693155 725508
17914G25508m3540j45509j83845L52324k33090K60665l20194K49931k8702q5574
$$ 725508 681968 536459 352614 704938 471848 732513 412319 662250 633548 547974
17904E47974k6152p4989L84143k86180O9344O3044n2204Q3415m0781o3330O0677
$$ 547974 521822 446833 830976 544796 614140 677184 624980 708395 667614 604284 664961
17893F64961n9938m2541r3636O7472J16538J6598j1584M7274K03182j89743j01428
$$ 664961 605023 562482 468846 536318 652856 669454 657870 705144 908326 718583 617155
17882F17155j8403j77502j5314R8756K07252j28486J87131k53661K27632q5446
$$ 617155 598752 421250 405936 504692 711944 583458 770589 516928 744560 659114
17872F59114k1897M4359O0086j12552P8264j12944M8107J62964j30641j08563
$$ 659114 637217 681576 741662 629110 707374 594430 642537 805501 674860 566297
17862E66297o2563J94138k74285P2674l6578Q5108O3625J453J99033J81130k14325
$$ 566297 503734 697872 423587 496261 459683 544791 608416 609869 808902 990032 775707
17851G75707k95962K90536k09018P77J41897l1889o8605J30445K1700l35060K31901
$$ 775707 479745 770281 561263 562040 703937 672048 603443 733888 755588 420528 652429
17840F52429R3644o9413q5059p1667l2631J12118J95419q0740j71731J34700O9632
$$ 652429 746073 676660 591601 519934 487303 599421 794840 714100 542369 677069 746701
17829G46701J67545k96600j7026j88284K24684J04312J17033k01320n7515M5939
$$ 746701 914246 617646 600620 412336 637020 741332 858365 657045 599530 645469
17819F45469m63J35775J20123q396k3335N3588q17L24010l14126p9251J91935
$$ 645469 645006 780781 900904 892508 869173 922761 921944 1245954 931828 852577 1044512
17808A044512m3128k79604L79172n29201J71248R9148k8250K97607l11187K78873
$$ 1044512 1001384 721780 1100952 571751 742999 842147 813897 1111504 800317 1079190
17798A079190j44146o1574P6393J4250K5679M4973l9311j12996j73714L9734N7015
$$ 1079190 935044 873470 949863 964113 989792 1034765 995454 882458 708744 748478 805493
17787H05493J99846j92888j95306N4987J97871j58212q3933K12459l03413r9117
$$ 805493 1005339 812451 617145 672132 870003 711791 627858 840317 536904 437787
17777D37787K94585j33547J33803j05744j13082J04115l1378L44022l90129J23066
$$ 437787 732372 598825 732628 626884 513802 617917 586539 930561 540432 663498
17767F63498L8374j89087Q4401P6544m8831K37920k65815n1715K09124k00269
$$ 663498 701872 512785 597186 673730 624899 862819 597004 545289 754413 554144
17757E54144j78299J11407K57796k70711J82995j00661J41102m5862p569o202
$$ 554144 375845 487252 745048 474337 657332 556671 697773 651911 644342 638140
17747F38140J5875J1173R8757r6801k8780j1890L17945q6580j82707j01226Q957
$$ 638140 654015 665188 763945 667144 638364 626474 944419 857839 675132 573906 582863
17736E82863m9261l3227L43362j47558M404r157n8254p5707Q3662J28281j72673
$$ 582863 533602 500375 843737 696179 700583 691426 633172 557465 641127 769408 596735
17725E96735J37990l54018L37861k5845k8808m4239K4357J56591K3783j7947r6196
$$ 596735 734725 380707 718568 692723 663915 619676 644033 800624 824407 806460 710264
17714G10264K27095m39087K34431M8707k09368J69485o6710J3622j29203P608
$$ 710264 937359 498272 732703 781410 572042 741527 674817 688439 559236 566844
17704E66844J74948L4300J78688m71451K20311j02467J18065j02295J43615q9077
$$ 566844 741792 776092 954780 483329 703640 601173 719238 616943 760558 671481
17694F71481m9023m461J88320j65229J05878o932m6720j57385J1715J16888L569
$$ 671481 622458 617997 806317 641088 746966 740034 693314 535929 547644 664532 668101
17683F68101L48346k73266j65531L72953l85043J0701K56832k46564R0900n3707
$$ 668101 1016447 743181 577650 950603 565560 576261 833093 586529 677429 623722
17673F23722L4875J42356n5282K6986m8313J20290P615j20302O3021k34551K38596
$$ 623722 658597 800953 745671 772657 724344 844634 852249 731947 794968 560417 799013
17662G99013m8375p630K9523L9934m4766R9228k8417o3517K1835R9079j02895
$$ 799013 750638 743008 772531 812465 767699 866927 838510 774993 796828 895907 793012
17651G93012L20654j60010k17985J41393n8027p9847R8508J38061j37235J16205
$$ 793012 1113666 953656 735671 877064 819037 739190 837698 975759 838524 954729
17641I54729j58609M1316K09441m7519M3756j41483j29674J13905K0616o5803
$$ 954729 796120 837436 1046877 999358 1043114 901631 771957 885862 906478 840675
17631H40675n5846J87001n7839Q1007L2570j7751J37973j0077l6896p1610r3391
$$ 840675 784829 971830 913991 994998 1027568 1009817 1147790 1137713 1100817 1029207 935816
17620I35816K42280k7720J84375R620l34211L7761L41764l34788L37724j13407
$$ 935816 1178096 1150376 1334751 1344371 1010160 1047921 1389685 1054897 1392621 1279214
17610A279214n4414j83285J32118q9179L39553k73433j05877J33787M1289K028
$$ 1279214 1224800 1041515 1173633 1084454 1424007 1150574 1044697 1178484 1219773 1221801
17600A221801p5172K6261J71332k67345K27343j44776J0314J25007N0884M9591
$$ 1221801 1146629 1172890 1344222 1076877 1304220 1159444 1169758 1294765 1345649 1395240
17590A395240k58344J30439q9182Q9011J81093n2011j27235k22402K25958J34458
$$ 1395240 1136896 1267335 1178153 1267164 1448257 1396246 1269011 1046609 1272567 1407025
17580A407025j67958J61068J9399p6134J17654j06166j49060K30464k6748J7817
$$ 1407025 1239067 1400135 1419534 1343400 1461054 1354888 1205828 1436292 1409544 1427361
17570A427361k47057K47529j94085J23767k1656j31122M8808M6362J222R4195
$$ 1427361 1180304 1427833 1233748 1357515 1335859 1204737 1253545 1299907 1301129 1395324
17560A395324N0587j35482k19527K25653j13769R5756k41082K00231J58909k68129
$$ 1395324 1445911 1310429 1090902 1316555 1202786 1298542 1057460 1257691 1416600 1148471
17550A148471L0892R5572j61584L3017J27546n2037L84738N262k63867J71738
$$ 1148471 1179363 1274935 1113351 1146368 1273914 1221877 1606615 1611877 1348010 1519748
17540A519748k27464K92207l46045J87730K02812k43163J21298j85679Q5026J98120
$$ 1519748 1292284 1584491 1238446 1426176 1628988 1385825 1507123 1321444 1406470 1604590
17530A604590l25458R8710J69128k39996K8753Q6939K5869n4683j02816J38989
$$ 1604590 1279132 1377842 1546970 1306974 1335727 1422666 1448535 1393852 1291036 1430025
17520A430025l0056J08588J39852o121k01010K14443j2220Q8265q7109L84407
$$ 1430025 1399969 1508557 1648409 1642288 1441278 1655721 1643501 1731766 1644657 2029064
17510B029064l2359p1222J0558K56448K72886j29939J62532Jk09986J86050j44835
$$ 2029064 1996705 1925483 1936041 2192489 2465375 2335436 2497968 2497969 2287983 2474033 2329198
17499B329198L8385K78579k4818J34527K38472K65911J96941L24498M46477K58465
$$ 2329198 2367583 2646162 2621344 2755871 2994343 3260254 3457195 3781693 4228170 4486635
17489D486635O53322M76437J225351J470359K995693N331203Q060192J1549916
$$ 4486635 5139957 5616394 6841745 8312104 11307797 16639000 24699192 36249108
17481C6249108J3206076J2026233Q764218N395950J433431k411099n429810q565908
$$ 36249108 49455184 61481417 70245635 75641585 77075016 74663917 69234107 60668199
17473F0668199r584666q921420p392114m514372p32583L575136P699561J0523949
$$ 60668199 51083533 42162113 34769999 30255627 29523044 33098180 40797741 51321690
17465E1321690J1274700Q879942N387082J897325k012824n286836q615180j0261462
$$ 51321690 62596390 71476332 76863414 78760739 76747915 71461079 62845899 52584437
17457E2584437j0769460r907641p834177n854879m329651l025906k478568j442801
$$ 52584437 41814977 31907336 24073159 18218280 13888629 10862723 8384155 6941354
17449F941354r37808j068154r21416j80618j04149r9746p6940j51039J79810l72948
$$ 6941354 6003546 4935392 4013976 3833358 3729209 3629463 3552523 3401484 3581294 3208346
17439C208346k6523J12827k78488L9448j98111J8028k24758J42443p2886J49501
$$ 3208346 3181823 3294650 3016162 3055610 2857499 2875527 2650769 2793212 2720326 2869827
17429B869827o5708J74119j93184L25148j07349j47743q9119j47925o9206J64830
$$ 2869827 2804119 2978238 2785054 3110202 3002853 2855110 2765991 2618066 2548860 2713690
17419B713690k90498j40115K12749l87211L42535j98177j67j7665l2215m6080
$$ 2713690 2423192 2283077 2495826 2108615 2451150 2252973 2252806 2235141 2202926 2156846
17409B156846J76193J33578o2333j20017J77621m4772K98981n1879K02442J70246
$$ 2156846 2333039 2466617 2404284 2284267 2461888 2417116 2716097 2664218 2866660 3036906
17399C036906J14014j12391K68032O0784J48104K35741M84352O5242K78265N67000
$$ 3036906 3150920 3038529 3306561 3367345 3515449 3751190 4235542 4300784 4579049 5146049
17389E146049M24863L02709M47907N62701M2842M80544J34840n9108j46966k11486
$$ 5146049 5570912 5873621 6321528 6884229 6927071 7407615 7542455 7483347 7336381 7124895
17379G124895j13430j62960l8643j97096k16475K55334k45021L91479M3552L20220
$$ 7124895 7011465 6848505 6809862 6612766 6396291 6651625 6406604 6798083 6841635 7161855
17369G161855M55430K1916O63245K03551J39194O7226L72609r6403j2628J516
$$ 7161855 7617285 7639201 8302446 8505997 8645191 8712417 9085026 8988623 8975995 8977511
17359H977511R3839k18030J14941M9566J45583L0827K71271Q292L18403M23199
$$ 8977511 9071350 8853320 8968261 9017827 9163410 9194237 9465508 9473800 9792203 10215402
17349A0215402P68067N81739L11497P06718O00729P44077L39299N72450o2862
$$ 10215402 10983469 11565208 11876705 12583423 13184152 13928229 14267528 14839978 14777116
17340A4777116j0202j71406j5226j35639p5741n70532k64613k13676j11403j7467
$$ 14777116 14766914 14595508 14580282 14444643 14368902 13798370 13533757 13320081 13208678 13191211
17330A3191211L9581M52498R1879O23358N39019K78157M01672K20809L33032O82120
$$ 13191211 13230792 13683290 13775169 14398527 14937546 15215703 15617375 15838184 16171216 16853336
17320A6853336J55243L42749L29841N8386o0478q5064J70054m12700j48682l49632
$$ 16853336 17008579 17351328 17681169 17739555 17679077 17594013 17764067 17351367 17202685 16853053
17310A6853053K05946K6253k34089J35397M1722M38915J1315L20330J26266M3897
$$ 16853053 17058999 17085252 16851163 16986560 17028282 17467197 17478512 17798842 17925108 17969005
17300A7969005Q8078p3249j48952J45657o53985K43789l82820k42907K902K20308
$$ 17969005 18057083 17983834 17834882 17980539 17326554 17570343 17187523 16944616 16947518 17167826
17290A7167826m8054J17499m2597K12497j1574p2659k96708k28621l96856n48362
$$ 17167826 17119772 17237271 17194674 17407171 17395597 17322938 17026230 16797609 16400753 15852391
17280A5852391m45703p73229j010245q43103o29019m08222j165820n71854n49340
$$ 15852391 15406688 14633459 13623214 12780111 12151092 11742870 10577050 10005196 9455856
17271I455856n45143m77951n10186l73866o9566l16752j67112r309j25976k53399
$$ 9455856 8910713 8432762 7922576 7548710 7479144 7162392 6995280 6985971 6859995 6606596
17261F606596J0884J17647m62846m4464m7503O8290m88516j23747N5980q5073
$$ 6606596 6617480 6735127 6272281 6227817 6180314 6248604 5760088 5636341 5692321 5607248
17251E607248l31358l502r3229o4878J1308j253k04141j46717P5806r2381Q544
$$ 5607248 5275890 5272388 5179159 5114281 5125589 5124336 4920195 4773478 4849284 4756903 4765447
17240D765447j83793p813N2283l42507j8970k82128j13060J37640j56907k25458
$$ 4765447 4581654 4573841 4626124 4283617 4264647 3982519 3869459 4007099 3850192 3624734
17230C624734j52681j2062N7246P2566J2631j59840q0093M8397k71110J42204
$$ 3624734 3472053 3459991 3517237 3589803 3602434 3442594 3362501 3410898 3139788 3281992
17220C281992K42888K095q4735L48809k44496J44547n5072q9766Q4916k48907
$$ 3281992 3524880 3526975 3442240 3791049 3546553 3691100 3636028 3546262 3631178 3382271
17210C382271n0330l16O1937J9370j91253J64915n2146p2583j50351k05447J89044
$$ 3382271 3331941 3331625 3393562 3412932 3221679 3386594 3334448 3261865 3111514 2906067 3095111
17199C095111r5942l9800j29832p0343k01863J75986l27284j32355K01644k34137
$$ 3095111 2999169 2959369 2829537 2759194 2557331 2733317 2406033 2273678 2475322 2241185
17189B241185R6455J0562R1026k95022K03565j72345J60211l8648J19883k32525
$$ 2241185 2337640 2348202 2439228 2144206 2347771 2175426 2335637 2296989 2416872 2184347
17179B184347O3274O6528K1411k6891K4988J00174K78349k25491n831J51574J65203
$$ 2184347 2247621 2314149 2335560 2308669 2333657 2433831 2712180 2486689 2480858 2632432 2797635
17168B797635l7341o6715R7075q5907l9930L3090J73847n6491j02227J52591J37202
$$ 2797635 2760294 2693579 2790654 2704747 2664817 2697907 2871754 2815263 2713036 2865627 3002829
17157C002829j90234J66226M5260p3669L39623k57919J24325Q645r8158k1814
$$ 3002829 2812595 2978821 3024081 2950412 3290035 3032116 3156441 3165086 3066928 3045114
17147C045114l4477j4850k03329N9151K98253j04083j61925O9668m0788J505K49607
$$ 3045114 3010637 2995787 2792458 2851609 3149862 3045779 2883854 2953522 2912734 2914239 3163846
17136C163846k27127j08279M3859J43100O1826j89594k22028J78388l0010l28224
$$ 3163846 2936719 2828440 2872299 3015399 3077225 2887631 2665603 2843991 2813981 2485757
17126B485757J03600K64247l22576J24314P46J05620j79255J4203l6372J8437
$$ 2485757 2589357 2853604 2531028 2655342 2656088 2761708 2582453 2596656 2560284 2578721
17116B578721j60681l9316Q2810k5896q4199J87967L1084J5879R5417r533Q5424
$$ 2578721 2418040 2378724 2461534 2435638 2351439 2539406 2570490 2586369 2681786 2672253 2757677
17105B757677J77152k42109Q0055p404j24468J92214k23954m49164J47817l39072
$$ 2757677 2934829 2692720 2772775 2765371 2640903 2833117 2609163 2159999 2307816 1968744
17095A968744o960j7754k56419K24246l90084r4552J46397j21639O781k66489
$$ 1968744 1961784 1944030 1687611 1911857 1521773 1427221 1573618 1451979 1458760 1192271
17085A192271p6223J88506k07725L6790M28953k89967n5454j15500K55190k6023
$$ 1192271 1116048 1304554 1096829 1133619 1562572 1272605 1217151 1101651 1356841 1330818
17075A330818j40478R3917k88442M27932q5071M8779l3635j31416k1487J56756
$$ 1330818 1190340 1284257 995815 1423747 1338676 1387455 1353820 1222404 1200917 1357673
17065A357673l18698K47052j54739J49882j35936P4089k2184Q9606K25428j18243
$$ 1357673 1038975 1286027 1131288 1281170 1145234 1219323 1197139 1286745 1512173 1393930
17055A393930L89863K99145k01793P9761M74106P8324j58966K76645k113Q8066
$$ 1393930 1783793 2082938 1881145 1960906 2435012 2513336 2354370 2631015 2628902 2716968
17045B716968n2254J8432n4046J30549J22676N2091q2789K79846J40367K8917
$$ 2716968 2664714 2683146 2629100 2759649 2882325 2934416 2851627 3131473 3271840 3300757
17035C300757k16172r9748m8963k84176Q0111k22812m17931k33102L2929q0495
$$ 3300757 3084585 2984837 2935874 2651698 2731809 2508997 2091066 1857964 1890893 1810398
17025A810398M041N4287l77281j84810K72529j87263Q3314j14724j34204J32671
$$ 1810398 1814439 1868726 1491445 1306635 1579164 1391901 1475215 1360491 1226287 1358958
17015A358958k10514O0915l6625J36103n218o133j2340r0324o4986r604R9500
$$ 1358958 1148444 1209359 1172734 1308837 1303619 1297486 1285146 1194822 1129836 1120232 1219732
17004A219732K5107Q4416m86793L27697k7747l8422l15497K97309L48702l96996
$$ 1219732 1244839 1329255 842462 1170159 1142412 1103990 788493 1085802 1434504 1037508
16994A037508O4178J38084q4732L490P4980p5954K02971p3141J78731k91890J36262
$$ 1037508 1101686 1239770 1155038 1158528 1233508 1157554 1360525 1287384 1466115 1174225 1310487
16983A310487k5757p3644K08000K9458k30584J27810p0625q8361J43708j51229
$$ 1310487 1284730 1211086 1419086 1448544 1217960 1345770 1275145 1186784 1330492 1179263
16973A179263P2407J38759L06771j20722L6449n6127J11480J11754R8958J9315
$$ 1179263 1251670 1390429 1697200 1576478 1612927 1556800 1668280 1780034 1878992 1898307
16963A898307P5644J84044J28606m3633Q0386J31052j68444K46735n6358R4089
$$ 1898307 1973951 2157995 2286601 2242968 2323354 2454406 2285962 2532697 2476339 2570428
16953B570428M0027k48717L88240j30682m78268J33313p015J66171m77779q6243
$$ 2570428 2610455 2361738 2749978 2619296 2141028 2274341 2267326 2433497 1955718 1869475
16943A869475P6213l24897K4582J94493l15466r7600o993J53329k21529J17606
$$ 1869475 1945688 1620791 1645373 1839866 1524400 1426800 1419807 1573136 1351607 1469213
16933A469213l43017J48597M3403k19472k408L8800N6811J98451l70479K04070
$$ 1469213 1126196 1274793 1318196 1098724 1096316 1135116 1191927 1390378 1019899 1223969
16923A223969l29306J90840P1916o8492J90828m13082l2601K62498l0502j34240
$$ 1223969 894663 1085503 1157419 1088927 1279755 866673 834072 1096570 1066068 931828
16913I31828J83090R2039m05566K40333r2621K08978k01605j1596J0309n7919
$$ 931828 1114918 1206957 801391 1041724 949103 1158081 956476 944880 955189 897270
16903H97270K6050j97436R1039J31776J00404j55288q1146J41408k56795K36139
$$ 897270 923320 725884 816923 948699 1049103 893815 812669 954077 697282 933421
16893I33421n6233K9093Q7250p3351l00526q2112L6501J37356J00636o9785r6946
$$ 933421 877188 906281 993531 920180 619654 537542 574043 711399 812035 742250 645304
16882F45304K9291q7974L0804K35087k20367R9421j37372K96533n5610K65801
$$ 645304 674595 586621 617425 852512 632145 731566 594194 890727 835117 1100918
16872A100918l39703q7337L13475l90684L49422K1839k02483O9873j70920K92888
$$ 1100918 761215 673878 987353 596669 946091 967930 765447 835320 664400 957288
16862I57288r8473M3610L3981J307N5083j68280M7866j7276Q9062j27739l4500
$$ 957288 858815 902425 936406 937713 992796 824516 872382 855106 944168 816429 781929
16851G81929R5826m4556k0195N1435K5489J04448k42381J36731k20637K63938
$$ 781929 877755 833199 813004 864439 889928 994376 751995 888726 668089 932027
16841I32027k24404K08272j2171n9462j28529N2260J34961K3690m5396P652J43292
$$ 932027 707623 915895 903724 844262 715733 767993 902954 926644 881248 888900 1032192
16830A032192n2969k23365J18770L36332j01896m2988L3032O5789J38687j88811
$$ 1032192 979223 755858 874628 1210960 1109064 1066076 1099108 1164897 1303584 1114773
16820A114773J56016M4816j73933L11037l1067J46043L1343Q2435M7981P012k75859
$$ 1114773 1270789 1315605 1141672 1452709 1421642 1567685 1599028 1681463 1729444 1736456 1460597
16809A460597o553J29537j2189j56425J54098O0596j31773Q474l3547J38828J60404
$$ 1460597 1454044 1583581 1571392 1414967 1569065 1629661 1497888 1506362 1472815 1611643 1772047
16798A772047k85165J18864l65607J01703O4583l9306j13691l5262j4894k6106
$$ 1772047 1486882 1605746 1240139 1341842 1406425 1367119 1253428 1218166 1203272 1177166
16788A177166k69933R6443q1371L8729j05787R1237k44004J71833M7843j13428
$$ 1177166 907233 1003676 922305 961034 855247 946484 702480 874313 922156 808728
16778H08728j84860L43252l16349K12990q7344m8401L5754j40605J10435J31406
$$ 808728 623868 967120 650771 863761 776417 728016 763770 623165 733600 865006
16768H65006k0980Q8246j68977P048Q0594Q8160k35491J31360j8675k4144j1816
$$ 865006 844026 932272 763295 770343 850937 939097 703606 834966 816291 792147 780331
16757G80331J93092l66757J05282J942j50511J88191Q8100l2113j6978J72695
$$ 780331 973423 606666 711948 713890 563379 751570 839670 807557 790579 963274
16747I63274J37867k56615l3191P1540r7323M2867J8718r7453q0127K18101J6218
$$ 963274 1101141 844526 811335 882875 785552 828419 847137 749684 669557 887658 903876
16736I03876n8661k44789L47152J8218j74894J58129o3373J85852l12952M1482
$$ 903876 845215 600426 947578 965796 790902 949031 885658 1071510 758558 800040
16726H00040K72379k29902N068J7054J91684o1901J06401m2073p1300K9213N8156
$$ 800040 1072419 842517 847585 864639 1056323 994422 1100823 1058750 987450 1016663 1074819
16715A074819k4589J28651j72599R9031j43659P4649k3106m9738J30114P3730
$$ 1074819 1050230 1178881 1006282 1105313 961654 1036303 1013197 963459 1093573 1167303
16705A167303K57310o347M0099L51986l70453J05112m1643J0301K16203j56857
$$ 1167303 1424613 1418266 1458365 1810351 1439898 1545010 1503367 1513668 1729871 1573014
16695A573014k51834K46590r9809k49684M82777k80849K31827m4001k5928j71
$$ 1573014 1321180 1567770 1467961 1218277 1701054 1420205 1652032 1608031 1582103 1581932
16685A581932j05178J71723K661j77848O08j0204k33277J28284N1099j70752N3285
$$ 1581932 1476754 1648477 1651138 1473290 1473898 1463694 1230417 1358701 1409800 1239048 1292333
16674A292333j6180r5276m3855K00374K7931R6710K01723m7896J98162j34893
$$ 1292333 1276153 1180877 1137022 1337396 1365327 1462037 1663760 1615864 1814026 1679133
16664A679133O0197R5779k25208O1568L3538j96992L8995k9612r9916L00939J45375
$$ 1679133 1739330 1835109 1609901 1671469 1705007 1508015 1547010 1517398 1417482 1718421 1863796
16653A863796q4269j1834k58028Q2617k42755Q5695l09407M0530Q1097l13227
$$ 1863796 1779527 1767693 1509665 1592282 1349527 1435222 1125815 1166345 1247442 934215
16643I34215j91858K41922k54504L43527m21883J81988j22435N0229O2844j26363
$$ 934215 742357 984279 729775 1073302 651419 833407 710972 761201 824045 697682
16633F97682k81812J05208K19391M7302p3516l9750J21357p9516O2526l0939p9699
$$ 697682 415870 521078 740469 787771 714255 674505 795862 716346 778872 747933 668234
16622F68234m9770o0863K30363j9004r0623o878o7222K8538J34072J07796k74745
$$ 668234 618464 557601 787964 768960 678337 671459 604237 632775 766847 874643 599898
16611E99898J74571j97850n79Q6593B97292K41314J36944J3453o5337J63129K9416
$$ 599898 774469 576619 576040 662633 297292 538606 675550 689003 623666 786795 816211
16600H16211j78714K7335K81732k15975O7850J98194j9252q7695M7052j69574
$$ 816211 637497 664832 946564 730589 798439 996633 977381 889686 936738 767164
16590G67164R9400J5707J5381j58090L43142k61386J40595L1969r6127o3516n1200
$$ 767164 866564 882271 897652 739562 1082704 821318 961913 993882 897755 834239 783039
16579G83039N073l04442M60461k46156J79519Q9414j01817O0297k01648j61353
$$ 783039 788112 483670 944131 697975 877494 966908 865091 925388 723740 562387
16569E62387J75721l095L3669l741l04001P4944L29680m26530N3285J06270J16400
$$ 562387 738108 735013 768682 764941 460940 535884 865564 439034 492319 598589 714989
16558G14989j07889K62393J29359j56919R9103k13226J8676j01158L00241J52744
$$ 714989 607100 869493 998852 841933 941036 727810 746486 645328 945569 1098313
16548A098313j08810l1046j16514O3671J61613k5749K95888l10019P9698l01580
$$ 1098313 989503 958457 841943 905614 1067227 1041478 1337366 1027347 1107045 805465
16538H05465K68448Q8532k66304j63811M30912E69678J48661m3330J78095k31580
$$ 805465 1073913 1162445 896141 732330 1163242 569678 718339 675009 853104 621524
16528F21524r9094O9833J33177p6569J44694l34091L67230l48015L88877C42204
$$ 621524 522430 592263 725440 648871 793565 459474 826704 478689 867566 342204
16517F09487n8452J2801M2655m313K03583o3586q0720L1005l07400J22243j95998
$$ 609487 551035 563836 606491 602178 805761 742175 661455 692460 385060 507303 311305
16506C11305N717J05376j71200j1281R208l2013n0942N6268p5230K87684N0808
$$ 311305 317022 422398 251198 239917 249125 217112 166170 222438 147208 434892 485700
16495D85700k6686Q379J75881k38614K25469o2766K06311l0212O3331j05076J34236
$$ 485700 459014 467393 643274 404660 630129 567363 773674 743462 806793 701717 835953
16484H35953J88345l6845j16115J76266k7965K22961k2535q5080K39233J47884
$$ 835953 1024298 987453 871338 1047604 1019639 1242600 1220065 1134985 1374218 1522102
16474A522102k02408O1061J58046n1115j92037L04432p271l1387K14640j46510
$$ 1522102 1319694 1380755 1538801 1487686 1295649 1600081 1592810 1561423 1776063 1629553
16464A629553P8788j15414q7655J20343J00324j19852J61549k31239J92696l2099
$$ 1629553 1708341 1592927 1505272 1625615 1725939 1606087 1767636 1536397 1729093 1696994
16454A696994R6480m9437J6436K05355k9998J69219j36552n4224K89439K14598
$$ 1696994 1793474 1744037 1760473 1965828 1935830 2105049 1968497 1914273 2203712 2418310
16444B418310l241j5647J21359J49665L18056r0414k8160J42254k9192J51871
$$ 2418310 2415069 2399422 2520781 2670446 2988502 2898088 2869928 3012182 2982990 3134861
16434C134861l4450K3211P9032J80585P38631q2577M78496P70999R50010O81443
$$ 3134861 3100411 3123622 3202654 3383239 4121870 4039293 4517789 5288788 6238798 6920241
16424F920241P97261R45520Q72622Q99505J209426Q52903J424717J330413J461642
$$ 6920241 7717502 8663022 9535644 10435149 11644575 12497478 13922195 15252608 16714250
16415A6714250J362415J446739J859254J539766K170576J777136J898990K252138
$$ 16714250 18076665 19523404 21382658 22922424 25093000 26870136 28769126 31021264
16407C1021264K132440K286566J952004K363583K013764K078551J837446J553226
$$ 31021264 33153704 35440270 37392274 39755857 41769621 43848172 45685618 47238844
16399D7238844O39031m31338j054139j147720j903189j442775q8112K256500N674438
$$ 47238844 47877875 47446537 46392398 45244678 43341489 41898714 41810602 44067102 49741540
16390D9741540J0387119J4196217J4902531J1045547N065762q80489n464441q572592
$$ 49741540 60128659 74324876 89227407 100272954 105338716 104458227 98993786 90421194
16382I0421194j0138307j0254177j1950433j5648522k0254033c415736k7902116
$$ 90421194 80282887 70028710 58078277 42429755 22175722 -3415736 -31317852
16375c1317852k4366806j3657087P33955J3330949J9511986a6137800E07781J2256579
$$ -31317852 -55684658 -69341745 -68607790 -55276841 -35764855 -16137800 507781 12764360
16367A2764360Q139811M136510M49346j385979k734130k817424k649825k504917
$$ 12764360 20904171 25040681 25490027 24104048 21369918 18552494 15902669 13397752
16359A3397752k090364j668737j646268j276895j032857r30595m71348o14328
$$ 13397752 11307388 9638651 7992383 6715488 5682631 4752036 4280688 3666360
16351C666360p07728l58304m31302m67713k63103p1308k97351k54874j26102k92152
$$ 3666360 2958632 2600328 2169026 1701313 1438210 1366902 1069551 814677 688575 396423
16341C96423J67948q1294R1555r864o3733J06534k25249K23007Q350l8933M6431
$$ 396423 564371 483077 574632 564768 501035 607569 382320 605327 613677 574744 621175
16330F21175k90307R9854K98772j80321P853L0484j97214M43382D16752L07319
$$ 621175 330868 430722 729494 549173 557026 587510 390296 833678 416752 724071
16320G24071j47215J93060j7336K64668J46880q4296K7240j83840o3145J22411
$$ 724071 576856 769916 752580 1017248 1164128 1079832 1107072 923232 860087 982498
16310I82498j11229j19060l5508k22242j55255D4502J94444A13719a31807q8360
$$ 982498 871269 752209 716701 494459 339204 44502 238946 113719 -131807 -220167
16300b20167F0015a44029a9518C1874a71958d562j07600p2109b4931q6575r5536
$$ -220167 60015 -144029 -19518 31874 -171958 -4562 -112162 -184271 -24931 -111506 -207042
16289b07042k09051B53848b2898n1246D682L23346f4511A44144a00187l771B20830
$$ -207042 -416093 253848 -22898 -74144 4682 328028 -64511 144144 -100187 -103958 220830
16277A25127K15719Q4384L32293j7128o6372J19527J4998l1688M2801M7384L6339
$$ 125127 340846 425230 757523 740395 674023 793550 808548 776860 819661 867045 903384
16266I03384R19J30331l86078k2181J22472k23248J02479C04935J24624J21067
$$ 903384 904303 1034634 648556 626375 748847 525599 628078 304935 429559 550626
16256E50626k16884p0829j1714r2647O3394q3600L38502J03296j97177J01755
$$ 550626 333742 262913 251199 158552 221946 138346 476848 580144 382967 484722
16246D84722O2207o2209K81679L6142O5081J73199j2905K5732L7487k66012J55634
$$ 484722 546929 484720 766399 802541 867622 1040821 1027916 1053648 1091135 825123 980757
16235I80757j8455m2967j18905j16872q2672J61956j01000j29715P8319o445j29432
$$ 980757 962302 919335 800430 683558 600886 762842 661842 532127 610446 604001 474569
16224D74569L67201l18286L08376o0705m0989K07320l10602K84950q3453p8436
$$ 474569 841770 523484 831860 771155 730166 937486 626884 911834 828381 749945
16214G49945R2752k0279J06409k25573m918R4159J61191j76306J7795p5433m6618
$$ 749945 842697 822418 928827 703254 698336 792495 953686 777380 795175 719742 673124
16203F73124K08470j36239K13262k16029O8570r6813k61736J99375M2309O1474
$$ 673124 881594 745355 958617 742588 811158 714345 452609 651984 694293 755767
16193G55767j51058K04666j27853K00071l17290J43356K8184K3424J07598J86378
$$ 755767 604709 809375 681522 881593 564303 707659 735843 759267 866865 1053243
16183A053243o4921j09017j44499K0078K1453K07925l92713O1658P9882K20009
$$ 1053243 988322 879305 734806 754884 776337 984262 591549 653207 733089 953098
16173I53098m03243J06837J62247k6941n0208j0903K8903J26343r8500Q4570k03746
$$ 953098 549855 656692 818939 791998 741790 730887 759790 886133 787633 872203 668457
16162F68457N8278J01108O737l5273o8641J0017m008l8148l288J34930M842p4022
$$ 668457 726735 827843 834580 799307 730666 740683 736675 698527 695239 830169 835011 760989
16150G60989n1481R9483j07053m044J81387N7492k12877J81302j16325K12882
$$ 760989 709508 808991 701938 697894 879281 936773 723896 905198 788873 1001755
16140A001755k49494o7271L1452Q2232n2694M118q138R876J9725J48J28082k01734
$$ 1001755 752261 684990 716442 798674 745980 750098 741960 751836 771561 771709 899791 698057
16128F98057Q9252j84173r3095L68709j2081J95677k38786J36660O2274k4656
$$ 698057 787309 603136 510041 878750 866669 1062346 823560 960220 1022494 997838
16118I97838j90596m2214K3874J75118N143m60308L08391J72146k58673M9798
$$ 997838 807242 765028 788902 964020 969163 508855 817246 989392 730719 780517
16108G80517J37959k37475K47631N9363K4542k249k10048N4359L6587J85267L9904
$$ 780517 918476 681001 928632 987995 1012537 1010288 800240 854599 891186 1076453 1116357
16097A116357j02241J54476j40001J3614j0633r6924K13549k81345J07214R299
$$ 1116357 1014116 1168592 1028591 1042205 1031572 934648 1148197 866852 974066 983365
16087I83365J93502k51173J16244l7115J74992r2965J63109j43278J00706J27285
$$ 983365 1176867 925694 1041938 1004823 1179815 1086850 1249959 1106681 1207387 1334672
16077A334672k06819J35998J096K3931o6313m2424j11861N2041P2220P9747O0759
$$ 1334672 1127853 1263851 1264947 1288878 1222565 1180141 1068280 1120321 1192541 1272288 1333047
16066A333047O230J41748n3613j39680p1436K38049L9997j58071J17721k0778
$$ 1333047 1339277 1481025 1427412 1287732 1216296 1454345 1494342 1336271 1453992 1433214
16056A433214r0157k2551L96521m92421K41756m3162J68451j15754J33869N1831
$$ 1433214 1343057 1320506 1717027 1224606 1466362 1423200 1591651 1475897 1609766 1661597
16046A661597O2967j29536j14201J69131j21856k0560J8803J1702p2673K42575
$$ 1661597 1724564 1595028 1480827 1649958 1528102 1507542 1526345 1538047 1465374 1707949
16036A707949j78812m6003J31654M4081j09764j2551K63386j62588K42751j74292
$$ 1707949 1529137 1483134 1614788 1658869 1549105 1536554 1799940 1637352 1880103 1705811
16026A705811p614N39k8244j109K62332k66910O7744K41580k58661L17886N30
$$ 1705811 1698197 1698736 1670492 1669383 1931715 1664805 1732549 1974129 1715468 2033354 2033884
16015B033884j5443p1170J76688k94383L92939p7536n6363k75962R6343o8251
$$ 2033884 2018441 1947271 2123959 1829576 2222515 2144979 2088616 1812654 1908997 1840746
16005A840746J69229j43679K31833j83160n4276K01265j03810J68007j33514J28050
$$ 1840746 2009975 1866296 2098129 1914969 1860693 2061958 1958148 2126155 1992641 2120691
15995B120691j46486P6560L562j90433L01005j21587k27628M19621j27269j27447
$$ 2120691 1974205 2050765 2054327 1863894 2164899 2043312 1815684 2235305 2108036 1980589
15985A980589p4680R8026J70695k12351J6295J98998k22555J95030K06082q8395
$$ 1980589 1905909 2003935 2174630 1962279 1978574 2177572 1955017 2150047 2356129 2267734
15975B267734k57542J65761k2363M0156j72750K38689r878j89002L40181j43403
$$ 2267734 2010192 2175953 2153590 2193746 2020996 2259685 2249807 2060805 2400986 2257583
15965B257583j47487j80017K83399K32216k29366m0867J9522J18324j97622K57503
$$ 2257583 2110096 1930079 2213478 2445694 2216328 2175461 2194983 2313307 2115685 2373188
15955B373188l09972K48228j26520q613N8523K34289l45239J32934o3331j9480
$$ 2373188 2063216 2311444 2184924 2176311 2234834 2469123 2123884 2256818 2193487 2174007
15945B174007J05900J80709l9577j19242J63626l59053L97071K2355k03814M05931
$$ 2174007 2279907 2460616 2421039 2301797 2465423 2106370 2503441 2525796 2321982 2727913
15935B727913k76159J7502L53737j76128J03921Q1236K84374l49658N1992P6419
$$ 2727913 2451754 2469256 2822993 2646865 2750786 2832022 3116396 2766738 2818730 2895149
15925B895149K93391l249J89408M6246J34466q3476J87780M90220K8680N04804
$$ 2895149 3188540 3185291 3374699 3420945 3555411 3471935 3659715 4149935 4178615 4683419
15915D683419L09768M26133N31836O98310J201545J483205K274060L073561M448943
$$ 4683419 4993187 5419320 5951156 6649466 7851011 9334216 11608276 14681837 19130780
15906A9130780O214746P018576P819830P697172O287271M250132K315921n84965
$$ 19130780 25345526 32364102 40183932 47881104 54168375 58418507 60734428 60149463
15898F0149463l034975m670459o542475o232790p037394n927679n402769l895437
$$ 60149463 57114488 52444029 45901554 39668764 32631370 26703691 21300922 17405485
15890A7405485l119221k561027k263396j582230j170267r42884q41117m06143
$$ 17405485 14286264 11725237 9461841 7879611 6709344 5766460 4925343 4519200
15882D519200n79965l21775k92237p3348k14317j98414J05328k06930o7976j07580
$$ 4519200 3939235 3617460 3325223 3251875 3037558 2839144 2944472 2737542 2669566 2561986
15872B561986J51247L340j04611J61427j24736J4207j81660P790k69270J84494
$$ 2561986 2713233 2716573 2611962 2773389 2648653 2662860 2481200 2488990 2219720 2404214
15862B404214k02047L18997k58948q875K8435j793j40900K14636p8904k81317
$$ 2404214 2202167 2521164 2262216 2253341 2281776 2279983 2139083 2353719 2274815 1993498
15852A993498J84352o247j36772j34750J35103P9489P4398j36753r2341K10941
$$ 1993498 2177850 2171603 2034831 1900081 2035184 2114673 2189071 2052318 1959977 2170918
15842B170918j86064Q592M0133L45943j52950l2116K05065j09638J22085M7718
$$ 2170918 1984854 1993446 2033579 2379522 2226572 2194456 2399521 2289883 2411968 2459686
15832B459686Q7561j07514N8810j46948k05201J21392r1337O4708J14431J739
$$ 2459686 2547247 2439733 2498543 2351595 2146394 2267786 2176449 2241157 2355588 2357327
15822B357327j28394j48957K50766l05785J94391j79174K00688n5240j25793Q2576
$$ 2357327 2228933 2079976 2330742 2024957 2219348 2040174 2240862 2185622 2059829 2142405
15812B142405J54933M4688J23755l15591K35388J2318K0920J9287J7790J81272
$$ 2142405 2297338 2342026 2465781 2150190 2385578 2397896 2418816 2438103 2455893 2637165
15802B637165m4324l9562j49707K35254K1559j882J32982j36218J10812J94193
$$ 2637165 2592841 2553279 2403572 2638826 2660385 2658503 2791485 2655267 2766079 2960272
15792B960272l7037K47139j97391M32539n9660K0283K1287N565R9712M9200J6793
$$ 2960272 2923235 3170374 2972983 3405522 3345862 3366145 3387432 3392997 3492709 3541909 3558702
15781C558702K12673L49790j01244L13988j28374R0583O7641K22231j51224j3269
$$ 3558702 3771375 4121165 4019921 4333909 4205535 4296118 4363759 4585990 4434766 4421497
15771D421497K46946j57962p4320j63285J47782L7525j167J59806J45784l8251
$$ 4421497 4668443 4510481 4436161 4272876 4420658 4458183 4457016 4616822 4762606 4724355
15761D724355K70297o2730n7286o1323k27905L51183j47230R0514k00747O2739
$$ 4724355 4994652 4931922 4874636 4813313 4585408 4936591 4789361 4879875 4679128 4741867
15751D741867K4266K27964O141l9203J05801K2494J07455N18959q2555K25326
$$ 4741867 4766133 4994097 5000238 4961035 5066836 5089330 5196785 5715744 5633189 5858515
15741E858515n84R0838K41851L50380J52461M7997N6744K8699K0578J4271M3532
$$ 5858515 5857931 5948769 6190620 6541000 6693461 6741458 6798202 6826901 6847479 6861750 6905282
15730F905282j18416M60711J15383P636m686J39918j20157j8920l31610k44405
$$ 6905282 6786866 7247577 7362960 7370596 7365910 7505828 7385671 7366751 7035141 6790736
15720F790736O0563l81574J19913j96918R4794K09002J79961l25350J32628k9681
$$ 6790736 6851299 6469725 6589638 6392720 6487514 6696516 6876477 6551127 6683755 6654074
15710F654074j31929l35o4460Q755l1907J94234K69325K03419K542K82895K75291
$$ 6654074 6522145 6521810 6457350 6466105 6434198 6628432 6897757 7101176 7103718 7386613 7661904
15699G661904K0282N31533n6025J56590j1245J79017J73902n0548N263K50873
$$ 7661904 7682186 8213719 8157694 8314284 8303039 8482056 8655958 8605410 8610673 8861546
15689H861546k25548M6416l08462j08025j82236K75227p6830J23617N2671P3816
$$ 8861546 8635998 8682414 8373952 8265927 8083691 8358918 8282088 8405705 8458376 8532192
15679H532192k38864n4610l309k83009R1981l97717j19604j70269m13114K74956
$$ 8532192 8293328 8238718 8235409 7952400 8044381 7646664 7527060 7356791 6943677 7218633
15669G218633j6358j93890j17834N05840l15015J04639K78904J26023J98364K7648
$$ 7218633 7202275 7008385 6890551 7396391 7081376 7186015 7464919 7590942 7789306 7816954
15659G816954M59454K59456L48201N78682L18192N93604M35374O35146N45018
$$ 7816954 8276408 8535864 8884065 9462747 9780939 10374543 10809917 11445063 11990081
15650A1990081M39373Q54203P98144M91653M49341N77407M62626N01666L66800
$$ 11990081 12429454 13283657 14081801 14573454 15022795 15600202 16062828 16564494 16931294
15641A6931294P64376O57334P28775Q06263J234697N40784N29955O87945L87208
$$ 16931294 17695670 18353004 19081779 19888042 21122739 21663523 22193478 22881423 23268631
15632B3268631j27636o5141l42360K5132n22936J72074l35549O5247J25472o2858
$$ 23268631 23140995 23075854 22733494 22758626 22235690 22407764 22072215 22137462 22262934 22200076
15622B2200076j73699k09576m57605o07768o62852j065171p87448r32108p80078
$$ 22200076 22026377 21816801 21359196 20751428 20088576 19023405 18235957 17303849 16523771
15613A6523771p45337r03083n82870k72643k46657n24785k21567o81029k68412
$$ 16523771 15778434 14875351 14292481 14019838 13773181 13248396 13026829 12345800 12077388
15604A2077388k19551n64768k85210m16567m7188j69100j25603k20810k17220
$$ 12077388 11857837 11293069 11007859 10591292 10544104 10375004 10249401 10028591 9811371
15595I811371P3788K07191L08982M36917J174829K054202M870424R370188J5033892
$$ 9811371 9885159 10092350 10401332 10838249 12013078 14067280 18937704 28307892 43341784
15586D3341784J5458688J0275497O312366K819403J74871m092342r105608j0982365
$$ 43341784 58800472 69075969 75388335 78207738 78382609 74290267 65184659 54202294
15578E4202294j0298779j0165241q142670m794133m015936k613987k352968j196081
$$ 54202294 43903515 33738274 25595604 20801471 16785535 14171548 11818580 10622499
15570A0622499j020145n02739k71098k34733N8361R3960j55766K07315m7341J88457
$$ 10622499 9602354 9099615 8828517 8593784 8652145 8746105 8590339 8797654 8750313 8938770
15560H938770K62171M99508M15081Q85932J708628L946980P600342J3884389K0952342
$$ 8938770 9200941 9700449 10115530 11001462 12710090 16657070 24257412 38141801 59094143
15551E9094143J8717939J1503680P177648K560125j404404o942355j3545429j3978754
$$ 59094143 77812082 89315762 96493410 99053535 97649131 90706776 77161347 63182593
15543F3182593j3479371j3284807r053371o092135m390735l333397k647774j775577
$$ 63182593 49703222 36418415 27365044 21272909 16882174 13548777 10901003 9125426
15535I125426j031413p17463n20423k96166n18414j9308l67905j62997j20928
$$ 9125426 8094013 7376550 6856127 6559961 6041547 6022239 5654334 5491337 5370409
15526E370409m13275N0568k33866J07241m68922j86349K6598R2980j59831K2165
$$ 5370409 4957134 5007702 4773836 4881077 4412155 4225806 4252404 4345384 4185553 4207718
15516D207718j27714J67868P0887j48385K20731N0552J2448Q9140N8009J04457
$$ 4207718 4080004 4247872 4318759 4170374 4391105 4441657 4454105 4543245 4601254 4705711
15506D705711N9611L5680j88116J01686o5260r1980M1930k43115j35627M3748
$$ 4705711 4765322 4801002 4612886 4714572 4649312 4557332 4599262 4356147 4220520 4264268
15496D264268P9703k04286K44928k25823L36305J78098k07830K73981l36161l2261
$$ 4264268 4343971 4139685 4384613 4158790 4495095 4673193 4465363 4739344 4403183 4370922
15486D370922M76789k63328K95306L54641L00298L08619J70946P4628J34952K59934
$$ 4370922 4847711 4584383 4879689 5234330 5534628 5843247 6014193 6088821 6223773 6483707
15476F483707j69314q6584Q4546O1365K31528j87472Q05303P72715O90629P71557
$$ 6483707 6314393 6227809 6312355 6373720 6605248 6417776 7223079 7995794 8686423 9457980
15466I457980O78538K23379M43248j8284n2159m97165k04411n99976k64490j30409
$$ 9457980 10136518 10359897 10803145 10784861 10732702 10235537 10031126 9431150 9166660 9036251
15456I036251O320M63815N59842M88233M43869P87430K85216o3574k92775j25741
$$ 9036251 9042571 9506386 10066228 10554461 10998330 11785760 12070976 12007402 11714627 11588886
15446A1588886o66197n33977n73589l56960k02825l58766K81881J01694R1008
$$ 11588886 10922689 10388712 9815123 9458163 9255338 8896572 9178453 9280147 9371155
15437I371155K68436K19171m88466J78202m20856q6309m35023k89906l97382j07018
$$ 9371155 9639591 9858762 9370296 9548498 9127642 9041333 8606310 8316404 7919022 7812004
15427G812004n13914L7374k99590L1200j10705j20133k75744l34569j57399M3567
$$ 7812004 7298090 7335464 7035874 7067074 6956369 6836236 6560492 6225923 6068524 6112091
15417F112091k62415o1894l39877R360k6970j0263n52343M52378j74063N1429
$$ 6112091 5849676 5787782 5447905 5457265 5430295 5420032 4867689 5320067 5146004 5197433
15407E197433k03682M61345j54869p2307J91680o6771P1510j2178L61238J27737
$$ 5197433 4993751 5455096 5300227 5227920 5419600 5352829 5424339 5412161 5773399 5901136
15397E901136K03693k54402J64173L82056l27007L79092p7550j65721P0696l7854
$$ 5901136 6104829 5850427 6014600 6396656 6069649 6448741 6371191 6205470 6276166 6238312
15387F238312J4362R1598K73551j00321J54611K07305k84913R8581J57102l6451
$$ 6238312 6252674 6344272 6617823 6517502 6672113 6879418 6594505 6693086 6850188 6813737
15377F813737J82077R3828k47121q1048k3803J28016q328k04243Q489L15903j88101
$$ 6813737 6995814 7089642 6842521 6761473 6737670 6865686 6857358 6653115 6661604 6977507 6789406
15366F789406J60209K70553R9326j88643K96109L17397J79613j19510J73037L25354
$$ 6789406 6949615 7220168 7319494 7130851 7426960 7744357 7923970 7804460 7977497 8302851
15356H302851R675J43227J52778J57140J54780K58392M01565N91802J080152J774809
$$ 8302851 8312526 8455753 8608531 8765671 8920451 9178843 9580408 10172210 11252362 13027171
15346A3027171L679384N947476Q442583P764738O141135L556962J574798j07711
$$ 13027171 16706555 22654031 31096614 38861352 45002487 48559449 50134247 50026536
15338E0026536k860710n081222n449366n505244m868973l771240k402031j493556
$$ 50026536 47165826 42084604 36635238 31129994 26261021 22489781 20087750 18594194
15330A8594194j239075j004106r27178p34043n41965n04507o64621j84235l4798
$$ 18594194 17355119 16351013 15423835 14689792 14147827 13643320 12978699 12794464 12759666
15321A2759666O6748J45375K81906M83799J82548N58274J626650K506909N280120
$$ 12759666 12826414 12971789 13253695 13737494 13920042 14478316 16104966 18611875 23891995
15312B3891995Q690406J3121413J4939043J3155590R280289N263391J177349k978143
$$ 23891995 32582401 45703814 60642857 73798447 83078736 88342127 89519476 86541333
15304H6541333p647482j0084536j1440719j1659506r501462p090163n508245l563006
$$ 86541333 78893851 68809315 57368596 45709090 36207628 29117465 23609220 20046214
15296B0046214k783459j604595j586995q01223J19212l29687k21078k36478j45209
$$ 20046214 17262755 15658160 14071165 13269942 13389154 13059467 12838389 12601911 12456702
15287A2456702j08281j70401l29512p597l5700L82670L44904R62960K173826L560877
$$ 12456702 12348421 12178020 11848508 11840911 11805211 12187881 12532785 13495745 15669571 19230448
15277A9230448O317287Q355656O865154M776225K680308R65050j095284l491453
$$ 19230448 25547735 33903391 40768545 45544770 48225078 49190128 48094844 44603391
15269D4603391m915336n737213n677024n134586l491136k415590j943866j684067
$$ 44603391 39688055 33950842 28273818 23139232 19648096 17232506 15288640 13604573
15261A3604573j510286j077536q05845q14332l41527l132J20529K142k7868K96595
$$ 13604573 12094287 11016751 10210906 9396574 9055047 9051915 9172444 9174586 9146718 9443313
15251I443313J68367K49677M27593l35394L32515l30761Q4188k67925l29815l69906
$$ 9443313 9611680 9861357 10288950 9953556 10286071 9955310 10039498 9771573 9441758 9071852
15241I071852j91567k16124L4802m39823P6701K21338M45566j9216R56844K33633
$$ 9071852 8880285 8664161 8698963 8259140 8335841 8557179 9002745 8983529 9940373 10174006
15231A0174006O74473M32497R1758j64342j40258k04328j82091m23205j37921
$$ 10174006 10848479 11280976 11372734 11208392 11068134 10863806 10681715 10258510 10120589
15222A0120589l87179l70288k7011l27472j0408K75800L5009K21639L07831N61066
$$ 10120589 9733410 9363122 9336111 9008639 8998231 9274031 9309040 9530679 9838510 10399576
15212A0399576K48387J22479O5751K63075n24299l46725o85184m01997m68909
$$ 10399576 10647963 10770442 10836193 11099268 10574969 10228244 9543060 9141063 8672154
15203H672154k21145m08748m19224m47897R3141l52125k99402l74461J28080k26714
$$ 8672154 8451009 8042261 7623037 7175140 7268281 6916156 6616754 6242293 6370373 6143659
15193F143659L36665n14931M85947J50337r74L61775n9591K92358M1379k6017
$$ 6143659 6480324 5965393 6451340 6601677 6600703 6962478 6902887 7195245 7236624 7210607
15183G210607M612k04228J27460n1676K72183J08112K37814J47218J32474j0216
$$ 7210607 7215219 7010991 7138451 7086775 7358958 7467070 7704884 7852102 7984576 7974360
15173G974360J29880r9246J09186J40445l52515J00944j09036K35319k03382j37860
$$ 7974360 8104240 8004994 8114180 8254625 7902110 8003054 7894018 8129337 7925955 7788095
15163G788095K25710j88086R9305J13926K11407J37332p8126O31792j37288N3975
$$ 7788095 8013805 7825719 7925024 8038950 8250357 8387689 8309563 8941355 8804067 8858042
15153H858042n956J6150r3155J74780j69376k11463l9598L55287m62616j53679
$$ 8858042 8852086 8868236 8775081 8949861 8780485 8569022 8529424 8884711 8422095 8268416
15143H268416J81110n9820j16490J65702J4101l87311N03627k22795q7198J46001
$$ 8268416 8449526 8389706 8273216 8438918 8453019 8065708 8569335 8346540 8259342 8405343
15133H405343j31113j38285k03159L40099r7429J4357p0682O6623j54627j0495
$$ 8405343 8274230 8135945 7932786 8272885 8175456 8189813 8119131 8185754 8031127 8020632
15123H020632J23743j17128N4323j75404o8141K8662O5919k66748m4065O7410
$$ 8020632 8144375 8027247 8081570 7906166 7838025 7866687 7932606 7665858 7621793 7689203
15113G689203N399Q0018o4204k87764N58700j69151m6327J91141M8234J06137
$$ 7689203 7694602 7774620 7710416 7422652 7981352 7812201 7765874 7957015 8005249 8111386
15103H111386Q6722K64529J2925K51545K86191L25102K09604L05020k4309N53809
$$ 8111386 8198108 8462637 8475562 8727107 9013298 9338400 9548004 9853024 9828715 10382524
15093A0382524P4184P12036O93550J078621J395684L034319L194818L182616K037469
$$ 10382524 10456708 11168744 11862294 12940915 14336599 17370918 20565736 23748352 25785821
15084B5785821J413942Q13408L2100q65544j858862j440689j604235j122872n48240
$$ 25785821 27199763 28013171 28045271 27179727 25320865 23880176 22275941 21153069 20604829
15075B0604829J88256K062174K614904L114345K192782J460898R65886j17168
$$ 20604829 20793085 22855259 25470163 28584508 30777290 32238188 33204074 33086906
15067C3086906n68690j362209j453738j229388Q58819K637406N122708M450320
$$ 33086906 32518216 31156007 29702269 28472881 29331700 31969106 37091814 41542134
15059D1542134K642014K252304J861617R00924J89977o47851p27723p97807j261853
$$ 41542134 44184148 46436452 48298069 49198993 49388970 48741119 48013396 47215589 45953736
15050D5953736N67424R58359K396132L018599K645513J781352J085328K15306
$$ 45953736 46521160 47479519 49875651 52894250 55539763 57321115 58406443 58621749
15042E8621749N49164K0648p23644j123373k025730k241699j960770j919458j607317
$$ 58621749 59170913 59191561 58467917 57344544 55318814 53077115 51116345 49196887 47589570
15033D7589570j983601j699114j353801q1722J823028M119197M922211M389272
$$ 47589570 45605969 43906855 42553054 42471332 44294360 48413557 53335768 57725040
15025E7725040M076776M012906L765649L486901K105938K237873K300931K455703
$$ 57725040 61801816 65814722 69580371 73067272 75173210 77411083 79712014 82167717
15017H2167717M039655M556515O070969O330660N393361L268447J356502n91953
$$ 82167717 86207372 90763887 96834856 103165516 108558877 111827324 113183826 112591873
15009A12591873k453279m565474o153427p056785p643591o754141o495792n427821
$$ 112591873 110138594 105573120 99419693 92362908 84719317 77965176 71469384 66041563
15001F6041563m076047l321737k163805r10328j14829N99919P11738M12624k91080
$$ 66041563 61965516 58643779 56479974 55569646 55454817 56054736 56766474 57179098 56888018
14992E6888018m68783j125610j932877k526911k442319j629152p25844O35030
$$ 56888018 56419235 55293625 53360748 50833837 48391518 46762366 46036522 46671552
14984D6671552O69598O68906O44623O39794J75470p01013j920181k764137k950186
$$ 46671552 47341150 48010056 48654679 49294473 49469943 48768930 46848749 44084612 41134426
14975D1134426l327515l064568k943032k061729j560860j706515p26505k05265
$$ 41134426 37806911 34742343 31799311 29737582 28176722 26470207 25743702 25538437
14967B5538437k17543J25882N7863L81232N79414O36669Q87961P93227J168893
$$ 25538437 25320894 25446776 25504639 25885871 26465285 27101954 27989915 28783142 29952035
14958B9952035J603332K842364M350153O334797R265134J2947031J7752583K2883603
$$ 29952035 31555367 34397731 38747884 45082681 54347815 67294846 85047429 107931032
14950A07931032K6739375K9282061L2648547L4329253L2570824L0491485K7854908
$$ 107931032 134670407 163952468 196601015 230930268 263501092 293992577 321847485
14943C21847485K2030567J0662760k665463j3209108j8651081k1620446k4928614
$$ 321847485 343878052 354540812 351875349 338666241 320015160 298394714 273466100
14936B73466100k4910776k3501278k1011744j7685874j3837232j1585044j1280421
$$ 273466100 248555324 225054046 204042302 186356428 172519196 160934152 149653731
14929A49653731j1489352j1936430j1057176j1138452r649405p488128n986767
$$ 149653731 138164379 126227949 115170773 104032321 94382916 86894788 80908021
14922H0908021k344029l10461q15788k028768k843229l374409n071698o598924
$$ 80908021 78563992 78253531 77437743 75408975 72565746 69191337 64119639 57520715
14914E7520715p612073p632047o952099o380892m572324l540200k576832j962496
$$ 57520715 49908642 42276595 35324496 28943604 24371280 20831080 18254248 16291752
14906A6291752j367000p30135j39143L17563N03098L78179P90618J414206J178522
$$ 16291752 14924752 14194617 14055474 14373037 14876135 15254314 16044932 17459138 18637660
14897A8637660J131813J821320K869524M662397N876948N439883M117953K245594
$$ 18637660 19769473 21590793 24460317 29122714 34999662 40439545 44557498 46803092
14889D6803092N82286q53428k524731l698018n026359m966528m519221l392405
$$ 46803092 47385378 46531950 44007219 40309201 35282842 30316314 25797093 22404688
14881B2404688k623485j766397j198965o17787p25484K32906K91364O48325R83690
$$ 22404688 19781203 18014806 16815841 16198054 15472570 15705476 15996840 16645165 17628855
14872A7628855J159341O14204J70334Q4811L82060O359j82471o2833l35942J92998
$$ 17628855 18788196 19402400 19572734 19657545 20039605 20045964 19863493 19800660 19464718 19657716
14862A9657716N25950R20439K030060L009799N640463Q411757J0290874J0350169
$$ 19657716 20183666 21104105 23134165 26143964 31784427 40196184 50487058 60837227
14854F0837227J0596990J0203321P195831K897332j216230n029762o770000r395899
$$ 60837227 71434217 81637538 88833369 91730701 90514471 85484709 78714709 69318810
14846F9318810r686640r837579q684104p053511n496541l853812k944798k045563
$$ 69318810 59632170 49794591 41110487 34056976 28560435 24706623 21761825 19716262
14838A9716262j316037j287381q92766l99899n92915l34987m13376j44468K57540
$$ 19716262 18400225 17112844 16220078 15820179 15227264 14892277 14478901 14334433 14591973
14829A4591973j17426K38155N54974M12855O45380O99059P27570J075785J316322
$$ 14591973 14474547 14712702 15267676 15680531 16325911 17024970 17752540 18828325 20144647
14820B0144647K572123M793289P266925R096528Q378928O839469L579590J022529
$$ 20144647 22716770 27510059 34776984 43873512 52252440 59091909 62671499 63694028
14812F3694028j529787l906119o162337p970986p442439o814718n892432l881231
$$ 63694028 62164241 58258122 52095785 44124799 36682360 29867642 23975210 20093979
14804B0093979k873677j919160j407104j170375m93772n67482n27810j31990m28995
$$ 20093979 17220302 15301142 13894038 12723663 12229891 11662409 11134599 11002609 10573614
14795A0573614l84188j28403n41004l79076k60199m34948l05133L4543J23364
$$ 10573614 10189426 10061023 9520019 9140943 8880744 8445796 8140663 8175206 8298570
14786H298570l07771j8917L22860j72410J43358L35734L06098N05820K39367J307310
$$ 8298570 7990799 7971882 8294742 8122332 8265690 8601424 8907522 9413342 9652709 10960019
14776A0960019Q70369O50007K84300P3393p6073o29317n31298p33489l88941r95043
$$ 10960019 11830388 12480395 12764695 12838088 12762015 12132698 11601400 10867911 10478970 9483927
14766I483927n09149l51628K8662j92958m02K73181J76557k2421J01163K29268
$$ 9483927 8974778 8623150 8651812 8458854 8458452 8731633 8908190 8885769 8986932 9216200
14756I216200K84474K42736K2770K28244K3943L74072p8187K85728J09993j92730
$$ 9216200 9500674 9743410 9766180 9994424 10018367 10392439 10314252 10599980 10709973 10517243
14746A0517243L48465n5759L67098j47300L21857L49593J23578P75793O08634
$$ 10517243 10865708 10809949 11177047 11029747 11351604 11701197 11824775 12600568 13209202
14737A3209202J088849J686289J385510K820737K980795M639310P298896J0815141
$$ 13209202 14298051 15984340 17369850 20190587 23171382 27810692 35109588 45924729
14729D5924729J7430652K6721176L4391239L8123608L7425726L2138953K1871992
$$ 45924729 63355381 90076557 124467796 162591404 200017130 232156083 254028075
14722B54028075Q982436m026260j5697442k4522345l0924819l3577058l0967596
$$ 254028075 263010511 258984251 243286809 218764464 187839645 154262587 123294991
14715A23294991k6656088k1903057j6659905j2096310r100087o161940n007685
$$ 123294991 96638903 74735846 58075941 45979631 36879544 30717604 25709919
14708B5709919l707445k581412k238285j835702j096594j285629j003623o73861
$$ 25709919 22002474 19421062 17182777 15347075 14250481 12964852 11961229 11287368
14700A1287368j093895q53422l63374n90944n75535o0557l05613L00476J94953
$$ 11287368 10193473 9340051 8976677 8385733 7810198 7749641 7444028 7744504 7939457
14691G939457L35119n8089r5917K8610J48545k27453j59074N9958k89460K79417
$$ 7939457 8274576 8216487 8120570 8149180 8297725 8070272 7911198 7971156 7681696 7961113
14681G961113L33579r5829L24781K48020o6322P53636O23571J065143O89211J19164
$$ 7961113 8294692 8198863 8523644 8771664 8705342 9458978 10082549 11147692 11836903 11956067
14671A1956067L58973k71048k42923o82117j237927r80330k78400r4577L19786
$$ 11956067 12315040 12043992 11801069 11118952 9881025 8900695 8622295 8527718 8847504
14662H847504M34804J14170j77443j31479J34375o31705n85125l61087n75713
$$ 8847504 9282308 9396478 9219035 9087556 9221931 8590226 8005101 7644014 7068301
14653G068301n70372j93109m3483j67639L0725J12573K67325P44374L78574M10866
$$ 7068301 6497929 6304820 6261337 6093698 6124423 6236996 6504321 7248695 7627269 8038135
14643H038135L86652P5422J23877J34907l67815j93890K57891K48695M80888L87302
$$ 8038135 8424787 8500209 8624086 8758993 8391178 8197288 8455179 8703874 9184762 9572064
14633I572064N06020M89374L0072l89663k88408r20816p41891j041426p15444
$$ 9572064 10078084 10567458 10597530 10207867 9919459 8998643 8256752 7215326 6499882
14624F499882m07508r40336j07912j38799l22563N0462j69877l8530j03539N813
$$ 6499882 6092374 5152038 5044126 4905327 4582764 4633226 4463349 4424819 4321280 4327093
14614D327093q3049K44333n1490o0698J14891j20759J9940k51674j82652J88008
$$ 4327093 4244044 4488377 4436887 4376189 4491080 4370321 4390261 4138587 3955935 4143943
14604D143943k73345j42335O036J28558M0699N38778N38141Q91202O18075R79752
$$ 4143943 3870598 3728263 3734299 3862857 3903556 4442334 4980475 5871677 6489752 7469504
14594G469504K42981J04572j28078P680n86630q94390o25702n49907n21560k52516
$$ 7469504 7712485 7817057 7688979 7696659 7110029 6215639 5589937 5040030 4518470 4265954
14584D265954q3415l15972K787N2358L2445M0405J05746k22240J34792p8216J81320
$$ 4265954 4182539 3866567 3869354 3921712 3954157 3994562 4100308 3878068 4012860 3934644 4115964
14573D115964J43827J47343k50275L53064J78280J53744L27174P72167J382260
$$ 4115964 4259791 4407134 4156859 4509923 4688203 4841947 5169121 5941288 7323548
14564G323548R08317L47724J091093Q13781J802606K745712N508261Q167316R475714
$$ 7323548 8231865 8579589 9670682 10484463 12287069 15032781 20541042 28708358 38184072
14555C8184072O308375M521415K074775L09663k184095m764062o494195o070969
$$ 38184072 44492447 49013862 51088637 51398300 49214205 44450143 37955948 31884979
14547C1884979o018106m224204k154149M42983K968082O930836R355127Q566721
$$ 31884979 25866873 21642669 19488520 19931503 22899585 29830421 39185548 47752269
14539D7752269O071498L505149J011726j516679m009842o616475p664126p031856
$$ 47752269 53823767 57328916 58340642 56823963 52814121 46197646 38533520 31501664
14531C1501664o728189m277129k696569j553308j079521p81607k77280o33312
$$ 31501664 24773475 20496346 17799777 16246469 15166948 14385341 14108061 13474749
14523A3474749k90224j98458j32582M60395K458992M477131O936095O396360M485872
$$ 13474749 13184525 12986067 12853485 13313880 15772872 20250003 27186098 33582458 38068330
14514C8068330K889250J019389k55306j878918l882966m276358l878090l436561
$$ 38068330 40957580 41976969 41721663 39842745 35959779 31683421 27805331 24368770
14506B4368770j840388p23065J478579K656601N310516O113764M282108K458932
$$ 24368770 22528382 21805317 23283896 25940497 31251013 37364777 41646885 44105817
14498D4105817J207132j16242j903509l662925n091345m625444m382601l772382
$$ 44105817 45312949 45196707 43293198 39630273 34538928 29913484 25530883 21758501
14490B1758501k764769k139530k018085j319696k220210r63175j758437j165535
$$ 21758501 18993732 16854202 14836117 13516421 11296211 10333036 8574599 7409064
14482G409064r01601q09601n83117l08949k87122j33387l0960k44893l647L0717
$$ 7409064 6507463 5697862 5114745 4805796 4518674 4385287 4354327 4109434 4105787 4136504
14472D136504r2524n1305M31688O86112P37913Q1988N69757K13430K1048j36094
$$ 4136504 4043980 3992675 4424363 5110475 5848388 5930376 6500133 6713563 6734611 6598517
14462F598517m48627k10800P4447K77772J47439O71599O01594J27056N77643j45028
$$ 6598517 6149890 5939090 6013537 6291309 6438748 7110347 7711941 7838997 8416640 8271612
14452H271612l9590n08736m86108l57800o12068j89736o2687J55165L26504k1587
$$ 8271612 8232022 7723286 7237178 6879378 6267310 6077574 6014887 6170052 6496556 6474969
14442F474969K40964M14009Q6309K22299M8873K85693K57267o2713K34192J54873
$$ 6474969 6715933 7129942 7216251 7438550 7487423 7773116 8030383 7967670 8201862 8356735
14432H356735M42931M15304R62889J546237K199772M571131N761313O407047O592392
$$ 8356735 8799666 9214970 10177859 11724096 13923868 18494999 24256312 30663359 37255751
14423C7255751N110241K902364J651304o57520k355294m103839m846473m988727
$$ 37255751 42365992 45268356 46919660 46262140 43906846 39803007 34956534 29967807
14415B9967807m777412l995714l596235k512996k055696j670043r32650q10261
$$ 29967807 25190395 21194681 17598446 15085450 13029754 11359711 10427061 9616800
14407I616800o84556l02260n11694m2396J25759l71575q7521J28813L10238q3155
$$ 9616800 8932244 8629984 8118290 8075894 8201653 7830078 7742557 7871370 8181608 8098453
14397H098453L35415O21724Q38065J208403K213095L764020N386252Q084423J0450007
$$ 8098453 8433868 9055592 9893657 11102060 13315155 17079175 22465427 30549850 40999857
14388D0999857J1240412J0053336P698841M389493J417242k396604n517070p851194
$$ 40999857 52240269 62293605 69992446 74381939 75799181 73402577 67885507 60034313
14380F0034313r013586q509916q208780o839374n379899l693416l183791k288187
$$ 60034313 51020727 42510811 34302031 27462657 22082758 18389342 15205551 12917364
14372A2917364j779628p83281p02121r06557k53497m33413J1916m85858j95560
$$ 12917364 11137736 10354455 9652334 8745777 8492280 8058867 8070783 7584925 7389365
14363G389365P9255k32627K76057K69644K89253M87978Q07244J325270K291366
$$ 7389365 7468620 7235993 7512050 7781694 8070947 8558925 9366169 10691439 12982805
14354A2982805K670524L568690M620633M835607M087285K928842K262222O33749
$$ 12982805 15653329 19222019 23842652 28678259 32765544 35694386 37956608 38590357
14346C8590357j030024k084955k691869l125407k789763k127418r51551K1513
$$ 38590357 37560333 35475378 32783509 29658102 26868339 24740921 23789370 23810883
14338B3810883J201929K770180M628909P385506J0449705J2256685J2106841J1119085
$$ 23810883 25012812 27782992 32411901 39797407 50247112 62503797 74610638 85729723
14330H5729723Q957217O059444K489156k018465n167072p949749j0499868j0981873
$$ 85729723 94686940 100746384 103235540 101217075 96050003 88100254 77600386 66618513
14322F6618513j0738998r368771q251778o875617n153261m515416l696422k752653
$$ 66618513 55879515 46510744 38258966 31383349 26230088 21714672 18018250 15265597
14314A5265597j937893j911586j329780r77364q53783o94102p75320j20109q43075
$$ 15265597 13327704 11416118 10086338 9108974 8255191 7561089 6785769 6665660 5822585
14305E822585k15635m50240o2566m97733l96537J3842j80144j93957P0166k66428
$$ 5822585 5606950 5156710 5094144 4596411 4199874 4213716 4033572 3839615 3909781 3643353
14295C643353j88352K2797p8489k64249j80508j27597k9393r6358M0966M7017
$$ 3643353 3455001 3477798 3399309 3135060 2954552 2826955 2797562 2701204 2742170 2789187
14285B789187k97156M01464j55428L1457N4426N1536m8987N6050k38783J63696
$$ 2789187 2492031 2893495 2738067 2769524 2823950 2875486 2826499 2882549 2643766 2807462
14275B807462J12418J36474j03017Q9787n1560K8949N6655j67050k35832j00265
$$ 2807462 2919880 3056354 2953337 3043124 2991564 3020513 3077168 2910118 2674286 2574021
14265B574021J56340j18612l57978L33331Q4803n9119k02388o9630n3366L1137
$$ 2574021 2730361 2611749 2253771 2587102 2671905 2612786 2410398 2340768 2287402 2318539
14255B318539l92876L45870J0044l02460L31846j22062K1220j3911j5585k47771
$$ 2318539 1925663 2271533 2281577 1979117 2310963 2188901 2210121 2196210 2180625 1932854
14245A932854J95399J4090J04542l21275O4834J82463l73276L58758q1876K17066
$$ 1932854 2128253 2142343 2246885 1925610 1990444 2172907 1799631 2158389 2076513 2293579
14235B293579j00586P5514l41442L02628j77966J66414j96767j3547J08162l24637
$$ 2293579 2192993 2268507 1927065 2229693 2051727 2218141 2021374 2007827 2115989 1791352
14225A791352L44044l34958J15283k2572k27o5808n3795J07981J1617K25896L9187
$$ 1791352 2135396 1800438 1915721 1893149 1892922 1827114 1773319 1881300 1892917 2118813 2158000
14214B158000J91320m6361K01831J06968j96710n6033J94960L41764P54136M37872
$$ 2158000 2349320 2302959 2504790 2611758 2415048 2359015 2553975 2895739 3649875 4087747
14204D087747J87183Q626K52237m3342k75067n40603m28552m83357l06120q0012
$$ 4087747 4274930 4283556 4535793 4492451 4217384 3676781 3248229 2764872 2458752 2378740
14194B378740k33500K7293l4504j01031j6260P5776k8943J72727j34688j44897
$$ 2378740 2145240 2172533 2138029 2036998 2020738 2096514 2067571 2240298 2105610 1960713
14184A960713J23817k23099J38556n7169P5481J12887R6923K32975L7228L88933
$$ 1960713 2084530 1861431 1999987 1942818 2018299 2131186 2228109 2461084 2498312 2887245
14174B887245P4551K7590J22874l99572k1345j63738q5889k37457j01780k24317
$$ 2887245 2961796 2989386 3112260 2712688 2691343 2527605 2441716 2204259 2102479 1878162
14164A878162O001n5893K4517R7922J1071k49519N8349K64490K47589j13007J35805
$$ 1878162 1884163 1828270 1852787 1950709 1961780 1712261 1770610 2035100 2282689 2169682 2305487
14153B305487k9975N5761K8564j05999k5744j8484J22777j78363K79464o5709
$$ 2305487 2275512 2331273 2359837 2253838 2228094 2209610 2332387 2154024 2433488 2367779
14143B367779L25509N20569l9919O08537Q31600J309873J471792R34273O35679
$$ 2367779 2693288 3213857 3173938 3782475 4614075 5923948 7395740 8330013 8965692
14134H965692Q29527N7729j57435m96465j007170p30180j290279o91387p83903
$$ 8965692 9795219 9852948 9695513 9199048 8191878 7461698 6171419 5480032 4696129
14125D696129o06278k52612m92010K4377l64533K57968J88764M44981l0072J19074
$$ 4696129 4089851 3837239 3345229 3369606 3005073 3263041 3451805 3896786 3866714 3985788
14115C985788J80024k56316N8677k43445j77871m28487j69461M0227r0678j79332
$$ 3985788 4165812 3909496 3968173 3724728 3546857 3118370 2948909 2989136 2898458 2719126
14105B719126K1320q5265J37146p7734O6847r3465L95776j20511M87043O50248
$$ 2719126 2740446 2655181 2792327 2714593 2781440 2687975 3083751 2963240 3450283 4100531
14095D100531L65415M92878o997M92987M5796l27874m0585l25965l27224r4009
$$ 4100531 4465946 4958824 4951827 5444814 5490610 5162736 5122151 4796186 4468962 4374953
14085D374953N027M2748M26480N60182L52447O26852K31807K16658J35603q9101
$$ 4374953 4379980 4422728 4849208 5409390 5761837 6388689 6620496 6837154 6972757 6883656
14075F883656k10j45787o9717J10630R7249K84834L29994N33186O78152Q18344
$$ 6883656 6883446 6737659 6667942 6778572 6875821 7160655 7490649 8023835 8701987 9520331
14065I520331J230760J433911J726814K218471L130494M137974N608818P395908
$$ 9520331 10751091 12185002 13911816 16130287 19260781 23398755 29007573 36403481
14057C6403481R297755J1490574J1422213J0772818Q125010N090588K207862j623337
$$ 36403481 45701236 57191810 68614023 79386841 87511851 92602439 94810301 93186964
14049I3186964m877359p351196r998487j0371174r874716q642801o555980n909361
$$ 93186964 88309605 80958409 70959922 60588748 50714032 42071231 35515251 29605890
14041B9605890m638190l609623l056240k046285k272543j700117j653751j281914
$$ 29605890 24967700 21358077 18301837 16255552 13983009 12282892 10629141 9347227
14033I347227r66816p65850q96994o17374k06436n15520m45528q8580k38709l26552
$$ 9347227 8380411 7614561 6717567 6100193 5893757 5378237 4932709 4844129 4605420 4278868
14023D278868l74495l5895j57100m5250j35068K1567l07251j7930k33424p7894
$$ 4278868 3904373 3868478 3711378 3666128 3531060 3552627 3245376 3227446 2994022 2916128
14013B916128M6997j31046j8953J7906j32997q1492J09972j41403r7561J0831
$$ 2916128 2963125 2832079 2813126 2831032 2698035 2616543 2726515 2585112 2487551 2498382
14003B498382l67641K88842r8599J76378m22832L20078r7339K38307j25015J9575
$$ 2498382 2130741 2419583 2320984 2497362 2074530 2394608 2297269 2535576 2410561 2430136
13993B430136j3501J73899J31742Q6348K95229K8475O34814N84192O51820J320685
$$ 2430136 2416635 2590534 2722276 2808624 3103853 3132328 3767142 4351334 5003154 6323839
13983F323839J155475Q50970R97349P66081K84157p9243l78944o05682q81696
$$ 6323839 7479314 8330284 9327633 10093714 10377871 10298628 9919684 9314002 8432306
13974H432306j192396q46363q69121p06991n25603j99838n28353k67023J9232
$$ 8432306 7239910 6393547 5524426 4817435 4291832 4091994 3563641 3296618 3315850
13965C315850j67299j25957k9262k95661J97233N7677k97189k55154j27319N6556
$$ 3315850 3148551 3022594 2993332 2697671 2894904 2952581 2655392 2400238 2272919 2329475
13955B329475n7957j685k84293N8167J63871l4700K96534r3263M77232J21363
$$ 2329475 2271518 2269833 1985540 2043707 2207578 2172878 2469412 2376149 2853381 2974744
13945B974744L16786k58835L54585Q1449M83706O18356J511828J997284K475090
$$ 2974744 3291530 3032695 3387280 3468729 3952435 4570791 6082619 8079903 10554993
13936A0554993K622007K775449K433594J963042N24989k88104j367155j763655
$$ 10554993 13177000 15952449 18386043 20349085 20874074 20585970 19218815 17455160
13928A7455160k146358k796187k491410j872531j738697j358251r81328n06044
$$ 17455160 15308802 12512615 10021205 8148674 6409977 5051726 4070398 3564354
13920C564354p13115l11981j74288j25191k05150l73812L20079k19325j54503
$$ 3564354 2851239 2539258 2364970 2239779 2034629 1660817 1980896 1761571 1607068
13911A607068L32036j36303j99567k9004M23p7136O7864l33885K58699l638K00231
$$ 1607068 1939104 1802801 1603234 1574230 1574653 1497517 1565381 1231496 1490195 1486557 1686788
13900A686788m61469J87225k2525m5599j14957L15517R3881j63013J33480K0491
$$ 1686788 1225319 1412544 1390019 1344420 1229463 1544980 1638861 1475848 1609328 1629819
13890A629819k42854K32625j80489J2676L08309l13393J2172J01336k56958J45976
$$ 1629819 1386965 1619590 1439101 1451777 1760086 1446693 1458865 1560201 1303243 1449219
13880A449219j10308J11318m199L5244Q983j13910K983k6951L81742m04548K50432
$$ 1449219 1338911 1450229 1446030 1481274 1490257 1376347 1379330 1352379 1734121 1329573 1580005
13869A580005m8745j93334J8152J97891J01081n1489k44859L94435k28764J59454
$$ 1580005 1531260 1337926 1356078 1553969 1655050 1603561 1358702 1753137 1524373 1683827
13859A683827l6283k7348J29149j53021J38293O9052k4341j56686l0772n7121
$$ 1683827 1647544 1620196 1749345 1596324 1734617 1803669 1779328 1622642 1591870 1534749
13849A534749N139P4818J32772l03997L37337n2466k58663J07296J39964J20753
$$ 1534749 1539888 1614706 1747478 1443481 1780818 1728352 1469689 1576985 1716949 1837702
13839A837702k47922k21046K456J53740j53666R8533j07587R2626m2375k5552
$$ 1837702 1589780 1368734 1371190 1524930 1371264 1469797 1362210 1454836 1412461 1386909
13829A386909O3699l7433Q4186o0863j09294K60104m38035K56729J28089k12361
$$ 1386909 1450608 1413175 1497361 1436498 1327204 1587308 1149273 1406002 1534091 1321730
13819A321730j12950K13609m20133K37586N5524L1494P9961m9193j08266n4347
$$ 1321730 1208780 1422389 1002256 1239842 1295366 1326860 1406821 1357628 1249362 1195015
13809A195015J8068O1036k24490N81354l40340j55025J09380K21442P0480j196
$$ 1195015 1213083 1274119 1049629 1630983 1290643 1135618 1244998 1466440 1536920 1535724
13799A535724r6073K4024L03858l06181n7218M4245j01020O9161j15564J07701
$$ 1535724 1439651 1463675 1767533 1461352 1404134 1448379 1347359 1416520 1300956 1408657
13789A408657L0363k31281L48903j01394r545J488k78489J83045j23842m9259
$$ 1408657 1439020 1207739 1556642 1455248 1445703 1447191 1168702 1351747 1227905 1178646
13779A178646J85295l00983K2725K26300j2215J89610J36248K5585j13305Q4299
$$ 1178646 1363941 1062958 1085683 1311983 1299768 1489378 1625626 1651211 1537906 1622205
13769A622205j85962M69539r2389P8004q0461P4261m7872j49630K23217k17820
$$ 1622205 1436243 1905782 1813393 1891397 1810936 1885197 1837325 1687695 1910912 1693092
13759A693092q4225m1660J37972j84710m3161j25352J07620l9691L6617K29624
$$ 1693092 1608867 1567207 1705179 1520469 1477308 1351956 1459576 1419885 1456502 1686126
13749A686126k51989j23125J82265k4947J8650n0611j4695J81228j22396K8968
$$ 1686126 1434137 1311012 1493277 1468330 1486980 1436369 1421674 1602902 1480506 1509474
13739A509474J28759m9003J685L5427j20377R0054l5157J96142j40614J19208
$$ 1509474 1638233 1589230 1590915 1626342 1505965 1596019 1560862 1757004 1616390 1735598
13729A735598j80017J68754j60198Q2850J8559J7407L6837j41724K26691N7114
$$ 1735598 1555581 1724335 1564137 1646987 1665546 1682953 1719790 1578066 1804757 1861871
13719A861871j99034K49773l01688K04323j00299N6590o024J53587M3527J30900
$$ 1861871 1662837 1912610 1610922 1815245 1714946 1771536 1765512 1919099 1962626 2093526
13709B093526l41183K74787p207L879K08776j54083l8560O3276O5583k90740O9852
$$ 2093526 1752343 2027130 2019923 2023802 2232578 2078495 2039935 2103211 2168794 1878054 1947906
13698A947906j45346j9218J49962J91087Q7267J34575K6682R0712L79241l81561
$$ 1947906 1802560 1783342 1933304 2124391 2211658 2346233 2372915 2463627 2842868 2461307
13688B461307K88121l09705L8089j11304j52282k03927K95413m57561J38314P304
$$ 2461307 2749428 2439723 2477812 2366508 2214226 2010299 2305712 1848151 1986465 1993769
13678A993769k86003J01575L52039j85061k26660J77791j86143J55723j3043M8293
$$ 1993769 1707766 1809341 2161380 1976319 1749659 1927450 1741307 1897030 1883987 1932280
13668A932280J25867n5049J25051K91375P9625J32476J71482K86213j05971j92669
$$ 1932280 2058147 2003098 2128149 2419524 2499149 2631625 2803107 3089320 2983349 2790680
13658B790680J14436N7914k28334j12696n0415l30656L20232l60990j50875j47199
$$ 2790680 2905116 2963030 2734696 2622000 2571585 2240929 2561161 2200171 2049296 1902097
13648A902097K06662J2910j33837l47194L60269J8086N4578j49755p6917P9936
$$ 1902097 2108759 2121669 1987832 1640638 2000907 2018993 2073571 1923816 1846899 1926835
13638A926835n3428L60172k35399P7995K76197J24293k4140L83438o6596n7090
$$ 1926835 1873407 2233579 1998180 2076175 2352372 2476665 2452525 2835963 2769367 2712277
13628B712277P7129j30896r687m79705N7659k96637K10805l77700j50027J64888
$$ 2712277 2789406 2658510 2648823 2169118 2226777 1930140 2140945 1763245 1613218 1778106
13618A778106r978J39795l3343J40255j13365q9934K10614k1685o2546K8568K02431
$$ 1778106 1768128 1907923 1874580 2014835 1901470 1811536 2022150 2000465 1937919 1966487 2168918
13607B168918j48647K71115l14560J25062J01371l4415q4425l0593l5913j23711
$$ 2168918 2020271 2291386 1976826 2101888 2203259 2168844 2084419 2053826 2017913 1894202
13597A894202j6084R8280k39327K31830J7653J36584p8764J91416m07554K23025
$$ 1894202 1878118 1976398 1737071 1968901 1986554 2123138 2044374 2235790 1828236 2051261
13587B051261K4654M4329j3645j45521j84721K76123k34144r687j89257J47407
$$ 2051261 2075915 2120244 2106599 1961078 1776357 2052480 1818336 1808649 1619392 1766799
13577A766799J5679k70152J49965P4083l07369K23125j13623M4462N018K06542
$$ 1766799 1782478 1512326 1662291 1736374 1429005 1652130 1538507 1582969 1587987 1794529
13567A794529j93548R4681j0921j60569J12966o6248Q7291o1762Q780l8763l9455
$$ 1794529 1600981 1695662 1684741 1524172 1637138 1570890 1658181 1596419 1605199 1566436 1526981
13556A526981K00249j47268K8766J21o139N1386k85045N0804K75689n3618k38355
$$ 1526981 1727230 1579962 1608728 1608849 1602710 1654096 1369051 1419855 1695544 1641926 1403571
13545A403571K92973J54353r682K32683K04168n3464M15945l4836K1191l91647
$$ 1403571 1696544 1850897 1841215 2073898 2278066 2224602 2640547 2605711 2626902 2235255
13535B235255O8038j25757r350k21783l05072J89625n9147J29814k96760J79117
$$ 2235255 2303293 2177536 2168186 1946403 1641331 1830956 1771809 1901623 1604863 1783980
13525A783980J41592L17463J96654l0499j3961J15456j13786n8355m91378j01673
$$ 1783980 1925572 2243035 2439689 2409190 2395229 2510685 2396899 2338544 1847166 1745493
13515A745493J76716k01165k17556j18727M3173j47773K50576j48263J94617k71512
$$ 1745493 1922209 1721044 1503488 1384761 1427934 1280161 1530737 1382474 1577091 1305579
13505A305579L9038M7898o2798J06402j52215J15231r9753K9730J11921j75099
$$ 1305579 1344617 1392515 1329717 1436119 1283904 1399135 1299382 1329112 1441033 1265934
13495A265934O975K12541k05026k2680J33014R4345k64246K86727j52019j9113
$$ 1265934 1272909 1485450 1280424 1257744 1390758 1485103 1220857 1507584 1355565 1336452
13485A336452J2029r8239R7552m40J96538k7845m5209N6885j15901k06075K22867
$$ 1336452 1348481 1250242 1347794 1347354 1543892 1516047 1470838 1527723 1411822 1205747 1428614
13474A428614K19105k65069J10961R020q6816o5322j84389L21771o783k82353
$$ 1428614 1647719 1382650 1493611 1502631 1415815 1350493 1166104 1487875 1481092 1198739
13464A198739K21362j52050J20299n6150P6571Q0719m8315j66315J35272J79151
$$ 1198739 1420101 1268051 1388350 1332200 1408771 1489490 1441175 1274860 1410132 1589283
13454A589283j72635L52041L3011K78618P6437K36961L15795k02652J25859l08341
$$ 1589283 1416648 1768689 1801700 2080318 2156755 2393716 2709511 2506859 2632718 2324377
13444B324377N3545q3990k50202j99253k0582q4479r5288r2785j94990K17835
$$ 2324377 2377922 2293932 2043730 1844477 1823895 1739416 1644128 1551343 1356353 1574188
13434A574188k5599j0310R1996Q8058k31638J7822j05875K9768K35244j17158
$$ 1574188 1548589 1538279 1630275 1718333 1486695 1504517 1398642 1428410 1663654 1546496
13424A546496P2375K08787N2967L84580L7463J87754J00988M5903M2612j73867
$$ 1546496 1618871 1827658 1880625 2265205 2302668 2490422 2591410 2637313 2679925 2506058
13414B506058o9135k44142K5385k79366K70948k98525j34009j78116K79244l60044
$$ 2506058 2436923 2192781 2218166 1938800 2209748 1911223 1777214 1599098 1878342 1518298
13404A518298K02188j12387j75219J33755j67599J66061M3492O1136J3059J35553
$$ 1518298 1720486 1608099 1432880 1566635 1399036 1565097 1608589 1669725 1682784 1818337
13394A818337K1128l24897N04219j04460R9704J11406m9077J33540Q4324l0116
$$ 1818337 1839465 1514568 2018787 1914327 2014031 2125437 2076360 2209900 2294224 2264108
13384B264108j21410M93276R3394j35277P4821k54557K88189j16770k87258J74671
$$ 2264108 2142698 2635974 2729368 2594091 2668912 2414355 2702544 2585774 2298516 2473187
13374B473187j43468k01507R0564o8846j32360q6586K06137r5706K15451J18464
$$ 2473187 2329719 2128212 2218776 2149930 2017570 1930984 2137121 2041415 2256866 2375330
13364B375330P0898Q2501o02385K09206l0995J45337J87729j84559l3009K9911
$$ 2375330 2446228 2528729 1926344 2135550 2104555 2249892 2437621 2253062 2220053 2249964
13354B249964l0137K55962K3895J17920j05924m4650J56285R5370l54075m9156
$$ 2249964 2219827 2475789 2499684 2617604 2511680 2467030 2623315 2718685 2364610 2315454
13344B315454J47440j5061j98288J50218K093k39078L9358Q5898n0416P6528k40848
$$ 2315454 2462894 2447833 2249545 2399763 2401856 2162778 2202136 2288034 2237618 2314146 2073298
13333B073298K27147p7438M3607j3693K1246n140M52661l40504O4737K09137l20171
$$ 2073298 2300445 2223007 2266614 2252921 2274167 2269027 2721688 2381184 2445921 2655058 2334887
13322B334887J36675k00857J92373J69505j57285K22570k3956J07369M6797J2631
$$ 2334887 2471562 2270705 2463078 2632583 2475298 2697868 2673912 2781281 2828078 2840709
13312B840709K42719J64574m0764J23720K13624j85394j76424K52690m61158L25187
$$ 2840709 3083428 3248002 3207238 3330958 3544582 3359188 3182764 3435454 2974296 3299483
13302C299483k31984J86714j67071K04054Q6687N2031J02921J31530N1737L41002
$$ 3299483 3067499 3254213 3087142 3291196 3377883 3429914 3532835 3664365 3716102 4057104
13292D057104j58908N7754k05206j24439K1601j38579J80192K1328R301n6968
$$ 4057104 3898196 3955950 3750744 3626305 3647906 3509327 3689519 3710847 3720148 3663180
13282C663180O8885m4172J86071Q9435n0674m0682J83785k63671K85675o6760
$$ 3663180 3732065 3687893 3873964 3963399 3912725 3872043 4055828 3792157 4077832 4011072
13272D011072N7771Q7695J12947J40055J011j7133L19910Q5569k73106K86865
$$ 4011072 4068843 4156538 4269485 4409540 4410551 4393418 4713328 4798897 4525791 4812656
13262D812656Q0203J40036P445q1366M00392k2256K77762m9760M9436K60166M45557
$$ 4812656 4892859 5032895 5040340 4958974 5359366 5337110 5614872 5565112 5614548 5874714 6320271
13251F320271J18633J11461J45640K52734M31037J35159K48435J16171J06361
$$ 6320271 6438904 6550365 6696005 6948739 7379776 7514935 7763370 7879541 7985902
13242G985902L54464j29266L66527o6933R9104J64376K09523m82096J80868K97961
$$ 7985902 8340366 8211100 8577627 8510694 8609798 8774174 8983697 8501601 8682469 8980430
13232H980430k4174L28392J60409J85276L56603J97532L55267N20359J08837L93126
$$ 8980430 8956256 9284648 9445057 9630333 9986936 10184468 10539735 11060094 11168931 11562057
13222A1562057K87535L07347J07538M60311r3682K98458j43792r5334N0059o5485
$$ 11562057 11849592 12156939 12264477 12724788 12631106 12929564 12785772 12690438 12740497 12675012
13212A2675012m87670j677j28605l64225M596o42280R0053k83641j82954o2879
$$ 12675012 12187342 12185665 12057060 11692835 11697431 11055151 11145204 10861563 10678609 10615730
13202A0615730l71945K55702q8769k47488K37894j64910N8338O4657k68612k42242
$$ 10615730 10243785 10499487 10410718 10163230 10401124 10236214 10294552 10359209 10090597 9848355
13192I848355j4059k93699j1740l94350n00732j88534j75724k95970k02182l91409
$$ 9848355 9834296 9540597 9528857 9134507 8633775 8445241 8269517 7973547 7771365 7379956
13182G379956N152n63849q2546n7483k70516l03115j09594k9383l53486l63743
$$ 7379956 7385108 6821259 6738713 6681230 6410714 6107599 5998005 5968622 5615136 5251393
13172E251393K99395J14550k96348r3037J12848j86256J43313k56079P5981J46377
$$ 5251393 5550788 5665338 5368990 5275953 5388801 5202545 5345858 5089779 5165760 5312137
13162E312137K10108J48939K6358Q4084L19324J42147L67138J288L1826J50261
$$ 5312137 5522245 5671184 5697542 5781626 6100950 6243097 6610235 6611523 6643349 6793610
13152F793610L9728m61198K04915l13592J35531j65469J63471k49720L63404j64524
$$ 6793610 6833338 6372140 6577055 6263463 6398994 6233525 6396996 6147276 6510680 6346156
13142F346156J5130m36932j26477J39203l02910l21464R584n48628j0458k66271
$$ 6346156 6361286 5924354 5797877 5937080 5634170 5312706 5322290 4773662 4763204 4496933
13132D496933n2503m72518o7221j5789J04207j57986J65343n3369J10350j33762
$$ 4496933 4444430 3971912 3904691 3888902 3993109 3835123 4000466 3947097 4057447 3923685
13122C923685J11919r6399k04895L376l10318K00557k60641P0525n2998m8947
$$ 3923685 4035604 3939205 3734310 3737686 3427368 3627925 3367284 3437809 3384811 3335864
13112C335864q8367l0005j48184j4836J98023j8114J24887p4253L0930J03345
$$ 3335864 3247497 3217492 3069308 3054472 3252495 3234381 3359268 3285015 3315945 3419290
13102C419290K4009J39561J7899K64922L79341K90118L40711K20641L67521J07637
$$ 3419290 3443299 3582860 3600759 3865681 4245022 4535140 4875851 5096492 5464013 5571650
13092E571650K59496K79151J40697J86899j63872j49730M8503L45627o03137K46226
$$ 5571650 5831146 6110297 6250994 6437893 6274021 6124291 6172794 6518421 5915284 6161510
13082F161510j71770J90625N5240M9872n86310j00157k29903l40596j88896m28968
$$ 6161510 5989740 6180365 6235605 6285477 5699167 5599010 5369107 5028511 4839615 4410647
13072D410647j76655k50429L035k82370j54603R2749l26989K26391l28255J46328
$$ 4410647 4233992 3983563 3986598 3704228 3549625 3642374 3315385 3541776 3213521 3359849
13062C359849n4593R84Q777J90308j52084K17840o4510l3298J91212Q733J1280
$$ 3359849 3305256 3306240 3315017 3505325 3353241 3571081 3506571 3473273 3664485 3673218 3684498
13051C684498j70630p2903K76477r0885j15406K658L01801k11671o1640j12103
$$ 3684498 3513868 3440965 3717442 3626557 3511151 3513809 3815610 3603939 3542299 3430196
13041C430196M6195P0875R9228q9231K55060O1769r5650J60634j23830J38038
$$ 3430196 3476391 3547266 3646494 3557263 3812323 3874092 3778442 3939076 3815246 3953284
13031C953284O0711Q4860k3266J69204r1935o4331J66232P7149p7141J86058L00166
$$ 3953284 4013995 4098855 4075589 4244793 4152858 4088527 4254759 4331908 4254767 4440825 4740991
13020D740991m90050M40999j77870J31418J4314L4347r8658J88565P5168J08908
$$ 4740991 4250941 4691940 4514070 4645488 4659802 4694149 4595491 4784056 4859224 4968132
13010D968132K2103j11254M88279l57056K81853L2683J3622K12770k20489R208
$$ 4968132 4990235 4878981 5367260 5010204 5292057 5324740 5338362 5551132 5330643 5339851
13000E339851J01830K3179O9428J3680Q0282n2337K12414L621K4317L5389K72995
$$ 5339851 5441681 5464860 5534288 5547968 5628250 5575913 5788327 5791948 5816265 5851654 6124649
12989F124649r1480J69256k40607r3811L60541k23601l16427J77012L6735j3551
$$ 6124649 6033169 6202425 5961818 5868007 6228548 6004947 5688520 5865532 5902267 5888716
12979E888716R508J14466l2339o9455K7320l2788k74570o3156q9501K8311L8011
$$ 5888716 5898224 6012690 5980351 5910896 5938216 5905428 5630858 5567702 5478201 5506512 5544523
12968E544523l0580k40060q7754l2859O2374j3802J1329l9793O1399M0738j41737
$$ 5544523 5513943 5273883 5186129 5153270 5215644 5201842 5213171 5173378 5234777 5275515 5133778
12957E133778o1727r194J83957Q8464L3657j01677n1784k0723M2993P7443r0609
$$ 5133778 5072051 5062857 5246814 5335278 5368935 5267258 5215474 5194751 5237744 5315187 5224578
12946E224578R0601j98172K48832o2985k64521O1307J03085M684o621j44610j22236
$$ 5224578 5315179 5117007 5365839 5302854 5038333 5099640 5202725 5207409 5200788 5056178 4933942
12935D933942J58031L6271O2695K78662k75156J30901K7622j60817J66493k04550
$$ 4933942 5091973 5128244 5190939 5469601 5194445 5325346 5352968 5192151 5358644 5154094
12925E154094K62838j30748k88203O8293p0635l843j4599j8589J10440r8497k18196
$$ 5154094 5416932 5286184 4997981 5066274 4995639 4991796 4977197 4958608 5069048 4970551 4752355
12914D752355n2371O425l49451o9443j49304m7721M2030r1584l6543J73656k77547
$$ 4752355 4699984 4706409 4356958 4287515 4138211 4090490 4132520 4040936 4004393 4178049 3900502
12903C900502k67154K44369j68033l3120k33536J75831j9827k345j32423k99772
$$ 3900502 3633348 3877717 3709684 3676564 3443028 3618859 3599032 3596687 3464264 3164492
12893C164492K01381j40116J21989M6309M3837k92320N666J51298o021o8631J47929
$$ 3164492 3365873 3225757 3347746 3394055 3437892 3145572 3151238 3302536 3296515 3227884 3375813
12882C375813n1953j89938J0712L73483r9843j9651l44162K67095j38163j85218
$$ 3375813 3323860 3133922 3144634 3518117 3418274 3398623 3054461 3321556 3183393 2998175
12872B998175K41133j69019k8676r6289O4776j95600K4930r6683L21779k64213
$$ 2998175 3239308 3070289 3041613 2945324 3010100 2814500 2839430 2742747 3064526 2800313
12862B800313J80515K301k42538J62527j84685L16742j68919J88902r0203Q4610
$$ 2800313 2980828 2983129 2740591 2903118 2718433 3035175 2866256 3055158 2964955 3049565
12852C049565p7131Q3915j7595J00939l91242p5091L11559j96767p900M736J25977
$$ 3049565 2972434 3056349 3038754 3139693 2748451 2673360 2984919 2788152 2780252 2784988 2910965
12841B910965p6059R2799l5034k69225J20554l19392K65500M15579l46736J05005
$$ 2910965 2834906 2927705 2892671 2623446 2744000 2424608 2690108 3105687 2758951 2863956
12831B863956j27765K26938j26668j4500j93718J26929r265K1038J05323P764
$$ 2863956 2736191 2963129 2836461 2821961 2628243 2755172 2745907 2766945 2872268 2880032
12821B880032P0251p0270M556J13691k12607J54017j27901Q0038j62099j29594
$$ 2880032 2950283 2880013 2884569 2998260 2785653 2939670 2811769 2891807 2729708 2600114
12811B600114L63968l75655K61059K7262k14291J89337j73160R2796p3384K19669
$$ 2600114 2964082 2588427 2849486 2876748 2662457 2851794 2678634 2771430 2698046 2917715
12801B917715j01101m254K37154j62595k9259J58926n5250j90031l4955L00532
$$ 2917715 2816614 2812360 3049514 2886919 2857660 3016586 2961336 2771305 2736350 3036882
12791C036882j83431J33135l6834J57479k87258O8524p5400J92901L7460o6451
$$ 3036882 2853451 2986586 2949752 3107231 2819973 2888497 2813097 3005998 3043458 2977007
12781B977007J7619j31894r2906K26270j8838k2202j14167K32045K7787j49712
$$ 2977007 2994626 2862732 2769826 2996096 2977258 2955056 2840889 3072934 3100721 2951009
12771B951009o3647L46827l20922L26235p8235m6595k12363Q3845n2447n4103
$$ 2951009 2887362 3234189 2913267 3239502 3161267 3114672 2902309 2986154 2933707 2879604
12761B879604p0028M71929j33556j22728J67885j98905K24702O5884l00494J84924
$$ 2879604 2809576 3281505 3147949 3025221 3193106 2994201 3218903 3284787 2984293 3169217
12751C169217j15164J16219j96526J7639J50576j20069k0703K8624J41907J71017
$$ 3169217 3054053 3170272 2973746 2991385 3141961 3021892 3001189 3029813 3171720 3342737
12741C342737m83737L75717j06402j0709m9935J6636K28260k623r5717K9560k18133
$$ 3342737 2859000 3234717 3128315 3117606 3067671 3084307 3312567 3309944 3214227 3243787 3025654
12730C025654M0821J83626P2452j62960J10116j2846j55639J99223m1387l676
$$ 3025654 3066475 3250101 3322553 3159593 3269709 3256863 3101224 3300447 3259060 3255384
12720C255384p2526j16533K29128J30812o0632j76278p6259M5579J12905J02039
$$ 3255384 3182858 3066325 3295453 3426265 3365633 3189355 3113096 3158675 3271580 3373619
12710C373619m8824K4492K45713k07135Q8879K72925l38695L63965j28716K14508
$$ 3373619 3324795 3349287 3595000 3387865 3476744 3749669 3410974 3774939 3646223 3860731
12700C860731L01785j24201k9938K30378k41111L77248N8534O3819J85631M05461
$$ 3860731 4162516 4038315 4008377 4238755 3997644 4374892 4433426 4497245 4682876 5088337
12690E088337L10327K01825M54111M95496O06683p4688L58981j56780j33954l06738
$$ 5088337 5398664 5600489 6054600 6550096 7156779 7082091 7441072 7284292 7150338 6843600
12680F843600m59711l77759n66694J0372p66444J32364j59901n0597o9572m24364
$$ 6843600 6383889 6006130 5439436 5449808 4683364 4815728 4655827 4605230 4535658 4111294
12670D111294M90967P809L3150j5423m4120M60360j92676J32802P1848N5806k03924
$$ 4111294 4602261 4610070 4643220 4627797 4583677 5044037 4851361 4984163 5056011 5111817 4907893
12659D907893K618J42796j31336j2727J15845j9671K1701P8679N13722j837M7297
$$ 4907893 4910511 5053307 4921971 4909244 5025089 5005418 5027119 5105798 5619520 5617683 5664980
12648E664980M85186n8268q1167J40804k24720J89658R4653N4370J23443N6366
$$ 5664980 6150166 6091898 6010731 6151535 5926815 6116473 6211126 6265496 6388939 6445305
12638F445305r6753K3124K24065j16932K56731J33675l0149J20073m1914J11219
$$ 6445305 6348552 6371676 6595741 6478809 6735540 6869215 6839066 6959139 6917225 7028444
12628G028444l0772J48481k02041j53029L36400m12239j07708j30668k04216j75665
$$ 7028444 6997672 7146153 6944112 6791083 7127483 6715244 6607536 6476868 6272652 6096987
12618F096987m38885j45041L3018k27875k43058L2839M1666J81503O10042N07163
$$ 6096987 5658102 5513061 5546079 5318204 5075146 5107985 5149651 5331154 5941196 6448359
12608F448359P52744L05158M29129N08671J69977L54562R0479j56103n28421n27156
$$ 6448359 7201103 7506261 7935390 8444061 8614038 8968600 9059079 8902976 8374555 7847399
12598G847399j41621n62552n47785o35243k30501k70579N0120l1851j11079J65493
$$ 7847399 7705778 7143226 6595441 5960198 5729697 5459118 5509238 5477387 5366308 5531801
12588E531801K15038J51687M4621K7149k3264m6813r2040L967Q6950K55053K11201
$$ 5531801 5746839 5898526 5943147 5970296 5947032 5900219 5808179 5812146 5899096 6154149 6365350
12577F365350K57437L77197L19815L65674k29306l71890M8254l99445l43424l24298
$$ 6365350 6622787 6999984 7319799 7685473 7456167 7084277 7132531 6733086 6389662 6065364
12567F065364n31859k4526j88168l19769L5315M0859j24478K14796l681j46450
$$ 6065364 5533505 5508979 5320811 5001042 5036357 5077216 4952738 5167534 5163853 5017403
12557E017403K61693J2611j97237p8601J89747R404k90569o9163K55162m6489
$$ 5017403 5279096 5291707 5094470 5015869 5205616 5215020 4924451 4855288 5110450 5063961
12547E063961K53308k91356K28458J87404j55615j92600J47675M04487J37270
$$ 5063961 5317269 5025913 5254371 5441775 5286160 5093560 5241235 5645722 5782992
12538E782992K70457k59468J71467J36623q1068M7852k57427m08873J35040k47142
$$ 5782992 6053449 5793981 5965448 6102071 6021003 6068855 5811428 5402555 5537595 5290453
12528E290453l9234n988l940J16453o0852O3149l2602J19263r5871R6210J09989
$$ 5290453 5251219 5245231 5241291 5357744 5296892 5360041 5327439 5446702 5350831 5447041 5557030
12517E557030r1248N796J06460K35881K59530k1873K73815L84404O90127m3485
$$ 5557030 5465782 5471578 5578038 5813919 6073449 6051576 6325391 6709795 7399922 7356437
12507G356437O6387J32016L24121m46811l83120j32931j99505l03543k6089k41881
$$ 7356437 7422824 7554840 7878961 7432150 7049030 6916099 6716594 6413051 6386962 6145081
12497F145081j63619O8N567r8596J99015o2506l0773J3482n6408J96171J40035
$$ 6145081 5981462 5981530 5987097 5888501 6087516 6025010 5994237 6007719 5951311 6147482 6287517
12486F287517P2055k44026L7653Q5756K39437J75252K79971L82991j75280K8515
$$ 6287517 6359572 6115546 6153199 6238955 6478392 6653644 6933615 7316606 7141326 7169841
12476G169841K2392K19649l32267K4668j44386k58086r8498j79520K77326j43453
$$ 7169841 7192233 7411882 7079615 7104283 6959897 6701811 6603313 6423793 6701119 6557666
12466F557666P6131j18134O8391J22896J14464J41714M1809J43229J93949O7840
$$ 6557666 6633797 6515663 6584054 6706950 6821414 6963128 7004937 7148166 7342115 7409955
12456G409955m7918L65175K2487L19541N0139K86214K40066J31998M73486P4542
$$ 7409955 7362037 7727212 7749699 8069240 8119379 8405593 8645659 8777657 9251143 9325685
12446I325685K82080N66632L69446L10735L75581N57267K11524J93718L47905
$$ 9325685 9607765 10174397 10543843 10854578 11230159 11787426 11998950 12192668 12540573
12437A2540573J57521N4900M7044n4455J22275K55359j20595n8957k7983M6211
$$ 12540573 12698094 12752994 12800038 12745583 12867858 13123217 13002622 12943665 12915682 12961893
12427A2961893L48656q5927l9344M22362L6646P5851K90013K53468N34697K40970
$$ 12961893 13310549 13224622 13185278 13607640 13644286 13720137 14010150 14263618 14798315 15039285
12417A5039285O45431K58640Q00925P52835P41855O77231O56580K39380J99770
$$ 15039285 15684716 15943356 16744281 17497116 18238971 18916202 19572782 19812162 20011932
12408B0011932M64919k14842J91433j20183m69283j94518k50003o66120l22210
$$ 20011932 20476851 20262009 20453442 20333259 19863976 19669458 19419455 18753335 18431125
12399A8431125m17373r063n00301m32790j77059m46955Q1534j74860o7410N32988
$$ 18431125 18013752 18004689 17504388 17071598 16894539 16447584 16529118 16354258 16286848 16819836
12389A6819836k48190K26542P25380J94151L36118K23480M30974O06996q3215
$$ 16819836 16571646 16798188 17523568 17717719 18053837 18277317 18708291 19315287 19232072
12380A9232072K72065K44473K4051N1948R6493p0914J8855m14635J73426m94455
$$ 19232072 19504137 19748610 19772661 19824609 19921102 19850188 19869043 19454408 19627834 19133379
12370A9133379k62604K5502m62180j31073k63930j28723l09820k40598p662k14547
$$ 19133379 18870775 18896277 18434097 18303024 18039094 17910371 17600551 17359953 17352291 17137744
12360A7137744l17474k87133k48034k0473k04016j96785r9989j54670Q0931n51798
$$ 17137744 16820270 16533137 16285103 16264630 16060614 15863829 15763840 15609170 15690101 15138303
12350A5138303l584k00646k10135k75692o5848k84189J60371l95978J16749Q6956
$$ 15138303 15134719 14934073 14723938 14448246 14382398 14098209 14258580 13862602 13979351 14066307
12340A4066307j5157M3481L24331J27995K70286L21765K85670L11673K22437J23212
$$ 14066307 14051150 14094631 14418962 14546957 14817243 15139008 15424678 15736351 15958788 16082000
12330A6082000L82075M62528M93916r0901L22128K61279L39624L6246K73052M3164
$$ 16082000 16464075 16926603 17420519 17329618 17651746 17913025 18252649 18288895 18561947 18605111
12320A8605111K00268O4148k37558N27802k22425J28959l23433J28067l2432Q3250
$$ 18605111 18805379 18869527 18631969 19159771 18937346 19066305 18742872 18870939 18838507 18921757
12310A8921757J63182J93274J62560L64270J06298N29465N0433L43097J76565
$$ 18921757 19084939 19278213 19440773 19805043 19911341 20440806 20491239 20834336 21010901
12301B1010901L08826K34664j43308p0696j78895l06198p18002k68575k43296
$$ 21010901 21319727 21554391 21411083 21340387 21161492 20855294 20137292 19868717 19625421
12292A9625421n38840k45021j80863m91268L1229j97430l82368m56079k78054
$$ 19625421 19086581 18841560 18660697 18169429 18200658 18003228 17620860 17164781 16886727
12283A6886727l97741n25720m87305m43000n13925k78820m48504m14336l36796
$$ 16886727 16488986 15963266 15475961 15032961 14519036 14240216 13791712 13377376 13040580
12274A3040580j16292q5556k73436j86201m00051L31906Q0773l35199j94532J62808
$$ 13040580 12924288 12838732 12565296 12379095 11979044 12310950 12391723 12056524 11861992 12024800
12264A2024800j63074O4117L1668j85932K63151J06629m31664J08489J30260J58606
$$ 12024800 11861726 11925843 11957511 11771579 12034730 12141359 11709695 11818184 11948444 12107050
12254A2107050J88479K85975K26470L61781O86768P23527O21417P24079O86927
$$ 12107050 12295529 12581504 12807974 13169755 13856523 14580050 15201467 15925546 16612473
12245A6612473J098812J080124J036470R52664O51413M50670N17253K85318m7581
$$ 16612473 17711285 18791409 19827879 20780543 21431956 21882626 22399879 22685197 22637616
12236B2637616L07250l34821K4759k30158k32683J49870r2794l30817k11073l11934
$$ 22637616 22944866 22610045 22634804 22404646 22171963 22321833 22229039 21898222 21687149 21375215
12226B1375215m63678r31642r61691p27600o81011q32194p68017q78192r82753
$$ 21375215 20911537 19979895 19018204 18290604 17609593 16777399 16009382 15131190 14148437
12217A4148437o52184l11459l86541l66595k88072j04987m19477k24567j56238
$$ 14148437 13496253 13184794 12798253 12431658 12143586 12038599 11619122 11394555 11238317
12208A1238317n35687p9106j76458l76456k28411J13436j30112j64983P6315J53906
$$ 11238317 10702630 10623524 10447066 10070610 9842199 9955635 9825523 9660540 9736855 9890761
12198I890761j47447l5766J3535Q559j49968J7776J91927J37809J43312K38036
$$ 9890761 9743314 9707548 9721083 9729642 9579674 9597450 9789377 9927186 10070498 10308534
12188A0308534J6934J83624L37359q3158N07784j22123K92708L35444j51469L48925
$$ 10308534 10325468 10509092 10846451 10763293 11271077 11148954 11441662 11777106 11625637 11974562
12178A1974562P5791o1713j80057J73733k26953k2981J19530j11169K1108P0324
$$ 11974562 12050353 11988640 11808583 11982316 11755363 11732382 11851912 11740743 11761851 11832175
12168A1832175K51969k32784N49438p4894J44075L25566L22064K54755P45114
$$ 11832175 12084144 11851360 12400798 12325904 12469979 12795545 13117609 13372364 14117478
12159A4117478N84636N23959K68518N98111J10004k94845N1066m76719j38176
$$ 14117478 14702114 15226073 15494591 16092702 16202706 15907861 15958927 15482208 15344032
12150A5344032j15207j04909L92427M53969L52283K91254M54891L44519L11854
$$ 15344032 15228825 15123916 15516343 15970312 16322595 16613849 17068740 17413259 17725113
12141A7725113N58674K20118O46796L16612L49905M90858P15853R56549J026929
$$ 17725113 18283787 18503905 19150701 19467313 19817218 20308076 21023929 21980478 23007407
12132B3007407J050614J399553J545654J850358J489494J989818J920237J633046
$$ 23007407 24058021 25457574 27003228 28853586 30343080 32332898 34253135 35886181
12124C5886181J603593J380023Q70045R42431N11470n843L9970K12697p472l10353
$$ 35886181 37489774 38869797 39739842 40682273 41193743 41187900 41227870 41440567 41433095 41122742
12114D1122742r2834n61050l18557m39724j27327m85338k8535m18463K59012j97250
$$ 41122742 41029908 40468858 40150301 39710577 39583250 39097912 39069377 38650914 38909926 38712676
12104C8712676j36415J44057J54716L92770O78685L46981P42080l89769j35678
$$ 38712676 38576261 38720318 38875034 39267804 39946489 40293470 41035550 40645781 40510103
12095D0510103j65378m90417j191174o50519q96494p76497k50925j80859J90219
$$ 40510103 40344725 39854308 38663134 38012615 37116121 36339624 36088699 35907840 36098059
12086C6098059R95743M19113M99495P40039M28374Q40108k10473L50679q172l4022
$$ 36098059 37093802 37512915 38012410 38752449 39180823 40020931 39810458 40161137 40152965 40118943
12076D0118943M2298K11494k26590N7815k03186j37128j1134p46846m18930j009644
$$ 40118943 40161241 40372735 40146145 40203960 40000774 39863646 39852512 39105666 38686736 37677092
12066C7677092p12911j098418j149612j214634j133926j057991p62290p18638
$$ 37677092 36964181 35865763 34716151 33501517 32367591 31309600 30547310 29828672
12058B9828672n85920n22779o90316m49944m58654n00538k71467n40897l43876
$$ 29828672 29242752 28719973 28029657 27579713 27121059 26620521 26349054 25808157 25464281
12049B5464281l99700m56481l42103n41669l15575m20065j88337o92478l12210
$$ 25464281 25064581 24608100 24265997 23724328 23408753 22988688 22800351 22107873 21795663
12040B1795663n00921m19456l29394o34761l11424n54628m47821k28152q4334
$$ 21795663 21294742 20875286 20545892 19911131 19599707 19045079 18597258 18369106 18284772
12031A8284772o0613k58830N66033p7950M55653m5250K33092j09162r9577l00007
$$ 18284772 18224159 17965329 18531362 18453412 18909065 18863815 19096907 18987745 18888168 18588161
12021A8588161n72339n24466o73617n35010k24188l54464j89059n77774j21070
$$ 18588161 18015822 17491356 16817739 16282729 16058541 15704077 15515018 14937244 14816174
12012A4816174l02134k77133l05822j63141p92685j80542l68993j4630J14657
$$ 14816174 14514040 14236907 13931085 13767944 12975259 12794717 12425724 12411094 12525751
12003A2525751K4285r8501m025N00666n9083K13205j16544k17997m39365j76731
$$ 12525751 12550036 12451535 12447510 12948176 12889093 13102298 12985754 12767757 12328392 12151661
11993A2151661l58730l97946o95206n8808j22758M927Q2587j49354l56139m6219
$$ 12151661 11792931 11394985 10699779 10640971 10518213 10523140 10605727 10456373 10100234 10054015
11983A0054015j94937n66940j30516j99517l32584k27951J8402j51804l17145
$$ 10054015 9859078 9292138 9161622 8962105 8629521 8401570 8419972 8268168 7951023
11974G951023K25436l48041M1749j63990k50835J08242n69725o1662k3329n25225
$$ 7951023 8176459 7828418 7870167 7706177 7455342 7563584 6993859 6932197 6908868 6383643
11964F383643l30141J76115k03179J31743k89112J43890J32687K22991r3761N2207
$$ 6383643 6053502 6229617 6026438 6158181 5869069 6012959 6145646 6368637 6274876 6327083
11954F327083M88746j04586K17870k5670K5719j55990j24084R5691k82786K86804
$$ 6327083 6815829 6711243 6929113 6903443 6929162 6773172 6649088 6744779 6461993 6748797
11944F748797K01816J30047J32279J51265J97802J05828J04477J27955N2467J21292
$$ 6748797 6950613 7080660 7212939 7364204 7562006 7667834 7772311 7900266 7952733 8074025
11934H074025K9412j45262R032R2765Q3717o3048J72550j26723J0076j5392k55397
$$ 8074025 8103437 7958175 7967207 8059972 8143689 8080641 8253191 8126468 8136544 8121152 7865755
11923G865755m23943j08596j30430j53659r0894j69115k36138j20449L3019k1519
$$ 7865755 7441812 7333216 7202786 7049127 6958233 6789118 6552980 6432531 6465550 6444031
11913F444031m81229K26378Q667R4418K35428J012179K131035K353852J030374
$$ 6444031 5962802 6189180 6197847 6292265 6527693 7539872 9670907 12024759 13055133
11904A3055133N95812K82349j61305n84333j339293j555447j124223j297636j086304
$$ 13055133 13650945 13933294 13771989 13187656 11848363 10292916 9168693 7871057 6784753
11895F784753m27135m78167j76028p257j29045K49595r03k2121M10039M02488
$$ 6784753 6357618 5879451 5703423 5696166 5567121 5816716 5815813 5793692 6203731 6606219
11885F606219M64487O74730P67482O98910O25887K82395L4527J24807j84919n84756
$$ 6606219 7070706 7745436 8512918 9211828 9837715 10120110 10154637 10279444 10094525 9509769
11875I509769l61323m00957o38664l78821o03632k70020k93516m74125l97019
$$ 9509769 9148446 8747489 8108825 7730004 7126372 6856352 6562836 6088711 5691692
11866E691692o875k75284j52248k98444K37811l26881N0516j4331j26390j02669
$$ 5691692 5684817 5409533 5257285 4958841 5196652 4869771 4920287 4905956 4779566 4676897
11856D676897R5567o5179K6459J53295K26003l06730k286M8733L96820k0927K56117
$$ 4676897 4772464 4707285 4733744 4887039 5113042 4806312 4804026 4852759 5249579 5228652 5484769
11845E484769K24143M35868L84270M63571Q08843L15792N52143J01712O558j34159
$$ 5484769 5708912 6144780 6529050 6992621 7801464 8117256 8669399 8771111 8777669 8643510
11835H643510l6365j63694l96570j14793k94111J10885k4111L6483Q6060k53834
$$ 8643510 8607145 8443451 8046881 7932088 7637977 7748862 7724751 7761234 7847294 7593460
11825G593460j27350k98205o45501l2332n79916o50264l54296r3768j54656k49949
$$ 7593460 7466110 7167905 6522404 6490072 5910156 5259892 4905596 4811828 4657172 4407223
11815D407223j68822J92478k46771J19412l36396J63725j62913n6538L45313l33110
$$ 4407223 4238401 4430879 4184108 4303520 3967124 4130849 3967936 3911398 4256711 3923601
11805C923601l73125K60410Q6544j8177l4095J24712j19421j5263J14011j1021
$$ 3923601 3550476 3810886 3897430 3879253 3845158 3969870 3850449 3835186 3949197 3938176
11795C938176J43154j79281J22413M2920P3914M28981K66360M60741N47009K06994
$$ 3938176 4081330 3902049 4024462 4067382 4141296 4570277 4836637 5297378 5844387 6051381
11785F051381M04188K08131O600k40714l44081k48986l13398m48023m01012m14981
$$ 6051381 6455569 6663700 6670300 6429586 6085505 5836519 5523121 5075098 4674086 4259105
11775D259105j71000J08030n59288K11447k45364j08186K10748l14677l23165
$$ 4259105 4088105 4196135 3636847 3848294 3602930 3494744 3705492 3390815 3067650
11766C067650M09067Q6566k20173O9393j86073L16043l61056K2476l7675j67626
$$ 3067650 3476717 3563283 3343110 3412503 3226430 3542473 3181417 3203893 3166218 2998592
11756B998592K11606L9679m5755k07971O1242K83562Q4108l02013k49758M54728
$$ 2998592 3210198 3249877 3204122 2996151 3057393 3340955 3425063 3123050 2873292 3328020
11746C328020P5517k08623j18132J44772M6413P115k04707R2555j73227J51275
$$ 3328020 3403537 3194914 3076782 3221554 3267967 3275082 3070375 3162930 2989703 3140978
11736C140978p3497o7339Q0617j33994q1829J93396j93683p4353K96656l19306
$$ 3140978 3067481 3000142 3080759 2946765 2864936 3058332 2864649 2790296 3086952 2767646
11726B767646L65110j10882q1282l9199Q2791l25124L86622j61884m4842O9186
$$ 2767646 3132756 3021874 2940592 2901393 2984184 2659060 3045682 2883798 2838956 2908142
11716B908142o8013J80576Q8813j81849J92345k02320j00513N5071p4991K1468
$$ 2908142 2840129 3020705 3109518 2927669 3120014 2917694 2817181 2872252 2797261 2818729
11706B818729j13930p7412J85172l4200j1452J09216j56441L99464j29006J87551
$$ 2818729 2704799 2627387 2812559 2778359 2766907 2876123 2719682 3119146 2990140 3177691
11696C177691m1196l4259q8358O9904J70589R0927j99816m9075J12247M3745L9350
$$ 3177691 3136495 3102236 3013878 3083782 3254371 3345298 3145482 3096407 3208654 3252399 3291749
11685C291749J91353j21604n5105J1116J1693J38341K60065l03880L78605k49475
$$ 3291749 3483102 3361498 3306393 3317509 3329202 3467543 3727608 3423728 3802333 3552858
11675C552858j23108M61404l24364j33707J55313r0996J45512r0102M6622L6159
$$ 3552858 3429750 3891154 3566790 3433083 3588396 3497400 3642912 3552810 3599432 3635591
11665C635591J1358M1836J12901q4348j11110K08217k52869J08552N4181k0656
$$ 3635591 3646949 3688785 3801686 3717338 3606228 3814445 3561576 3670128 3724309 3703653
11655C703653j34481L2143M8617n6636J81408j74706L2843K6881k44252K13446
$$ 3703653 3569172 3601315 3649932 3593296 3774704 3599998 3632841 3659722 3415470 3628916
11645C628916j41370P1275o2748J23080N9047j64108O2915j68203J38446K25006
$$ 3628916 3487546 3558821 3496073 3619153 3678200 3514092 3577007 3408804 3547250 3772256
11635C772256l07625l015k5776K06835k63296l700L1023K00731J28116l27310
$$ 3772256 3464631 3461616 3435840 3642675 3379379 3375679 3406702 3607433 3735549 3408239
11625C408239P4639l5066j46541J12704n9501J52938l95586N7092J28633J21457
$$ 3408239 3482878 3447812 3301271 3413975 3354474 3507412 3111826 3168918 3297551 3419008
11615C419008k8354j53902K10859R2320p9513n8956j9246r0417K51247j7091q6362
$$ 3419008 3390654 3236752 3447611 3539931 3460418 3401462 3382216 3291799 3543046 3525955 3439593
11604C439593O746K23266j0128o5764j8258K76891l12869L20127p4211j20384
$$ 3439593 3446339 3669605 3659477 3593713 3575455 3852346 3539477 3859604 3785393 3665009
11594C665009R0833M9666k2758k19288M26052j68542K5310j54789k19021J93814
$$ 3665009 3755842 3805508 3782750 3563462 3989514 3820972 3846282 3691493 3472472 3666286
11584C666286P1933n6965q4093K01577K19038l10197L22830m8321k32069J2337
$$ 3666286 3738219 3681254 3597161 3798738 4017776 3707579 4030409 3982088 3750019 3762356
11574C762356L98926k22339J11251q9373o7830M4173R7303J10852l17656n9475
$$ 3762356 4161282 3938943 4050194 3960821 3892991 3937164 4034467 4145319 3827663 3768188
11564C768188J75697j35095J11410M5473j04315J82169j64862J69127j5659K99259
$$ 3768188 3943885 3808790 3920200 3965673 3861358 4043527 3878665 4047792 4032133 4331392
11554D331392j14004k16550J8263M4109L23357m12907P4680j05846j7419K5473
$$ 4331392 4217388 4000838 4019101 4063210 4386567 3973660 4048340 3942494 3925075 3950548
11544C950548P1414q4178N6339j64332o0408J37909J8271M9993q0277J57763j59287
$$ 3950548 4021962 3937784 3994123 3829791 3769383 3907292 3925563 3975556 3895279 4053042 3893755
11533C893755k76947K47864J50361j83732q1235L60081l72577N6780P2438K7276
$$ 3893755 3616808 3864672 4015033 3831301 3750066 4110147 3737570 3794350 3866788 3894064
11523C894064o9905k07902L24645o4645L7586Q7085j76448J61029L5627K17026
$$ 3894064 3824159 3616257 3940902 3876257 3913843 4000928 3824480 3985509 4021136 4238162
11513D238162j45263P5745k6187p4522L10947k43815J99050q8366M1340K41128
$$ 4238162 4092899 4168644 4142457 4067935 4378882 4135067 4334117 4245751 4287091 4528219
11503D528219l05932O4158m9979M9181j81073J52934k7425j38633K17985k54332
$$ 4528219 4222287 4286445 4236466 4285647 4104574 4257508 4230083 4091450 4309435 4055103
11493D055103L32255j91520j24014L83166j23941l9943L5942O4249j7584J10021
$$ 4055103 4387358 4195838 4071824 4454990 4331049 4291106 4327048 4391297 4373713 4483734
11483D483734l2491J82440J43420k19278J04999j52440J78112M09420n68709r3215
$$ 4483734 4451243 4633683 4777103 4557825 4662824 4510384 4688496 5097916 4529207 4435992
11473D435992J95969k5707O5684L9931k60731J13715J00456j44700r8645M7407
$$ 4435992 4631961 4606254 4671938 4711869 4451138 4564853 4665309 4520609 4421964 4469371
11463D469371N60p3610N4417J85338j42791j9412M2735j54586P6298M9109J17511
$$ 4469371 4469931 4396321 4450738 4636076 4493285 4473873 4516608 4362022 4438320 4487429 4604940
11452D604940n2807j81006J76560n8099K97807j18557J1931l5981M4226J10941
$$ 4604940 4552133 4371127 4547687 4489588 4787395 4668838 4680769 4644788 4689014 4799955
11442D799955j6329J23102j2537J7199J09087J30133J35216n6388K64241l44987
$$ 4799955 4783626 4906728 4894191 4911390 5020477 5150610 5285826 5229438 5493679 5148692
11432E148692K99159P9678J70579J96867l294k19872K05529O1052N112K17941
$$ 5148692 5447851 5527529 5698108 5894975 5891681 5671809 5877338 5938390 5943502 6161443
11422F161443j67863K41518M1750n968O4105R0528O9200j42959J8507J77259R7772
$$ 6161443 5993580 6235098 6276848 6270880 6334985 6425513 6494713 6351754 6370261 6547520 6645292
11411F645292K73570j12921J09138j97325K68941J09525J84165L07853q4318J86740
$$ 6645292 6918862 6805941 6915079 6717754 6986695 7096220 7280385 7588238 7503920 7690660
11401G690660L42603q0722R6039J88685O3754J35516J46437K18846K20259M15513
$$ 7690660 8033263 7952541 8048580 8237265 8301019 8436535 8582972 8801818 9022077 9437590
11391I437590l6218M1336j23579N97655m3791J42172J40174N57278k2654j2596
$$ 9437590 9401372 9442708 9319129 9916784 9872993 10015165 10155339 10712617 10689963 10677367
11381A0677367R4281M65854l29692M28717K24071O3118P6746L8212K35066J82916
$$ 10677367 10771648 11237502 10907810 11336527 11560598 11623716 11700462 11738674 11973740 12156656
11371A2156656J28680j02624J90787M1008J16043J59498J05634l49993M96901
$$ 12156656 12285336 12182712 12373499 12414507 12530550 12690048 12795682 12445689 12942590
11362A2942590k16413M25100l46281K53326J15405O921K2351J34675P690m7396
$$ 12942590 12726177 13151277 12804996 13058322 13173727 13180648 13202999 13337674 13345364 13297968
11352A3297968q2215L13735l30308K79815R4562j24731j07461n7912P3091r0727
$$ 13297968 13215753 13529488 13199180 13478995 13573557 13448826 13341365 13283453 13356544 13265817
11342A3265817N9280j81460J2535j52024j8402p6739M256k98464r3350j28896
$$ 13265817 13325097 13143637 13156172 13004148 12985746 12909007 12913263 12614799 12521449 12392553
11332A2392553K6389k39878J88600m25749j15623j64047J9652r7063k73543k8542
$$ 12392553 12418942 12179064 12367664 11941915 11826292 11662245 11681897 11584834 11311291 11282749
11322A1282749j21305j94717j52951j35670l18957k15122K8895l93200j79231
$$ 11282749 11161444 10966727 10813776 10678106 10359149 10144027 10172922 9779722 9600491
11313I600491R703k62041J00915m27489j58418R876k79239l47484P2175l49654
$$ 9600491 9610194 9348153 9449068 9021579 8863161 8873037 8593798 8246314 8318489 7968835
11303G968835j14411n3876l53204j68454k7735j28483l16948m3063j98642q2918
$$ 7968835 7854424 7800548 7447344 7278890 7251155 7122672 6805724 6762661 6564019 6481101
11293F481101l12719J02328q5401l11657J88316j18800m12342R7861j59236k83289
$$ 6481101 6168382 6270710 6185309 5873652 6061968 5943168 5530826 5628687 5469451 5186162
11283E186162k2947M9267j89734J24934j22746r8030k39576J26863k48750M2631
$$ 5186162 5163215 5212482 5022748 5147682 5024936 4926906 4687330 4814193 4565443 4608074
11273D608074J8773k21795N4489l47171J44774O2258l57778K12212k23785J310
$$ 4608074 4626847 4405052 4459541 4112370 4257144 4319402 3961624 4173836 3950051 3951361
11263C951361R8822n7024P3520o7590J0361j88720K5054p0733k47093L20685j96251
$$ 3951361 4050183 3993159 4066679 3999089 4009450 3820730 3845784 3775051 3527958 3848643 3652392
11252C652392O89p4766K72812m04309J62747P3018n962q4803J37775k45799P5308
$$ 3652392 3653081 3578315 3851127 3446818 3609565 3682583 3676621 3591818 3729593 3483794 3559102
11241C559102m2093J69524J04095k33326J82387l3629r821l70730L43961k89904
$$ 3559102 3517009 3686533 3790628 3557302 3739689 3706060 3696239 3325509 3669470 3379566
11231C379566K57491K2432j11160J05204J61550j59202L14910K36592O50929N68954
$$ 3379566 3637057 3659489 3548329 3653533 3815083 3655881 3970791 4207383 4858312 5427266
11221E427266P68555P64298L19027M53924R5938j78072p47071l72715p62255n14847
$$ 5427266 6195821 6960119 7279146 7733070 7829008 7650936 6903865 6531150 5768895 5254048
11211E254048o52564l73574K7782k13610k0178k8461l75132K8932j62596L73987
$$ 5254048 4601484 4227910 4255692 4042082 4021904 3993443 3618311 3647243 3484647 3858634
11201C858634j25785R550L5006k7267O6138J83311J93965O63497N94650Q61824
$$ 3858634 3732849 3742399 3777405 3750138 3816276 3999587 4193552 4857049 5451699 6313523
11191F313523R04773K36114N50025j39499k28869m60188q18386n36746q36176
$$ 6313523 7218296 7454410 8004435 7864936 7636067 7175879 6357493 5820747 4984571
11182D984571j41500l90118j7083l16750q1528k8225n6493j57462l115K2782N5125
$$ 4984571 4843071 4452953 4435870 4119120 4037592 4009367 3952874 3795412 3792297 3815079 3870204
11171C870204j49193K58040k27912M34235k08605N4725l66632K66062n2717R9912
$$ 3870204 3721011 3979051 3751139 4185374 3976769 4031494 3664862 3930924 3878207 3978119
11161C978119r7367K82201L9014q3005m4797r9641J94249n8232L5304r7887K00149
$$ 3978119 3880752 4162953 4201967 4118962 4074165 3974524 4168773 4110541 4145845 4047958 4248107
11150D248107j87310P4724P8357J60409j11122R9219j23986N6837L7181N0200
$$ 4248107 4060797 4135521 4213878 4374287 4263165 4362384 4238398 4295235 4332416 4382616
11140D382616j09271j4060J80319j27355j23272L29255j33994J58211L2584k1850
$$ 4382616 4273345 4259285 4439604 4312249 4188977 4518232 4384238 4542449 4575033 4553183
11130D553183j00636L01583K6251q7834K01570k36209J36454j68920O1507K48764
$$ 4553183 4452547 4754130 4780381 4692547 4894117 4657908 4794362 4625442 4686949 4935713
11120D935713k81125L78694k39531K03395q0283R6258J16j54761K54203j07254
$$ 4935713 4654588 5033282 4793751 4997146 4916863 5013121 5013237 4858476 5112679 5005425
11110E005425J66210k45857K53401R8119o7395j78211K412J54614k78017J89749
$$ 5005425 5171635 4925778 5179179 5277298 5209903 5031692 5034104 5188718 4910701 5100450
11100E100450k72924P6903J7332M2614q234r5739J01062o6908n8955K02225l54912
$$ 5100450 4827526 4904429 4921761 4964375 4956141 4860402 4961464 4894556 4835601 5037826 4682914
11089D682914J99551p2900P9799o6327R5853j88470J79850l7586M223J48647k36979
$$ 4682914 4882465 4809565 4889364 4823037 4918890 4730420 4910270 4872684 4876907 5025554 4788575
11078D788575J20755r354Q5010l677J97029r1494q6019J55353J17559k8388O5720
$$ 4788575 4909330 4899976 4984986 4981309 5178338 5086844 5000825 5156178 5273737 5245349 5311069
11067E311069M7541m6651j15858M01277j63347J92132K32332p4516l99k837M07346
$$ 5311069 5358610 5311959 5196101 5597378 5434031 5626163 5858495 5783979 5783580 5780743 6188089
11056F188089j30357J15017K36156J17007r5152N7631P0357k46614K76407J76557
$$ 6188089 6057732 6172749 6408905 6525912 6430760 6488391 6558748 6312134 6588541 6765098
11046F765098J51024r0619K59895O8034j27836R2212L3632K29539K08809J20573
$$ 6765098 6916122 6825503 7085398 7153432 7025596 7117808 7151440 7380979 7589788 7710361
11036G710361k17761L29413L79101l3618M50373M102L14911J52224P4576M01600
$$ 7710361 7492600 7822013 8201114 8167496 8617869 8621971 8936882 9089106 9163682 9565282
11026I565282K95263K20518K79546K60882L62042J70434K05995J83458k7187N39517
$$ 9565282 9860545 10081063 10360609 10621491 10983533 11153967 11359962 11543420 11516233 12055750
11016A2055750J38288K00038M8399N8425J09135M79410m0733j12882L46140K16232
$$ 12055750 12194038 12394076 12442475 12500900 12610035 13089445 13048712 12935830 13281970 13498202
11006A3498202K55610L8834N22553P2014N24880J91442M74455L08447K56405L47316
$$ 13498202 13753812 13792646 14315199 14387213 14912093 15103535 15577990 15886437 16142842 16490158
10996A6490158L26890N68642J96636L98819J88355K41109K02026L02169k0609
$$ 16490158 16817048 17385690 17582326 17981145 18169500 18410609 18612635 18914804 18894195
10987A8894195K49607J39079K10853L53534k7590P14145j5751P42626L14216N84879
$$ 18894195 19143802 19282881 19493734 19847268 19819678 20533823 20518072 21260698 21574914 22159793
10977B2159793L62297J28944N59425J92211Q3203J86247K55503J77695O60064
$$ 22159793 22522090 22651034 23210459 23402670 23485873 23672120 23927623 24105318 24765382
10968B4765382K29983J88138Q70570K93979L05264M22174O19831N02514L72711
$$ 24765382 24995365 25183503 26054073 26348052 26653316 27075490 27695321 28197835 28570546
10959B8570546L91213O80100K77895N99630O81686P71752P38500N32620R50815
$$ 28570546 28961759 29641859 29919754 30519384 31201070 31972822 32711322 33243942 34194757
10950C4194757O91274N07497O22711Q69862L73499P67491L93147N41197R01629
$$ 34194757 34886031 35393528 36016239 36886101 37259600 38027091 38420238 38961435 39863064
10941C9863064M18614R37745Q07779O34257J057415O37153Q14116Q23035J097903
$$ 39863064 40281678 41219423 42027202 42661459 43718874 44356027 45170143 45993178 47091081
10932D7091081Q56658J078117P82136J103721R83998Q11451J118710R69739J166589
$$ 47091081 47947739 49025856 49807992 50911713 51895711 52707162 53825872 54795611 55962200
10923E5962200J344468R50578J526410Q21215J100880O96113Q57687L83734O08824
$$ 55962200 57306668 58257246 59783656 60604871 61705751 62401864 63259551 63643285 64252109
10914F4252109M67452J99629K96895K58648J29039J9785J88833j55709K46329
$$ 64252109 64719561 64919190 65216085 65474733 65603772 65623557 65812390 65656681 65903010
10905F5903010j64471j3592J66858P9558K3093K8843K70401K99503J91864L68066
$$ 65903010 65738539 65724947 65891805 65971363 65994456 66023299 66293700 66593203 66785067 67153133
10895F7153133N60441J72861O12435N01462R71595N10045Q84322J440159R11778
$$ 67153133 67713574 67886435 68498870 69000332 69971927 70481972 71366294 72806453 73718231
10886G3718231J455636J804351J399078K075576K384370K745051K992293L033986
$$ 73718231 75173867 76978218 78377296 80452872 82837242 85582293 88574586 91608572
10878I1608572M117695M081905M541292N225342N437926N701018N727051N657988
$$ 91608572 95726267 99808172 104349464 109574806 115012732 120713750 126440801 132098789
10870A32098789M980716M757137L735193K838438K134355L26576l65275j338232
$$ 132098789 137079505 141836642 145571835 148410273 150544628 150871204 150505929 149167697
10862A49167697k541203l277246l933794m707315m908725n539932n499580n844481
$$ 149167697 146626494 143349248 139415454 134708139 129799414 124259482 118759902 112915421
10854A12915421n593673n613175n568988n707472n056859m713257m748588m661204
$$ 112915421 107321748 101708573 96139585 90432113 85375254 80661997 75913409 71252205
10846G1252205m421546l825849m006445l707064l223507k966510l071988k642415
$$ 71252205 66830659 63004810 58998365 55291301 52067794 49101284 46029296 43386881
10838D3386881k662786k077071k214305j975113j667274j805618j604611j341084
$$ 43386881 40724095 38647024 36432719 34457606 32790332 30984714 29380103 28039019
10830B8039019j337275j219777j284405j108365j130142p97389p08360j218185
$$ 28039019 26701744 25481967 24197562 23089197 21959055 21161666 20453306 19235121
10822A9235121n84048r20229p38081n18135n46391o73172k47025n96117j71083
$$ 19235121 18651073 17730844 16992763 16474628 15928237 15255065 15008040 14411923 14240840
10813A4240840l31640n50372k79560j31071l44292j23364k72717m51291m68261
$$ 14240840 13909200 13358828 13079268 12948197 12603905 12480541 12207824 11756533 11288272
10804A1288272l42389k19998m87396k10267m95469k082n60601k30624j54058k87384
$$ 11288272 10945883 10725885 10238489 10028222 9532753 9530671 8970070 8739446 8585388 8298004
10794H298004k85216K3495k00511l08864q1448J03240m34003j5242N6479m40342
$$ 8298004 8012788 8036283 7835772 7526908 7445460 7548700 7114697 7099455 7155934 6715592
10784F715592J06699j92795j8981l07837N0587J972k57663l85408j08210J72932
$$ 6715592 6822291 6629496 6610515 6302678 6353265 6355237 6097574 5712166 5603956 5776888
10774E776888k36907j6031k62397K4099k0365O8215l63230o7535J99000n09725
$$ 5776888 5539981 5523950 5261553 5285652 5265287 5333502 4970272 4902737 5101737 4592012
10764D592012J71199k53743K17531j88831P1807j39778r1804J31183J57220k36631
$$ 4592012 4763211 4509468 4726999 4538168 4609975 4470197 4378393 4509576 4666796 4430165
10754D430165q1971K3319O7736m7606K5738o7003Q5852l12211O1935j1384o4424
$$ 4430165 4348194 4371513 4439249 4391643 4417381 4350378 4436230 4124019 4185954 4174570 4110146
10743D110146k09502P08k07905j36539L98250l27341k849Q944p3188J24952k66523
$$ 4110146 3900644 3901352 3693447 3556908 3955158 3627817 3624968 3633912 3560724 3685676 3419153
10732C419153L01951o2102l9761P3056J12730J25313j30239J97305j32961j19096
$$ 3419153 3721104 3659002 3619241 3692297 3805027 3930340 3800101 3997406 3864445 3745349
10722C745349J41817j36408Q758O5914k03212J22216j50885J00393O280j10187
$$ 3745349 3887166 3750758 3759516 3825430 3622218 3744434 3593549 3693942 3700222 3590035
10712C590035L3529K61063o8168M2367k04977P8481k11562K57156K28608L146
$$ 3590035 3623564 3884627 3816459 3858826 3653849 3732330 3520768 3777924 4006532 4009678
10702D009678l47238J99522n4073j40579p2514J19022j74168O031m0007n6695
$$ 4009678 3662440 3861962 3807889 3667310 3594796 3713818 3539650 3545681 3505674 3448979
10692C448979j07082N849j02264L88882k04541j4368o3272M2930j81190J15266
$$ 3448979 3341897 3347746 3245482 3634364 3429823 3415455 3352183 3395113 3213923 3329189
10682C329189r6796j48543J60217n6661J902L5228j66307M907L85317k34998P3891
$$ 3329189 3232393 3083850 3244067 3187406 3189308 3224536 3058229 3063136 3448453 3213455 3287346
10671C287346L9507K974N8363l76465o3343K34389j54158m6622J0877j24072R1465
$$ 3287346 3326853 3329827 3388190 3011725 2948382 3182771 3028613 2981991 2992868 2868796 2960261
10660B960261M6138k31118K88855l53779n0942p5354J15528j03216J15558J33042
$$ 2960261 3006399 2775281 3064136 2710357 2659415 2584061 2699589 2596373 2711931 2844973
10650B844973o7545m4232J61445K461k06958j33996J52294J0832l58417K68822
$$ 2844973 2777428 2733196 2894641 2897102 2690144 2556148 2708442 2719274 2360857 2629679
10640B629679k13864o6477J23299j05257j7806K7874o4016j59417L23943k51298
$$ 2629679 2415815 2349338 2472637 2367380 2349574 2377448 2313432 2154015 2477958 2226660
10630B226660J33881j91196Q2538J3679J23807q0143N4834j61316N6679L7986
$$ 2226660 2360541 2169345 2251883 2265562 2389369 2309226 2364060 2202744 2259423 2297409
10620B297409j68254K59506j71541j59606L59522k38100J01377j67950J07757
$$ 2297409 2129155 2388661 2217120 2057514 2417036 2178936 2280313 2112363 2220120
10611B220120J66304j39391n0739k01300Q8191M2388L7391J03081p2469J80209
$$ 2220120 2386424 2247033 2196294 1994994 2083185 2125573 2162964 2266045 2193576 2373785
10601B373785K6561k49351k45595K08701j08081L03665j3714k39358L3386L12910
$$ 2373785 2400346 2150995 1905400 2114101 2006020 2309685 2295971 2056613 2089999 2402909
10591B402909k98533k8043j41750J28991K40158l07553J58356R0783R6616j63805
$$ 2402909 2104376 2076333 1934583 2063574 2303732 1996179 2154535 2245318 2341934 2178129
10581B178129M1629k4542k82303J40852o567N8716k4221M0754O9983m27687L06248
$$ 2178129 2219758 2195216 1912913 2053765 2047198 2105914 2081693 2122447 2192430 1764743 2070991
10570B070991p6953J86231k9178l48767J26348J4502k16979J98895K1049j48703
$$ 2070991 1994038 2180269 2151091 1802324 1928672 1943174 1726195 1925090 1946139 1797436
10560A797436R9776l07562L38625j58651l8483j39724M28215k04639j42146j69978
$$ 1797436 1897212 1589650 1928275 1769624 1731141 1591417 2019632 1814993 1672847 1502869
10550A502869K64982j29694J54478J34470m55818K05388m8220K757p7550J3762
$$ 1502869 1767851 1638157 1792635 1927105 1471287 1676675 1628455 1631212 1553662 1567424
10540A567424r1231Q1056K70879k57716J26341j04523M3173K23826k48692L73693
$$ 1567424 1476193 1557249 1828128 1570412 1696753 1592230 1635403 1859229 1610537 1984230
10530A984230k54879j12821Q2163n2994J61941j30661J07756J55643l7257J64116
$$ 1984230 1729351 1616530 1698693 1645699 1807640 1676979 1784735 1940378 1903121 2067237
10520B067237J36084p534J81726K95018q2117L47999N2027k95888k9056l3234
$$ 2067237 2203321 2195787 2377513 2672531 2590414 2938413 2990440 2694552 2665496 2632262
10510B632262r0960j53276k94059q2855K5475Q3415r6561M9963R4369k18374m1881
$$ 2632262 2541302 2388026 2093967 2011112 2036587 2120002 2023441 2073404 2167773 1949399 1907518
10499A907518M3928K38275j8557k13232J91984j50915k1838M23979r2854R3728
$$ 1907518 1951446 2189721 2171164 1957932 2149916 1999001 1977163 2401142 2308288 2402016
10489B402016M06642Q2024j05201J88539N6343J4415r8443o49836J32110j21510
$$ 2402016 2808658 2890682 2785481 2974020 3030363 3044778 2946335 2296499 2428609 2307099
10479B307099j40371J50781o8257o3749J00156j34590K82022j05154k2938K0593
$$ 2307099 2166728 2317509 2249252 2185503 2285659 2151069 2433091 2327937 2304999 2325592
10469B325592J25336k26419P6164J33392J54255J84771m3605R9297j1893K80210
$$ 2325592 2450928 2224509 2300673 2434065 2588320 2773091 2729486 2828783 2816890 3097100
10459C097100l23411K1112O1701j13717j64064J89526J76291o9693K29543k37963
$$ 3097100 2773689 2794801 2856502 2742785 2578721 2768247 2944538 2874845 3104388 2866425
10449B866425p6642J87426n583K44005n54l0345o6116n5881L9563k388j27402
$$ 2866425 2789783 2977209 2971626 3215631 3215077 3184732 3118616 3062735 3102298 3099910 2972508
10438B972508K58743J36937J70586N25480k42483J8904q8788j5459j72202n11872
$$ 2972508 3231251 3368188 3538774 4064254 3821771 3840675 3751887 3736428 3564226 3052354
10428C052354J46542m41774p2245j52669k75905L51474k63485K323P0416l372
$$ 3052354 3198896 2757122 2684877 2532208 2256303 2607777 2344292 2346615 2417031 2413659
10418B413659r0325O2263J00014r5253O7514K3937L84250k67069L04489L13003
$$ 2413659 2323334 2385597 2485611 2390358 2457872 2481809 2866059 2598990 2903479 3216482
10408C216482K18286K37634o3754M04478P0034K04358l75884M33600k84162J28519
$$ 3216482 3434768 3672402 3608648 4013126 4083160 4287518 3911634 4345234 4061072 4189591
10398D189591O0894k7837L98786J2224M16333J62568K38564M06585L10139K45405
$$ 4189591 4250485 4222648 4621434 4633658 5049991 5212559 5451123 5857708 6167847 6413252
10388F413252K16879M53908M3370K62721l36321L17604l3372o1986m07350J37
$$ 6413252 6630131 7084039 7127409 7390130 7053809 7371413 7338041 7276055 6868705 6868842
10378F868842j94170j43228j41388k71681J40251N764m5685P3893k30425J19111
$$ 6868842 6674672 6531444 6390056 6118375 6258626 6264390 6218705 6292598 6062173 6181284
10368F181284K10071J22269O9589J32021r6548J40579k55222L0089l09202J17686
$$ 6181284 6391355 6513624 6583213 6715234 6618686 6759265 6504043 6534132 6224930 6342616
10358F342616k259k42832k20879R9774k17065J72820J47206j82177j62338j40740
$$ 6342616 6340357 6097525 5876646 5976420 5759355 5932175 6079381 5897204 5734866 5594126
10348E594126k98320J6509j99278q6988j27367o0487M5886r7025j5563J30559
$$ 5594126 5295806 5312315 5113037 5026049 4898682 4838195 4884081 4787056 4771493 4902052
10338D902052Q9637k98387J54134N3877K03139j43014K05413n7337J01002l5338
$$ 4902052 4991689 4693302 4847436 4901313 5104452 4961438 5166851 5109514 5210516 5175178
10328E175178j14239J34206l11029p4944K18315j20682K37185o5199j2668J6348
$$ 5175178 5060939 5195145 4884116 4809172 5027487 4906805 5143990 5078791 5066123 5082471
$$ [...]
##END NTUPLES=NMR SPECTRUM
##END=
