##TITLE=Coffee green (M4-ROVE40 + 1.5mL buffer 50/50,  450uL extracto + 50uL (D2O+TMS))
without heating, vortex and centrifuged, temperature 0oC.
##JCAMPDX= 6.0         $$ Bruker NMR JCAMP-DX V2.0
##DATA TYPE= NMR SPECTRUM
##DATA CLASS= NTUPLES
##ORIGIN= Bruker BioSpin GmbH
##OWNER= Administrator
$$ 1.72 TOPSPIN		Version 2.1
$$ 2012-05-22 16:13:43.543 -0700  Administrator@X
$$ Compression mode = diff/dup
##.OBSERVE FREQUENCY= 400.13188198
##.OBSERVE NUCLEUS= ^1H
##.ACQUISITION MODE= SIMULTANEOUS (DQD)
##.ACQUISITION SCHEME= undefined
##.AVERAGES= 64
##.DIGITISER RES= 22
##SPECTROMETER/DATA SYSTEM= spect
##.PULSE SEQUENCE= noesygppr1d
##.SOLVENT NAME= H2O+D2O
##.SHIFT REFERENCE= INTERNAL, H2O+D2O, 1, 14.97969
##AUDIT TRAIL= $$ (NUMBER, WHEN, WHO, WHERE, PROCESS, VERSION, WHAT)
$$ ##TITLE= Audit trail, TOPSPIN		Version 2.1
$$ ##JCAMPDX= 5.01
$$ ##ORIGIN= Bruker BioSpin GmbH
$$ ##OWNER= Administrator
$$ $$ c:\Bruker\TOPSPIN/data/jwist/nmr/11-coffee-green-quantification-2/171/pdata/1/auditp.txt
$$ ##AUDIT TRAIL=  $$ (NUMBER, WHEN, WHO, WHERE, PROCESS, VERSION, WHAT)
(   1,<2011-11-17 17:54:45.575 -0500>,<Administrator>,<TOPSPIN>,<go>,<TOPSPIN 2.1>,
      <created by zg
	started at 2011-11-17 17:45:51.091 -0500,
	POWCHK enabled, PULCHK disabled,
       configuration hash MD5:
       DA 63 81 1B EF 4C B5 72 B4 DF EA D9 B4 DB 4C 08
       data hash MD5: 64K
       A9 63 3E 60 00 79 24 55 F4 0E 0E 6C B5 00 19 B2>)
(   2,<2011-11-17 18:37:48.825 -0500>,<Administrator>,<TOPSPIN>,<proc1d>,<TOPSPIN 2.1>,
      <Start of raw data processing
       efp LB = 0 FT_mod = 6 PKNL = 1 PHC0 = 0 PHC1 = 0 SI = 32K 
       data hash MD5: 32K
       A7 4D DC 72 09 C1 28 8B 6D F7 B5 93 5C F7 47 E6>)
(   3,<2011-11-17 18:37:49.607 -0500>,<Administrator>,<TOPSPIN>,<proc1d>,<TOPSPIN 2.1>,
      <pk PHC0 = 21.56067 PHC1 = 0 
       data hash MD5: 32K
       A7 45 D2 FC 94 9B 34 B4 39 66 24 96 90 98 2C AD>)
$$ ##END=
$$ 
$$ $$ hash MD5
$$ $$ DC E6 FA 52 E2 38 02 5A F3 8C C1 A4 F2 17 38 3C
##$RELAX= 
##$RELAX= 
##$RELAX= 
##$RELAX= 
##$RELAX= 
$$ Bruker specific parameters
$$ --------------------------
##$DU= <Z:>
##$EXPNO= 171
##$NAME= <11-coffee-green-quantification-2>
##$PROCNO= 1
##$TYPE= <nmr>
##$USER= <jwist>
##$ACQT0= -8.17975531651648
##$AMP= (0..31)
100 100 100 100 100 100 100 100 100 100 100 100 100 100 100 100 100 100
100 100 100 100 100 100 100 100 100 100 100 100 100 100
##$ANAVPT= -1
##$AQSEQ= 0
##$AQ_mod= 3
##$AUNM= <au_prof>
##$AUTOPOS= <>
##$BF1= 400.13
##$BF2= 400.13
##$BF3= 400.13
##$BF4= 400.13
##$BF5= 400.13
##$BF6= 400.13
##$BF7= 400.13
##$BF8= 400.13
##$BYTORDA= 0
##$CFDGTYP= 0
##$CFRGTYP= 9
##$CHEMSTR= <none>
##$CNST= (0..63)
1 1 145 1 1 1 1 1 1 1 1 1 1 1 1 1 1 1 1 1 1 1 1 1 1 1 1 1 1 1 1 1 1 1 1
1 1 1 1 1 1 1 1 1 1 1 1 1 1 1 1 1 1 1 1 1 1 1 1 1 1 1 1 1
##$CPDPRG= <>
##$CPDPRG1= <>
##$CPDPRG2= <>
##$CPDPRG3= <>
##$CPDPRG4= <mlev>
##$CPDPRG5= <mlev>
##$CPDPRG6= <mlev>
##$CPDPRG7= <mlev>
##$CPDPRG8= <mlev>
##$CPDPRGB= <>
##$CPDPRGT= <>
##$D= (0..63)
$$ [...]
##$TP= (0..7)
150 150 150 150 150 150 150 150
##$TP07= 0
##$TPNAME0= <>
##$TPNAME1= <>
##$TPNAME2= <>
##$TPNAME3= <>
##$TPNAME4= <>
##$TPNAME5= <>
##$TPNAME6= <>
##$TPNAME7= <>
##$TPOAL= (0..7)
0.5 0.5 0.5 0.5 0.5 0.5 0.5 0.5
##$TPOFFS= (0..7)
0 0 0 0 0 0 0 0
##$TUNHIN= 0
##$TUNHOUT= 0
##$TUNXOUT= 0
##$USERA1= <user>
##$USERA2= <user>
##$USERA3= <user>
##$USERA4= <user>
##$USERA5= <user>
##$V9= 5
##$VALIST= <valist>
##$VCLIST= <CCCCCCCCCCCCCCC>
##$VD= 0
##$VDLIST= <DDDDDDDDDDDDDDD>
##$VPLIST= <PPPPPPPPPPPPPPP>
##$VTLIST= <TTTTTTTTTTTTTTT>
##$WBST= 2048
##$WBSW= 25
##$XGAIN= (0..3)
0 0 0 0
##$XL= 0
##$YL= 0
##$YMAX_a= 5336294
##$YMIN_a= -2130474
##$ZGOPTNS= <>
##$ZL1= 120
##$ZL2= 120
##$ZL3= 120
##$ZL4= 120
##$ABSF1= 0
##$ABSF2= 0
##$ABSG= 0
##$ABSL= 0
##$ALPHA= 0
##$AQORDER= 0
##$ASSFAC= 0
##$ASSFACI= 0
##$ASSFACX= 0
##$ASSWID= 0
##$AUNMP= <proc_prof1d>
##$AXLEFT= 0
##$AXNAME= <>
##$AXNUC= <1H>
##$AXRIGHT= 0
##$AXTYPE= 0
##$AXUNIT= <>
##$AZFE= 0.1
##$AZFW= 0.1
##$BCFW= 0
##$BC_mod= 0
##$BYTORDP= 0
##$COROFFS= 0
##$CY= 15
##$DATMOD= 1
##$DC= 0
##$DFILT= <>
##$DTYPP= 0
##$F1P= 0
##$F2P= 0
##$FCOR= 0.5
##$FTSIZE= 32768
##$FT_mod= 6
##$GAMMA= 0
##$GB= 0
##$INTBC= 1
##$INTSCL= 1
##$ISEN= 128
##$LB= 0
##$LEV0= 0
##$LPBIN= 0
##$MAXI= 10000
##$MC2= 0
##$MEAN= 0
##$ME_mod= 0
##$MI= 0
##$NCOEF= 0
##$NC_proc= -6
##$NLEV= 6
##$NOISF1= 0
##$NOISF2= 0
##$NSP= 0
##$NTH_PI= 0
##$NZP= 0
##$OFFSET= 14.97969
##$PC= 1
##$PHC0= 21.56067
##$PHC1= 0
##$PH_mod= 1
##$PKNL= yes
##$PPARMOD= 0
##$PPDIAG= 0
##$PPIPTYP= 0
##$PPMPNUM= 2147483647
##$PPRESOL= 1
##$PSCAL= 4
##$PSIGN= 0
##$PYNMP= <proc.py>
##$REVERSE= no
##$SF= 400.13
##$SI= 32768
##$SIGF1= 0
##$SIGF2= 0
##$SINO= 400
##$SIOLD= 32768
##$SPECTYP= <>
##$SREGLST= <1H.CDCl3>
##$SSB= 0
##$STSI= 32768
##$STSR= 0
##$SW_p= 8223.68421052631
##$SYMM= 0
##$S_DEV= 0
##$TDeff= 65536
##$TDoff= 0
##$TI= <>
##$TILT= no
##$TM1= 0
##$TM2= 0
##$TOPLEV= 0
##$USERP1= <user>
##$USERP2= <user>
##$USERP3= <user>
##$USERP4= <user>
##$USERP5= <user>
##$WDW= 1
##$XDIM= 32768
##$YMAX_p= 324178181
##$YMIN_p= -460231
##$CURPLOT= <Network HP LaserJet P1505>
##$CURPRIN= <$Network HP LaserJet P1505>
##$DFORMAT= <normdp>
##$LAYOUT= <+/1D_H.xwp>
##$LFORMAT= <normlp>
##$PFORMAT= <normpl>
##$SURQMSG= 1
$$ End of Bruker specific parameters
$$ ---------------------------------
##NTUPLES= NMR SPECTRUM
##VAR_NAME=  FREQUENCY,     SPECTRUM/REAL,   SPECTRUM/IMAG
##SYMBOL=    X,             R,               I
##VAR_TYPE=  INDEPENDENT,   DEPENDENT,       DEPENDENT
##VAR_FORM=  AFFN,          ASDF,            ASDF
##VAR_DIM=   32768,         32768,           32768
##UNITS=     HZ,            ARBITRARY UNITS, ARBITRARY UNITS
##FACTOR=    0.250966925370066, 1,           1
##FIRST=     8223.43324360094, -66421,       -165642
##LAST=      0,             60268,           -164766
##MIN=       0,             -460231,         0
##MAX=       8223.43324360094, 324178181,    0
$$ Real data points
##PAGE= N=1
##DATA TABLE= (X++(R..R)), XYDATA
$$ [...]
23412 421671 390979 370496 306138 248622 290871 255830 349477 529038 283842 485570 268754
23401 268754 362417 209533 339655 414517 423293 254207 214671 287291 396692 462426 448049
23390 448049 634839 560945 585474 569265 663217 616997 424015 672634 756253 629202 804635
23379 804635 841544 871854 1075494 1226579 1365741 1802097 2318811 2789912 3676856 4754327
23369 4754327 5778687 7093612 9138708 10931147 12855236 14907807 17094210 18820800
23361 18820800 20565753 21792871 22819990 23444439 23325470 23395021 22339470 20630926 19121045
23352 19121045 17301427 15302874 13151121 11088772 9138931 7373241 5687966 4569740
23344 4569740 3642787 2574649 1940736 1383615 1330803 959953 739740 479465 558682 420477
23334 420477 581613 455217 292434 323187 411671 625884 338419 267972 330577 420291
23324 420291 189935 517211 155371 340685 436193 371486 396136 339173 215035 230576
23314 230576 126799 250410 207907 197995 183992 213131 121118 419225 49140 427525 191432
23302 348060 121769 232290 76723 122757 338576 414045 129444 326603 271321 67666
23291 177231 453956 96684 208057 138904 305347 27243 232143 260200 351310 196409
23281 196409 266054 280168 217850 302188 180660 215887 320644 122029 330272 436729
23271 436729 352692 189540 120677 392417 170861 469701 296818 118629 282514 206557
23261 206557 227988 329465 360795 300841 297297 143872 290268 193955 222868 285281 163785
23250 163785 130559 445795 264624 398691 429271 152362 333840 185855 344731 339277
23240 339277 475949 171590 403902 -10692 263594 183965 210508 295577 170321 53345
23229 221558 338082 252751 276239 285480 -55021 -54406 172876 472751 188834 248058 318842
23218 318842 146068 283535 253053 336050 303050 269878 136289 235260 367584 316582 303585
23207 303585 329696 175020 392686 78685 60021 46243 69405 91644 180478 420431 311113
23196 311113 389881 110843 491660 356586 55298 416225 344656 -4937 390360 295819 83264
23184 68117 216751 375200 81628 314645 291800 45653 -46420 259511 162885 217242 120986
23173 120986 320072 122336 283825 147467 173527 339911 361519 128744 306901 256133
23163 256133 466661 399322 303341 219200 277433 266734 438044 211127 212743 382324 -38852
23151 316295 228042 290930 190383 373348 442557 154828 234027 -5139 410713 243389 315681
23140 315681 406448 230931 166941 413276 351819 124974 265491 333392 308365 204954
23130 204954 181440 164249 261270 263368 163721 22749 201335 202515 151387 349468 434844
23119 434844 205006 166649 235708 499773 203933 100273 540692 289503 119587 564078
23109 564078 303227 226635 233379 99098 318621 179700 358988 225615 163680 156256 186444
23098 186444 87264 122430 146674 339370 207179 407461 39651 228594 401982 472247
23088 472247 428646 311872 264405 333792 353424 274035 155706 349652 506065 215537
23077 333542 273019 521059 482181 249118 109648 176038 385358 278557 52859 230215
23067 230215 333530 352659 493089 281871 6361 274517 314969 317055 289690 203065 314431
23056 314431 204868 549598 179840 363741 -63284 488720 312204 211789 374206 156866
23045 355929 429249 477481 181857 441380 45464 356776 351052 308500 212679 416219 329661
23034 329661 296695 339352 418780 557570 119006 254262 159576 368641 198809 449131
23024 449131 458562 280437 269963 388670 397687 358227 478700 233626 247108 426015 436791
23013 436791 299398 176434 489562 260692 681965 258831 295662 305987 229574 226882
23003 226882 183251 296664 147157 274267 317493 293833 249129 286356 379996 297518 317203
22992 317203 490613 462953 417901 374018 349169 384268 343028 378263 557455 314606 506521
22981 506521 284168 398338 602168 574644 621112 410644 707615 534652 584693 373614
22971 373614 507318 674088 403487 504182 591605 567751 813952 564381 523220 572180
22961 572180 708165 459226 883997 695350 890586 634405 772203 1022018 1239216 1168759
22951 1168759 1699017 1784122 2325316 3001970 3751334 4629534 5729103 6967609 8239231
22942 8239231 9292386 10486747 11410202 12205132 12727809 12932797 12964725 12888871 12081480
22933 12081480 11113712 10215731 9060102 7960609 6703876 5651418 4962500 3990246 3185803
22924 3185803 2854881 2470819 2711864 2655324 2570494 3139470 3567748 4173233 4937589 6178809
22914 6178809 7350824 8915332 10388002 12691385 14536301 16252395 17860567 19321914
22906 19321914 20390687 21374325 21781723 21669369 21385823 20367989 19375488 17759986 16515175
22897 16515175 14769685 13217206 11625815 10013210 8812898 7757621 7018444 6730204
22889 6730204 6391981 6474443 6477208 6755189 7246961 7577289 8308667 8773000 9212369 9711545
22879 9711545 9914971 9772310 9945585 9711507 9356482 8925195 8291826 7685662 7053198
22870 7053198 6136371 5679780 4735344 4247049 3538915 3161566 2560550 2251053 2069784
22861 2069784 1990349 1496337 1614171 1166605 1477395 1280865 1188241 669461 900001 929240
22851 929240 790106 605913 715578 629532 788532 545428 467306 407815 550435 477979
22841 477979 589487 429241 348909 419765 526125 464966 557018 584045 490983 432961 739915
22830 739915 387573 414235 400944 262306 366742 217336 257568 568307 447904 478867
22820 478867 548137 345930 213435 305177 401592 354890 560289 600240 458306 350242
22810 350242 303260 264840 544507 344831 258595 302732 315714 560923 360533 186722
22800 186722 466126 386856 488517 108120 198914 313248 309858 302579 363095 337557 386845
22789 386845 312261 454033 177647 119473 344088 333535 481828 152888 370059 378547
22779 378547 470879 248605 322265 322532 374713 594806 178720 271175 250533 302424 422642
22768 422642 253121 340735 617918 479094 587566 603306 340014 335466 182239 279451
22758 279451 167823 455032 357513 282072 160685 331218 369107 522314 240856 180217
22748 180217 571672 248754 167067 163655 376022 235547 353090 227377 104277 294631
22738 294631 117688 227282 313396 171224 386714 435179 384390 511786 140301 108539
22728 108539 359732 315840 92687 95673 189699 355610 458779 361885 166484 303619 323495
22717 323495 242216 257414 190485 372578 235646 339244 397465 242447 250919 234636 380567
22706 380567 270260 386523 391094 104030 229702 366213 240545 95063 394171 107762
22695 241662 255098 409821 321577 370102 343625 499465 53123 396548 197322 299659
22685 299659 469879 225457 279170 278924 241939 333828 151640 179979 517842 372816 273097
22674 273097 377796 241642 358531 198552 255871 94693 514847 467624 316092 268172
22664 268172 509905 332840 370036 267087 517241 389892 464562 388432 506963 453212
22654 453212 444600 343489 253520 387158 396167 289563 310942 315888 540492 384380 369120
22643 369120 66182 226790 305097 394388 340468 283211 583686 307647 305937 421961 461654
22632 461654 365122 98788 382341 447448 242903 634359 301212 449427 420376 343739
22622 343739 403194 223819 493760 305144 577554 436650 440062 422205 467470 537050 592012
22611 592012 599303 439625 360747 307953 443341 533549 570899 276044 298893 440801 275222
22600 275222 516245 356859 769554 450747 436395 395703 377050 422346 449805 533065 498264
22589 498264 379467 383014 404695 405152 399219 634762 724478 409380 675538 294231 368432
22578 368432 540553 288489 484939 506721 330004 540146 315996 399880 585482 368241
22568 368241 430205 544859 380122 518289 286281 464522 463210 548171 456806 416736 378174
22557 378174 266636 537785 520696 400694 394039 543129 366548 414796 402931 430469 451682
22546 451682 638890 347201 443788 499199 617937 434177 416750 659375 229580 298711
22536 298711 352852 624306 375097 363719 435350 481407 229281 481397 250250 348883
22526 348883 465017 374615 235163 530618 480249 392644 262492 295370 424875 349793
22516 349793 501931 434469 439446 421514 748989 481700 459663 425688 386327 499957 553185
22505 553185 414884 423251 390698 578378 561932 514537 552384 408015 375102 512882 146118
22493 353080 316759 432088 629419 502458 501335 406584 738994 460431 519020 468890 607921
22482 607921 167377 384883 521333 230645 347174 196908 564945 508401 336085 654572
22472 654572 422111 449952 532991 372574 618587 209279 632630 312721 650223 464448
22462 464448 585105 754549 477984 444895 528851 617243 568533 459917 426244 331082 558210
22451 558210 547100 463243 372787 284774 395244 593483 128026 583936 592636 348026 673682
22440 673682 383295 369517 521530 431896 411178 270956 382506 426417 356327 320554 422933
22429 422933 644377 569878 316589 457519 555071 523593 414378 372391 508522 620588
22419 620588 423892 367735 499179 599243 410751 560267 357400 342917 261398 484822
22409 484822 699175 306644 396053 389418 575245 584013 552123 469065 570942 395423 306298
22398 306298 520297 475492 637366 495255 317701 633635 484015 397010 477179 351869
22388 351869 417919 79484 558227 421166 291779 481207 620324 457796 471115 473469
22378 473469 273381 554919 619944 447185 498329 538122 316625 586066 526033 409483
22368 409483 409926 445042 313753 477569 520497 794447 300758 418818 265309 575697
22358 575697 560206 543950 623238 300627 455603 438375 510052 527766 579563 574676 464330
22347 464330 535585 386563 381715 544062 555759 542865 701794 781442 485847 504269 638312
22336 638312 654624 516253 759090 1006756 853864 1215156 1199721 1260007 1294877 1518274
22326 1518274 1394464 1468190 1186652 927535 658202 785810 628888 821665 708676 635756
22316 635756 814384 672940 777055 488108 761278 590139 525567 730634 634829 673110
22306 673110 739184 606016 890580 495266 608565 732262 758112 635903 741665 739199
22296 739199 657720 689787 504707 626079 620791 663525 737168 610013 448317 672220 569973
22285 569973 726768 867645 524781 647400 587098 403728 870197 323688 463792 615053
22275 615053 706584 891195 626660 538353 653134 905800 693445 761352 559897 625854
22265 625854 810518 661543 576693 693061 844085 666562 720137 446478 562541 564071
22255 564071 436791 588488 889603 832773 525086 918750 682762 733362 870479 736680
22245 736680 797744 824322 898550 796276 614494 933279 532009 570842 708352 749328
22235 749328 781321 807664 665174 812190 682704 1054576 474299 547324 714060 648583
22225 648583 677358 713182 732130 651034 702116 724640 534993 596449 975434 579286 847500
22214 847500 742962 750085 573721 812623 777200 799462 705768 625750 695149 742462 770597
22203 770597 710470 782945 615592 492324 732066 827796 929187 753216 641537 610830
22193 610830 535218 586526 559356 883733 546971 790690 709971 684926 713797 635158 848376
22182 848376 648495 649853 755441 1080353 714539 801535 696322 620123 806982 753180
22172 753180 550194 385421 761939 634814 644332 628191 620928 747996 661395 344262 741367
22161 741367 647642 939395 626422 825500 773985 697299 653160 516387 849428 818873
22151 818873 737641 798832 605234 840488 699565 593732 705541 766674 524638 879628
22141 879628 765051 735038 806637 571622 525966 692958 433660 672418 756003 731840
22131 731840 623482 529099 845683 683180 492602 708133 592073 786767 722842 739526
22121 739526 758272 677770 602601 667109 767099 593876 628647 641831 651252 663783 553630
22110 553630 654091 564261 720416 707112 735832 685018 556856 483816 683321 701877 668802
22099 668802 555550 663096 750222 488729 708715 742048 502650 836719 732871 919054
22089 919054 607107 706008 674866 716955 661914 972860 642878 619472 829657 690664
22079 690664 735147 666697 712732 781860 596605 767896 730856 733869 597147 679960 753644
22068 753644 853744 828430 886289 755607 710191 699524 634150 674982 661100 660994 753172
22057 753172 1053834 693184 828263 707546 817595 785956 976164 893811 824135 607464
22047 607464 734080 877050 799349 627164 762189 982403 682340 717065 540784 803197
22037 803197 580194 893303 512090 562452 768661 589953 847235 697681 749734 730557
22027 730557 807573 834620 783674 749651 791210 619486 487891 778960 831990 754646 797081
22016 797081 813092 850428 828698 1065879 669246 694004 729549 849926 764093 604411 846260
22005 846260 727654 892406 570692 731965 831031 757436 792132 813689 724044 820668 799603
21994 799603 948703 790820 900487 958097 795169 728933 929672 702098 566270 791620
21984 791620 1002785 762434 949083 783760 849875 702523 1055709 798495 743490 734728
21974 734728 889982 844013 867729 599630 700890 860244 816547 734316 801485 719759 893901
21963 893901 807645 693219 975089 757670 886972 879869 832700 1120488 748539 779644
21953 779644 688847 1109251 875544 984494 948965 942934 696066 676445 701032 510774 973722
21942 973722 756432 992546 875286 924438 753254 964763 864245 841153 911378 896351
21932 896351 1013867 613815 804317 787934 825625 964909 958981 690468 994178 1044952
21922 1044952 699433 744404 735295 708545 789360 755804 967397 652721 876278 680257
21912 680257 881235 822390 862248 481415 904200 879418 860035 828338 699636 816852
21902 816852 826438 841010 945444 866890 754780 691677 785294 956440 992748 886218 849912
21891 849912 681656 809983 910976 803397 692010 1039253 1049770 907372 950045 868303
21881 868303 600076 545936 633478 758712 732278 822362 1057373 1025358 599689 905960
21871 905960 750420 852394 789442 958107 856707 940458 1163407 745413 980066 823953
21861 823953 871634 993132 897636 824345 983062 934884 856455 808742 739106 910254 885862
21850 885862 748309 731033 706790 880814 907443 906301 817687 693552 848911 872101 742223
21839 742223 583673 1044919 878263 810252 866189 633220 796380 790675 692066 740902 818683
21828 818683 639245 756409 741354 877464 862727 730932 1075295 615303 734378 669266
21818 669266 958772 958317 856402 950833 949613 875339 912462 742854 868594 839417 843710
21807 843710 581870 728957 738649 794627 735849 699371 736257 534875 647815 802688 645562
21796 645562 951092 518535 859228 690702 721725 736501 574360 725376 1012322 756244
21786 756244 668716 825805 759974 658343 861665 982936 685339 824174 948989 936843
21776 936843 982356 620417 802779 708039 926757 982182 762747 666462 927179 979291
21766 979291 870590 931699 952284 902012 932131 1010341 951964 1034001 1019264 1266488 1099687
21755 1099687 1421399 1348033 1286928 1644682 1617686 1739365 1908395 2008016 2285937 2757508
21745 2757508 2767460 3345493 3744208 4047054 4641303 5498098 5942831 6233686 6460016 6860253
21735 6860253 6762762 6634602 6326164 6148111 5464255 5247564 4718166 4250868 4206195 3822808
21725 3822808 3808130 3673510 3881438 3576881 3807502 4347461 4733916 5168418 5889631 6371831
21715 6371831 6970747 7611754 8348595 8643596 9125996 9720161 9785867 9835511 9887445 9760552
21705 9760552 9372998 9087213 8943748 8036498 7634997 7173815 6610156 5964491 5436503
21696 5436503 4601618 4620367 4394795 3746554 3663166 3520490 3730142 3767497 3857067 4213997
21686 4213997 4516145 4912193 5182634 5823782 6187018 6496352 6767189 6530412 6433579 5923893
21676 5923893 5687533 5065573 4550681 3976516 3628517 3113110 2784565 2311087 2059464
21667 2059464 1965141 1752621 1545774 1660113 1222749 1331017 1333885 1433307 970323 1174807
21657 1174807 1018934 1057230 1195984 999434 967841 1059095 1064699 835594 1041701 880698
21647 880698 742576 905010 544397 937058 894663 598032 764440 749217 852885 850316
21637 850316 817579 859558 825791 614940 921529 657048 764498 1031864 804395 533880
21627 533880 766192 781222 1070356 780188 696970 691678 937968 888224 821383 618897 593766
21616 593766 642974 769971 708719 727715 778728 785738 844867 816342 748386 759907 768245 628652
21604 628652 749721 850920 787516 832966 649632 983209 826335 978537 899548 750354
21594 750354 943009 813288 904918 700277 802195 633514 1002698 857848 961444 931444
21584 931444 866208 763202 874241 790369 841439 713502 710269 811281 865681 928610 782310
21573 782310 798982 725744 752508 975481 847851 872784 739568 893940 480877 785334
21563 785334 730243 531798 815371 588465 730294 716673 811230 620683 875654 487848
21553 487848 688259 637774 853975 757903 765253 724065 1045099 645502 755299 943345
21543 943345 802242 634953 646343 640636 1069377 691192 695046 882217 955230 869765 1033665
21532 1033665 867702 731464 939860 1021703 790861 847161 758047 1018792 953967 801707
21522 801707 759403 919420 847308 1041972 1205932 834689 962323 808061 905813 831042
21512 831042 788554 1129194 805386 1014858 865494 954905 939997 618656 715734 870466
21502 870466 875708 1049018 924912 1011517 1041265 989899 817107 1049703 1064553 804425 845453
21491 845453 1069549 913179 965499 1048262 1142911 922792 995590 1126305 932580 961209
21481 961209 1034542 1045761 793185 714996 1033595 1133199 1087148 904009 857305 1133637 704383
21470 704383 996390 886531 1205164 1089310 954526 979941 892626 1132999 738483 993791
21460 993791 998567 721251 933411 1070371 967120 1045930 934795 951804 689491 974404
21450 974404 1023096 882642 915262 756655 733262 910445 919006 931311 1085084 925027 986876
21439 986876 1006104 823951 1018454 955763 886053 835622 852288 848082 1049058 894305 1025911
21428 1025911 784770 840989 1124911 958403 998466 1157480 813249 787420 1277915 917645
21418 917645 993056 884365 808676 1081746 987528 857572 886303 940230 1007715 941555 1140556
21407 1140556 999427 936937 746603 827676 902344 1042887 966618 1105553 879993 944461
21397 944461 923984 859526 741483 801373 869945 723315 1071715 720415 962450 1008805
21387 1008805 1220008 966809 959054 1051499 990374 1058195 1110283 1093723 1142139 1071138 998655
21376 998655 1112694 1008065 1012527 1263528 1235154 1082082 945945 1260690 992192 1130471
21366 1130471 1275278 1085096 909835 1070467 916700 893586 994032 1058418 1116000 1044912
21356 1044912 1135029 1028275 1146815 1092005 1265646 1593636 1262203 1238878 1294828 1283995
21346 1283995 1188290 1211264 1542307 1208290 1224759 1399942 1497918 1268762 1622063 1197774
21336 1197774 1382798 1744207 1448947 1315057 1208445 1588951 1430265 1595792 1549787 1833353
21326 1833353 1896386 1912727 1828174 1803093 1814321 2041856 2023073 2017068 2062267 2055776 1997331
21315 1997331 2084502 2392553 2444449 2447398 2594138 2547803 2763799 2993566 3051695 3466001
21305 3466001 3363613 3415162 3777651 3745638 4151490 4345861 4985766 5321639 5727269 6222183
21295 6222183 6741054 7272544 8039725 8964636 9586845 10422107 11615808 12966133 14124833
21286 14124833 15237303 16558464 17645356 18449661 19220762 19586828 20061404 19863111 19180174
21277 19180174 18988551 17902834 16934836 15458395 14510126 13081332 11970544 10741060
21269 10741060 9921609 8985113 8106624 7307791 6559845 6210528 5716312 5361798 4805468
21260 4805468 4585000 4225708 3923803 3834273 3383944 3339970 3097472 3001288 2878942 2680545
21250 2680545 2710144 2389245 2416217 2366644 2037460 2042924 1839969 1620028 2003887 2025039
21240 2025039 1689733 1746557 1565585 1510712 1426340 1668276 1629194 1642973 1438692 1457926
21230 1457926 1343887 1527461 1568264 1360357 1419558 1402869 1444911 1293543 1160601 1443399
21220 1443399 1262952 1388539 1227632 1356893 1233617 1273589 938838 1219311 1127271 1094536
21210 1094536 1326157 1032480 1159738 1313067 1123248 1183486 1309468 1232696 1315989 1162925
21200 1162925 1318498 996508 1202444 1062103 1248054 1189231 1233648 1018070 1300990 1023046
21190 1023046 1079509 1147073 1171499 1300184 1175814 1022421 1196815 986971 1383100 1115402
21180 1115402 1175225 1333311 1099750 1038909 1107806 1083754 1109730 1154758 1096130 1285326 1091224
21169 1091224 958739 1185682 1184493 1019931 1155412 1236389 1180793 1139215 1312927 1237125
21159 1237125 1207460 1024833 1170157 1097360 1140185 963995 962252 1121909 1113774 1283195 1038171
21148 1038171 946505 1130301 1288875 829818 871977 1081184 1006816 1019035 967339 863118
21138 863118 1040286 928412 893705 835660 1159938 1062578 951747 1068934 1066901 1268461
21128 1268461 1017869 1005435 1077148 1105819 946425 1020180 1243811 958867 1068628 1146969
21118 1146969 1193025 1156463 1389774 1453040 1330824 1209811 1327846 1180729 1311804 1550666
21108 1550666 1503086 1631039 1427254 1535669 1599144 1714991 1679838 1691631 1555381 1432978
21098 1432978 1472522 1160782 1344500 1342418 1214965 1306482 1190580 1319087 1514400 1222387
21088 1222387 1524621 1324345 1366461 1548382 1404532 1318601 1524895 1509343 1721845 1600413
21078 1600413 1350272 1373405 1470921 1319713 1520308 1436378 1485792 1412918 1245776 1208683
21068 1208683 1274071 1480905 1443232 1205875 1552747 1282991 1519081 1479791 1373273 1385916
21058 1385916 1132479 1648493 1502040 1800971 1712393 1689773 1832418 1855028 1954710 2493942
21048 2493942 2848297 3044146 3723860 4140580 4943086 4820004 5055948 5354499 4987446
21039 4987446 4906594 4293366 3528183 3442471 3079921 2861228 2453463 2574867 2210891 2541260
21029 2541260 2479688 2291318 2402790 2225896 2360771 2503995 2274223 2473350 2789602 3005664
21019 3005664 3377649 3620541 3916838 4200721 4897263 4958256 5213288 5203586 5111376 4902990
21009 4902990 4268024 4097334 3677764 3249864 3055475 2756566 2615518 2326011 2423883 2370457
20999 2370457 2243897 2263364 2336509 2333115 2116325 2237509 2342025 2085428 2254384 2294096
20989 2294096 2357614 2488076 2685547 3051791 3297151 3601109 4087689 4784739 5032937 5449623
20979 5449623 5659342 6001139 6015771 5898414 5290515 5277347 5189542 4728367 5131803 5447781
20969 5447781 5915111 6385061 6797340 7341975 7835447 8359047 8959536 9428390 10395228
20960 10395228 11563662 12930904 14938826 17254175 19143694 21199220 22620169 23545381
20952 23545381 24090148 23676979 22355222 20415595 18285592 15687172 13538789 11394840
20944 11394840 9636324 8328867 6953536 6223240 5146650 4511723 4167122 3934743 3688481
20935 3688481 3437004 3258463 3049282 2756705 2831683 2640763 2325439 2593030 2403533 2300005
20925 2300005 2359793 2048955 2406294 2300594 2435212 2322339 2362011 2488936 2406628 2652592
20915 2652592 2455778 2849554 2778678 2992051 3139064 3381378 3706796 3971212 4650351 5303633
20905 5303633 5576213 6394364 6824508 7323217 7832005 8472346 9032971 9624373 10792067
20896 10792067 12080637 13463283 15619158 17716589 19214847 20995790 21830056 22157952
20888 22157952 21657316 20354146 18348931 16285776 13505820 11362049 9549441 7966234
20880 7966234 6615269 5745147 4974621 4244636 4048904 3233191 3153865 2714636 2704615 2793068
20870 2793068 2377822 2344546 2170166 1943370 2000395 1970305 1724302 2145479 1806760 1788401
20860 1788401 1735553 1904713 1884780 1477213 1630605 1782769 1634446 1714028 1664783 1469075
20850 1469075 1626907 1606961 1797888 1614152 1742198 1748729 1695308 1455849 1453087 1658463
20840 1658463 1531727 1577800 1831210 1670012 1652396 1880089 1644268 1438494 1748346 1922099
20830 1922099 1658117 1463549 1842098 1918205 1745738 1729943 1696848 1763209 1846514 1686614
20820 1686614 1760815 1531219 1468768 1489848 1467461 1605017 1664521 1461388 1699118 1841865
20810 1841865 1824641 1792129 1865936 1752578 1673038 1794537 1812138 1893234 1733446 1491582
20800 1491582 1839406 1841930 1636540 1668682 1422722 1584597 1765405 1757498 1876611 1549850
20790 1549850 1315969 1570103 1752632 1347490 1557091 1429717 1450205 1281429 1416504 1370402
20780 1370402 1443638 1456016 1173844 1645749 1497344 1600748 1448060 1494804 1255353 1513011
20770 1513011 1452121 1591486 1296414 1223977 1341174 1453881 1344374 1421926 1095296 1222179
20760 1222179 1339350 1409260 1234053 1378031 1303482 1377531 1350264 1171536 1369847 1428900
20750 1428900 1313490 1409207 1414157 1570421 1519215 1177978 1704993 1355038 1383270 1480131
20740 1480131 1162024 1383201 1354852 1229426 1486669 1392908 1496736 1303765 1352616 1553137
20730 1553137 1600649 1594922 1422007 1633165 1471659 1448728 1436965 1335527 1440191 1497849
20720 1497849 1563395 1208751 1240309 1361487 1553520 1330231 1452134 1310828 1375319 1101549
20710 1101549 1404228 1417698 1513238 1366983 1524748 1617875 1484226 1611512 1552715 1702069
20700 1702069 1360783 1485181 1497512 1456828 1360609 1509585 1581563 1520021 1268841 1334688
20690 1334688 1297422 1526211 1304609 1401129 1176896 1493340 1509127 1437738 1331217 1703185
20680 1703185 1429227 1935326 1750669 1861341 1894248 1978480 1946255 1827981 1796861 1803058
20670 1803058 1765433 1658094 1797158 1701208 1613080 1545973 1604713 1270671 1413208 1508728
20660 1508728 1444214 1550586 1344259 1618399 1479385 1529489 1531050 1546801 1940407 1772207
20650 1772207 1714319 1843559 1751492 2021490 1747404 1851821 1879628 1844465 1945342 1996438
20640 1996438 1781444 1617790 1652675 1765404 1584184 1602537 1534037 1483202 1275134 1439345
20630 1439345 1217139 1212217 1399909 1075069 1516352 1269175 1631931 1531573 1193807 1337309
20620 1337309 1459483 1357904 1378630 1532481 1331454 1492710 1600647 1638621 1424829 1796257
20610 1796257 1540131 1395523 1657024 1434445 1524411 1446559 1318682 1259275 1573844 1374676
20600 1374676 1246765 1094683 1367613 1307144 1405331 1265016 1151268 1225806 1372179 1302255
20590 1302255 1598505 1536927 1267545 1422045 1459933 1536738 1553136 1248928 1281255 1206424
20580 1206424 1510720 1242284 1358387 1244662 1334180 1181045 1123260 1258834 1188524 1334368
20570 1334368 1187571 1263460 1237746 1255896 1236813 1171442 1153751 1315395 1420407 1151480
20560 1151480 1185854 1584578 1343201 1357588 1342611 1258364 1524338 1322823 1432751 1221475
20550 1221475 1334906 1444182 1188883 1508679 1527203 1310767 1294404 1270079 1219817 1513471
20540 1513471 1255133 1692498 1413764 1585579 1571705 1842359 1806649 1989767 1961872 1777464
20530 1777464 1702044 2037828 1912248 1645427 1816060 1634797 1644182 1743094 1619248 1506426
20520 1506426 1571680 1493140 1355193 1337163 1401203 1441156 1414229 1284392 1361497 1466030 1413796
20509 1413796 1546095 1630631 1599931 1408607 1557279 1812472 1604093 1665979 1880586 1582418
20499 1582418 1809907 1751659 1926273 1851981 1526945 1597192 1490518 1671287 1629031 1484469
20489 1484469 1868363 1468024 1505540 1564179 1440852 1536365 1610099 1693139 1288064 1905609
20479 1905609 1636523 1646696 1826665 1652079 1894070 1898508 1639362 1736869 1765318 1774826 1802233
20468 1802233 1671094 1552849 1467031 1808206 1711282 1662707 1681440 1596139 1441325 1519465
20458 1519465 1598619 1514473 1666144 1380406 1722632 1470908 1864909 1436557 1380882 1614847
20448 1614847 1523087 1541225 1623521 1533133 1694216 1434422 1283615 1264203 1593636 1360803
20438 1360803 1450146 1249462 1688908 1416943 1415726 1271541 1469756 1653301 1484192 1361073
20428 1361073 1331448 1399427 1676993 1402215 1571900 1447025 1503553 1350333 1549134 1822843
20418 1822843 1458074 1499033 1689487 1647425 1415213 1733109 1724398 1978869 1651070 1695974
20408 1695974 1918636 2008731 1856836 1743448 1736266 1905426 1767906 1584323 1692161 1871706
20398 1871706 1632170 1574016 1714916 1738877 1873348 1760612 1631002 1733621 1698446 1567736
20388 1567736 1673349 1481327 1481888 1728540 1732235 1578413 1656058 1690815 1506064 1689235 1618594
20377 1618594 1508409 1407249 1398313 1327836 1348953 1368914 1701458 1784274 1573438 1548558 1467079
20366 1467079 1582387 1620535 1599924 1661428 1803307 1647660 1612277 1493392 1803836 1594470
20356 1594470 1716680 1565919 1710270 1554206 1774822 1766426 1879530 1859265 1728101 1886175
20346 1886175 1847143 1908583 1768859 1768495 2229742 2190259 2455982 2264900 2392291 2355800 2422791
20335 2422791 2377885 2639566 2762571 2645932 2703863 2791858 2615112 2639161 2700073 2294706
20325 2294706 2397167 2591159 2223169 2116173 2126719 2300650 1913423 1929269 1944036 1861727
20315 1861727 2110810 2024437 2064606 1682360 2214455 2060001 2383617 2093020 2317415 2107904
20305 2107904 2170909 2421975 2303967 2218839 2405650 2283613 2125270 2473153 2497285 2566881
20295 2566881 2777058 2776923 2984074 3402518 3849082 4246739 4506064 5064381 5549725 6102340
20285 6102340 6214497 6556175 6549344 6911920 7148706 7162118 6797906 6981385 6725091 6700242
20275 6700242 6174807 5648590 5334883 4756923 4550139 3943608 3577394 3300616 3091558
20266 3091558 2850487 2880667 2880989 2753814 2711523 2774400 2564975 2287657 2400819 2554318
20256 2554318 2556441 2246200 2510747 2316083 2285911 2202904 2357335 2147964 2398837 2273771
20246 2273771 2079728 2319361 2224034 2126258 2419667 2388720 2429476 2643665 2556088 2196965
20236 2196965 2843982 2571517 2591308 2903285 3066862 3101669 3288736 3389915 3315603 3456740
20226 3456740 3777192 3932410 4599754 4667847 5180165 5848709 6447317 7182357 7773694 8466514
20216 8466514 9030391 9846064 10328290 10291611 10418874 10697084 10599197 10480447 10461649 10296112
20206 10296112 9768827 9534920 8784816 8009992 7094185 6661980 5833465 5539276 5194416
20197 5194416 4739806 4656350 4685109 4687042 4891073 4866615 5131847 5287996 5742742 6204319
20187 6204319 6738036 7252494 7939060 8971439 9775407 11232426 12121315 13828792 15466009
20178 15466009 17433738 19295805 21288220 23402835 25003198 26576527 27937767 29184992
20170 29184992 29803667 30144352 30110440 30071464 29081221 28195695 27115576 25545013 23414844
20161 23414844 21619738 19307619 17123966 14939910 13437817 11658069 10369683 9412980
20153 9412980 8118194 7772926 7157944 6371551 6399265 5838653 5853660 5537866 5381911 5657799
20143 5657799 5637778 5818362 6050296 6134414 5884248 6257454 6265429 6380797 6384370 6320014 6171863
20132 6171863 6165164 6461755 6482671 6724086 6956022 6938994 7183917 6741591 7165736 7259529
20122 7259529 6950023 6658323 6753552 6525167 6307919 6022323 6067647 5882786 5409425 5168039
20112 5168039 4902652 4575638 4355560 4060168 4004431 4007560 3756621 3690824 3830381 3981991
20102 3981991 4059423 4147315 4924154 5243131 5361128 6235197 6619572 7370106 8062778 8955534
20092 8955534 9831262 10400203 11594690 12726027 13559216 14824967 15693891 16376860 17217305
20083 17217305 17840682 18150980 18222507 18058742 17314527 17108711 16421636 15770993 14788720
20074 14788720 13676589 13297265 12316915 11176168 10367696 9349399 8651852 7796821 7447810
20065 7447810 7425734 7254538 7008011 7150260 7449980 7668602 8294501 8812781 10009343
20056 10009343 10761935 11827564 12958709 14218376 15279047 16286913 17238857 17709265
20048 17709265 18384943 18411312 18429363 18063024 17542266 17229331 16422236 15378415 14440716
20039 14440716 13087441 11831977 10418640 9131441 8007015 6945788 6124184 5426076
20031 5426076 4696365 4541601 4213911 3740092 3655442 3465558 3223464 2920377 2939829 2848197
20021 2848197 2397349 2455503 2341644 2247865 2186192 2230990 2244438 2066609 1996356 1994355 1939035
20010 1939035 2111144 2076015 1684782 1821165 1949485 1789105 2026457 1858807 1812932 1807779
20000 1807779 1591791 1787143 1827607 1842835 1958404 1674139 1649796 1764866 1592268 1825325
19990 1825325 1800468 1793097 1699883 1742091 1824471 1624383 1813515 1831443 1845002 1710713 1790228
19979 1790228 1658673 1674905 1570235 1770723 1694727 1673691 1754555 1815313 2104174 1775810
19969 1775810 1753812 1873753 1859327 1900670 2030085 1797719 1708427 1921153 1785341 1708945
19959 1708945 1828478 1922879 1833826 1744697 2108836 2107933 1746398 1917014 1985857 1957062 2076067
19948 2076067 2120357 2177135 2016554 2184908 2160851 2117329 1970292 2101804 2030328 2080624
19938 2080624 2251994 2027142 2381437 1916994 2178417 2023248 2026196 2226458 2101460 2071188
19928 2071188 1945373 2074999 1914272 1953284 2099973 1830038 1798358 1928546 1907978 1902728
19918 1902728 1918327 2008027 1886457 2178912 2148672 2081316 2264364 2192828 2030270 2251585
19908 2251585 2218588 2217169 2240395 2110677 2338167 2335327 2329499 2349510 2345407 2435930 2338032 2293455
19896 2293455 2369435 2601140 2783574 2560972 2767601 2606366 2666106 2471718 2635017 2725835
19886 2725835 2637770 2793254 2797389 2799298 3021560 3248788 3037801 3050285 3103470 3237510 3268920
19875 3268920 3275016 3046430 3422132 3383115 3541612 3417854 3797274 3732674 3731519 3879712
19865 3879712 4008200 4293182 4235026 4547708 4725104 4878749 5060604 5545947 5693010 6088152
19855 6088152 6660166 7317961 7978515 9230339 9879278 10702978 11681184 12581858 13433738
19846 13433738 13948576 14126888 14641730 15184180 15174758 16184392 17056638 18404637 19884199
19837 19884199 20910735 22458663 23558115 24368642 24955088 24635159 24208576 22822327 21458170
19828 21458170 19572458 17867869 16553149 14841230 13859001 12959326 12524296 12098351 12273737
19819 12273737 12154181 12489471 12654699 12968791 13286794 13482042 13806646 13711738 13590625
19810 13590625 13690561 13970301 14263075 14944227 15818769 16831910 17705136 18686771 19440850
19801 19440850 20036186 20038156 19857273 18841523 17675055 16245079 14541253 13102795 11529134
19792 11529134 10038202 9049133 8213200 7201890 6812552 6341641 5690882 5071279 5023877
19783 5023877 4756712 4516946 4470967 3856100 3843392 3720268 3563346 3467118 3403878 3393152
19773 3393152 3277439 3247639 3107548 3248978 3080618 3124399 3078313 3103146 3093858 2848784
19763 2848784 2825793 2802700 2859624 2880118 2864831 2776864 2840147 2769407 2785053 2805860 2680064
19752 2680064 2723481 2653523 2859780 2598197 2617150 2787116 2704914 2601160 2390913 2509965
19742 2509965 2644165 2456750 2447677 2364528 2234120 2484582 2453161 2532595 2474126 2308193
19732 2308193 2599617 2482505 2421068 2409411 2582288 2210643 2435875 2373615 2490741 2332753
19722 2332753 2634202 2448869 2296807 2481485 2334804 2230012 2310070 2296580 2211415 2338676
19712 2338676 2376163 2358629 2368957 2324290 2353331 2142480 2594326 2272436 2144443 1899814
19702 1899814 2060723 2213285 2308385 2199144 2190579 2204597 1978861 2145852 2185853 2225822
19692 2225822 1994372 2162244 2185793 2050615 2071766 2124934 2009824 2136966 2036000 1713224
19682 1713224 2091186 2042543 1916106 2092211 1829277 2091019 1919511 1775830 1917227 2077605
19672 2077605 2067290 1854489 1835804 1737356 2041880 1795285 2062123 2059202 2043974 1887169
19662 1887169 1943838 1907681 1889342 1991242 1870524 1856958 2030550 1850472 1815345 1933235
19652 1933235 2047557 1934761 2088808 1821709 1935355 2045600 1959564 1863702 1883557 1976485
19642 1976485 1926846 1743352 1873691 2046542 1863346 1989502 2125565 1845409 2020610 1882700
19632 1882700 1834751 2064836 1923227 2016597 1963941 1713085 1813851 1874979 1785610 1840970
19622 1840970 1653963 1588457 1936941 1831676 1687380 1864769 1912072 1658948 1777056 1575530
19612 1575530 1796723 1642145 1736552 1782110 1688828 1499342 1757974 1561343 1640745 1613207
19602 1613207 1618023 1743026 1578596 1671155 1604498 1847469 1727144 1464997 1772921 1647083
19592 1647083 1632995 1746259 1492994 1515046 1629017 1592544 1744958 1471388 1378533 1478629
19582 1478629 1625076 1693433 1568528 1547945 1785106 1487637 1488354 1553302 1498884 1705452 1513000
19571 1513000 1481022 1428210 1559189 1460444 1399198 1775892 1505711 1555836 1559384 1327352 1316816
19560 1316816 1753188 1533771 1522816 1476138 1299294 1352086 1095529 1324574 1435823 1248666
19550 1248666 1368995 1330938 1147881 1489884 1367717 1453136 1387073 1521501 1200819 1458071
19540 1458071 1418304 1368323 1373272 1551114 1387286 1469893 1643815 1275387 1538931 1414529
19530 1414529 1506477 1341712 1389696 1363916 1391207 1491417 1265965 1452808 1466430 1464455 1510030
19519 1510030 1341805 1334586 1482118 1247479 1616608 1489113 1470488 1308558 1417972 1242956
19509 1242956 1495365 1323715 1570241 1381763 1409420 1474871 1493989 1326252 1281513 1320529
19499 1320529 1262029 1262283 1274424 1262788 1284273 1484619 1384628 1402637 1085057 1183731 1168689
19488 1168689 1337451 1295864 1222930 1123639 1487354 1291535 1235321 1302789 1160268 1293914
19478 1293914 942642 1085815 1177966 1259546 1048550 1183836 1029450 990614 1048636 1147658
19468 1147658 983903 1095265 1100938 866518 1014749 1128939 1199838 1214623 1089215 1381839
19458 1381839 1388886 1217278 904355 1061758 969074 1061524 1088703 885792 740175 907758
19448 907758 947968 970360 1074997 780976 836914 867318 945613 828066 885332 969367 938527
19437 938527 1018984 901147 1020318 1011707 1033126 938749 866221 819077 789669 913845 824569
19426 824569 862430 768097 796850 897155 784824 801470 863755 843889 562839 954048 771895
19415 771895 960909 848841 829481 878169 751351 1039540 772667 934913 858653 954122
19405 954122 832109 784709 1076250 899979 802463 680181 822505 663255 737081 885838
19395 885838 623157 761571 1185847 999472 1059556 677047 819713 991446 903475 753834
19385 753834 1041340 1010317 775675 699117 938327 763258 969290 911291 745299 699696
19375 699696 746709 1055996 744689 725171 757993 926114 804652 839568 975274 851338
19365 851338 911655 811660 863203 1030208 979062 767879 995987 892269 913405 938184 996619
19354 996619 769731 950165 873906 1097402 682551 962004 1008548 762977 843984 870367
19344 870367 1010470 815832 813099 658556 763306 885637 842398 869880 638033 730049
19334 730049 805615 566381 1003234 931337 825367 821019 768131 639735 963702 814733
19324 814733 1062973 856797 776963 799515 1058872 1048252 853820 752059 1005469 765897
19314 765897 756414 830515 924816 714301 1074717 973903 943995 1033087 958458 1019001 931308
19303 931308 549106 901029 941167 977832 890565 987769 823921 913848 903560 924263 950939
19292 950939 984514 1089604 1005517 922002 890396 1126440 757413 937672 728066 838418
19282 838418 749887 930330 865722 740037 787426 710701 577378 663968 728138 679346 926613
19271 926613 843856 794355 727200 873972 749352 830634 473909 1162682 886546 763782
19261 763782 775658 889494 977475 935089 859871 780635 645187 516233 986557 662096
19251 662096 857238 794222 738039 760513 810153 726468 887458 1061796 1176515 1171224 1360995
19240 1360995 1266999 1487407 1467734 1474369 1319092 1316765 1321608 952262 945300 996212 969381
19229 969381 975096 658661 630401 761895 694118 816567 769684 1083784 952241 941720 851106
19218 851106 811545 780769 729783 568964 886933 703306 739508 873985 613376 926064
19208 926064 827600 697447 704880 763348 600252 716999 526347 502024 691722 796132
19198 796132 630921 800769 696344 504317 761777 859576 599186 501084 531359 555598
19188 555598 750793 784191 484616 813692 763868 877849 692548 566479 736063 686085
19178 686085 521103 660046 691006 960955 642736 1004650 701242 811427 867685 757478
19168 757478 857361 999007 679828 1069400 825806 1030767 1093987 1308736 1117738 1284649
19158 1284649 1344451 1300209 1218137 1353979 1347795 1088555 1151024 1153707 1182595 1130666 987151
19147 987151 973228 1319520 1049062 1116436 1221755 1346376 1378655 1205353 1389069 812983
19137 812983 1080657 1202236 750811 1172366 961026 1114527 929533 986164 967863 1183580
19127 1183580 1234309 1213756 631838 1031490 881819 994975 1351711 1001367 945154 1069721
19117 1069721 1047974 1007811 1136899 1252642 1188358 1250977 1193981 990598 942492 1245861
19107 1245861 973215 1221524 1210592 1225783 1043610 1321642 1336866 1599634 1503478 1830938
19097 1830938 1939052 1952142 2313819 2081770 2735568 2945922 3526493 4031425 4091052 4441036
19087 4441036 4694450 4925023 5174019 4846550 4674766 4184112 3707446 3247640 2684391
19078 2684391 2527394 2337238 2214149 2024755 1788375 1617535 1764182 1644348 2037853
19069 2037853 2102576 2348728 2712664 3124546 3565533 3736769 4206649 4443485 4338739 4203374
19059 4203374 4388310 3860010 3354020 3008914 2878031 2854521 2660742 2868427 3255715 3758934
19049 3758934 4280479 4248824 4952284 5130313 5049778 5209340 5026980 4363601 4201803 3569665
19039 3569665 3172463 2974644 2429073 2258507 2269393 2258168 2142823 2088774 2216070 2346381
19029 2346381 2474704 2976428 3373070 3657301 3886956 4710986 4966856 5052158 4939823 4717026
19019 4717026 4286716 3620316 3032642 2670457 2385356 2276132 2048845 1979430 1895519 2026139
19009 2026139 1940383 1950699 1975490 2296288 2375699 2562603 3240250 3529516 3930036 4536682
18999 4536682 4646417 5014401 5351078 4981356 4823854 4621118 4318803 4156678 4198432 3956015
18989 3956015 4554190 4774633 5075749 6177669 6720497 7800818 8777593 9694636 10842681
18980 10842681 12135988 13577652 15075552 16789638 18031699 19379208 20729294 21341246
18972 21341246 21718209 21193128 20169056 18568620 16155861 14032513 11783513 9994384
18964 9994384 8233422 7108798 5897518 5179537 4610014 4221512 3740818 3249502 2942309
18955 2942309 2679101 2353034 2446778 2399410 2121764 2347089 1755219 1946019 1942307 1787820
18945 1787820 1533506 1576915 1654137 1717709 1591503 1985439 1958940 1862336 1766686 1829772 1864426
18934 1864426 2054225 2057725 2101598 2228805 2114018 2330404 2428886 2347462 2628181 2993503
18924 2993503 3116788 3215083 3896977 3911188 4445852 5422661 6180055 7388772 8725500
18915 8725500 10305022 12210096 13856075 15851242 17255420 18670188 19507556 19707870
18907 19707870 18820260 17729089 16047984 13959461 11655538 10118206 8210258 6658278
18899 6658278 5803765 5082657 4088707 3610729 3165845 2772079 2345973 2141448 2182816 2021119
18889 2021119 1813484 1706554 1233881 1531540 1314369 1267401 1193533 1244623 1343689 1171050
18879 1171050 1240504 1027634 1006196 997435 1166022 744324 1051369 1043744 1185881 644148
18869 644148 1001081 772720 603050 500076 757353 703578 749292 817566 806241 793004
18859 793004 831327 874924 715027 765370 670681 851558 764141 735278 952574 723212 878017
18848 878017 1044303 851506 784805 803452 774733 574743 877395 735644 706588 593992
18838 593992 516229 745508 399532 552500 645156 727923 777003 579115 848043 682608
18828 682608 710780 740183 683839 851387 770897 857020 820301 706737 692829 866846 218013
18816 681838 835902 809399 486968 844438 617823 769011 593724 762900 517675 740244
18806 740244 683780 780504 873893 652664 768804 764627 744773 576625 773303 771282 789139
18795 789139 821645 788644 715901 896145 740381 646235 790086 1191601 726574 788789
18785 788789 888261 931980 969891 1008481 850491 1014275 938339 785069 811723 856507 971427
18774 971427 822014 881675 887580 650100 669785 836294 874620 857478 733814 772850 537809
18763 537809 607391 500843 558440 592246 650583 551765 689424 873641 614428 464126
18753 464126 503346 514683 716901 588126 690900 612278 865562 796870 688633 697915 804582
18742 804582 602462 438314 693710 966064 568985 511040 696923 604292 770745 568055
18732 568055 632929 817330 701290 536895 533588 791083 749241 678722 666353 744513 761703
18721 761703 815500 835348 644916 822758 655117 689858 851497 866160 699126 325282
18710 735454 656395 645554 610199 818893 599865 684006 577853 849777 563225 541086
18700 541086 683965 708267 667399 489089 605504 582105 587822 779144 594573 613172 864209
18689 864209 685382 686681 683168 738905 664506 752797 614767 893018 586156 764862 617591
18678 617591 773332 668971 740397 776039 823155 680179 639980 780511 588053 860872
18668 860872 800012 442642 839486 647400 729110 823245 613966 476855 592842 762723
18658 762723 456273 699706 656119 667739 717799 689527 511058 597271 551368 472205 776139
18647 776139 723158 881940 530190 769178 865151 561727 643288 546672 789108 581795
18637 581795 717075 730982 520135 354256 917070 717358 650020 639494 494672 529372
18627 529372 518117 627356 669004 484266 503861 367366 598639 431233 686091 507106
18617 507106 625131 412244 684519 624981 374999 818612 401224 516816 556121 539286
18607 539286 723649 759982 577437 778816 658454 620721 766316 638943 913409 661107
18597 661107 852481 660997 809098 655893 677145 722168 724437 526059 833136 689780
18587 689780 954418 539027 864288 1067675 853459 837264 751431 767453 672409 802229
18577 802229 641842 759975 597004 737868 726859 645673 644887 690496 516589 659676 609282
18566 609282 658625 777551 488960 735695 408893 661569 647641 723066 406069 560968
18556 560968 653117 661403 579743 481031 492771 342133 661053 653066 415676 522722 419880
18545 419880 724656 480356 556487 660691 335968 574124 612829 405612 441423 756229
18535 756229 642700 692280 486882 550545 586013 646235 428686 527736 705236 881914
18525 881914 472945 622798 691334 444894 585663 536911 516733 625389 628741 461617
18515 461617 430533 384703 535049 479564 609182 441920 361661 479209 259301 482701
18505 482701 374193 684748 682013 421779 595870 644702 764631 586097 496233 426577
18495 426577 470650 652397 668672 416328 427205 448377 519275 660188 431370 665709
18485 665709 518409 545449 678278 373991 449575 614813 617095 551945 404351 722108
18475 722108 567291 861271 652807 420102 608061 479167 551384 574550 641244 319328
18464 662941 452782 344530 510343 666120 385743 522199 638304 545778 544142 499637
18454 499637 547854 640152 650156 645458 689966 610798 749459 711332 509903 890540 842371
18443 842371 637439 633065 784050 654129 560392 677508 736969 648507 671873 585572 524521
18432 524521 359264 499019 505574 466127 654951 715585 637559 550744 364685 693940 527753
18421 527753 729848 693461 640236 564904 702227 819796 776512 716872 675439 368499 676619
18410 676619 728532 610145 683871 542780 467901 684288 485055 494744 558683 567836 575216
18399 575216 548533 606371 426608 281833 435599 459459 505918 620310 691001 557978
18389 557978 477248 429043 351111 417122 592796 715444 509062 537023 325997 447144
18379 447144 582346 419047 572846 686232 447083 414578 458211 610859 396101 573966
18369 573966 599233 436346 450627 504195 576030 350723 564320 381293 528218 527468 689800
18358 689800 574119 445876 489008 672308 550714 315713 417819 677389 443982 760029
18348 760029 659408 455880 515005 709438 350364 575806 560843 613761 617140 713245 576796
18337 576796 590445 509240 520223 828711 582232 699556 744793 839827 706473 474608
18327 474608 252004 594607 422118 484639 454690 304901 607618 533771 613490 729609
18317 729609 291067 571584 405535 633305 701485 641440 497965 852940 543146 660606
18307 660606 691814 542985 642871 585266 628590 686126 701209 706638 625070 697611 579571
18296 579571 695111 593440 565459 658691 306566 419170 455742 660005 534830 396718
18286 396718 575163 328856 367212 374294 543825 602790 466606 645656 477921 469972 719574
18275 719574 739961 416381 471919 702514 597323 548156 543968 461465 561137 424915 546847
18264 546847 837011 649793 504207 493004 514196 595703 550023 501215 565721 651124 471166
18253 471166 532847 648772 569113 625406 608500 845581 406677 778937 744555 442839
18243 442839 419202 519105 602989 512158 343771 320992 516358 635607 534065 576606 638460
18232 638460 470501 446461 757159 790335 361924 764688 675647 408202 459555 656329
18222 656329 558044 420910 570012 471568 589067 747629 449405 571891 639153 653286
18212 653286 466474 457727 676680 600189 568954 367706 676028 447781 551607 619317
18202 619317 615872 536650 745336 893954 499251 668590 572208 508422 561789 709651 680055
18191 680055 736100 460519 621157 404552 565672 645660 863794 554530 519663 610577
18181 610577 612662 539360 756770 537345 498258 611744 680187 552929 585766 531855 754088
18170 754088 587274 616397 666222 762496 340360 544285 711759 543162 684450 589748
18160 589748 458289 322148 567596 701032 539111 665115 503205 686711 384895 677714
18150 677714 342464 561602 568869 722378 643615 602003 647382 476778 607134 556969 789370
18139 789370 576639 392343 418709 589865 582517 475293 568713 581237 607065 685095 445771
18128 445771 701892 499861 408378 476612 620929 327237 823490 645482 679936 482171
18118 482171 318496 427978 623844 536248 573080 683198 480324 578344 492029 604376
18108 604376 618865 530658 674741 521839 558184 504749 479782 676511 666121 366567 408937
18097 408937 599832 456689 629004 636184 641107 393425 504919 520346 703552 443739
18087 443739 634162 575879 405624 327551 562519 411854 455451 497341 441086 414581 742502
18076 742502 462956 523199 543124 712179 440429 361704 659480 699511 419762 503224
18066 503224 459333 654734 436903 371145 610296 546504 304551 497654 563198 599114
18056 599114 730363 376896 624677 496124 539244 403096 543997 581172 405033 357972
18046 357972 547973 571623 265243 591620 372411 584110 452821 331426 412125 632467
18036 632467 445836 571175 623121 369001 538734 551271 354813 622323 616323 357894
18026 357894 350700 365474 396490 540220 497530 657084 570634 485683 369745 615746 451998
18015 451998 637159 466348 564743 494931 527854 325723 459745 663825 583218 176415
18004 576828 540651 607292 417668 555879 486269 574607 349927 581225 442516 567053
17994 567053 171737 280705 473178 660096 308006 652566 497102 661148 625826 424784
17984 424784 569606 334147 483857 525099 482769 644104 630353 457258 602221 596197
17974 596197 542275 641754 631420 743790 358182 491883 535393 615271 470393 422603 230169
17963 230169 543272 495749 652797 577226 759688 738439 614682 522595 562186 575702 614440
17952 614440 412008 527020 780284 360725 358607 552146 683443 644147 431209 492763
17942 492763 467001 216343 611996 393858 747467 515276 440898 517634 655858 503091
17932 503091 506548 686892 793632 652646 750075 688526 615024 660071 470292 572950 782636
17921 782636 876560 587680 444621 546547 592456 723984 613317 467581 713589 673731
17911 673731 532869 751581 589635 667427 593144 560655 791671 841890 745409 457190
17901 457190 733896 671798 574858 866583 552723 807217 383992 753621 550667 676795
17891 676795 535662 736461 568203 655481 634806 640574 888919 883059 732154 834637 606523
17880 606523 776751 912587 530057 547835 839240 516754 512579 465296 677691 726288
17870 726288 615520 598697 840469 694690 795447 680024 686058 414451 585079 889858
17860 889858 659650 723704 902734 819285 614326 674403 496892 722000 471975 729017
17850 729017 701151 580491 513544 801802 746054 721708 754895 565457 834078 886116 875600
17839 875600 649591 712416 580511 530214 626512 605349 800769 679834 775211 668232
17829 668232 700597 634153 840872 647453 521625 659393 1096834 897672 866369 721102
17819 721102 876339 670036 1031188 899761 1031001 1083307 1108652 535688 1027632 985742
17809 985742 668185 800592 840747 956408 1009814 790332 668757 664513 734153 845107
17799 845107 969924 812230 750632 888978 843945 741896 939288 456575 707222 631722
17789 631722 774180 630112 687685 544369 826942 573087 583495 683709 647633 668179
17779 668179 278785 516431 366053 544587 693224 670155 543063 573328 682333 637728
17769 637728 677422 646560 635911 657083 648237 696331 576064 743324 697252 457204 600738
17758 600738 841355 766684 690217 776641 516745 587960 729126 643495 841493 757718 632829
17747 632829 677556 891945 748845 546522 573345 686201 602314 609754 610211 315572 751907
17736 751907 787382 660161 664486 515127 593440 571785 432749 766420 797952 823384 594281
17725 594281 965812 565244 625760 792398 643384 423182 737430 612737 608466 715962
17715 715962 588603 921783 576837 665324 794269 499185 683914 740292 575452 695194
17705 695194 558218 420220 744618 753640 729062 605479 564623 794745 602157 575365
17695 575365 755379 683590 711761 609585 725169 663700 522197 764126 763501 435873 780464
17684 780464 697056 787224 639277 529457 779336 525559 630010 646273 668051 735971
17674 735971 885380 608463 711103 811446 676390 633183 660563 563343 839838 586403
17664 586403 865865 776404 745193 862457 627355 688478 882661 865726 620432 702899
17654 702899 842180 674871 876959 897445 907938 649169 899386 934644 890361 863287
17644 863287 1043717 801196 621048 876331 724380 824076 1126243 795824 969684 979659
17634 979659 941787 935636 1108666 963003 1084430 999130 895780 1025133 962854 1097952
17624 1097952 1094214 1023868 1089921 1026056 1112651 1093003 1061961 1021096 1192237 952780 1075662
17613 1075662 1059206 1280238 1139544 1160356 1381046 1250493 1221132 1063131 1486355 1484313
17603 1484313 1032664 1313657 1066856 1243611 1472276 1280938 1257366 1155657 1332054 1325932
17593 1325932 1435427 1334044 1255713 1298253 1321188 1261086 1195693 1235187 1256664 1170103 1139719
17582 1139719 1171150 1233715 1212429 1082983 1195693 1391369 1235207 1193906 1212101 1353562
17572 1353562 1399771 1350746 1414551 1460296 1170289 1301410 1322604 1363175 1395406 1436840 1447285
17561 1447285 1271796 1307103 1090976 1217485 1015096 1360834 1175472 1201807 1194178 1267420
17551 1267420 1045398 1071056 1105267 1191399 1432933 1228680 1256576 1067263 1339437 1488044
17541 1488044 1358055 1371283 1161666 1528668 1279435 1556766 1371710 1334579 1569558 1389814
17531 1389814 1239948 1271705 1223665 1334917 1395444 1461852 1334323 1539322 1573747 1416836
17521 1416836 1420627 1362440 1274345 1165201 1626765 1535911 1301668 1519166 1626072 2024551
17511 2024551 1934764 1733240 2109140 2141380 2095010 1987221 2177931 2317824 2220240 2117376
17501 2117376 2250515 2145050 2530483 2563440 2684781 2954792 3265173 3421658 3773596 4084656
17491 4084656 4456889 5027043 5819034 6981737 8877202 12563870 18208841 26349082 36270159
17482 36270159 46336750 55785147 63142302 69104857 71566692 70424520 65313772 56741049
17474 56741049 46570405 36515818 28925783 24566115 25157670 29664414 37394136 46553154
17466 46553154 55363399 62831325 68653757 71888000 71569810 66981441 59129145 48098360
17458 48098360 36807262 25890006 17595206 12070556 8426946 6581641 5381587 4610852
17450 4610852 3990374 3762629 3545571 3351338 3242385 3421003 3639475 3411858 3725989
17441 3725989 3821695 3759377 3729846 3588695 3446256 3299118 3146759 2899042 3144499 3022335
17431 3022335 3051901 3099405 3376754 3284365 3321382 3229348 3247570 3091075 3030676 2781819 2635771
17420 2635771 2459574 2346784 2243574 2313169 2226773 2245238 2145214 2226630 2275587 2408403
17410 2408403 2437298 2088060 2437651 2337129 2332798 2421729 2545366 2661238 2967139 2831664
17400 2831664 3241582 3376284 3463705 3731221 3738771 3879386 4238811 4469562 4801243 5365627
17390 5365627 5691804 6281837 6551063 7029998 7202899 7492652 7469469 7600415 7573985 7327716
17380 7327716 7212420 6964735 6438610 6351315 6346141 6167081 6477231 6486404 6898100 7231545
17370 7231545 7453697 7979538 8456542 8809229 9018912 9418732 9257105 9195288 9478593 9158466
17360 9158466 9054262 9146580 8867352 8982209 9039205 8987194 9244127 9503304 9860027 10303254
17350 10303254 11071421 11484227 12076209 12918839 13262146 14016740 14583852 15029381 14869554
17341 14869554 15270335 15081624 14943802 14720879 14005283 13637112 13349666 13387551 13072252
17332 13072252 13088229 13059615 13560689 14116717 14581195 15031804 15334719 15972093 16660143 16874564
17322 16874564 17464722 17677897 17497025 17677023 17550202 17350668 17121908 16881202 16489348
17313 16489348 16387758 15982345 15652662 15407820 15464312 15485929 15657177 15995759 16211444 16470368
17303 16470368 16802570 16995334 17288521 17194653 17266119 17238452 16955621 16821421 16689308 16142117
17293 16142117 16284415 16030184 16021934 15787305 15721211 15838448 15799934 15797481 15383200 15177701
17283 15177701 14841104 14448440 13611537 13190707 12492521 11586841 10883890 10194505 9494891
17274 9494891 8869627 8125987 7639346 7364576 7087461 6928312 6691144 6203462 6126523 6210185
17264 6210185 6146007 6192941 6155311 5884554 5783480 5380455 5209725 5258460 5102264 5193313
17254 5193313 4796101 4879958 4589156 4602535 4451818 4371550 4787943 4314762 4736003 4524322
17244 4524322 4185418 4264688 4236748 3937495 4087737 4005423 4040031 3728135 3559939 3620626
17234 3620626 3436701 3245548 3387775 3344410 3132677 3147568 3332587 3271353 3128349 3116762
17224 3116762 3257813 3427499 3269795 3327525 3364728 3413277 3407477 3296499 3293864 3484621 3523123
17213 3523123 3311246 3298287 3347913 3112057 3213159 3370695 3305719 3093347 3140419 3285624
17203 3285624 3110264 2948977 3188819 2981388 2805112 3055564 2926123 2687413 2769025 2421567
17193 2421567 2412560 2266361 2167494 1999218 2160610 2289590 2113132 2115745 2278263 2249066
17183 2249066 2100952 2232267 2227880 2254344 2075951 2326239 2305964 2403237 2095750 2208771
17173 2208771 2423028 2460065 2431648 2668008 2699317 2333571 2595052 2452837 2447086 2510763
17163 2510763 2632110 2506079 2747945 2692506 2709212 2706594 2936170 2758354 2681260 3095048
17153 3095048 2995030 3032064 2870014 3058789 2721060 2849077 2982435 2862306 2731211 2633245
17143 2633245 2557436 2608783 2949961 2662434 2787552 2797482 2968918 3013239 2809136 2814501 2797440
17132 2797440 2525547 2430963 2741859 2685194 2524764 2441668 2419328 2505458 2541666 2497711 2571785
17121 2571785 2536430 2384306 2398247 2524403 2481124 2342210 2156303 2244183 2326707 2344328
17111 2344328 2313058 2431064 2074780 2322126 2276196 2402472 2678739 2610292 2509313 2355470
17101 2355470 2387403 2366041 1872134 1847124 1888609 1934467 1708249 1760331 1534341 1690698
17091 1690698 1295993 1451500 1502203 1305035 1265151 1206921 1036503 939080 1086722 1163418
17081 1163418 1112630 1390670 1222082 1358245 1078392 936033 1079472 1216880 1124636 1132746
17071 1132746 1127585 1041560 1245530 1081136 1303225 1223274 1089938 1011060 1377105 1202881
17061 1202881 1313872 1119537 1098803 1332905 1330368 1740175 1685324 1698963 1911870 2202229
17051 2202229 2169169 2129471 2064451 1959586 1960779 2324527 2177915 2304736 2120944 2417784
17041 2417784 2421721 2651623 2607046 2780960 2737623 2857589 2725227 2464680 2380714 1866962
17031 1866962 2157135 1819069 1568208 1755330 1568252 1516439 1580203 1619181 1411040 1345046
17021 1345046 1370992 1263468 1328379 1223371 960700 1152477 1300236 1313155 1129657 956649
17011 956649 1387393 1058617 1067147 1000797 1161499 1127135 1119484 1077882 1072243 1200763 1246138
17000 1246138 1228267 1286846 1149759 1190437 1203236 1052372 1352098 1092382 1125475 1340807
16990 1340807 1139342 1136837 1210460 1019640 1116054 1208413 1090329 1182810 1252217 1353039 1297233
16979 1297233 1251722 1364334 1243844 1505964 1359961 1178162 1283457 1473442 1574459 1724921
16969 1724921 1737567 1727665 1537706 1774461 2033993 2165922 2075820 2333938 2375589 2548613
16959 2548613 2614597 2355629 2584534 2729329 2635322 2416872 2517815 2307404 2556064 2427395
16949 2427395 2443467 2046591 2156370 2038172 1921761 1966291 1818200 1840804 1605441 1659883
16939 1659883 1382262 1546604 1194432 1075597 1346382 1387740 1264552 1090835 1190829 1193558
16929 1193558 1175694 1246690 1147862 1248126 1211873 1245164 1004595 1040706 1168294 969077
16919 969077 946784 1291994 963291 827423 1054299 873213 981377 859653 1150104 1002040
16909 1002040 821811 796117 954890 835763 1031273 1123866 818893 938162 983774 980836
16899 980836 862894 970280 1055501 792248 666339 699252 546765 697634 814405 698122
16889 698122 932182 815159 936266 924848 868997 1086029 932389 706158 735815 680147
16879 680147 757050 550092 753038 806705 849117 942956 692437 1003772 708638 750631
16869 750631 1049588 755115 858975 700842 874099 654605 879594 833154 933122 828205
16859 828205 785627 766332 837217 710920 836297 664500 1008103 834522 713055 822163
16849 822163 738272 672639 882628 794614 689445 658409 695214 1010603 938105 979596 858323
16838 858323 928121 895767 780237 884481 977480 1075753 1063567 1119455 1030375 1120251 801966
16827 801966 971150 1000002 972516 1020983 1111705 1084116 1171485 1461683 1263153 1551479 1628572
16816 1628572 1591792 1685434 1457621 1579861 1558097 1539526 1511651 1656205 1483352 1518646
16806 1518646 1372075 1504443 1408700 1562017 1441023 1389098 1584922 1400567 1478836 1426442
16796 1426442 1395074 1243503 1359557 1238503 1024841 991040 1156080 794754 786704 814751
16786 814751 775876 611940 634312 704201 568002 439010 772419 617159 580900 889662
16776 889662 592657 548980 553534 576350 631181 741060 798577 947334 664294 795535 742562
16765 742562 790247 804461 734802 861438 630649 894166 680528 661193 661921 698101 667349
16754 667349 712294 935284 828692 806366 1089389 949664 927486 871077 760452 799171
16744 799171 850404 794584 905407 710735 732900 796465 872684 708936 714610 873039 665119
16733 665119 768190 751620 991495 848404 926928 588982 925542 716670 733101 1142156
16723 1142156 893124 916871 1019715 871684 714764 1035476 1111463 1050219 953043 1016715
16713 1016715 821044 874722 870064 995356 969681 1140215 1340513 1181819 1073942 1635860
16703 1635860 1622446 1668283 1530560 1650567 1828018 1833894 1503547 1531997 1456118 1669217
16693 1669217 1617409 1504264 1507173 1644806 1707092 1686315 1709652 1580158 1553218 1634176 1442349
16682 1442349 1469011 1502187 1145938 1286928 1336840 895105 1081300 1006678 1149249 886223
16672 886223 1139352 1345936 1309266 1296044 1599061 1637390 1792909 1936882 1751550 1812906
16662 1812906 1706209 1586237 1637024 1447728 1567277 1729970 1280452 1574470 1773235 1791795
16652 1791795 1553707 1689453 1625200 1471259 1434437 1047910 1211344 1080728 854770 914249
16642 914249 1022818 790331 577635 760089 828570 690401 628835 827256 738427 709648
16632 709648 479784 554438 649339 645157 537262 353831 668388 862103 777295 482348
16622 482348 755610 669271 603635 742971 798538 742865 805866 714333 703890 728500 893082
16611 893082 773376 823428 846480 1120204 904054 748607 857665 755615 996513 784606
16601 784606 875982 775157 688330 831755 531013 892736 923661 684415 1040065 729964
16591 729964 886284 782780 840624 842096 796931 842306 915561 948247 587303 733902 642373
16580 642373 767719 597274 426994 634279 737623 726182 625094 662202 625850 653809
16570 653809 474788 549581 472249 392934 409633 535455 463456 607163 265753 306490 409887
16559 409887 280772 201374 443670 333374 547400 321259 489781 439654 378069 670143
16549 670143 475480 481966 358754 479126 684884 632759 209916 670147 482764 300103
16539 300103 451149 502047 412642 548682 619322 608834 549635 579819 692056 492244 774287
16528 774287 550335 586489 509164 455900 588744 543877 690300 640488 331009 364671 397134
16517 397134 467568 218406 170086 63940 321823 226940 250023 349854 347541 251325 163814
16506 163814 368680 236996 506907 129127 465515 324710 198972 291136 285923 453625
16496 453625 115783 119730 99966 302688 630978 463503 561562 645292 471255 713063
16486 713063 767964 511755 537524 845519 681391 820170 731598 632496 944301 927445
16476 927445 869209 827880 926163 877314 756137 632155 838978 673168 669468 626763 658541
16465 658541 639252 635097 467240 712282 714147 631792 474216 579113 706033 470080 533239
16454 533239 736097 540478 649154 580469 577992 580279 624890 431696 423233 335742 367474
16443 367474 234171 349272 248934 220896 139300 223351 251223 527173 553783 449145
16433 449145 291942 624470 830648 1103383 1086022 1308038 1550150 2039380 2247824 2499441
16423 2499441 3304473 3769459 4789991 5610442 6947712 7675934 8766579 10120358 11124106
16414 11124106 12185900 13897478 15420286 17193846 19067651 21396714 23425284 26388519
16406 26388519 29126473 31988859 34796926 37221564 39370581 40804839 42270409 43291267
16398 43291267 44362919 45161324 45539565 45574214 45770675 47266201 51643680 60275760 72425139
16389 72425139 82709761 86849946 84996369 79170586 72136525 65587762 61479627 57877180
16381 57877180 51976208 43259885 31413795 20736915 15447765 17133487 24206193 32433704
16373 32433704 38640444 41905698 42977254 42700729 41166165 39540733 37665789 35707769
16365 35707769 33919694 31708688 29756053 27794696 25768462 23833988 21737591 19881309
16357 19881309 17903947 16749749 15128163 14027302 12646305 11131400 9831849 8449677
16349 8449677 7472145 6595894 5787922 5208161 4634604 4311448 3898050 3597479 3423466
16340 3423466 2979735 2844200 2887403 2573801 2277110 2183657 1973088 1809539 1686478 1344977
16330 1344977 1747184 1261803 1262162 1364170 1340403 1014463 1128005 968010 961384 829498
16320 829498 651604 570226 320178 502514 173351 133793 -220810 129632 238539 239802
16310 239802 153337 55850 201069 137299 143314 153054 -106676 72939 258855 271200 121111
16298 72934 277657 28966 233938 179042 178350 141562 117723 141910 -8729 -147886 132885
16286 -133539 75826 -159377 -63476 -44486 322566 500465 346229 583726 635519 752843
16276 752843 867529 899273 900069 1249215 1282947 984433 1177491 1188318 1179417 875296 961835
16265 961835 987564 816881 563953 547076 611124 456572 717596 606934 420628 668651
16255 668651 666095 692951 704630 758330 679833 783297 924155 940950 797881 592242 789084
16244 789084 762008 712827 906802 643352 977141 875349 933465 888726 995034 878044
16234 878044 999652 715239 459065 553605 622704 656698 557549 585920 716937 721676 507872
16223 507872 468062 658685 355292 717906 583808 635693 557887 553704 630956 764916 622979
16212 622979 777284 656430 544325 897034 823895 935078 1185511 772836 739301 813458
16202 813458 609160 820523 938053 749460 809724 817814 804287 683405 647821 796108
16192 796108 826920 943319 974000 931906 909076 1009174 872700 909729 1161683 776168
16182 776168 912451 818972 905800 906928 903856 895664 748742 877757 861758 882579 1031353
16171 1031353 893630 934885 844601 922482 991091 840171 779215 825935 822638 979766 789625
16160 789625 922504 951552 617411 710943 749235 801478 822313 884259 753314 917656 691709
16149 691709 775914 801447 598238 1015188 911460 870733 839258 771200 664024 941648
16139 941648 710145 865559 783238 956528 891206 841200 674847 1000291 873036 781990
16129 781990 682175 812170 867793 527457 603239 888468 917575 850344 613067 892772
16119 892772 1043441 1016958 924252 1044104 1057891 1028060 1180526 1098727 767112 735350 891877
16108 891877 1052947 822687 743897 977178 663879 910222 879920 1028369 1030457 1048553
16098 1048553 837208 769770 1003319 898874 929343 867652 1164323 824390 1078556 1085910
16088 1085910 1219844 1323476 946645 853964 1200470 1142085 1208443 1072209 991016 1092998
16078 1092998 1250020 1190045 1115349 1203732 1218053 1127649 1284773 1130529 1333093 1243132
16068 1243132 1421969 1377742 1470575 1274484 1473344 1322630 1145218 1572023 1330777 1428230
16058 1428230 1255346 1566943 1388671 1599002 1348959 1576610 1230097 1637819 1613074 1637040
16048 1637040 1801275 1520627 1578591 1598211 1420441 1905834 1634878 1666197 1618030 1639678
16038 1639678 1525336 1432381 1619426 1564703 1502978 1881759 1827536 1537731 1663240 1668162
16028 1668162 1744908 1666706 1831124 1892031 1688719 1791510 1978468 1897472 1894731 2060729
16018 2060729 1938489 2069355 2009397 2056579 1821141 1930939 1748065 1902596 2169759 2014829
16008 2014829 2098117 2087746 2301207 1998688 2301362 2110274 2219892 2079578 2313988 1935543
15998 1935543 2148651 1860086 2025711 1980048 2078566 2147908 1997772 1925847 2095488 2082073
15988 2082073 2063700 2100532 2185469 2210545 2135720 2243343 2145434 2038528 2384394 2309800 2392210
15977 2392210 2501442 2487388 2376241 2275029 2066117 2250028 2073658 2097976 2209978 2432235
15967 2432235 2293398 2163622 2164911 1966067 1928067 2213646 2101097 2072924 2240623 2324230
15957 2324230 1928174 2146215 2044122 2166097 2217132 2204100 2389261 2431152 2244303 2340189
15947 2340189 2261438 2252177 2178274 2137092 2207879 2223086 2312076 2533274 2247592 2229743 2532114
15936 2532114 2443594 2431383 2314037 2609441 2646751 2672889 2570933 2662031 2687173 2783881 3188698
15925 3188698 3058296 2964849 3160541 3375685 3502622 3524779 3782046 4034550 4257738 4464408
15915 4464408 4845213 5596258 5904997 6652793 7513613 9010942 11238275 14341725 18411626
15906 18411626 24223957 30861701 38015373 45488671 52386289 57947456 61767154 63078561
15898 63078561 61532042 57577763 51147275 43330284 35148006 27547001 21260237 16161798
15890 16161798 12347956 9969309 8158503 6818960 5734204 5160247 4506865 4065164
15882 4065164 3747758 3484306 3215434 2922594 3149722 2698183 2795083 2852744 2837902 2655675
15872 2655675 2718968 2653922 2623426 2736064 2611301 2517566 2501300 2345664 2433006 2308806
15862 2308806 2222290 2479553 2290625 2070735 2012457 2454232 2360590 2188713 2132766 2229361
15852 2229361 2231972 1975552 2122012 1867017 2213954 2063937 2134331 1986309 2210834 2051998
15842 2051998 2161269 2077731 2350281 2138654 2188619 2292388 2479529 2478823 2203098 2522127
15832 2522127 2842362 2328077 2410122 2088612 2341791 2331871 2278339 2234097 2552307 2275966
15822 2275966 2192354 2041480 2189374 2163389 2142580 2368413 2260438 2015690 2262672 2202470
15812 2202470 2306486 2437140 2247557 2525645 2431398 2386071 2636939 2536563 2446477 2426054
15802 2426054 2532664 2639419 2543777 2588937 3132500 2869954 2993615 3184278 3326253 3419072
15792 3419072 3434864 3372575 3340063 3494371 3626680 3743450 3675483 3521733 3834039 3701427
15782 3701427 4162779 4199114 4419906 4482965 4661444 4913096 4699804 4772062 5119622 4946419
15772 4946419 4678717 4552694 4812192 4544291 4761837 4961176 4960399 4941883 5059751 5081494
15762 5081494 5305743 5075267 5354847 5063427 5398580 5028007 5060304 4954000 4956603 4881148
15752 4881148 4869466 4967683 5050148 5027306 5267924 5214367 5474055 5489782 5736436 5837914
15742 5837914 6207096 6381750 6546876 6602727 6902859 6905729 7056449 6874539 7143170 6968955
15732 6968955 6992386 7021432 7380442 7260629 7478613 7647453 7587421 7542679 7458800 7331824
15722 7331824 6889107 6674478 6429820 6662367 6705768 6493381 6658798 6650906 6791575 6731382
15712 6731382 6763348 6495000 6439411 6218444 6380607 6367244 6343846 6627794 6644567 7142919
15702 7142919 7396452 7575680 7742432 7858294 8047350 8254278 8247531 8322539 8259357 8425885
15692 8425885 8695571 8147905 8143035 8105114 8216169 8033114 7827264 7834251 7717768 7831353
15682 7831353 7993848 7848828 7831096 7736684 7953710 7720286 7644753 7383429 7238602 6914252
15672 6914252 6646279 6706756 6853690 6816262 6679098 6945850 6963687 6851688 7208299 7454690
15662 7454690 7684002 8345947 8353367 8932984 9099547 9573818 10245552 10765268 11438922 12044666
15652 12044666 12941535 13172975 13890435 14694472 15261104 16039442 16523480 16669289 17510359
15643 17510359 18059795 18894786 19424529 20362241 21192557 22096446 22727918 23428380 24014764
15634 24014764 24228076 24257917 23888423 23706304 23327215 22854220 22857247 22553941 22743240 22516602
15624 22516602 22555343 22594051 22090959 21619194 20956795 19998628 19005904 18043788 16925344
15615 16925344 15916673 15182933 14711490 13943790 13473152 13408913 12801001 12432517 11770477
15606 11770477 11886092 11419239 11053239 10450380 10623198 10320872 9817656 9598311 10026332
15597 10026332 9745526 9757571 10138441 10431077 11353354 12669591 16774681 23524178 33730827
15588 33730827 44955848 54447936 61858751 68286095 73847904 75057454 69859027 61403987
15580 61403987 50775418 37608232 26215363 17832901 13136079 10572164 9345380 8606454
15572 8606454 7994204 7834178 7934120 7987187 8074864 8174857 8322775 8357353 8589526 8683380
15562 8683380 8990054 8987240 9499269 10247206 11341942 13962313 19974224 30800411 44668552
15553 44668552 58932862 70426064 79655350 87853792 94085654 93542602 84848526 73352078
15545 73352078 57931369 41064125 27023554 17464962 12196088 9525712 8025709 7083596
15537 7083596 6544368 6008536 6225269 5807053 5661552 5585252 5936468 5764315 5526983 5438750
15527 5438750 5231564 4965773 5062216 4558883 4514755 4610658 4409603 4296343 4345649 4352357
15517 4352357 4420944 4457434 4611976 4320137 4431164 4714029 4844005 4824486 5107203 5160452
15507 5160452 5204062 5207688 5243648 5118977 4782467 4801468 4654383 4772675 4511440 4458032
15497 4458032 4322378 4635496 4411834 4576801 4613564 4522525 4588471 4814411 4813254 5208532
15487 5208532 5130796 5174691 5107437 5482228 5759806 5890690 6011395 6310104 6230095 6381145
15477 6381145 6363623 6471541 6466719 6687872 6654803 6910588 7460567 8002568 8816556 9616881
15467 9616881 9998479 10384677 11232514 11203000 10855313 10529760 10199146 9597914 9226166 9156418
15457 9156418 9254895 9330540 10077136 10701919 11144819 11604581 11897133 12224523 12132814 11684226
15447 11684226 11045356 10576084 10123258 9696949 9450919 9483367 9455726 9484062 9695477 9703492
15437 9703492 9739138 10060164 9852990 9491777 9395913 8923922 8802589 8376702 7937936 8030468
15427 8030468 7749474 7516124 7342106 7109802 6880948 6960914 6774774 6465875 6659926 6169966
15417 6169966 5977890 5868324 5782335 5591348 5438896 5665955 5539971 5721141 5515763 5619466
15407 5619466 5540295 5547412 5634638 5560788 5700610 5847114 5892605 6126836 6175476 6312718 6574386
15396 6574386 6495880 6497124 6508811 6670816 6281688 6529632 6379972 6414322 6388481 6313839 6676146
15385 6676146 6760311 6981899 6695805 6901906 6897965 6884300 6941329 7116004 6821827 6721271
15375 6721271 6794388 6588950 6754360 6840202 6810026 6606577 6769033 6829721 6983875 7030809
15365 7030809 7076539 7233251 7551972 7601638 7936696 7994396 7933111 7980644 8347394 8447978
15355 8447978 8620844 8684582 8999279 9177652 9633753 10546928 12055511 15036217 19629748
15346 19629748 25634320 31708837 37038933 41757828 45407394 47837536 47786744 44528173
15338 44528173 39352124 33649578 26743827 21695527 18038298 16373490 15421952 15034238
15330 15034238 14509186 14331704 14023587 13399888 13052585 12600919 12372166 12242007 12519840
15321 12519840 12722105 13286573 13253756 14067047 15183930 17328761 21263343 27807392 37487898
15312 37487898 48770161 59463381 69097278 76610799 82165311 83766670 80941594 73104013
15304 73104013 62042210 49189359 37027257 26899192 20357456 16093492 14147846
15297 14147846 12672570 12284627 12107674 11970667 11924214 12046196 12043650 12123117 11973848 12052825
15287 12052825 12283700 12258457 12089638 12056165 11975065 12852288 14398014 17619864 22453591
15278 22453591 28060373 33609677 37945765 42022055 44997027 46542480 45192025 41718282
15270 41718282 36623489 29952900 23262247 18549024 15042404 13213528 11516141 11067230
15262 11067230 10192096 9997780 9191613 8920720 8694643 8716145 8795774 8927986 9147731 9294480
15252 9294480 9775254 9924306 10055256 10040394 10153154 10046077 10087624 9591569 9863646 9285219
15242 9285219 9317111 8829716 8578884 8605642 8732437 9064562 9242585 9945405 10444197 10769413
15232 10769413 11444749 11736235 11581273 11812415 11489100 11128564 11077313 10557843 9935433
15223 9935433 9614926 9443297 9024544 9078020 9388065 9675889 9526656 9796196 10410606 10813000
15213 10813000 10967455 11093453 10968653 10823108 10344763 10213478 9581815 8807709 8436677
15204 8436677 7637028 7473241 7122347 6765277 6550826 6605576 6284665 5998943 6192172 6073105
15194 6073105 6242878 6217122 6438988 6598702 6780416 6969392 7000769 7231879 7346845 7370368
15184 7370368 7388593 7249786 7256959 7460333 7467711 7796707 7845670 8111893 8258975 8508666
15174 8508666 8616189 8646928 8355649 8425994 8265878 8299273 8059480 8146368 8164694 8124474
15164 8124474 7950646 8139528 8068447 8008075 8288089 8265271 8717326 8824022 8760611 8938983
15154 8938983 8972614 9132253 8776192 8887186 8658773 8866687 8504761 8482143 8527013 8520657
15144 8520657 8168670 8593238 8472424 8627332 8432264 8634060 8537394 8698811 8557124 8279257
15134 8279257 8362115 8508616 8691332 8361754 8365985 8316795 8334705 8431339 8229022 8111041
15124 8111041 8345185 8121003 8033179 8213356 7934394 8015031 7934063 7819824 7797943 7897974
15114 7897974 7688013 7684091 7888777 7643617 7986411 7883017 7601983 7956276 7993878 8110924
15104 8110924 8133779 8482321 8803125 8870875 9110298 9184143 9355142 9597349 9913059 10220902
15094 10220902 10606778 11378726 12015757 13274512 15351071 17578844 20198734 22577867
15086 22577867 24413474 25916054 26806366 26927895 25942865 24375618 22838315 20786749
15078 20786749 19703166 19505672 20471913 22399977 24584051 27002086 28940506 30534063
15070 30534063 31698918 31912723 31239595 30191192 28846601 28137753 29299386 31519617
15062 31519617 34426070 37485452 40282609 43221449 46369289 47880808 47931604 47222414
15054 47222414 45545182 44007730 43740383 44255721 46346056 48260899 50423797 51744136
15046 51744136 52743262 53878906 54949638 55802760 55679111 54006985 52134852 49548430
15038 49548430 46685876 44377232 42304298 40102553 37829837 35649002 34145624 34570813
15030 34570813 36058412 38676596 41503719 44019228 46549339 48983012 50791615 50820036
15022 50820036 50720799 50480952 50304887 51808057 55288242 60838413 67762020 75216159 82529206
15013 82529206 89054953 94931656 100021244 103617791 105927114 107577713 108521782 109494838
15005 109494838 110588808 111252158 112058694 111663227 110779815 108462049 105730643 102020581
14997 102020581 97909593 93080949 88324976 83392036 78550375 73060484 67815557 62662740
14989 62662740 58249456 55003285 52711189 51208048 50709036 50309210 50275481 50764957 50592035
14980 50592035 48996922 46901915 43957199 40314506 36756589 33506706 30724558 28744899
14972 28744899 27129139 25917735 25223900 25049358 25309538 25293504 25868998 26179611 26582501
14963 26582501 27270984 27923127 29118870 30325043 32541872 35956945 40374060 47536214
14955 47536214 57284462 70906327 88598882 110294173 135065235 163041230 193461072
14948 193461072 224660338 254321712 282307136 305718540 320283113 324178181 319125083
14941 319125083 308657519 291988908 269584603 243861177 217260860 192038844 170455857
14934 170455857 154834713 144223434 135872393 127650522 118962548 109190038 99135733
14927 99135733 89893300 81968721 76346095 72870973 70239875 68607403 66852509 65008906
14919 65008906 63631314 61894023 57636445 51987856 45325217 37302073 30066411 24041240
14911 24041240 19473693 16829910 15219791 14300089 13758577 13632211 13780137 14008942 14677063
14902 14677063 15396629 16575663 17730307 19091967 20734402 23101256 27130422 31222390
14894 31222390 35524796 39244547 41961940 44096183 45205726 44486090 41984012 37780122
14886 37780122 32507825 27052431 22748760 19478706 17486219 16570903 15854474 15461156
14878 15461156 15560630 15993049 16479696 17716006 18469883 18765216 19354127 20084141 20380415
14869 20380415 20784986 20795589 20427928 20518657 20205954 20261824 20837880 22657379 25166844
14860 25166844 29827185 35832825 43716193 51962989 61410530 70933414 78870725 83946470
14852 83946470 85695520 84138880 79504847 71497859 61817059 51435325 41684889 33299804
14844 33299804 26850281 22560950 19978598 18379103 17282051 16471940 16088364 15618775
14836 15618775 15198232 15223746 14865933 14736615 14377232 14437491 14540642 15021067 15260676 15782414
14826 15782414 16472616 17172347 17991332 19428235 21553447 25098254 30880753 37572153
14818 37572153 44583837 50428413 55037525 58605229 60257730 58906281 54421753 47561500
14810 47561500 39438801 30799767 23746400 18362307 15336061 13743069 12179112 11799457
14802 11799457 11421161 11224443 10745907 10774885 10545865 10624559 10249420 10061895 9919236 9686892
14792 9686892 9446084 9240528 8957550 8864035 8646190 8571353 8601278 8663576 8801907 8950827
14782 8950827 9090963 9635701 10446604 11085907 11649431 12147138 12682644 13044410 13480442
14773 13480442 12996855 12762959 11884228 11101142 10110718 9557093 8943818 8756898 8471216
14764 8471216 8578521 8412660 8774935 8973853 9079154 9116877 9174642 9447229 9725081 9749192
14754 9749192 10210699 10086896 10555362 10725592 10909963 11115668 11069183 11189818 11321100 11488773
14744 11488773 11607254 11682509 12164271 12508837 12935458 13775164 15035887 16426525 18037672
14735 18037672 20714223 24473087 30085775 38799563 52254488 72137659 98203538 128346431
14727 128346431 159942463 190046754 216129763 234520140 242828781 239823830 225031246
14720 225031246 198393294 165089253 130464407 98021468 71438169 51856362 38332398
14713 38332398 29931241 24541970 21302695 18589986 16837643 15656012 14553396 13592043
14705 13592043 12900611 12004752 10998542 10139589 9492557 8703122 8433270 7909920 7924984
14696 7924984 7686404 7736139 7965757 8058318 8200643 8181611 8501340 8603802 8403264 8255678
14686 8255678 7947517 7883576 8176051 8169853 8371537 8528970 8777422 8929461 9803711 10088054
14676 10088054 10969841 11445448 11865240 12316148 12539238 12095439 11751506 11114000 10207859
14667 10207859 9160961 8672549 8613657 8906248 8768064 9102148 9262080 9425663 9599994
14658 9599994 8790512 8204244 7400207 6856034 6296299 6128808 6156867 6026047 6392080 6430279
14648 6430279 7222296 7453650 7851490 8246788 8566400 9030200 9319400 9183519 9039926
14639 9039926 9367371 9262143 9563421 10086924 10669256 11071715 11156481 11373406 11060649 10529679
14629 10529679 9829808 8486133 7314053 6415364 5467030 4899579 4590603 4448211 4245725
14620 4245725 4331954 4229294 4142014 4111733 4088861 4045506 4232355 4260837 4321635 3915689 3868645
14609 3868645 3998807 3824455 3778790 3833831 3635834 3760891 3969292 4329543 4744009 5398060
14599 5398060 6300867 7155097 7818583 8714434 8899834 8900954 8808952 8226509 7642587 6865783
14589 6865783 5803800 4838254 4432054 4070540 4020358 3906091 3872410 3649914 3697118 3675932
14579 3675932 3980785 3889028 4008332 4189883 4131285 4064611 4514759 4497311 4729648 4732890
14569 4732890 5297462 5721570 6728850 7490459 7968229 9076009 10217064 11549754 14128344
14560 14128344 18038888 23771919 30344075 35766017 40620748 44331493 47517021 48840615
14552 48840615 46725545 41973210 35548884 28107772 21905551 17682903 16402207 17934557
14544 17934557 22800931 29581505 36834038 43077382 48269425 52274211 54844074 54233799
14536 54233799 50147714 43970615 35535906 27393437 20596399 16063203 13518693 12505846
14528 12505846 12111307 12216950 12328470 12291693 12112940 12215214 12625335 13936168 17099957
14519 17099957 21506258 26424236 30708482 34524024 37595755 39940763 40498617 38447110
14511 38447110 34669115 30181522 25281314 21596187 19770202 19945713 22263341 25670795
14503 25670795 30327020 34720532 37528356 40170102 42071276 42825343 40950851 37667484
14495 37667484 33000679 27653306 22345331 18634650 15883152 13809439 12890291 11531967
14487 11531967 10211566 9172829 7635365 6686191 5710786 4926530 4537236 4066546 3863010
14478 3863010 4069695 3676129 4041163 4007873 3834756 4095832 4436772 5062725 5398725 5725194
14468 5725194 6414430 6725733 7014399 7292225 6997693 6890590 6720841 6649632 6730134 6754519
14458 6754519 7205590 7812895 8293636 8723381 8950753 8874962 8250167 7726824 6831170 6136772
14448 6136772 5855651 5841814 5761495 5953855 6286122 6684253 6954700 7059174 7420769 7276238
14438 7276238 7602024 7575848 7806574 8033913 8446304 8862556 9439505 10483169 12405064
14429 12405064 15446872 19861095 24814176 30313526 34828895 38884155 42296335 43721204
14421 43721204 43602264 41047905 36963883 31729238 25886474 21060009 17297440 14342995
14413 14342995 12249115 10649183 9731181 8900238 8279836 7641792 7484286 7426040 7291074
14404 7291074 7328165 7230449 7302735 7238780 7507779 7681095 7913726 8725536 9796602 11261315
14394 11261315 14228655 18313731 24527109 32354170 41279572 50057421 58123339 64630656
14386 64630656 68896783 70471556 68399197 62661167 54498761 45027873 35357884 27039033
14378 27039033 20580436 16031691 12658331 10670592 9391458 8348757 8015820 7648575
14370 7648575 7595719 7194708 7124340 7102657 6823169 6791117 6723901 6535094 6677111 7007287
14360 7007287 7283391 7911602 8630437 10243000 12262975 14992683 18431784 22143408 25985649
14351 25985649 28884535 31700344 33321345 33399635 32231779 29860357 26426750 22688919
14343 22688919 18820338 15801193 13224340 11790103 10962047 11357355 13360650 16063963
14335 16063963 19238150 21925459 24038753 26420051 28982129 31043025 31462893 32457443
14327 32457443 33376342 35028620 39242618 46369602 55451051 66051780 77590509 87958204
14319 87958204 96746010 103070234 106625289 106140063 101578509 92926462 80720942 67366100
14311 67366100 54852474 43955770 35287001 28734715 23735826 19508191 16696119 14363309
14303 14363309 12485236 10931238 9743256 8728131 7784291 7168215 6599717 6003170 5672228
14294 5672228 5562227 5230382 4908266 4535506 4287508 4227166 4107324 3777846 3811397 3561083
14284 3561083 3606294 3419932 3327878 3370387 3390886 3446581 3478985 3460860 3339261 3444140 3527620
14273 3527620 3449350 3352372 3455180 3334132 3290405 3278745 3056654 2809445 2918966 2874909
14263 2874909 2888106 2540454 2630658 2435136 2537346 2440031 2628887 2563423 2369138 2356185
14253 2356185 2201437 2517599 2464770 2269380 2217755 2055617 2128716 2018796 2156453 1990961
14243 1990961 2090024 2169716 2013670 1930424 2021846 2199435 2217863 2132839 2305449 2136398
14233 2136398 2238113 2456229 2123623 1948902 1957022 1949013 2003730 1813677 1825473 1838122 1823031
14222 1823031 1984952 2054615 1944477 2079086 2008273 1972942 2364757 2403842 2181512 2592601
14212 2592601 2559184 2479616 2570623 2744695 3272899 3710383 3869558 4051513 4296422 4456711
14202 4456711 4391886 4042996 3756842 2914846 2670257 2112259 1951184 1890062 1959725 1929304
14192 1929304 1994666 1931201 2263975 1994193 2033414 2107453 2324107 2192895 2189394 1935218
14182 1935218 1967396 1836689 2198858 2099682 2263579 2622867 2468670 2553544 2685510 2654346
14172 2654346 2534535 2415905 2281750 2438988 2079213 2374331 2035006 1989775 2071504 1949683
14162 1949683 1946542 1973754 1959661 2124485 2112141 2058572 2337472 2268361 2322731 2583113 2389328
14151 2389328 2481302 2290813 2275064 2301952 2364976 2692893 2512972 2819627 3254970 3556195
14141 3556195 4336691 5516868 6210695 7466709 8426940 9059464 10178558 10315021 10021179
14132 10021179 9544830 8278980 7247306 5867368 5277706 4227861 3634740 3115471 2939943
14123 2939943 2862624 2818779 3215543 3417170 3656659 4005064 4069807 4276941 4083373 4033709
14113 4033709 3937588 3634360 3344293 3084198 2792128 2788991 2620295 2467919 2552507 2416641
14103 2416641 2458140 2575029 2489966 2932830 3383532 3714816 3929046 4427453 4949079 5205214
14093 5205214 5111662 5272719 5306837 4842439 4523952 4368195 3873566 3652360 4253726 4621703
14083 4621703 4967612 5600763 5607904 6139891 5990754 6322333 6058351 5734715 5379539 4841985
14073 4841985 4823228 4351261 4217465 4594477 4561246 4754877 4818455 5077494 5560978 5948804
14063 5948804 6483482 6867948 7381260 8434961 9497336 10594810 11554729 12946970 14493243
14054 14493243 16234759 18375664 20799957 24432082 29214333 35655590 44284535 55044484
14046 55044484 67252279 79626761 91197586 100670553 107890620 111885278 111471403 106594037
14038 106594037 96910292 83635675 69183839 55709263 44374667 35423705 28373968
14031 28373968 23310504 19518676 16739746 14413612 12388968 11094923 9946790 9161825
14023 9161825 7999418 7406685 6750967 6232452 6031753 5698288 5242202 5138091 4756729
14014 4756729 4319947 4355718 3915041 3905339 3781138 3600165 3593696 3326908 3280257 3032906
14004 3032906 2876237 3046780 2836877 2906764 2928436 2861127 2865480 2816927 2763427 2781633 2882139
13993 2882139 2741918 2765902 3053265 3079428 3561389 3869725 4391427 5253447 5877345 6760137
13983 6760137 7626075 8345871 8631240 9246606 9394791 9312649 8876101 7766804 6809814
13974 6809814 5983558 5112123 4662078 4070907 3673539 3478113 3429212 3195326 2983874 3043148
13964 3043148 2859403 2633473 2722033 2498316 2517617 2553701 2214228 2418280 2131057 2247474
13954 2247474 2300895 2041041 2195432 2420802 2692025 2641230 3036971 3223223 3147708 3472591
13944 3472591 3869141 3890591 4378544 5004316 6534237 8472333 11079923 13951152 16884734
13935 16884734 19834237 22147076 23725463 24210145 23719106 21841190 18869444 15418016
13927 15418016 12456605 9335432 6760963 4933793 4007633 3055484 2565332 2463418 1998477
13918 1998477 2011756 1841193 1829172 1709704 1760132 1823135 1882839 1610019 1375205 1415238
13908 1415238 1737456 1505624 1485989 1400512 1649656 1632484 1646818 1664918 1420817 1689181
13898 1689181 1478285 1695450 1657316 1765538 1463322 1592750 1584890 1761267 1631278 1742237
13888 1742237 1712316 1751326 1509793 1445931 1569804 1563051 1686990 1250286 1503332 1512517 1341791
13877 1341791 1343044 1593194 1541813 1730724 1313742 1564486 1365875 1653193 1404932 1739386
13867 1739386 1486820 1674994 1700704 1673170 1689475 1823142 1918907 1737851 1626079 1650072
13857 1650072 2015528 1693698 1567397 1837953 1752799 1651798 1873013 1618555 1685016 1498181
13847 1498181 1486742 1720582 1588011 1742125 1572306 1575641 1762655 1643033 1639758 1393171
13837 1393171 1556238 1589964 1415624 1450328 1468118 1520277 1320052 1547051 1543298 1709158
13827 1709158 1654917 1536554 1648021 1713243 1534244 1598751 1574706 1297492 1295077 1455821
13817 1455821 1368534 1317299 1532713 1164106 1260996 1196647 1242486 1149294 1222227 1293454 1444534
13806 1444534 1395613 1574491 1458378 1436993 1516348 1491419 1503808 1346895 1661388 1400842
13796 1400842 1603293 1652825 1465868 1496737 1373361 1441931 1344237 1378097 1356109 1577308
13786 1577308 1492353 1154630 1404938 1186053 1347604 1286714 1192013 1486216 1298493 1432442
13776 1432442 1399986 1587969 1133095 1567975 1363049 1518012 1613069 1699233 1370329 1477801
13766 1477801 1420740 1571437 1649000 1749059 1602321 1697665 1637532 1552232 1799686 1884088
13756 1884088 1814073 1874132 1915173 1953163 1888202 1891069 2018608 1766424 1730709 1554623 1814720
13745 1814720 1864216 1692179 1731423 1516022 1495839 1591836 1380031 1587716 1506798 1487817
13735 1487817 1683089 1546120 1536875 1702886 1820208 1565408 1686601 1630139 1597461 1876182
13725 1876182 1523289 1608988 1770377 1799154 1718754 1723337 1478272 1520569 1600958 1838410 1883424
13714 1883424 1812921 1799107 2029228 1613647 2183230 1838693 1907640 2019156 1950778 2038063
13704 2038063 1990554 2249817 2018445 1701070 1868005 1750805 1792180 2112331 2043947 2335868
13694 2335868 2540516 2732111 2740835 2746689 2569171 2765441 2609137 2422251 2425327 2115687
13684 2115687 2038865 1940002 1949625 1699314 1792023 2067034 2037022 1979335 2071137 1989658 2026483
13673 2026483 2001391 2148256 2114368 2061812 2144640 2295575 2339463 2495385 2780775 3035305
13663 3035305 2982051 3272413 3521228 3192308 2889110 2986788 3000780 2619830 2628867 2348196
13653 2348196 2251541 2146256 2092999 1901682 2023476 1932555 2062895 2043018 1971850 1931796
13643 1931796 2293324 1974708 2123626 1780755 2079322 1957725 2095844 2034628 2545613 2597674
13633 2597674 2633446 2996515 2895554 3124953 2984673 2984022 2520294 2337037 2129301 2025665
13623 2025665 1802012 1820191 1914907 1654438 1782868 1722586 1651022 1801766 1688064 1641652
13613 1641652 1964336 1613281 1984005 2043695 1998651 2188181 2228778 2264470 2058702 1932375
13603 1932375 2058274 2003436 1718741 1965516 1999065 2021994 1981311 1845948 1830224 1910654
13593 1910654 1862008 1978643 2042929 2334897 2302746 2127571 1981680 1937052 1984878 1848805
13583 1848805 1915319 1658698 1530872 1415953 1797074 1819062 1831808 1608171 1662749 1613911
13573 1613911 1362610 1573904 1423042 1925495 1521113 1563867 1374992 1632250 1749476 1631216
13563 1631216 1366777 1610900 1640465 1734730 1570995 1745474 1657165 1507504 1533637 1406624
13553 1406624 1509251 1721785 1761712 1676390 1521984 1694745 1766105 1859493 1941639 2164061
13543 2164061 2244186 2416398 2480744 2631026 2605585 2796916 2678086 2368664 2200008 2146165
13533 2146165 1979540 1818847 1763075 1875443 1805693 2086014 2085968 2186390 2326123 2483088
13523 2483088 2527759 2984034 2737259 2559962 2205719 2163911 1996083 1877290 1518253 1584946
13513 1584946 1756094 1339785 1371112 1279838 1594433 1526326 1298028 1240706 1225535 1436369
13503 1436369 1593401 1604072 1271961 1429667 1501125 1387118 1399065 1361080 1295943 1593949
13493 1593949 1350016 1293117 1442493 1419099 1513370 1300155 1464902 1375126 1438162 1333461
13483 1333461 1495155 1475537 1251330 1315965 1248940 1518109 1287387 1418038 1320085 1403652
13473 1403652 1542552 1274283 1438676 1382224 1403347 1280113 1325601 1412206 1088426 1438149
13463 1438149 1303706 1352965 1406724 1459103 1498796 1634990 1512727 1588958 1635278 2013889
13453 2013889 2122757 2207675 2287705 2353882 2732677 2739271 2549590 2636311 2350410 2213596
13443 2213596 1831132 1633783 1422557 1550110 1584579 1680742 1720754 1425745 1667999 1449896
13433 1449896 1379749 1281425 1569397 1577660 1652528 1419459 1487990 1710674 1791246 1943221 1953471
13422 1953471 2210388 2486709 2521033 2630053 2609551 2525650 2859307 2341320 2346830 2080707
13412 2080707 1667699 1701034 1675543 1575982 1609305 1469409 1488510 1568792 1543898 1451746 1454634
13401 1454634 1489200 1316276 1367499 1647227 1567344 1659501 1755788 1787597 1684858 1782134 1773527
13390 1773527 1986107 2164561 2296859 2158591 2257969 2322992 2556915 2556999 2560622 2468359 2867333
13379 2867333 2484033 2748615 2649739 2255688 2157518 2300635 2108526 2058434 2271669 1958029
13369 1958029 2129971 2113554 2039748 1988664 2291137 2212989 2178206 2219243 2160987 1983281 2144888
13358 2144888 2032303 2237538 2214552 2218576 2421758 2386688 2391900 2507137 2298400 2319578 2298539
13347 2298539 2639429 2252689 2122944 2218743 2101850 2137439 2230727 1932304 2164786 2010869
13337 2010869 2304331 1977650 2061504 2220430 2074560 2282724 1842099 2259051 2353037 2098932
13327 2098932 2309682 2132373 2223768 2298740 2163283 2366442 2409531 2410047 2145105 2399183
13317 2399183 2622196 2535823 2732950 2822799 2844859 2976494 3246419 3123059 3019589 3138253
13307 3138253 3058320 3028732 3098571 2899637 2862098 2987299 2952306 3222868 3085472 3446950
13297 3446950 3675791 3553876 3550773 3814160 3663765 3701645 3463208 3529904 3272263 3370708
13287 3370708 3401144 3409961 3660503 3511530 3469224 3360914 3600874 3627445 3461695 3750894
13277 3750894 3636067 3696359 4104452 3925742 4114793 3952338 4009091 4005661 4489085 4339716
13267 4339716 4322721 4575756 4436125 4479534 4818590 4657629 4863709 5118697 5165684 5130099
13257 5130099 5512138 5571262 5918893 5859979 6135028 6355268 6553495 6841446 6788656 7052925
13247 7052925 7402226 7325130 7682966 7622370 7907306 7646949 7747672 7995927 7914369 8075534
13237 8075534 8225006 8142263 8291929 8601086 8493038 8861089 8942494 9180463 9673359 9921500
13227 9921500 10367169 10598276 10887476 11164999 11545130 11492827 11697225 11943289 11794601 11838309
13217 11838309 11508505 11541409 11454177 11044127 11021832 10817059 10605752 10176351 10228251 9967829
13207 9967829 10019800 9856366 9670428 9973233 9744924 9724191 9653805 9812443 9393966 9555606
13197 9555606 9555355 9268165 9149088 9135372 8787995 8729568 8364105 8341874 7887212 7893083 7660268
13186 7660268 7469469 7202072 6774577 6876283 6706913 6676560 6123497 6147193 5933679 5826019
13176 5826019 5544834 5604251 5426054 5242335 5266379 5183093 5045647 5169569 4966784 5011019
13166 5011019 5246879 4982975 5438505 5454699 5733933 5837239 6035255 6011887 6294439 6569527
13156 6569527 6592178 6680385 6740470 6588501 6709941 6342863 6358458 6245157 6407037 6114347
13146 6114347 6010000 6075998 6012733 6029197 6250816 5938238 5879740 5455653 5348938 5133570
13136 5133570 4645285 4094420 4296526 4029737 4077484 3911676 3859821 4001885 3983438 4090362
13126 4090362 3890074 3937861 4136431 4053699 4039632 3927751 3616419 3466775 3418514 3321688
13116 3321688 3327716 3347774 3322393 3179620 3283772 3114632 3026931 3536809 3382971 3229527
13106 3229527 3319184 3130902 3441307 3623935 3523951 3668274 3895744 3977824 4269204 4738248
13096 4738248 4836954 4930431 5647099 5786622 6049407 6117180 6242505 6004473 6182021 6158077
13086 6158077 5736180 5741975 5920097 5853806 5938117 5812617 5727869 5380824 5393757 4877065
13076 4877065 4848107 4459044 4226928 3759277 3659889 3572596 3365025 3167279 3114617 3132773
13066 3132773 3396337 2974378 2956611 3076545 2989214 3432561 3335831 3257619 3395933 3380716
13056 3380716 3184477 3446141 3570980 3509001 3613119 3277260 3474821 3184046 3483739 3206913
13046 3206913 3201895 3261153 3012539 3227541 3398335 3266288 3266390 3322863 3344629 3419152 3672590
13035 3672590 3723575 3588874 3558303 3603773 3948451 3796566 3699932 3886362 3999925 4162601
13025 4162601 4183251 4086283 4106210 4155902 4252545 4156543 4255572 4361063 4613259 4442790 4706920
13014 4706920 4768677 4622480 4928726 5038699 4942099 4991583 4970402 5228703 5116638 5284275
13004 5284275 5397757 5333251 5376244 5294869 5470469 5542234 5610412 5456843 5676329 5782897
12994 5782897 5845268 6104986 5947705 5970297 6050148 6240229 5985020 6124878 5980323 5959093
12984 5959093 5874160 5915199 6189369 5995208 5924139 6001666 6204200 5925691 5636807 5918110
12974 5918110 5725941 5590139 5605397 5596759 5330171 5221874 5418535 5222615 5396148 5120554
12964 5120554 5286033 5184630 5236766 5126309 5213448 5194750 5218224 4978836 4901268 5271331
12954 5271331 5119940 5217881 5226267 5179428 5201971 5283379 5094630 5339108 5210282 5117973 5135189
12943 5135189 5190615 5067001 5325902 5248442 5200477 5359993 5229051 5220818 5067389 5355237
12933 5355237 5314859 5484847 5630484 5783455 5555302 5421213 5453706 5245439 5100061 5192968
12923 5192968 4820533 5044301 5027398 5142105 5070316 4799640 4864328 5080587 5042299 4700646
12913 4700646 4799257 4447704 4124436 4163526 3946600 4248223 4055245 3919813 3868564 3898551
12903 3898551 3655044 3845182 3731790 3468703 3504930 3438697 3412196 3519487 3720369 3464228
12893 3464228 3572580 3300963 3313790 3261634 3450414 3013122 3253357 3215140 3384920 3390645
12883 3390645 3196224 3151173 3316639 3090128 3127339 3126226 3124328 3199439 2958567 2917801 3010073
12872 3010073 2806797 2962606 2994030 2958687 2839891 2750811 2778625 2849669 3031175 2630296
12862 2630296 2769434 2856152 2680715 2754075 2846933 2751952 2700527 2677401 2847934 2919586 3022410
12851 3022410 3074186 2973412 2924017 2640690 2730880 2864834 2743429 2903443 2656006 2565879
12841 2565879 2735152 2698491 2903351 2712287 2814030 2858338 2946998 2859176 3009278 2701266
12831 2701266 2803414 2709062 2474294 2711540 2520951 2604890 2712993 2563886 2822196 2848819
12821 2848819 2995567 2720226 2671729 2731904 2850025 2857914 2808486 2607011 2837588 2682922
12811 2682922 2836216 2797460 2848965 2757048 2330450 2783916 2880806 2720558 2848736 2722719
12801 2722719 2824371 2910924 2863169 3075480 2970647 2882744 2900641 3003404 2910100 2789842
12791 2789842 2829747 2841472 2916605 2914687 2977110 2778681 3052599 3012206 3126291 2904070 2981681
12780 2981681 3016904 2896302 2698202 3051851 2793987 2749053 2693874 2858676 3024195 2940030
12770 2940030 2735341 2802921 3020460 2966024 3065543 3096374 3180546 3069431 3117442 3034507 3069528
12759 3069528 3140457 3277278 2935753 2978405 3123905 3224678 3263292 3089317 3254974 3009557
12749 3009557 3035469 3086606 3072629 2971696 3043980 2991018 3057512 3101298 2955169 3125746 3056885
12738 3056885 3159440 3016990 3131981 3041648 3290893 3274192 3293168 3125673 3143520 3217539
12728 3217539 3217531 3054549 3160665 3136643 3034769 3097422 3203956 3279660 3254427 3099841 3007069
12717 3007069 3076176 3253342 3347577 3194705 3163133 3467526 3384574 3162637 3385446 3587558
12707 3587558 3389055 3467421 3719239 3547915 3774428 3847398 3985687 3968531 4123089 4106324
12697 4106324 4047083 4222378 4501321 4363246 4508030 4746560 4925667 5447078 6235784 6858436
12687 6858436 7182128 7708233 7716350 7884033 7493139 7152311 6528917 6029847 5191311 4968020
12677 4968020 4490028 4483030 4551503 4569855 4283142 4246932 4424965 4694480 4686633 4699842 4713795
12666 4713795 4994762 4866203 4987962 4932610 4973867 4878735 4812975 4854496 4704326 4965531
12656 4965531 4499471 4724245 4968346 4966983 5303125 5367002 5634382 5797310 5994212 6240738
12646 6240738 6243163 6185667 6179963 6171511 6259277 6375440 6198789 6108633 6312590 6376332 6608475
12635 6608475 6611415 6701861 6360667 6746977 6585369 6551312 6704668 7003857 6699358 6961004
12625 6961004 6897476 6357719 6593572 6398130 6115472 5929488 5666489 5594155 4986096 5105328
12615 5105328 5079131 5374583 5286118 5376030 6240955 6704927 7099574 7310484 7998139 8580009
12605 8580009 8703020 8875350 8951197 8677810 8174949 7701694 7422922 6491801 6085030 5671795
12595 5671795 5341335 5143395 4908857 5332917 5403695 5227431 5530823 5697713 5799134 5655599
12585 5655599 6076702 5773947 6036860 5954634 6414002 6360384 6538548 7014734 7218878 7401890
12575 7401890 7232357 7393079 7379413 7070531 6718400 6177676 5922480 5362524 4929322 4725636
12565 4725636 4759927 4694755 4795854 4837172 4929378 5018291 5044292 5078643 4896951 5010977 5209885
12554 5209885 5125153 4874011 4933733 5028136 4900431 4789680 5155806 5080346 5103400 5183223
12544 5183223 5310172 4956792 5528170 5458436 5704298 5899147 5979525 6118481 6143139 5806198
12534 5806198 5806451 5590635 5474708 5341081 5374505 5036305 5204544 5132848 5096961 5096800 5058081
12523 5058081 5140365 5418646 5140622 5426414 5181721 5413240 5724959 5694115 5557936 5765003
12513 5765003 6167266 6495736 6766705 7196836 7638829 7528023 7690828 7636384 7326544 7086294
12503 7086294 6909916 6487050 6194034 6080200 5816926 6051081 5770074 5896467 5748012
12494 5748012 5772340 5921820 5844660 5849037 5929007 5928763 5708118 5945730 5919220 6110209 6074683
12483 6074683 6225547 6643538 7012082 6876664 7159217 7310113 7323444 7213969 7119414 6685770
12473 6685770 6784121 6439183 6353444 6458327 6225914 6199587 6458073 6280756 6732322 6570206
12463 6570206 6567310 6754453 7043412 6898946 7254988 7310154 7464127 7321650 7581438 7635797
12453 7635797 8066640 8208855 8549676 8649942 8901404 9242050 9646977 10192071 10408932
12444 10408932 10999256 11055429 11335431 11456345 11628558 11965930 12068996 12004739 11978503 12250692
12434 12250692 12068286 12082240 12059854 12225281 12138880 12443926 12422342 12557187 12747414 12934272
12424 12934272 13397112 13758344 14092215 14241051 14821871 15073772 15498618 16028384 16743628
12415 16743628 17300354 17873676 18588645 18840208 19368584 19366980 19266216 19363584 19119468 18776633
12405 18776633 18699465 17889816 17693118 17147723 17269371 16614299 16401907 16027466 15864901
12396 15864901 15759885 15691163 15756052 15957594 15910450 16062185 16512017 16651047 17136091 17609839
12386 17609839 17991486 18532409 18911218 18984409 19227634 19860917 19643450 19820409 19647672
12377 19647672 19504810 19668739 19447227 19076195 18667228 18892935 18670084 18506196 18238217
12368 18238217 17992465 18080429 17732159 17583491 17489283 17263946 17251467 17027965 16623946 16631181
12358 16631181 16238418 16281641 16170011 16316315 16061233 15751719 15724768 15486022 15434827 15206706
12348 15206706 14924614 14815052 14648329 14553670 14590750 14272574 14558389 14695708 14547051 15002600
12338 15002600 15276874 15600548 16133474 16257109 16554872 17048584 17302691 17579427 17770673
12329 17770673 18142226 18425785 18930053 19305670 19062598 19348013 19443755 19731559 19710332 19488851
12319 19488851 19912997 19879885 19683023 19744341 19658312 19632562 19899402 20121038 19964378 20183522
12309 20183522 20280392 20703542 20825811 21307469 21514561 22178319 22356079 22464131 22662470
12300 22662470 22319754 22381606 22061520 21327631 20921427 20217862 20062945 19623956 19221804
12291 19221804 19050625 18980944 18810543 18472460 18105227 17895046 17041201 16600097 16127773
12282 16127773 15571024 14999319 14827004 14246738 13988035 13505995 13269570 13000069 13079765
12273 13079765 12955059 12839448 12678696 12518735 12352945 12455853 12287218 12396514 12436464
12264 12436464 12331808 12160883 12202844 12458128 12376796 12560456 12274973 12635558 12705417 12840764
12254 12840764 13314325 13637967 14307696 14848167 15819253 16692339 17639259 18575059 19759016
12245 19759016 20818226 21382862 22652187 23344020 23809974 24040343 24415166 24317885 24074381
12236 24074381 24000981 23666766 23590180 23328936 22959021 22999732 22599433 22337652 21709494 21120102
12226 21120102 20303295 19486469 18477230 17478479 16475810 15517575 14434359 14131034 13195379
12217 13195379 12749652 12421836 12106518 11783496 11610992 11082050 11157957 10819059 10648271
12208 10648271 10419709 10240620 10078139 9812002 9502783 9922581 9655373 9783992 9894167
12199 9894167 9820174 9676916 10050030 9806191 9683417 9769848 9895232 10240743 10255385 10417828
12189 10417828 10630245 10872019 11094397 11513565 11522736 11487395 11897786 11801595 11825167 12142457
12179 12142457 12066558 12070985 12150057 12154138 11849627 11664155 11649617 11607283 11629711 11794473 11792941
12168 11792941 11984953 12081709 12033824 12393349 12612227 13156732 13583377 14018779 14389709 14784962
12158 14784962 15399593 16019699 15785570 15737569 15573642 15202822 14839550 14943121 15060195
12149 15060195 15300458 15550857 15631045 16409910 17200889 17813617 18062074 18663631 19252154
12140 19252154 19501678 20154852 20610627 21491887 22121970 23008952 24173102 25538024 26814513
12131 26814513 28767989 30559346 32294843 34191211 35960028 37959170 39539143 40860607
12123 40860607 41867957 42653956 42776854 42958526 42649960 42718495 42249077 41952044 41123342
12114 41123342 40787405 40372147 40138368 39451893 38957905 38590942 37986528 37771650 37861382
12105 37861382 37629039 37543380 37934299 38195475 38625546 38701383 38837013 38911653 38630664 38425575
12095 38425575 37930742 37197104 36223425 35243345 34879978 34502565 34543857 35138379 35613353
12086 35613353 36504758 37514187 38532289 39083851 39542522 40027673 40074597 39902866 39879685
12077 39879685 40093628 39909274 39879814 39657849 39500334 39237036 38879217 38444100 37602937
12068 37602937 36551052 35806436 34680647 33452618 32384543 31238878 30278209 29314774
12060 29314774 28714570 28238380 27883925 27246754 26977338 26562474 26265690 25948593 25491615
12051 25491615 24795008 24162230 23815103 23414144 22736200 22499169 22149348 21757033 21420560
12042 21420560 20965797 20792122 20192986 19560252 19294852 18596083 18199145 17885012 17481949
12033 17481949 17818291 17726977 17928716 18190937 18417943 18703348 18943016 19039084 18901678 19058697
12023 19058697 18448999 18105715 17341530 16392763 15663987 15327636 14785546 14616030 14190719
12014 14190719 13966225 13689174 13229698 13065183 12493291 12307563 11917915 11700603 11554328
12005 11554328 11770156 11544869 11803293 12190234 12263367 12719689 12284977 12188585 12245200 11855972
11995 11855972 11458318 10964887 10632972 10349775 10276945 10089529 9953327 9744959 9798479 9852263
11985 9852263 9511229 9290636 9200570 8684725 8662606 8231041 8163882 7983121 7746134 7955631
11975 7955631 7772149 7917452 7610782 7387580 7267710 7367275 7062627 6778289 6360508 6211957
11965 6211957 6017944 5809706 6065044 5698842 5873077 5930805 5970998 6349755 6458365 6594182
11955 6594182 6358068 6579714 6773792 6689089 6697370 6632015 6665605 6623738 6622181 6572212 6461857
11944 6461857 6815216 7256056 7457738 7279256 7785623 7846672 7897226 7829827 7899756 7918626
11934 7918626 8281622 8088268 7862662 8360365 8298916 8004448 8166125 8006025 7955046 7653852
11924 7653852 7511837 7356757 7273933 6842256 6936452 6838578 6621849 6459313 6360874 6175704
11914 6175704 6134749 6146453 5929413 6525979 7747917 8997470 10847879 12043275 13178617
11905 13178617 13812083 14770387 14814868 13681550 12394528 10623265 8594609 6699074 5766334
11896 5766334 5510529 5277776 5478432 5300712 5350764 5258723 5467460 5656862 6092470 6387113
11886 6387113 7291327 7896499 8200366 9161616 9366675 9969623 10061704 10252232 10048455 9740093
11876 9740093 9055161 8391512 7900418 7433536 6936200 6586034 6204913 5771477 5364815
11867 5364815 5377990 4965611 4920363 4819136 4417253 4744190 4643160 4825921 4847033 4504896
11857 4504896 4592643 4725245 4779547 4796223 4857389 4649718 4988544 5147252 5232045 5243074
11847 5243074 5773148 5912373 6134108 6525043 7172149 7644973 8044798 8263821 8531280
11838 8531280 8631073 8757564 8192783 8113918 7668577 7458170 7283278 7178887 7395299 6964460
11828 6964460 7044933 7289748 6967760 6692885 6072312 5860640 5158477 4942691 4700108 4410230
11818 4410230 4215481 4123288 3974666 4018907 4059819 3645029 3975619 3592802 3671147 3584167
11808 3584167 3501302 3877353 3790040 3613486 3676201 3243255 3413892 3607528 3487459 3601348
11798 3601348 3595046 3681660 3641372 3620573 4055830 3796569 4104190 4444472 4729213 5347535
11788 5347535 5291023 5752108 6137680 6290788 6500988 6138928 5872970 5368339 5229413 4312396
11778 4312396 4121459 3695372 3841546 3550888 3387569 3205087 3238051 3324630 3233534 3167169
11768 3167169 3080739 3046665 3186423 3063644 2916057 3282738 3032701 2874190 3140057 3161082
11758 3161082 2963020 3135168 2798784 3154240 2953309 2887303 2994607 2908736 2908846 3055310
11748 3055310 2878422 2994028 2952830 3133924 3099826 2889900 2915720 2917267 2849957 2979611
11738 2979611 2791715 2845576 2869151 2644366 2819787 2614426 2785655 2628567 2690800 2752679
11728 2752679 2686252 2578300 2823047 2526170 2613720 2775032 2559117 2826829 2727781 2702990
11718 2702990 2444415 2772139 2678822 2762902 2645685 2781688 2674774 2691180 2773518 2608596
11708 2608596 2800973 2719714 2633315 2907262 2834333 2986351 2787062 2799925 2914989 2773484
11698 2773484 2725605 2685451 2690795 2958733 2886246 2721434 3020330 2787468 2805247 3070340
11688 3070340 2846832 3177144 3169219 3126165 3081109 3267496 3119512 3284339 3189744 3199346 3128813
11677 3128813 3172516 3309636 3181172 3210187 3250925 3247526 3216203 3517774 3231653 3318911 3483136
11666 3483136 3333458 3350859 3428500 3559151 3205949 3161123 3177904 3333623 3172852 3179886
11656 3179886 3371983 3192823 3334876 3336398 3237043 3372137 3144041 3250537 3481670 3085568
11646 3085568 3191648 3276965 3169288 3250802 2980337 3146806 3181402 3192274 3312457 3240655
11636 3240655 3365984 3268013 3097526 3433688 3210741 3331171 3382535 3214918 3283142 3373728
11626 3373728 3354647 3107159 2967502 3194987 2927601 3352818 3135783 3284389 3183680 3274744
11616 3274744 3139750 3091698 3047717 3059625 3300788 3250517 3030199 3100723 2984690 3289745
11606 3289745 3333912 3350947 3356710 3282873 3390329 3396211 3476919 3560657 3625510 3354426 3647238
11595 3647238 3576079 3448309 3420450 3453546 3336579 3666040 3619123 3280565 3384447 3515992
11585 3515992 3466148 3206863 3501918 3296354 3516294 3624985 3774487 3710010 3646659 3725388
11575 3725388 3727723 3749353 3844454 3875919 3951576 3848850 3684139 3796369 3791185 3802021 3620845
11564 3620845 3672190 3560559 3479929 3656575 3523064 3639595 3703215 3717209 3620579 3798804
11554 3798804 3521815 3746219 3902409 3659533 3779908 3568113 3747777 3665716 3673363 3697556
11544 3697556 3590970 3520962 3562704 3449961 3628351 3572403 3691516 3534982 3596462 3567045
11534 3567045 3444270 3397700 3535505 3817321 3578953 3433439 3501335 3430493 3535098 3539807
11524 3539807 3642664 3462396 3509236 3781751 3551382 3611164 3620530 3708324 3739254 3740575 3573122
11513 3573122 3727500 3800155 3685267 3853611 3692443 3890744 3666488 3937067 3943641 3883682
11503 3883682 3945928 3852918 3686970 3800902 3699734 3994757 3674090 3694780 3797690 3885299
11493 3885299 3591871 3657008 3883672 3952517 3776055 3910161 4251201 3882756 4062343 4189110
11483 4189110 4108144 4138581 4006570 4133658 4253645 4263164 4029972 3868179 4457123 4055912
11473 4055912 4312537 4277117 4255331 4273028 3968885 4136092 3949329 4033763 4227766 4244587
11463 4244587 4122336 4011579 4067255 4067900 4117662 4167796 3995069 3978109 3981501 4137472 3959119
11452 3959119 4273616 4137711 3991427 4094549 4042716 4278912 4073832 4280295 4197305 4192783
11442 4192783 4288839 4253890 4450666 4417257 4483734 4400207 4586482 4553441 4465075 4799333 4998089
11431 4998089 4744904 4868725 4963701 5194173 5254905 5338778 5320587 5457913 5479308 5436343
11421 5436343 5875352 5546677 5635302 5635333 5888695 5963973 6070547 6010209 6051108 6077082 6078491
11410 6078491 6130580 6448617 6683096 6674923 6637886 6966562 6901364 7001968 7054144 7238434
11400 7238434 7242815 7443793 7496479 8004647 7936011 7851937 8173213 8518440 8263411 8544179
11390 8544179 8694078 8914039 9048515 9189846 9399373 9317250 9615008 9822512 9898100 9913034
11380 9913034 10274398 10575321 10597354 10826630 10757324 10709036 10832035 11139038 10897105 11273120
11370 11273120 11055600 11357821 11467343 11542558 11340204 11419459 11642064 11464366 11860402 11759100
11360 11759100 11705386 11830087 11840107 12039170 11942088 12227709 12008753 12014902 12276329 12228193
11350 12228193 12227177 12188188 12102205 12033192 12090063 11960964 12077180 11790204 11788731 11742363 11466160
11339 11466160 11502795 11528945 11437651 11371623 11318248 10950944 11137213 10930175 10994174 10450136
11329 10450136 10569440 10616297 10293476 10110254 9995272 9987496 9709674 9426425 9436019 9550893
11319 9550893 9235740 9144983 8994061 8699906 8445399 8623098 8203134 7958379 8054371 7837555
11309 7837555 7545744 7501165 7483832 7092614 6917995 6906425 6604717 6714313 6249397 6423231
11299 6423231 6355366 5935756 6188868 5863683 5803116 5752206 5505360 5406686 5241717 5374362
11289 5374362 5297039 5052489 5034477 4906624 4855955 4736345 4583443 4593802 4518808 4478778
11279 4478778 4291616 4234900 4181187 4301996 4277800 3961340 3980838 4247230 3709074 3822506
11269 3822506 3900431 3795767 3539531 3623278 3620284 3541374 3621146 3437263 3534313 3479648 3467199
11258 3467199 3628509 3456094 3350689 3198607 3179624 3352551 3300320 3385896 3205510 3171007
11248 3171007 3400259 3245780 3359536 3490986 3201371 3495484 3471064 3377265 3272685 3379367
11238 3379367 3111059 3131879 3422907 3188339 3304411 3249749 3463096 3277239 3470810 3607855
11228 3607855 3450632 3680735 3936208 4262686 4982199 5642059 6475938 6940288 7510563
11219 7510563 7617556 7818420 7576312 7219956 6341547 5524202 4774349 4287677 3888139
11210 3888139 3554118 3605871 3651773 3624158 3489871 3424984 3406503 3531593 3524764 3557419 3418200
11199 3418200 3666719 3655477 4043875 4487767 4992823 5913045 6743634 7108364 7297080 7739826
11189 7739826 7997883 7707854 6986909 6406255 5424929 4752108 4249780 3996544 3817488
11180 3817488 3723677 3623370 3432678 3409102 3471155 3457343 3263962 3309017 3534570 3537884 3608459
11169 3608459 3679070 3863566 3817907 3770426 3618611 3705847 3719622 3817348 3754281 3641053 3771291
11158 3771291 3863917 3855371 3655155 3879368 3821998 3903010 3946477 3850233 3814981 4041610 4054267
11147 4054267 3817668 3855923 3940395 3883996 3981197 3922180 4118271 4160190 4083125 4085028 4048269
11136 4048269 4289980 4045332 4137257 4268836 4057534 4325522 4183705 4254720 4546336 4187721
11126 4187721 4404108 4325560 4311857 4448161 4454751 4468943 4495239 4174364 4502146 4423454 4617729
11115 4617729 4590093 4634296 4459644 4472579 4669005 4662461 4764333 4535946 4586319 4774863
11105 4774863 4772174 4590379 4931141 4675527 4601730 4414189 4422334 4574862 4576477 4507806 4575057
11094 4575057 4455376 4564799 4511881 4547909 4506991 4523268 4413893 4172655 4600700 4464642
11084 4464642 4367485 4614233 4722920 4574098 4369543 4488379 4503227 4489689 4675404 4909082
11074 4909082 4613814 4879700 4818366 4825066 4874651 4863996 4995909 5081129 4986259 5086683 5126560
11063 5126560 5192711 5300454 5231080 5622837 5476894 5623133 5547284 5914435 5780377 6043065
11053 6043065 5957666 6056228 6053045 5976158 6260080 6130917 6303730 6226900 6303390 6358889 6807803
11042 6807803 6614555 6805293 6975117 6841713 6901954 7145058 7460736 7529145 7801974 7573601
11032 7573601 7996107 8394154 8683268 8946141 9272744 9384372 9735343 9807915 10022099 10254929
11022 10254929 10142837 10474312 10702203 10969314 10840880 11370761 11231085 11392018 11374828
11013 11374828 11664841 11848548 11909237 11942404 12182763 12712197 12721096 13052332 13195481 13618798
11003 13618798 14117421 14073273 14795744 14953125 15041305 15338805 15656555 15896037 16269355 16385317
10993 16385317 16835614 16808024 17032620 17187442 17230697 17504328 17669455 17648663 18061737 18311179
10983 18311179 18655584 19146198 19582685 20004795 20709365 20813250 21470094 21615810 21776765
10974 21776765 22123162 22122920 22256539 22475367 22643684 22956183 23495416 23902016 24084971 24818158
10964 24818158 25154685 25570495 26142823 26376811 27036576 27450755 28104133 28642638 29410084
10955 29410084 30261788 30780737 31691021 32110491 32881585 33600775 34272054 34763286 35325662
10946 35325662 35637792 35943254 36626652 37170053 37888509 38743172 39339642 40072358 40740479
10937 40740479 41583395 42516350 43332617 44270104 45226796 45897049 46821948 47857504 48720768
10928 48720768 49851984 50589673 51505793 52544333 53448833 54135914 55075627 55936070 56824208
10919 56824208 57452803 57979365 57961077 58432009 58584604 58659875 58537630 58601587 58531050 58421769
10909 58421769 58253155 58386211 58535648 58349616 58556457 58414555 58771306 58963366 59563924
10900 59563924 59849137 59802208 60302954 60603762 61066318 61738929 62480910 63257099 64013002
10891 64013002 65127244 66194812 67859894 69153843 70797032 72752839 74739368 77488676
10883 77488676 80374651 83551389 87356021 91124409 95445816 100375876 105487470 110784432
10875 110784432 115718268 121160570 125749144 129764442 133147803 135278587 136882761 137086850
10867 137086850 136212465 134543206 132063049 128698381 124550926 120166575 115452904 110322445
10859 110322445 105216017 100196526 95128835 90120771 85001933 80633786 75901957 71522571
10851 71522571 67512942 63350716 59917954 56455308 53195760 50012772 47098593 44245128
10843 44245128 41607794 39232699 37001217 35093867 32941674 31320419 29646688 28192165
10835 28192165 26564044 25531141 24378418 22869401 21865904 20875227 20045433 19018172
10827 19018172 18243469 17567744 16890104 16373923 15525974 15268512 14366755 13900186 13553771
10818 13553771 12933043 12431074 12094596 11844763 11591988 11354577 11036530 10772292 10363867
10809 10363867 10124063 10037256 9854308 9652805 9275039 8859374 8947963 8611103 8393802 8066503
10799 8066503 7762084 7596498 7296807 7172873 7160029 6869299 6730630 6644646 6315776 6346938
10789 6346938 6213504 5981210 5923338 5918216 5628886 5696312 5568314 5399172 5381939 5274630
10779 5274630 5159699 5209365 5164488 4848782 4688546 4874787 4659055 4708759 4289314 4225410
10769 4225410 4257575 4511972 4431844 4217327 4146571 3860908 4008062 4000897 3674433 3813988
10759 3813988 3904840 3676721 3846382 3751155 4004030 3917153 3826698 3949124 4007567 3955237
10749 3955237 3773264 3637433 3762591 3776220 3499255 3395384 3325439 3273960 3271550 3433150
10739 3433150 3195849 3204033 3119580 3219202 3107966 3088320 3204517 3351243 3363416 3135691
10729 3135691 3309294 3425570 3496691 3592250 3388592 3188403 3450436 3149917 3371939 3229412
10719 3229412 3479341 3264938 3274297 3151303 3064578 2915132 2837212 3304437 3200968 3038529
10709 3038529 3331006 3238183 3052240 3316523 3269872 3243218 3237769 3274393 3425219 3141638
10699 3141638 3379331 3478367 3251428 3082779 3064197 3102895 3217140 2859370 3200404 3247668
10689 3247668 3152207 3413564 3118716 2954551 3025136 3159474 3017169 2870564 2963187 2949509
10679 2949509 2971212 3073381 3053077 3127062 3410145 3150345 3309970 3044896 3351170 2736872
10669 2736872 3253260 3207424 2896890 2904144 2730842 2734918 2826197 2728045 2771893 2561248 2648148
10658 2648148 2314888 2551030 2454806 2672648 2728911 2760950 2692414 2738253 3012498 2824686
10648 2824686 2867807 2659109 2812737 2508040 2456304 2334249 2195558 2299935 2044733 2392195
10638 2392195 2290520 2109337 1835907 2448829 2206018 2296995 2217257 2073567 2060656 2259200
10628 2259200 1941560 2020159 2062241 2027847 1890852 1870671 1661480 2020521 2230779 1849241
10618 1849241 1848665 1955069 2128691 1990054 2219541 2078582 2139712 2089155 2063313 1919015
10608 1919015 2041350 2219080 2040993 1811885 1949489 1923019 1877089 1910815 2215203 1686568
10598 1686568 2096793 1954390 2292367 2227648 1794109 1914094 2119096 1928258 1914645 2110568
10588 2110568 1948008 2074139 1722251 1885632 1811370 2038182 2116205 1929733 1932437 2062387
10578 2062387 1794127 2279867 1958134 2047729 2002192 1842183 1874061 1967070 1804990 1876242
10568 1876242 1916613 1688701 1833479 2037047 1722858 1761277 1755934 1602583 1533025 1674385
10558 1674385 1692481 1891063 1530636 1572562 1650434 1330291 1480156 1532987 1587773 1542150
10548 1542150 1456604 1528201 1619822 1485599 1559450 1426026 1560736 1593507 1619660 1487890
10538 1487890 1458633 1577543 1572561 1434704 1598781 1589266 1660597 1703665 1589860 1721288 1507632
10527 1507632 1657261 1431062 1613998 1757720 1651558 1803066 2074628 2145836 2440607 2487411
10517 2487411 2505567 2715816 2799077 2778502 2711580 2549845 2459663 2203278 1942308 2068241
10507 2068241 1926640 1806952 2072921 1845299 2023586 1777990 2055536 1933434 1686265
10498 1686265 1877004 1911041 2132142 1978711 2047909 2325999 2535999 2385291 2699282 2837150
10488 2837150 2724251 3027832 3071304 2994654 2695920 2558910 2333686 2163396 2240257 1957576
10478 1957576 2410086 2083448 2173705 2110390 2214031 2321006 2255774 2314954 2219202 2419828
10468 2419828 2448442 2410312 2696448 2486797 2506241 2837630 2809868 2804376 2923742 2740785
10458 2740785 2534906 2446537 2500553 2528104 2369584 2434727 2545611 2494059 2466216 2572860
10448 2572860 2660885 2623757 2637203 2898851 2946973 2906814 2815688 2755217 3324356 3523353 3656331
10437 3656331 3690485 3878525 4037281 3983559 3864634 3915662 3607359 3356766 2989771 2636599
10427 2636599 2429993 2398972 2414793 2535341 2509454 2601469 2317428 2410870 2474340 2277950
10417 2277950 2444450 2369607 2304248 2389203 2599492 2754141 2966426 2940313 3273815 3372253
10407 3372253 3573666 4037980 3787743 3737479 3885829 3952507 3625601 3576881 3727167 3745255
10397 3745255 3930703 3882280 4344133 4325564 4793488 4864555 5184926 5377342 5565322 5645272
10387 5645272 5980068 6107444 6168250 6288298 6213098 6322574 6417628 6401624 6294285 6085680
10377 6085680 6138624 5856864 5797521 5584475 5703896 5750601 5729077 5671960 5477800 5930071
10367 5930071 6054309 6067248 6069261 6311720 6020787 6037304 5830185 5633285 5615359 5421645
10357 5421645 5535395 5511935 5332016 5120913 5395376 5478546 5546922 5155190 4882081 5012292
10347 5012292 4852379 4931676 4850652 4633354 4561619 4374151 4274027 4502365 4474773 4689636
10337 4689636 4818238 4804016 4786847 5057737 5144712 4776368 5005497 4942233 4802539 4823511
10327 4823511 4778722 4727218 4653778 4876709 4807754 4615425 4747689 4860606 4608728 4576988
10317 4576988 4673630 4876754 4865098 5034371 4818052 5197608 5128609 5059761 5427015 5391942
10307 5391942 5798058 5822485 5905759 5963594 6079806 5772679 5886518 5795843 5763915 5844343
10297 5844343 6063325 5729977 5919144 6183017 6552236 6338181 6829164 7141095 7345282
10288 7345282 7844716 8057187 8886440 9371365 10178330 10597842 11128871 11592774 11994225
10279 11994225 12579348 12933136 13269424 13721535 14153407 14390123 15017063 15295940 15993886
10270 15993886 16312585 17112113 17355175 17930861 18461450 19149449 19613999 20155368 20769323
10261 20769323 21782654 22243743 22825718 23894529 24632346 25211054 25662349 26019175 26438452
10252 26438452 26393305 26312849 26395210 26742652 26910890 27243078 27525608 27646720 28100314 28171659
10242 28171659 28272507 27998050 27685220 27449811 27050018 26357904 25713460 24764708 24251251
10233 24251251 23509829 22865391 22310959 21681761 21526204 20988624 20585571 20104446 19960576
10224 19960576 19207262 18859723 18458290 18221199 17587066 17473962 17217033 17079980 17116743
10215 17116743 16575849 16446163 15852289 15470933 14775059 14344872 13943295 13480794 12691450
10206 12691450 12226360 11960424 11256686 10538868 9919748 9619420 8805369 8600833 8205078
10197 8205078 7884029 7443301 7274349 6943644 6747307 6421045 6217891 5770380 5624449
10188 5624449 5592282 5545265 5215936 5199732 5178626 4955218 5039625 4901995 4712009 4737922
10178 4737922 4783656 4750854 4431396 4361437 4382442 4365775 4101527 4096714 3872683 4029930 3656287
10167 3656287 3852813 3903529 3627783 3792538 3657838 3498938 3518802 3685760 3554045 3563739
10157 3563739 3469031 3498316 3370227 3253051 3415457 3333963 3349983 3266314 3318445 3355312 3221070
10146 3221070 3386830 3159882 3286385 3206485 3173747 3146843 3142292 3101042 3306612 3223321 3031927
10135 3031927 3140706 2772723 3246937 3074288 3172118 2973494 2833658 2742705 2894279 2931454
10125 2931454 2759534 2266581 2604573 2757700 2711350 2501878 2712295 2639113 2621837 2510004
10115 2510004 2699954 2668798 2768673 2673346 2395024 2503627 2549163 2523991 2579407 2716617
10105 2716617 2700396 2454269 2671075 2467337 2653347 2591551 2521050 2599364 2591571 2425579
10095 2425579 2474228 2440021 1943283 2441538 2290561 2354674 2275530 2366181 2115425 2248699
10085 2248699 2413418 2402342 2445880 2372495 2219248 2433879 2536645 2386177 2233622 2131905
10075 2131905 2310110 2443702 2403082 2295953 2606872 2364523 2470380 2629008 2571298 2429121
10065 2429121 2502688 2740608 2667313 2611209 2965151 2673272 2768696 2589463 2918350 2758482
10055 2758482 2742721 2817228 3004182 2782235 2817823 2763473 2820707 2671707 2857201 2581370
10045 2581370 2590640 2723436 2747046 2630630 2826058 2551339 2490534 2452199 2701526 2464303
10035 2464303 2654213 2524123 2343089 2404266 2398073 2376436 2416861 2409516 2394321 2311764 2413961
10024 2413961 2530007 2345161 2217114 2370582 2057253 2195694 2524378 2340191 2300091 2271634
10014 2271634 2221561 2261130 2409563 2292211 2183971 2107573 2079907 2194020 2115130 2170323
10004 2170323 2050855 2274484 2020229 1925713 2043457 2079607 2000454 2100686 2108389 2119694
9994 2119694 2107660 1882804 1764418 1726712 1777273 1801633 1689605 1755983 1600725 1770683
9984 1770683 1813059 1747899 1898414 1869973 1594727 1587748 1581423 1683779 1485994 1636743 1575670
9973 1575670 1564325 1111829 1457005 1372390 1410654 1409019 1317204 1291298 1374063 1349596 1269273
9962 1269273 1362470 1420231 1380914 1332302 1089390 1212051 1276874 1214731 1048353 1382189 1082935
9951 1082935 1154272 1222148 1155104 1074995 1042762 986773 977745 919811 1055858 995450 1167114
9940 1167114 996681 1009979 1105264 1043350 1133595 955206 885783 774963 1277089 963010
9930 963010 857868 851141 1046762 942153 971308 971179 699919 847573 795455 935532 894848
9919 894848 778302 941348 1020274 1100935 956959 913719 1090084 852137 954126 993460
9909 993460 1072168 756534 1044922 744649 947227 982549 915845 901177 1189141 871115
9899 871115 792415 703808 1087267 932789 733725 1073557 976112 998714 762594 798105 1008009
9888 1008009 739602 845825 897842 982031 868857 708067 788016 741396 814037 896723 823683
9877 823683 926652 951788 888849 681287 832193 925021 853252 905558 1040618 1062400 748195
9866 748195 880764 610587 635143 915869 771064 841515 819088 915457 744889 818137 763636
9855 763636 615288 834358 879480 849405 726599 880290 823580 952579 895245 823582 564084
9844 564084 882726 848935 932695 920574 884958 880080 943849 969376 752337 773927 720391
9833 720391 841227 733057 841582 968382 910067 829345 984695 790327 935143 801401
9823 801401 826086 994345 934519 644998 703943 966599 1076713 879675 1059595 963511
9813 963511 642287 979315 828062 725290 760075 739253 884537 780629 753687 728058
9803 728058 897620 731055 765530 759269 1007629 863600 643125 1054156 902240 655979
9793 655979 737879 951118 699421 579493 942615 726397 706317 815191 719793 1003757
9783 1003757 900430 693239 795038 677859 661691 927059 719530 694059 682631 714553
9773 714553 683408 914680 600543 880900 619387 580243 830611 565491 707033 430972
9763 430972 611745 585236 574923 571118 517149 661215 669526 564794 646956 486081 523168
9752 523168 518611 689275 525063 773485 570088 676799 547738 585742 472045 447457
9742 447457 682124 567352 599393 485132 551178 518938 556899 641961 343158 537685 634601
9731 634601 667992 624894 677817 518766 339158 249778 349752 575908 506020 375431 520124
9720 520124 292946 483295 421814 260572 408658 357254 590969 463920 428805 334878
9710 334878 294848 364927 440713 344167 533482 377122 427511 407762 515649 217481 479637
9699 479637 584357 426802 361273 339743 456914 472682 455599 335924 283395 689933 675546
9688 675546 477881 395912 411288 208014 170508 360067 243237 556477 639249 352772
9678 352772 443882 569870 295354 278897 376418 285992 474896 448288 157037 372361 359576
9667 359576 360603 380813 245255 481218 537358 583885 377068 250965 536370 472287 420378
9656 420378 391856 222312 524688 438289 568778 405581 483142 513874 563896 417913 385635
9645 385635 182578 260933 379645 230018 279369 539172 252938 372855 348309 308486
9635 308486 239796 468551 306340 503795 280081 525614 497655 574867 405950 436575
9625 436575 534100 498625 311038 533981 492692 544516 454090 375554 425969 423070 464311
9614 464311 417211 507676 381432 239651 481948 636597 351412 241476 377539 704592
9604 704592 543187 529248 446010 445293 471432 396864 242364 276198 437880 306728 547101
9593 547101 374364 535604 390241 545376 287173 335562 576613 304915 500909 430829
9583 430829 363867 435837 521705 263027 359904 213523 458275 325191 415307 347373 551033
9572 551033 504203 567044 423693 288175 336880 511977 291636 689112 377741 474544
9562 474544 403684 442508 548091 354862 316013 397240 271578 271540 449838 363215 369164 327555
9550 327555 525609 338148 259364 335874 442729 356074 442833 429296 606887 243309 392522
9539 392522 118959 495117 280133 620047 244113 400800 182331 311455 311599 182255
9529 182255 254754 348598 414798 188734 266124 329619 244286 427966 381175 97800 512493
9518 512493 310024 294899 158187 322472 280510 326495 338684 237934 144661 407420 323425
9507 323425 314887 127186 327581 148588 339999 304954 420467 317052 220440 242281 422109
9496 422109 235609 304648 112348 355765 521018 264351 456211 260702 182806 600786
9486 600786 257841 555843 375504 300158 436292 304829 401500 233575 105222 218195
9476 218195 256883 148635 449063 94028 243706 272018 261649 260412 355910 259636 318074
9465 318074 195416 403088 377586 367976 234913 128996 172583 111681 277593 160656 504145
9454 504145 178433 490269 375155 451939 242552 86318 150184 256985 424857 167396
9443 206587 17062 323516 179907 338409 509114 361502 201218 64074 356216 169097
9432 -19277 252821 304360 147015 6698 324155 137138 268043 222564 388809 177781 280132
9421 280132 199052 426807 175638 254743 209905 336056 317108 323403 429296 292695 308908
9410 308908 178043 245166 66930 321937 263465 43670 257215 318663 406699 420978 87757
9398 350470 235654 381746 450173 141240 92291 314015 193124 243793 207638 164146 37860
9386 273187 378576 191419 208099 104370 122809 330225 224428 193953 232995 17335 290123
9375 290123 124959 346904 190952 234788 161696 129652 235014 99236 92515 212930 83342
9363 371466 195970 263885 30127 251206 422101 400889 197903 340056 229053 71733
9352 159118 341249 212571 293716 387450 53669 247926 153509 168587 104768 515615 227507
9340 341392 -152385 56926 338440 91040 208833 268036 2527 208309 37723 293963 169991
9329 169991 176496 290915 262705 -12526 256461 312895 139098 163834 346964 351532 101513
9317 158562 194236 377634 25451 301250 193334 97485 389108 46830 125110 -133468 231608
9305 199717 300907 405500 164859 178210 137076 105826 269428 117167 258611 340851
9295 340851 142016 371683 234191 184664 294040 243665 243211 -80046 137112 260522 95522
9283 249987 175323 156915 168891 238324 276319 26952 231715 215622 257190 163161 237211
9272 237211 205184 252978 145912 288201 215305 99256 131134 207679 177438 283682 177131
9261 177131 213627 395279 145228 492518 183015 239315 42469 324139 104658 379648
9251 379648 336842 -80839 223368 170216 164921 288327 207731 195028 369396 179633 26961
9239 427585 -33174 -61868 253611 73645 222215 71316 424636 211409 230528 91977 102661
9228 102661 426404 85724 292189 208478 152468 159469 -5341 265014 55400 343268 108352
9216 251970 471428 47924 52792 364160 311383 228202 199220 104274 91356 56762 242277
9205 242277 200405 200679 242127 309974 374728 262225 54035 120257 273279 99334 289504
9194 289504 159582 152835 215472 -46486 200276 127195 343471 275657 182700 -33377 74655
9182 100856 349948 174979 245678 10563 91716 95245 232394 71924 156679 127676 128055 191126
9170 191126 127007 3695 -34057 244002 312498 213603 92383 2705 363096 47731 392411
9159 392411 17284 171204 223483 215585 47168 253133 96948 48428 112379 255623 19084
9147 237941 205956 197468 385140 -30661 61161 430295 391787 313299 109634 171608 215154
9136 215154 211771 217972 287814 344201 32435 199590 153173 258527 196786 21876 248688
9125 248688 266902 263953 359398 177426 153790 210271 126304 80584 315315 208761 -481 46241
9112 295981 250717 -26166 61008 292725 -103812 253577 172861 283987 -126250 213084
9101 253081 443075 323296 265672 344714 186656 278281 421654 248050 244078 242524 219505
9090 219505 219455 301945 245749 158720 354704 89152 298807 385295 -140408 66257 148436 327851
9078 327851 417444 290842 223158 168664 219599 370220 383630 167244 207100 168547 282275
9067 282275 322827 43585 219865 117802 107623 139061 312549 138989 299102 235070 148917
9056 148917 206285 145717 380604 188751 204775 239403 173476 191320 193584 134969 337042
9045 337042 131324 18455 257791 122281 38308 183688 289409 134667 -10855 218355
9034 309844 220158 51789 193279 78898 235225 -26567 89606 299977 383765 151179 -5141
9022 126016 46519 182587 182538 230738 186458 247718 275889 200320 211432 -59830 276207 279247
9010 279247 233988 -41380 181220 151939 336075 87558 250884 80887 132871 407073 354690
8999 354690 87217 212689 174689 97488 202132 173827 -44022 61389 67188 115208 127579
8988 127579 274983 279521 90065 168880 135273 304094 207236 147067 357699 207238 257863
8977 257863 113614 119772 356328 376979 102876 128540 169540 324868 -31869 228682 122158
8966 122158 126699 279000 231465 150648 142300 60561 245874 77783 46879 119179 119815 109983
8954 109983 228502 83375 132696 93411 331141 171433 -116913 326615 195037 320271
8944 320271 170765 270571 245241 97172 343306 190158 178845 176769 299112 216206 180517
8933 180517 381602 79657 233923 243583 139623 201997 169726 124892 308558 272854 124471
8921 169744 257680 244480 401930 192583 100450 108426 253259 233405 414607 236324 119132
8910 119132 257665 98815 186125 296947 307903 327165 275356 124682 436374 301737 489381
8899 489381 596787 262316 434512 375408 269664 166212 229719 222231 509011 339131
8889 339131 341714 491135 338006 579545 292681 372070 559104 514872 492769 411762 508626
8878 508626 447688 612312 255296 541079 421763 518769 565154 296077 676822 384394
8868 384394 539759 584447 465501 410010 477189 360593 259076 480402 508028 474483 281394
8857 281394 410735 308053 274261 360167 374941 365618 344758 390600 276701 225505 193598
8846 193598 272362 234045 343231 323180 131331 414009 446887 231606 302251 253026 115079
8834 306080 218791 142103 218768 241060 231194 348331 275778 248213 302159 450876 130611
8822 132900 280969 495651 165100 287960 211980 391586 72044 146092 313143 237800
8812 237800 337415 174046 99476 337443 363186 -31991 157117 189197 111464 246273 288080
8801 288080 229550 67225 139554 253790 86637 277472 240286 180529 -29837 49660 124304
8790 124304 323097 11190 155016 86050 179409 -53289 157474 208660 223057 141000 -41330
8778 159361 158328 144840 100080 149310 -81989 296087 245102 240270 396797 390372 167281 189725
8766 189725 134759 224463 -4229 94172 173696 185963 114576 92454 80150 80125 8021 33475 109700
8753 109700 102653 144727 42459 170466 196388 115929 241326 84602 210911 150308 -109682
8741 98243 173561 117202 60211 179230 205200 48008 101979 313591 76763 338790 -67966
8729 124922 60079 317184 108230 235044 107234 150852 72035 176564 206583 72111 212814
8718 212814 45979 159139 449697 107546 141137 123169 13828 141578 -124961 -11573 162281
8706 24959 77372 163851 78167 25265 367195 184365 -122059 402658 179287 238378 321419
8695 321419 196070 290474 99197 -38436 248596 34750 -230279 116985 306901 152273
8684 85063 304554 60266 100712 141636 206729 109063 218605 72929 297043 327186 15153
8672 181501 194857 114920 220187 207833 212136 50716 -33741 -15425 48947 205023 -76317
8660 126012 203576 146928 -155164 143545 78368 116100 40078 14980 126003 213749 259098
8649 259098 -81097 220193 208298 88661 74956 215045 33139 -32534 -2378 119762 279603
8638 279603 -9162 -76565 159833 -104650 -39106 60601 201168 208669 73764 -2590 309558
8626 181847 169911 130412 18295 61836 73077 60823 -30382 357781 132620 194751 109096
8615 109096 122766 139851 143636 115206 92073 56249 -93717 187547 289232 128180 36115
8603 56732 120867 33482 182216 103457 -21446 424057 218361 104953 268793 -6892 -14161
8592 -14161 316933 210724 299693 119881 49966 81345 234446 175396 90615 241732 142504
8581 142504 232339 59082 196290 99919 -166422 143138 326709 325255 -116082 157841 379851
8570 379851 65923 -41612 -31360 78227 159618 28058 189691 152157 1782 297264 78788
8558 76620 104350 161463 -51731 321027 2143 71732 212540 290013 -59885 203778 -76654
8546 -11407 134114 164123 298968 107248 126214 46566 217070 18212 -121268 -41331 257819
8534 112565 83319 332952 201157 79047 165312 105201 104435 190301 57703 213926 82320
8522 61507 -6782 107692 130956 294748 31831 250085 93664 272020 299230 190153 78958
8510 323681 180826 310681 314654 10731 244600 244246 71171 153912 85433 128203 194447 -60461
8497 243942 8927 -126797 181560 237440 -44539 208847 216961 171293 18648 98633 86411
8486 86411 124003 24701 89030 78476 194721 81868 192311 116502 327244 165940 -72834
8474 265363 22948 140183 311864 281159 117920 235748 52853 13717 224008 229470 253857
8463 253857 276685 32155 91352 30729 21581 309651 66353 259454 151241 138207 131562
8452 131562 184180 331725 176177 44701 84929 56030 128923 124109 315007 131550 289083
8441 289083 11247 274636 229482 154360 -22239 177093 -73618 234820 27667 60183 80627
8430 80627 53160 323524 156639 211148 91622 169408 62346 -33836 39486 103975 37 62993
8418 62993 -40918 192035 169332 144657 294689 214079 6227 235069 65724 78447 278449
8407 278449 -7705 64359 143444 -123273 404374 -148885 153648 217476 164653 274539 28962
8395 101569 -16454 57796 271490 179028 131962 -8347 -19987 149393 163093 349535 36047
8383 99028 122395 -34781 112798 129424 -11678 262940 198538 -89727 126995 184573 -10045
8371 78229 256801 43625 316349 112819 80206 -25015 198259 291255 19457 103111 -24894
8359 142362 36044 156935 -9999 26270 216573 -201611 72699 59956 35051 17173 -53114
8347 -17697 139123 96352 204750 22068 -52899 180236 147869 155375 16325 8274 75061 12378
8334 212044 58018 -72707 187096 -18128 273951 139297 163540 276256 135023 8650 177770
8323 177770 86262 116324 42940 109706 112236 -25588 123125 -56367 11427 96906 192179 58492
8310 -10509 48881 263193 183723 90466 120835 -165603 244204 -158127 30239 -36253 235807
8298 65542 237558 -35032 273565 94695 260690 158547 306560 264321 107383 108982 82232
8287 82232 -159650 84656 175249 178577 -19653 141244 -32830 78924 158394 119066 218461 -31734
8274 225301 -44107 22040 -7494 93587 -73093 214037 79136 -161098 256951 153216 -140619
8262 140413 83049 58105 -51723 36072 26776 -67400 -21394 188050 64264 63550 -57683 53390
8249 59179 153532 130048 117964 238580 269 130719 210259 160829 192476 70469 87628 300556
8237 300556 27 -24767 130576 -52994 60397 128824 226538 -86819 118498 210880 218481 177022
8225 177022 -138846 52153 -33367 238904 112521 193039 199339 441656 104674 179736 35635
8213 -18872 184733 25977 9627 453469 206123 50228 26951 119548 345217 164568 109677
8202 109677 -15198 63793 141346 -31412 300007 232624 -131119 165158 98170 110745 81522
8191 81522 364638 -29775 46196 170285 59718 105637 271934 272052 88997 128460 -42002 94419
8178 114455 123173 200094 303103 59595 163294 253038 251652 214910 90004 -32842 180844
8166 315699 131206 -68005 84885 154864 124882 -53519 169391 220418 -64695 240051 31071
8154 65322 -88787 214873 151308 277064 4147 -90404 -149623 177543 -132445 64113 98230
8143 98230 194749 135660 18742 57793 -29257 164713 44612 20428 116628 81021 205737
8132 205737 -29607 16660 90193 292986 320127 61922 194218 37844 268165 -1429 180450
8120 168875 17168 28363 -7712 290398 218087 85315 22027 269952 161770 -74946 249300
8108 -132220 144147 -56440 225282 138772 48814 133756 -73561 -271085 139538 417276 9832
8096 -32960 210105 192396 43273 -33914 95064 19366 125673 204004 30540 -129637 180402
8084 198113 144059 60557 -73074 -116311 -5193 150376 35266 -34663 -144848 366615 -245719
8072 274265 107509 -1277 361547 -12413 29061 21253 -7659 56195 129478 -33125 -109898 139118
8059 276208 100557 271289 194042 171075 51885 243574 36857 252340 58792 65227 176981
8048 176981 241317 248213 115446 69736 200957 1251 -31925 238175 -181175 150188 237870
8037 237870 32860 -45449 83932 174205 123744 28060 64211 297960 62718 -33355 -176681
8026 -176681 115280 66908 133582 55096 -90815 44852 199333 293475 20806 101527 160556
8015 160556 110078 162221 96248 171253 27120 -65788 162797 315970 48133 162858 138093
8004 138093 198608 93972 129945 -16380 26638 102717 253649 -1926 -49624 50516 254484
7993 254484 308469 88630 -99587 238489 160285 73142 65424 47728 230812 156670 366324
7982 366324 156530 179097 23150 27997 83324 -239922 31648 329105 210073 269646 402802
7971 402802 300819 -33982 180467 39709 89691 170479 -120862 -1564 -32625 297771 158741
7960 158741 111264 93018 -40379 -85911 -190911 191782 125130 219463 -98128 -36932 121992
7948 70166 321954 35638 161427 -86960 189723 -14121 62813 277735 3621 264281 -221415
7936 38724 141895 22043 159476 26198 -3966 -73580 116677 68110 201295 94239 18732
7924 304282 337891 135097 218064 77153 121654 142218 49846 121751 -86741 282000 316632
7913 316632 98304 50651 -602 126522 80430 112395 126720 -2482 -20152 -15629 77287 -2481
7900 -57826 227532 12046 137638 -46189 251966 50293 50980 169507 103220 37270 63604
7889 63604 93997 113120 -12713 -69359 88291 82445 -19833 182478 328318 -47733 18668 -29251
7876 128333 35357 -54776 99610 -13915 85536 108558 -88255 -138452 41621 9905 20920 -31434
7863 100655 33768 177042 -176861 104248 176622 31360 -7811 -8037 190324 31242 485438
7852 485438 353178 109920 128366 42127 134703 71656 -84630 -200078 27304 -24150 231048
7840 64208 20976 113913 135707 -56739 -61598 138855 137678 173485 49848 77043 -29461 64565
7827 2428 27761 291585 -194127 -44290 206500 203305 242089 307810 86455 -25710 48833 172327
7815 172327 -2113 47328 -127668 140959 25885 291114 144048 279252 203925 -245361 -33956
7803 58542 177730 -35578 76335 72751 237863 89370 -137340 -154320 99880 108662 109584 116092
7791 116092 149130 -57264 -6722 187403 19928 13157 16544 -86247 176117 -227020 145436
7779 192590 115441 99235 233671 1731 24388 177518 41158 -97272 112630 -147901 -9792
7767 55070 205148 47385 86265 37547 5472 41444 18183 159852 143112 -61648 -39075 181116
7754 16441 144132 229624 177237 77222 -77068 41886 -5819 -119403 -44694 57102 87647 -56069
7741 206905 118659 -97678 -47933 134316 -18973 76 -13824 -18252 -73041 212212 214730 49371
7728 192655 -100565 -185511 212393 224299 39976 866 56035 3416 95359 142375 179757 110144
7716 110144 189922 -104382 21694 -88578 185954 15188 164180 4461 91239 103258 189053
7705 189053 -102646 201741 -130690 -27196 144120 -147234 13328 141768 38645 -191948
7694 107013 191054 75517 32050 197966 125393 -182640 97114 -185334 95581 55688 77233
7683 77233 134650 220156 176681 330224 68242 47518 -4729 -621 422715 122272 180346 26575
7670 130389 40663 96705 46387 -393 -30097 107144 253930 -62463 -135096 -24374 169085
7658 265794 139399 124620 -121891 87208 19816 210873 202061 56238 53626 -29635 -85157
7647 -85157 129792 36975 -125316 184872 36137 130594 90613 57675 152489 -25287 -152197
7636 -152197 -48004 111374 10413 13950 47294 132145 154001 -14352 91399 -59339 240852
7624 150083 -34579 -65982 3427 170167 -26721 -55904 133944 73711 -2410 167478 75719
7612 218002 43092 52044 17646 9732 -19923 -62981 -56258 757 124817 -76205 170393 368213
7600 368213 248465 147186 -90771 112972 -64018 153563 55794 138795 -52989 164574 -143344
7588 272522 68269 77407 59181 67231 134169 121146 29708 31303 -224859 158486 71932 90721
7576 90721 210514 18016 143998 112902 328803 163618 47490 132297 -166053 15928 26974
7565 26974 99438 -60897 18127 54401 216227 36153 62124 78383 40287 87452 236110
7554 236110 117125 120540 165416 30824 143102 153171 60240 -42882 12882 258853 102976
7542 35159 71163 -17829 11926 74235 194473 -18768 103033 199492 -5972 -107622 65794
7530 233455 -64090 77229 168644 73470 160244 229914 35579 74957 110684 87891 160086 -57743
7517 91816 17819 47464 -196588 -168841 25676 264665 226006 -69178 146883 114731 251505
7506 251505 -29726 47399 131406 180312 -122619 4791 86740 24179 -63097 70545 404244
7495 404244 169372 -115340 -77671 177282 12727 52692 55534 288244 -117272 -100100 28267
7483 -100904 210814 -21538 151835 99974 32052 1231 111944 239400 220288 121817 109221
7472 109221 27573 76149 -1126 210943 -199136 267522 126135 239170 429877 132857
7461 -104587 -7805 -31465 214647 -172255 104126 29343 133191 -118394 15802 69756 -10922
7449 105743 90420 246459 -81153 229913 186566 146917 -26 183214 -373672 8608 160454
7438 160454 -8930 -63109 112267 -169816 248124 321358 -39866 77667 157080 -83608 -155442
7427 -155442 79232 -25743 37232 215303 137513 84776 -17784 42755 180462 87368 24499
7415 -161531 -31907 110081 21662 83252 7631 34338 49180 71143 44593 61817 144601 -63692
7402 128818 -141665 -132503 228917 355586 205151 -4784 61373 -29621 -124862 -42365 151245
7390 -17460 -160021 267409 12447 124387 -72409 169571 -83240 253437 -92495 132514 103886
7379 103886 85774 129186 146865 250185 -51376 75696 137400 -56333 99900 97283 115272 -65066
7366 244704 -2967 -57988 134048 129411 69507 -11833 -87627 60151 142240 156893 205102 96540
7353 73650 166579 87120 -250294 127771 225997 123084 -272728 128666 68950 -32213 13478
7341 156868 111715 48300 71386 37983 42539 26234 210643 176648 -110161 28720 -53739
7329 155400 256318 -161957 -5946 -231377 -49292 -30090 -120473 -22154 15737 -14661 197891
7317 171592 111511 424182 -6903 279889 14501 224496 141232 79957 142104 173708 268672
7306 268672 -22763 -130022 237483 118017 -104421 102308 155809 68723 22249 85504 25060
7294 323188 278333 156474 153134 64194 118081 -27116 -99233 51250 173405 12398 105405
7283 105405 -50875 -55907 267289 140254 182599 33267 110735 143975 175024 220749 -86660
7271 127307 132619 26761 140604 125722 64598 -238712 -125240 392664 -12777 210304 319542
7260 319542 11948 183908 -153307 44286 -76919 -168116 -48931 131177 136417 -29365 69864
7248 -22468 -185818 120490 110260 11612 209438 224431 68750 -211451 233202 -23694 117221
7236 -98206 -62413 -76372 146241 86091 -152388 -156153 106596 -21282 204636 49512 226648
7225 226648 116397 123807 -41641 -21030 161063 31218 -23406 207081 260550 -172898 224896
7213 119210 183575 -34835 74705 77022 240678 196856 117134 -68354 -112835 -92918 -111014 133252
7200 205867 225759 105581 271864 188946 -87607 -9861 231151 177413 51095 190003 -49857
7188 257181 217902 148858 -54165 146358 -100330 -199770 182925 -93568 -131020 72724 -68739
7176 278874 -107309 12456 125101 -259723 -12802 47608 -11614 93291 -102190 266076 127893
7164 75323 -289969 -41598 -11238 -217132 -39216 116570 32466 140170 -160593 160628 12967
7152 95134 66154 218218 102325 70565 60911 44247 15941 25738 -68329 242130 194269 -18666
7139 -56790 108872 97723 -26586 176021 3242 56073 -123557 153761 122863 48725 -138156
7127 183466 74285 -237321 -9381 -49452 100681 204262 134741 172104 -30658 244639 147886
7116 147886 164845 174329 19490 139630 -134870 49035 248002 -68176 182457 39638 -164218
7104 7987 167066 -5841 133730 102642 -57338 205115 -1162 4274 -1185 -256726 -3855 62335
7091 31289 3768 43015 124368 -41096 -137344 190674 188263 -82928 69153 -119723 -207633 25466
7078 23614 -3771 91100 127628 -193976 1748 34997 -74835 44216 56095 168625 124565 291644
7066 291644 -116123 129482 1144 -4463 53869 -24471 -40815 10525 43528 119518 -50783 28808
7053 227559 333882 153672 206846 -76849 48960 71133 -71043 -80394 -16348 -59826 39780
7041 214325 -60174 5800 118151 109109 106312 49763 -84734 114019 82304 152933 -8350 -188568
7029 -188568 69037 23322 187216 268785 254354 74456 289902 240893 67621 12467 228909
7018 228909 266920 -34968 142758 -207392 129852 205114 227435 156008 8113 -143538 2533
7006 -145482 179700 107611 17758 -11044 19136 183701 92780 152598 -43976 -61477 -38798
6995 -38798 -104081 -81661 78249 78560 26823 247315 -76929 57559 -27993 35143 189723 272402
6983 272402 -31776 31594 232006 240600 127452 45107 121213 -119513 166986 107494 85633
6972 85633 130386 32932 47815 62301 -32150 -50271 48774 1289 -37199 55800 91905 168652
6960 168652 117317 -61028 -89752 52028 -41794 88820 55318 4194 69015 38674 85692 56991
6948 56991 4026 93921 289171 93544 8884 270476 -10803 60303 194788 -16129 21873 201615
6936 201615 59858 182011 242049 -277588 -3353 148170 -30128 -240318 148687 -51211 240869
6924 -73277 16917 108649 -59 211157 -68643 101684 44398 140390 339191 69086 252915 -15245
6911 91732 -13347 86256 -118896 170254 -10062 -24766 94183 -165320 237628 68095 -20955
6899 330986 137009 81831 -6997 203861 -11569 51891 38795 257085 149199 9929 -3197
6887 -17623 152501 -176777 239330 78638 194187 25452 -22739 212737 171115 -53955 95545
6875 33597 -234109 123802 38454 39414 77982 194615 -611 51393 260586 -83261 90621 107433
6863 107433 80931 -149100 315329 9485 47751 47046 75622 -247978 30238 -15980 355178
6851 49124 71164 107213 54074 128624 68677 -41570 167581 123001 -30288 115357 -13271
6839 98778 139754 -42152 -48260 36655 56372 -52886 61632 -10633 25164 46696 119277 90831
6827 90831 -87404 33506 108731 -162015 348034 6993 306 99979 -121108 47679 167097 -120843
6814 -94348 -125113 51752 42745 158561 49364 -109541 -52821 12437 -56903 174010 22168
6802 -144960 -112243 25431 196821 155705 -15164 112674 79121 112068 -46083 234220 8697
6790 162906 51997 167689 41009 -103296 44918 115162 209015 35901 -84302 -81537 -142410
6779 -142410 69930 152727 -154059 42514 -56951 1470 67524 -4615 -175217 150971 116504
6768 116504 114759 113233 175329 52583 -8070 114334 167871 26870 93594 53513 -14555 -112093
6756 -112093 -73114 177145 137473 -40331 -93206 -101715 -27716 -171345 26737 180844 218610
6745 218610 183044 66357 55489 -189725 85791 -126202 28938 -129489 263600 218842 -27602
6733 -74349 -53276 -21496 194599 183465 -49994 -260572 208603 -201458 116449 95746 -2267
6721 219414 10249 92293 -77076 -9382 -79600 -47563 69173 37106 79951 13862 -68655 26730
6708 240999 6784 -4715 5817 149957 234117 47520 188934 -39746 216200 32661 270973
6697 270973 88419 -18374 135100 30683 124945 -75729 24657 -123437 186497 29508 216963
6686 216963 84271 46330 -262934 10601 28309 -61087 -245746 -27040 -113335 -137425 144231
6674 120237 192630 106205 31543 -74862 161599 -13332 12526 105966 -44556 -83283 54561
6662 28995 45839 -80534 -156311 126372 65419 -60968 -34597 13823 -141681 101788 152486
6651 152486 -226838 274740 100005 62740 -61037 63611 -101962 25010 141129 144383 -40472
6639 -3137 209098 -40974 71534 57072 -38509 53172 -76741 -88742 103179 106256 -48672 167303
6626 313541 16212 -131711 -149010 -14720 188954 116880 192227 201016 211123 127188 81222
6615 81222 108685 54417 -93145 -201263 156065 152496 391854 156324 69852 89419 79118
6604 79118 -48399 237683 -48888 85039 134242 167373 -42969 114389 -143505 95179 48379
6593 48379 160422 -15287 176497 220165 180030 63106 190934 7478 -49344 -154342 -120089
6582 -120089 -22148 -72647 128730 -143146 -96074 125893 -79481 -48830 -183795 158849 -91315
6570 -304852 109643 66248 100515 -141977 144450 -118082 117789 -43568 -181599 186714
6559 68258 -24420 205165 -110997 388951 5770 163221 -72482 -261277 81300 10711 -718
6547 73158 150972 -20364 22107 120146 78823 159061 -152466 73127 -165820 7548 -10004 121179
6534 54842 -35976 -76945 26436 -116550 145666 -96042 -84916 -236718 -66809 -12987 292026
6522 -114927 -126582 29300 -132576 -204414 293923 108750 55542 222963 -151353 102955
6511 -61975 104718 44254 257970 7633 97510 -57257 200631 -195295 169888 -69017 -20280
6499 -25459 110729 16587 2498 -6474 54539 -82029 5564 24242 164645 -50261 17257 -102651
6486 -5104 -138708 -9581 181143 100978 110869 -61923 138962 211363 -56798 73985 54496 97360
6474 97360 93720 245192 163329 874 237499 65345 -8056 50754 -128565 48155 6684 88172
6462 88172 -272088 150091 1046 22593 56133 273250 127974 -12764 -42773 -131866 -152036
6451 -152036 -158312 -163423 116379 17056 208715 -11210 32177 150439 -64675 -10324 276280
6439 123159 71513 116479 -100530 191291 47517 84094 -37401 143351 84313 229660 42131
6427 331872 101873 60778 187210 -25243 141743 180920 -251957 38110 193823 180298 -31952
6415 108702 -141823 197436 45453 75500 40225 -28416 150601 -98121 -11243 120787 83031
6404 83031 146731 106447 -112671 35573 31249 -61498 308600 241417 117214 154194 35438
6392 -115277 155821 130000 -39944 -175508 -199531 -28743 -62317 -165091 107660 119777 166486
6381 166486 -14747 82870 -46844 119332 78480 69531 -50433 -4968 -18928 12065 163280 -9779
6368 118963 62491 -136403 200235 47548 23365 -1854 -35733 142288 9087 24660 -12312
6356 -134204 -262213 45499 -35064 -157148 -4001 -70293 -12697 -53651 222751 -114048 53382
6344 116207 170387 -126188 -6635 -129571 119799 48062 4650 41547 -39056 57836 75943
6333 75943 -4573 -231442 52100 -66686 24486 168141 40205 5472 2896 3622 -19701 133482
6320 57821 153944 1968 226991 267274 3431 -194718 4666 184646 45030 -48456 -1353 -42195
6308 -42195 52846 28910 93773 76457 122156 48064 -3068 80340 -65349 -112507 -95117 214257
6295 181072 -78820 187892 -99206 -55473 82227 -11721 68905 -104709 105543 61971 -65700
6283 18416 115044 164597 -153674 51076 46875 307021 145897 58246 -279528 378302 34699
6271 15109 -157554 243347 320324 26070 8266 -201785 202098 -6333 49005 -103441 56882
6259 88133 167139 106140 40854 -13465 101853 192921 239267 175814 113471 146742 104781 121834
6247 121834 122705 135775 4321 -61148 117526 195452 105242 -112007 162903 -30145 -20229 -148875
6235 -148875 154707 92216 72014 31360 -35645 197132 -50531 69243 267927 178209 209022
6224 209022 124171 181660 -73494 -409295 122657 -130745 101908 161782 26357 -117139 -59638
6213 -59638 15584 181531 204401 131868 70352 124773 290242 27944 -47655 143774 -26275
6201 44853 16901 52937 36741 -19940 138449 -176432 7058 147358 147507 -14465 81739 76777
6189 76777 -177403 -115341 42988 267041 -176754 90471 277343 -121622 43047 -47356 -1293
6177 99776 227780 94624 48293 -97619 20747 266669 63406 -236137 229402 163213 -30963
6165 101334 -25461 -59975 7215 12937 -40202 -46283 270631 179789 94790 298568 -89774 249790
6152 37351 -5288 -40006 -112349 -148630 333911 -25949 142441 184385 65902 47623 37731 9252
6139 53527 146673 -9552 -223504 67275 50032 -316941 69015 -31064 209895 91361 227881
6128 227881 8475 -39325 -114336 -169326 -13546 143866 -7152 -227282 55518 195703 -208556
6116 89739 -101619 -79132 17156 204557 143342 162694 -66832 -102517 -94008 -84693 -155864 -41062
6103 72639 -88833 -104029 47386 -15994 113720 18239 8360 183679 -40454 3575 169190 -8256
6090 -143264 -18263 26443 5546 -138 176333 127479 -130670 -52486 -75603 280424 -107114
$$ [...]
##END NTUPLES=NMR SPECTRUM
##END=
