##TITLE=Coffee green (M4-ROVE60 + 1.5mL buffer 50/50,  450uL extracto + 50uL (D2O+TMS))
without heating, vortex and centrifuged, temperature 0oC.
##JCAMPDX= 6.0         $$ Bruker NMR JCAMP-DX V2.0
##DATA TYPE= NMR SPECTRUM
##DATA CLASS= NTUPLES
##ORIGIN= Bruker BioSpin GmbH
##OWNER= Administrator
$$ 1.72 TOPSPIN		Version 2.1
$$ 2012-05-22 16:14:42.997 -0700  Administrator@X
$$ Compression mode = diff/dup
##.OBSERVE FREQUENCY= 400.13188198
##.OBSERVE NUCLEUS= ^1H
##.ACQUISITION MODE= SIMULTANEOUS (DQD)
##.ACQUISITION SCHEME= undefined
##.AVERAGES= 64
##.DIGITISER RES= 22
##SPECTROMETER/DATA SYSTEM= spect
##.PULSE SEQUENCE= noesygppr1d
##.SOLVENT NAME= H2O+D2O
##.SHIFT REFERENCE= INTERNAL, H2O+D2O, 1, 14.97969
##AUDIT TRAIL= $$ (NUMBER, WHEN, WHO, WHERE, PROCESS, VERSION, WHAT)
$$ ##TITLE= Audit trail, TOPSPIN		Version 2.1
$$ ##JCAMPDX= 5.01
$$ ##ORIGIN= Bruker BioSpin GmbH
$$ ##OWNER= Administrator
$$ $$ C:\Bruker\TOPSPIN/data/jwist/nmr/11-coffee-green-quantification-2/241/pdata/1/auditp.txt
$$ ##AUDIT TRAIL=  $$ (NUMBER, WHEN, WHO, WHERE, PROCESS, VERSION, WHAT)
(   1,<2011-11-18 13:43:33.966 -0500>,<Administrator>,<TOPSPIN>,<go>,<TOPSPIN 2.1>,
      <created by zg
	started at 2011-11-18 13:34:39.263 -0500,
	POWCHK enabled, PULCHK disabled,
       configuration hash MD5:
       DA 63 81 1B EF 4C B5 72 B4 DF EA D9 B4 DB 4C 08
       data hash MD5: 64K
       B9 A7 E2 44 B2 73 C3 CF 69 EB 3A 0C 8C A5 83 3D>)
(   2,<2011-11-18 15:25:03.982 -0500>,<Administrator>,<TOPSPIN>,<proc1d>,<TOPSPIN 2.1>,
      <Start of raw data processing
       efp LB = 0 FT_mod = 6 PKNL = 1 PHC0 = 0 PHC1 = 0 SI = 32K 
       data hash MD5: 32K
       C9 9A 6E 90 68 F8 2B 5C D7 CE CD E5 6A D8 08 9E>)
(   3,<2011-11-18 15:25:04.341 -0500>,<Administrator>,<TOPSPIN>,<proc1d>,<TOPSPIN 2.1>,
      <pk PHC0 = 22.71423 PHC1 = 0 
       data hash MD5: 32K
       B6 D2 85 34 11 60 A0 20 5E 63 44 A6 C7 33 94 73>)
$$ ##END=
$$ 
$$ $$ hash MD5
$$ $$ 3E 01 19 32 E7 B6 A5 F7 02 8B 7E 7D 9A 7A C3 6A
##$RELAX= 
##$RELAX= 
##$RELAX= 
##$RELAX= 
##$RELAX= 
$$ Bruker specific parameters
$$ --------------------------
##$DU= <Z:>
##$EXPNO= 241
##$NAME= <11-coffee-green-quantification-2>
##$PROCNO= 1
##$TYPE= <nmr>
##$USER= <jwist>
##$ACQT0= -8.18176733375901
##$AMP= (0..31)
100 100 100 100 100 100 100 100 100 100 100 100 100 100 100 100 100 100
100 100 100 100 100 100 100 100 100 100 100 100 100 100
##$ANAVPT= -1
##$AQSEQ= 0
##$AQ_mod= 3
##$AUNM= <au_prof>
##$AUTOPOS= <>
##$BF1= 400.13
##$BF2= 400.13
##$BF3= 400.13
##$BF4= 400.13
##$BF5= 400.13
##$BF6= 400.13
##$BF7= 400.13
##$BF8= 400.13
##$BYTORDA= 0
##$CFDGTYP= 0
##$CFRGTYP= 9
##$CHEMSTR= <none>
##$CNST= (0..63)
1 1 145 1 1 1 1 1 1 1 1 1 1 1 1 1 1 1 1 1 1 1 1 1 1 1 1 1 1 1 1 1 1 1 1
1 1 1 1 1 1 1 1 1 1 1 1 1 1 1 1 1 1 1 1 1 1 1 1 1 1 1 1 1
##$CPDPRG= <>
##$CPDPRG1= <>
##$CPDPRG2= <>
##$CPDPRG3= <>
##$CPDPRG4= <mlev>
##$CPDPRG5= <mlev>
##$CPDPRG6= <mlev>
##$CPDPRG7= <mlev>
##$CPDPRG8= <mlev>
##$CPDPRGB= <>
##$CPDPRGT= <>
##$D= (0..63)
$$ [...]
##$TP= (0..7)
150 150 150 150 150 150 150 150
##$TP07= 0
##$TPNAME0= <>
##$TPNAME1= <>
##$TPNAME2= <>
##$TPNAME3= <>
##$TPNAME4= <>
##$TPNAME5= <>
##$TPNAME6= <>
##$TPNAME7= <>
##$TPOAL= (0..7)
0.5 0.5 0.5 0.5 0.5 0.5 0.5 0.5
##$TPOFFS= (0..7)
0 0 0 0 0 0 0 0
##$TUNHIN= 0
##$TUNHOUT= 0
##$TUNXOUT= 0
##$USERA1= <user>
##$USERA2= <user>
##$USERA3= <user>
##$USERA4= <user>
##$USERA5= <user>
##$V9= 5
##$VALIST= <valist>
##$VCLIST= <CCCCCCCCCCCCCCC>
##$VD= 0
##$VDLIST= <DDDDDDDDDDDDDDD>
##$VPLIST= <PPPPPPPPPPPPPPP>
##$VTLIST= <TTTTTTTTTTTTTTT>
##$WBST= 2048
##$WBSW= 25
##$XGAIN= (0..3)
0 0 0 0
##$XL= 0
##$YL= 0
##$YMAX_a= 5868759
##$YMIN_a= -1929642
##$ZGOPTNS= <>
##$ZL1= 120
##$ZL2= 120
##$ZL3= 120
##$ZL4= 120
##$ABSF1= 0
##$ABSF2= 0
##$ABSG= 0
##$ABSL= 0
##$ALPHA= 0
##$AQORDER= 0
##$ASSFAC= 0
##$ASSFACI= 0
##$ASSFACX= 0
##$ASSWID= 0
##$AUNMP= <proc_prof1d>
##$AXLEFT= 0
##$AXNAME= <>
##$AXNUC= <1H>
##$AXRIGHT= 0
##$AXTYPE= 0
##$AXUNIT= <>
##$AZFE= 0.1
##$AZFW= 0.1
##$BCFW= 0
##$BC_mod= 0
##$BYTORDP= 0
##$COROFFS= 0
##$CY= 15
##$DATMOD= 1
##$DC= 0
##$DFILT= <>
##$DTYPP= 0
##$F1P= 0
##$F2P= 0
##$FCOR= 0.5
##$FTSIZE= 32768
##$FT_mod= 6
##$GAMMA= 0
##$GB= 0
##$INTBC= 1
##$INTSCL= 1
##$ISEN= 128
##$LB= 0
##$LEV0= 0
##$LPBIN= 0
##$MAXI= 10000
##$MC2= 0
##$MEAN= 0
##$ME_mod= 0
##$MI= 0
##$NCOEF= 0
##$NC_proc= -6
##$NLEV= 6
##$NOISF1= 0
##$NOISF2= 0
##$NSP= 0
##$NTH_PI= 0
##$NZP= 0
##$OFFSET= 14.97969
##$PC= 1
##$PHC0= 22.71423
##$PHC1= 0
##$PH_mod= 1
##$PKNL= yes
##$PPARMOD= 0
##$PPDIAG= 0
##$PPIPTYP= 0
##$PPMPNUM= 2147483647
##$PPRESOL= 1
##$PSCAL= 4
##$PSIGN= 0
##$PYNMP= <proc.py>
##$REVERSE= no
##$SF= 400.13
##$SI= 32768
##$SIGF1= 0
##$SIGF2= 0
##$SINO= 400
##$SIOLD= 32768
##$SPECTYP= <>
##$SREGLST= <1H.CDCl3>
##$SSB= 0
##$STSI= 32768
##$STSR= 0
##$SW_p= 8223.68421052631
##$SYMM= 0
##$S_DEV= 0
##$TDeff= 65536
##$TDoff= 0
##$TI= <>
##$TILT= no
##$TM1= 0
##$TM2= 0
##$TOPLEV= 0
##$USERP1= <user>
##$USERP2= <user>
##$USERP3= <user>
##$USERP4= <user>
##$USERP5= <user>
##$WDW= 1
##$XDIM= 32768
##$YMAX_p= 291740660
##$YMIN_p= -6413731
##$CURPLOT= <Network HP LaserJet P1505>
##$CURPRIN= <$Network HP LaserJet P1505>
##$DFORMAT= <normdp>
##$LAYOUT= <+/1D_H.xwp>
##$LFORMAT= <normlp>
##$PFORMAT= <normpl>
##$SURQMSG= 1
$$ End of Bruker specific parameters
$$ ---------------------------------
##NTUPLES= NMR SPECTRUM
##VAR_NAME=  FREQUENCY,     SPECTRUM/REAL,   SPECTRUM/IMAG
##SYMBOL=    X,             R,               I
##VAR_TYPE=  INDEPENDENT,   DEPENDENT,       DEPENDENT
##VAR_FORM=  AFFN,          ASDF,            ASDF
##VAR_DIM=   32768,         32768,           32768
##UNITS=     HZ,            ARBITRARY UNITS, ARBITRARY UNITS
##FACTOR=    0.250966925370066, 1,           1
##FIRST=     8223.43324360094, -174561,      -166780
##LAST=      0,             -71670,          -172039
##MIN=       0,             -6413731,        0
##MAX=       8223.43324360094, 291740660,    0
$$ Real data points
##PAGE= N=1
##DATA TABLE= (X++(R..R)), XYDATA
$$ [...]
23364 6786283 8195604 10125126 12006086 13944604 15895472 17780468 19836085 21333971
23356 21333971 22582807 23277009 23620984 23770537 23321205 22473217 20942236 19308652 17616673
23347 17616673 15435712 13409335 11175718 9559572 7567624 6206676 4635467 3616548
23339 3616548 2659149 2121338 1583157 1263963 1136050 676201 482234 609523 615948 438223
23329 438223 225764 508563 552032 447664 404950 449561 243782 354459 174496 167485
23319 167485 286035 302086 307126 365454 95602 122835 98980 144691 195875 290122 269119
23308 269119 100977 140799 71888 4152 472605 216067 146010 311373 230254 369235 469529
23297 469529 177610 365533 471457 272038 123619 306565 238559 344309 371355 157861
23286 265073 491485 262975 489830 89763 402631 430968 302016 233317 320644 292717
23276 292717 327555 409649 212015 391264 409778 366186 80517 354969 98223 297987 133505
23264 455367 266500 223409 355977 435848 171828 314453 200701 203938 443472 361108
23254 361108 365662 230424 400459 280040 221555 404662 239078 382299 259712 332194
23244 332194 298489 447230 471201 357111 301775 348792 -27928 326706 276198 97266 147646
23233 147646 211526 131214 221610 322308 100098 108530 248915 200606 187317 50263 165891
23222 165891 431845 106030 84527 386313 260651 306370 -108170 327640 34234 398463
23212 398463 58145 173938 350761 703416 256216 386123 -48850 337458 306765 250876
23202 250876 57207 323690 238809 206047 249665 271571 126958 139578 30038 213430 295646
23191 295646 200339 157515 327806 188712 207624 190140 183787 214781 243884 301964 81908
23179 296039 259312 78017 240940 118881 402472 286584 169160 366101 -27270 371869
23168 310076 340679 360649 236353 217040 265406 144810 302084 303652 235974 310930 84486
23156 179559 183338 472780 95454 197212 47934 170337 243086 368940 211544 162331 179045
23145 179045 493957 396566 213081 368211 500424 111755 79762 298563 116949 165673
23135 165673 187687 393645 152144 167825 192820 390296 179821 256309 216028 167502 179029
23124 179029 201363 330805 263857 124270 317715 352641 133967 431866 279974 -87104
23113 240080 502443 251155 418412 136480 279612 222347 307633 128604 225442 282729
23103 282729 426241 162146 136496 337441 316376 192439 267715 117256 486306 340670
23093 340670 367102 337296 427587 338744 306129 502238 145105 366863 120251 449862
23083 449862 404153 436726 278536 397834 182347 487799 263615 174914 405387 214605
23073 214605 339236 305628 254045 322708 334376 137707 423763 260177 213900 299259 295453
23062 295453 255272 530735 167723 445408 160685 460997 254652 175874 230248 199068
23052 199068 480310 325569 84020 168922 228471 187102 326923 384222 145974 310773
23042 310773 345153 248154 273293 409757 447898 382022 307386 308728 383630 327837 764476
23031 764476 386308 451878 312711 251841 40360 177124 207710 399129 192310 530124
23021 530124 321314 310270 363447 238131 418395 425976 395633 525897 524507 421450 275692
23010 275692 253609 392594 175697 375416 328731 416481 167517 109450 472070 554930
23000 554930 57792 336651 472433 367191 509710 114714 398073 404295 477139 402362
22990 402362 386379 551414 363943 384642 225695 105779 362264 304466 376601 524441
22980 524441 506632 577513 379917 419116 602850 633708 759337 695939 537665 572690 606195
22969 606195 519759 635661 564494 678953 702910 432094 399651 645662 594859 682436 663615
22958 663615 657990 666019 777955 837210 802087 977864 886433 1017723 1035338 1093445 1533627
22947 1533627 2104010 2509214 3046073 3584841 4616127 5441020 6682118 7796672 9059416
22938 9059416 10090847 11283905 11819990 12347497 12882853 12971652 12787866 12377401 11903523
22929 11903523 10836471 9591870 8703544 7470895 6437578 5741023 4474173 4075344
22921 4075344 3390891 3068539 2460480 2585868 2999988 3136881 3457539 4200509 4961109
22912 4961109 5964240 7371209 8417877 10043184 12112246 13791786 15597487 17457185
22904 17457185 18834058 19837932 21082805 21727491 22029956 22034979 21422991 20692451 19304988
22895 19304988 17835967 16213645 15038170 13227994 11615448 10389606 9012483 8041896
22887 8041896 7172101 6828727 6974980 6731437 6669028 6950782 7406106 7867841 8398521 9017604
22877 9017604 9557351 9594399 10215476 10198057 10238789 10163562 9817967 9131406 8611975 8081749
22867 8081749 7325472 6764218 5662159 5124675 4456191 3842089 3262895 2750373 2460692
22858 2460692 2255844 2063739 1661060 1408628 1372785 1174072 923456 884687 905068 610523
22848 610523 989919 674000 722332 618988 807216 706270 618350 332106 698237 657382
22838 657382 649350 560733 585828 574758 474055 496804 301540 347557 554731 348951 503601
22827 503601 806878 602210 210765 246472 391136 327503 342873 449253 412979 290168
22817 290168 333727 296273 296307 407496 450588 459914 531435 362240 371991 424698 660505 414599
22805 414599 478814 327153 298315 442903 568858 469304 335106 290532 510700 501791 561686
22794 561686 651719 399242 443346 332389 586154 286208 445284 199250 347773 386824
22784 386824 314195 463275 421863 319909 466196 264771 469501 448495 279246 97655
22773 162679 547217 590520 472999 453322 418548 195929 430888 300802 280259 363099
22763 363099 449619 403563 359745 305688 486213 448222 603298 286896 387099 303653 298577
22752 298577 408115 427874 508449 246996 375623 355504 394888 299161 317780 311971 316578
22741 316578 38613 104509 406779 529573 187740 458767 225854 188316 465236 230712
22730 94249 323317 408541 201878 328575 373035 71924 303577 328903 286076 232001 324721
22719 324721 375945 262204 416850 203417 206723 203312 264316 440255 455854 436617 445920
22708 445920 324480 436759 283008 452497 181231 371502 246645 253420 472459 324310
22698 324310 359959 253383 244550 437041 442845 491970 334490 342488 211870 385272 301312
22687 301312 392506 594609 288326 201931 366698 302101 415208 454618 521745 139629
22676 614493 411515 453217 312380 373887 43870 342043 434557 340442 366834 114375 444400
22665 444400 212539 467461 273995 354875 370905 224086 338056 280195 102729 235856
22655 235856 235248 545221 319662 351372 203028 450427 181725 453856 456483 386663 312568
22644 312568 542356 443875 395398 224883 283310 239907 404273 282559 295093 347152 469650
22633 469650 371982 381286 446109 184162 363253 416817 387692 274756 153328 593567 369550
22622 369550 366017 533785 401503 215479 561274 469741 415941 334404 638643 357814
22612 357814 567146 329368 448430 461670 419770 405785 400913 453375 447030 505992 524270
22601 524270 523795 478225 550337 311329 564298 372458 355282 276293 678140 571424 344375
22590 344375 527235 560622 593638 391027 512873 397340 415315 465052 446969 361773 508372
22579 508372 495871 769789 646376 650582 544837 514174 405480 405597 586388 340737 544307
22568 544307 446554 461748 506555 382104 620109 698303 763764 348203 408256 424700 240082
22557 240082 439069 557618 591060 588311 625486 411823 622009 370402 467549 392676 299825
22546 299825 406716 523374 621198 387311 472604 563733 325556 445190 303004 243780
22536 243780 297639 395669 409973 580619 399131 394779 470829 384477 260386 373207 594857
22525 594857 488034 521236 337442 326489 519333 466183 400849 509892 446541 350491 369971
22514 369971 466534 559309 408671 585345 294183 414291 676917 477389 482558 647918
22504 647918 541449 455955 719788 482532 625577 623348 466239 559581 610485 353392
22494 353392 338119 566942 716533 588322 514342 752876 658889 687520 402456 591943
22484 591943 630424 589860 530289 517249 561617 490669 561243 594826 400955 477501 639237
22473 639237 747019 553809 584272 498020 502049 551812 615690 319744 297807 503374 365963
22462 365963 522798 489107 597135 406454 280911 389082 637377 474098 123573 507941
22452 507941 487656 417223 517512 337956 364315 426606 569565 557492 434104 439655 444310
22441 444310 478895 528943 357275 530227 536092 402406 617692 395242 533727 575153
22431 575153 495795 746904 652984 477853 349490 361731 633315 567353 486751 577309 552991
22420 552991 542826 377124 674572 630399 326237 440872 512118 247962 443970 515998
22410 515998 719579 499165 472119 351997 346521 337864 154652 738227 479508 542337 523130
22399 523130 540438 551715 449881 679914 609044 495591 500809 411684 607888 354556 388195
22388 388195 475081 323179 397460 426046 698819 515187 459193 533298 502527 353711 693693
22377 693693 557813 477068 407191 557376 601292 433183 505815 609847 684183 376543
22367 376543 403002 634511 611662 648979 317782 508253 513875 635383 592730 520074 319102
22356 319102 488040 511415 454717 504271 523918 653162 413310 558153 509286 408855
22346 408855 488211 525587 456013 598453 372220 516135 546287 707482 530751 658734
22336 658734 435398 642888 852947 784528 732725 1016367 1183931 869157 1333428 1303142
22326 1303142 1341258 1380766 1169540 1250136 1227380 1230940 1135676 997992 594254 585228 640028
22315 640028 490752 243853 646586 479352 689550 496595 819042 759012 560480 617775
22305 617775 714808 856079 520685 837461 690617 608996 621716 806115 694047 747713
22295 747713 781704 435344 816093 612764 668901 757656 730971 653805 636949 632621 946412
22284 946412 592179 790073 715350 595947 839112 853418 696535 604165 540747 624062
22274 624062 702907 733309 948007 823775 782813 879865 938346 740721 397241 851733
22264 851733 764821 1006983 815683 768647 511515 851038 628360 752511 809939 841683
22254 841683 893386 671153 1000825 954132 600354 663117 1000122 680559 613313 938268
22244 938268 873766 836225 803458 926491 856424 1005295 734173 728618 771242 609612 857669
22233 857669 762435 615907 744408 659306 794733 846065 488829 893523 694093 604380
22223 604380 583508 842550 857916 925140 653009 721771 819133 750742 727869 705032 628398
22212 628398 616534 662713 667113 753112 731412 622413 786067 778952 818318 1012300 817321
22201 817321 727017 908771 599792 790979 750097 860798 527257 862363 666216 716739
22191 716739 851492 935015 593906 733008 683652 598894 852291 1066183 788383 650516
22181 650516 764606 925158 708497 642956 519925 863409 618283 637631 725941 828775
22171 828775 690495 702488 978141 552539 805876 697978 834329 772032 661261 552762
22161 552762 854071 896166 514923 525171 581428 568826 755302 765656 476996 453106 702435
22150 702435 799799 672448 644418 716777 596171 840761 654700 709304 693925 989388
22140 989388 922549 747989 629240 862652 735403 656821 609908 671228 541248 596804
22130 596804 815930 995208 1016186 701665 810504 955027 796955 789864 693270 550462
22120 550462 686639 547813 820186 585414 940810 623073 706987 510293 667862 731627
22110 731627 580703 681725 541605 539294 592991 709935 660830 602705 780873 658077
22100 658077 708724 922369 473002 805460 869660 594293 804172 745563 840250 783640
22090 783640 489349 778409 616262 701555 726996 608905 781454 807088 674625 880540
22080 880540 617936 762485 632400 744137 858481 705777 856331 729556 667340 816314
22070 816314 614657 511572 759386 824017 602174 827267 721525 750360 806570 780287
22060 780287 721357 992563 611192 698070 842763 779663 837802 967132 742291 833936
22050 833936 829094 884767 814923 690894 832837 755143 761123 876253 832346 668014 800288
22039 800288 842000 899608 843946 815671 1048116 874356 711377 950907 820050 764542
22029 764542 1006672 879946 701430 720481 678627 812428 895787 727677 1057229 888965
22019 888965 973270 743324 831116 916552 653418 1023026 831091 973085 714410 990746
22009 990746 764627 982224 1010351 888026 822353 833742 867425 837152 803465 1002771 685897
21998 685897 672496 829319 921839 909021 886749 935245 788367 602600 977698 785247
21988 785247 868637 1076499 894292 830799 962515 880973 861403 778317 725651 756911 1043459
21977 1043459 698204 799811 770327 798861 709841 947327 705612 863181 830641 974788
21967 974788 807236 860669 776232 895982 970053 741590 1040712 997097 1060470 799294
21957 799294 780499 992519 887740 1071162 1034854 908956 862285 811939 768406 849877 862161
21946 862161 904025 733441 888117 778875 1006328 848305 664756 1013444 873996 896972
21936 896972 894360 985672 1089377 823561 1038355 846595 869552 743575 820250 815521 731696
21925 731696 900269 704202 741641 1300368 998091 815446 1001842 863943 940082 1237083
21915 1237083 984291 807439 948216 1122891 825166 831505 603188 921151 851995 1091657
21905 1091657 1104979 817943 721005 1046826 817978 879609 872777 806579 984840 850015
21895 850015 874951 751238 923435 934223 997711 694616 817555 924105 888520 980851
21885 980851 1105039 850578 828600 974213 997249 870278 1014064 859533 940999 1086926
21875 1086926 899941 774293 945268 1076731 861261 1106223 930652 940139 1015857 746493
21865 746493 1033839 821832 856296 851948 920487 820538 909490 831480 1113087 775092 752535
21854 752535 911375 1026168 705801 675831 576871 1034142 1058395 814290 1001115 939704
21844 939704 684565 629670 924136 697200 758485 729712 955492 921055 616057 889677
21834 889677 812131 842508 1035472 770478 749882 1013225 661903 902718 691502 811511
21824 811511 955094 1035071 798013 868710 771577 817405 758720 963346 919182 949463 824260
21813 824260 1032524 992093 1022734 709160 876392 810398 874581 797345 671419 653008 868565
21802 868565 882868 871031 755699 983348 773884 845289 661684 811065 763131 853971
21792 853971 624225 895685 622134 1023448 698627 789484 781382 855712 761540 1013134
21782 1013134 854853 1019193 768570 615289 633425 571892 958351 765989 830242 799734
21772 799734 969292 678008 1011255 867592 1079446 720485 862684 1191831 1067267 1129700
21762 1129700 930807 878303 1014359 991308 892373 1047261 1157936 996467 1109598 1096123
21752 1096123 1305898 1224478 1259788 1558864 1765188 1843498 1760401 2029614 2343577 2418606
21742 2418606 2939920 3078783 3466163 3853586 4504699 5017891 5445140 6009132 6443946
21733 6443946 6694216 6766606 6782810 6728326 6675747 6261253 5916802 5278655 5021742 4507368
21723 4507368 4390416 4173518 3891744 3915323 4124934 4158484 4221335 4811603 5232316 5672072
21713 5672072 6377250 6701362 7484744 8089156 8494125 9172942 9706170 9948397 10216704
21704 10216704 10238704 10352358 10023609 9690115 9248423 9008234 8440719 7881645 7265827
21695 7265827 6844008 5932661 5498593 4867867 4440877 4426703 4209188 3861060 3942252 3994103
21685 3994103 4196115 4370183 4723129 4856628 5344512 5550786 5921048 6171523 6508278
21676 6508278 6390621 6431335 6211078 5986385 5426344 5433582 4678326 4080847 3771187 3249156
21666 3249156 2687125 2332025 2234046 2191487 1898882 1670343 1650922 1519634 1488310 1358228
21656 1358228 1545580 1148461 1327973 1147996 1164561 949453 1227010 1096999 957302 907908
21646 907908 1201387 930183 896761 865138 693210 843993 1004956 960057 756970 918727
21636 918727 1049057 971691 768677 1144738 756326 836548 874516 794362 729708 1029377
21626 1029377 775768 945194 857151 741732 681704 818182 983612 750361 870245 669330
21616 669330 875785 859741 951450 762853 975247 887966 935222 782343 839431 807052 766657
21605 766657 943768 862768 742506 546184 612950 830349 982233 681066 619205 689691
21595 689691 814139 765354 811752 868723 781029 930881 648126 936728 925169 844900 1008754
21584 1008754 737704 933184 731261 861606 767640 803248 853228 895437 778227 898028
21574 898028 763027 1025109 907644 775619 835328 928879 848442 677184 750184 520438
21564 520438 790782 763928 691455 861116 771409 803790 847421 564654 773469 647173
21554 647173 723411 909269 790717 1015905 793977 870619 838774 1142487 810956 954238
21544 954238 586292 818167 786438 595936 833289 992117 862670 626651 795799 875616
21534 875616 845964 891068 835394 848318 745362 1069653 754381 928168 953285 930608 889533
21523 889533 1059404 1073184 1060291 849961 1001194 634422 841098 914401 747693 953055
21513 953055 856078 944531 945420 874781 937162 901354 806938 920239 925879 980081 926251 899402
21501 899402 1100626 1279552 1017910 981270 952073 852122 1104547 895372 883044 763975
21491 763975 1150365 779202 1090814 1119749 1179412 1084063 995625 1167791 972172 783452
21481 783452 1095405 1073516 1102689 1175340 961929 1080295 1206089 911768 1013868 690117
21471 690117 898215 1160241 1035131 907915 1169780 905215 976617 955485 669663 989083
21461 989083 1059386 1033407 906485 762750 878193 1149919 1045813 955257 1022238 942615
21451 942615 944353 766591 1155713 997460 783591 1213204 1091136 841790 967722 958995
21441 958995 1033219 941549 1127515 906872 784690 1199841 1260557 953769 956871 1198964
21431 1198964 1014156 1119776 908709 807912 932109 841606 1013727 986500 1054295 825662
21421 825662 655248 1296487 959573 789047 1071135 959698 863957 1109497 1095893 953866
21411 953866 924307 1103924 854136 704081 1034800 947195 936878 1089152 1119685 853344
21401 853344 1264326 911497 1115065 1190739 962603 947739 986091 1025549 940287 1098370
21391 1098370 1086818 1024058 926099 882466 807203 830989 1114504 1157068 1170684 1102956 957281
21380 957281 838919 1112769 995032 1049917 1037084 1031231 955930 1052230 1071903 1130567 1234404
21369 1234404 1116155 1055576 1205173 1006485 1131743 1162066 1070847 1113757 1124177 1229373
21359 1229373 1102140 1219488 1076938 1075115 815816 920131 1080347 1045450 958969 1146841
21349 1146841 1361250 1087339 1174016 1043218 1120669 1146302 1101996 1013374 969384 1166581
21339 1166581 1265987 1178659 1328242 1391704 1364006 1364720 1593969 1291461 1275635 1186441 1430553
21328 1430553 1353020 1383686 1370005 1169973 1188940 1592797 1333030 1422803 1330929 1368609 1583358
21317 1583358 1715542 1495454 1891379 1684892 1841708 1810786 1898709 1982068 1930735 2100187
21307 2100187 1996558 1906835 2008340 2127029 2391423 2513764 2387627 2595324 2396342 2566979
21297 2566979 2775225 2936928 2712626 3024527 3001564 3310119 3653425 3673333 4002954 4334143
21287 4334143 4702673 4874218 5318321 5547691 5967096 6638692 7079383 7927563 8394039
21278 8394039 9221299 10048950 11075766 12305415 13637539 15142856 16492134 17963676
21270 17963676 19133526 20545077 21736545 22655154 23492578 23706366 23664104 23168903 22811006
21261 22811006 21545553 20335090 18978894 17728623 15898420 14556446 13352242 11808568
21253 11808568 10653654 9864022 8485131 8118464 7216599 6774880 6426262 5616511 5384763
21244 5384763 4792775 4430517 4327766 4135366 3654975 3707719 3451514 3252896 2852606 2925207
21234 2925207 2804378 2739832 2753828 2188326 2239095 2351580 2241675 2032904 2078054 1924171
21224 1924171 1862429 1792510 1868859 1716818 1805864 1514845 1831870 1585461 1555624 1599982
21214 1599982 1535457 1660400 1836504 1587023 1622983 1513761 1250799 1384928 1329694 1470471
21204 1470471 1475094 1445256 1376582 1253294 1384844 1395433 1247083 1255316 1279445 1334722 1499151
21193 1499151 1387563 1051432 1439401 1272197 1219190 1479937 1171041 1277011 1448612 1502000
21183 1502000 1572069 1193536 1339231 1115698 1113406 1149424 1212439 1362443 1130320 1105727
21173 1105727 1336402 1206083 1255047 1179862 1336983 1168170 1172645 1064323 1215448 1145142
21163 1145142 1092304 826510 1027743 936116 1056968 1383210 1105427 1137057 1141691 1302164
21153 1302164 1149877 1354863 1360662 1279615 1331086 1261104 1324628 1277879 1211314 1137760 1191674
21142 1191674 1407408 1347918 1016476 1155086 1258464 1210011 1425835 1313898 1049775 992244
21132 992244 1141784 1233587 1123678 1002457 1061113 791359 1092073 1289600 1098287 1004628
21122 1004628 1293485 1259358 1307951 1145957 979071 1145475 963583 914010 1274074 1094298
21112 1094298 1048380 1278774 1078241 1244780 1087089 1171426 1259077 1366214 1320832 1238697
21102 1238697 1297735 1323963 1636215 1238592 1257946 1453873 1318953 1487771 1357324 1250995
21092 1250995 1407083 1599282 1496764 1534133 1748878 1795144 1727500 2031332 1854860 1834616
21082 1834616 1872619 1800012 1791419 1696643 1778707 1717766 1773239 1626535 1837282 1805361 1554541
21071 1554541 1678234 1892055 1743771 1683948 1578955 1399325 1707849 1490392 1864454 1572511
21061 1572511 1438788 1666587 1382844 1401847 1422090 1509078 1447619 1190717 1361888 1569591
21051 1569591 1399282 1109112 1232542 1410869 1493268 1355859 1366496 1454502 1803731 1477588
21041 1477588 1608765 1532075 1666731 1753459 1731084 2080192 2239024 2513646 2744463 3194738
21031 3194738 3646905 4022974 4475613 4765383 5394678 5552835 5557405 5575516 5484426 5334288
21021 5334288 4901390 4407596 4121572 3637042 3291239 3109324 3239093 2926358 2921630 2533870
21011 2533870 2567288 2567337 2532739 2532263 2393654 2694462 2819285 2701091 2739236 3159755 3152255
21000 3152255 3967857 4406497 4653148 5032111 5367673 5796019 5734781 6041571 5988427 5968401
20990 5968401 5250119 5097523 4544201 3894031 3533325 3392010 2946704 2804502 2617212
20981 2617212 2643208 2529711 2535326 2567015 2378471 2187685 2522355 2601423 2735969 2866567
20971 2866567 3105095 3143262 3869662 4327310 4602605 5247030 5617912 6159575 6140746 6542051
20961 6542051 6836867 6939591 6870540 6843435 6768409 7072371 6972599 7316105 7318483 7570567
20951 7570567 7601653 8012860 8375825 8589440 8717146 9347234 10106463 11219952 12512424
20942 12512424 14147996 16077838 18044844 20289730 21802404 23516017 24201297 24755220
20934 24755220 24677509 24190668 22884733 21154811 19127071 16612065 14651584 12648983
20926 12648983 11006770 9528449 8183857 7097536 6210723 5500342 4919711 4154751 3879395
20917 3879395 3633944 3475158 3291707 3264902 3083833 2914533 2833094 2655894 2582387 2787521
20907 2787521 2499050 2635871 2511370 2651048 2805866 2745436 2759565 2870591 2861622 3066185
20897 3066185 3437396 3292799 3891890 4132981 4794504 5108031 5738169 6208147 6471535
20888 6471535 7035023 7250590 7630219 7908300 8284782 8826906 9558290 10040141 11521674
20879 11521674 13237167 15193815 16969408 18910744 20567939 22151195 22800038 23239392
20871 23239392 22839844 22089869 20594425 18561342 16404304 13953535 11624956 9609830
20863 9609830 7767859 6707380 5756018 5022317 4098772 4066483 3595262 3312888 2939014
20854 2939014 3064325 2723657 2559418 2614558 2226771 2078054 2091175 2093454 2089627 1727589
20844 1727589 1994323 1810201 1967225 1903585 1761458 1958139 1691391 1844126 1742490 1953371
20834 1953371 1752453 1892880 1654496 1839907 1768201 1974494 1888288 1531935 1656826 1972772
20824 1972772 1973313 1832916 1734186 1747082 1799090 1697968 1770371 2044179 1886808 1843688 1724852
20813 1724852 1751484 1909942 1714692 1745420 1768510 1985730 2021771 1858012 1758236 1960909
20803 1960909 1953470 1787295 1802947 1805087 1946243 1772527 1815804 1981586 1691009 1783186 1576902
20792 1576902 1761672 1602246 1794002 1629965 1678436 1906747 1595904 1669377 1931210 1697302
20782 1697302 1780368 1745540 1759265 1745755 1906225 1701753 1875254 1876535 1528418 1625478 1514087
20771 1514087 1623716 1766659 1523156 1720112 1757032 1724863 1649484 1766499 1588808 1560351
20761 1560351 1547533 1522246 1493315 1449397 1526873 1428926 1474039 1459516 1496539 1450034 1501089
20750 1501089 1388932 1378847 1284766 1227180 1207928 1448043 1224339 1297919 1367813 1367597 1444648
20739 1444648 1395579 1401191 1550034 1478737 1314330 1569398 1448148 1285521 1499779 1430373
20729 1430373 1483839 1434667 1446277 1620238 1579663 1357770 1525244 1468475 1429161 1708374
20719 1708374 1938904 1405646 1668716 1646200 1722538 1597027 1485547 1957559 1694060 1688340
20709 1688340 1536236 1735623 1640556 1562106 1735127 1843951 1655178 1585554 1624690 1823973
20699 1823973 1814057 1638260 1614383 1727145 1670446 1616344 1566291 1619690 1641033 1524090 1589238
20688 1589238 1356313 1643524 1716531 1396031 1642500 1524186 1694294 1424482 1874838 1825751
20678 1825751 1806515 1974900 1856766 2142456 1842560 1840732 2056943 2033197 2104423 2047222
20668 2047222 2166441 2237626 2130176 1819758 1814047 1689047 1668595 1942009 1598821 1818634
20658 1818634 1881516 1811253 1658604 1703795 1583376 1996251 1797333 1881218 1808951 1980046
20648 1980046 1937203 1864366 1908056 2064292 2129810 2152760 1974447 2004869 2149863 1962260
20638 1962260 2049207 1859320 1843490 1768239 1754301 1906566 1797724 1543767 1718096 1594858
20628 1594858 1661457 1673138 1677044 1436685 1596886 1528509 1524728 1703430 1879657 1789807 1541289
20617 1541289 1659577 1828256 1944119 1842924 1858932 1668555 1649101 1669481 2066690 1757419
20607 1757419 1737643 1534848 1720917 1593747 1422354 1745389 1505694 1653843 1603772 1321555
20597 1321555 1488863 1224015 1516553 1537935 1474494 1511062 1254057 1543281 1452459 1503841
20587 1503841 1567871 1419998 1514621 1525716 1919374 1653550 1699464 1550578 1850774 1561658
20577 1561658 1362919 1488324 1424254 1567536 1478247 1607648 1658446 1606540 1411606 1530279
20567 1530279 1359700 1415280 1585420 1602818 1506256 1368552 1670373 1597995 1477493 1405545
20557 1405545 1458445 1394042 1582293 1482479 1686001 1627677 1643549 1807430 1541104 1498748
20547 1498748 1367805 1812034 1442220 1631144 1777064 1415987 1573331 1568612 1328579 1693124
20537 1693124 1533686 1545334 1895209 1645480 1557262 1928238 1940688 1992262 1978427 2013639
20527 2013639 2049154 2105573 2092436 2088978 1887463 2011273 1987727 2084281 1702213 1653974 1753760
20516 1753760 1873382 1624384 1527517 1431778 1602061 1655452 1551568 1587170 1672080 1569659
20506 1569659 1776584 1808453 1713695 1801532 1652550 1783456 1785942 1874725 1904352 1932502 1819884
20495 1819884 1838779 1897351 2013045 1587254 1772344 1723099 1746094 1593960 1440732 1673849
20485 1673849 1427670 1354452 1402026 1531895 1522953 1466691 1712948 1444400 1766762 1805884
20475 1805884 1848435 1742312 1836742 1812615 1928957 1982631 1975010 2054830 2036863 1861240 1888107
20464 1888107 2021542 2064054 1751423 1877604 2007406 1819830 1988488 1620548 1774615 1896250
20454 1896250 1669962 1346649 1930264 1736593 1775419 1748502 1839244 1712394 1677493 1764221
20444 1764221 1915299 1698734 1723508 1609033 1732807 1764409 1664985 1731200 1700541 1727462
20434 1727462 1705888 1626527 1649734 1655279 1592340 1609425 1378868 1682127 1687360 1608140 1615461
20423 1615461 1405049 1799099 1591634 1837163 1606394 1731061 1663763 1627298 2040048 1695949
20413 1695949 1812397 1822916 1619833 1726952 2031151 1852048 1968035 1846552 1776845 1797264
20403 1797264 1797545 1813674 1918740 1729050 1732451 1560580 1783802 1615610 1869571 1718729
20393 1718729 1893091 1762268 1943384 2055116 1993019 1967651 1898330 2182987 2098664 1928298
20383 1928298 1906138 1925640 1891165 1628987 1896208 1808793 1778859 1719207 1641770 1577234 1674614
20372 1674614 1622428 1532251 1657973 1391812 1349299 1770967 1628617 1592008 1731183 1858610
20362 1858610 1584409 1439141 1756163 1837694 1570579 1797271 1643385 1834796 1933571 1945334
20352 1945334 1895073 1786665 1771109 2068815 1688788 1965295 1930763 1719621 1937345 1756031
20342 1756031 1957127 1823698 2007517 1827708 2151242 1988598 2011328 1814045 1868212 2073390
20332 2073390 2023769 2077376 1963974 2052332 2184416 1957619 2167485 2142442 2253697 2236425
20322 2236425 2413638 2479409 2615600 2795652 2625558 2759994 2875717 3002769 2842899 2897902
20312 2897902 2890735 3157711 2955134 3234342 3338928 3113026 3187020 3083872 3008118 2841646
20302 2841646 2926990 2789905 2765855 2708942 2791418 2527794 2458625 2374555 2391510 2246679 2062287
20291 2062287 2160614 2182309 1817878 1946998 2029061 2157994 1927625 1984207 2029494 2303613
20281 2303613 2235214 2269573 2496347 2721909 2792639 2621792 2662134 2972558 3103864 3203199
20271 3203199 3401227 3939953 3985833 4511699 4779545 5450428 5610316 6273745 6995700 6921114
20261 6921114 7700555 8026047 8320149 8589248 8767313 8635850 8714080 8430609 8031274 8070059
20251 8070059 7504704 7212943 6440475 5764988 5393416 4880021 4402719 4196032 3529230
20242 3529230 3151189 3229268 2991907 2893611 2876098 2820180 2722148 2553320 2594413 2652843 2655164
20231 2655164 2665720 2477017 2778716 2732623 2494596 2613020 2867618 2908484 2631138 2846255
20221 2846255 2570395 2811517 3043849 2824077 2963719 3062194 3019425 3221296 3150506 3413906
20211 3413906 3465070 3677278 3789406 4146385 4425799 4759382 5191060 5798213 6435192 7063332
20201 7063332 8086683 8727473 9503739 10231937 10760491 11306118 11937943 12653935 12955639
20192 12955639 13224033 12795108 12536378 11994560 11423198 11279459 10430466 9650450 9157239
20183 9157239 8299210 7247656 6638837 5944857 5486084 5560092 5141509 5399651 5245220
20174 5245220 5255297 5371977 5829228 5918941 6421531 7071757 7316704 7574026 8906522 9869712
20164 9869712 10676655 12106592 13576469 15197119 16653335 18833983 20752482 22968278
20156 22968278 24939239 26823791 28643637 30325851 31558317 32878278 33327856 33563182
20148 33563182 33403503 32670883 31930113 30674570 29246066 27231598 25291395 22967338
20140 22967338 20718622 18667128 16491227 14419332 12906735 11322464 10332005 9140023
20132 9140023 8389588 7757661 7326247 6753694 6592135 6457736 6183125 6261234 6303846 6024193
20122 6024193 6422596 6421440 6701336 6707063 7387819 7290635 7384678 7956975 8257727 8511612
20112 8511612 8674395 8974555 9049314 9390632 9205034 9199781 9265692 9232891 9140859 8986409
20102 8986409 8635852 8068611 7830725 7599293 7392580 6824086 6472801 6149466 6025523
20093 6025523 5369701 4987308 5060464 4564442 4529928 4495208 4721881 4625317 4673693 4983457
20083 4983457 5233944 5463404 5986963 6693830 7360032 7935411 8545980 9362883 10181814
20074 10181814 10921018 11749507 13151151 14290624 15360474 16130392 16732216 17735294 18101556
20065 18101556 18768496 19334132 19904211 19812515 19437098 18950322 18279492 17573867 16639859
20056 16639859 15893326 14847236 14089166 13113069 12325978 11426081 10571908 9764187 9052183
20047 9052183 8693752 8239793 8210799 8152893 8346330 8356741 8920247 9734583 10216710 11169826
20037 11169826 12133092 13260694 14624511 16010213 16863168 17799903 18568512 19564193 19718875
20028 19718875 20170749 20238989 19621530 19296468 18164690 17487828 16253941 15173225 13668439
20019 13668439 12425008 11292516 9876965 8714871 7570345 6967750 5959520 4944842
20011 4944842 4856248 4314829 4082644 3843538 3727337 3211833 3142428 3134871 2994734 2740044
20001 2740044 2777346 2790813 2596093 2926069 2374221 2557974 2327643 2373758 2245572 2296690
19991 2296690 2520483 2224549 2411108 2336037 2238865 2170091 2037341 1994921 2184614 2109683
19981 2109683 2148816 1947360 1899032 2380415 2079026 2041478 2229955 1965593 2175937 2013831
19971 2013831 2005979 1991318 2018948 2092257 2069781 2123413 2039180 1917302 2108441 2038083 1982101
19960 1982101 2092962 2241830 2005205 2016742 2108065 2016934 1916337 1999784 2155311 1895492
19950 1895492 2074645 1900928 2206312 2157196 2104484 2132699 2146306 1976913 2056613 2369016
19940 2369016 2303701 2257337 2586947 2236365 2210291 2281143 2272485 2274162 2405215 2357916 2564149
19929 2564149 2415881 2300564 2556179 2502707 2100738 2490493 2358599 2336537 2464983 2244400
19919 2244400 2130932 2230273 2282187 2224420 2214829 2121679 2243310 2331185 2081424 2200321 2324779
19908 2324779 2124331 2308725 2206025 2255393 2319578 2317099 2365821 2452461 2557127 2272066
19898 2272066 2359663 2573599 2598226 2521602 2596780 2621548 2608207 2833071 2584399 2829059
19888 2829059 2651810 2720212 2871134 2621000 3093122 2718022 2726634 2886480 2944753 2942328
19878 2942328 3044841 3103071 3268048 3229528 3406257 3361303 3509391 3335549 3652120 3147279
19868 3147279 3325283 3140577 3564619 3512188 3533148 3480302 3514547 3486261 3578515 3966114
19858 3966114 3829771 3911942 4138830 4250346 4256023 4115556 4464592 4691668 4727462 5200029
19848 5200029 5182338 5735327 5783658 6420630 6724053 7272065 7861223 8532070 9452073 10668979
19838 10668979 11442143 12530374 13569029 14103746 14949230 15634925 16273944 17082224 17628845
19829 17628845 18479791 19132359 20082805 21216367 22292888 23660771 24553626 25634207 26307096
19820 26307096 26924076 26915968 26581391 25803011 24804087 23337795 21761100 20434971 18738102
19811 18738102 17535692 16492259 15738284 15206865 14823168 14914276 14861289 14856622 15223524 15241819
19801 15241819 15490548 15805874 15728831 16176555 16388846 16635500 16826441 17505528 18111665
19792 18111665 18949180 19723056 20334265 20955889 21479662 21186874 21239503 20775280 19923707
19783 19923707 18696327 17341870 15785063 14495541 13098175 11509711 10517575 9713960
19775 9713960 8441174 7384220 6957315 6443728 6201441 5821487 5336241 5146009 4709932
19766 4709932 4491403 4387879 4248173 4306741 4072038 4051829 3837389 3767852 3734849 3713136
19756 3713136 3854668 3584479 3506600 3516779 3390113 3318575 3176475 3337105 3303987 3327821
19746 3327821 3143626 3201072 3251286 2948838 2968755 3071001 3033830 3129054 3019699 2833904
19736 2833904 3201172 2852400 3050000 3135724 3053672 3042213 2776271 2969297 2995882 3075513
19726 3075513 3001703 2829588 2811364 2862788 2721639 2832734 2625837 2657113 2803547 2854503
19716 2854503 2634538 2779484 2718335 2609301 2819871 2607396 2669436 2546134 2639369 2744020
19706 2744020 2635428 2530558 2710648 2697856 2583779 2576070 2649720 2692249 2635211 2433836
19696 2433836 2689799 2591869 2669198 2592663 2637716 2511023 2665676 2394612 2562554 2484733
19686 2484733 2486801 2587206 2656076 2470243 2451866 2319536 2246199 2321565 2289143 2246890 2306570
19675 2306570 2264691 2153321 2334535 2284724 2261708 2338717 2373387 2357778 2139587 2090845 2195918
19664 2195918 2317182 2169648 2226925 2025994 2219299 1992268 2187163 2238313 2233326 2188799
19654 2188799 2371797 2124061 2203567 2506209 2494595 2452677 2141532 2180108 2092297 2167776
19644 2167776 2012628 2034640 2170882 2128279 2092103 1933913 2049783 2215743 2083858 2237016
19634 2237016 2259610 2206958 2214946 1921734 1892536 2049016 2119275 2146544 2203243 2048064 2037273
19623 2037273 2165204 2045519 2152685 1937908 1971687 2054698 1949511 1945062 2114683 1953627
19613 1953627 2173688 2291918 1958152 1845077 2238676 1919206 1915740 1845744 1858818 1917349
19603 1917349 1894099 2040426 1825835 1914282 1873419 1855352 1881006 1607526 1736397 1711856
19593 1711856 1851815 1775256 1918477 1721885 1896338 2162620 1886186 2014053 2077544 2116023
19583 2116023 2056861 1975020 1893170 2139009 1876632 1892961 2161704 1924107 1771333 2220119
19573 2220119 1910694 1907053 1812206 1892439 1887060 1737788 1967238 1951644 1679471 1956614 1785648
19562 1785648 2178666 1901231 1791010 1771925 1772083 1910841 1613717 1904739 1540406 1843256
19552 1843256 1656179 1520544 1840130 1727472 1822495 2074755 1698031 1586600 1648286 1718776
19542 1718776 1482726 1620629 1685162 1573703 1533046 1316906 1731524 1587885 1370267 1525333
19532 1525333 1704884 1559564 1588913 1744178 1333686 1628294 1391918 1812312 1898677 1593870
19522 1593870 1774342 1650089 1627835 1751053 1899059 1611990 1770051 1503589 1633851 1625714
19512 1625714 1779931 1666518 1850771 1566106 1551626 1729674 1848109 1604442 1596322 1507452
19502 1507452 1605084 1594437 1606934 1715119 1674051 1584093 1571006 1776506 1803074 1594880 1534048
19491 1534048 1484713 1584719 1426004 1384984 1601573 1450735 1553097 1456859 1376263 1251397
19481 1251397 1413105 1372686 1414117 1373765 1554523 1653922 1518411 1466003 1261422 1231233
19471 1231233 1342929 1356900 1150003 1289284 1244666 1185788 1092266 1316278 1316551 1228477 1311494
19460 1311494 1362202 1208550 1133725 1205906 1177240 1185850 1091225 1158759 1195671 1180041 1297240
19449 1297240 1043312 1218125 1113501 1067843 1281237 1227962 1197478 1171456 1302270 1148153
19439 1148153 1193560 1161684 1312042 1059126 1031004 1257982 922050 1012962 1070752 1053898
19429 1053898 910247 1200555 1028754 1070137 1166120 1208418 943729 793111 1189283 1096808
19419 1096808 1354589 1013034 1040144 1225802 833894 910272 1068977 888599 1099446 1063129
19409 1063129 1102976 1120429 1098230 1159076 1002555 1119343 942512 855992 843793 1126864
19399 1126864 1147886 1028834 1132969 1037028 1020632 973554 1050709 942999 866227 1166577
19389 1166577 932487 1104901 1068399 987277 1020665 1001315 1000252 1133728 1060980 917313 1013490
19378 1013490 926896 885673 982276 1006734 899048 930857 988184 1037223 895484 1098558 762935
19367 762935 1033403 1031433 1055319 985645 826433 1067922 966011 969615 933321 881410 849716
19356 849716 1054479 993302 1087423 951230 1037315 1137919 854409 904828 876101 451105
19346 451105 901690 879621 681347 957290 911549 831497 837437 988662 815743 873711 899947
19335 899947 787488 907262 909113 1129135 928203 970240 1035902 876090 882840 864102 898046
19324 898046 801734 669574 955567 963745 1020739 612824 1088876 876669 785850 840406 803690
19313 803690 1185066 844143 1067255 916825 836845 977026 722338 823916 1145305 1118902
19303 1118902 907906 1066433 1142824 1143211 1006435 1171275 1027220 1039331 1063965 978875 1011224
19292 1011224 911630 990834 1098010 1121281 799284 1210270 954646 710274 1148130 1110403
19282 1110403 960340 942853 1068028 906549 1002396 887839 1164009 987662 1022027 660518
19272 660518 1031382 919705 1000042 906240 769622 744386 1082426 910834 958480 935541
19262 935541 1136306 1186899 820416 908036 951099 998453 837967 966329 912115 777929
19252 777929 1134396 1079436 742529 1068588 931322 947322 881777 848137 843882 938773 1266515
19241 1266515 1092148 1594617 1428420 1547111 1570302 1641052 1544116 1544538 1289298 1235969 1216603
19230 1216603 877731 857764 753843 840483 874771 950404 762218 974549 996046 1001626 720072
19219 720072 910720 818438 887678 789571 859849 924437 783822 927720 824280 656871
19209 656871 1035066 772256 751952 679807 657575 649609 808749 756946 1026102 916551 680417
19198 680417 762139 925292 797276 1137927 752730 691317 827718 777725 779351 1055525
19188 1055525 764821 858279 778521 783114 871210 676316 731432 873964 628750 902519
19178 902519 597488 889782 995784 794942 900194 880222 567463 797893 778883 691816
19168 691816 727158 717616 767742 872402 812262 908917 784746 931782 1253966 859919 1034028
19157 1034028 1112023 907027 924627 865542 1006043 893479 729165 1110750 1148275 1409182
19147 1409182 1556351 1555786 1301134 1350649 1662707 1403436 1462826 1594836 1477644 1377711
19137 1377711 1462791 1459649 1430245 1594950 1383606 1701983 1468656 1512352 1423692 1351038 1305489
19126 1305489 1433077 1427168 1337503 1328615 1079988 1121443 1256183 828814 1097134 987689
19116 987689 1069491 1015784 1104852 1096267 1157311 1024477 1117143 1236535 1029389 1209009 1308468
19105 1308468 989493 1200943 999737 1263081 1256280 1150331 1461920 1240470 1213350 1479582
19095 1479582 1294721 1235608 1409587 1484473 1360662 1532316 1484944 1423870 1650374 1573327
19085 1573327 1919776 2220999 2184272 2559998 2816415 3123330 3608441 3900538 4547423 5084366
19075 5084366 5247561 5401970 5600508 5710085 5745322 5666826 5167357 4785010 4251094 3456911
19065 3456911 3090409 2813200 2552462 2412296 2237483 2370462 2453530 2575117 2893795 3175212
19055 3175212 3695566 4299284 4636320 4642956 5001716 4812435 4714914 4727559 4652564 4117005
19045 4117005 3706209 3320381 2876822 2732125 2564122 2544292 2572376 2931512 3118959 3330523
19035 3330523 4093008 4353344 4946395 5460776 5718771 5826824 5918322 6127469 6104536 5613114
19025 5613114 5213050 4687611 4182272 3549129 3101104 2981160 2856041 2916509 2860769 3355616
19015 3355616 3535045 4126724 4412768 5076163 5172812 5145573 5319244 5315518 5109209 5064590
19005 5064590 4362606 4151153 3583484 2963242 2669631 2413300 2279309 2509686 2278808
18996 2278808 2394386 2565077 2961465 3504805 3838088 4138059 4422670 4801598 4812421 5053427
18986 5053427 5199902 5302932 5201942 4771810 4583856 4414962 4047005 3728813 3605904
18977 3605904 3681688 4306696 4357929 5046773 5419395 6394298 7261861 8297693 9347831
18968 9347831 10612587 11781924 13615731 15333078 17266903 19405587 20860119 22212901
18960 22212901 23107227 23410483 23402031 23224670 22463499 21123247 19382785 16823306 14884684
18951 14884684 12136193 10327055 8450676 7112901 6058941 5392315 4462628 4283868
18943 4283868 3588328 3389103 3337322 2782551 2537454 2376514 2205827 2289311 2264369 2158184
18933 2158184 1919398 1993957 2006292 1812825 1915414 2102054 2185096 1931877 1922145 1947476
18923 1947476 2116043 2199591 2126932 2253435 2205580 2283606 2373499 2356729 2409972 2630195 2837233
18912 2837233 3044691 3079223 3474797 3647415 3968267 4490492 5207085 5871866 6629182 8012433
18902 8012433 9532986 11401970 13140875 14941046 16885838 18394099 19735801 20284602
18894 20284602 20442632 20414195 19379233 18242070 16443606 14372075 12418003 10155392
18886 10155392 8332002 6920076 5770339 4680103 4212432 3679369 3171500 2773492 2699621
18877 2699621 2245561 2165724 1841117 1923418 1926286 1580525 1460787 1665383 1308892 1235864
18867 1235864 1287312 1275180 1292120 1092742 1008128 1085128 1459154 890676 939272 1058314
18857 1058314 964614 1192076 1026101 930759 1059458 1125059 817568 1237601 751199 863756
18847 863756 881941 973288 1011985 973724 1051773 860042 689058 907537 699000 726584 821147
18836 821147 760364 711844 777273 814976 1067432 600656 939520 732911 691254 858046
18826 858046 728925 1008579 653259 830302 890175 925693 715178 801528 913141 765898
18816 765898 897521 978596 606476 800424 593506 949275 784498 927732 666188 502547
18806 502547 620130 817785 873615 883622 685245 1045881 717176 790753 888209 734698
18796 734698 867669 651377 812379 862649 938306 998481 889528 715761 930394 829206
18786 829206 908695 852614 1014668 898022 728738 1051605 879096 1027846 1133368 916241
18776 916241 929488 889773 858523 949292 899057 920928 851234 719543 911309 721770 777520
18765 777520 931908 762316 891839 996900 940034 728261 967138 888812 615999 779143
18755 779143 706658 794642 688192 712152 869683 883396 907815 832732 623053 918505 890793
18744 890793 810067 740034 864600 789743 716204 682716 751629 774297 722638 794528 692457
18733 692457 759456 772153 710080 707859 746277 1025031 791465 818986 913518 968161 1006790
18722 1006790 934128 933745 828989 928120 1003589 835085 932733 988102 888461 899600 899045 536142
18710 536142 846469 1011046 783975 826415 715237 1014681 882210 978446 1200287 791877
18700 791877 807755 776649 643338 682766 651906 825706 565519 1068122 733137 705952
18690 705952 825485 851587 604176 812157 769024 479974 866357 805163 936632 640338
18680 640338 643580 651329 872301 752173 949860 877708 662568 633607 633680 861443 813013
18669 813013 756036 813416 809922 691497 458202 766189 724992 811351 726229 610201 722830
18658 722830 801679 623925 799242 627634 503580 780953 826321 681812 614879 524056
18648 524056 664874 795006 732428 722541 543927 644727 936639 732940 754042 801466
18638 801466 605166 629034 853851 1124854 885729 617278 650724 568943 713284 737991
18628 737991 590331 820897 577679 641012 600728 716615 682173 575505 743124 708344
18618 708344 737850 755873 740136 686898 624592 520042 812188 746970 783232 927373 857767
18607 857767 533645 855836 760165 530063 744425 940790 619179 910547 884568 724054
18597 724054 690538 913016 718406 834079 1046637 1011878 623238 750434 844079 743696
18587 743696 602435 857457 828539 725807 1009835 766381 909282 747961 887714 771724
18577 771724 692467 1036307 654137 897376 792430 696336 688788 606537 717572 609033
18567 609033 789011 873726 898002 635830 558376 739666 784852 710177 646407 732469 737740
18556 737740 857219 917313 621132 750749 814636 623546 685192 625937 528402 812629
18546 812629 731565 683657 688674 508000 666500 516741 525197 770695 755958 541877 614578
18535 614578 295729 718142 544235 786247 630057 444049 630436 658017 336539 674809
18525 674809 646224 470221 322579 513400 504328 651934 568224 575537 415655 592233 473630
18514 473630 562931 512633 573536 733613 568366 745104 704928 512208 487147 566890 731434
18503 731434 625537 487298 601169 532140 467803 848608 579554 560615 601816 542993
18493 542993 665896 761187 787080 514264 623773 591719 486728 576492 555245 635150 739211
18482 739211 570747 643197 711672 568990 619201 523587 514863 814513 608165 780337 737818
18471 737818 714067 550371 763500 339631 615413 698035 570441 829249 673006 760921
18461 760921 664981 642987 612255 669636 552736 701863 686531 416696 716374 823061
18451 823061 702525 915560 668214 692117 293739 886034 628970 734869 700435 488874
18441 488874 523693 534592 692685 558632 791974 698251 661282 659039 803191 834657 821889
18430 821889 677099 719147 773072 927910 518341 731164 672906 762929 761552 664631 550212
18419 550212 690478 464823 609325 576834 624980 814265 665878 470936 667813 792499
18409 792499 762864 655328 652029 853048 849839 763523 783633 820757 680195 595852 717752
18398 717752 667057 766832 688840 606576 604265 607437 535391 331613 500509 429965 640764
18387 640764 631768 910813 454694 806232 746231 600035 527465 603819 491508 531066 637575
18376 637575 579426 884093 615559 836513 677253 574902 415783 425086 607877 686818
18366 686818 573163 774237 562678 643861 490465 719848 637795 514079 794045 493905
18356 493905 747725 489726 503931 637016 526649 457879 334618 813553 538378 472255
18346 472255 520755 591176 607145 493183 731353 499388 556372 664591 393350 727368
18336 727368 613123 527943 550274 759908 396210 665532 808417 613112 812681 703773
18326 703773 743101 841935 693387 665106 674403 784831 437893 806384 484177 841280
18316 841280 616940 864519 379179 645790 609538 532979 411580 561834 596517 620438
18306 620438 608395 591936 565837 533347 713802 526305 551391 656096 604153 585696 793977
18295 793977 684454 624161 841587 913133 969584 723868 585337 756135 756974 606683 445076
18284 445076 549832 627559 434187 520678 633708 664954 692367 421950 628709 656180
18274 656180 555716 526960 330931 592835 446930 374426 705192 394090 561194 923653
18264 923653 532886 644300 467317 443884 589060 557942 399577 507889 502917 673515
18254 673515 654747 633348 546397 489348 575732 693686 685562 554352 689566 717811 616795
18243 616795 729969 822926 800421 906702 534565 784659 763818 623566 850653 548453
18233 548453 530101 650516 973242 569369 805120 652949 517694 642840 849659 460682
18223 460682 653119 578923 696473 692481 528518 534129 621016 547148 668204 651145 638433
18212 638433 652505 824719 468700 872621 537474 714019 674163 606261 580972 563740
18202 563740 631122 757574 790018 799933 720787 689913 850137 614204 765909 815489 720986
18191 720986 656354 794897 674913 734279 677273 712929 627361 750544 683894 760521 684976
18180 684976 753258 877175 689474 530803 828223 513100 579637 533290 620096 593553
18170 593553 410727 583773 575843 709339 622458 571065 580441 577230 548750 393561 612576
18159 612576 835453 557304 753250 642156 491021 749869 527661 641573 527006 483440
18149 483440 520541 569676 373935 612563 474154 663934 633234 700348 435129 433819 671044
18138 671044 559669 648370 630853 471203 542048 584089 672648 928434 494803 854837
18128 854837 665580 318167 548461 747191 698363 451543 675232 520132 659598 502781
18118 502781 598144 673512 523479 696466 565376 605420 768457 904297 695640 668604
18108 668604 452553 478408 641305 616977 485524 675699 640884 805952 654183 555330
18098 555330 546778 600527 445099 569583 483222 462734 471055 571188 267086 803498 542400
18087 542400 469491 464058 984228 490175 590864 742280 506449 639913 566533 526225
18077 526225 599587 623570 688486 518519 392287 750743 625011 621507 402930 571543
18067 571543 565260 512373 621757 320573 504778 795847 535804 582075 467370 520891
18057 520891 491183 558564 641114 634220 556378 329743 538443 405315 692956 610012 651020
18046 651020 787645 615360 601946 755022 370640 491862 653888 731955 689247 496265
18036 496265 497633 411903 506973 355404 666405 590632 592486 326427 501277 353775 600494
18025 600494 478464 211872 580663 581535 795142 752154 575922 598600 512210 612617 561207
18014 561207 373802 497030 593204 540558 376451 394788 406987 498330 657592 521973
18004 521973 414645 504244 628538 539971 579956 611534 281839 556489 644622 560322 458920
17993 458920 582256 741817 556118 709898 345695 633040 415609 660803 677877 479126
17983 479126 575372 730990 853367 688023 592223 441393 333481 396694 751406 611529
17973 611529 597557 661330 675250 733638 791979 619865 447382 772719 432816 575529
17963 575529 549011 579988 567686 658506 747901 526818 407064 543791 751939 750869 512820
17952 512820 584970 793873 671530 704158 683734 546961 590049 748885 664137 738414 489010
17941 489010 642381 444978 482564 629534 506998 721113 647049 517508 537113 802940
17931 802940 516314 700500 795931 719267 537348 683062 744422 862288 749690 892157
17921 892157 720827 776778 699357 692333 692165 791525 836506 632951 801292 681727 957011
17910 957011 1059760 798005 533407 840118 834405 663973 866874 853214 587574 796258
17900 796258 617175 888116 728561 675439 755342 722459 730371 953203 843391 711812
17890 711812 937310 973228 953788 1112617 893881 715255 1117427 966431 755950 965017
17880 965017 640044 741977 1012563 829464 601533 841594 915237 940078 669090 730302
17870 730302 1060388 514936 905491 917983 898520 1029730 967190 911086 743191 740077 822788
17859 822788 862517 1069677 704696 809291 502597 773573 937774 650031 628147 899108
17849 899108 714409 941513 710356 832641 636946 807899 954066 746595 800260 949989
17839 949989 926389 679047 1024905 662132 863563 889706 715053 747342 783049 747163
17829 747163 799893 717097 804258 678982 765475 661524 809129 850598 996215 956623 937855
17818 937855 1125565 797704 855843 879685 1099897 1087122 1051203 1054526 1071193 881893 1162677
17807 1162677 938996 1015187 1006946 897887 588970 795670 854714 921935 830805 761838 1246057
17796 1246057 971611 1000205 1068303 934880 1044751 881461 1056767 879550 784083 904730
17786 904730 834189 675849 655108 795765 648002 733265 578030 768738 710915 717063 785287
17775 785287 754329 692183 760461 678637 684716 676674 693913 881670 893193 945535 788099
17764 788099 708967 758485 746223 721873 972887 1076094 628685 814658 720301 773673 733106
17753 733106 716720 676401 543744 860404 534809 720780 766153 531703 778257 833006
17743 833006 645272 940929 618431 847808 722305 636599 618467 791457 717040 865545
17733 865545 752964 905800 950507 670660 629052 997321 634229 652932 730037 804601
17723 804601 798108 713373 614250 706243 592467 846337 719539 796526 490985 660463 683457
17712 683457 509365 773417 669885 714551 921002 668679 736032 694951 804662 509158
17702 509158 827869 776192 770284 695748 692571 731847 703845 682921 829750 920185 633648
17691 633648 649835 785104 856154 858781 683799 772024 786818 688891 846828 817747 832694
17680 832694 795154 770130 768373 775564 800977 695747 893721 700727 599373 645939 620224
17669 620224 745786 1003408 748090 707891 875326 587970 873151 668950 729127 994483
17659 994483 824227 941103 1014288 973466 810484 668623 907750 802941 905424 863210
17649 863210 882172 1084794 832145 807463 1137396 921429 1221264 1026067 968781 795649
17639 795649 1106348 1045577 1188576 1083982 1160847 885561 1192079 994615 1195251 1095241
17629 1095241 975693 1088919 747111 1044366 1162265 1075978 1041285 1109072 961178 1239767
17619 1239767 1336537 1227853 1238307 1162182 1314274 1277990 1227559 1288611 1349654 1182517 1227822
17608 1227822 1479633 1314264 1255181 1551642 1266560 1425338 1305044 1238177 1043716 1462270
17598 1462270 1452070 1572290 1404630 1547990 1399105 1296063 1443496 1437714 1305855 1491607
17588 1491607 1397368 1597310 1472451 1382164 1351343 1212680 1554739 1273579 1342766 1412068
17578 1412068 1395776 1398641 1142676 1366218 1149793 1462592 1422025 1253997 1505296 1326710
17568 1326710 1354583 1236563 1071644 1472716 1211146 1463209 1200716 1381753 1410942 1470255
17558 1470255 1451020 1243705 1399042 1192498 1460414 1328599 1142875 1325556 1139466 1266786
17548 1266786 1148242 1427839 1130378 1283057 1438012 1638502 1352555 1332803 1395380 1188294
17538 1188294 1284294 1389225 1431892 1278448 1353861 1523091 1453738 1467296 1505166 1611526
17528 1611526 1696531 1457232 1500284 1346696 1494531 1406901 1484528 1343756 1731339 1455777
17518 1455777 1538481 1571457 1643466 1445887 1765317 1629698 1961976 1969220 1997220 1874146
17508 1874146 2293259 2224813 2338099 2325299 2472787 2510274 2429250 2587165 2472280 2649450
17498 2649450 2782786 2981054 3046369 3167243 3414344 3793938 3818895 4453287 4676653 5138379
17488 5138379 6122274 7213622 9381608 13271365 18634490 25858622 34067845 41712845
17480 41712845 48560200 53356046 56520485 58412268 58303763 57540056 54675467 49773171
17472 49773171 42753789 35223634 29724836 27947022 30527360 36145891 42880234 49468461
17464 49468461 54054648 57325719 58829964 58580128 57458460 54275402 49452869 41860677
17456 41860677 32610810 23479885 15508918 10713014 7892635 6168816 5238517 4341983
17448 4341983 4227456 3932929 4024700 3796779 3903567 4023680 4335632 4063048 4403487 3956064
17438 3956064 4190810 3911604 4005643 3928900 3940685 3617322 3474401 3512672 3541736 3668166
17428 3668166 3747047 3713817 3820649 3709919 3838843 3872555 3657551 3412237 3238003 3238880
17418 3238880 3069552 2641074 2667822 2796016 2588531 2741368 2740593 2561991 2432072 2534518
17408 2534518 2909972 2595257 2675047 2850985 2915201 2980957 3220893 3055941 3198306 3625633
17398 3625633 3611748 3702156 4019271 4263641 4306887 4556763 4563508 4923895 5538424 5826402
17388 5826402 6325555 6637635 7062444 7499360 7770536 7846974 7981793 8026847 7883785 7782697
17378 7782697 7627555 7682531 7352923 7260338 7125992 7019463 7119324 7387330 7742904 7951075
17368 7951075 8610056 8793365 9307509 9546717 9869319 10025690 10245815 10200358 10129499 10016839
17358 10016839 10122876 9710560 10035126 9749879 9774562 10092730 10371063 10313963 11017147 11524220
17348 11524220 12198600 12684564 13464709 14168219 14654521 15421562 15415236 15828505 15995795 16276924
17338 16276924 15657982 15586052 15464526 15325900 15139480 14560786 14471138 14461786 14740257 14781358
17328 14781358 15313231 15962666 16291563 17033504 17453426 18236060 18778459 19048142 19369871
17319 19369871 19328699 19463836 19096652 18923608 18724328 18054248 17581926 17221567 16807447
17310 16807447 16236915 16420692 15982189 16239333 15951546 16004084 16372782 16528895 16981211
17301 16981211 17347022 17698595 17834010 17935975 18154635 18055146 17915555 17801484 17473753
17292 17473753 17031185 16816813 16549340 16165748 15970707 15289903 15300860 14785274 14615044
17283 14615044 14461275 13812423 13574012 13056323 12703452 11860009 11401522 10737799 10169973
17274 10169973 9380492 8830296 8303203 7775862 7459923 7124020 6788463 6455270 6403974
17265 6403974 6595143 6354103 5968640 6106518 5693477 5649027 5602242 5167871 5103043 4948796
17255 4948796 4800170 4775887 4720783 4887196 4653908 4636814 4606849 4641605 4483739 4589309
17245 4589309 4403811 4424147 4150806 4134103 3966216 4017379 3873463 3800824 3786816 3735573
17235 3735573 3395860 3404218 3619583 3528838 3645907 3286123 3388328 3320187 3117495 3475089
17225 3475089 3547389 3677937 3471370 3613512 3592384 3718045 3808036 3702223 3249309 3712496
17215 3712496 3745645 3554647 3493635 3559467 3522442 3850589 3544164 3673856 3643294 3504339
17205 3504339 3576403 3482260 3705998 3513893 3683370 3553883 3511387 3588423 3347107 3434444
17195 3434444 3266002 3078717 2959384 2655965 2493423 2477716 2565964 2549173 2575220 2585476
17185 2585476 2568390 2275463 2276522 2621813 2490832 2395159 2256539 2475522 2200835 2301004
17175 2301004 2279580 2378803 2480568 2518025 2731938 2634209 2432614 2447333 2638676 2616525
17165 2616525 2688735 2593679 2788406 2835237 2842119 2549581 2859430 2899527 2895375 3213464 3112674
17154 3112674 3098595 2796369 3181809 3188977 2931399 2931469 3011364 2927734 3027136 2875055 2870794
17143 2870794 2863791 2742971 3097013 2955548 2905989 2923823 2888553 2822965 2942454 2758671
17133 2758671 3062592 2679756 2721294 2765836 2752351 2688058 2554100 2803614 2413490 2642018
17123 2642018 2629633 2610247 2544135 2508382 2628131 2359353 2540658 2386362 2623780 2431131
17113 2431131 2180738 2630777 2438784 2280650 2334415 2096620 2082688 2486680 2265883 2393337
17103 2393337 2251796 2165603 2037451 2196130 2094417 2072627 2216619 1760894 1899907 1977541
17093 1977541 1817164 1905728 1488349 1697434 1520898 1597390 1499378 1279087 1556896 1455642
17083 1455642 1293266 1408517 1382531 1328976 1266471 1303507 1237639 1433828 1234991 1286324
17073 1286324 1494064 1464286 1125595 1175197 1400176 1305966 1330754 1342400 1091044 1420707
17063 1420707 1200058 1264029 1104918 1597748 1324335 1421069 1538696 2026265 1787964 1522867
17053 1522867 1724971 1811168 1871320 2223230 1976385 1960330 1947141 1738228 2126052 1891709
17043 1891709 1931011 2199126 2239498 2227267 2329769 2421997 2434062 2456655 2528747 2467522 2270174
17032 2270174 2392855 2291711 2192869 1916004 2115030 1835732 1965376 1802639 1513292 1543007
17022 1543007 1504182 1663128 1650166 1521013 1608276 1336208 1602326 1278307 1431980 1365585
17012 1365585 1449577 1520172 1490624 1406820 1579581 1449807 1508399 1189868 1250817 1404101
17002 1404101 1291101 1475332 1385774 1517450 1421534 1303863 1388728 1386654 1301067 1284648 1521846
16991 1521846 1460089 1327079 1446777 1592309 990517 1268730 1374363 1330549 1645834 1515405
16981 1515405 1420237 1517212 1405786 1492533 1541914 1669988 1517029 1750792 1690233 1775105
16971 1775105 1738798 1941840 1833358 2062952 2239299 2042292 2212665 2139913 2378931 2648629
16961 2648629 2919051 2902575 3108471 3053812 3175864 3171448 3176817 3202820 3126674 3233481 3051942
16950 3051942 2949974 3042586 2984827 2724424 2652747 2489258 2572985 2393133 2285148 2127531
16940 2127531 1767807 1914355 1895937 1849803 1716637 1556607 1607475 1497557 1614006 1524598
16930 1524598 1459509 1383013 1425023 1476073 1509086 1439357 1466762 1458972 1509371 1664161 1538683
16919 1538683 1440101 1243368 1314870 1067052 1378850 1273359 1253681 1201372 1262085 1083010
16909 1083010 1260695 1007836 1040394 1013912 1209991 1087156 948088 1240997 1076104 1512641
16899 1512641 1136383 982290 1125510 1132990 967605 1166396 1263999 1061083 1128576 1085179
16889 1085179 921969 1214829 905971 1173262 968092 1050060 1133510 984635 1082102 1109307
16879 1109307 1042171 1064939 1217831 1094724 1039663 929030 1106730 1218633 1177869 1171500
16869 1171500 1403833 1276536 1168209 1093513 1090083 1071250 1210731 1136587 1331585 1014664
16859 1014664 896401 1203754 834159 1219966 948194 1171696 953532 1157932 1090657 1129209
16849 1129209 941671 933333 1148660 1032107 1123514 1093847 1280144 1238434 1083540 1121149
16839 1121149 1032345 1251718 941716 1114431 1280461 1150523 1245299 1171969 1056864 1045681
16829 1045681 1234255 1286868 1158779 1273547 1169030 1321370 1346673 1336905 1213453 1215710
16819 1215710 1469747 1534500 1560474 1459365 1755002 1449028 1653819 1962747 1903389 1759457
16809 1759457 1720447 1623354 1480378 1797161 1638981 1591091 1785235 1648122 1751966 1657772
16799 1657772 1602499 1652773 1609424 1229450 1479560 1650333 1558225 1391504 1240981 1166170
16789 1166170 1309492 1117547 980707 1214556 1327458 999418 1116007 825059 1221933
16780 1221933 1207059 1033555 759162 1167257 949854 1092650 1109461 1075636 1199670 1145098
16770 1145098 911609 978646 886293 1049451 1248092 1107536 1167299 1273401 1082484 1100165
16760 1100165 1279208 1155400 922208 1230881 1062711 1198835 988611 1142668 1112399 1217144
16750 1217144 1284238 1124077 1096943 1228714 1133603 1172846 1315741 1169979 1038308 947999
16740 947999 1218189 1159638 1065126 1414650 1176103 1196849 1378622 1330156 1205974 1252032
16730 1252032 1250189 1207894 1141926 1233758 1069424 1317395 1106859 1120174 1248266 1233920 1392436
16719 1392436 1413747 1376948 1456771 1348626 1777810 1672132 1173762 1165243 1342080 1328804
16709 1328804 1629588 1233618 1771215 1688172 1674590 1874154 1849664 2057720 1999939 2235427
16699 2235427 2181425 2238264 2240124 2116694 2163164 1979868 2157030 2138134 2182594 2000681 2329801
16688 2329801 2064778 2387713 2046268 2303233 2365753 2223330 2220215 1840655 2172593 1857870
16678 1857870 1688711 1840357 1672606 1760458 1594633 1486507 1601766 1686174 1785542 1983844
16668 1983844 2107516 2083902 2431678 2416593 2287234 2416859 2469425 2674282 2300787 2495374
16658 2495374 2319152 2292133 2387325 2294615 2478898 2449048 2433248 2365074 2549349 2197150
16648 2197150 2354878 2112179 1866343 1917620 1770143 1509608 1419180 1491721 1406672 1468953
16638 1468953 1193546 1278484 1399190 1168029 1354288 1200627 1505898 1420714 1517940 1451716
16628 1451716 1166555 1350476 1368896 1261703 1327438 1330856 1491420 1467694 1517742 1659766
16618 1659766 1478802 1459694 1149956 1322147 1248300 1640344 1393555 1574109 1707057 1607965
16608 1607965 1485097 1667274 1509426 1540603 1525734 1604481 1563907 1755173 1661778 1767429
16598 1767429 1798605 1942345 1801767 1873427 1745990 1759198 1771222 1881361 1693123 1865676
16588 1865676 1692966 1757352 1736421 1639995 1567737 1556181 1747997 1751655 1551881 1694544 1558399
16577 1558399 1789646 1848522 1593500 1448022 1743932 1677394 1617121 1859085 1633487 1759346
16567 1759346 1618876 1665647 1903723 1673683 1508715 1751507 1713362 1520800 1557404 1818075
16557 1818075 1692995 1726105 1802808 1999688 1748678 1926320 1668401 1729856 1750964 1784196
16547 1784196 1857119 1932223 1919827 1973029 1840018 1821534 1966194 2055436 2111432 2013668 1930508
16536 1930508 1639164 2174815 1997213 2045316 1959784 2091239 2093577 2352066 2349235 2318554 2127659
16525 2127659 2403080 2264904 2438851 2514415 2501948 2562275 2688857 2588768 2769307 2759959
16515 2759959 3144154 3107406 3125117 3157961 3321822 3358569 3257939 3251638 3097265 3500332
16505 3500332 3432653 3475742 3498741 3721350 3774829 3739149 3641129 3618944 3781934 3989688 3902383
16494 3902383 4257507 4392624 4566416 4436297 4938182 4920088 5379714 5574602 5656653 5782338
16484 5782338 6130645 6170510 6318721 6586279 6590337 6698405 6659072 7120789 7360863 7698209
16474 7698209 8279489 8708762 9455947 9649964 10713975 11184872 12126199 12870214 13682154
16465 13682154 15087483 15980347 17582330 19105160 20659865 22391407 24490238 26878618
16457 26878618 29425722 32620328 36250671 40387131 45329830 50450818 56470200 62826502
16449 62826502 69143036 74961551 80794557 86032353 92062464 97354499 103351709 109408611
16441 109408611 115836609 122771884 129494826 136788723 144079212 151064855 156944680 161364086
16433 161364086 165525433 169148808 173259172 176731970 180064457 182769003 185079611 186596932
16425 186596932 187993738 188532786 188502352 187720512 186697904 184807998 182575128 179624507
16417 179624507 176110769 172901269 168581330 163672001 157402554 151003000 144101655 137359576
16409 137359576 130588159 123570758 116611136 109081668 101293458 93040131 85034090 77188611
16401 77188611 68979614 61119119 53191210 45593497 38734570 32376563 26901347 22424301
16393 22424301 19997158 20807364 27512099 40733295 56349935 67994758 73824696 73638640
16385 73638640 69970028 64914846 59091084 54206960 49728906 47341521 43513849 33817351
16377 33817351 18156501 2660111 -6136265 -6413731 -1441729 3929740 7276089 8878604
16369 8878604 8591490 7933814 6763085 5498356 4363548 3640640 2457672 1661619 1066543
16360 1066543 453729 -24442 -138068 -168015 -273795 -540336 -162113 -122251 77598 -78404
16349 -70685 -76254 107080 4615 92369 245658 263254 436421 585941 870226 882266 811273
16338 811273 1181285 1057159 954726 1053872 821130 573013 178641 27439 100870 -229423
16327 -392547 -298266 -144228 -87551 -113651 29993 438464 283230 539281 908449 995523
16317 995523 1008435 1271356 1223589 1470356 1390669 1294731 1067709 1058984 945826 923679 955633
16306 955633 917599 877812 764189 875738 840389 465022 391225 534481 579176 386950
16296 386950 250501 494817 221892 246863 178603 6252 148026 223257 46659 -171792 -93776
16285 -93776 125497 -150795 -44384 291993 361207 147155 163899 522528 347544 486072
16275 486072 706897 975937 962449 1128929 906221 755772 930094 1193509 980261 1009150
16265 1009150 1017381 916590 830402 851026 760060 665683 517337 539933 503178 426306 709133
16254 709133 460719 703829 873187 840026 762638 623628 701914 624651 776551 773179 780276
16243 780276 820208 794985 859766 1234311 1134826 1035253 1148905 823412 956525 780471
16233 780471 918284 955945 737371 728276 544970 491802 596925 539607 428120 442760 575079
16222 575079 401426 413204 726670 500896 399954 629798 670041 468723 689213 628140
16212 628140 539672 565623 513825 617891 649289 572507 864741 674094 666989 614084 515707
16201 515707 478461 442623 308050 501497 585827 778593 664103 350718 550715 480257
16191 480257 649171 430451 620139 558549 730959 582518 890806 643474 639167 642254
16181 642254 752119 718269 846016 421274 564435 656461 559895 578980 399923 413556
16171 413556 470545 477365 442320 568253 658266 486894 391122 372819 279036 616627 589414
16160 589414 617083 497847 594205 395538 465937 388044 481763 592292 391749 549004
16150 549004 644106 417986 671870 348759 375975 490127 832479 490650 530399 623255
16140 623255 547353 646341 719288 835057 515687 687198 581827 590958 597280 753201 544390
16129 544390 548871 527495 659031 774621 494105 620384 606283 552941 761178 507872
16119 507872 603967 589339 565204 751720 423476 723285 497490 776771 493736 495034
16109 495034 667078 757944 869843 818504 530201 816781 729788 831644 863282 586604
16099 586604 813247 823544 765631 968374 996226 925461 591758 844540 997361 715154
16089 715154 800823 836543 754915 703812 952194 828671 912139 840301 1015312 918600 1058823
16078 1058823 989126 739482 1055665 874256 878407 1246851 1172676 1175078 1054832 1033800 1117286
16067 1117286 1087133 1216156 1125589 1065242 1215242 1186770 1443065 1255920 1311335 1347436
16057 1347436 1255232 1249592 1022318 1339023 1164612 1339799 1308577 1442050 1448992 1530052 1303095
16046 1303095 1484586 1492515 1609291 1268570 1096126 1431452 1547949 1279922 1409524 1653859
16036 1653859 1396994 1603607 1502614 1343111 1476466 1543688 1567606 1698352 1584116 1401895
16026 1401895 1802966 1654711 1716521 1860768 1669299 1720400 1622386 1787023 1812603 1674033
16016 1674033 2080531 1946854 1855854 2106486 2027775 2171190 1911941 1851536 2053214 2143994
16006 2143994 2195365 1994928 2189428 2049365 2039737 1970868 2052468 2356458 1816504 2334181
15996 2334181 2192711 2064974 2165583 2180248 2133870 1933580 2199166 2153538 2019407 1994056
15986 1994056 1916064 2075258 2099087 1987346 2103093 2403295 2239238 2065601 2335282 2115682
15976 2115682 2227671 2071367 2014168 2200819 2299575 2566822 2248094 1984434 2277340 1997890
15966 1997890 2073830 2171194 2019745 1935036 2056958 1943981 1986562 1978464 2300542 1895363
15956 1895363 1963805 2033703 1979530 2061739 2060705 2119688 2032633 2083764 1990254 2234710 2096641
15945 2096641 1999211 2340565 2319283 2376538 2285754 2264019 2301419 2599759 2307178 2388629 2123274
15934 2123274 2432205 2375260 2496714 2728159 2917174 2818667 2832418 2787425 2954203 2832889
15924 2832889 2919433 3133855 3318413 3044351 3373552 3492670 3609984 3646260 4271401 4292242
15914 4292242 4416367 4887867 5125035 5604671 6416180 7293972 8386263 10012303 12700071
15905 12700071 16000313 20369603 26198192 32624453 39996524 47101289 52601485 57092790
15897 57092790 60157752 61339504 60575492 58436389 53905032 47984062 40753053 32832909
15889 32832909 25508175 19227857 14541172 11354468 9080948 7360008 6361096 5566928
15881 5566928 4703597 4470314 4055886 3512273 3309360 3114870 3120706 2996384 2985049 2908883
15871 2908883 2765696 2711660 2769921 2823814 2573403 2514500 2385985 2343731 2297213 2421909
15861 2421909 2501694 2291369 2387595 2135159 2136095 2170024 2247522 2161093 2112584 1922470 1990504
15850 1990504 2347071 2202930 2031788 2092657 2268857 1910373 2167610 1945738 1761843 1982641
15840 1982641 2000896 2286390 2357448 2317542 2363465 2317314 2217467 2502598 2524417 2572744 2261323
15829 2261323 2440285 2373046 2388802 2234453 2198567 2163708 2108601 2289963 2238271 2089702
15819 2089702 2328613 2078760 2036294 2188080 2125990 2360073 2302830 2183471 2394594 2498489
15809 2498489 2246118 2345538 2368381 2496666 2730608 2527638 2637699 2667140 2329971 2638474
15799 2638474 2718989 2693652 2892830 2997778 3296226 3436910 3468334 3706597 3430478 3964184
15789 3964184 3755049 3919523 4078444 4015239 3978377 4023450 4324919 4272131 4553268 4512892
15779 4512892 4854393 5221878 5289837 5299290 5514084 5281834 5104200 5192421 5447144 5264915
15769 5264915 5223947 5289476 5248704 5198072 5437421 5213451 5517203 5462324 5760066 5708809
15759 5708809 5855988 5632495 5751514 5562507 5450074 5261023 5252905 5388925 5416614 5138438
15749 5138438 5401792 5252367 5178936 5449350 5681388 5566216 5917173 6010030 6148647 6523514
15739 6523514 6814410 6790934 7008982 7063959 7201352 7191909 7310454 7477475 7464621 7423742
15729 7423742 7429493 7579307 7569489 7682615 7734020 7721030 7540802 7638603 7342099 7139135 7276326
15718 7276326 7076709 7207869 7101892 6772282 6891033 6929539 7013306 7044500 6788437 6709491
15708 6709491 6652303 6651367 6362682 6717181 6591479 7081458 7210198 7478064 7856872 7932155
15698 7932155 8139287 8318603 8506330 8395169 8513213 8542320 8579223 8472440 8259946 8551726
15688 8551726 8283485 8021666 8093069 8129264 8030794 7988065 7807295 8016887 7952168 7985318
15678 7985318 7565685 7582897 7601739 7513289 7115915 6906612 6965080 6802750 6681691 6814739
15668 6814739 6739922 6917318 6769002 6928352 7367872 7681754 7691293 8393762 8461087 9178006
15658 9178006 9446274 10050209 10284390 11347192 11979969 12480547 13280052 13819469 14445099
15649 14445099 15176543 15821817 16664336 17235118 17846713 18138730 19097266 19631085 20649820
15640 20649820 21316602 22341686 22877483 23886123 24815804 25098629 25605550 26277743 26122676
15631 26122676 26109296 25646762 25569805 25190226 25078858 24657803 24566485 24232263 24166593 23977930
15621 23977930 23612095 22827119 22128438 21269619 20132179 18992575 18178404 17258159 16285373
15612 16285373 15372408 14944234 14189210 13758943 13392024 12967379 12544520 12354617 11857289
15603 11857289 11441998 11152720 10959419 10853066 10411653 10544631 10243083 10449781 10544518
15594 10544518 10828017 11249664 12110242 14149220 18645147 26485022 35251133 44379201
15586 44379201 51163812 55515781 58286916 59814593 60275300 59019334 56665207 52237577
15578 52237577 43979460 32349364 21599712 15046394 12119896 10233521 9315395 8718384
15570 8718384 8458403 8492186 8240124 8535217 8558436 8633857 8606805 8758452 8936487 9327110
15560 9327110 9645312 10048975 10823577 12484767 15919688 23052509 33293617 45474269
15552 45474269 56726924 64459053 69984582 72775662 74403563 74398725 72597210 68511768
15544 68511768 62162001 49696739 33936157 20923350 13813060 10563231 8637965 7617949
15536 7617949 6913274 6678281 6216389 5996602 6114251 5808377 5998447 5851871 5892553 5580884
15526 5580884 5362926 5494034 5328568 5212860 5144861 5036422 4780493 4670734 4615922 4728052
15516 4728052 4699299 4801762 4729660 4906407 4764092 4894253 5369397 5317242 5445966 5284173
15506 5284173 5622580 5630578 5473317 5585490 5390940 5332966 5043936 5097378 5011622 4952871
15496 4952871 5025383 5017250 4915934 5135054 5136769 5179835 5321420 5264892 5212860 5606356 5547213
15485 5547213 5790278 5759991 6095794 6224601 6339137 6314383 6381300 6544567 6663053 6913773
15475 6913773 6731519 6804462 7144687 7119674 7621141 7960788 8550081 9195991 9974478 10357918
15465 10357918 10709421 10650838 10969062 10965592 10853837 10494513 10200481 9846721 9673685 10027742
15455 10027742 10259669 10439146 10997675 11508342 11922317 12201109 12220950 12207881 12140916 12016326
15445 12016326 11837570 11196327 10779878 10547650 10546681 10176230 10291405 10588159 10496783 10621119
15435 10621119 10597235 10511691 10671479 10420016 10250992 9655480 9560758 9193315 8795204 8699227
15425 8699227 8606719 8183421 7571715 7749411 7532101 7458379 7333090 7192728 6717906 6506107
15415 6506107 6344490 6448134 6326021 6172065 6115314 6216239 5994231 5864591 6090297 6156380
15405 6156380 6118636 6203373 6281547 6373343 6380392 6643328 6687554 6896622 6984872 7075498 7183313
15394 7183313 7216124 7215846 7353102 7136093 7204353 7186833 7199585 7183772 7422881 7207764 7132130
15383 7132130 7063023 7411905 7645492 7441083 7289461 7150351 7338694 7291439 7283067 7185132
15373 7185132 7196366 6805594 7019992 7109859 7059590 7287060 7268973 7423796 7454190 7652581
15363 7652581 7612154 7982910 8071266 8032464 8488931 8430150 8569270 8566052 8687733 9086355
15353 9086355 9072121 9491814 9623598 10405548 11233348 13664627 16957288 21300702 26873972
15344 26873972 31675077 35160793 37328316 39075318 39876271 40102352 39371088 38128491
15336 38128491 35451192 30364287 24337767 19586383 17269684 16046597 15291379 15017697
15328 15017697 14725628 14478407 14196573 13925681 13557648 13372399 13333508 13129743 13474258
15319 13474258 13752003 13988627 14996578 16467368 19200170 24077920 31438881 39847945
15311 39847945 48987586 56554098 62497599 66309521 68367837 69040071 67832489 65178706
15303 65178706 60374348 52151638 41697855 30708906 22383615 17450791 14666165 12992797
15295 12992797 12458277 12185908 12145628 11977048 12096128 12216341 12194487 12139175 12181399 12299429
15285 12299429 12438625 12485640 12234352 12968029 13691450 15680594 19256051 23660845 28342458
15276 28342458 32813849 35578904 37285371 38446521 39096301 38570003 37580815 35669116
15268 35669116 32060782 26654953 20649816 16262828 13675291 12277000 11605185 10968685
15260 10968685 10644863 9769240 9613733 9674155 9251206 9278250 9394013 9535707 9636565 9695438
15250 9695438 10114042 10397395 10559642 10665034 10968019 10479258 10254024 10038837 10112201 9856158
15240 9856158 9855057 9692825 9605892 9749796 9908464 10464526 10918433 11414059 11683079 11979265
15230 11979265 12312087 12210598 12198294 12141969 11916116 11683291 11088484 10918822 10153754 10123756
15220 10123756 9933574 9757256 9911042 10055597 10323050 10459755 10672623 10985764 11111949
15211 11111949 10995476 11070791 10792302 10535127 10415211 9972311 9463089 9003378 8505707
15202 8505707 7890207 7597877 7098742 7007182 6686671 6444972 6376737 6275050 6339377 6450881
15192 6450881 6617564 6663899 7023607 7224649 7117085 7511203 7671398 7607574 7531436 7834421
15182 7834421 7873932 8156336 8022174 8106666 8304531 8506022 8818771 8660232 9052143 8932884
15172 8932884 9039621 9181187 8796605 8888586 8722187 8485338 8847268 8591569 8692754 8602632
15162 8602632 8787742 8583265 8890490 8947253 8806178 9025375 9069046 9102351 9186560 9333839
15152 9333839 9482437 9274625 9137434 8973981 9248147 9040218 8773368 8834956 8657756 8725335
15142 8725335 8773194 8658661 8804913 8805210 8987119 9121186 8986279 9113540 8992524 9099840
15132 9099840 9120037 8890602 8956427 8822032 8789482 8842612 8895478 9087390 8803305 8827402
15122 8827402 8619075 8735680 8406556 8274691 8230922 8157721 8285041 8329071 7907763 8205406
15112 8205406 7682794 7896993 7834480 7926697 8142060 8000282 8216953 7948412 8331187 8243192
15102 8243192 8524824 8942957 9335362 9205151 9424020 9517497 9913494 10243789 10523225 10953864
15092 10953864 11601696 12514184 13891172 15929202 17824800 19923364 21509433 22839005
15084 22839005 23383070 24132697 24343029 24433025 24189700 23509585 22211450 21089004 20603910
15075 20603910 21252027 22706395 24355421 26340587 27749577 28598584 28866396 29838445 29648335
15066 29648335 29796516 29845373 30754192 31380412 32559725 34552957 36074751 37921738 39673249
15057 39673249 41539621 43558146 45558052 46808631 47677130 46270874 44803351 44384529
15049 44384529 45803925 48047800 50148358 51237047 52011083 51865164 51871701 52631657 52783422
15040 52783422 52648897 51698387 49599478 46639878 43426129 41053877 39068407 37677215
15032 37677215 35824842 34571080 33918047 34251593 34958302 36150448 36712895 37515952 38407067
15023 38407067 39286291 40356917 41435643 42141857 42649812 42568356 43455438 46023059 49998216
15014 49998216 54842389 59629694 64149906 68563700 72761265 76555374 79585734 81261519
15006 81261519 82365490 82315150 81215865 80291655 80420308 80623056 81839169 83088933 85335922
14997 85335922 88736198 93920960 99141598 105250787 111369367 116998246 121555947 124727166
14989 124727166 126450516 126761294 125862220 123471744 119535668 114687527 108807756 101802900
14981 101802900 94490544 87742192 81056229 74561147 68171809 61492259 55355400 49831900
14973 49831900 45495199 41701426 38576583 35969819 33823520 32966555 31730476 31619648
14965 31619648 31546835 31737151 31691489 31746277 32091897 32976215 34671738 36800067 40251201
14956 40251201 45141246 51999361 61489295 74413735 90325429 109143643 130984623
14949 130984623 154778448 179932317 206349465 231972800 255322751 275034766 287838566
14942 287838566 291740660 288541246 279867018 268566659 253529355 235989016 217409218
14935 217409218 197246940 174931536 153912852 138237845 128079115 121060845 115064309
14928 115064309 107412830 98535192 89463689 81868021 76797740 73575373 71093854 68755361
14920 68755361 65606403 62409315 58761585 55427766 52341461 49187890 45483781 40293477
14912 40293477 34057809 27386083 22003520 18823497 16471102 15206864 15073336 14820583
14904 14820583 14782311 15158413 15598076 16107709 17131174 18259572 19804252 21714166 24991328
14895 24991328 28544818 32419383 35812422 37985758 39731273 40437227 40607978 40283020
14887 40283020 39381306 37546142 34645086 30457292 25758081 22019789 20036460 18653063
14879 18653063 18122714 18034131 17747886 17851138 18437101 19291517 19893013 20619990 20891242
14870 20891242 21029489 21255630 21590119 21893829 22486681 22441042 22641843 22693577 23537493 25255367
14860 25255367 28732098 33047112 39516948 46291035 53591968 60331372 66868409 71209346
14852 71209346 74434591 75645866 74994530 72437041 67149749 59966303 52630376 44730143
14844 44730143 37045912 29979275 25065986 21853411 20092035 19192493 18667362 17667466
14836 17667466 17256135 16758416 16271232 16120865 15909587 15873698 15675966 15618206 15786437 16329771
14826 16329771 16604418 17307802 17790610 18887631 20594781 23439058 27621755 33089657
14818 33089657 38824590 43924437 47462198 50007684 51289552 51637765 50794994 49024938
14810 49024938 45825667 40983444 34259763 27065316 20780814 16869788 14854584 13530734
14802 13530734 12893631 12303755 12052858 11920753 11935610 11681891 11820645 11593685 11327911
14793 11327911 11066134 10938176 10390590 10409072 10579337 10283380 10049667 10006043 9998183 10291107
14783 10291107 10061210 10090396 10294344 10714842 11449384 11961405 12697252 13022580 13413621
14774 13413621 13542438 13510288 13370972 13414724 13044762 12600895 11932274 11183376 10337135 10453420
14764 10453420 10056637 9802067 9734942 9828848 10086199 10065377 9940818 10303064 10384799 10736579
14754 10736579 11086228 11225925 11422546 11662194 11844509 11957393 12269855 12319076 12580135
14745 12580135 12800100 12910062 13245756 13527483 13805203 14153173 14633360 15479189 16376432
14736 16376432 17796565 19815689 22550634 26762616 32873970 42093162 56268856 75018600
14728 75018600 98094225 123716289 147784644 169189457 185718684 196792985 201946597
14721 201946597 202163987 196317834 183956890 163832186 137602035 109925261 83000279
14714 83000279 60189189 43467719 32890945 26563226 22343761 19657669 17646601 16115344
14706 16115344 14942443 14128492 13245021 12854578 12216373 11315946 10338620 9552943 9203341
14697 9203341 9090106 8829031 8857980 9067427 8573246 8749269 8707960 8857881 8834497 8536996
14687 8536996 8889202 9023426 8868411 8989376 8813823 8961984 8744716 8973766 9486173
14678 9486173 9970431 10496132 11241092 11877873 12492964 12749884 12790804 12812071 12289373 11998390
14668 11998390 11920125 11408851 10971876 10513378 10048561 9840972 9571474 9627051 9521475 9444361
14658 9444361 9190923 9374018 9309623 8974408 7945249 7311832 6553884 6397794 6405031 6866268
14648 6866268 7428350 7753388 8124426 8773519 9186938 9159655 9626060 9759456 9977721 10451696
14638 10451696 10889823 11322601 11462095 11784835 12202386 12208388 12436444 12219899 11861960 11130981
14628 11130981 10780969 9750193 8534250 7751852 6535932 5704240 5122308 4796731 4513022
14619 4513022 4370253 4469903 4416290 4606321 4396829 4724126 4444980 4260621 4312094 4304738
14609 4304738 4345530 4187449 4144150 3954842 4088767 3732332 4099138 4184425 4599742 5230729
14599 5230729 6116268 6690088 7479933 8324905 8848277 8855798 9230052 9086824 9124289 8493271
14589 8493271 7871212 7204421 6438877 5367428 5121918 4885345 4553052 4637128 4852320
14580 4852320 4798776 4555838 4603850 4854453 4516621 4714179 4909352 4589472 4839175 5211739
14570 5211739 5283268 5398828 5767915 6416086 7146733 8371320 8674692 9531858 10752123
14561 10752123 12071517 15200538 19264245 24715668 30379658 34474387 36928263 38322562
14553 38322562 39382351 40186587 40099182 38792416 36392190 32635674 26691705 21051445
14545 21051445 18309338 19620006 23905385 29452868 34932532 39310837 42333302 44529602
14537 44529602 45445299 45242962 43980353 42211350 38465193 32695824 25222762 19310295
14529 19310295 15323099 13297153 12394491 11940114 11984805 11974772 12134112 12339940 13435420
14520 13435420 15126590 18133336 21887693 25528470 28704221 31033797 32500492 33743820
14512 33743820 34234102 34363215 33938427 32439664 29696100 25391924 22096032 21349577 22836512
14503 22836512 26105342 29711538 32714545 34787252 36141514 36692776 36505685 35797990
14495 35797990 35068171 33159769 30679866 26088822 20960245 17078504 14899264 13117293
14487 13117293 11442072 10340074 9350658 8602901 7420497 6267616 5271959 4437562 4190496
14478 4190496 4208097 4000234 4134885 3831254 3924437 4276321 4517874 4788246 5374867 5914357
14468 5914357 6538954 6795536 6983964 6904616 7160149 7391984 7290944 7435587 7616628 7626203
14458 7626203 7830955 8101541 8401965 8569756 8799268 9084112 8946456 8845741 8648562
14449 8648562 8125411 7189784 6958592 6397873 6320478 6121064 6247074 6437287 6735024 7050059
14439 7050059 7323313 7385578 7732872 7927559 8112753 8017131 8426767 8835197 9941563 11114568
14429 11114568 13299357 16345137 20590593 25016443 28737042 32063406 34733310 36214695
14421 36214695 37284243 37618620 37109296 35397193 32351150 28000761 22963976 18704182
14413 18704182 15309615 13078916 11484896 10387344 9554563 8717184 8108732 7833747 7319962
14404 7319962 7331360 7130220 7126937 7307843 7405682 7424974 7846134 8263386 8906859 9975615
14394 9975615 11725514 14801079 18964138 25098635 32082302 39393711 46190375 51139009
14386 51139009 55549826 57851410 58965095 58421362 56257368 52238024 45806644 38147804
14378 38147804 29667150 22876459 17421777 13864492 11349274 9875295 8912267 8660102
14370 8660102 8133363 7403448 7332012 7164692 6841606 6856831 6607279 6784169 6684654 6526202
14360 6526202 6803418 7430112 7815630 8741898 10508149 12146248 14547729 17658219 20817341
14351 20817341 23366746 25486817 27017251 27906118 27997716 27364571 26211433 24516416 21965344
14342 21965344 18687696 15349108 12395308 10522011 9397824 10126927 11637520 14051136
14334 14051136 16428404 17925623 19203774 19742453 20282467 20422445 20376901 19830149 19359944
14325 19359944 17558395 14383075 11578231 10642257 10835984 11097222 11564938 12720785 14064513
14316 14064513 15548676 17764656 20414813 23820387 28208737 34236838 41601402 51159585
14308 51159585 62036763 74536961 87271161 99176254 109085705 115901334 119679751
14301 119679751 119973485 117650440 111719507 102722355 90191682 75576649 61062988 48051124
14293 48051124 38379233 30955111 25370208 21103120 17655922 15363935 13205443 11524299
14285 11524299 10511213 9368870 8686341 7921387 7217353 6580920 6545259 6018107 5900253
14276 5900253 5599385 5378462 5242151 5008308 4967990 4499460 4672914 4193455 4290528 4295673
14266 4295673 3941423 3676478 3589633 3568229 3564243 3287355 3180190 3230409 3284337 3117238
14256 3117238 3067349 3075279 3093141 2960794 2798135 2820525 2929706 2746650 2828422 2805650 2629480
14245 2629480 2549527 2449259 2549954 2624752 2360355 2394412 2335516 2407467 2455607 2466613 2282195
14234 2282195 2158394 2300737 2324365 2304033 2188307 2345762 2241284 2272517 2140406 2151902
14224 2151902 2171367 2312057 2153417 2133489 2023843 2270107 2185059 2354593 2283449 2537886
14214 2537886 2274237 2290705 2365641 2677516 2569399 2873236 3089352 3498954 4066622 4171831
14204 4171831 4297641 4405849 4162933 4250914 4058471 3995394 3885233 3571150 2739486 2370962
14194 2370962 2204138 1892834 2035462 2385197 2332945 2372905 2192313 2202703 2493837 2206010
14184 2206010 2263128 2349710 2012865 2108930 2219674 2062724 2384129 2420136 2450326 2290072
14174 2290072 2025138 2483824 2377949 2589649 2348833 2282626 2236029 1959109 2061306 2045712
14164 2045712 2129627 2216693 1980415 2214284 2072244 1974169 2431811 2543268 2208144 1921817
14154 1921817 2341491 2306671 2422177 2435803 2219737 2570445 2220749 2313883 2650058 2480720
14144 2480720 2555940 2915831 3269493 3884220 4729452 5785224 6735844 7726712 8280477
14135 8280477 8926806 9567690 9565194 9695077 9262478 8939957 8031170 6554124 5441754
14126 5441754 4673346 4150917 3655783 3098577 3205346 3182908 3424874 3443866 3931600 3916759
14116 3916759 4070833 4212200 4256785 4133937 4130767 3866881 3482003 3276158 2895497 2795710
14106 2795710 2571262 2842835 2714987 2900522 2598157 2687077 2784934 3121906 3562249 3883477
14096 3883477 4443483 4360689 4731841 5001430 5190223 5159321 5005166 5060776 4550002 4655852
14086 4655852 4260225 4152214 4640110 4641431 5369197 5245115 5551232 5714927 6005255 5733860
14076 5733860 5777639 5819689 5295870 4865923 4286381 3859027 4035827 3425667 3589320 3617315
14066 3617315 3597963 3552631 3865662 4060629 4205715 4541173 4963220 5453982 5858564 6005014
14056 6005014 6393950 6764021 7041226 7338828 7565761 7881738 7985304 7930188 8417085 9348924
14046 9348924 9778692 10808733 11938796 13337100 14907661 16803842 18671234 21222036
14038 21222036 24341527 28559303 34069383 40996422 50308955 61714244 74209951 87490343
14030 87490343 100540618 110792805 118463637 122913727 123992194 121427574 116044033 107040458
14022 107040458 94431782 79028426 63466549 50066755 39349398 31570945 25915882
14015 25915882 21533122 18401150 15603448 13721273 12161861 10913550 9736715 8673107
14007 8673107 7949309 7331215 6460360 6144184 5788958 5555604 5122643 4906671 4812447 4711501
13997 4711501 4374164 4304246 4286124 3856694 3988960 3944217 4027525 4058806 4102892 4408862
13987 4408862 4494556 4954785 5330630 5869828 6756839 7301614 7577194 8011674 8077874 8227684
13977 8227684 8053582 8091478 7711605 7115077 6815909 6137225 5140103 4875193 4483867 4201539
13967 4201539 3838712 3504952 3395017 3361044 3294805 3105915 3288653 2949460 2722849 2495268
13957 2495268 2719013 2749912 2330115 2468339 2308085 2326441 2731665 2573300 2697688 2852299
13947 2852299 3299050 3394550 3643496 3773422 4037089 4388397 4849108 5759744 6686825 8816992
13937 8816992 11097695 14133630 17060094 19986430 22199070 24232997 25093358 25370049
13929 25370049 25267123 23986805 21473465 18345963 14962697 11908932 8931771 6477186
13921 6477186 4754942 3548587 3084991 2473353 2336677 2143359 2246426 2091261 2005872
13912 2005872 2017140 2048765 1910637 2015635 1811847 1888586 1836453 1924318 1767246 1853499
13902 1853499 1761102 1973020 1671601 1616044 1558943 1716151 1574235 1857439 1826806 1816337
13892 1816337 1829278 1807025 2123088 1810198 1742094 1642480 1769341 1721414 1800816 1986019
13882 1986019 1768050 1834302 1847787 1834763 1855484 1518708 1591457 1748120 1438164 1707027
13872 1707027 1628710 1485482 1603677 1772226 1487816 1884415 1905749 1739475 1726645 1742788
13862 1742788 2093111 1947018 1712910 2059085 1723410 1831202 1834502 2137860 2120345 1739943
13852 1739943 1865060 2075968 1899270 1893863 1953128 1810935 2024641 2105278 1857075 1806336
13842 1806336 1812127 1709966 1838108 1769972 1842592 1669901 1668824 1783285 1511493 1585001 1490307
13831 1490307 1419770 1643685 1402865 1358840 1888358 1531993 1695684 1564686 1866115 1686916
13821 1686916 1552361 1486578 1740573 1651529 1461072 1525106 1542844 1479494 1564376 1411948
13811 1411948 1362510 1567426 1314050 1678907 1545203 1475308 1571574 1408243 1415899 1379744
13801 1379744 1210215 1382176 1525285 1783509 1693639 1630195 1758591 1573732 1792831 1578429
13791 1578429 1693475 1787104 1675887 1723405 1566006 1595193 1386092 1648099 1432039 1478269
13781 1478269 1592873 1310563 1681886 1359382 1427266 1552364 1539006 1521522 1412369 1563313
13771 1563313 1469478 1455162 1619128 1572922 1700848 1608988 1423902 1613933 1777945 1799129
13761 1799129 1767872 1560155 1672437 1704322 1656611 1385728 1286918 1457573 1585711 1610668
13751 1610668 1494022 1722400 1365327 1702008 1663110 1675168 1822573 1827151 1994623 2044020
13741 2044020 2211407 1938937 2188434 2207563 2085090 2184755 2150233 1952020 2020322 1768631
13731 1768631 1798600 1868052 1705903 1848682 1725333 1818081 1670287 1669031 1792108 1657616
13721 1657616 1664878 1602174 1687601 1734866 1771567 1792826 1591336 1692321 1673087 1748277 1761727
13710 1761727 1822045 1665271 1794224 1742100 1796355 1832427 2155967 1872391 1902175 1896084 1829632
13699 1829632 1952087 1974491 2238744 2106847 2413047 2412824 2565417 2581244 2723879 2995722
13689 2995722 2581610 2775652 2752089 2674290 2493835 2324576 2174019 1904362 1919719 1822724
13679 1822724 1792186 1950987 2040071 1972966 2264149 1965232 2057751 2209320 2257103 2286586
13669 2286586 2523438 2181772 2628405 2717393 2878745 3209097 3118282 2996169 3445894 3352733
13659 3352733 3625479 3325095 3482262 3202341 2859932 2789052 2561616 2446143 2299173 2200812
13649 2200812 2093973 2018056 2118043 2082607 2000119 1987274 2157028 2356283 2222690 2347852
13639 2347852 2115191 2157825 2210904 2521973 2522573 2592980 2758985 2956669 3049680 3223121 2825287
13628 2825287 2947055 2840134 2755163 2679004 2468967 2181891 2203917 1814673 1780096 1756903
13618 1756903 1849961 2040456 1648300 1881991 1781750 1761793 2022758 2068084 1905733 2200914
13608 2200914 2252699 2261264 2246447 2118428 2208083 2298862 2269756 2182302 2035645 1940613 1951697
13597 1951697 2031827 1934964 1697878 2204244 2151520 2211890 2228767 2302948 2148808 2260608
13587 2260608 2368339 2321808 2125294 2112567 2022239 1914888 1682231 1858281 1530725 1780787
13577 1780787 1703643 1761469 1581912 1708960 1870699 1466571 1505527 1962988 1569516 1672606
13567 1672606 1780869 1595088 1783559 1474217 1644060 1728819 1502384 1532737 1459325 1651014
13557 1651014 1531169 1499947 1529601 1559348 1673904 1695506 1717927 1610792 1778062 1559837
13547 1559837 1518487 1585137 1902712 1946261 2074510 2420451 2551585 2728834 2662301 2678989
13537 2678989 2869966 2675689 2587798 2651636 2426308 2202187 2013904 2158038 1861661 2050330
13527 2050330 1939848 2205220 2173996 2457733 2625793 2785639 2534869 2571777 2565845 2536941
13517 2536941 2457475 2378093 2039948 1782793 1721105 1386249 1420220 1432660 1082177 1544164
13507 1544164 1419729 1519194 1397179 1300053 1426216 1281463 1323154 1361339 1453863 1382904
13497 1382904 1297602 1318727 1542595 1432622 1367287 1303898 1358985 1736964 1360846 1468283
13487 1468283 1574169 1348432 1295653 1339980 1347755 1447080 1419807 1313764 1474490 1552466 1438379
13476 1438379 1364341 1425075 1744526 1459582 1451388 1472033 1282488 1258074 1393329 1458290 1540141
13465 1540141 1373689 1359892 1132104 1304411 1638396 1377123 1642373 1746801 1533962 1709476
13455 1709476 1604267 1979258 1911918 2130741 2296899 2600212 2706398 2932779 2538469 2732265
13445 2732265 2512742 2509639 2311120 2165567 2241376 1840943 1762319 1467493 1652282 1652516 1386782
13434 1386782 1624146 1466097 1543020 1521184 1541650 1438955 1536496 1582872 1458031 1817767
13424 1817767 1678951 1980782 2185325 2381662 2427031 2512200 2638816 2485816 2713973 2518408
13414 2518408 2517017 2264384 2217789 2103332 1770823 1500650 1669560 1685145 1621793 1590610
13404 1590610 1720265 1617083 1630317 1577834 1542758 1806217 1595547 1502315 1363616 1763636
13394 1763636 1553944 1779031 1904429 1914183 1761841 1945228 1923076 2170506 2146249 2364898
13384 2364898 2456394 2693227 2692525 2635691 2473567 2517459 2327083 2557429 2662125 2613164 2207189
13373 2207189 1933282 1917967 2119835 1945506 1862141 2067982 1902284 1916603 2058498 2205684
13363 2205684 1893457 2057922 2321699 2116373 2214184 2006316 1930671 2071364 2096131 2397881
13353 2397881 2257815 2319629 2207255 2432610 2484165 2300721 2227592 2311664 2452126 2422391
13343 2422391 2003609 1969448 2015813 2001055 1926842 1746185 1974143 1809501 2052001 2251351
13333 2251351 2234506 2266722 2165810 2057001 2210057 2110555 2180080 2137889 2069899 2057026 2279762
13322 2279762 2046620 2194338 2236058 2302755 2145258 2297507 2540332 2413522 2742066 2746828
13312 2746828 2694198 3230810 2943424 3051522 2949628 3068997 3021531 3059598 2851186 2703557
13302 2703557 2976811 2923948 2859386 3096413 2820733 3292709 3382097 3530856 3610320 3549454
13292 3549454 3347768 3260638 3409397 3403340 3296824 3252473 3311498 3107345 3066281 3375983
13282 3375983 3384702 3492142 3340928 3334932 3413900 3513467 3685091 3734662 3785448 3744670 3819443
13271 3819443 4101294 4028897 4074638 3982646 4123443 3967951 4044309 4424527 4497290 4727825
13261 4727825 4814272 4912851 5102166 5158632 5456422 5391224 5804374 6030443 6267984 6184704
13251 6184704 6584180 6800306 6940359 7175734 7181058 7330080 7413107 7648693 7477590 7508293
13241 7508293 7403018 7718506 7603297 7915925 7807427 8158122 8049307 8324451 8623175
13232 8623175 8941821 9126241 9365022 9915634 10060748 10136668 10813179 11088713 11451575 11443912
13222 11443912 11588112 11478626 11761561 11307889 11329696 11227140 11178716 10822666 10763075 10314899
13212 10314899 10187071 10116203 10062631 9637662 9743265 9731484 9535630 9789076 9325639 9493237
13202 9493237 9371932 9417477 9658126 9660155 9415841 9176343 9313728 8857159 8904577 8558370
13192 8558370 8428418 8599170 8259025 7865700 7513042 7699879 7480582 6893634 6890870 6830663
13182 6830663 6411620 6576443 6459856 6093587 5968752 6011112 5835037 5851669 5696687 5422020
13172 5422020 5390996 5461798 5301269 5205270 5274858 5553688 5508645 5413793 5526043 5563237 5577503
13161 5577503 5870647 5996062 6232277 6363576 6542986 6666987 6847070 6755881 6865772 6782014
13151 6782014 6738766 6761487 6568818 6430022 6640601 6184056 6281353 6201071 6285791 6548896
13141 6548896 6087005 6157091 5784919 5720055 5490630 5353260 5128490 4764072 4399202 4489627
13131 4489627 4297159 4235411 4239440 4030884 4114322 4262510 4044668 3990594 4282577 4107644
13121 4107644 4184198 4069170 3872752 3641157 3713565 3603772 3598341 3331586 3419148 3312269
13111 3312269 3365454 3248863 3396827 3216829 3178325 3280510 3448467 3164458 3315548 3341055
13101 3341055 3548801 3428841 3938697 3853765 4261567 4445523 4708516 5104009 5411716 5748787
13091 5748787 5972141 5835545 6096180 5946256 6157250 6056813 6139152 6175640 5844779 5773414
13081 5773414 5767720 5237277 5577611 5719335 5334551 5121152 5016309 4755039 4245970 4104983
13071 4104983 3430177 3339371 3235378 3331680 3118499 3166028 2903959 2906825 2904364 3140798 2821000
13060 2821000 2975915 3109194 2996834 2945736 3245999 3160162 3119230 3273911 3130820 3164551
13050 3164551 3153421 3237883 3105610 3134421 3067476 2710885 2887677 2960126 3083528 3195072
13040 3195072 3248722 3142378 3100021 3109686 3217488 3364856 3361865 3417643 3599102 3444350 3428512
13029 3428512 3512954 3511843 3727493 3869955 3664182 4075215 3972730 3907391 3864070 3832618
13019 3832618 4173948 4060793 4314785 4241741 4389334 4338269 4488859 4558538 4652001 4649929
13009 4649929 4674485 4942848 4702078 4999901 5059208 5103245 5402906 5253339 5435167 5534722
12999 5534722 5689713 5716357 5825557 5691985 5837364 5897787 6005500 6214069 6308187 6435236
12989 6435236 6315943 6449785 6455570 6390983 6198395 6371465 6477916 6257652 6408545 6397978
12979 6397978 6121568 6405723 6296682 6383829 5934328 6281544 6146032 6144555 5758180 5698960
12969 5698960 5638257 5493951 5476877 5383721 5567651 5658758 5541130 5403811 5431954 5356224
12959 5356224 5242464 5344950 5174237 5337157 5502283 5453785 5184345 5365413 5214119 5424215
12949 5424215 5456031 5402249 5191915 5490052 5454686 5350672 5160393 5210024 5350388 5260905
12939 5260905 5543089 5462697 5442052 5588202 5529325 5780398 5674132 5768841 5892420 5772074
12929 5772074 5944127 5901664 5789555 5649192 5693119 5656100 5508790 5717104 5497259 5592341
12919 5592341 5333251 5269410 5192735 5111233 5201855 5114937 5020027 4859454 4695631 4494336
12909 4494336 4445431 4267423 4439838 4146849 4286084 4150434 4068038 3965350 4108527 3695768
12899 3695768 3829216 3527114 3807860 3541165 3466733 3616805 3388882 3330021 3415016 3290659
12889 3290659 3291929 3200890 3247569 3351033 3260053 3303212 3427697 3207216 3262964 3329006 3168562
12878 3168562 3032366 3234061 3324475 3119170 3214292 3088459 3233495 3179285 3139571 3153295
12868 3153295 2959049 3158104 2935875 3012704 2696046 2938426 2901886 2606632 2953541 2909522
12858 2909522 2822447 2862096 2867894 2743739 2698625 2953475 2750550 2791557 2804957 2870728 2827983
12847 2827983 2806120 2827760 2935913 2877922 2766758 2566496 2964453 2721630 2764667 2776406
12837 2776406 2787433 2775093 2553286 2947214 2880983 2984024 2799235 2722292 2932815 2752117
12827 2752117 2810534 2803225 2687032 2706311 2948299 2758925 2784075 2995108 2768595 2747656
12817 2747656 2827222 2826997 2652657 2633950 2819270 2655245 2767646 2746795 2755447 2614587 2704702
12806 2704702 2732278 2846002 3077441 2833139 2918956 2869781 2909064 2952537 2917340 2768525
12796 2768525 2719431 2931176 2960526 3088991 3100757 3146890 2951147 2988565 3088527 2884245
12786 2884245 3015665 2843887 2930616 3183437 3253273 2981192 3027006 3002429 3088095 3070878
12776 3070878 3014522 2902257 2735998 2753309 2784466 3084504 3013274 2841906 3105968 3182746
12766 3182746 2800237 3079444 3282120 3096590 3185579 3133741 3096053 3170282 2945050 3217808
12756 3217808 3059454 3350715 3253174 3022983 3252653 3012478 2923947 3006459 3180537 2984993
12746 2984993 3136699 2821302 3052149 2888796 3064396 3338028 3223649 3241866 3175884 3311585
12736 3311585 3155204 3100410 3236229 3082003 3189036 3240256 3441332 3216733 3150482 3129133
12726 3129133 2901471 3080661 3349338 3287534 3136640 3262824 3152960 3250169 3237564 3294550
12716 3294550 3220047 3263413 3551524 3293157 3393249 3096134 3398369 3408826 3461294 3433246
12706 3433246 3729357 3645339 3547020 3664166 4003334 3929773 4032585 4216574 3958920 4264372
12696 4264372 4205231 4330512 4208260 4566745 4872614 5126186 5560531 5883970 6658134 7144854
12686 7144854 7414654 7710542 7605750 7787831 7583273 7402680 7027460 6696116 6057362
12677 6057362 5470755 4836330 4936477 4550201 4565538 4560555 4518595 4705544 4920970 4748389
12667 4748389 4912832 5133111 5139786 5269833 5130831 5263845 5001826 5054997 4641360 5108308
12657 5108308 4864374 5041290 4866602 4772621 5103863 5093168 5181447 5532418 5676937 5707829
12647 5707829 5756147 5936041 6164846 6090520 6452811 6541195 6536941 6459430 6650501 6104200
12637 6104200 6638317 6399933 6598426 6637427 6850734 6796744 6480566 6805652 6934817 6931981
12627 6931981 7164854 7111632 7048832 7129950 6882196 6665849 6744153 6586224 6379964 5982399
12617 5982399 5900243 5515896 5396352 5588206 5344157 5584543 5850592 6107307 6389129 7156027
12607 7156027 7416013 7921983 8437177 8710130 8659997 8512610 8316798 8221028 7712410 7282767
12597 7282767 6982565 6509753 6166776 5365791 5520160 5070891 5319136 5260180 5477986 5606339
12587 5606339 5846412 5905496 6075122 5914064 6117467 6428922 6248648 6389412 6925602 6998205
12577 6998205 6909966 7163676 7168684 7292756 7052596 7159434 6863662 6456644 6548578 6286008
12567 6286008 5693323 5263649 5092222 4950415 5081293 5107601 4902443 4936404 4972116 5024483
12557 5024483 5185113 4940326 4966306 4911463 4907288 5018488 5109494 4922828 5060428 4867719
12547 4867719 5382723 5196159 5296090 5361941 5279261 5380356 5587503 5870958 5984071 6159532
12537 6159532 6167839 5926953 6134901 6108740 6052179 6158404 5906244 5708612 5440060 5381176
12527 5381176 5145458 5197318 5269402 5223681 5154504 5302421 5313390 5281653 5532644 5377586
12517 5377586 5656599 5605186 5719905 5981664 6003343 6349062 6969218 7212384 7498488 7663376
12507 7663376 7795978 7968397 7974091 7921716 7824751 7590707 6767820 6582403 6175021 5972205
12497 5972205 5783947 5799559 5951022 5660474 5859784 6010770 5837985 5814145 5947887 5972251
12487 5972251 5845860 6129299 6119524 6228696 6417534 6689059 6806112 7127330 7078805 7323784
12477 7323784 7145646 7394466 7313434 7316959 7254106 7236571 6869281 6483455 6563572 6319783
12467 6319783 6551881 6450090 6490637 6653201 6660546 6754810 7110883 7180453 6936918 7366450
12457 7366450 7510959 7726580 7885813 8195156 8442507 8544774 8932230 9133165 9505668
12448 9505668 10043503 10089247 10471773 10827153 11071340 11305811 11738308 11852153 11965716 11933325
12438 11933325 11984597 11987242 12078278 12030707 12401877 12254030 12244304 12222168 12471447 12430066 12631033
12427 12631033 12811048 13121202 13674574 14019840 14149097 14669043 15018469 15368261 16030955
12418 16030955 16797771 16957514 17621511 18054495 18399185 19187467 19347356 19560829 19454058
12409 19454058 19585615 19476260 19206678 19164153 18389537 18027173 17729549 17432955 16923656
12400 16923656 16663612 16451430 16155305 16175150 15863559 15943538 16180427 15962798 16354641 16502854
12390 16502854 17296014 17436587 17524872 18228263 18647028 19183810 19603389 19771229 20011684
12381 20011684 20172765 20235380 20217760 20234926 20278654 19910989 20024598 19687947 19616663 19647966
12371 19647966 19609540 19299590 19045275 18977449 19114693 18932992 18591567 18551445 18396689 18376128
12361 18376128 18299059 17994742 18108205 17671751 17756433 17491120 17387029 17299050 17254060 17105119
12351 17105119 17110228 16681392 16641737 16486992 16277675 16182595 15926728 15767048 15871250 15916983
12341 15916983 15837969 15938526 16287416 16560036 16704675 17131007 17376182 18024561 18114876 18593561
12331 18593561 19154563 19381351 19723514 19806598 20591704 20704720 21003045 21053039 21259409 21343927
12321 21343927 21359690 21502652 21586164 21797154 21723417 21694649 21848754 21673610 22048062 21777078
12311 21777078 21962350 21953804 22195594 22567382 22647624 23040971 23438132 23788818 24009133 24184267
12301 24184267 24559262 24323172 24248227 24038672 23851716 23473250 23207243 22330300 21786374
12292 21786374 21316607 21100332 20768062 20513499 20016381 19796447 19429835 19220582 18924752
12283 18924752 18353066 17489105 17101971 16392639 16024569 15596521 15025845 14726254 14560315
12274 14560315 14364660 14053035 13942419 13822459 13912820 13792884 13862635 13653215 13599147 13437176
12264 13437176 13519909 13592068 13432420 13346632 13354120 13516190 13383005 13761721 13894752 14130812
12254 14130812 14261765 14724403 15234130 16199858 16889900 17241997 18556635 19498349 20725181
12245 20725181 21814955 23093207 23947473 24828759 25647523 26105731 26224712 26747773 26630044
12236 26630044 26703342 26434428 26134792 25828227 25444713 25308902 24906434 24547668 24146340
12227 24146340 23405002 22986663 22012904 21138698 20029474 18843813 17828810 16804757 15828514
12218 15828514 14718321 14144389 13609435 13125712 12658473 12351263 11970515 12085812 11777786
12209 11777786 11447965 11068223 10931595 10666995 10583332 10381118 10302729 10182004 10079104 10064315
12199 10064315 10284816 10095026 10454342 10542815 10559179 10526870 10489836 10749463 11022651 11024089
12189 11024089 11367463 11509336 11871574 11886925 11983097 12409414 12506572 12574049 12698763 12931150
12179 12931150 13024078 12780247 12595656 12983108 12617250 12532230 12503014 12561329 12324320 12333573
12169 12333573 12115900 12694422 12619406 12499563 12835122 12667062 13484673 13677282 14171049
12160 14171049 14508509 14872676 15217752 15447464 15636807 15472491 15749608 16037924 15840277
12151 15840277 15797306 15554489 15936264 15864837 16071262 16691718 17219440 17862573 18669766 19061888
12141 19061888 20105921 20560101 21115720 22019102 22816043 23655183 24444489 25667501 26869686
12132 26869686 28142997 29636339 31717932 33067445 35391484 37199189 39009912 40971627
12124 40971627 42557454 43878567 45165485 45942452 46423684 46778099 46819547 46676032 45999239
12115 45999239 45490013 44960649 44144885 43444603 42774633 42242257 41617045 41125146 40692451
12106 40692451 40073480 39776546 39277925 39195787 39099625 39113546 39192324 39116710 39030365 38965525
12096 38965525 38680580 38186825 38054345 37681472 36970773 36854331 36301752 36157052 36176973
12087 36176973 36730775 37564634 37900422 38690237 39482697 40526972 41250544 41954992 42164207
12078 42164207 42231528 42283424 41756103 42004627 41986290 41612173 41529002 41007988 40853600 40061833
12068 40061833 39220943 38418840 37525055 36295123 35230369 34148879 32965134 31887171
12060 31887171 31074690 30098146 29469934 28759266 28421876 28140927 27646954 27128768 26631754
12051 26631754 26207902 25669570 25133281 24524880 24211601 23878826 23005038 22913017 22522416
12042 22522416 22003748 21608392 21133676 20590777 20070214 19494794 19204103 18752780 18423361
12033 18423361 18444608 18192892 17994200 18572245 18947028 19160862 19232954 19453117 19636512 19647757
12023 19647757 19390150 18928111 18630963 17981404 17316807 16648698 16113730 15313715 15028951
12014 15028951 14519824 13924720 13749705 13419430 12816810 12941931 12687942 12253438 11928336
12005 11928336 11732245 11541570 11427151 11545917 11863387 11790009 12241735 12198388 11911065 11810194
11995 11810194 11751733 11279925 11168788 10673780 10811912 10610191 10484898 10223849 9885588
11986 9885588 9851064 9675674 9692606 9610379 9245987 9326816 8897129 9039997 8469037 8662651
11976 8662651 8262758 8013961 8163720 8066837 8154123 7683706 7650466 7541657 7277001 6984727
11966 6984727 6888624 6558396 6437365 6311652 6229378 6114053 5890237 6289297 6056396 6346835
11956 6346835 6473103 6552354 6628745 6625089 6847492 6394983 6689745 6538379 6695454 6863777
11946 6863777 6808648 6763990 7110290 7127314 7338656 7514841 7758199 7771237 7878835 8393109
11936 8393109 8500790 8442876 8308818 8408228 8649713 8565632 8663317 8685361 8488482 8425019
11926 8425019 8386943 8226970 8218625 7748287 8002656 7523532 7252403 7276057 7237076 6894515
11916 6894515 6927982 6660442 6439388 6318284 6339139 6275336 7304614 8709430 10644023
11907 10644023 11843719 12750378 13504547 13761143 14083810 13971739 13730787 13266642 12984279
11898 12984279 11315669 8793426 6577472 5742867 5831733 5664046 5262374 5478396 5419916
11889 5419916 5629450 5918945 6315810 6801613 7442002 7505962 8449435 9015507 9410915 9636437
11879 9636437 9771046 10108076 10005177 9745935 9459288 9129213 8364383 8082838 7297465
11870 7297465 6954544 6477863 6112706 5747914 5696553 5302290 5119401 4867273 4806058 4809009
11860 4809009 4892878 4812544 4713725 4861319 4791321 4976036 4904097 5091551 4770204 5189496
11850 5189496 5046099 5586440 5592437 5664673 5847679 6062269 6422588 6900969 7297056 7814524
11840 7814524 7916931 8070422 8053704 7930938 7996730 8112573 7895524 7517139 7560624 7292815
11830 7292815 7183929 6864150 6941854 6877190 6774549 6440158 6406513 6086323 5781338 5591057
11820 5591057 5085857 4932772 4672797 4262344 4157551 4037321 3969754 3824547 3739498 3928285
11810 3928285 3742830 3588164 3637730 3604130 3543983 3520710 3493001 3698312 3286790 3610839
11800 3610839 3503688 3480265 3644804 3475341 3440575 3568283 3693679 3835882 4053208 3957380
11790 3957380 4276497 4468373 4661923 5287770 5474699 5445725 5622172 5813804 5617026 5499740
11780 5499740 5409335 5006441 4683425 4377504 4069354 3599783 3491549 3251318 3183710 3021446
11770 3021446 3092745 3180173 3131960 3235323 3137649 3068408 2856883 3098296 3072523 3271757
11760 3271757 2921753 2906928 2996698 3025153 2928624 2883438 2959344 2815125 2960056 2939635 2958449
11749 2958449 3048932 2842502 2902656 2997556 2922956 3002630 2707099 2791247 2867549 2844947 2860710
11738 2860710 2771113 2862597 2593720 2661925 2747941 2871406 2821432 2702576 2696625 2562554 2781916
11727 2781916 2990352 2747037 2887533 2604916 2581084 2754755 2802415 2647727 2724696 2404296
11717 2404296 2603265 2810960 2539186 2784038 2503630 2566378 3013338 2840377 2635755 2614600
11707 2614600 2758345 2851604 2790659 2751256 2802814 2851889 2941793 2650955 2886456 2875758 2730037
11696 2730037 2830537 2740857 2697635 3000713 2737314 2712332 2507925 2889984 2774138 2923058
11686 2923058 2954081 2842038 2985426 3182864 3175839 2976734 3333032 3090980 3119142 3073378
11676 3073378 3405816 3226589 3365696 2933067 3265953 3354169 3438679 3246550 3325340 3229012
11666 3229012 3205660 3071455 2998699 3187474 3330485 2976586 3361622 3334112 3036816 3248794
11656 3248794 3028485 3200876 3202205 3276604 3074996 3091671 3079440 3185081 3374213 2848769
11646 2848769 3256405 3071587 3318563 3002295 3336890 3279093 3012561 3154766 3281795 3060676
11636 3060676 3226772 3329259 3173948 3248719 3076104 3115873 2907080 3284801 3424822 3227837
11626 3227837 3103060 3212155 3287852 3110691 3272947 3106843 3149267 3046778 3189345 2942175
11616 2942175 3132810 2946967 3101220 3135863 2833475 2876034 3284777 3167500 3079319 3156970
11606 3156970 3274796 3270791 3404474 3368279 3253129 3564427 3221800 3419021 3391599 3581795
11596 3581795 3560921 3702279 3478330 3341308 3455876 3566112 3540246 3570670 3612830 3612223 3313073
11585 3313073 3504624 3436261 3491616 3452071 3511463 3509245 3572795 3627921 3564217 3497541 3392839
11574 3392839 3416381 3621394 3628543 3520818 3792096 3927161 3613330 3665682 3564542 3394648
11564 3394648 3834340 3501115 3715704 3761023 3564958 3677155 3525793 3726814 3484435 3640231
11554 3640231 3330873 3501343 3400239 3659081 3596465 3671810 3606175 3324450 3641019 3461319
11544 3461319 3313468 3498180 3551307 3398809 3263117 3457068 3489905 3506172 3429312 3175022
11534 3175022 3519906 3450642 3384246 3374798 3500252 3629063 3513778 3405064 3490069 3474293
11524 3474293 3399469 3545245 3392010 3379363 3252815 3556804 3477337 3340317 3397695 3452537
11514 3452537 3428467 3575336 3501876 3680243 3412318 3645639 3532831 3615449 3330135 3849248
11504 3849248 3623889 3681001 3592050 3910626 3876030 3692373 3545940 3611817 3748521 3562515
11494 3562515 3718703 3651915 3872561 3697713 3675705 3518626 3812009 3809100 3811371 3960252
11484 3960252 3714721 3585852 4030888 3897746 4115536 3905632 3905375 3981429 3894572 3726613
11474 3726613 3910702 3653080 3836522 4079615 4024167 4172925 3932705 3909315 3884028 3807196
11464 3807196 3917630 3900438 4074075 3836183 3753467 3993409 3841966 3846360 3914528 3786679
11454 3786679 3684800 3778723 3853255 3689091 3637422 4012069 4021852 3752129 4200121 3815747
11444 3815747 3793157 3921975 4037418 3977569 4038419 4033480 4045995 4186486 4319827 4204599
11434 4204599 4042003 4550576 4410614 4485839 4390458 4498915 4575948 4594631 4888425 4619579
11424 4619579 4915657 5206256 5126118 5039702 5139389 5339636 5480466 5230424 5688913 5736110
11414 5736110 5546570 5646908 5798902 5931217 6012854 6093921 6208218 6084300 6326452 6395004
11404 6395004 6637734 6685328 6855259 6904536 7189853 7110591 7389807 7477127 7518649 8116405
11394 8116405 7797808 8066879 8050236 8230622 8386433 8905417 8642600 8671152 8903688 9301136
11384 9301136 9428470 9180951 9291327 9773935 9675947 9872346 9997581 9964920 10034367 10549867
11374 10549867 10659503 10469214 10707680 10779242 10751339 10919628 11239315 11078681 11338871 11104569
11364 11104569 11390305 11460100 11535080 11542716 11646737 11609824 11685991 11476123 11760823 11570701
11354 11570701 11774039 11699504 12021961 11587652 11942737 11865404 11604799 11481447 11462967 11700459
11344 11700459 11508449 11401893 11349247 11429842 11236690 11080094 11043637 11130841 10664228 10809732
11334 10809732 10545095 10593048 10541265 10526020 10287467 10223113 9848448 9710783 9688172 9626971
11324 9626971 9408206 9231101 9310219 9008218 9008355 8894062 8645993 8652883 8365296 8147222
11314 8147222 7958345 8126765 7903079 7425342 7587535 7294325 7245785 7077388 6618356 6483655
11304 6483655 6583645 6535839 6291794 6184205 5941850 5845555 5620933 5892014 5671690 5528250
11294 5528250 5208423 5141217 5153955 4878584 5020455 5066437 5021773 4714866 4852736 4508191
11284 4508191 4353096 4554047 4343141 4397065 4163150 4332823 4109872 4115696 4130146 4101209
11274 4101209 3609557 3743614 3754243 3693771 4040896 3670316 3521001 3528438 3646187 3680301
11264 3680301 3754672 3807043 3420231 3356192 3504627 3208047 3431226 3267131 3328372 3115869
11254 3115869 3417367 3222330 3223435 3044859 3164460 3190569 3203984 3580863 3370354 3235576
11244 3235576 3301528 3196963 3029170 3098754 3244238 3350727 3441874 3212366 3364023 3265102
11234 3265102 3327640 3268854 3370738 3339845 3407746 3232277 3397101 3692941 3871259 4120575
11224 4120575 4929882 5412444 6027479 6759776 6768838 7232757 7231744 7308714 7461500 7051540
11214 7051540 6953465 6122372 5283641 4395599 4117133 3605091 3418992 3465366 3485949 3348132
11204 3348132 3367412 3647185 3534657 3262274 3447113 3475861 3635787 3928787 4147190 5008248
11194 5008248 5706587 6291694 6831469 6901367 7415450 7405952 7490913 7304743 7116333 7094189
11184 7094189 6122585 5072217 4526689 3822087 3854932 3461746 3500236 3374162 3614953 3689708
11174 3689708 3376963 3318765 3439676 3441818 3410070 3457237 3410438 3394513 3554249 3547849 3805260
11163 3805260 3480278 3678460 3879479 3521245 3699640 3754263 3718348 3662214 3637472 3781896
11153 3781896 3697561 3644720 3710996 3731195 3605495 3853236 3712129 3706573 3823126 3558338
11143 3558338 3715076 3848844 3757778 4174262 3971085 3857045 3763475 4010821 3627026 4212120
11133 4212120 4001350 4001874 4209146 3910997 4151700 4000670 4052541 4201974 4251616 4107258
11123 4107258 4196553 4134933 4395149 4232504 4023983 4215062 4155810 4296320 4471286 4528540
11113 4528540 4455617 4448000 4483452 4313442 4388533 4327896 4562711 4439872 4354447 4407021 4398408
11102 4398408 4627222 4520011 4402670 4456731 4357944 4196581 4381874 4370085 4577630 4382276
11092 4382276 4267038 4575251 4449195 4413187 4326833 4294741 4330356 4128690 4215257 4305287
11082 4305287 4279969 4337365 4314054 4128420 4369434 4476282 4230228 4408060 4075795 4691900
11072 4691900 4497395 4461906 4715814 4619534 4657954 5008154 4828621 4985486 4891776 5064429
11062 5064429 5280883 5219394 5245992 5392272 5585102 5468682 5487873 5645626 5605693 5651072
11052 5651072 5728897 5965137 5880765 5846263 6019805 6025439 6248677 6091779 6412508 6219850
11042 6219850 6493983 6725036 6729036 6749862 6944440 7267205 7042317 7692046 7426140 8003857
11032 8003857 8070456 8089187 8508315 8365281 8908840 8983451 9341726 9387117 9589148 9996736
11022 9996736 9879770 10140980 10505692 10278049 10193314 10684666 10971411 10959005 10890374 11197784
11012 11197784 11450907 11336019 11665960 12040167 12253375 12579001 12631675 13140002 13179536 13580900
11002 13580900 13881139 14114980 14526396 14766395 14987446 15358107 15455965 15692862 16095613
10993 16095613 15987264 16323734 16436770 16239773 16645283 16714162 16816326 17329268 17329924 17743731
10983 17743731 18141267 18795596 18901352 19674951 20082643 20576532 20910645 21405879 21633345
10974 21633345 21749764 22434497 22630639 22619251 22451846 22780819 23003740 23352416 23798017
10965 23798017 24415983 24624715 25205330 25748485 26348247 26696588 27498810 27977872 28336141
10956 28336141 29322793 29976101 31035343 31503605 32502337 33259679 33877535 34606071 35267296
10947 35267296 35586541 36493882 36947370 37346023 37870749 38251220 38773558 39536209 40175195
10938 40175195 41347398 42147997 42750484 43977855 44799952 45766149 46710526 47357977 48472507
10929 48472507 49219757 50151762 51145541 51626562 52564685 53435641 54190412 54849775 55464034
10920 55464034 56075103 56325216 56823404 57026511 57265669 57125532 57263474 57319245 56918485
10911 56918485 56754403 56752428 56567498 56555883 56468482 56522884 56829064 57077441 57267681 57528295
10901 57528295 57697791 58075562 58663231 58869615 59418588 60166484 61099965 61564592 62873998
10892 62873998 63815586 65121453 66681913 68551000 70543010 72528533 75130416 77903732
10884 77903732 81193199 84554067 88625165 93362727 97693694 102700646 108026766 113582128
10876 113582128 118351484 123331020 127619213 131277297 133688789 135644249 136119547 135948147
10868 135948147 134332439 132128147 128834424 124686314 120456138 115663365 110748939 105516126
10860 105516126 99998411 94857271 89701608 84775154 79919246 75325156 70737389 66424614
10852 66424614 62598045 58969268 55462909 51963377 49198526 46126287 43424510 40849481
10844 40849481 38459781 36364893 34181584 32162963 30553829 28989255 27320461 26047883
10836 26047883 24634384 23339646 22347344 21271944 20522113 19225575 18462433 17647786 16853963
10827 16853963 16168521 15550581 14949964 14496340 14165801 13382420 13025378 12493870 12291211
10818 12291211 11613415 11453025 11300723 11000643 10307054 10310490 9833395 9623531 9421266 9181074
10808 9181074 9079444 8651377 8732511 8512296 8196350 8145784 8024814 7855104 7443875 7440263
10798 7440263 7288807 7028675 6700747 6679850 6463598 6534441 6013179 6082963 5782461 5985666
10788 5985666 5683356 5721564 5754814 5188029 5426430 5560531 5108137 5329720 4925913 4837756
10778 4837756 5013662 4880919 4672930 4688726 4647804 4517306 4429623 4269107 4214132 4189935
10768 4189935 4296805 4094284 4035153 3993002 4006499 3872151 3982039 3891236 3836893 3922397
10758 3922397 3812257 3662663 3855476 3695346 3839448 3746543 3823118 3865581 3759691 4055990
10748 4055990 3580819 3656614 3520464 3595488 3639288 3422197 3455256 3521560 3432828 3132312
10738 3132312 3278707 3310293 3123768 3220440 3397756 3093503 2954059 3272707 3155555 3150242
10728 3150242 3152652 3419565 3205849 3246939 3010095 3272131 3361558 3241609 3123384 3287184
10718 3287184 3127599 3158773 3101241 3030337 2798775 3149150 3019992 3100576 3029578 3127530
10708 3127530 2939785 3088817 3067402 2921763 2959968 3157440 3153805 3144338 3218778 3176285 3028108
10697 3028108 3157646 3263847 3203717 3021373 3240111 3004214 2820118 3148178 3193584 3010116
10687 3010116 3163531 3112356 3013996 2995274 3036893 2764181 2752069 3163457 2827313 3107355
10677 3107355 2890767 2803630 3178598 3119817 3105565 3309767 3356942 3279313 3287191 2991422 3223175
10666 3223175 3102045 3013465 2820593 2807010 2767940 2806459 2936917 2661245 2554628 2629304
10656 2629304 2618817 2684426 2690022 2889087 2985398 2896924 2823601 3132867 2959760 3085417 2996415
10645 2996415 2875221 2927244 2786454 2313977 2404979 2578040 2481626 2099379 2276920 1841154
10635 1841154 2355845 2037929 2291431 2145539 2311194 2131947 2142106 1773949 1835665 2050354
10625 2050354 2212474 2262323 2067285 2201309 2153173 2155571 1889913 2131511 2096387 2079427
10615 2079427 2088856 2156864 1939101 2167758 2255474 2176063 2063123 2122963 2046764 2010230 1955119
10604 1955119 1912619 1976505 2134987 2079043 1969361 1923095 1934737 2256063 2031771 2042973
10594 2042973 1958805 2109836 2068951 2166640 2064094 2103012 2317306 1979393 2030273 2079269
10584 2079269 1902779 1884526 1931215 2004935 1948734 2055256 2123225 1795165 1928819 2047219
10574 2047219 1918728 2119316 1906425 2088360 2051892 1966366 1937049 2016663 1858853 1997583
10564 1997583 1743121 1734684 1690289 1601565 1764195 1500488 1597602 1671929 1715160 1765099 1547549
10553 1547549 1524059 1618894 1837651 1619636 1672668 1832990 1705636 1687803 1472772 1511003
10543 1511003 1489878 1284786 1720711 1430880 1634054 1677322 1694719 1784653 1477330 1781092
10533 1781092 1578403 1514810 1533414 1849895 1574965 1593140 1721278 1621388 1701607 1729577
10523 1729577 1843280 1832907 1940499 2170724 2275634 2300097 2631157 2900737 2737680 2764321
10513 2764321 2577990 2872973 2737748 2567906 2671833 2141615 1968508 1841691 2081742
10504 2081742 1569066 1951206 2094515 1883285 2014297 2038594 2064031 1979888 2171035 1921784
10494 1921784 2100021 2312132 2418505 2361480 2826794 2873828 2919907 2745829 2954368 2985356
10484 2985356 2889609 2774962 2909444 2578232 2758586 2524958 2265433 2247132 2231933 2244590
10474 2244590 2210277 2179917 2317468 2512185 2098948 2194139 2548657 2531078 2555147 2826257
10464 2826257 3027549 2792145 2783350 2810605 2693506 2841323 2847625 2839826 2524591 2606051 2728758
10453 2728758 2479620 2506359 2394866 2431119 2448900 2526176 2503637 2488957 2879180 2615446
10443 2615446 2672616 2781364 2599452 2703438 3340999 3321501 3840437 4027694 4132534 4100639
10433 4100639 4083433 4179133 4170835 3821878 3665534 3512479 3036165 2844017 2568008 2596030
10423 2596030 2183192 2242904 2482084 2292087 2490191 2506334 2234498 2496132 2590418 2482943
10413 2482943 2474217 2778597 3013629 3099160 3385011 3365320 3438786 3573020 3826754 3814187
10403 3814187 4010261 3940014 3991608 3687629 3591609 3660941 3486734 3731346 3931008 4140636
10393 4140636 4242070 4405835 4384109 4433240 4596971 4742669 4793963 5042143 5120869 5162612
10383 5162612 5104366 5323156 5301672 5538961 5783836 5691930 5807126 5808649 5654486 5656940 5830329
10372 5830329 5634827 5781615 5772057 5897022 5892343 5840214 5732142 5872119 6136613 5957173
10362 5957173 5694290 5757347 5735712 5791034 5408230 5337477 5314733 5093454 5056385 5167337
10352 5167337 5042053 5200765 5138116 5083851 5113902 5103757 4976811 4979344 4944635 4624117 5061307
10341 5061307 4713223 4745995 4587170 4807493 4808661 4983829 4953693 4619629 5332816 5083471
10331 5083471 5075011 5023148 5317789 4945859 5140266 4983671 4926154 4644936 4765677 4825902
10321 4825902 4832747 4918978 4847049 4937632 4720111 4919149 4935314 4883512 4839728 4932545 5190279
10310 5190279 5209027 5443043 5612471 5597638 5786889 5859014 5860639 6053888 6333428 6273367
10300 6273367 6149597 6139638 6323879 6068223 6299021 6272957 6671545 6693395 6977979 7062215
10290 7062215 7526472 7993477 8284463 9012038 9389408 9924396 10412796 11071159 11299929
10281 11299929 11849440 12464907 12957013 13171982 13945946 14174885 14645745 15088621 15549667
10272 15549667 16041134 16108807 16831264 17265903 17764298 18326198 18748520 19333342 20320598
10263 20320598 21065118 21418680 22340873 22842886 23947326 24330826 25101343 25266524 25672462
10254 25672462 25881315 26113924 26270301 26252635 26434660 26582710 26831829 27022321 27476083
10245 27476083 27419729 27751398 27612763 27657867 27498088 27005361 26606809 25804743 25140829 24540288
10235 24540288 23948348 22967752 22565829 21799768 21283228 20849907 20391539 19943822 19664253
10226 19664253 19266582 18594339 18496098 18112833 17825072 17414308 17272477 17354588 17087027 16711135
10216 16711135 16298293 16106609 15912644 15197094 15037768 14511054 13784500 13093974 12757798
10207 12757798 11840469 11519120 11047400 10372773 9829271 9286660 8873325 8407417 8260856
10198 8260856 7782345 7390561 6980383 6905193 6492768 6341226 5850425 5895424 5703915 5782368
10188 5782368 5566806 5661825 5142612 5007989 5135757 4758161 4793031 4903494 4867894 4606681
10178 4606681 4559737 4440822 4517884 4238313 4050644 4402446 4245714 3997476 4135402 3963083
10168 3963083 3835211 3875013 3677012 3744418 3867963 3625109 3646242 3827138 3711584 3683700
10158 3683700 3799433 3528922 3523681 3573550 3562388 3966232 3481922 3479732 3556846 3411017 3429540
10147 3429540 3320482 3287056 3529678 3276431 3343463 3574397 3255646 3130789 3340476 3210405
10137 3210405 3061542 3009006 3242359 3209516 3154587 3095399 3210913 2906748 2958737 3092957
10127 3092957 2721288 2859811 2853074 2763789 2796323 2775626 3120109 2778331 2661823 2674101
10117 2674101 2748146 2761990 2834919 2487628 2576135 2634463 2276484 2627119 2643134 2532173
10107 2532173 2692833 2595914 2435379 2257282 2569252 2590348 2352958 2313486 2580014 2630524
10097 2630524 2453188 2498313 2306314 2353412 2556395 2586177 2463896 2485580 2505979 2521454
10087 2521454 2485535 2256080 2558533 2607778 2366147 2308434 2499368 2379936 2736505 2117393
10077 2117393 2264010 2373992 2232005 2536559 2568934 2445888 2371040 2504332 2344048 2713895
10067 2713895 2623129 2375957 2469733 2608355 2627645 2768909 2732502 2575191 2637521 2622796
10057 2622796 2579997 2580345 2639503 2557232 2727799 2881072 2924690 2680161 2430134 2818796 2643882
10046 2643882 2484587 2651639 2668872 2743485 2653180 2752525 2711728 2632326 2790376 2897812
10036 2897812 2700437 2740548 2654396 2767651 2776392 2649827 2633469 2657476 2974563 2655259
10026 2655259 2627554 2448300 2565730 2578090 2541251 2678084 2728025 2727124 2340226 2402282 2538053
10015 2538053 2486482 2477803 2187519 2284834 2550412 2247089 2437032 2131980 2153474 2309326
10005 2309326 2463494 2117295 2222149 2301159 2183011 2073915 2386963 2026023 2483577 2467054
9995 2467054 2132597 2052733 2038544 1909189 2251305 1924403 1935690 1933465 1809151 1916390
9985 1916390 1881098 1629136 1693981 1903881 1967563 1837607 1613644 1668323 1725361 1450571
9975 1450571 1741800 1545807 1561337 1570932 1556915 1751661 1654202 1389734 1556656 1441176
9965 1441176 1439405 1326188 1389445 1598524 1458855 1415173 1531035 1406196 1196479 1233547
9955 1233547 1373466 1418588 1302080 1228997 1413295 1344440 1178455 1304106 1231866 1395141
9945 1395141 1238134 1403179 1217445 1203701 1163818 1082070 1008068 1353678 1050076 1116081
9935 1116081 1131455 909213 978053 1207176 951175 1095984 882679 1017614 1071766 1121329
9925 1121329 1018853 1038480 1065337 1124069 945727 953870 930632 898785 1135001 792139 978968
9914 978968 951559 878448 892692 843496 874392 842368 1135642 975863 975971 1168234 803288
9903 803288 849632 968045 953983 968233 1226259 1237075 939278 1090582 877863 1021613
9893 1021613 1012134 845101 982720 579631 657275 846847 1002108 747153 920922 975558
9883 975558 1004943 927080 780286 956243 1061848 1000107 1062619 971920 1084089 929621 1109862
9872 1109862 820144 963071 990234 739908 821392 817970 962058 737761 1062651 873703
9862 873703 856103 829232 811919 1017856 859802 968535 952512 974109 756502 1030242 892306
9851 892306 874647 704126 981991 805558 711018 1132697 857907 876654 960952 850845
9841 850845 831551 1030520 690534 1128629 997055 592412 757328 776593 828931 999224
9831 999224 870835 692502 834570 748777 872687 954341 1015070 888233 734084 1151879
9821 1151879 825423 636222 899175 939482 887853 750629 946540 995096 1112926 1039311
9811 1039311 939467 741435 767250 969608 956967 875584 935304 918367 816405 889755 801355
9800 801355 836084 810298 833324 882144 900152 848276 940442 747492 1155372 736504 770400
9789 770400 850118 769768 866170 882295 706851 928390 693142 655724 726276 757865 817806
9778 817806 821035 707158 754381 839531 882847 787629 942914 725180 932158 840396 530001
9767 530001 630100 773737 720289 650700 459907 605002 833528 614006 631156 669928
9757 669928 658007 839218 625429 582743 750072 460698 807078 555730 943140 483961
9747 483961 549540 706375 733118 724819 716342 756421 558385 763349 625841 483026 404418
9736 404418 455048 646150 266034 579719 450544 685233 399943 506366 565840 520125
9726 520125 740579 574561 707274 389462 536709 686628 539456 649356 518726 392000
9716 392000 457853 573362 297333 481971 407971 545986 594052 386057 409618 394398 601151
9705 601151 917683 515949 508781 592218 472802 476840 503420 537983 387459 491637 368518
9694 368518 559272 208672 645161 461694 470459 363086 344264 429630 710647 398158
9684 398158 455462 647316 319480 616024 345186 491597 548001 201878 341602 420434
9674 420434 539017 389413 518649 366146 554867 525775 251169 506276 480525 626230
9664 626230 696416 290274 284854 576896 604340 353816 707764 426724 417018 515797 509851
9653 509851 155513 712232 435919 466849 411044 546149 583493 632427 480552 575269 461897
9642 461897 211660 401835 449240 529131 337742 393391 466551 335332 368549 387470 556058
9631 556058 420165 379344 230637 489489 478435 683980 380723 151584 462170 369722
9621 369722 532727 406678 245593 450723 324940 407835 446817 560592 496089 526486
9611 526486 618020 384886 483163 545416 616260 495782 463066 462591 389780 435620 485821 336491
9599 336491 661815 424481 715939 326224 599734 336432 345200 405012 475902 616451
9589 616451 309272 540028 410182 129078 295205 487409 402637 513004 281402 268340
9579 268340 498515 446249 413760 457724 175871 246000 512028 505309 466368 373852 447724
9568 447724 446409 457001 517003 356057 511336 576526 412765 370707 266226 481431 594166
9557 594166 385387 256857 424550 320472 346640 196199 450811 355303 346398 387049 435835
9546 435835 258791 415527 242619 426031 266859 534673 433808 311502 144621 300716
9536 300716 361382 382035 392774 426887 200073 473499 280928 224829 518548 343950 350849
9525 350849 472019 405978 80158 364183 321369 329251 292536 251671 293771 209810 362891
9514 362891 375801 476450 449435 286942 376997 434834 545196 484967 591733 188832 245110
9503 245110 508839 453742 264274 131385 123748 409196 464021 289208 225398 253260 174105
9492 174105 117201 481590 452222 205808 615626 216210 265978 269933 596124 319518 317413
9481 317413 420084 336179 356282 219864 174079 420058 189457 194646 363395 382074 235732
9470 235732 549061 463108 258699 351768 295929 202740 365322 395613 424810 70342 229252
9459 229252 249914 487279 246930 324820 360760 161716 232817 275231 308604 108917 400959
9448 400959 250006 273362 390677 286790 333625 388411 315306 351958 223727 181756 80051
9436 246622 270448 458116 281863 305517 395339 373692 184034 58816 364837 171569 175042
9425 175042 262063 213029 137266 374302 131925 345464 280297 377478 254719 234125 171112
9414 171112 115272 338752 459442 188606 169146 60268 82904 167402 204051 270771 578567
9403 578567 163312 70668 35932 434032 115837 180688 123390 338153 413587 174090 176868
9392 176868 320107 322296 210852 -197 251954 313877 433952 469846 265565 60692 195364
9381 195364 242630 212804 400669 400427 356906 459882 178711 262323 253039 232646 344965
9370 344965 -122465 171302 467213 358981 228279 140766 335171 324581 304052 243740
9360 243740 353855 270434 197600 367164 216331 -8540 324669 131936 248938 26876 182351
9349 182351 -50041 159530 408499 247837 161587 39288 -15728 392348 228338 159283 79394
9337 145449 278494 8149 278439 385249 444136 -150188 313834 37405 356991 323170 121278
9325 640199 382012 276518 240779 178939 508753 104738 144903 142968 96063 113259 328205
9314 328205 282691 299379 142669 102411 -40918 291162 240622 368345 157417 284864 62167
9302 330623 339493 248042 365396 178813 334483 171817 267279 116848 216918 332085
9292 332085 302428 189290 265290 331464 192881 234613 171869 117360 77959 248265 193763
9281 193763 175490 358974 345348 -21100 138012 282905 309794 194762 255267 253913 127465
9270 127465 402379 236803 246724 317508 116686 130824 342364 222056 316103 300503 300724
9259 300724 48571 230217 159467 376553 191321 123258 356040 355939 -31676 83289 85680
9248 85680 310145 206654 -33481 69246 248578 292057 113933 256736 59535 218179 25944
9236 81649 394871 290237 352945 175011 264699 84377 78232 37597 387977 265018 180090
9225 180090 94860 332328 337336 111791 396514 332760 15029 94480 330032 205304 281325
9214 281325 64047 169940 113814 275934 241643 345053 389298 317050 288005 290828 25919
9202 57497 -29281 87280 362608 54323 276208 80102 234427 201344 208829 24972 363788
9191 363788 201287 -35327 221941 255713 80478 369367 220951 239273 121973 263172
9181 263172 238063 239785 141689 128227 407143 317360 225241 336649 311625 -64207 179538
9169 98768 252632 113289 386409 248411 272311 229006 136958 -29399 73088 111786 501026
9158 501026 177438 258929 289446 297600 302847 233805 130448 72791 386216 -60357 63846
9146 204353 90000 -79724 116032 84927 -43154 354404 274954 46226 217230 -42238 203037
9134 85377 363156 146585 111656 375064 268061 203177 432660 303274 211600 341912
9124 341912 163766 55663 153922 173616 165989 248078 483854 231826 202877 344112 -59876
9112 218981 145404 248726 107769 148589 139214 425400 301879 250131 -60432 158746 250404
9101 250404 -10249 201670 127517 148132 438255 292229 263948 438968 242532 414259
9091 414259 282099 286996 85433 4532 281340 410873 207932 292110 172555 303542 231536
9080 231536 219418 388930 75164 -50698 213801 252960 321921 305019 64155 307482 -62454
9068 471259 416871 154448 329568 248319 356713 263029 212473 207265 243466 200231 166885
9057 166885 142645 218993 193532 216223 259316 180627 258346 483276 302187 238350 42747
9045 286706 93896 199253 152834 182509 362971 237931 203258 203769 273197 65943 -29459
9033 -96480 34168 216139 329262 346453 33208 52401 133870 -124061 62303 501913 37081
9021 134133 58441 139518 466062 302152 378026 361844 323393 172889 136285 110693 469143
9010 469143 -53276 338833 364397 355144 -220673 372918 -84359 156775 252944 366442 231618
8999 231618 277665 -15611 48187 121797 188969 126984 109936 190146 198037 -33616 178584 188644
8987 188644 346498 76037 233828 160361 167939 98015 88568 251483 210082 106659 183303
8976 183303 -117483 161293 166515 236545 319615 359791 9457 93958 7249 135187 81538 -19323
8963 346498 271329 103083 261633 189162 253636 370194 180662 331879 251725 379252
8953 379252 183486 91128 172609 347696 239380 352160 10182 207149 66228 133149 124869
8942 124869 164927 269634 216906 281286 368815 259749 76420 422521 214547 166268 148756
8931 148756 129324 350223 472261 201277 319963 170446 360985 365407 372550 203154 369613
8920 369613 212544 253190 258236 247204 324356 357573 150525 292286 403536 111464 417113
8909 417113 225296 251564 617627 275815 332616 235865 223938 411060 507319 347257 606729
8898 606729 182299 467099 597092 569050 444989 289849 500183 663338 456975 255811
8888 255811 457931 274378 561026 603507 265336 386789 545425 427361 478731 497212
8878 497212 507311 515347 404840 645754 430376 533030 378262 487442 541170 428342
8868 428342 470099 252332 515306 286387 571116 451356 396015 442675 425065 587384
8858 587384 455415 387177 344994 250008 381434 331779 26751 488128 674422 427959 517366
8847 517366 373809 350375 293483 155949 438930 216464 358557 155783 318646 413382
8837 413382 377013 350105 150965 408321 250861 396452 296798 290708 215874 118126 271320
8826 271320 163095 98551 179166 495971 502047 132675 326656 20960 284942 144208 140431
8815 140431 337776 39305 168096 149259 270195 310499 319113 127646 158273 317515 166555
8804 166555 146391 6284 185417 150399 49607 431556 98236 401791 114778 -70974 15131
8792 371490 362499 250511 56826 291476 235839 -86411 91376 244466 249028 154411 353543
8781 353543 95953 51819 182746 22094 98976 70495 139187 163305 143405 222973 186062
8770 186062 51078 47102 90999 231699 120072 255008 126464 421831 260106 47977 61053
8759 61053 131011 293361 90719 -30790 54642 179712 228684 -33839 168151 230116 290983
8748 290983 144156 224963 276020 124760 293993 233027 134731 459670 113938 -91137 244850
8736 121459 84690 39156 250632 121694 107595 180918 115109 224170 62141 218176 39372
8724 241201 23471 151331 123609 72956 -149112 232513 192578 149313 110129 157898 -24594
8712 -18709 100986 91313 198080 250863 284250 97232 145351 110614 212657 412476 55204
8700 -55101 82824 280270 100158 -177280 84418 40976 146262 120301 436536 31687 153780
8689 153780 -41473 190088 193386 200834 141118 244489 183540 266938 181869 -12012 151938
8677 183497 295911 145250 150880 161727 200498 113641 144993 34081 177221 63480 290593
8666 290593 430399 -185186 -57818 321261 203088 136431 170632 211996 94463 126827 91170
8655 91170 115731 352608 -20520 179318 49109 -182818 246017 59059 144585 193096 184763
8644 184763 133547 84471 -30013 237694 140299 -18129 -76971 177355 132822 225660 -283286
8632 292792 279532 64372 118315 -69263 -21451 283179 172224 -27214 413459 104759 38267
8620 271561 127070 53420 151391 -106975 140661 127295 142428 101534 -2984 202789 106056
8609 106056 145873 -38036 75450 74715 199965 46228 -157043 74072 118451 147263 365925
8598 365925 -30200 229718 30537 44312 64920 311484 162205 231397 164013 119608 207028
8587 207028 186037 183986 17621 226447 90760 68709 7118 194982 87168 -71052 -64382 112723
8574 23064 167948 -29077 373834 262123 -53629 266602 537745 207756 43047 18742 305472
8563 305472 89338 183420 -27105 -12022 187288 156964 -57717 174171 104073 26180 18839
8552 18839 144670 196644 242319 133398 109346 222227 20099 164609 88863 331839 177915
8541 177915 73699 163007 289742 211429 205161 105636 257756 332785 74643 120089 115215 114357
8529 114357 59991 108417 152213 167016 -97259 129242 114243 144499 86386 22205 243168
8518 243168 83967 100248 -56565 224274 39708 63757 48818 74141 331836 159648 190225
8507 190225 118289 187707 60227 124515 -12093 123988 216956 25265 -173669 -9005 -15888 314945
8494 365491 -84209 290899 80592 217970 333148 187455 171425 50134 80367 -3821 69050
8482 276257 83772 146368 49953 150509 78249 58163 37262 -121213 270635 87009 199468
8471 199468 53067 213434 101354 89791 139413 196250 164871 339554 -30472 119324 149231
8460 149231 -110863 -17734 55628 103459 -124428 42977 245744 373394 104008 218190
8450 218190 50800 209790 -49718 112542 -111942 53231 15725 205488 215576 118053 170189
8439 170189 -47805 74757 151124 228571 282903 58628 5356 89901 271524 262238 6301 250576
8427 250576 -8558 29236 177556 -43110 66357 425269 38626 311808 -72854 82453 253573
8416 253573 434105 196849 111425 58676 262848 136875 175702 -31863 -262306 430899
8405 33676 83479 189095 36741 7839 145055 -37215 162601 -24910 253886 259436 136458
8394 136458 63076 207587 101894 286758 93910 126490 299646 140976 3175 315095 -15780
8382 82691 7684 148261 305980 211485 79501 151018 389516 90876 38149 119543 73559
8371 73559 204025 23622 63727 82613 143182 161235 293558 207669 136704 25302 12769
8360 12769 67460 63285 138990 197291 168059 98970 -28379 222378 173624 83637 174250 184582
8348 184582 201495 30364 128885 284182 -44674 134101 192009 420479 78182 111229 135889
8337 135889 230107 120182 2762 44944 31527 69615 6960 -159858 -50056 153114 25090
8325 109312 95164 203525 34500 89307 179223 207936 180448 46138 8830 107371 182083 -16402
8312 92444 -153480 190243 42993 150372 -184869 177153 -53959 -24642 167351 160360 -11670
8300 292531 405934 138007 314241 60596 397755 -23165 -50942 293745 -39283 51872 -69652
8288 97088 71976 -1257 -11681 90088 108494 78612 161064 179345 248539 -31533 239914 112894
8275 238195 14278 264237 92890 247575 59919 186252 45027 16921 -111518 301081 75780
8263 149454 141762 128391 -2687 316631 266304 -20056 136942 182578 153851 201119 46657 45351
8251 45351 131914 -48906 -112515 -23198 70332 54087 55832 79892 -15286 181725 261483 -32814
8238 2886 74145 125169 209971 87576 292227 260340 -31635 288591 97711 129409 282283
8227 282283 112786 278318 -67412 201065 105368 -78846 -119497 30080 9492 336342 -16642
8215 252150 -93164 9117 314527 -2215 16166 260720 60073 120208 142454 59138 148627 93764
8203 93764 228805 -28061 215928 29280 141559 113078 244658 96652 99438 -14335 -21403
8192 -21403 369627 224825 -18342 246627 105816 172784 99360 -918 44950 104490 71255
8181 71255 1990 -65860 33946 62160 185369 119495 191508 74592 -54295 -68859 -31711 147531
8168 -31589 75964 -24608 93879 337 137576 5615 118765 11307 90858 45199 174128 -105568
8155 242699 135417 171142 177497 -63423 80261 -18252 90481 113772 172842 167731 31748 139046
8143 139046 71008 243553 57458 54223 200135 59733 132152 -36068 96090 162702 7160 173302
8131 173302 158999 65978 109186 158804 -25340 110288 -130242 -163505 211586 147593 137869
8120 137869 11957 48581 97473 79996 188385 148044 187761 392477 240055 24825 209602
8109 209602 201781 228373 126107 202900 -17271 134241 99402 373189 124728 244693 -34584
8097 185476 -88059 134677 212795 180122 178990 212210 190516 -143574 121834 58667 67731
8086 67731 185199 117997 212695 98265 -11322 -13506 -112893 -82724 173 99406 2767 -81639
8073 248638 183469 41323 -1667 -36048 126313 137000 176737 76372 119286 124214 40721 -58526
8060 229706 238799 74281 78252 70147 11450 353174 40775 -1559 38092 222525 79324 -67258
8047 112476 243601 231734 135998 165071 6814 214139 9346 -18268 105280 155232 73955
8035 -110361 -143541 177698 149439 41692 263879 -73437 157300 163935 45672 294857 105997
8023 -12206 224318 132745 139521 51553 255880 79713 238521 45074 215025 240198 268515
8012 268515 22922 38370 133897 -80455 -109680 -62758 23569 84875 -244072 -86624 147141
8000 70574 65561 58298 296095 -31709 -54355 -9633 66380 216947 71600 -271938 17659 86247
7988 86247 168171 169316 4813 -34960 404083 138441 189344 226330 152695 82659 227387 14118
7975 33550 369270 225769 -157263 -47524 119198 301849 215189 182176 170892 301877 99502
7963 75011 175294 258976 71034 301347 22548 -54268 210644 371662 203226 -137220 -85381
7952 -85381 -26186 183316 184112 14810 162245 153461 -13302 74625 183904 -24184 148016 204760
7940 204760 49242 163008 230566 157123 196158 -87935 115740 117765 -79942 -31914 -186282
7929 -186282 137348 38313 -2666 -87896 128182 29182 188621 62527 71203 -49736 142857
7917 329879 -36021 131522 123215 178788 -133393 -134631 -18634 269208 -46945 49329 -113243
7905 -90790 75695 -70988 184413 71263 60719 206387 571274 -153701 108368 290560 65843
7893 39255 -43241 179515 2963 70958 219058 -67815 -22478 -127532 -43869 133108 245040
7882 245040 -85307 191982 190411 17860 -6574 225033 -119004 71902 84342 118358 196111
7871 196111 111853 1488 -151619 89733 -25883 122924 37788 18137 150781 -123245 184918
7859 -101676 -4753 193908 -49662 46965 27811 3274 82634 94969 277884 23757 138610
7848 138610 163322 -9238 97124 266 90700 171334 164356 98412 145850 61789 157986 159912 -61168
7834 66940 56076 100542 54144 251180 -4892 77780 178341 134352 -20453 47512 316670
7823 316670 240271 179571 292452 -100021 210305 161545 101864 -168769 1433 19175 139840
7812 139840 153712 137500 -35809 233242 -51600 73425 3748 241157 219658 -20600 77677
7800 149466 6516 104137 -59040 105906 60653 -156360 17127 272282 103523 -41104 1548
7788 223957 207124 210944 232647 58608 30957 69359 68894 -22241 92957 186456 156506 -35038
7775 60971 61553 -10113 255194 13485 51377 -35969 -120088 80633 111866 143164 131956 169711
7763 169711 290123 67509 141559 -111881 158868 -70027 -49203 118769 121534 296974 -51937
7751 -79169 81213 -41370 113966 236052 57051 92630 -211589 -25086 116143 166970 111478
7740 111478 166628 -96045 -54192 257710 12598 31328 31006 -171173 96474 57108 237067
7729 237067 237284 -117879 -66430 76596 116148 -44765 -129077 22539 23667 137663 30317 155860
7717 155860 62112 184169 -45146 298369 24725 155856 -90056 -186564 243811 -93222 -237937
7706 -237937 66946 149444 -98518 107364 140127 78376 240355 -109924 162732 59672 135516
7695 135516 12842 80865 153035 253770 163295 182459 -100500 -29227 83243 51339 162597
7684 162597 396010 -48782 38776 3704 127661 -98304 -35979 124452 186904 157634 219762
7673 219762 67238 129338 -15715 67335 -19255 229261 115655 6831 74153 137620 104716
7662 104716 130699 41620 179527 221789 253449 142884 67100 -153122 70613 247019 78014
7650 84699 146189 164016 78773 147282 -47101 127058 -67665 249481 7149 -65934 227900
7638 79489 37323 260912 101723 -98065 111075 153799 -4757 -148850 126676 102145 -115750
7626 187391 -31529 199685 24600 63965 -2744 178897 13173 62797 142063 210399 114378
7615 114378 245083 27749 251845 32063 186033 116911 68535 263386 115173 -70418 58121
7603 110649 352540 193931 232940 220277 103366 -35124 47919 102065 -58979 243562 219525
7592 219525 37063 50491 102421 31774 55598 170111 150207 -103972 -127100 -61539 -235968
7581 -235968 113490 313628 22639 -33401 109224 -40047 158239 148882 154769 -94241 280932
7569 -75850 147518 271768 88644 2886 94270 23048 21852 94445 287036 193841 136474 -84830
7556 162441 -51092 164386 72578 3892 -68730 5753 307829 -41363 -18785 -11636 77149 230245
7544 230245 -289120 -63634 132528 123885 109062 120089 89626 40806 97384 -292663 -57184
7532 32313 9340 -332319 -15009 -8955 -116447 148056 109568 22826 -167756 5484 28516 22052
7520 22052 117448 -18707 -77754 40250 -25332 235996 228277 -432 76619 -4353 -12340 143424
7507 120847 103118 27709 200229 31816 224575 298964 -18513 -213642 117495 108811 124167
7496 124167 83506 391949 114288 -113585 -15235 217920 -145473 77945 175550 169058 94943
7485 94943 -93611 -204436 37074 49848 13036 159953 77333 23462 98064 -147940 -127821
7474 -127821 -7542 -51712 127085 128759 2962 72605 192851 90722 136210 21994 -223100 191996
7461 80228 -29086 91877 74013 26550 -6861 -20984 -312397 3289 22707 109466 -38254 -36492
7449 -36492 -30604 215087 126921 90206 36012 257831 -110359 19520 204275 44859 145731
7438 145731 81557 88427 323570 173776 176174 134559 112730 -107586 -31562 20925 53707
7427 53707 94616 148386 56594 161089 203892 77290 37244 -159961 33091 44146 -60851
7415 189901 28254 3727 56392 74856 62748 140266 -47611 -68568 27648 170089 51912 59505
7403 59505 114091 106348 -27053 -25751 128731 39166 134743 115134 56852 204419 160406 111293
7391 111293 3620 235405 131831 -15444 68726 126904 -13148 -288232 191865 98603 124358
7380 124358 166315 85570 204420 98821 78108 67754 -66087 200561 364841 187748 -80835
7368 111469 161506 162518 123618 86535 174360 223970 239239 104640 -147968 -29689 56643
7356 131640 -13953 -14106 48796 34202 27192 306197 241860 2150 122366 77074 170912 25836
7343 -69910 234101 -35834 77573 84049 146555 211220 -40960 6727 206579 18115 82219 -116478
7330 147511 187793 38340 126077 -5251 89035 -141280 46136 65897 98103 147281 -77968 254276
7317 -55258 236864 62573 -236201 45637 109925 221957 297071 -7961 318350 181623 -128528
7305 -50170 -2623 239243 115907 153599 176729 211475 65796 56015 65650 219522 194604 88331
7292 69377 145158 -5123 -148102 211543 64311 125255 226539 323813 206496 117742 -89653
7280 94405 137960 106240 106490 -53437 -96852 106749 -133885 31727 241089 118493 -188731
7268 -70541 175786 100193 -77815 246578 89831 93279 20081 203334 149547 2514 178707
7257 178707 128963 193182 125698 21428 151416 112681 -10569 179899 123862 130407 74586
7246 74586 190835 -57130 190448 113234 26477 109018 -168175 -144057 -4022 -23708 268839
7234 88150 268424 244046 16418 1610 228433 5014 -19298 -121062 98499 -48421 133956
7222 -162562 48354 21203 -199512 131891 -70928 -85883 83123 102782 79160 19482 -39562
7210 145576 242324 -25386 21670 196279 170499 -37016 -75516 44330 -136738 60384 189745
7199 189745 180812 185111 103330 22369 110364 101598 18000 48108 100996 -56485 184871 21556
7186 -6076 233248 -4579 224390 165417 114336 116925 125415 -69297 135295 -22715 149815 87308
7174 87308 23809 200259 18002 77782 18753 -108809 369193 216344 -44716 124848 103527
7163 103527 113125 38266 -32254 194839 -183062 -12261 140027 -75783 213478 101369 -21389
7151 103697 -22697 -76856 79336 226881 -58265 7847 -1078 -121766 84139 132544 4866 -12007
7138 2127 146894 180625 -78541 164070 -16691 -173054 58380 122735 196369 221773 134846
7127 134846 196098 348661 142449 177621 22642 28348 -425 -110376 -63469 -77737 -30979 -91787
7115 -91787 -145668 75454 264996 2967 149235 162470 207408 76092 -52180 -106941 140998
7103 -60680 315963 94547 82212 146921 -59319 16909 123305 -140166 -51857 143680 -19398
7091 -27775 -60199 253072 28821 -18048 77033 -158118 23175 -47513 23631 -65372 -20050
7079 19716 84285 93255 320837 -46471 -157137 251161 -120731 58601 138425 42515 144347
7068 144347 156514 -109668 197266 27585 -79833 41650 147256 100991 -197172 22428 -10957
7056 21968 180397 -243689 -33640 345844 145118 181436 -135072 14072 121449 54945 -19251
7044 38523 39704 108973 174771 157322 -173693 -58407 202934 -14831 -2349 -368 -12763 -133546
7032 -133546 -77415 33683 42245 121576 180821 -5403 139277 161496 67519 160393 -33934 133691
7019 -18732 47235 133835 114953 226172 124084 -3829 45313 334493 155979 -45158 -76772
7008 -76772 -4636 65707 -150431 -76275 193326 -13549 -81702 115880 136024 82896 63114
6997 63114 -88310 138398 1405 -12172 -16147 -17530 33588 10288 118922 108283 -4449 73747
6984 10711 177945 65841 142352 280707 -170039 107109 265354 -18244 241458 114568
6973 117639 -78737 -137555 49093 -11943 72018 83664 -23970 113961 8183 -49569 244250
6961 10506 302084 -59533 155743 171542 -12292 251830 20625 79433 241610 6438 -163320
6949 -14254 151608 -18231 146036 285096 200946 57835 69959 134258 180532 110781 221854
6938 221854 11917 -20025 147361 68803 -64451 -1316 25144 -123084 248993 -8880 -74785
6927 -74785 -108047 91176 197443 234900 35099 112947 16899 70479 -72342 -32401 108848
6915 -113059 -1535 -55949 167679 327430 -6739 -50332 69639 475477 19566 34664 154078
6904 154078 113840 69587 193714 -52443 151950 333866 151508 106049 130873 -8024 -113597
6893 -113597 -35023 -30679 50121 -98696 3407 40534 46056 -259919 7975 107653 -74353 152732
6880 100409 30745 -7023 132109 -104080 260983 29683 -86610 -82820 108691 -81610 45429
6868 -72300 182594 -158751 116196 16111 -21109 -90440 184940 51176 -105868 -131783 -20028
6856 131316 132237 61812 -121778 157289 133272 -213656 62978 199251 142181 -81968 125640
6844 -204557 183123 -7157 351955 -49663 172700 115694 -82555 61644 -52165 -103027 95590
6832 -51286 254837 149215 98945 215921 234191 52906 85866 -70942 84353 176820 -234280
6820 110310 50720 251712 166725 -32336 103858 261879 40816 22799 68281 -51570 38222
6808 191245 -72372 -32489 -110556 43504 135679 282630 184825 148966 93740 316982 139809
6796 195416 66364 -107424 91029 -123899 124303 -121887 179412 48502 175211 27288
6785 -75546 125945 -84540 6248 111630 47223 -5357 22888 173703 -146834 66843 -51596
6773 40700 145059 101221 -66156 -67809 -28695 95371 116705 82138 209931 -22185 114976
6761 114636 -47924 19975 -80724 7834 -1347 101453 -89830 10802 96275 171931 4104 65051
6749 65051 167917 288549 53775 93709 -151321 11719 129847 162606 165677 -108420 21491
6737 -49293 -21648 -12124 -73212 11197 -113884 121843 -132004 -217562 287470 -182727 155154
6725 26886 -5953 219060 105343 -5849 132105 46496 -73485 -168510 14852 -88968 166712
6713 -153135 -7102 155333 -176785 -94939 -169334 -1902 -141932 219664 -112646 172720 193612
6702 193612 -64411 398841 30684 52110 35771 -31908 50469 -85 6363 -53272 170116 -106213
6689 117972 73327 -98365 95824 -90863 214240 -89060 -33017 81034 -1612 344142 24238
6677 -3016 28388 11382 34256 -89092 -163413 -71724 125625 70914 -72460 206912 91112 146266
6665 146266 47735 148934 41541 123091 -33438 20304 -145485 -236332 58117 102059 10638
6653 -8768 -113944 97349 -57300 98126 -132826 318590 -54776 111484 208498 279334 37445
6641 -62727 -55902 226271 107707 112435 164141 80866 168603 21762 -86936 106217 16845 80690
6629 80690 -72977 348687 -239912 225329 233354 41046 18346 328073 -1580 125739 -12865
6617 71198 -30928 61227 73753 -294685 -134731 34247 -78935 -19346 -27641 63484 149347 113624
6605 113624 87753 68465 246072 61642 21334 -97450 12244 76814 -259474 -56068 226113
6593 -230075 141608 123475 218387 123577 206037 337222 -19993 447910 244489 242073 63733
6581 -205174 18160 -2323 89393 12138 69011 146527 -140018 64350 12955 93516 121007 107615
6569 107615 142601 -50552 128150 251640 -73773 124509 -13112 180921 53382 155458 7210
6557 188739 104638 126997 51387 321200 173068 12330 131957 -98164 -19530 131349 -96734
6545 -55387 -12143 207143 85024 99272 -44798 48300 15013 9320 120458 -114522 162758
6533 57922 84067 297150 40372 58063 -11424 -47148 -44748 -239744 -7170 -70084 274515 324772
6521 324772 -145988 6193 213768 -146209 6112 195769 -128996 93293 82169 122319 190140
6510 190140 52252 116395 -59876 86678 166513 -106919 -4782 124275 4841 230945 70783
6498 -82838 -138721 134425 -82499 -154072 27409 -53836 69757 -209029 -50828 -2700 8000 127554
6486 127554 75615 3393 -235345 295312 -50800 265167 138344 -36418 -120876 -35844 -106748
6475 -106748 1111 -34281 -77344 115339 76051 64815 -5709 90009 154077 14259 205980 157887
6463 157887 -110431 -67010 -56595 321506 56248 -136460 -92903 16790 274060 112271 275112
6452 275112 58240 58905 -22228 113667 -103097 153773 -49071 212009 55280 34342 9250
6440 14379 2424 -137066 48597 49995 -101721 173998 -49755 17663 210027 154576 78584
6429 78584 -211475 166922 -81316 -266450 90767 76565 57349 116175 115654 13617 1326 -9600
6416 185776 41447 5597 4302 -39851 229199 112835 -159002 -132731 -33060 21429 83930
6405 83930 17290 28472 173329 -18082 160656 48728 244396 -2766 261021 45204 87544
6394 87544 99917 -146888 61398 -109751 38373 -145999 152689 -107437 -19398 2044 72253
6383 72253 63052 96551 -5803 107380 19957 189057 -131142 -148167 -79330 5917 181509 211611
6371 211611 -20958 52327 322278 231001 -29228 -99987 88866 -178678 -68633 -82869 -9794
6359 294149 -18241 196762 -220 4640 379777 206643 127780 107684 -16789 109132 168907
6348 168907 -49133 -226494 -6570 144312 139717 52738 188541 263206 -35364 -10164 -188825
6337 -188825 85818 120189 114029 320372 -52812 113309 209024 88655 -122641 169077 59732
6325 51975 -29205 111621 -8549 48166 -26464 197922 42289 -49541 130044 87352 -4311 2126
6312 159296 57553 -132697 197750 43973 74160 -128521 -61664 12311 -103874 174750 -134080
6300 61176 -4319 -43446 85977 30360 -66115 30201 -67556 30910 118923 27605 27159 -157953
6287 99233 -57827 86194 188655 -61713 25152 -134858 53096 137298 -123527 141528 -36054
6275 -31366 63648 -173778 33199 223841 -32327 84123 5558 154891 -54937 97311 146951
6264 146951 65267 118513 122049 64207 32539 131254 70315 -2706 115298 69031 128314 -28088
6251 151364 157926 86374 190357 66314 186635 28050 91984 53633 -179893 80369 -84880
6239 96328 92044 41673 -27021 -94479 100742 81427 89758 -109146 36021 -75055 -3999 215953
6226 226083 280249 109438 4309 107473 -59258 -44934 16811 256464 -138217 -56284 72871
6214 -66081 -832 -129984 43455 10588 174085 35979 30141 121334 84491 31088 -24363 -50165
6202 -50165 -22199 -13689 186610 332932 69735 95719 -37433 83023 93535 169588 118541 189171
6190 189171 28176 48712 84154 143831 113601 -323744 102813 -33364 68441 91867 1830
6178 -7094 -136358 119505 124503 116364 174266 243447 40718 -226369 -113921 -82044 98389 347
$$ [...]
##END NTUPLES=NMR SPECTRUM
##END=
