##TITLE=Coffee green (M4-ROVE80 + 1.5mL buffer 50/50,  450uL extracto + 50uL (D2O+TMS))
without heating, vortex and centrifuged, temperature 0oC.
##JCAMPDX= 6.0         $$ Bruker NMR JCAMP-DX V2.0
##DATA TYPE= NMR SPECTRUM
##DATA CLASS= NTUPLES
##ORIGIN= Bruker BioSpin GmbH
##OWNER= Administrator
$$ 1.72 TOPSPIN		Version 2.1
$$ 2012-05-22 16:15:48.747 -0700  Administrator@X
$$ Compression mode = diff/dup
##.OBSERVE FREQUENCY= 400.13188196
##.OBSERVE NUCLEUS= ^1H
##.ACQUISITION MODE= SIMULTANEOUS (DQD)
##.ACQUISITION SCHEME= undefined
##.AVERAGES= 64
##.DIGITISER RES= 22
##SPECTROMETER/DATA SYSTEM= spect
##.PULSE SEQUENCE= noesygppr1d
##.SOLVENT NAME= H2O+D2O
##.SHIFT REFERENCE= INTERNAL, H2O+D2O, 1, 14.97964
##AUDIT TRAIL= $$ (NUMBER, WHEN, WHO, WHERE, PROCESS, VERSION, WHAT)
$$ ##TITLE= Audit trail, TOPSPIN		Version 2.1
$$ ##JCAMPDX= 5.01
$$ ##ORIGIN= Bruker BioSpin GmbH
$$ ##OWNER= Administrator
$$ $$ C:\Bruker\TOPSPIN/data/jwist/nmr/11-coffee-green-quantification-2/291/pdata/1/auditp.txt
$$ ##AUDIT TRAIL=  $$ (NUMBER, WHEN, WHO, WHERE, PROCESS, VERSION, WHAT)
(   1,<2011-11-18 15:06:38.466 -0500>,<Administrator>,<TOPSPIN>,<go>,<TOPSPIN 2.1>,
      <created by zg
	started at 2011-11-18 14:57:44.091 -0500,
	POWCHK enabled, PULCHK disabled,
       configuration hash MD5:
       DA 63 81 1B EF 4C B5 72 B4 DF EA D9 B4 DB 4C 08
       data hash MD5: 64K
       2E D1 E8 46 11 0E 2D 20 C2 23 6A B6 E9 D8 80 C4>)
(   2,<2011-11-18 15:26:32.607 -0500>,<Administrator>,<TOPSPIN>,<proc1d>,<TOPSPIN 2.1>,
      <Start of raw data processing
       efp LB = 0 FT_mod = 6 PKNL = 1 PHC0 = 0 PHC1 = 0 SI = 32K 
       data hash MD5: 32K
       EC F7 C9 30 F8 5F EF 7E AD F9 58 6F 5C 56 75 FD>)
(   3,<2011-11-18 15:26:32.982 -0500>,<Administrator>,<TOPSPIN>,<proc1d>,<TOPSPIN 2.1>,
      <pk PHC0 = 23.41736 PHC1 = 0 
       data hash MD5: 32K
       A0 6C 64 14 06 01 E9 45 32 BF 1D 3B 2A 4C 32 EC>)
$$ ##END=
$$ 
$$ $$ hash MD5
$$ $$ 0F 39 F0 BC 8D 82 1B 97 92 F5 FC 29 78 CA 4D 91
##$RELAX= 
##$RELAX= 
##$RELAX= 
##$RELAX= 
##$RELAX= 
$$ Bruker specific parameters
$$ --------------------------
##$DU= <Z:>
##$EXPNO= 291
##$NAME= <11-coffee-green-quantification-2>
##$PROCNO= 1
##$TYPE= <nmr>
##$USER= <jwist>
##$ACQT0= -8.17708153138186
##$AMP= (0..31)
100 100 100 100 100 100 100 100 100 100 100 100 100 100 100 100 100 100
100 100 100 100 100 100 100 100 100 100 100 100 100 100
##$ANAVPT= -1
##$AQSEQ= 0
##$AQ_mod= 3
##$AUNM= <au_prof>
##$AUTOPOS= <>
##$BF1= 400.13
##$BF2= 400.13
##$BF3= 400.13
##$BF4= 400.13
##$BF5= 400.13
##$BF6= 400.13
##$BF7= 400.13
##$BF8= 400.13
##$BYTORDA= 0
##$CFDGTYP= 0
##$CFRGTYP= 9
##$CHEMSTR= <none>
##$CNST= (0..63)
1 1 145 1 1 1 1 1 1 1 1 1 1 1 1 1 1 1 1 1 1 1 1 1 1 1 1 1 1 1 1 1 1 1 1
1 1 1 1 1 1 1 1 1 1 1 1 1 1 1 1 1 1 1 1 1 1 1 1 1 1 1 1 1
##$CPDPRG= <>
##$CPDPRG1= <>
##$CPDPRG2= <>
##$CPDPRG3= <>
##$CPDPRG4= <mlev>
##$CPDPRG5= <mlev>
##$CPDPRG6= <mlev>
##$CPDPRG7= <mlev>
##$CPDPRG8= <mlev>
##$CPDPRGB= <>
##$CPDPRGT= <>
##$D= (0..63)
$$ [...]
##$TP= (0..7)
150 150 150 150 150 150 150 150
##$TP07= 0
##$TPNAME0= <>
##$TPNAME1= <>
##$TPNAME2= <>
##$TPNAME3= <>
##$TPNAME4= <>
##$TPNAME5= <>
##$TPNAME6= <>
##$TPNAME7= <>
##$TPOAL= (0..7)
0.5 0.5 0.5 0.5 0.5 0.5 0.5 0.5
##$TPOFFS= (0..7)
0 0 0 0 0 0 0 0
##$TUNHIN= 0
##$TUNHOUT= 0
##$TUNXOUT= 0
##$USERA1= <user>
##$USERA2= <user>
##$USERA3= <user>
##$USERA4= <user>
##$USERA5= <user>
##$V9= 5
##$VALIST= <valist>
##$VCLIST= <CCCCCCCCCCCCCCC>
##$VD= 0
##$VDLIST= <DDDDDDDDDDDDDDD>
##$VPLIST= <PPPPPPPPPPPPPPP>
##$VTLIST= <TTTTTTTTTTTTTTT>
##$WBST= 2048
##$WBSW= 25
##$XGAIN= (0..3)
0 0 0 0
##$XL= 0
##$YL= 0
##$YMAX_a= 5234274
##$YMIN_a= -1932540
##$ZGOPTNS= <>
##$ZL1= 120
##$ZL2= 120
##$ZL3= 120
##$ZL4= 120
##$ABSF1= 0
##$ABSF2= 0
##$ABSG= 0
##$ABSL= 0
##$ALPHA= 0
##$AQORDER= 0
##$ASSFAC= 0
##$ASSFACI= 0
##$ASSFACX= 0
##$ASSWID= 0
##$AUNMP= <proc_prof1d>
##$AXLEFT= 0
##$AXNAME= <>
##$AXNUC= <1H>
##$AXRIGHT= 0
##$AXTYPE= 0
##$AXUNIT= <>
##$AZFE= 0.1
##$AZFW= 0.1
##$BCFW= 0
##$BC_mod= 0
##$BYTORDP= 0
##$COROFFS= 0
##$CY= 15
##$DATMOD= 1
##$DC= 0
##$DFILT= <>
##$DTYPP= 0
##$F1P= 0
##$F2P= 0
##$FCOR= 0.5
##$FTSIZE= 32768
##$FT_mod= 6
##$GAMMA= 0
##$GB= 0
##$INTBC= 1
##$INTSCL= 1
##$ISEN= 128
##$LB= 0
##$LEV0= 0
##$LPBIN= 0
##$MAXI= 10000
##$MC2= 0
##$MEAN= 0
##$ME_mod= 0
##$MI= 0
##$NCOEF= 0
##$NC_proc= -7
##$NLEV= 6
##$NOISF1= 0
##$NOISF2= 0
##$NSP= 0
##$NTH_PI= 0
##$NZP= 0
##$OFFSET= 14.97964
##$PC= 1
##$PHC0= 23.41736
##$PHC1= 0
##$PH_mod= 1
##$PKNL= yes
##$PPARMOD= 0
##$PPDIAG= 0
##$PPIPTYP= 0
##$PPMPNUM= 2147483647
##$PPRESOL= 1
##$PSCAL= 4
##$PSIGN= 0
##$PYNMP= <proc.py>
##$REVERSE= no
##$SF= 400.13
##$SI= 32768
##$SIGF1= 0
##$SIGF2= 0
##$SINO= 400
##$SIOLD= 32768
##$SPECTYP= <>
##$SREGLST= <1H.CDCl3>
##$SSB= 0
##$STSI= 32768
##$STSR= 0
##$SW_p= 8223.68421052631
##$SYMM= 0
##$S_DEV= 0
##$TDeff= 65536
##$TDoff= 0
##$TI= <>
##$TILT= no
##$TM1= 0
##$TM2= 0
##$TOPLEV= 0
##$USERP1= <user>
##$USERP2= <user>
##$USERP3= <user>
##$USERP4= <user>
##$USERP5= <user>
##$WDW= 1
##$XDIM= 32768
##$YMAX_p= 517428266
##$YMIN_p= -132762857
##$CURPLOT= <Network HP LaserJet P1505>
##$CURPRIN= <$Network HP LaserJet P1505>
##$DFORMAT= <normdp>
##$LAYOUT= <+/1D_H.xwp>
##$LFORMAT= <normlp>
##$PFORMAT= <normpl>
##$SURQMSG= 1
$$ End of Bruker specific parameters
$$ ---------------------------------
##NTUPLES= NMR SPECTRUM
##VAR_NAME=  FREQUENCY,     SPECTRUM/REAL,   SPECTRUM/IMAG
##SYMBOL=    X,             R,               I
##VAR_TYPE=  INDEPENDENT,   DEPENDENT,       DEPENDENT
##VAR_FORM=  AFFN,          ASDF,            ASDF
##VAR_DIM=   32768,         32768,           32768
##UNITS=     HZ,            ARBITRARY UNITS, ARBITRARY UNITS
##FACTOR=    0.250966925370066, 1,           1
##FIRST=     8223.43324360094, 83871,        -626795
##LAST=      0,             215297,          -633832
##MIN=       0,             -132762857,      0
##MAX=       8223.43324360094, 517428266,    0
$$ Real data points
##PAGE= N=1
##DATA TABLE= (X++(R..R)), XYDATA
$$ [...]
19432B452908j98866n65978Q56187k98493k44514K95345K76857l04473n5697j00002
19422B113274M72532n40234J99733k95056J73491J63943n1418L59945o23079K68503
19412B241634j67203K23513K0064k71591p9774M78504m48153l89K8460k10958
19402A814107J22212L09060k69341R3001J8053L79428j55364n64334r0015K67652
19392A924459L37571l5393O3022o20768N70176j87355J01192k50456J67851J2207
19382B082506l64946l1129N45803k35445l21026K05190K71940l26977N25567p11458
19372A640025L57671L07565l39440q3767J2319N90189q21155L25739P57648m43445
19362B303349l49656k29507K9054K2039J23410R4373n7678K86309n58870M1282
$$ plain form
19432 2452908 2254042 1688064 2544251 2245758 2001244 2296589 2573446 2268973 2213276 2113274
19422 2113274 2585806 2045572 2245305 1950249 2123740 2287683 2236265 2596210 1973131 2241634
19412 2241634 2074431 2297944 2318008 2046417 1966643 2445147 1996994 1996605 2025065 1814107
19402 1814107 1936319 2245379 1976038 2069039 2087092 2466520 2311156 1746822 1656807 1924459
19392 1924459 2262030 2226637 2289659 1668891 2239067 2051712 2152904 1902448 2070299 2082506
19382 2082506 1717560 1686431 2232234 1996789 1675763 1880953 2152893 1825916 2351483 1640025
19372 1640025 1997696 2305261 1965821 1882054 1894373 2484562 1663407 1989146 2746794 2303349
19362 2303349 1953693 1724186 1753240 1775279 1898689 1993062 1935384 2221693 1662823 1704105
19352A704105J67042j43955K1718j82509M79176n63520O61654j70057K41536m92161
19342A723029N4781n1736J68431j19331m7501k55901K27673K32276K98836l52121
19332A878436M0930k69306M08612l93579K16328l48569M14951k78539J429L09944
19322A980637k81302K78607k37687K88672m75516J03438J09128J58798r8749J01213
19312A927239o13606L06378P4913j51275L46815j79869m48788O39046l264L16194
19302B213783k62693P6532M9774j93739K66801o06190N42427R9211k70941L16629
19292B231594n72723M5077M52526J27586o17099j51332k33092L15473j23090N24654
19282A999574N32804j253374P34231K90423k72822j12635J62637K90659m35319
$$ plain form
19352 1704105 1871147 1727192 1748910 1566401 2045577 1482057 2143711 1973654 2215190 1723029
19342 1723029 1777810 1726074 1894505 1775174 1727673 1471772 1699445 1931721 2230557 1878436
19332 1878436 1919366 1650060 2058672 1665093 1881421 1532852 1947803 1669264 1670693 1980637
19322 1980637 1699335 1977942 1740255 2028927 1553411 1656849 1765977 1924775 1826026 1927239
19312 1927239 1313633 1620011 1694924 1543649 1890464 1710595 1261807 1900853 1897589 2213783
19302 2213783 1951090 2027622 2077396 1883657 2150458 1544268 2086695 2185906 1914965 2231594
19292 2231594 1658871 1703948 2156474 2284060 1666961 1515629 1282537 1598010 1474920 1999574
19282 1999574 2532378 1279004 2013235 2303658 2030836 1918201 2080838 2371497 1936178
19273A936178m87294O44643j87127K06004L4870J61521n68246R9381k6574J8984
19263A832340K3230J83326L5763j42491k96703K21182j31874k06648L9333J34510
19253A691968K73918o0151J24744o40502L96595j19694P2805k74102K39939J60011
19243A865531Q24553l03361P66782k83624N27980l92014N15265m48969q229j11944
19233B951970q34913k9065m37145R3071J3639J79201k90367L47300j36941k05203
19223A651547M58160l43704k37492J61997O1984k14809K1393L6505k2469O5610
19213A638722L35601n55619J68400K36292O7361j08338j59174J71802l51652O47657
19203B091052p52661Q4625L25919r8888k01441r9306Q9209K02552k24658o8714
$$ plain form
19273 1936178 1448884 2093527 1906400 2112404 2147274 2308795 1740549 1839930 1813356 1832340
19263 1832340 1855570 2038896 2074659 1932168 1635465 1856647 1724773 1518125 1557458 1691968
19253 1691968 1965886 1905735 2030479 1389977 1786572 1666878 1739683 1465581 1705520 1865531
19243 1865531 2690084 2386723 3153505 2869881 3397861 3005847 3521112 3072143 3063914 2951970
19233 2951970 2117057 2087992 1650847 1743918 1757557 1936758 1646391 1993691 1856750 1651547
19223 1651547 2109707 1766003 1528511 1690508 1752492 1537683 1559076 1595581 1573112 1638722
19213 1638722 1974323 1418704 1587104 1823396 1890757 1782419 1623245 1795047 1443395 2091052
19203 2091052 1338391 1423016 1748935 1650047 1448606 1349300 1438509 1641061 1416403 1347689
19193A347689L25286l56028N31416m26534O12685o55047O760J20823K71420n82868
19183A195602L31277j08179P5204R802M54238n17461j30254K45358M53298p69069
19173A239816M94430j42856k02522L45233j77196r3753l15590P79461o17991R64034
19163B273066j007071O01526K467n60101O55587m70242K76412o24315N66547K53223
19153A967099m54653K90474l00097L00156j52495j99626N71996k73095n9571K28206
19143A918394M63415p69204Q96742k68958N40597p9950k41749P10200J13465L23503
19133C606455J0935J92968p2808m22174M44499j1452j48442k76476N43868l28279
19123C539094L9105J09418J06452p11333r4850N59194r66976j58037K34425q83463
$$ plain form
19193 1347689 1672975 1316947 1848363 1421829 2034514 1379467 1386227 1507050 1778470 1195602
19183 1195602 1526879 1418700 1493904 1503706 1957944 1440483 1310229 1555587 2008885 1239816
19173 1239816 1734246 1591390 1388868 1734101 1556905 1463152 1147562 1927023 1309032 2273066
19163 2273066 1265995 1867521 1869988 1309887 1965474 1495232 1771644 1147329 1713876 1967099
19153 1967099 1512446 1802920 1502823 1802979 1650484 1450858 2022854 1749759 1690188 1918394
19143 1918394 2381809 1612605 2509347 2240389 2780986 2701036 2459287 3169487 3282952 3606455
19133 3606455 3617390 3810358 3737550 3315376 3759875 3748423 3599981 3323505 3867373 3539094
19123 3539094 3578199 3687617 3794069 3082736 2987886 3547080 2580104 2422067 2656492 1773029
19113A773029L10737O31474o51069J11018Q4446l8352l2285J27401Q3427K32795
19103B632621l1207j37451L94067n26207K90426k2209K82672L08198j70855j62736
19093B857319k74518J86858l96749J84460L96202q5252k58416M08318j66597l11816
19083B539809n00012L87759L50141L86604q4347M07016l3355O09104O24976p2474
19073D615221K27641J251663R95346J436784J368155J076697J426717Q74635k92977
19064A2979882J35573L87692p30606l56308j136402j428060j415848j154674l45229
19055F936020j280496J1164l71388K10320J80099R23296R10192R84004J124007
19046I627218J56825J338550j96687J30880J5358o11519m20211j884123m11059
$$ plain form
19113 1773029 2083766 2715240 2064171 2175189 2259635 2221283 2188998 2316399 2399826 2632621
19103 2632621 2601414 2463963 2858030 2331823 2622249 2600040 2882712 3190910 3020055 2857319
19093 2857319 2582801 2769659 2372910 2557370 2953572 2868320 2609904 3018222 2851625 2539809
19083 2539809 2039797 2427556 2777697 3164301 3079954 3486970 3453615 4062719 4687695 4615221
19073 4615221 4842862 6094525 7089871 8526655 9894810 10971507 12398224 13272859 12979882
19064 12979882 13115455 13503147 12772541 12416233 11279831 9851771 8435923 7281249 6936020
19055 6936020 5655524 5666688 5295300 5505620 5685719 6609015 7519207 8503211 9627218
19046 9627218 9784043 11122593 10925906 11056786 11072144 10460625 10040414 8156291 7745232
19037G745232j307094o60701o01416m27871r7868j43333R35818l65292k79054
19028D798421N24104J290005M34211P99052J304514J258994P86188J970723K13529
19019A3379741K83899L75105m50966k43230j263849j091377o88524j367163j028322
19010G905314q33997J59081J87282j0407J427952J213816P52906N88139N15854
19001A1905940L82380K10257l02521j242123q85148q06450r49537j411572q12102
18992F089124p63569n15780o9391K27392N26903M64565J293894J047646N06722
18983H807506J118976O62829Q13122N63009n14380K30566n34720j390149q12941
18974H943818m79437j017486p64238M41322k81664R1515K23900K29516N36109
$$ plain form
19037 7745232 6438138 5777437 5176021 4748150 4650282 4506949 5442767 5077475 4798421
19028 4798421 5322525 6612530 7046741 7845793 9150307 10409301 11195489 13166212 13379741
19019 13379741 13663640 14038745 13587779 13344549 12080700 10989323 10300799 8933636 7905314
19010 7905314 7071317 7230398 7417680 7407273 8835225 10049041 10801947 11390086 11905940
19001 11905940 12288320 12498577 12196056 10953933 10068785 9262335 8312798 6901226 6089124
18992 6089124 5325555 4809775 4740384 4967776 5494679 5959244 7253138 8300784 8807506
18983 8807506 9926482 10589311 11402433 11965442 11451062 11681628 11146908 9756759 8943818
18974 8943818 8464381 7446895 6682657 7123979 6842315 6933830 7157730 7387246 7923355
18965G923355L16466J003078J542908J424180J838019K978212K620938L450317
18957B3097473L168675L930559M525527M697956M946674L579268K527994K118776
18949E2592902j10311o09711j858396l341305l899767m917008m951353n244981
18941B7660070l797937m061370k954311k511305j589365k159852j488900n04244
18933H592786j111267r51377m67816p63032k79576o7321l69656L64991r20645
18924D027087L38389l57751J38477j92392j5564Q18073o74616Q1217l21895M42018
18914D283043j56782k02263l1410K71623j5096K57851K82482o559O4003J07166
18904D854058N52165J11477N72300K06622N59303P70179K31205J192991J627862
$$ plain form
18965 7923355 8239821 9242899 10785807 12209987 14048006 17026218 19647156 23097473
18957 23097473 26266148 30196707 34722234 39420190 44366864 47946132 50474126 52592902
18949 52592902 52482591 51872880 50014484 46673179 42773412 37856404 32905051 27660070
18941 27660070 23862133 19800763 16846452 14335147 12745782 10585930 9097030 8592786
18933 8592786 7481519 6530142 6062326 5299294 5019718 4952397 4582741 4947732 4027087
18924 4027087 4365476 4007725 4146202 3953810 3938246 4756319 4081703 4162920 3841025 4283043
18914 4283043 4126261 3923998 3892588 4164211 4149115 4406966 4689448 4682889 4746892 4854058
18904 4854058 5406223 5517700 6090000 6296622 6855925 7626104 7857309 9050300 10678162
18895A0678162J526373K300151K585580L282258M637291M473638M193703M110372
18887C7787528L080599K263019Q42676r60698p75608k378216l784900m569598
18879C1504802m794730l273894m585891l058197k419571k331472j611724j115913
18871H313410o09322j233269j104965j94951l14915n34036o63750Q8069P9786
18862C826057o85746L34582q32548J06418l71134K90605j1153l50086O80971r63184
18852B024782K02390N23730o94862k11957N98491k03873l18225J64600L33696
18843B418772n63048K86161k56807K89136k61812M6724J73942m22637L83099n70138
18833A523392J36660J17478k3681m93516L28668K59308k04917j6574J81987m5209
$$ plain form
18895 10678162 12204535 14504686 17090266 20372524 25009815 29483453 33677156 37787528
18887 37787528 40868127 43131146 43973822 43013124 42237516 39859300 36074400 31504802
18879 31504802 26710072 23436178 18850287 15792090 13372519 11041047 9429323 8313410
18871 8313410 7704088 6470819 5365854 5170903 4855988 4321952 3658202 3746271 3826057
18862 3826057 3140311 3474893 2642345 2748763 2377629 2668234 2657081 2306995 2987966 2024782
18852 2024782 2227172 2750902 2056040 1844083 2442574 2238701 1920476 2085076 2418772
18843 2418772 1855724 2141885 1885078 2174214 1912402 1959126 2133068 1710431 2093530 1523392
18833 1523392 1660052 1777530 1753849 1260333 1589001 1848309 1643392 1626818 1808805 1763596
18823A763596J4607q2326j21344J95197M088j57633n00812Q01397q78036K69570
18813A308304L46691M2308m61447Q19690m10329k65254k38317O18606j07104L7850
18803A690998M8086O4319Q6897l43460L46202J43530k30696k05187k9318L65263
18793A936634j92652q2001R8765l22242P31708l39336o4272j38931j3415N55257
18783B169515q06563Q13453o95736K97434q3383K00568m9293q4591L79033p1222
18773B069215q4118m39780j03865K00099N00823l15111j44603J10861J03967J36143
18763B033631j55641p31460O02686n0809k23085L68642K0161r2486R3439p5985
18753A789093j91005k58380L79947j63024l71468M82778k6678L2824n78713N87722
$$ plain form
18823 1763596 1778203 1695877 1574533 1769730 1773818 1616185 1115373 1916770 1038734 1308304
18813 1308304 1654995 1697303 1235856 2055546 1645217 1379963 1141646 1760252 1653148 1690998
18803 1690998 1739084 1803403 1890300 1546840 1893042 2036572 1805876 1600689 1571371 1936634
18793 1936634 1743982 1661981 1760746 1438504 2170212 1830876 1766604 1627673 1614258 2169515
18783 2169515 1362952 2176405 1480669 1778103 1694720 1895288 1845995 1761404 2140437 2069215
18773 2069215 1985097 1545317 1441452 1641551 2142374 1827263 1682660 1793521 1897488 2033631
18763 2033631 1877990 1146530 1749216 1698407 1475322 1843964 1864125 1771639 1865078 1789093
18753 1789093 1598088 1339708 1719655 1556631 1185163 1667941 1641263 1674087 1095374 1683096
18743A683096k39670j07427j1754J31688p7154P11295q62616O70430m34300N00935
18733A964523m33582j75783L56180m07995J33950J75506j83029m07285O53190
18724A675675M4295l46645J68396j12173M10450n77500J54846R3455K58490L69143
18714B138432m79921l27194N80812k63740L81106p13116M48060m67608K3641L52541
18704A673013n6463j41698N29492n36361L92633l17622N09853n01269K31952m16468
18694A367062M30101k42739K16433j83740m5462K01210r3182l60630j06932O26337
18684A808458l11235R0299j79244J41849l7224o6537j93770k7979D79158J054732
18674A533890K43379L59856p57783j70988J98857j15426k72949l7497N98896m91783
$$ plain form
18743 1683096 1443426 1335999 1324245 1455933 1378779 2090074 1227458 1897888 1463588 1964523
18733 1964523 1530941 1355158 1711338 1303343 1437293 1612799 1429770 1022485 1675675
18724 1675675 1719970 1373325 1541721 1429548 1839998 1262498 1417344 1510799 1769289 2138432
18714 2138432 1658511 1331317 1912129 1648389 2029495 1316379 1764439 1296831 1320472 1673013
18704 1673013 1616550 1474852 2004344 1467983 1860616 1542994 2052847 1551578 1783530 1367062
18694 1367062 1797163 1554424 1770857 1587117 1541655 1742865 1649683 1289053 1182121 1808458
18684 1808458 1497223 1587522 1408278 1550127 1512903 1446366 1252596 1224617 479158 1533890
18674 1533890 1777269 2137125 1379342 1208354 1407211 1291785 1018836 981339 1580235 1088452
18664A088452J50118J76944n90772K63281L43591K27536p27459N92556o49445
18655H74802L59677K62460K679j08800Q5213l6250j7839O9595J14153l48389Q4225
18644A341526q9569M2369K33377j88350k1991k76038N76907m1923l08282M9792
18634A317818M9760L25297m11031K763l76874R85862q1528k49426n3089K19744
18624A729296j67394l81757L32392j61961L62112r0275j90857o9246K86415m4708
18614A604017l25203P3414J11260M14399j15779l82202O680O3391m7728P8823
18604A481072L54467j79657j59096j60761K89205k35368K4437J51421k04875k79129
18594A081716L92492o3067N99555m16387J5819L254l11898j83533L30409l59279
$$ plain form
18664 1088452 1238570 1415514 824742 1088023 1431614 1659150 931691 1524247 874802
18655 874802 1234479 1496939 1499618 1390818 1476031 1439781 1421942 1491537 1605690 1257301 1341526
18644 1341526 1251957 1294326 1527703 1339353 1317362 1041324 1618231 1576308 1268026 1317818
18634 1317818 1367578 1692875 1281844 1284607 907733 1893595 1812067 1562641 1509552 1729296
18624 1729296 1561902 1180145 1512537 1350576 1712688 1622413 1431556 1362310 1648725 1604017
18614 1604017 1278814 1352228 1463488 1877887 1762108 1379906 1386586 1449977 1402249 1481072
18604 1481072 1835539 1655882 1496786 1336025 1625230 1389862 1414299 1565720 1360845 1081716
18594 1081716 1474208 1411141 2010696 1594309 1610128 1613382 1301484 1117951 1448360 1089081
18584A089081K87309j93625M53145j41493L00392j0402k66377Q6436q3132k54244
18574A267090O21543q86940J143600j047729M52694j18628l30580M98004K5374
18565A624428j77796o40506J040681H97074P14634o30994L70573J19760N9068
18556A530115k8208l32537R4225p2687L48708j08996J97502k16617j74934Q6395
18546A322966j48913l06957l8713K32069K65420K57885l13397K1930Q6029j05684
18536A272635k22082J03198l0731n9508M5912L2535K06248j49711E55910L28846
18526H84756K25779K62212m64618L68274k51639L53139k98370j62506k06746M34547
18516A144828J51873j93749k94236N60583l61379O82494p21538L78367q2056p8534
$$ plain form
18584 1089081 1376390 1182765 1635910 1494417 1794809 1784407 1518030 1604466 1521334 1267090
18574 1267090 1888633 1001693 2145293 1097564 1550258 1431630 1101050 1599054 1624428
18565 1624428 1446632 806126 1846807 897074 1611708 980714 1351287 1471047 1530115
18556 1530115 1501907 1169370 1263595 1190908 1539616 1430620 1628122 1411505 1236571 1322966
18546 1322966 1174053 867096 828383 1060452 1325872 1583757 1270360 1292290 1378319 1272635
18536 1272635 1050553 1153751 1123020 1063512 1109424 1141959 1348207 1198496 555910 884756
18526 884756 1110535 1372747 908129 1276403 1024764 1377903 1079533 917027 710281 1144828
18516 1144828 1296701 1102952 808716 1369299 1007920 1690414 968876 1347243 1265187 1186653
18506A186653m3322k12258O81804k85580N0887p7404p2951m4756P5059k09462
18496A048670q9620M85478l03349K46849E64876L89793K9735N50713K7345k20264
18486A342198L9767M56832k85832o2598n69750K03289k9263j19676k9381j92284
18476G53302N40077l69909L64464M48797D02908K02504Q57615m78878K70435k26135
18466A028449P2049j78014K73205q3542J04038M52280m24509j42746J44807K81210
18456A527227j56159l59930N350P3903K05763n16760J08976L68927j31217j79134
18446I46946L38087N18378n46265n0947J00033p1407k14589L06453j4111j06908
18436A205670N5687J03770L0129k52495J45520l8829K55031l75993K89069K79698
$$ plain form
18506 1186653 1143331 931073 1612877 1327297 1378184 1300780 1227829 1183073 1258132 1048670
18496 1048670 959050 1444528 1141179 1388028 564876 954669 984404 1535117 1562462 1342198
18486 1342198 1381965 1838797 1552965 1490367 920617 1123906 1094643 974967 945586 753302
18476 753302 1293379 923470 1287934 1736731 402908 605412 1463027 984149 1254584 1028449
18466 1028449 1100498 922484 1195689 1112147 1216185 1668465 1243956 1101210 1246017 1527227
18456 1527227 1371068 1011138 1016488 1090391 1296154 779394 888370 1257297 1126080 946946
18446 946946 1285033 1803411 1257146 1206199 1306232 1234825 1020236 1326689 1312578 1205670
18436 1205670 1261357 1365127 1395256 1142761 1288281 1249452 1504483 1128490 1417559 1697257
18426A697257n07084M15952m67893M21469J51836o71159N09346r3408n8778J36784
18416A534322P8140n97335P24465m62686m86999L07307K3494K68528j95233j53391
18406A040612L7566M86221l65987J09051n29098N29788l66793M96243p0735n3923
18396A312945K07240k19882j7317J24842L6759K79222m00097m46416K61523J03679
18386A242498l26138O69860P029k11384n8470J19814l68948K66182m60587J60079
18376A039935Q3460o4561k49209K7379L59418n8312k44933L92778l6686K06465
18366A455734k81865N0162j8413p2466k69106J54240J58549m28024O19948J30577
18356A499336k39798L9201k23430j09786J29140K82889n12539N10604m49428K27843
$$ plain form
18426 1697257 1190173 1606125 1138232 1559701 1711537 1040378 1549724 1456316 1397538 1534322
18416 1534322 1612462 1015127 1739592 1276906 789907 1097214 1120708 1389236 1194003 1040612
18406 1040612 1078178 1564399 1198412 1307463 778365 1308153 941360 1437603 1366868 1312945
18396 1312945 1520185 1300303 1282986 1407828 1444587 1723809 1323712 877296 1138819 1242498
18386 1242498 916360 1586220 1593249 1381865 1323395 1443209 1074261 1340443 879856 1039935
18376 1039935 1123395 1058834 809625 837004 1196422 1138110 893177 1285955 1249269 1455734
18366 1455734 1173869 1224031 1205618 1133152 864046 1018286 1176835 748811 1368759 1499336
18356 1499336 1259538 1298739 1075309 965523 1094663 1377552 865013 1375617 926189 1154032
18346A154032k08986n1720J80983k49284K61251K61264l08503M15006p3292J89465
18336A570216l86150n34945L63373L12311k5284j50181O9493O612k88502J77886
18326A114829K18644j47809m70559M95958l58758K35044K67124n44323M82153
18317A292303k6244j687J64243l9050M75329l65960L64499p69668j7635R4267
18307A170397j10257O14585H25594O73359j54768N2925K0308m997n94923O22595
18297A440093n60909K57985N10692p43467R96931J10850r14027M17543J39304
18288A654995R1373m17005l96544J46122J83485M06067o81271p0883q6980k7973
18278H01386O81972l88077j49106M72845j72249K17256o74758R5915q9083L11111
$$ plain form
18346 1154032 945046 893326 1074309 825025 1086276 1347540 1039037 1454043 1380751 1570216
18336 1570216 1184066 649121 1012494 1324805 1299521 1149340 1218833 1225445 936943 1114829
18326 1114829 1333473 1185664 715105 1211063 852305 1087349 1354473 810150 1292303
18317 1292303 1266059 1264372 1428615 1389565 1864894 1498934 1863433 1093765 1076130 1170397
18307 1170397 1060140 1674725 825594 1498953 1344185 1397110 1417418 1412421 817498 1440093
18297 1440093 879184 1137169 1647861 904394 1901325 2012175 1098148 1515691 1654995
18288 1654995 1746368 1329363 932819 1078941 1262426 1668493 987222 916339 829359 801386
18278 801386 1483358 1095281 946175 1419020 1246771 1464027 789269 885184 796101 1107212
18268A107212m60517L09036N23306n99483N22753m6078E15192O3565L27136N71015
18258A476908k24936j60351K99404Q0531l0859o57047L37697k3090N14818O5988
18248A679063k90707M304L79756k48553k44084l36979q437O24452p34495O47324
18238A471644k15084L78819o98266P48545k11127n80007L95175j96397P596M1066
18228A141964J91925j51764k39929K08488j14324K86364l13054L45945l51995
18219A003620J24932J96818K13608r7365o5813j26715j54015P24266p60825J79080
18209A237591j09509j03059K85662q0083N2345m03249L11014k09678r5717K81334
18199A166651j4062P969j71J70076m8217K12593l33852n5981L93142l18240M5843
$$ plain form
18268 1107212 646695 955731 1479037 879554 1402307 1356229 515192 578757 905893 1476908
18258 1476908 1251972 1091621 1391025 1471556 1440697 783650 1121347 1098257 1613075 1679063
18248 1679063 1388356 1392660 1772416 1523863 1279779 942800 934363 1558815 824320 1471644
18238 1471644 1256560 1635379 937113 1685658 1474531 894524 1289699 1093302 1100898 1141964
18228 1141964 1333889 1182125 942196 1150684 1036360 1322724 1009670 1355615 1003620
18219 1003620 1128552 1325370 1538978 1441613 1375800 1249085 1095070 1819336 1058511 1237591
18209 1237591 1128082 1025023 1310685 1230602 1282947 879698 1190712 981034 885317 1166651
18199 1166651 1152589 1160558 1160387 1330463 1282246 1494839 1160987 1105006 1498148 1179908 1225751
18188A225751j78878J13860K46133M2427k46811k05335C99105N36600j1186O21463
18178A545982m5529l44382J88913J07928m01126N9604N8788k41296M17954l01610
18168A045226L18654J77183m46326m53107O43124J66045l15184l30134K92907
18159A098388m26776M22456K96098F09963J22174j31303Q24559l74687K84575
18150A335281m02812J82656K76818E03777K87399O63162j87086l0287j116l99936
18140H35913Q52103m05493n83585L94621K92604m10878D53308M88830p360m0701
18130H94077K41344j98959M61458k85228l68638L11904L53502l64018N11497n68629
18120I88310L88710J07701j98369l24117M010M22621n05087N94894m71693J12629
$$ plain form
18188 1225751 1046873 1160733 1406866 1449293 1202482 997147 399105 935705 924519 1545982
18178 1545982 1500453 1156071 1344984 1452912 1051786 1111390 1170178 928882 1346836 1045226
18168 1045226 1363880 1541063 1094737 641630 1284754 1450799 1135615 805481 1098388
18159 1098388 671612 1094068 1390166 609963 732137 600834 1425393 1050706 1335281
18150 1335281 932469 1115125 1391943 503777 791176 1454338 1267252 1236965 1235849 835913
18140 835913 1688016 1282523 698938 1093559 1386163 975285 453308 942138 934778 894077
18130 894077 1135421 936462 1397920 1112692 744054 1055958 1409460 1045442 1556939 988310
18120 988310 1377020 1484721 1286352 962235 966245 1388866 883779 1478673 1006980 1119609
18110A119609J72456n3042M3891l80151L82569l35579O0649J89300k82564M86330
18100A403468j45717J51728J14913l11521M3374M8651J43320l18577L33474j18136
18090A344977j56693Q4686K14379n44007K50207m42292J38332K33085M7691n50704
18080F19661P28841l05257j01901k0992p879K59028l5963j82392M48062F99603
18069D64977K17095N42300k67312J50119j86158K18880m37731K66026K03454E27865
18058I31976K39322L08354l80809r9939l3043J67015j14941n0655L26400j91365
18048A102315E28566Q02433l02708j19633j64987o9526N11322k57527j53311j25945
18038F48684O63688k83192K02520m78413M58538K0540J840n7029q1167N24724
$$ plain form
18110 1119609 1292065 1239023 1282914 902763 1285332 949753 1010402 1199702 917138 1403468
18100 1403468 1257751 1409479 1524392 1212871 1256245 1304896 1448216 1129639 1463113 1344977
18090 1344977 1188284 1272970 1487349 943342 1193549 751257 889589 1122674 1170365 619661
18080 619661 1348502 1043245 941344 920352 912473 1171501 1135538 953146 1401208 699603
18069 464977 682072 1224372 957060 1107179 921021 1139901 702170 968196 1171650 527865
18058 931976 1171298 1479652 1098843 998904 965861 1132876 1017935 967280 1293680 1102315
18048 1102315 528566 1330999 1028291 908658 743671 674145 1185467 927940 774629 648684
18038 648684 1312372 1029180 1231700 753287 1211825 1232365 1234205 1177176 1096009 1620733
18028A620733m22054k16722J11834r5119L21085D77640P68368m53361R205O3802
18018H65654M4520N46500l47198K81714o69263k2858O08054l27442P1461N70792
18008A621934o82354l80750M40330J58738L35306n42438r3087L28483Q1014o072
17998A261104k56323j31434O09815n78740J01686k93203J20908p3225L00096j51434
17988I09250L1158R8391J05167J52000k16034Q9631J65194l9096m81229M04593
17978A219025L86786p40986K81247k08275j2319l6353J94727n7297J39985K38908
17968A405448F98080N84926k2955k36797L75897n96967M56578J36055j44464k7252
17958A223101L19834m52460j60269O43238n49787P8729P7680k31349J86546J13133
$$ plain form
18028 1620733 1198679 981957 1093791 998672 1319757 477640 1246008 792647 801852 865654
18018 865654 910174 1456674 1109476 1391190 721927 699069 1307123 979681 1051142 1621934
18008 1621934 939580 558830 999160 1157898 1493204 950766 857679 1186162 1267176 1261104
17998 1261104 1004781 873347 1483162 904422 1006108 712905 833813 760588 1060684 909250
17988 909250 940408 1038799 1143966 1295966 1079932 1169563 1334757 1295661 814432 1219025
17978 1219025 1605811 864825 1146072 937797 925478 889125 1083852 1026555 1166540 1405448
17968 1405448 698080 1283006 1260051 1023254 1399151 802184 1258762 1394817 1250353 1223101
17958 1223101 1542935 1090475 930206 1573444 1023657 1102386 1180066 948717 1135263 1248396
17948A248396j70055R6104J01641J95346J31301l71171k03439L39514k75497L7779
17938A129919J43534k08930M89287l79345J23690j00281K30232k68336k82122
17929H77648J79877P19841k46425k85645L28331q7091L23268l03912m75645k06584
17919H23663N70288k47241K48458k42194M14427J99931k9262l54402Q0569M25335
17909A889572o11020L62138L6649k49971R0518R4467n049n5324r1281K2623L7872
17898A521194m06384M15615K16869L36649p63331M21914m9923L4225j96397K62675
17888A793106m31226j28752P95054l83829O4570l78534M58278J2407O09064o01031
17878A809107j468m98149O72403m1311Q04K37429n69950K0181L33804n58475k6523
$$ plain form
17948 1248396 1078341 1174445 1276086 1471432 1602733 1231562 1028123 1367637 1092140 1129919
17938 1129919 1273453 1064523 1553810 1174465 1298155 1197874 1428106 1159770 877648
17929 877648 1057525 1777366 1530941 1245296 1573627 1486536 1809804 1505892 1030247 823663
17919 823663 1393951 1146710 1395168 1152974 1567401 1767332 1738070 1383668 1464237 1889572
17909 1889572 1278552 1640690 1677339 1427368 1517886 1612353 1607304 1551980 1460699 1483322 1521194
17898 1521194 1114810 1530425 1747294 2083943 1320612 1742526 1692603 1726828 1530431 1793106
17888 1793106 1361880 1233128 2028182 1644353 1708923 1330389 1788667 1801074 2410138 1809107
17878 1809107 1807639 1309490 1981893 1940582 1941386 2178815 1608865 1629046 1962850 1404375 1377852
17867A377852J74062K04871L12402J030p38363R28713m97115n410n1719M4588
17857A750911M18417q73749Q37159n04801J27582k93532J78613k9577K88711k47643
17847A652091N154k27060O87440r48606Q72726o84024K09385L00572J46408k48818
17837A765268L1347m61658M26789k00644j99868m99040N17118O54346p13249K72839
17827A593248j35045L59865m72501K20938m43996N03535P2300j31181j28408J77977
17817A616732n49792R46360K79728k88147l78943N66838m41925L38525m03432
17808A685944O03028k12082j04676m11122L56965l69539J00350J75898j94066
17799A630700m14595R18216k27878k18809J19225K51444l27591L45388k92765
$$ plain form
17867 1377852 1551914 1756785 2069187 2070217 1331854 2260567 1763452 1758042 1706323 1750911
17857 1750911 2169328 1295579 2132738 1627937 1755519 1461987 1640600 1611023 1899734 1652091
17847 1652091 1657245 1430185 2117625 1169019 2041745 1357721 1567106 1867678 2014086 1765268
17837 1765268 1796615 1334957 1761746 1561102 1361234 862194 1379312 2033658 1320409 1593248
17827 1593248 1458203 1818068 1345567 1566505 1122509 1626044 1698344 1567163 1438755 1616732
17817 1616732 1066940 2013300 2293028 2004881 1625938 2192776 1750851 2089376 1685944
17808 1685944 2288972 2076890 1972214 1561092 1918057 1548518 1648868 1824766 1630700
17799 1630700 1216105 2134321 1906443 1687634 1806859 2058303 1730712 2076100 1783335
17790A783335o17166K82568N20776q13866K54672k01892N94554l96627J06868
17781A513222m26905K15444l49622j9513L92087j47969M09439k54986L5046M37692
17771A803935l03092k08044L06287j3274M5791l34558K3736k79279L52774Q3805
17761A478081Q2673k61208j27709P23365m36921l00172K3376r2540L05883K87499
17751A682327k17867E93546J310869l67856J37998n8925O7568J12120n81603p0520
17741A143197N31355o9726k73931L81236k09341L49343p13218M85916n08301J21019
17731A237549N93443m99906J57420L38019l76838M54028n64381K20474O7609n0784
17721A576633j80419m05669O93095m78580L0470K36628n4225l32701K99921j64355
$$ plain form
17790 1783335 1166169 1448737 1969513 1155647 1410319 1208427 1802981 1406354 1513222
17781 1513222 1086317 1301761 952139 932626 1324713 1176744 1586183 1331197 1366243 1803935
17771 1803935 1500843 1292799 1599086 1585812 1631603 1297045 1320781 1041502 1394276 1478081
17761 1478081 1560754 1299546 1171837 1895202 1458281 1158109 1181485 1088945 1394828 1682327
17751 1682327 1464460 593546 1904415 1536559 1674557 1615632 1683200 1795320 1213717 1143197
17741 1143197 1674552 1604826 1330895 1712131 1502790 1852133 1138915 1624831 1116530 1237549
17731 1237549 1830992 1331086 1488506 1826525 1449687 1903715 1339334 1559808 1627417 1576633
17721 1576633 1396214 990545 1683640 1205060 1235530 1472158 1417933 1085232 1385153 1220798
17711A220798L65446J4903m86669J67527J27605q6149p3577K3818j7192J77105
17701A433615m91338R93151m54690l52957l5327K70280K55937m73141K20391J31842
17691A497763P2072l34263J96945N95660l33588k4744k60097L56486n69929K88856
17681A485161p0854K27251l83960l89126O76236K98475m27388L2022L43460R7887
17671A889164H36970M82800o5767N6895K45121k08613Q1821L70784k44144K57090
17661A812957r9118m74192J57580K21115K14651j562k43794m32375j54033J254622
17651B255851m37966k02115j84614K47766p5110R2546K46273l28700N33005j81574
17641A965362n68905K74806M3157M26428m46644K16691J28553l4516K39744l8531
$$ plain form
17711 1220798 1586244 1601147 1114478 1282005 1409610 1323461 1249884 1273702 1256510 1433615
17701 1433615 942277 1935428 1480738 1127781 1092454 1362734 1618671 1145530 1365921 1497763
17691 1497763 1569835 1235572 1432517 2028177 1694589 1669845 1409748 1766234 1196305 1485161
17681 1485161 1414307 1641558 1257598 868472 1544708 1843183 1415795 1447817 1791277 1889164
17671 1889164 836970 1319770 1254003 1310898 1556019 1347406 1429227 1800011 1555867 1812957
17661 1812957 1713839 1239647 1397227 1618342 1832993 1831431 1587637 1155262 1001229 2255851
17651 2255851 1817885 1615770 1431156 1678922 1603812 1696358 1942631 1613931 2146936 1965362
17641 1965362 1396457 1671263 1714420 2140848 1694204 1910895 2039448 2004932 2244676 2206145
17631B206145O687j39677j89228O65350k33280J89806L43794m49575K3803J82735
17621B606560L1380m69491K11777M83538m02017L2084l5800N3376m33299J203923
17611C282031p74610J37201J2481m92186J99906N54007m72660J28232L19871k23583
17601B670690M04228k2836l12253K42963m20647O1945P349J78740K33614k72393
17591B771400p27532L28102Q31095m51624K18135k69836k88020o4740J5872O99620
17581C062472k86588j22606J44056Q1627n65060M12102k19555L07248o5683j17953
17571B630060L44949o04587J5648P1576k14558N28624o9503l15420M82751k31193
17561B638347L84307o34585j57826M68223p89912O42118j34412k23526j78575
$$ plain form
17631 2206145 2212832 2073155 1883927 2549277 2315997 2505803 2849597 2400022 2423825 2606560
17621 2606560 2637940 2168449 2380226 2863764 2461747 2493831 2458031 2511407 2078108 3282031
17611 3282031 2507421 2644622 2657103 2164917 2364823 2918830 2446170 2574402 2894273 2670690
17601 2670690 3074918 3052082 2739829 2982792 2562145 2624090 2631439 2810179 3043793 2771400
17591 2771400 2043868 2371970 3203065 2751441 2969576 2699740 2411720 2346980 2362852 3062472
17581 3062472 2775884 2653278 2797334 2878961 2313901 2726003 2506448 2813696 2748013 2630060
17571 2630060 2975009 2370422 2386070 2457646 2243088 2771712 2702209 2386789 2869540 2638347
17561 2638347 3022654 2388069 2230243 2698466 1908554 2550672 2416260 2192734 2014159
17552B014159q4683K08453K52643J64120J64199m76032N71366j69104l7847J22893
17542B730167j21136J94283r0973l37184L8343M13214l167p6211k71722K54741
17532B730355k76965j92824K1204O60461p27874O64060O42763r94609M8968J35977
17522B711516J97613l22130J17984J10605l10659J44587L77890m41943M97931
17513C083394Q5786O26313l26005K08588j69225O58580J44088J27559j65926l86025
17503C887127O15641k34825L07832m13198N61128k18061J59170K3240O57166K96572
17493E641792M97335K36039R26984N05267J277878J236656K621043M882600P777680
17484B5603274J2290556J5606122J6006295J3430519J0968015O507207L095514
$$ plain form
17552 2014159 1929476 2137929 2390572 2554692 2718891 2242859 2814225 2645121 2607274 2730167
17542 2730167 2609031 2803314 2712341 2375157 2413500 2826714 2823547 2747336 2475614 2730355
17532 2730355 2453390 2260566 2281770 2942231 2214357 2878417 3521180 2526571 2575539 2711516
17522 2711516 2909129 2586999 2704983 2815588 2504929 2649516 3027406 2585463 3083394
17513 3083394 3169180 3795493 3469488 3678076 3508851 4167431 4311519 4439078 4273152 3887127
17503 3887127 4502768 4267943 4575775 4162577 4723705 4505644 4664814 4688054 5345220 5641792
17493 5641792 6139127 6375166 7302150 7807417 9085295 10321951 12942994 17825594 25603274
17484 25603274 37893830 53499952 69506247 82936766 93904781 100411988 103507502
17477A03507502N07297k906930o820364j0881855j1876784j2471162r161907l314444
17469D6581353L785942J0707681J3159667J3316628R632690O330132L478148j30721
17461A06861520l466603o510902j1068682j3252528j4658334j4148524j1210897
17454C2545050p790864n996448l729052j923396k095743j088288j152114n60394
17446H208751L65950m12119N63826L99589j34392N33171o9152J82426j89846l95664
17436I052540j24710p13362k77739l38910J34872L71694k80953M34024m8512k47473
17426G961471Q95260n49832p6411j31811o18780o79501l64086m33248k4523k73880
17416E704659j3291n43703m9450L9860N81974k89017m08513J60663O90632n40286
$$ plain form
17477 103507502 104014799 101107869 94287505 83405650 71528866 59057704 49895797 46581353
17469 46581353 50367295 61074976 74234643 87551271 97183961 103514093 106992241 106861520
17461 106861520 103394917 96884015 85815333 72562805 57904471 43755947 32545050
17454 32545050 24754186 18757738 15028686 13105290 11009547 9921259 8769145 8208751
17446 8208751 8574701 8162582 8726408 9125997 8991605 9524776 9455624 9638050 9448204 9052540
17436 9052540 8927830 8214468 7936729 7597819 7732691 8104385 7823432 8257456 8208944 7961471
17426 7961471 8856731 8306899 8230488 8098677 7479897 6800396 6436310 6003062 5978539 5704659
17416 5704659 5691368 5147665 5098215 5138075 5720049 5431032 5022519 5183182 5873814 5333528
17406E333528N12042K47117k25141J94749O21672L14356j01865O89326M36393
17397H022177n02275P03728K0099K12528L86928O64848Q33167O35475J015862
17388A1992537N82265J461591J2753J385626O50771J27944k2336K38701l82172
17379A6047680k79203o08023r16990l1805l97778L99850K57711J70017R47572
17370A5589031k96718J330723Q10083R90740M80077R53554J31219J10239L35262
17361B0434210m5579j50940j01063l56463N6106p32936J97255P67449J87119L10208
17351B0565366K59844J131086J635292R80085O82141J696758J377363J192179
17343B9520114R44490J146297j14264O59960p5651p05240l98999l80205l98839
$$ plain form
17406 5333528 5845570 6092687 5867546 6062295 6683967 6998323 6896458 7585784 8022177
17397 8022177 7519902 8223630 8243729 8456257 8843185 9508033 10341200 10976675 11992537
17388 11992537 12574802 14036393 14049146 15434772 16085543 16213487 16191151 16429852 16047680
17379 16047680 15768477 15160454 14243464 14211659 13813881 14213731 14471442 14641459 15589031
17370 15589031 15292313 16623036 17433119 18423859 18903936 19857490 19988709 20098948 20434210
17361 20434210 20388631 20237691 20136628 19780165 19836271 19103335 19300590 20068039 20255158 20565366
17351 20565366 20825210 21956296 23591588 24571673 25253814 26950572 28327935 29520114
17343 29520114 30464604 31610901 31496637 32156597 32080946 31375706 30976707 30596502 30197663
17334C0197663q00849m0257m05387O27717L9262J358948R82974R90331J634848
17325C4585250J153141J014100J189791P3224R68421o28086k65791p13573p50134
17316C6626343r26731r81132j599728r58579j388779n27506j050488q13285p295
17307B8372820K14381Q3124P13687M22933Q64902J063667P97366K24937Q29158
17298C3586975N73495j49118j23376o54612j148451n31584j242969j020920j106081
17289B8183359j473175l34210q55797n41520m22546j73426m85715n35828n95808
17280B2765334p62796l46747j035445p09738r67579j312468j052312p61559j094146
17271A4722544r01018j008852k25096m78571l58973n11220m61680j25002o26558
$$ plain form
17334 30197663 29396814 29356557 28951170 29578887 29618149 30977097 31960071 32950402 34585250
17325 34585250 35738391 36752491 37942282 38015506 38983927 38355841 38090050 37376477 36626343
17316 36626343 35699612 34718480 33118752 32160173 30771394 30243888 29193400 28380115 28372820
17307 28372820 28587201 28670325 29384012 29806945 30671847 31735514 32532880 32757817 33586975
17298 33586975 34160470 34011352 33887976 33233364 32084913 31553329 30310360 29289440 28183359
17289 28183359 26710184 26375974 25520177 24978657 24556111 24382685 23896970 23361142 22765334
17280 22765334 22002538 21655791 20620346 19910608 18943029 17630561 16578249 15816690 14722544
17271 14722544 13821526 12812674 12587578 12109007 11750034 11238814 10777134 10652132 10025574
17262A0025574l26492m6081o12074q5315M4938l75814O3709k67718j65048N085
17252H260764L4820l4276k70129l37589K95854l78404o8240l67544P1372k91150
17242F915478N10346p42463L82471j196324P83154n79670p5133L70773l66007
17233F002625J41131Q2742N907p5861L33310l05251K38094J35825K04613K6458
17223F789593L44358l89092K18091k52158L76890k72734J80439k91574Q0328O9415
17213F853556J31609j58407L36562l54301R4838k10186N31963q3859j34966O24898
17203G631707j62274O18012j010730k71471O55078j041314l7073j55592j40459
17194F085884n44685k35527r8333J92666l97901r8490K98189m03723J50403K4342
$$ plain form
17262 10025574 9699082 9653001 9040927 8955612 9000550 8624736 8688445 8420727 8255679 8260764
17252 8260764 8295584 8261308 7991179 7653590 7949444 7571040 7502800 7135256 7206628 6915478
17242 6915478 7425824 6683361 7065832 5869508 6652662 6072992 5997859 6368632 6002625
17233 6002625 6143756 6226498 6232405 6156544 6489854 6184603 6422697 6558522 6763135 6789593
17223 6789593 7133951 6744859 6962950 6710792 7087682 6814948 6995387 6703813 6784141 6853556
17213 6853556 6985165 6826758 7163320 6809019 6903857 6693671 7225634 7141775 7006809 7631707
17203 7631707 7469433 8087445 7076715 6805244 7460322 6419008 6381935 6226343 6085884
17194 6085884 5541199 5305672 5207339 5400005 5002104 4903614 5201803 4798080 4948483 4972825
17184D972825l30732J36752k01675J10707r0032m88331P65187n06503J30497Q3274
17174D581969k00465L88168L2282m79107R3406K08784o150m12093K91195L33995
17164D831984r8924j54932K33623J03593K94754L25622l32956N7237k7797M6642
17154E278846L04378n01208J52233J21182q3553k34331P04903l75831j22463l22335
17144D921821j43891M17318m31257O44997Q8525k41632L77270k61927j45579k82587
17134D943058L19130j48228K29593L0723n9762P4564q32497K69471j145J51819
17124D976726M03150n12431l5145P4949K39254k93694J53397Q3468j89303p2180
17114D828191l11168r4952l02508L65765r39495M79038M0027j95959J11928n29548
$$ plain form
17184 4972825 4642093 4778845 4577170 4687877 4597845 4109514 4874701 4368198 4498695 4581969
17174 4581969 4381504 4769672 4801954 4322847 4416253 4625037 4618887 4206794 4497989 4831984
17164 4831984 4733060 4578128 4811751 4915344 5210098 5535720 5202764 5260001 5232204 5278846
17154 5278846 5583224 5082016 5234249 5355431 5271878 5037547 5742450 5366619 5244156 4921821
17144 4921821 4777930 5195248 4763991 5408988 5497513 5255881 5633151 5371224 5225645 4943058
17134 4943058 5262188 5113960 5343553 5374276 5314514 5389078 4556581 4826052 4824907 4976726
17124 4976726 5379876 4867445 4832300 4907249 5146503 4852809 5006206 5089674 4900371 4828191
17114 4828191 4517023 4422071 4119563 4485328 3545833 4024871 4064898 3868939 3980867 3451319
17104C451319Q061R1199k98881J0737J27555j03883n3058M63720n38206l68801
17094B789762J026J33185L8393Q350L06303l81534j65725J02459k99570j41639
17084B391010N59193n90910O17727l05579j31843M1965J12486M9614j47234J0251
17074B606680l03598O6588N66801l18824Q2032p87799R50082j09113k57439l6929
17064B458481o0999J41548M26669n04932o2102J0171L17121K47733j71492K25822
17054C028020N6671n03952O38503n03847L05170j64081J55869j80603L43554j99025
17044B976279R1772L16228m45006N82796m09837L70469J85831N2631L75659j44907
17034C951915j44161q0808l47532J27482k739l82298j96930J94320q9469K5303
$$ plain form
17104 3451319 3459380 3550579 3251698 3262435 3389990 3286107 3233049 3696769 3158563 2789762
17094 2789762 2790788 2923973 2962366 2970716 3277019 2895485 2729760 2832219 2532649 2391010
17084 2391010 2950203 2359293 2977020 2671441 2539598 2581563 2694049 2743663 2596429 2606680
17074 2606680 2303082 2369670 2936471 2617647 2699679 1911880 2861962 2752849 2495410 2458481
17064 2458481 2397482 2539030 2965699 2460767 2398665 2408836 2725957 2973690 2802198 3028020
17054 3028020 3084691 2580739 3219242 2715395 3020565 2856484 3012353 2831750 3175304 2976279
17044 2976279 3068051 3384279 2939273 3522069 3112232 3482701 3668532 3721163 4096822 3951915
17034 3951915 3807754 3726946 3379414 3506896 3504157 3121859 2924929 3119249 3029780 3055083
17024C055083r9919n01580N16570r0003K45892m16951k15174o3594M95290l51874
17014B573740k84856K93735j82024K07124K80351n98324L61379L55627m91913
17005B514839k27985j09531J39993k78076N13587M45384j013420J035119l70786
16996B649124o99174N06810K15602l22405J15230q0166O2180O8162n6841P5056
16986B533578K55860o17033K57806j88818J87085K21971m33536N07259L79902
16977C104074m05315Q4028K66446R0470l53345K43554N10146K59874r8209K61846
16967C963569R2832P80470J22566J64950K85215O11994m61579M09889N38976J66046
16957F674928q8859K23104j05659N70375o11701M0251l71588J76329j27377p82332
$$ plain form
17024 3055083 2955164 2453584 2970154 2880151 3126043 2709092 2493918 2430324 2925614 2573740
17014 2573740 2288884 2582619 2400595 2607719 2888070 2289746 2651125 3006752 2514839
17005 2514839 2286854 2177323 2317316 2039240 2552827 2998211 1984791 3019910 2649124
16996 2649124 1949950 2456760 2672362 2349957 2465187 2385021 2447201 2515363 2458522 2533578
16986 2533578 2789438 2172405 2430211 2241393 2428478 2650449 2216913 2724172 3104074
16977 3104074 2698759 2782787 3049233 3139703 2786358 3029912 3540058 3799932 3701723 3963569
16967 3963569 4056401 4836871 4959437 5124387 5409602 6021596 5560017 5969906 6508882 6674928
16957 6674928 6586069 6809173 6703514 7273889 6662188 6702439 6330851 6507180 6379803 5597471
16947E597471P90561q08119j86603l49702k27442M06261o10452m49070Q0867p39179
16937C504593L60763q80970K81136J40001l11302l9875j51748m57881J85151L85708
16927C015576L30265p38898Q5074j14848j49667L43436q0101j52508L58388o04962
16917B291755J65406l3598r7702k65739K15517j60740J08097k02335M35115l33738
16907B122038j52447M17290o77730N37047l50784L77416l04368M74377j21771
16898B321068n82725N45011l32536J26756J12740R7604l86633O3675N2918j20866
16888A897012k30405N09310j33846R4887k54791K43411l68210J19047L82j16582
16878A760215p3329L66526k45763n1551N88131l14310j13873L38207k55186L90480
$$ plain form
16947 5597471 6388032 5579913 5393310 5043608 4816166 5222427 4611975 4162905 4243772 3504593
16937 3504593 3865356 2984386 3265522 3405523 3094221 3054346 2902598 2444717 2629868 3015576
16927 3015576 3345841 2606943 2692017 2577169 2427502 2770938 2690837 2538329 2896717 2291755
16917 2291755 2457161 2423563 2325861 2060122 2275639 2114899 2222996 2020661 2455776 2122038
16907 2122038 1969591 2386881 1709151 2246198 1895414 2272830 1968462 2442839 2321068
16898 2321068 1738343 2283354 1950818 2077574 2190314 2287918 1901285 1964960 2017878 1897012
16888 1897012 1666607 2175917 2042071 2136958 1882167 2125578 1757368 1876415 1876797 1760215
16878 1760215 1686886 2053412 1807649 1756098 2344229 2029919 1916046 2254253 1999067 2389547
16868B389547k5772q4253k05784O7098O74335r66798M83471J28187m17571j19764
16858A922696j05917O10215q0034k6832J79404l62317J72332l15776J50211J33099
16848B277081k47815P1725K03778k39392K91854o1336k44273j23680n6209P2199
16838A943932J13067m34112L09916J030L2709Q4596M9365J01328j15116K19271
16828B305986J50956j61443J26171j68273J67804j5691O2176K02090j73802K06412
16818B702386M44454j76439M51957q60505R97871o20689r7859J52311R2848p656
16808C078679o4568l05243J91214L25995m55833L9040K79035J17836j75301o41731
16798B389123K57688k7370m79724K37232j09825R9023m17510N74716k40190l96012
$$ plain form
16868 2389547 2363775 2279522 2073738 2140836 2815171 1848373 2331844 2460031 2042460 1922696
16858 1922696 1816779 2426994 2346960 2320128 2499532 2137215 2309547 1993771 2143982 2277081
16848 2277081 2029266 2100991 2304769 2065377 2357231 2295895 2051622 1927942 1871733 1943932
16838 1943932 2056999 1622887 1932803 1933833 1966542 2051138 2100503 2201831 2086715 2305986
16828 2305986 2456942 2295499 2421670 2253397 2421201 2405510 2467686 2669776 2495974 2702386
16818 2702386 3146840 2970401 3422358 2561853 3559724 2939035 2841176 2993487 3086335 3078679
16808 3078679 3014111 2708868 2900082 3226077 2770244 2809284 3088319 3206155 3030854 2389123
16798 2389123 2646811 2619441 2139717 2376949 2267124 2366147 1948637 2523353 2283163 1887151
16788A887151M9629j00616K16024l26773J27122l86223O30336n46432M53822q26303
16778A177737P11604j89979L73874m43469K63158J68167m22265O24641n57366
16769A706102l5096L21407J49831l47744j06403M60264J17157p22407N7470Q0959
16759A681540K6665l7384k1089N16087o3031L2488n70537M87347k58134K27886
16749B021838m24837L19760o82417P54602k43215L53017n5032q05088P79009n09290
16739A508347n4195O64066J24737j53758n5554l79952N99995l5485j9906L32011
16729B530306j37840K3155k21087N80784j109283L84551K8633O17372m7826m23776
16719B224989J52531M32864k2159j61992n52064J091881l40519m70805J43237
$$ plain form
16788 1887151 1936780 1836164 2052188 1725415 1852537 1466314 2096650 1550218 2004040 1177737
16778 1177737 1889341 1699362 2073236 1629767 1892925 2061092 1638827 2263468 1706102
16769 1706102 1671006 1992413 2142244 1794500 1688097 2148361 2265518 1543111 1600581 1681540
16759 1681540 1708205 1670821 1649732 2165819 2102788 2135276 1564739 2052086 1793952 2021838
16749 2021838 1597001 1916761 1234344 1988946 1745731 2098748 2043716 1238628 2017637 1508347
16739 1508347 1454152 2118218 2242955 2089197 2033643 1653691 2253686 2218201 2198295 2530306
16729 2530306 2392466 2415621 2194534 2775318 1666035 2050586 2079219 2696591 2648765 2224989
16719 2224989 2377520 2810384 2788225 2626233 2074169 3166050 2825531 2354726 2497963
16710B497963K47769k44610K95404J49697L00607K91293k37809L95649P26264
16701D422227J2864J08296r8911j4898m4517r1234j69163j4562N64584l53131
16691D321555L05444k59381L49189r8640l5834J05160q5350j4516R8173n63492
16681D122308j82842n12265N2175j92648l26158M43303o32975J54412J12329r8639
16671B939000N82168J41914K84975J79413O54320m31591N23050k58514M82321
16662E097056k29640K9849n27827P5957k45732J12705N58367p37713K68216P87302
16652E188540n49491R5365j42405k29425n69678P8227k86145k1266m35859p73270
16642B354593J12735k78615j99522O03278r28568K11093K58309l85845L91094
$$ plain form
16710 2497963 2745732 2501122 2796526 2946223 3246830 3538123 3300314 3695963 4422227
16701 4422227 4435091 4543387 4444476 4429578 4385061 4293827 4124664 4110102 4674686 4321555
16691 4321555 4626999 4367618 4716807 4618167 4582333 4687493 4602143 4587627 4685800 4122308
16681 4122308 3939466 3427201 3479376 3286728 2960570 3403873 2770898 2925310 3037639 2939000
16671 2939000 3521168 3663082 3948057 4127470 4781790 4350199 4873249 4614735 5097056
16662 5097056 4867416 4897265 4369438 4445395 4199663 4312368 4870735 4133022 4401238 5188540
16652 5188540 4639049 4734414 4592009 4362584 3792906 3871133 3584988 3563722 3127863 2354593
16642 2354593 2467328 2188713 1989191 2592469 1663901 1874994 2133303 1747458 2138552
16633B138552k01198r777k83205N08074L53246m29358J3979r3799j00469m0422
16623A855623j396j2963K94461k02924j72744M24825J86490n19056J75656M68775
16613B496747p05215M42581K94871q71241N40577R264L8069L7994k93302K83042
16603B273387K90323k84946J02340k39076O73398J20673L26320l38126L41728
16594C266021q4044Q6183l11007K96038m40431K70045m34655N58558k86053j31919
16584B788736K4225j24276M45057j13556n10203L5933J56432l41898K63372l48610
16574B275212L19358j08749j32766J6465J37389K83332k95703m8070K2162K18911
16564B687541n7402k7248K14018k70827j88632p3366j05628O26843m82347K8689
$$ plain form
16633 2138552 1937354 1927577 1644372 2152446 2505692 2076334 2090313 1996514 1896045 1855623
16623 1855623 1854227 1841264 2135725 1932801 1760057 2184882 2371372 1852316 2027972 2496747
16613 2496747 1791532 2234113 2528984 1657743 2198320 2207584 2245653 2283647 1990345 2273387
16603 2273387 2563710 2278764 2381104 2142028 2815426 2936099 3262419 2924293 3266021
16594 3266021 3181977 3268160 2957153 3253191 2812760 3082805 2648150 3206708 2920655 2788736
16584 2788736 2812961 2688685 3133742 3020186 2509983 2545916 2702348 2360450 2623822 2275212
16574 2275212 2594570 2485821 2353055 2369520 2506909 2790241 2494538 2446468 2468630 2687541
16564 2687541 2630139 2602891 2816909 2546082 2357450 2284084 2178456 2805299 2322952 2351641
16554B351641K43622k12171L94944q3378J40543j28096k2346J27472J32068j67302
16544B776997M23104j27972m58526K77694J16983l75437k66201Q24732l50527
16535B840847k18433P6624J86680k9209l89107k20763M43208K03024k23938j13355
16525B555578l37823N28042j63159K13758l13791K85487j07184k98684N08490
16516B870714j02738j24770J34772j11390m76826J26515K53822l086J590l36613
16506B231990L30532M08583J45115m13901j74001K62856m22582O19563n35971
16497B452184K4047l48161N21464n1771m85465K20005m12541l7567O08659n06405
16487A984449j69566Q6335K0257k06726M03482Q1030K8599r4517L66633l23633
$$ plain form
16554 2351641 2595263 2383092 2778036 2694658 2835201 2707105 2684759 2812231 2944299 2776997
16544 2776997 3200101 3072129 2613603 2891297 3008280 2632843 2366642 3191374 2840847
16535 2840847 2622414 2699038 2885718 2856509 2467402 2246639 2689847 2892871 2668933 2555578
16525 2555578 2217755 2745797 2582638 2796396 2482605 2768092 2660908 2362224 2870714
16516 2870714 2767976 2643206 2777978 2666588 2189762 2316277 2570099 2567013 2568603 2231990
16506 2231990 2562522 2971105 3116220 2702319 2528318 2791174 2368592 2988155 2452184
16497 2452184 2476231 2128070 2649534 2597763 2112298 2332303 1919762 1882195 2490854 1984449
16487 1984449 1814883 1901218 1921475 1714749 2118231 2199261 2227860 2133343 2499976 2176343
16477B176343L64736N4813N07819m3621L38994k29057K68019o6931k8236L28547
16467C671426j82412O46130l47011k73714P00746p52148J00892L3226N39444l89316
16457C747263n7556N94706m20997k21360L75953J0334P0332j51820k4233M55791
16447D378413n73552M15850J002763m43200o2168K52694M72889N9389l47676L63331
16437E518733K12141Q6826J97928Q69360O72456O66999O68480J285834J208604
16428A1387361J498960J793112J844052K756041K721790K591440L123388L455474
16420C1171618L281235M001530M021765M471526M612900N082897O246416O135194
16412F9025081O219803O830035P833574P657970Q481620Q135678Q099321P390176
$$ plain form
16477 2176343 2541079 2595892 3103711 3060090 3399084 3170027 3438046 3371115 3342879 3671426
16467 3671426 3489014 4135144 3788133 3514419 4215165 3463017 3563909 3597135 4136579 3747263
16457 3747263 3689707 4284413 3863416 3642056 4018009 4028343 4098675 3946855 3922622 4378413
16447 4378413 3804861 4220711 5223474 4780274 4718106 4970800 5443689 5503078 5155402 5518733
16437 5518733 5730874 5817700 6015628 6884988 7557444 8224443 8892923 10178757 11387361
16428 11387361 12886321 14679433 16523485 19279526 22001316 24592756 27716144 31171618
16420 31171618 34452853 38454383 42476148 46947674 51560574 56643471 62889887 69025081
16412 69025081 75244884 82074919 89908493 97566463 106048083 114183761 122283082 129673258
16404A29673258M143004J683089o71679j041817k565355l875750n978703p255312
16396A14110735o925914o291017m539495k32032O811843J6908366K6191048K7975228
16388A74008762J9858837Q778522o42752r795720j7542685k2948588k2107265
16381A29609111k0070979k0561661k7808989B0558518c2091826n3870974l8274981
16374a24237781q525076J6393385K8155676L1681359b7858073d738336A2410565
16366B3156767N949912J130130j895779m323022l957192m091828l630508k653204
16358I685276j938273p27520j537000l07845q69685l5631k34012M76251p93897
16349C717664j47167l799k81834K89245l58492o50770p0651m95712j84657n07907
$$ plain form
16404 129673258 133816262 135499351 134827672 133785855 131220500 127344750 121366047 114110735
16396 114110735 107184821 100893804 96354309 96122277 102934120 119842486 146033534 174008762
16388 174008762 193867599 202646121 202003369 192207649 174664964 151716376 129609111
16381 129609111 109538132 88976471 61167482 20558518 -32091826 -85962800 -124237781
16374 -124237781 -132762857 -116369472 -88213796 -56532437 -27858073 -4738336 12410565
16366 23156767 29106679 30236809 28341030 24018008 20060816 15968988 12338480 9685276
16358 9685276 7747003 7019483 5482483 5174638 4304953 4269322 4035310 4511561 3717664
16349 3717664 3570497 3566698 3284864 3574109 3215617 2564847 2494196 1998484 1813827 1305920
16339A305920n94520m0184J60794k95007M40973m04797k29666L56919B32398J52355
16329C84753I244P1830L7282c54418k00325a59837m97904k24479d16844o27737
16319a044581b28029p83318K40903j58562L02186l76482J08238k5886m60368J3306
16309a368012L18291J27225m06046J53148N0168j7962J16048l00910M25370k56739
16299a159419O0287n32175L28756J13454J14001R217J26844M05887l34952L74739
16289d93361E7666c51732a04535B08308K86412k31194G2992L42760m7193J72816
16279E41375k04172M27720l53117K63008j638k79741L77882k57761p0777j73857
16269B68922K71469B58752L30252B04619n5364K47948A96323Q0280l833g0524
$$ plain form
16339 1305920 711400 671216 832010 537003 977976 573179 343513 700432 232398 384753
16329 384753 9244 81074 118356 -354418 -554743 -159837 -657741 -882220 -416844 -1044581
16319 -1044581 -228029 -1011347 -770444 -929006 -626820 -1003302 -895064 -920950 -1381318 -1368012
16309 -1368012 -1049721 -922496 -1328542 -1175394 -1125226 -1143188 -1027140 -1328050 -902680 -1159419
16299 -1159419 -1099132 -1631307 -1302551 -1189097 -1075096 -1065879 -939035 -533148 -868100 -493361
16289 -493361 57666 -351732 -104535 208308 494720 263526 72992 415752 368559 541375
16279 541375 337203 764923 411806 674814 673176 393435 771317 513556 442779 268922
16269 268922 540391 258752 589004 204619 149255 397203 196323 276603 272770 -70524
16258D03413j92096N03772l53960M97315J17548m41569P79967K41196r1836k39642
16248A224108L41399r3768m53J51580G84961J120806m80851N34421j43804J0085
16238A825618r3431N6369l09200k38306M79657p72271M30922K7444F59017O17009
16228A276026l99125O2255B69373L05721B50290j01862K64229j29342N718J49848
16218D38881c56239C74525P0501J72757J5817M7755L11359O409m39874L0679J92766
16207G82694K02614j08480J95700L1190j14261K36759P5538j01437k21883M48495
16197A426929o5302j65077m6798L60810k10477m96899N32450k00032K63039m0865
16187A357778K2111k08186K27072J70596k5972p29681M85422n2346K53714D65097
$$ plain form
16258 403413 211317 715089 361129 858444 975992 534423 1314390 1555586 1463750 1224108
16248 1224108 1565507 1471739 1471286 1622866 784961 1905767 1424916 1959337 1815533 1825618
16238 1825618 1732187 1788556 1479356 1241050 1720707 948436 1379358 1406802 659017 1276026
16228 1276026 876901 939156 269373 575094 250290 148428 412657 283315 289033 438881
16218 438881 -356239 374525 445026 617783 633600 681355 992714 999123 559249 589928 782694
16207 782694 985308 876828 1072528 1103718 989457 1226216 1301754 1200317 978434 1426929
16197 1426929 1361627 1196550 1149752 1510562 1300085 803186 1335636 1135604 1398643 1357778
16187 1357778 1379889 1171703 1398775 1569371 1543399 813718 1299140 1246794 1500508 465097
16176A105771L47393n41984n6424N9313k44389M45902J2733o3950j25900P44253
16166A682718p69687L57144F11485l216M76831E35154N20156l47992L03532D65447
16155E24720K50055O7083L9934k96329R3593k1672K28706Q232L42308k54015N20952
16144A503567k72712m05257N82156k80910J61673l24085K50037j04093N43114
16135A653490o29432L6652K81404j52608P7870K12744k55779N10965l11969K04241
16125A627578k77043K25728J15002k24572j43462M61712P2942k99879K41323j8828
16115A780501l22469k68634Q6278L34317m54787K59715Q2960K75324j64664j96265
16105A412276M8342K24007k99552K85210j58575K84821j34063l0556L72472o33846
$$ plain form
16176 1105771 1453164 911180 854756 914069 669680 1115582 1128315 1064365 938465 1682718
16166 1682718 913031 1270175 611485 608269 1085100 535154 1055310 707318 1010850 465447
16155 524720 774775 841858 881792 585463 679056 657384 886090 894322 1236630 982615 1503567
16144 1503567 1230855 825598 1407754 1126844 1288517 964432 1214469 1110376 1653490
16135 1653490 1024058 1060710 1342114 1189506 1267376 1480120 1224341 1735306 1423337 1627578
16125 1627578 1350535 1576263 1691265 1466693 1323231 1784943 1857885 1558006 1799329 1780501
16115 1780501 1458032 1189398 1275676 1609993 1155206 1414921 1497881 1773205 1608541 1412276
16105 1412276 1460618 1684625 1385073 1670283 1511708 1796529 1662466 1631910 2004382 1370536
16095A370536J85820n1436O1M05508j45094j9516K65978K2603J6773l72713K01263
16084A879783j69056M95124l24217K21691l55697L78977m24530O37435O0k83098
16074B056472J3527M06666j5409J48933l1841q9184P1989K85585n42096O02707
16064B907349m01498J30140p1987O29981p67802J99500L54279k08980k36083J73431
16054B708330q016M47811l42528M9863P7503l67803L39416r0796J49424n9993
16044B903211L51833l99080L26273j75355J88643k18783N15777K9932m88451J79778
16034C213778L22250l71580N69806k2674k47830p0556m8399J01323M20842l1604
16024C835356j86387J21566K35276M9771k72206j07347j7115q948N59481o4397
$$ plain form
16095 1370536 1556356 1504920 1504981 1910489 1765395 1745879 2011857 2034460 2051233 1678520 1879783
16084 1879783 1710727 2205851 1881634 2103325 1747628 2126605 1702075 2339510 2339570 2056472
16074 2056472 2069999 2476665 2461256 2610189 2578348 2489164 2561153 2846738 2304642 2907349
16064 2907349 2505851 2635991 2564004 3193985 2426183 2625683 2979962 2770982 2534899 2708330
16054 2708330 2700314 3148125 2805597 2855460 2932963 2565160 2904576 2813780 2963204 2903211
16044 2903211 3255044 2855964 3182237 3006882 3195525 2976742 3492519 3522451 3034000 3213778
16034 3213778 3536028 3164448 3734254 3711580 3463750 3393194 3344795 3446118 3866960 3835356
16024 3835356 3648969 3770535 4005811 4055582 3783376 3676029 3658914 3649966 4209447 4145050
16014D145050J49572m00309L05934n36004M26504L50539K9936k93490j22994J6764
16004D071502M30861l49718P0435K29210j09145K70028N7046k48843k56962J89241
15994D353655j06813M4775l11281K82389o1840M06202L88964l18464n87452Q5482
15984D175617M90853m15794J97397j76441N22479m5750Q5935k41012R3632O4355
15974D751271J01633k00314J66478n8464m11920K23623M58764m60340k88012R9804
15964D382523k31829m1507l74155N85711J56814p18540J44979Q1772L45439J38012
15954D469219j25101J39023M1927j10223J55427m21492M23937q0021J94982k48268
15944D439410j88718J87828k1408K71024n11065P79634m12075k45750l11550O86997
$$ plain form
16014 4145050 4294622 3894313 4200247 3664243 4090747 4441286 4471222 4177732 4054738 4071502
16004 4071502 4502363 4152645 4223080 4452290 4343145 4613173 4670219 4421376 4164414 4353655
15994 4353655 4246842 4291617 3980336 4262725 4200885 4607087 4996051 4677587 4090135 4175617
15984 4175617 4666470 4250676 4448073 4271632 4794111 4748361 4834296 4593284 4686916 4751271
15974 4751271 4852904 4652590 4819068 4760604 4348684 4572307 5031071 4570731 4282719 4382523
15964 4382523 4150694 4109187 3735032 4320743 4477557 3759017 3903996 3985768 4331207 4469219
15954 4469219 4344118 4483141 4525068 4414845 4570272 4148780 4572717 4492696 4687678 4439410
15944 4439410 4250692 4438520 4417112 4688136 4177071 4956705 4544630 4298880 3987330 4674327
15934D674327M65407K40408m64346J67020L726k83102M62028L81814j89082j29759
15924E328441K20151K34132K34243L2443M84011L8182L85691j37568L872R38361
15914G761959p4243Q94406L16666R95519J268369J086137J650423J685316L898137
15905A9482689M093668P062896R430267J2538527J4138425J4751396J4427519
15898I5925387J1455446Q398388N186418M49043k979303p084833j0619646j3305365
15890H7425535j3384522j4215139j2200232j0348316p447430n753915m776075
15883A9299906l092829k444787k071995j183958q55256j507334p07691m03144
15875G032912l78402j00523k02762k96737j20664p07826L53610L91809j19472
$$ plain form
15934 4674327 5139734 5380142 4915796 5082816 5086542 4803440 5265468 5647282 5458200 5328441
15924 5328441 5548592 5782724 6016967 6049410 6533421 6571603 6957294 6819726 6823598 7761959
15914 7761959 7687716 8582122 8898788 9894307 11162676 12248813 13899236 15584552 19482689
15905 19482689 23576357 30639253 40069520 52608047 66746472 81497868 95925387
15898 95925387 107380833 115779221 120965639 121414682 118435379 111350546 100730900 87425535
15890 87425535 74041013 59825874 47625642 37277326 29829896 24075981 19299906
15883 19299906 16207077 13762290 11690295 10506337 9651081 8143747 7436056 7032912
15875 7032912 6654510 6553987 6351225 6054488 5933824 5225998 5579608 5971417 5851945
15866E851945o84022L21018o52017L68470k57417P4549o89778K17200J59648o1831
15856D647765q21150J003657o58041K54974k47433L80075m22155K99120j00902
15847D335910k12868J81817n9642l28778O00034p84105N81339L7193p2737P32279
15837E010442k40104j39957k13122K1927J92518O02466j79568K54978j39327r19777
15827D250476L74539O2868p2680m7072m0864o6061l7028k70668L82448M648L25900
15816D866506p37752N41277l8918L42084j31454J00654R8135j7594L45885J59053
15806E527876k45707K68194l80334p9751K38049P0162M30282l38816K85663P21770
15796F497388J1613K28736J08780Q69401j90819K80410J9607K28626K72539l37418
$$ plain form
15866 5851945 5167923 5488941 4836924 5205394 4947977 5022526 4332748 4549948 4709596 4647765
15856 4647765 3826615 4830272 4172231 4427205 4179772 4559847 4137692 4436812 4335910
15847 4335910 4123042 4304859 4245217 3916439 4516473 3732368 4313707 4350900 4278163 5010442
15837 5010442 4770338 4630381 4417259 4439186 4631704 5234170 5054602 5309580 5170253 4250476
15827 4250476 4625015 4687883 4615203 4568131 4527267 4461206 4424178 4153510 4535958 4540606 4866506
15816 4866506 4128754 4670031 4631113 4973197 4841743 4942397 5040532 5022938 5368823 5527876
15806 5527876 5282169 5550363 5170029 5090278 5328327 5398489 5828771 5489955 5775618 6497388
15796 6497388 6509001 6737737 6846517 7715918 7525099 7805509 7825116 8053742 8326281 7988863
15786G988863M69384J01554K61817L29909Q36950J64233N47582K92625M4286L83669
15776A1420872J92523J26955l29708J32216o08366Q10050o87968p60J02657J91983
15766A1350454m51347P46898K26160J10478n9986N40837l63218m2899n37120J87330
15756A1707587n6970r8789k46364O9590l39623j50756Q4177j82035j22840J04664
15746A0768641j89497Q25434J69698K34105J262365k4095M68127l26004P73679
15737A3962453L02747L62529j93481L84594l4528p27878M01020Q37092K22903
15728A5517451o64588J291429j09890m13868K6860J62062o63113m96122k73903
15719A4376318J38128o89956M76862P5321J49967O048l19013q26877L46069k29368
$$ plain form
15786 7988863 8458247 8559801 8821618 9151527 9988477 10152710 10700292 10992917 11037203 11420872
15776 11420872 11613395 11740350 11410642 11542858 10934492 11744542 11056574 11055814 11158471 11350454
15766 11350454 10899107 11646005 11872165 11982643 11922657 12463494 12100276 12057377 11520257 11707587
15756 11707587 11650617 11551828 11305464 11375054 11035431 10884675 10968852 10786817 10663977 10768641
15746 10768641 10579144 11404578 11574276 11808381 13070746 13046651 13514778 13188774 13962453
15737 13962453 14265200 14627729 14434248 14818842 14784314 14056436 14457456 15294548 15517451
15728 15517451 14852863 16144292 16034402 15620534 15647394 15809456 15146343 14650221 14376318
15719 14376318 14514446 13824490 14301352 14376673 14526640 14532688 14213675 13386798 13732867 13503499
15709A3503499q21215L01778q5300m49098N77926J212337M89145J74292M60474
15700A5363838M22157L61823J33366R224q4741o1106O57946l99328m11129O7275
15690A6059325k85312J9972N3496q33942O15544j80381r1808k65676j51197j73351
15680A4766670r5692j89669m72114J49859p55986J73994k38233j047288M77337
15671A2768878k96537K58225K62438o34305N37634N89410L28958N99834J002223
15662A5416758M18329Q35183J180729J198121Q74506J382368R02094J736105J303110
15653B5247303J665948J031767J575175J506498J345411J213644J291061R72154
15645C5848961J685454J079235J187185J648088J824713K123722K231248J329755
$$ plain form
15709 13503499 12682284 12984062 12898762 12449664 13027590 14239927 14729072 14903364 15363838
15700 15363838 15785995 16147818 16281184 16290408 16205667 16144561 16802507 16403179 15992050 16059325
15690 16059325 15774013 15793985 15847481 15013539 15629083 15448702 15356894 15091218 14940021 14766670
15680 14766670 14670978 14481309 14009195 14159054 13403068 13577062 13338829 12291541 12768878
15671 12768878 12472341 12730566 12993004 12358699 12896333 13485743 13814701 14414535 15416758
15662 15416758 15835087 16670270 17850999 19049120 19923626 21305994 22208088 23944193 25247303
15653 25247303 26913251 27945018 29520193 31026691 32372102 33585746 34876807 35848961
15645 35848961 37534415 38613650 39800835 41448923 43273636 45397358 47628606 48958361
15637D8958361J934170J074563J435517r4894n61995K60972p55246m40404m27751
15628E1383293j238045N15032N8210k06732m77910j08716j098114j663538j705562
15619D5457918j916312k323463k422956j666080j925002k442205j236988j182960
15611C0341952j355733q83645j323746o70681r90710r29682j001800j22874j193295
15602B1869786m84429m54003m79783k72486k21750K33360k96940P59848O77513
15593B1331116J266526J953739N540201J2082390J9140768J8321267J2836803
15586I2472810R062401N195591L532951m26237l266356p592521j2097326j5333813
15578G1547500j6411498j3933423q945797n851739l463832k181115k119842j411420
$$ plain form
15637 48958361 50892531 51967094 53402611 53307717 52745722 53006694 52251448 51811044 51383293
15628 51383293 50145248 50660280 50718490 50511758 50033848 49925132 48827018 47163480 45457918
15619 45457918 43541606 41218143 38795187 37129107 35204105 32761900 31524912 30341952
15611 30341952 28986219 28102574 26778828 26108147 25117437 24187755 23185955 23063081 21869786
15602 21869786 21385357 20931354 20451571 20179085 19957335 20190695 19893755 20653603 21331116
15593 21331116 22597642 24551381 30091582 42173972 61314740 79636007 92472810
15586 92472810 101535211 106730802 110263753 109837516 106571160 98978639 86881313 71547500
15578 71547500 55136002 41202579 32256782 26405043 22941211 20760096 18640254 17228834
15570A7228834o25447k36602k4575J09465o00339k52321O12536J99728j29276
15561A6282003Q08850L80602J169810J791174L350308R646949J8629827K6488135
15553G8547658K2310251J6003045J0585615O358867K459375j388573n275520j1383653
15545A18217065j7637322k0651135k1239622j6358452j0596738o113027m694413
15538B0926356l091170k238967p31962j099634n95120n18222k04176l22489L09701
15529A2434317n16346l383m20777K64829o20658n04970j2241n36368K98208l91843
15519I990768k87734o3944L36342m35106N54353k21676N68161K11265l03665O10848
15509A0959612j02677R34426R4115k89543M5615j41978j71349R5132p94786M65753
$$ plain form
15570 17228834 16603387 16366785 16342210 16451675 15851336 15599015 16211551 16411279 16282003
15561 16282003 17090853 17471455 18641265 20432439 23782747 33429696 52059523 78547658
15553 78547658 100857909 116860954 127446569 133805436 136264811 134876238 129600718 118217065
15545 118217065 100579743 79928608 58688986 42330534 31733796 25620769 20926356
15538 20926356 17835186 15596219 14864257 13764623 13169503 12651281 12447105 12124616 12434317
15529 12434317 11917971 11914588 11493811 11758640 11137982 10633012 10620771 10084403 10382611 9990768
15519 9990768 9703034 9639090 9975432 9540326 10094679 9873003 10441164 10652429 10348764 10959612
15509 10959612 10856935 11791361 11885476 11595933 11641548 11499570 11328221 11423353 10628567 11094320
15499A1094320l35010m17644L14358l51586j50105L42184M9195O34132N07534
15490A1687378n58852Q27169p71045J60181M77920l01776R22589L21844L89997
15481A3155405Q3721o05425J95413M0982O22403O0823L32658j50681R36822J09778
15471A4781899J190610J395817J216205J067846J026356L48934P71007K01737
15463B2000411p63713J21286p25490l14870j022177K61722K83199Q17877N10030
15454B1168275Q09062J095333R84419O61961l19680J83702L48607l64515r82359
15445B3584805k95280j114044m79490J85040l11928J59789P72096k96521L52789
15436B2557256j19312k26018M55802m72776n71364j243715m63380n55269n82493
$$ plain form
15499 11094320 10759310 10341666 10656024 10304438 10154333 10496517 10545712 11179844 11687378
15490 11687378 11128526 11955695 11184650 11344831 11822751 11520975 12443564 12765408 13155405
15481 13155405 13239126 12633701 12829114 12870096 13492499 13553322 13885980 13735299 14672121 14781899
15471 14781899 15972509 17368326 18584531 19652377 20678733 21027667 21798674 22000411
15463 22000411 21236698 21357984 20632494 20317624 19295447 19557169 19840368 20658245 21168275
15454 21168275 21977337 23072670 24057089 24719050 24399370 24583072 24931679 24567164 23584805
15445 23584805 23289525 22175481 21695991 21881031 21569103 21728892 22500988 22204467 22557256
15436 22557256 22437944 22211926 22667728 22194952 21623588 20379873 19916493 19361224 18778731
15427A8778731k07002k36485p63715m41375n21987o8628m12339m46832r72861
15418A4707507K34q09575m8418n40878k80039l92629L79836l83353K9609l44517
15408A2317777N38846l55671M5068N55853N1165J19589l54866M88977Q05884J08878
15398A4321500O71001j30212R4348L70853L66432p03713p3742o4348j4392l95547
15388A4442180L58894L32745l12847l62259k10878O55223p33125J96177r408O3454
15378A4420156n12277N31858J24623j78276n74621J42780p4578j76291j6453M95029
15368A4181950N91648m16557L65491O81477j31272N96355J33195M3704M49878
15359A6495869p56586M27335j43443L26885q6962N37948l45169J636466M77709
$$ plain form
15427 18778731 18571729 18335244 17571529 17130154 16608167 16539539 16127200 15680368 14707507
15418 14707507 14707741 13898166 13849748 13308870 13028831 12636202 13016038 12632685 12662294 12317777
15408 12317777 12856623 12500952 12546020 13101873 13153038 13272627 12917761 13406738 14212622 14321500
15398 14321500 14992501 14862289 14956637 15327490 15693922 14990209 14916467 14852119 14837727 14442180
15388 14442180 14801074 15133819 14820972 14458713 14247835 14903058 14169933 14366110 14356702 14420156
15378 14420156 13907879 14439737 14564360 14386084 13811463 13954243 13879665 13703374 13686921 14181950
15368 14181950 14773598 14357041 14722532 15404009 15272737 15869092 16002287 16045991 16495869
15359 16495869 15739283 16166618 16023175 16350060 16263098 16801046 16455877 18092343 18570052
15350A8570052J319888L190609N433936R487400J1324430Q604746P340065M329252
15342F9600378K701815J767546o03578k242913n384258o371081q130908o939221
15334D4397780o242169l632749k130588j081306j180117j391356o18506j149638
15326B6971351q49700l31479l13557k63347P70985q4230K5890n8744K463827J536756
15316B9867752L195780O078511J3201500J6601407J8995340J4996533J1735566
15309A14672389O925564L679430J35570l866224q123548j2582176j5305329j7315440
15301F8220236j4772003j0629441p244895m844203k985185j825207j417504j168563
15293B3333235k1863j03544N2692J17817M26236m49459M32394L60485j86877L49953
$$ plain form
15350 18570052 19889940 23080549 28514485 38001885 49326315 57931061 65271126 69600378
15342 69600378 72302193 74069739 73466161 71223248 65838990 59467909 51337001 44397780
15334 44397780 38155611 34522862 32392274 31310968 30130851 28739495 28120989 26971351
15326 26971351 26121651 25790172 25476615 25213268 25984253 25900023 25925913 25867169 28330996 29867752
15316 29867752 33063532 39142043 52343543 68944950 87940290 102936823 114672389
15309 114672389 121597953 125277383 125412953 121546729 113423181 100841005 85535676 68220236
15301 68220236 53448233 42818792 35573897 30729694 27744509 25919302 24501798 23333235
15293 23333235 23311372 23207828 23260520 23378337 23804573 23355114 23787508 24147993 23961116 24311069
15283B4311069l3098P94571K522295N132774R086125R943169Q320900M831219
15275F4909024L895890J567744N86873j776198k675577n872772p884183q388925
15267D4361876p828709n133999l647181k695763j357219j360131q60767j381608
15259B0096499m97119k98972J19314K60890n06191O47349m05111N55044N43445
15250B0515148j09365J015203l34420K43349m40723m61347L31368o20289M19211
15241B0558135m34473q29520L65608J72195Q86678N84905J168736P91807R61413
15232B4225484O11358Q02262k95691m34475l69048o94587p60559o20855l82571
15223B2081318j174770N4754p11037j6330J45113M14859R32776l76545O11746
$$ plain form
15283 24311069 24277971 25072542 27594837 32727611 41813736 51756905 60077805 64909024
15275 64909024 68804914 70372658 70959531 69183333 66507756 60634984 52750801 44361876
15267 44361876 36533167 31399168 27751987 25056224 23699005 22338874 21478107 20096499
15259 20096499 19599380 19300408 19419722 19680612 19174421 19821770 19416659 19971703 20515148
15250 20515148 20405783 21420986 21086566 21329915 20889192 20427845 20759213 20138924 20558135
15241 20558135 20123662 19294142 19659750 19831945 20718623 21303528 22472264 23264071 24225484
15232 24225484 24836842 25639104 25343413 24908938 24539890 23845303 23084744 22463889 22081318
15223 22081318 20906548 20961302 20250265 20233935 20379048 20793907 21726683 21350138 21961884
15214B1961884K50881N41264L66471l92277p39897j068771j063055p56181q19136
15205A8281183r95105j047184p41006r47253p26168J40220o39794k65769l97776
15196A2661348j52839J35688K80712L69186L30313L34555N92120M58761L06510
15187A5316354J74406J26903l0905L17988K29043l2924r3764J164485k2332R44796
15177A8094050m50194K95482Q01613k55846K81188Q2210k77284L5530l29556j29302
15167A8147891l60223P81864m85201n04048J96619j09358K31147O7778N47808
15158A8514277j00343N16292k12719k18489P5573J46639j71084j69870J14275
15149A8494551k30175k51375l40876J45263k19177j85834K28185P58325J1051
$$ plain form
15214 21961884 22212765 22754029 23120500 22728223 21988326 20919555 19856500 19100319 18281183
15205 18281183 17286078 16238894 15497888 14550635 13824467 13964687 13324893 13059124 12661348
15196 12661348 12508509 12644197 12924909 13294095 13624408 13958963 14551083 15009844 15316354
15187 15316354 15490760 15617663 15586758 15904746 16133789 16100865 16007101 17171586 17149254 18094050
15177 18094050 17643856 17939338 18740951 18485105 18766293 18848503 18571219 18606749 18277193 18147891
15167 18147891 17787668 18569532 18084331 17580283 17776902 17667544 17898691 17966469 18514277
15158 18514277 18413934 18930226 18717507 18499018 18574591 18721230 18550146 18380276 18494551
15149 18494551 18264376 18013001 17672125 17817388 17598211 17412377 17640562 18398887 18409938
15140A8409938J29392j1122j94254L56900l02753J47151L92338K11487q3929r31118
15130A8124030K27196o7125k37298k64722L56224j96856j20664K99804m90808
15121A7629781m73864O13101j032532l53782K73064n90205K41596k37413k68847
15112A5800899K28849q4235l72817L24385l89121M75821J65060M49910l19224
15103A6279527L26885O86469J27815M15422L14985M11621Q36682L94689M79175
15094B0273270Q68751P60751J739931K411420L448684M566760L373637L996765
15086D1439969K246079J561517P85284K8858p06672j439530j758136k322787j818775
15077C8015807O1109J024624L048827M122404L828889J851053K008027J307737
$$ plain form
15140 18409938 18539330 18528208 18333954 18690854 18388101 18535252 18927590 19139077 19055148 18124030
15130 18124030 18351226 18284101 18046803 17782081 18138305 17941449 17820785 18120589 17629781
15121 17629781 17155917 17769018 16736486 16382704 16655768 16065563 16307159 16069746 15800899
15112 15800899 16029748 15945513 15572696 15897081 15507960 15983781 16148841 16598751 16279527
15103 16279527 16606412 17292881 17420696 17836118 18151103 18562724 19399406 19794095 20273270
15094 20273270 21142021 21902772 23642703 26054123 29502807 34069567 37443204 41439969
15086 41439969 43686048 45247565 46032849 46061707 45355035 43915505 42157369 39834582 38015807
15077 38015807 38076916 39101540 42150367 46272771 50101660 51952713 53960740 55268477
15069E5268477N88423n29566n65831j351168j63946K419007M012006M260685L359247
15060F7297334L422702L564756K576039L370848L175740K446098p965j122960
15052H4722592j037267O93873K641994M001207L907333J272204J350272p76922
15044I6775286P47272O81692N81130n48587k058553l444886m975961m156546l809744
15035G9791103m015620l529586m165917m316952j621342R51081K174615J806999
15027F7074381Q49964N10661L01933J18764k70880k815j135113j600086P25674
15018F6572483K031388O702397P953158Q692044R107664P808732O238094N587428
15010A20693388L600867K508504J502286n3756Q41348K130825K920992N342057
$$ plain form
15069 55268477 55856900 55327334 54761503 53410335 53246389 55665396 59677402 63938087 67297334
15060 67297334 70720036 74284792 76860831 80231679 83407419 85853517 85845552 84722592
15052 84722592 83685325 84379198 87021192 91022399 94929732 96201936 97552208 96775286
15044 96775286 97522558 98204250 98785380 98236793 96178240 92733354 87757393 83600847 79791103
15035 79791103 75775483 72245897 68079980 63763028 62141686 63092767 65267382 67074381
15027 67074381 67924345 68435006 68736939 68855703 68584823 68582008 67446895 65846809 66572483
15018 66572483 68603871 75306268 83259426 91951470 101059134 108867866 115105960 120693388
15010 120693388 124294255 126802759 128305045 128251289 129092637 131223462 134144454 139486511
15002A39486511M481510N085768M551326M212604M192077J735710K43374k452567
14994A61536313k227276k626530k265398j636903J285200L707934P285344J1058247
14986A76116931J2736874J5452062J4783922J4632942J3646889R652649O084336
14979B63106605O63516m457508r483556j2575164j6699992j7175813j8325424
14972A85052664j8217345j7201091j4702030j2656651j0529192q551880p163403
14965I6031072o060050m864183l984627k592532j486711k12313R27382K944712
14957H0702750O927845Q974210J4533102K0406915K7357966L2137455L7188458
14950B28228701M2157918M5603856M4862834M4500373M3938385L7849282K3261394
$$ plain form
15002 139486511 143968021 149053789 153605115 157817719 162009796 163745506 163988880 161536313
14994 161536313 159309037 156682507 154417109 152780206 154065406 157773340 165058684 176116931
14986 176116931 188853805 204305867 219089789 233722731 247369620 257022269 263106605
14979 263106605 263770121 259312613 249829057 237253893 220553901 203378088 185052664
14972 185052664 166835319 149634228 134932198 122275547 111746355 103194475 96031072
14965 96031072 89971022 85106839 81122212 78529680 77042969 76830656 77758038 80702750
14957 80702750 87630595 96604805 111137907 131544822 158902788 191040243 228228701
14950 228228701 270386619 315990475 360853309 405353682 449292067 487141349 510402743
14943E10402743P025523o417635j6712022k2773650k5332009l0908351l3205112
14936C82079487l5977343l4369652l0689998k2493256j7596314j4046243j4503301
14929B12403380j5676726j6207500j5414060j3629543r932822o207004l699138
14922A31636587l569409m921873n419528n785815o528004o152612p125072r113277
14914H3020997j0143343j0800425j0212606p459884n357848m190567k725771j186086
14906C0944467j465503P98174q123L53445J046085J755520K201181J555116L399175
14897D0579537N095158O883010Q351482O618956M679906K880453J549588J31283
14889G6769373n49264k912761m490843o758959o647784o954221m531483l472899
$$ plain form
14943 510402743 517428266 511010631 494298609 471524959 446192950 415284599 382079487
14936 382079487 346102144 311732492 281042494 258549238 240952924 226906681 212403380
14929 212403380 196726654 180519154 165105094 151475551 141542729 135335725 131636587
14922 131636587 128067178 123145305 117725777 111939962 105411958 99259346 92134274 83020997
14914 83020997 72877654 62077229 51864623 44404739 39046891 34856324 32130553 30944467
14906 30944467 29478964 30277138 30269015 30622460 31668545 33424065 35625246 37180362 40579537
14897 40579537 45674695 52557705 60909187 67528143 72208049 75088502 76638090 76769373
14889 76769373 76220109 73307348 68816505 62057546 55409762 48455541 43924058 40451159
14881D0451159q99223j503300o05696q63294k52109J461071J228466J233598N54117
14872D0804789Q24537N7986N54606J104621N11560N44179M70890m86526P40732
14863D5127374R71357J948702N903775P990130J0818942J2797359J3377156J3449922
14855A12384717J3205555Q605396M605230J314598m087855o735768j0460645j2750245
14847A06080983j3731814j3304226j1575141j0380648p176025m580135k407295
14840D2925699k431802k344629q45166k037360r89967o20879n39820q23526j237432
14831C1055118L29585n09737N02737P0178R99916P49670J004162J614760K009554
14822C7825943M786945O931388J0624527J1661796J0650310P282062M114366K522989
$$ plain form
14881 40451159 39551936 38048636 37442940 36579646 36327537 37788608 39017074 40250672 40804789
14872 40804789 41629326 41687312 42241918 43346539 43858099 44402278 44873168 44386642 45127374
14863 45127374 46098731 48047433 53951208 61941338 72760280 85557639 98934795 112384717
14855 112384717 125590272 134195668 138800898 140115496 136027641 129291873 118831228 106080983
14847 106080983 92349169 79044943 67469802 57089154 49913129 45332994 42925699
14840 42925699 40493897 38149268 37304102 35266742 34276775 33655896 33116076 32292550 31055118
14831 31055118 31384703 30874966 31377703 31447881 32447797 33197467 34201629 35816389 37825943
14822 37825943 42612888 49544276 60168803 71830599 82480909 89762971 93877337 96400326
14814I6400326j32803k862308n500754p584132j0552737j1442029j0160226q920293
14806C9245044m987480l365828k151403j802226j446205o87702m24926m25398
14798B3953876N48326n14856K0045k87205j94527n26727n01679k56778m0964l67994
14788B1831517L17362j006922M36658j92718K23145K1908K50955P05059N44058
14779B3131022J463185J565705Q14972L4183Q09941n0904J73550m42031o32016
14770B6867607j556447j326461j489784r71227k0063j138927l6729m03508J04109
14761B0028570K10716J533L90243l57704L55051J36975L45502J17151O04663O57931
14751B2490631Q87777P14123J29183M03960j66695P48041J78814N8004k47254
$$ plain form
14814 96400326 96267523 93405215 87904461 80320329 69767592 58325563 48165337 39245044
14806 39245044 34257564 30891736 28740333 26938107 25491902 24804200 24379274 23953876
14798 23953876 24502202 23987346 24007391 23720186 23525659 22998932 22497253 22240475 22199511 21831517
14788 21831517 22148879 21141957 21578615 21385897 21609042 21630950 21881905 22586964 23131022
14779 23131022 24594207 26159912 26974884 27009067 27819008 27768104 27941654 27499623 26867607
14770 26867607 25311160 23984699 22494915 21523688 21503625 20364698 20327969 19924461 20028570
14761 20028570 20239286 20240819 20631062 20273358 20628409 20765384 21110886 21228037 21832700 22490631
14751 22490631 23378408 24092531 24221714 24625674 24458979 25207020 25385834 25443838 25196584
14742B5196584K90726O55577J20714J210663K083635J775065L604417L552714
14734C8490095N975991Q991642J3240338K2039347L3556641M2277136M7363929
14727B11935119M7786292M3197876L2883520K0521186Q606819l453895j6316057
14720C45160860k8921271l9451809m4646880m5185879m1725362l4219979k5572967
14713H5436713j7403522j2140481q320247o635843m662395l249451k584749k248304
14705B8191721j729030j236948j466959j798786p11540k226387k31696n23019
14697A8267356m45928j90345P13151j89955N02716o38261M56197N444J90717N96612
14687A9267704o22710J44818j055689R1249K18207K72557P36746p6716R08659
$$ plain form
14742 25196584 25487310 26142887 26263601 27474264 29557899 31332964 34937381 38490095
14734 38490095 44466086 53457728 66698066 88737413 122294054 164571190 211935119
14727 211935119 259721411 302919287 335802807 356323993 364930812 361476917 345160860
14720 345160860 316239589 276787780 232140900 186955021 145229659 111009680 85436713
14713 85436713 68033191 55892710 47572463 40936620 36274225 33024774 30440025 28191721
14705 28191721 26462691 25225743 23758784 21959998 21248458 19022071 18790375 18267356
14697 18267356 17821428 17631083 18344234 18154279 18656995 18018734 18474931 18480375 18671092 19267704
14687 19267704 18644994 18789812 17734123 17825372 18043579 18316136 19052882 18976166 19884825
14678A9884825J580014J084207J803207J091111Q78093q2421k77559m52738r28374
14669B4580365j095528j671299p64560j207181K34440J18503l95123L32339m43007
14660A9688949p4932j20038L12514j457295j130169j199342j378471j037114J09099
14651A3713201O4181K75774N08879J143361J038558J136598L77995N21303R57845
14642A9737695L22128J416134M65705Q34972M98129R85507J014954Q30896R21667
14633B7027787k88146M7715j198240q30581k287768k305750k052314k934523j529548
14624A3648632k095399p97837m11270j231282K61539l91848L33636n21657R4648
14615H889162k76822r5027J44999q8523K47546m66633l34198q1025K07647L4810
$$ plain form
14678 19884825 21464839 22549046 24352253 25443364 26321457 26239036 25961477 25508739 24580365
14669 24580365 23484837 21813538 21048978 19841797 20076237 20194740 19799617 20131956 19688949
14660 19688949 19614017 19493979 19806493 18349198 17219029 16019687 14641216 13604102 13713201
14651 13713201 13777382 14053156 14562035 15705396 16743954 17880552 18258547 18779850 19737695
14642 19737695 20059823 21475957 21941662 22776634 23274763 24260270 25275224 26106120 27027787
14633 27027787 26739641 26787356 25589116 24758535 22470767 20165017 18112703 15178180 13648632
14624 13648632 11553233 10755396 10344126 9112844 9374383 8982535 9316171 8794514 8889162
14615 8889162 8612340 8517313 8662312 8573789 8821335 8354702 8020504 7939479 8147126 8181936
14605H181936M84n46568J026404P01610J590833J183093K466049K099890J466895
14596A8170626J182371J094904j18404q48302o28819j274613k093700j873652
14588A3610411k125264j846109l48508n48925n02062J32963R1483K53157K24058
14579H941204J30660j23479L20527M77153J24540o186N24519l21276R46614K23998
14569A1238274l7834J512989J800545K056334P32164J303566J766212J645821
14561B2018071L576299O782074R757303J1407195Q646543N325968L699528K446002
14553G3658983k27552j362387l667502o329263r292530q979618p304004m152610
14545C2343517J751143O572484J1549766J0864222Q938058P220914L580701J376185
$$ plain form
14605 8181936 8182420 7635852 8662256 9363866 10954699 12137792 14603841 16703731 18170626
14596 18170626 19352997 20447901 20329497 19481195 18852376 17577763 15484063 13610411
14588 13610411 11485147 9639038 9290530 8741605 8239543 8372506 8463989 8717146 8941204
14579 8941204 9071864 8948385 9268912 9746065 9870605 9864419 10388938 10067662 11014276 11238274
14569 11238274 11200440 12713429 14513974 16570308 17302472 18606038 20372250 22018071
14561 22018071 25594370 32376444 42133747 53540942 62187485 67513453 71212981 73658983
14553 73658983 73431431 72069044 68401542 62072279 52779749 43800131 36496127 32343517
14545 32343517 34094660 40667144 52216910 63081132 72019190 79240104 82820805 84196990
14537H4196990m81147l526165n808192r267011j0403422j0396914q387571n056205
14529C0870363l517056j909966j385336m68722n70184q57963m32680O93027K106871
14520B4528354O086157P496024P663578O823543M438416K878384J776409J346495
14512F3037360q03013j698467m036158n581742n424261m083019j435302K266063
14504D2241461N622345P611199N211919L562040K303610J247524K83276j364919
14496F6718455k870040m602920n088243p293293o536796n206741m202205m112372
14488B6805845l415824j905782k512662k723367k474155j768904j733234j018300
14480I253617m11352p87033r4068n55543M44071r9727K44208L38571N25505J693139
$$ plain form
14537 84196990 83715843 80189678 74381486 65114475 54711053 44314139 35926568 30870363
14529 30870363 27353307 25443341 24058005 23589283 23019099 22161136 21728456 22421483 24528354
14520 24528354 30614511 38110535 45774113 52597656 57036072 59914456 61690865 63037360
14512 63037360 62234347 60535880 56499722 50917980 45493719 41410700 39975398 42241461
14504 42241461 47863806 55475005 60686924 64248964 66552574 67800098 68083374 66718455
14496 66718455 63848415 59245495 54157252 46863959 40327163 35120422 30918217 26805845
14488 26805845 23390021 21484239 18971577 16248210 13774055 12005151 10271917 9253617
14480 9253617 8842265 8055232 7961164 7405621 7849692 7749965 7994173 8332744 8858249 10551388
14470A0551388R70649J576328J035497k2821J93095N69884J16659n29836k36479
14461A4224364j0682J56971P65089Q61505J499342J141198J33549N85101j040191
14452A8316246l51676J00489j509382k249431q85963j353042r3035m93502L80391
14443A1861095m19193P11488J94245M00240P50416j10084R10697K03359J32573
14434A4634836R72408J133289M81591K033795L336482N188347P430545Q357586
14426D3568879Q338135O617199M839649L345774J473075M6391k971221l095745
14418F2162136o595531o982307p173845o767377m504489m003311l086701k048924
14410B0999651k293544j391680j993126r60564k98624o06801m82157j14527r4434
$$ plain form
14470 10551388 11522037 13098365 14133862 14111041 14304136 14874020 14990679 14460843 14224364
14461 14224364 14213682 14370653 15135742 15997247 17496589 18637787 18771336 19356437 18316246
14452 18316246 17964570 18065059 16555677 14306246 13420283 12067241 11974206 11480704 11861095
14443 11861095 11441902 12153390 12347635 12747875 13498291 13388207 14298904 14502263 14634836
14434 14634836 15607244 16740533 17222124 19255919 22592401 27780748 35211293 43568879
14426 43568879 51907014 58524213 63363862 66709636 68182711 68229102 65257881 62162136
14418 62162136 55566605 48584298 41410453 34643076 30138587 26135276 23048575 20999651
14410 20999651 18706107 17314427 15321301 14360737 14062113 13455312 12973155 12858628 12764194
14401A2764194j62949K73187N79615O7829Q59220K200170K215046M303398P441911
14392C0541621R325726J3716882J4396980J3009460J0677147P823603M862541
14385A04353960J934469k019347o010619q750317j2147929j2520265j3175610
14378E1664342r945848q571266n872585m789288k700250k398171q50175j314283
14370A5222476j98035j025161q09243K59867o87816n06758M97296m94117M40644
14361A2699153m10463P94691O04981J605051K191265K837045M124955N179314
14353B9625992O632298N097100M260497K810207J648268m03766j278044k658645
14345D5733907m156168n114296n132175n056279m350700l191075j336183j019898
$$ plain form
14401 12764194 12601245 12874432 13454047 13521876 14381096 16581266 18796312 23099710 30541621
14392 30541621 39867347 53584229 67981209 80990669 91667816 99491419 104353960
14385 104353960 106288429 104269082 98258463 89508146 77360217 64839952 51664342
14378 51664342 41718494 33147228 27274643 22485355 19785105 17386934 16536759 15222476
14370 15222476 15024441 13999280 13190037 13449904 12762088 12255330 12752626 12258509 12699153
14361 12699153 12288690 13083381 13688362 15293413 17484678 20321723 24446678 29625992
14353 29625992 36258290 41355390 45615887 48426094 50074362 49670596 48392552 45733907
14345 45733907 41577739 36463443 31331268 26274989 21924289 18733214 17397031 16377133
14337A6377133K559067O834823O337982L945974K648845J394678J240140J1316
14329D1349958j005110k338987l932861n377158n322863m764316k306681j772688
14321A4529294l29172n25581k60951K37827j29719N44557J603101P32538J303468
14312A7705362J152801K244236J262093L111668J880557L217151L768299M659087
14304C9001254O247358P685419J0394970J3785938J8471402K4215290K9282363
14297A49083994L2238650K9739816K5151387J8839257J1800805M463753l186546
14290B68131116j1116318j9335989k6254792l0825731l0561266k8077900k2852942
14283I9106178j7864037j4322067j1530153q850150o562741n770060m325902l025602
$$ plain form
14337 16377133 18936200 25771023 32109005 36054979 38703824 40098502 41338642 41349958
14329 41349958 40344848 38005861 34073000 28695842 23372979 18608663 16301982 14529294
14321 14529294 14200122 13674541 13413590 13651417 13521698 14066255 15669356 16401894 17705362
14312 17705362 18858163 21102399 22364492 25476160 27356717 30573868 34342167 39001254
14304 39001254 45248612 52934031 63329001 77114939 95586341 119801631 149083994
14297 149083994 181322644 211062460 236213847 255053104 266853909 271317662 268131116
14290 268131116 257014798 237678809 211424017 180598286 150037020 121959120 99106178
14283 99106178 81242141 66920074 55389921 46539771 39977030 34206970 29881068 26855466
14275B6855466k934858k556369j910920j565594j721175j208532j101182p72940
14267A3083896r10441j126648l44387q31070l49157l49006o01291M40014r43701
14258H068209J36629m62010m89636Q27627r36364L22503o29659L81782n40630
14249F678451L6644j01910J01580p28352L35009l53044q5288j71644k02440J29195
14239E638201j5847j51424l15718L7018N5001j9167l96745J47584m53911j80223
14229D344769j18399K15077k64510K88492j43915M93834m91867L5326L77156l55359
14219D380604R64577k85181j55797K96290P9917j9738l13923K98464o4621P6256
14209E256848J21287J467178P59514N04039M7127K17697O22902p63953O061r32193
$$ plain form
14275 26855466 23920608 21364239 19453319 17887725 16166550 14958018 13856836 13083896
14267 13083896 12173455 11046807 10702420 9871350 9522193 9173187 8571896 9011910 8068209
14258 8068209 8204838 7742828 7253192 8080819 7144455 7466958 6837299 7219081 6678451
14249 6678451 6715095 6613185 6714765 5986413 6321422 5968378 5883090 5711446 5509006 5638201
14239 5638201 5622354 5470930 5155212 5192230 5247231 5228064 4831319 4978903 4524992 4344769
14229 4344769 4226370 4441447 4176937 4465429 4321514 4815348 4323481 4358807 4735963 4380604
14219 4380604 5345181 5060000 4904203 5200493 5280410 5260672 4946749 5245213 5180592 5256848
14209 5256848 5378135 6845313 7604827 8108866 8155993 8373690 8996592 8232639 8238700 7306507
14199G306507j69099j023113o64219n48141m03999l3520J72526P0921K77475k57263
14189D728075j3040j94266P9296K02481n55044N03355j11777o96096N27548K24859
14179D695391j71718m29952n4327P96020p01200L46924j24618L15804l22425R2084
14169D441983k25477K36707j2242m4776j80812r3135o987R1215j23126j47500
14159C935850L35416o2877K87207J03418r7579N41391k71852j55864L36292m94922
14149D456480j91464Q9829R8547K80671J52806N31328J34769J339225J464870
14140H357061K275736K742598K198192J490364J487067R79539Q24399k84391p63579
14131A9306986j549396j494846k909502k283079j137688j000995j861339m52308
$$ plain form
14199 7306507 7137408 6114295 5450076 4901935 4497936 4464416 4636942 4707863 4985338 4728075
14189 4728075 4715035 4520769 4600065 4802546 4247502 4750857 4639080 3942984 4470532 4695391
14179 4695391 4523673 4093721 4039394 4835414 4134214 4481138 4356520 4672324 4349899 4441983
14169 4441983 4216506 4453213 4440971 4396195 4215383 4122248 4115261 4206476 4083350 3935850
14159 3935850 4271266 4208389 4495596 4599014 4501435 5042826 4770974 4615110 4951402 4456480
14149 4456480 4265016 4354845 4453392 4734063 4886869 5418197 5552966 6892191 8357061
14140 8357061 10632797 13375395 15573587 17063951 18551018 19530557 20354956 20070565 19306986
14131 19306986 17757590 16262744 13353242 11070163 9932475 8931480 7070141 6617833
14123F617833n61481M66521M37807P90065m1569N27484P38967m82062q0931j75252
14113H237382k94593j28488p77322m98113j127972M16333j62385m1330o7956j48083
14103E407473j33977j23794J09488P31670O18520J355187O01693Q72052M80074
14094I918386M26350k87372M08867n83445N42980j052995k23275o97172R1537
14085H543861N06979M87311J213528M58506N80353J71360J17745k13990n09930
14076A1355723n19809r82768r05955r05897o38120k29901m03659l68948K72123
14067F672789m56630M03543m20168M53590Q9350L48051P45580J088899P27439
14058I652443M20052N43223P45828k96150P23551m71465K6751r4611J36848k81703
$$ plain form
14123 6617833 6056352 6522873 6960680 7750745 7709176 8236660 8975627 8493565 8412634 8237382
14113 8237382 7942789 7814301 7036979 6538866 5410894 5827227 5664842 5623512 5555556 5407473
14103 5407473 5273496 5149702 5259190 5990860 6609380 7964567 8566260 9438312 9918386
14094 9918386 10344736 10057364 10466231 9882786 10425766 9372771 9149496 8452324 8543861
14085 8543861 9050840 9538151 10751679 11210185 11790538 11961898 12079643 11865653 11355723
14076 11355723 10835914 9853146 8947191 8041294 7403174 7173273 6769614 6400666 6672789
14067 6672789 6216159 6619702 6199534 6653124 6742474 7090525 7836105 8925004 9652443
14058 9652443 10072495 10615718 11361546 11065396 11788947 11317482 11344233 11249622 11386470 11104767
14048A1104767M29764Q07824J336399J162124L58426J525335R07781J250424J243751
14039B0126595Q65559P07728M12378J286386J430410J669618J870456L042518
14031C1411648L910965M320683P302016Q768439J0768293J6571513K1289872K7768468
14023A32111897L2832490L3186432L0311167K3636510J6684290Q958499J319576
14016B79040861o667912j5813505k3525185l0007265l2478358l1328801k6669435
14009A12550400k1124346j7160381j2948399j0328638q201218n627726n452036
14002C1707656l851866l218775l187254j390287k125664j407905j095065q28746
13994A4602094j116359p46606m62620o85730J78969J61917L26174k61516J64357
$$ plain form
14048 11104767 11534531 12342355 13678754 14840878 15199304 16724639 17632420 18882844 20126595
14039 20126595 20992154 21699882 22112260 23398646 24829056 26498674 28369130 31411648
14031 31411648 35322613 39643296 46945312 55713751 66482044 83053557 104343429 132111897
14023 132111897 164944387 198130819 228441986 252078496 268762786 277721285 279040861
14016 279040861 272372949 256559444 233034259 203026994 170548636 139219835 112550400
14009 112550400 91426054 74265673 61317274 50988636 42787418 37159692 31707656
14002 31707656 27855790 24637015 21449761 20059474 17933810 16525905 15430840 14602094
13994 14602094 13485735 12739129 12276509 11590779 11769748 11931665 12257839 11996323 12160680
13985A2160680J172935L61894M25680O70968K84688K02848j65666k01109M657
13976A4917575K23224j262256j694187l90014r49407p36587l72540q25877j53595
13967H756336n45178j222544k07993o2376q65296O28659p86607n5788J76730o19723
13957E196220J01768l11066k50870J05524M5814j84695P79816J05654N42585P14385
13947F845135K91958O71881m21883P49947N01504L48016J011673J431517L056587
13938A4486335M676789O573491O347818P793416O578112N660583L547799J803616
13930E7467959j227296j904043m649370o244737o765159o762710o743070n085804
13922A8085770m723734l141611j958280j346487m05736p40733o90619n43789J04290
$$ plain form
13985 12160680 13333615 13695509 14121189 14792157 15076845 15279693 15114027 14912918 14917575
13976 14917575 15140799 13878543 12184356 11794342 10844935 10108348 9735808 8909931 8756336
13967 8756336 8211158 6988614 6780621 6718245 5852949 6481608 5695001 5639213 5815943 5196220
13957 5196220 5297988 4986922 4736052 4841576 4887390 4702695 5482511 5588165 6130750 6845135
13947 6845135 7137093 7808974 7387091 8137038 8638542 8986558 9998231 11429748 14486335
13938 14486335 19163124 25736615 32084433 39877849 46455961 52116544 55664343 57467959
13930 57467959 56240663 54336620 49687250 43442513 36677354 29914644 23171574 18085770
13922 18085770 13362036 10220425 8262145 6915658 6509922 5769189 5078570 4534781 4639071
13913D639071n31227Q213l41461K20040J45072j95065M86635l24663q76674N56108
13903C786049L36343l48690p3539k76906K70321j13067L65375j01538p33865P52103
13893C862586j44288q5571M5444J04695R3365k76124K99854M85064m36850J09425
13883D057600j50536j16061j12490l01486J11296J42746l18977j48649L11123
13874C474566n3982J3034l87027M49489m62430Q37962m84144K43418K2136P7365
13864C730387J21269j6413k99929Q1714k19298O36621k92050K34804m6554N3857
13854C984408m1039k53605L95286j84625J92016K74616L3067j39950l28429l39816
13844C591929J45819J14434m85246N77769n09490M39457l14151n0143k78088l7986
$$ plain form
13913 4639071 4107844 4116057 3774596 3994636 4139708 3944643 4431278 4106615 3229941 3786049
13903 3786049 4122392 3773702 3700163 3423257 3693578 3580511 3945886 3844348 3110483 3862586
13893 3862586 3718298 3632727 3678171 3782866 3876231 3600107 3899961 4385025 3948175 4057600
13883 4057600 3907064 3791003 3678513 3377027 3488323 3631069 3312092 3163443 3474566
13874 3474566 3420584 3433618 3046591 3496080 3033650 3871612 3387468 3630886 3653022 3730387
13864 3730387 3851656 3835243 3535314 3617028 3397730 4034351 3742301 3977105 3930551 3984408
13854 3984408 3943369 3689764 4085050 3900425 4092441 4367057 4400124 4260174 3931745 3591929
13844 3591929 3737748 3852182 3366936 3944705 3435215 3874672 3560521 3510378 3232290 3194304
13834C194304l71130o2176P38996k85931j40293K56147j41562J40387L3271J96845
13824C558858k13250j46585m39635l25049J373050l40374k20330M63443l88549
13815C321579k11096j3294J44072j12007j72095p6696k36186L45037k43014K65285
13805C011585p5727N2637p3490l0052J25972M09430l74498N58872n06345L30711
13795C429095K27083n15516K57669q1977J88963m47773L9877J01303j75697l54339
13785B668688N73405L22079o78312l25974O47130j64084o6271j45501R4365M97543
13775C423068k46499J22306k43505L4507J32491J80237L7000k04017o0455L35305
13765C510438j21575k24246k20924K96977j21653R0372n6671J13438l86012M00005
$$ plain form
13834 3194304 2823174 2760998 3499994 3214063 3073770 3329917 3188355 3328742 3362013 3558858
13824 3558858 3345608 3199023 2759388 2434339 3807389 3467015 3246685 3710128 3321579
13815 3321579 3110483 3097189 3241261 3129254 2957159 2880463 2644277 2989314 2746300 3011585
13805 3011585 2935858 2988495 2915005 2884953 3010925 3420355 3045857 3604729 3098384 3429095
13795 3429095 3656178 3140662 3398331 3316354 3505317 3057544 3097421 3198724 3023027 2668688
13785 2668688 3242093 3564172 2885860 2559886 3207016 3042932 2976661 2831160 2925525 3423068
13775 3423068 3176569 3298875 3055370 3089877 3222368 3402605 3439605 3235588 3175133 3510438
13765 3510438 3388863 3164617 2943693 3240670 3119017 3209389 3152718 3266156 2880144 3280149
13755C280149Q4274k34969J15761o52271O21837q5058r0951l43499M48054J92063
13745C335390k80031P6399m5499P3637l2656N31819l58722Q8547j44534O03630
13735C847980J80390K82495p88532R93415r3389J81369L70434n94041j8603k27417
13725D134101l11193l36209O79203o64051k02805k6407M62903l92638L9883j54365
13715C228422L0992K70585o45195M32902K18260k57376P8346l95543L73179N21963
13705C856535j13667l38002L26248k86293k90597P76138m87873J20551P82329
13696D345369l53901Q92831O82594k51409K57912O76045n28196j91051N43492
13687F073686o17344o51745m62227l7878k52318k37718J77184K00251l35414L08733
$$ plain form
13755 3280149 3364423 3129454 3245215 2592944 3214781 3129723 3038772 2695273 3143327 3335390
13745 3335390 3055359 3131758 3086259 3159896 3127240 3659059 3300337 3388884 3244350 3847980
13735 3847980 4028370 4310865 3522333 4515748 4422359 4603728 4974162 4380121 4361518 4134101
13725 4134101 3822908 3486699 4165902 3501851 3299046 3272639 3735542 3342904 3382787 3228422
13715 3228422 3259414 3529999 2884804 3317706 3535966 3278590 3356936 2961393 3334572 3856535
13705 3856535 3742868 3404866 3731114 3444821 3154224 3930362 3442489 3563040 4345369
13696 4345369 3991468 4884299 5566893 5315484 5573396 6249441 5721245 5530194 6073686
13687 6073686 5456342 4804597 4342370 4304492 4052174 3814456 3991640 4191891 3856477 4165210
13677D165210n7992J60967j02526p4519L50643k30425O25102j74510k80047R05070
13667E286973K02320O28947K91595M15902j8114K50457J10668k6843o4278J42583
13657G220210j072531J56353l20880l96326n89582l3527m50165J76909n44675
13648D145786J52357m41492O21893n51559K84346J58526l29064K07696N4265j81128
13638D121626j39566N12443P27802M52083j82795L61635M50670K09835k02847
13629F310886m82402O20102o39295r90571n3672n26777J33520o40464L79238l87818
13619C722747o6937q7475k61060N36231j04366m13927K36956N00583K61675l59358
13609C965069N29290q6356J66846j93643Q05528n02074J67189m09305j08624N0398
$$ plain form
13677 4165210 4107218 4268185 4165659 4091140 4441783 4211358 4836460 4661950 4381903 5286973
13667 5286973 5489293 6118240 6409835 6825737 6807623 7058080 7168748 7141905 7077627 7220210
13657 7220210 6147679 6304032 5983152 5586826 4997244 4963717 4513552 4690461 4145786
13648 4145786 4298143 3856651 4478544 3926985 4211331 4369857 4040793 4248489 4302754 4121626
13638 4121626 3982060 4494503 5222305 5674388 5491593 5853228 6303898 6513733 6310886
13629 6310886 5828484 6448586 5809291 4818720 4765048 4238271 4371791 3731327 4110565 3722747
13619 3722747 3655810 3568335 3307275 3843506 3739140 3325213 3562169 4062752 4324427 3965069
13609 3965069 4494359 4408003 4574849 4381206 5186734 4684660 4851849 4442544 4333920 4384318
13599D384318k56538n17928k33657O16631n12417L97523N80696k60440J36104
13590D334292M76523l42386K27407M36344j025683O6608j53415l17768J1741j51758
13580C561905k03596N89963p81990Q3203p489J64989L95373p76141J38316R1600
13570C256133m88271l2288O04264j320J2684k82900N57628p61830P51799p76037
13560B839862M15648l38796N03368M729k21052l20349L38915J31082p4405j32315
13550C146687L33446j81879M07329l13711N42329K21025P05284L83671M12991
13541E657172k9636N50755q80558R96323j037534k52784J51872o04266J5167l90694
13531D175817j76384K45451l50331j42367P57199K22284R61783L33135m23646
$$ plain form
13599 4384318 4127780 3609852 3376195 3992826 3480409 3877932 4458628 4198188 4334292
13590 4334292 4810815 4468429 4695836 5132180 4106497 4173105 4019690 3701922 3713663 3561905
13580 3561905 3358309 3948272 3166282 3249485 3241996 3406985 3802358 3026217 3164533 3256133
13570 3256133 2767862 2735574 3339838 3338518 3351202 3068302 3625930 2864100 3615899 2839862
13560 2839862 3255510 2916714 3420082 3424811 3203759 2883410 3222325 3353407 3279002 3146687
13550 3146687 3480133 3298254 3705583 3391872 3934201 4155226 4860510 5244181 5657172
13541 5657172 5627536 6178291 5297733 6294056 5256522 5003738 5155610 4551344 4566511 4175817
13531 4175817 3999433 4244884 3894553 3752186 4509385 4731669 5693452 6026587 5602941
13522E602941J24743j17452j12404n27719j57345q89782J30002k22093l02703
13513C528188m6408l95798K37348k35247o4465j39739J28412j05300q2128j20912
13503B703951K29855n99353O73949o05307P33305k66141j95292l67415N65303
13494B872855K92079q64968K75316L47679l77399J70548j79259M27991l36482
13485B628360k36972J053627p98648J80237l53152P68707k81866j76618J87341
13476B971016k55515j80657L1026L16756k29201l02632N99640r6830l00474M68845
13466C021974l30244k86082j44976P71895q51424R77316j20478l17688M63952
13457C184245p0744N02736n67679Q22125P71035K95336K93457J09694L53851l30724
$$ plain form
13522 5602941 5727684 5610232 5497828 4970109 4812764 3922982 4052984 3830891 3528188
13513 3528188 3481780 3085982 3323330 3088083 3023618 2883879 3012291 2906991 2824863 2703951
13503 2703951 2933806 2334453 3008402 2403095 3136400 2870259 2674967 2307552 2872855
13494 2872855 3164934 2299966 2575282 2922961 2545562 2716110 2536851 2964842 2628360
13485 2628360 2391388 3445015 2646367 2826604 2473452 3242159 2960293 2783675 2971016
13476 2971016 2715501 2534844 2565870 2882626 2653425 2350793 2950433 2853603 2553129 3021974
13466 3021974 2691730 2405648 2260672 3032567 2181143 3158459 3037981 2720293 3184245
13457 3184245 3113501 3616237 3048558 3870683 4641718 4937054 5230511 5340205 5694056 5363332
13447E363332L41801l31630j5126m53238p99014n11251M16686m77533j36492k22915
13437C174620q6854m18223L39855q0908L67230l6187n25537J64289K33693j61089
13427B970889m2032Q08573o02663K47108J160981L7440O72842P2594M82206m43350
13417E364588O8314r5669j1902n082p78229n02918n49858R8659m98177k28552
13407B861174K18728k14213J21114O608l73597L65981K13261J14303q5097k82177
13397B946085K96236j59450l69080M62570R5670M000K93423M48192K70958m04143
13387C884461P40962k80112J74313O89123J7964j51687J87857N16171o14635k56596
13377D907821l81300j42494l78543J718J91116k27998j73383N86387n02949J98389
$$ plain form
13447 5363332 5705133 5373503 5358377 4905139 4106125 3594874 4011560 3534027 3397535 3174620
13437 3174620 3087766 2669543 3009398 2928490 3295720 3259533 2733996 2898285 3131978 2970889
13427 2970889 2928857 3737430 3134767 3381875 4542856 4580296 5253138 5325732 5807938 5364588
13417 5364588 5432902 5337233 5325331 5320249 4542020 4039102 3489244 3587903 3089726 2861174
13407 2861174 3079902 2865689 2986803 2993411 2619814 2985795 3199056 3313359 3228262 2946085
13397 2946085 3242321 3082871 2713791 3176361 3272031 3276031 3569454 4017646 4288604 3884461
13387 3884461 4625423 4345311 4519624 5208747 5226711 5075024 5262881 5779052 5164417 4907821
13377 4907821 4526521 4384027 4005484 4007202 4198318 3970320 3796937 4383324 3880375 4078764
13367D078764M72996m81454L50254m00158l549L74341q21826K22561K94631n98920
13357C487640P78932j88343L48204p4925M99533n52582N40985k58325L39450m87597
13347D432972j87850J7547m91193q9907K68352j87258K4467P2149N5404n2334
13337C862349J08604l08530L25707k73491L19948M4116o05143M83207n9155j13787
13327C783825L06308J47781n45380N93874r8764q7533J02646P3228l22866M11286
13317D364405J79636M67065M68240r7711l8353M85833r1177K31127K48032m17727
13307E799370J92765m36199J28442l36718R1908J13190J97557l39586J97156N36033
13297F143918k9078O28556Q9327n12157l14366K82087k418k23862l53056L10722
$$ plain form
13367 4078764 4551760 4070306 4420560 4020402 4016853 4391194 3569368 3791929 4086560 3487640
13357 3487640 4266572 4078229 4426433 4351508 4851041 4298459 4839444 4581119 4920569 4432972
13347 4432972 4245122 4262669 3771476 3681569 3949921 3762663 3787130 3859279 3914683 3862349
13337 3862349 3970953 3662423 3988130 3714639 4034587 4078703 3473560 3956767 3897612 3783825
13327 3783825 4090133 4237914 3692534 4286408 4187644 4100111 4202757 4275985 3953119 4364405
13317 4364405 4544041 5011106 5479346 5381635 5343282 5829115 5737938 5969065 6217097 5799370
13307 5799370 5992135 5555936 5684378 5347660 5439568 5552758 5750315 5410729 5607885 6143918
13297 6143918 6114840 6743396 6832723 6320566 6006200 6288287 6285869 6062007 5708951 6019673
13287F019673r03057R02636p2265L7611j45344Q8159J45910Q2799K38247K04035
13277F598404J14015N0068l37384N41698O3395r8903j56656P84320k39420O40644
13267G960181K2369M00414j31278K01481O71425l79559M50076L62361N10649J92219
13257A0260338L61695N33723R4237Q79430J09637k1055L11652M13747N3877K91341
13247A3288622J46367k81491M10675j49569O6413R9613K21307n38040P39120K91044
13237A4294061K64722N56089N31158R23917J06490O84685P26137O70014O80145
13228A9437418M69450j55190Q35476j3876k19762L63966m64176j92413o45086
13219A9415807q20512K8610q1570o92371P0876n12026J05393m80402L6104k84838
$$ plain form
13287 6019673 5116616 6019252 5946987 5984598 5839254 5927413 6073323 6156122 6394369 6598404
13277 6598404 6712419 6762487 6425103 6966801 7030196 6931293 6774637 7558957 7319537 7960181
13267 7960181 7982550 8382964 8251686 8453167 9124592 8745033 9195109 9557470 10068119 10260338
13257 10260338 10622033 11155756 11249993 12129423 12239060 12218005 12529657 12943404 12997281 13288622
13247 13288622 13434989 13153498 13564173 13414604 13481017 13580630 13801937 13263897 14003017 14294061
13237 14294061 14558783 15114872 15646030 16569947 16676437 17361122 18087259 18757273 19437418
13228 19437418 19906868 19751678 20587154 20573278 20353516 20717482 20253306 20060893 19415807
13219 19415807 18595295 18623905 18542335 17849964 17920840 17408814 17514207 17033805 17069909 16785071
13209A6785071L98385k76408J89707j54905J57536J04192P4756n02941j88333
13200A6587060k67881j57633P7539K5992p11080m16412j58286m36395l88635o12870
13190A3541399j82197M0790m96375j42291l4884m88898j75302j11776K86988j68372
13180A2069082o09294r8493J14518k37104j73395j42960n15427J64367o6129j11411
13170A0393754P5573J39244n31184K54167N8678M67014M57524k18406Q22817L37828
13160A2257009m34953P60515M13689k73935J134593o0832j39879J06943r2151
13151A3670999k73413m70910j36143M8699m24414l44145L40717L4777o2784J90602
13141A2573985j44092m90726l38947j222118J22791l82650p12328O6439m01344
$$ plain form
13209 16785071 17183456 16907048 17096755 16941850 17099386 17203578 17278334 16775393 16587060
13200 16587060 16319179 16161546 16239085 16265077 15553997 15137585 14979299 14542904 14154269 13541399
13190 13541399 13359202 13399992 12903617 12761326 12726442 12237544 12062242 11950466 12237454 12069082
13180 12069082 11459788 11361295 11475813 11238709 11065314 10922354 10406927 10571294 10505165 10393754
13170 10393754 10469327 10608571 10077387 10331554 10390232 10857246 11314770 11096364 11919181 12257009
13160 12257009 11822056 12582571 12996260 12722325 13856918 13796086 13656207 13763150 13670999
13151 13670999 13397586 12926676 12790533 12839232 12414818 12070673 12411390 12446167 12383383 12573985
13141 12573985 12429893 11939167 11600220 10378102 10500893 10118243 9405915 9472354 9071010
13132I071010q58947P0605M68333n56607J54196l99995M21506k33256L970J71326
13122H312141l45732q2707n73355L91245o02473l68193j93169K63479J84292n266
13112F980262p72319n447n036j47627J45282r3286j359J269K63753M81659n14738
13101F332413P06328L5913n4263N36512M57767O22400J066252M14297O50267P76535
13091A1544421k27874J61139K31944k20264k38466j15717l14069R7956p9857q3508
13081A0755705K32911n78435q6828J22092l55081p28839o2511o96188q57196q74653
13071F870977k58569j11570o87651r5922l7283l70841Q1991j39793M44918l77032
13061E319225M63705j07695M38274j40757L67828r0305N4387k14286J29946j53987
$$ plain form
13132 9071010 8212063 8282668 8751001 8194394 8348590 7948595 8370101 8136845 8140815 8312141
13122 8312141 7966409 7883702 7310347 7701592 7099119 6730926 6537757 6801236 6985528 6980262
13112 6980262 6207943 6202496 6197460 6049833 6195115 6101829 6100470 6101739 6365492 6847151 6332413
13101 6332413 7038741 7074654 7020391 7556903 8014670 8637070 9703322 10117619 10767886 11544421
13091 11544421 11316547 11477686 11709630 11489366 11250900 11135183 10821114 10919070 10839213 10755705
13081 10755705 10988616 10410181 10323353 10445445 10090364 9361525 9299014 8602826 7745630 6870977
13071 6870977 6612408 6500838 5813187 5717265 5679982 5309141 5391132 5251339 5696257 5319225
13061 5319225 5782930 5675235 6113509 5972752 6340580 6250275 6304662 6090376 6220322 6066335
13051F066335j59140K0200K42624k24077p71313M76594o1909L8408o6141o0233
13041E501348J54343k28565L41114J78352k34236L07272k19099M76499K09870
13032F486898m89643K80717J87844L46568k15008N22636j62431K7475j78705J40113
13022F946464K5292K77912r3551o4487N32212m49052Q52789j55885K24696O3914
13012H160304m7970M22107k56150M08861j18192P54279J5794L35442J23357j29897
13002I667935M45133M3372K62827O0250M58241k76710J079784j48163O99352Q6692
12992A2378713l95358M26111k0771M93708n78502N94334O6102k01673m55492P07084
12982A3014256K03686L3845k25185l78537L76614k0982k18796Q4421l75258m58817
$$ plain form
13051 6066335 5907195 5927395 6170019 5945942 5174629 5651223 5589314 5627722 5561581 5501348
13041 5501348 5655691 5427126 5768240 5946592 5712356 6019628 5800529 6277028 6486898
13032 6486898 5997255 6277972 6465816 6812384 6597376 7120012 6957581 6985056 6806351 6946464
13022 6946464 6971756 7249668 7156117 7091630 7623842 7174790 8027579 7871694 8096390 8160304
13012 8160304 8112334 8534441 8278291 8687152 8568960 9323239 9339033 9674475 9797832 9667935
13002 9667935 10113068 10156440 10419267 10479517 10937758 10661048 11740832 11592669 12292021 12378713
12992 12378713 11983355 12409466 12388695 12882403 12303901 12898235 12964337 12762664 12307172 13014256
12982 13014256 13217942 13251787 13026602 12648065 13024679 13003697 12784901 12869322 12494064 12035247
12972A2035247k69974J66800k25941o0689n84319M26614n94751K22681l28960
12963A0786708j23695M006K1895K18295r18345N34565k54275j38186J86541j02811
12953A0214698l740K68485l68402j60736L32388l83319M44963j68927R7630R9729
12943A0372769j89677O6272J62646p12199Q62452q4907k14114j36845O09631M67983
12933A1204011J42365m1227n3797L32427K5266k86624J80192j39175o79348L43253
12923A1027343r81252R79755K70893L86207n54458j00243J83821k24816m16028
12914A0571222k35519k43572m63811N4379o35335N48689p63592J3437l72018J30628
12904H604508k79464k59025o4415k48034r677k43706M1624R1898m16173J10246
$$ plain form
12972 12035247 11765273 11932073 11706132 11645443 11061124 11487738 10892987 11115668 10786708
12963 10786708 10663013 10667019 10688914 10907209 9988864 10523429 10269154 10130968 10317509 10214698
12953 10214698 10210958 10479443 10111041 9950305 10282693 9899374 10344337 10175410 10273040 10372769
12943 10372769 10183092 10249364 10412010 9699811 10562263 10477356 10263242 10126397 10736028 11204011
12933 11204011 11346376 11305149 11251352 11583779 11609045 11322421 11502613 11363438 10684090 11027343
12923 11027343 10046091 11025846 11296739 11682946 11128488 11028245 11212066 10987250 10571222
12914 10571222 10335703 10092131 9628320 9682699 9047364 9596053 8832461 8845898 8473880 8604508
12904 8604508 8325044 8066019 8001604 7753570 7743893 7500187 7541811 7633709 7217536 7327782
12894G327782l87462q281K03361q09986Q19841k48268r5835l76932L94583k54166
12884F564637J96943m05451J43574m6599O3851P9432l92115l26725L11778l58631
12874E830694J10529j6295m39862L74043K75036l02098K59283l14024J01347n26000
12864E352653M58145l79270k27252J03647M5908N46146m18665m15144j39571Q60321
12854E786918n25929m3048J46258l10572J14034m77996Q63289n77036L50677J20342
12844E446937k58832L20895J3061o97227J016865k83470j56700l34173J044711
12835F112067l60335l86358j50788M37497J49101n80135M22340J83458o06279
12826E220568M04813L3504m25075M32303l55653K70248n64932P82339m60392j2641
$$ plain form
12894 7327782 6940320 6932039 7135400 6325414 7145255 6896987 6801152 6424220 6818803 6564637
12884 6564637 6761580 6356129 6499703 6453104 6516955 6596387 6204272 5877547 6189325 5830694
12874 5830694 5941223 5924928 5485066 5859109 6134145 5832047 6091330 5777306 5878653 5352653
12864 5352653 5810798 5431528 5204276 5307923 5353831 5899977 5481312 5066168 4926597 5786918
12854 5786918 5260989 5217941 5364199 5053627 5167661 4689665 5552954 4975918 5326595 5446937
12844 5446937 5188105 5509000 5522061 4824834 5841699 5558229 5401529 5067356 6112067
12835 6112067 5751732 5365374 5214586 5652083 5801184 5221049 5643389 5826847 5220568
12826 5220568 5625381 5658885 5233810 5666113 5310460 5580708 5015776 5798115 5337723 5325082
12816E325082J30395o75012K23496L8498P95391m68933R653O00352n64008j25013
12806E289901J2626Q3379l09232J8839M16781M35916j53637j75526K21021J10031
12796E950099l05515j31265L34603L54503l38947j53535j64085p0562K02203M03216
12786F080715n05334Q93453n84874K16677o56418q7351N20258m9421k42174L35714
12776E921245k41805L73074k43075J5146k37819J30572M73731j9605M6266n1446
12766F166284k525j30302L03808j73698k34790K38619l80398M29531M87276n18572
12756F185233k3181P90770m05621o95177K84754k17806M28813k81749p9341L64610
12746F351305K50991J8275m50545K2149j66341o8086L72618o16429P49788l06423
$$ plain form
12816 5325082 5455477 4780465 5003961 5042459 5837850 5368917 5378570 5978922 5414914 5289901
12806 5289901 5302527 5385906 5076674 5095513 5512294 5948210 5794573 5619047 5840068 5950099
12796 5950099 5644584 5513319 5847922 6202425 5863478 5709943 5545858 5475296 5677499 6080715
12786 6080715 5575381 6468834 5883960 6100637 5444219 5356868 5877126 5827705 5585531 5921245
12776 5921245 5679440 6052514 5809439 5824585 5586766 5717338 6191069 6171464 6217730 6166284
12766 6166284 6163759 6033457 6337265 6163567 5928777 6167396 5786998 6216529 6703805 6185233
12756 6185233 6162052 6952822 6547201 5852024 6136778 5918972 6347785 6066036 5986695 6351305
12746 6351305 6602296 6620571 6170026 6192175 6025834 5957748 6330366 5713937 6463725 6157302
12736F157302J55810K40751j51480j57593J6048J49859R2695j09489j59898J72667
12726F406672j55642N98256m17972j1638j68718p8563K50264K01068n92124J65744
12716F197347M3234J08386M43177j45803R6706j98067K97903k02948k1598L12934
12706F931271j65515J81989J65501K28944K24750j77335M10679M81083Q5979m08104
12696G959242O06026J63310K18601J0105J79246J002334J427407J389008J506623
12687A4461902N65639K84527J305819r71162K462m56241o14407j754241o06052
12678A2218246j347177o44773o92697J8730n81289q6166N41015j06156J96411
12669I516144J79579J62332L2713L78522k63563R431j26674O21019n92788p07618
$$ plain form
12736 6157302 6313112 6553863 6402383 6244790 6260838 6410697 6503392 6393903 6234005 6406672
12726 6406672 6251030 6849286 6431314 6419676 6250958 6172395 6422659 6623727 6031603 6197347
12716 6197347 6240581 6348967 6792144 6646341 6743047 6544980 6842883 6639935 6618337 6931271
12706 6931271 6765756 6947745 7113246 7342190 7566940 7389605 7800284 8281367 8367346 7959242
12696 7959242 8565268 8728578 8947179 8957284 9136530 10138864 11566271 12955279 14461902
12687 14461902 15027541 15312068 16617887 15646725 15649187 15192946 14578539 12824298 12218246
12678 12218246 10871069 10226296 9533599 9552329 8971040 8884874 9425889 9319733 9516144
12669 9516144 9695723 9858055 9890768 10269290 10005727 10015158 9888484 10509503 9916715 9209097
12659I209097L70992j82566k70636k36784N83355r6826N71285m31217J016555
12650A0533255J89092O48025L75647M68767l43581K72258M08181k81961M58383
12641A2728066Q8082l56984k97055L06152P2192K94061L40768j97850m342m13026
12631A2560064N1128N05445L08847M77174m81910O68237j0551l23994J74235j61192
12621A3767483q24353m98307m23406p74494n92318l5260p04199O27761J33451
12612A0676358R90716N99959P54787P40124Q95873J042851P38854L94993J14401
12603A6948916J11778o70912p42847p54468r62606p49541p65071j054376m15629
12594A0945244q63508N40193r48927O98623K09271O04358N44064n38093P45809
$$ plain form
12659 9209097 9580089 9397523 9126887 8890103 9473458 9376632 9947917 9516700 10533255
12650 10533255 10722347 11370372 11746019 12214786 11871205 12143463 12551644 12269683 12728066
12641 12728066 12816148 12459164 12162109 12468261 12540453 12834514 13175282 12977432 12973090 12560064
12631 12560064 12611192 13116637 13425484 13902658 13420748 14088985 14078434 13754440 13928675 13767483
12621 13767483 12943130 12444823 12021417 11246923 10654605 10619345 9915146 10542907 10676358
12612 10676358 11667074 12267033 13021820 13761944 14657817 15700668 16439522 16834515 16948916
12603 16948916 17060694 16389782 15646935 14892467 13929861 13180320 12415249 11360873 10945244
12594 10945244 10081736 10621929 9673002 10371625 10580896 11185254 11729318 11191225 11937034
12585A1937034k93618J15324O34450J85645j16944L64032Q11838M73756J15905
12576A4227422k6912j55093K86297k49293k85169r41252l60654j073888n88645
12567A0832813n00440l2015l32698j83745J00950p6789k50239O8929R8387K34075
12557I959228j46526k47391J01880J10079j14815L5721m68524K47114K3714N47569
12547A0048049J3660m14640P56408R0461r8499R00121O42898m6711J93830K25796
12537A2311373L73676k17329j10656q2248k47752l38600l32340m78580m51827
12528A0425717n36411j43387K73701J39446K01830p09855L49947L48859M1901
12519A0391748m15883K74912o6267M57480O84746J56311J154807J079778R55242
$$ plain form
12585 11937034 11643416 11758740 12393190 12578835 12461891 12825923 13637761 14111517 14227422
12576 14227422 14200510 14045417 14331714 14082421 13797252 12856000 12495346 11421458 10832813
12567 10832813 10332373 10300358 9967660 9783915 9884865 9808076 9557837 9626766 9725153 9959228
12557 9959228 9812702 9565311 9667191 9777270 9662455 9698176 9229652 9476766 9500480 10048049
12547 10048049 10061709 9647069 10403477 10493938 10395439 11295560 11938458 11891747 12085577 12311373
12537 12311373 12685049 12467720 12357064 12274816 12027064 11688464 11356124 10877544 10425717
12528 10425717 9889306 9745919 10019620 10159066 10360896 9651041 10000988 10349847 10391748
12519 10391748 9975865 10250777 10184510 10641990 11326736 11483047 12637854 13717632 14672874
12510A4672874L93149J75469R03492j03395j24642J99130r88927r36016l98069
12501A3793065r43282l10651k93445m53356o12183l4216r5580J73433m21755N2966
12491A0854996P44763l32621p6755K52650M28494k25824J22876R02132M03941
12482A3074652k8462R52803M17804k124n5152J12217J72469k80775l86764j57293
12472A3819375n03386p01505N66056n43209k22744O67430m10448N87826o73332
12463A2586063P89139K4331R2337K72778O40394K10512M11695P11607J2530O28245
12453A6379631O41932P47103J35461J684834l71006O12472J099287k60605J266803
12444B1935912m00571R02025j59863o09815O09627j6541m9570p0567J7615M2337
$$ plain form
12510 14672874 15066023 15241492 16144984 16041589 15916947 16116077 15127150 14191134 13793065
12501 13793065 12849783 12539132 12245687 11792331 11180148 11145932 11050352 11223785 10802030 10854996
12491 10854996 11599759 11267138 11190383 11443033 11871527 11645703 11768579 12670711 13074652
12482 13074652 13046190 13998993 14416797 14414673 14359521 14471738 14644207 14363432 13976668 13819375
12472 13819375 13315989 12614484 13180540 12637331 12414587 13082017 12671569 13259395 12586063
12463 12586063 13375202 13399533 13491870 13764648 14405042 14615554 15027249 15738856 15751386 16379631
12453 16379631 17021563 17768666 17904127 19588961 19217955 19830427 20929714 20669109 21935912
12444 21935912 21535341 22437366 22277503 21667688 22277315 22260774 22211204 22140637 22158252 22200589
12434B2200589L17489j96537J76965N89528M38485K12888J387644J94726Q04455
12425B6126232J037887J438746O33030N11828J302639J028659N84936O71370J240005
12416C4575332N33335L96004K57329L76518k61253K06380o94383m68940j040464
12407C3879858r67241m57549p66218p87215l53224k37221l66185n16839k39131
12398B9189035R1454o8386M53190M55108N38224L24128J159731N84605J120027
12389C3847116P61065Q26370R03652N01640O45128O46911m38712J282134p12969
12380C8262335M33813n17053j7412J8158l51529n591l20431L93617j30759p15182
12370C7049966j58846r2493M71546m81079q3725J7110j88958L97967j49705n62761
$$ plain form
12434 22200589 22518078 22321541 22498506 23088034 23526519 23739407 25127051 25321777 26126232
12425 26126232 27164119 28602865 29235895 29747723 31050362 32079021 32663957 33335327 34575332
12416 34575332 35108667 35504671 35762000 36138518 35877265 36083645 35389262 34920322 33879858
12407 33879858 32912617 32455068 31688850 30901635 30548411 30311190 29945005 29428166 29189035
12398 29189035 29280489 29212103 29665293 30120401 30658625 30982753 32142484 32727089 33847116
12389 33847116 34608181 35434551 36338203 36839843 37484971 38131882 37693170 38975304 38262335
12380 38262335 38696148 38179095 38161683 38179841 37828312 37822721 37502290 37895907 37765148 37049966
12370 37049966 36891120 36798627 37270173 36789094 36705369 36722479 36533521 36931488 36781783 36219022
12360C6219022l15987m47150M12701l2338j48219n01178K85899j94058n15585
12351C4763107n2206l00235o54307k00617n94559m72786M1685k85332L96629r3740
12341C2547639J004338m08144P14304O95263J117588J52888J088828J084651M80304
12332C8477659J292018J03586J179879Q25355K82601J020561N88486O45622K7410
12323D4443177M70016l97420k0290O54848k22918o7409J27666j91612q4130l2406
12313D4679522L41253K58786K79102P04462K43887N91262M67680J169931J198359
12304D9934244L58057J03301J045480j82455l90494p32407p80498q82211j329575
12295D7143442j427634m37209n35757o75337j110822m21141n23049j083355q16124
$$ plain form
12360 36219022 35903035 35455885 35868586 35836248 35688029 35186851 35472750 35278692 34763107
12351 34763107 34710901 34410666 33756359 33555742 32961183 32488397 32530082 32244750 32641379 32547639
12341 32547639 33551977 33143833 33858137 34553400 35670988 35823876 36912704 37997355 38477659
12332 38477659 39769677 39873263 41053142 41878497 42161098 43181659 43770145 44415767 44443177
12323 44443177 44913193 44515773 44495483 45150331 44927413 44860004 44987670 44796058 44711928 44679522
12313 44679522 45020775 45279561 45558663 46263125 46507012 47098274 47565954 48735885 49934244
12304 49934244 50292301 50395602 51441082 51258627 50868133 50135726 49355228 48473017 47143442
12295 47143442 45715808 45278599 44742842 44067505 42956683 42535542 42012493 40929138 40113014
12286D0113014M0318j670582q25841j124815j220043j217003p75771q96263j151938
12277C1271076k43646n41957p85338o06800l75294k0016m97l08940n5467J35987
12267B8469108l07214n17576L3955M42248n73618J43218P8881m58177J24719J23917
12257B7559461M03296R79134K71537J467183P55462J657870J654172J756617K111629
12248C8616361J958108K484583K781983K525242J709406K415360J224151N50384
12240E4265578J075202L86212J92911r28678j65153o5468j074265q15228L6899
12231E2908010r80866n14739j594863p51610j931007j005936k663483k478816
12223D0986690j951589k769789k171347j441297k236170j728337o74867j249262
$$ plain form
12286 40113014 40153332 38482750 37656909 36532094 35312051 34095048 33319277 32423014 31271076
12277 31271076 31027430 30485473 29700135 29093335 28718041 28698025 28697528 28388588 28333121 28469108
12267 28469108 28161894 27644318 27678273 28120521 27546903 27690121 27769002 27310825 27435544 27559461
12257 27559461 27962757 28941891 29213428 30680611 31436073 33093943 34748115 36504732 38616361
12248 38616361 40574469 43059052 45841035 48366277 50075683 52491043 53715194 54265578
12240 54265578 55340780 55726992 55919903 54991225 54826072 54760604 53686339 52871111 52908010
12231 52908010 51927144 51412405 49817542 49065932 47134925 46128989 43465506 40986690
12223 40986690 39035101 36265312 34093965 32652668 30416498 28688161 28013294 26764032
12215B6764032o07418q29002j018437l85318l75758j151824m20799l96818l16885
12206B1261773j67647o27514l15317M06749l46609L60786J50166l27587J8881
12197B0413681L58377j25185P84027o323O44381j8078L97861Q95936M08875K53472
12187B4007024R03687j49929M03795N79371K71009p6059L79715l7321j2321m64730
12177B5804241l80353P0720o14967K71628M9832p025m93033j2842J83317K09081
12167B5080599j0296l50117M47910O55522R88656N47096J018069N90633Q46105
12158B9814177k54510J171229k75901j4620J12876l16203L51534J75147k40697
12149C0523032O65550K83260J390432J211144J117996J992899J508841J571246
$$ plain form
12215 26764032 26156614 25327612 24309175 23923857 23548099 22396275 21975476 21578658 21261773
12206 21261773 21094126 20466612 20151295 20558044 20211435 20572221 20722387 20394800 20413681
12197 20413681 20772058 20646873 21430900 21424577 22068958 22050880 22448741 23344677 23753552 24007024
12187 24007024 24910711 24760782 25164577 25743948 26014957 25938898 26318613 26281292 26268971 25804241
12177 25804241 25423888 25494608 24879641 25151269 25201101 25194076 24701043 24688201 24871518 25080599
12167 25080599 25070303 24720186 25168096 25823618 26812274 27359370 28377439 28968072 29814177
12158 29814177 29559667 30730896 30454995 30440375 30553251 30237048 30588582 30763729 30523032
12149 30523032 31188582 31471842 32862274 34073418 35191414 37184313 38693154 40264400
12141D0264400J285087J950433J345278J316370J696318J850821K123756K593744
12133E4426207K059496L532748L093392M253062L242120M688362L970250L803034
12125H3068671L675801L062544K775438J216896J219684O90257J15459q10397
12117I5014353n53037j417141j692811k077284j692423j700268j023971k207837
12109H2649581j673998j486628j435157j421229q26692j207137o82140J21494
12101G4038094l92306J38618j18838l28647m56414p29925o06123j71114j285758
12092G0087587m60694n75490L89291J59311J509837J283475J808649J549692J291868
12083G7043526Q46258J930324N92946O50567O86722o40732l49168R0499l3372
$$ plain form
12141 40264400 41549487 43499920 44845198 46161568 47857886 49708707 51832463 54426207
12133 54426207 56485703 60018451 63111843 67364905 70607025 75295387 79265637 83068671
12125 83068671 86744472 89807016 92582454 93799350 95019034 95709291 95824750 95014353
12117 95014353 94461316 93044175 91351364 89274080 87581657 85881389 84857418 82649581
12109 82649581 80975583 79488955 78053798 76632569 75805877 74598740 73916600 74038094
12101 74038094 73645788 73784406 73665568 73336921 72880507 72150582 71544459 71373345 70087587
12092 70087587 69626893 69051403 69440694 69600005 71109842 72393317 74201966 75751658 77043526
12083 77043526 77889784 79820108 80413054 81063621 81750343 81109611 80760443 80850942 80817570
12074H0817570O20228n40101r89420r53309j071467j201400j198279k213829k136572
12065G1133421k375780j805687k564676j842171j599464r60091j623208p96248
12057E7566096j480912o34269j146436r78980j105182j416039j332074n88263
12049D8883941j692475p56887j387492m21562j140402j95528q28185r48583q28253
12040D0684574p72090j107068j041267j207544J49362j496578j96940j87470K61048
12031C5086027M66964J192156L7097J376670N33555J27573K59813r19645l9871
12022C8120339j280289j204391j883189j556484j351354p45922j377403j267288
12014B7454019n82363p54304j123248n51690r05223n71444j97297j252664L41938
$$ plain form
12074 80817570 81437798 80897697 79908277 78954968 77883501 76682101 75483822 73269993 71133421
12065 71133421 68757641 66951954 64387278 62545107 60945643 59985552 58362344 57566096
12057 57566096 56085184 55450915 54304479 53325499 52220317 50804278 49472204 48883941
12049 48883941 47191466 46434579 45047087 44625525 43485123 43289595 42461410 41512827 40684574
12040 40684574 39912484 38805416 37764149 36556605 36705967 35209389 35012449 34824979 35086027
12031 35086027 35552991 36745147 36782244 38158914 38692469 38820042 39079855 38160210 38120339
12022 38120339 36840050 35635659 33752470 32195986 30844632 30098710 28721307 27454019
12014 27454019 26871656 26117352 24994104 24442414 23537191 22965747 22768450 21515786 21857724
12005B1857724l34839q582L59168j04235n5612M07892M41244j68446m10891k22872
11995B1760551n14994m79589j91159r78406P85877o79728j58890k25243K18444
11986A9536863m67199K49313m67921m6176r24816l99281m8902K0842l65591k99605
11976A6787527n85475J7316l55544j40277l43315n78127o99233j0394l32189n93447
11966A3166842l85564j34361m50477l44828L7148j17789L67453J54715j02584
11957A2190555M12105M3177O813L849K15313l09986L85457k54125m14667O95231
11947A2973722J29224k15501L60549M18644O87901M24236N64613k18179N80191
11938A5705400K40202M28096O88174J16732N07802l19904K3351k31159K14083
$$ plain form
12005 21857724 21522885 21514303 21873471 21769236 21713624 22121516 22562760 22394314 21983423 21760551
11995 21760551 21245557 20765968 20574809 19596403 20382280 19702552 19543662 19318419 19536863
11986 19536863 19069664 19318977 18851056 18804880 17880064 17480783 17431881 17452723 17087132 16787527
11976 16787527 16202052 16219368 15863824 15723547 15380232 14802105 14102872 14092478 13760289 13166842
11966 13166842 12781278 12646917 12196440 11851612 11888760 11770971 12138424 12293139 12190555
11957 12190555 12602660 12645837 12652650 12656499 12871812 12561826 12947283 12693158 12278491 12973722
11947 12973722 13102946 12887445 13247994 13666638 14354539 14778775 15343388 15125209 15705400
11938 15705400 15945602 16373698 17061872 17178604 17686406 17366502 17389853 17158694 17372777
11929A7372777l53451m69744p3879j25651n493n00742n31186r6858p77268m33390
11919A4005115l82370J41180q32359n428J9705n37968J1688K70486N10079L020266
11909A6220394N063460L996967K411164J747492J246182k97462j18327q38164
11901B9431706j648518l073493l994211l680482l331430r20008r96546q22100
11893A0964918l01563k23880L24722N72420R3966O49891N93899J441584O02458
11884A4718415J487698Q42501M32990J420178M09147N51370M047j342190j94852
11875A8329304r43294q34624j463485l55282j125745p82263p25131q17394j77161
11866A1104925p84215j79704m12730J818r22664L29905n8982J05147J36987j88200
$$ plain form
11929 17372777 17019326 16549582 16475703 16350052 16344559 15843817 15312631 15215773 14438505 14005115
11919 14005115 13622745 13763925 12931566 12926138 12945843 12407875 12419563 12690049 13200128 16220394
11909 16220394 21283854 25280821 27691985 29439477 30685659 30388197 30269870 29431706
11901 29431706 27783188 24709695 20715484 17035002 13703572 12783564 11787018 10964918
11893 10964918 10663355 10439475 10764197 11336617 11430583 12080474 12674373 14115957 14718415
11884 14718415 16206113 17048614 17481604 18901782 19310929 19862299 19866346 18524156 18329304
11875 18329304 17386010 16551386 15087901 14732619 13606874 12824611 12099480 11282086 11104925
11866 11104925 10320710 10141006 9728276 9730094 8807430 9137335 9078353 9183500 9320487 9132287
11856I132287J03512j11354M55289l89121Q2693N54180J3959N68149P70296p8251
11846A1101639O07293L03247L37665R92365J119213N32992J90067l71208M41350
11837A5254623q01079m09495K79226n35576m810o02026O0763n80329K81615J28366
11827A3071278m84218o27403k15117k76789j230377K05690r43773m26385m95736
11818H577170l77245K59423p74198J81500N9593n79299J53332j58893k23604J0954
11808G128733q353m44078J53226m55666M52314L00300m26617n47494j55379N31024
11798F528010O75363p84243l10968R91378j05923l71963P74288j3138P24667P33665
11788H841136O72768J36455N81311j82253O33065l16125o02877k74032n65652
$$ plain form
11856 9132287 9235799 9124445 9579734 9190613 9273306 9827486 9841445 10409594 11179890 11101639
11846 11101639 11708932 12012179 12349844 13342209 14461422 14994414 15184481 14813273 15254623
11837 15254623 14453544 14044049 14323275 13787699 13782889 13180863 13241626 12661297 12942912 13071278
11827 13071278 12587060 11959657 11744540 11467751 10237374 10443064 9499291 9072906 8577170
11818 8577170 8199925 8459348 7685150 7866650 7926243 7346944 7500276 7341383 7117779 7128733
11808 7128733 7120380 6676302 6829528 6373862 6826176 7126476 6699859 6152365 5996986 6528010
11798 6528010 7203373 6419130 6108162 7099540 6993617 6621654 7395942 7382804 8107471 8841136
11788 8841136 9513904 9650359 10231670 10049417 10682482 10366357 9763480 9489448 8923796
11779H923796q92300j73463o36213J62566q11823m17271M4232l13763K15984r9717
11769F002028m49610L27757J70172m2921m26299M8798j4235Q2927j70509l48779
11759E179329N16796k55118k6758l56354J76077J84245m57787M62569j00475J76428
11749E498952n90794N32566L40218m94151j77745K83338k20668J51840l49926
11740D973630J09463O3672J04372j07176j71902q7171K30479n74588J82791M97711
11730E221281j56917o0468K51273k67958j31130j5040K24976k76234M5385j33607
11720D701561N46643L8592k30769j91769k58537O10646l71589l9419L30992k4692
11710E111659Q949L74501q18209L55252P6002j62479P5920K32501j54943K92618
$$ plain form
11779 8923796 8031496 7858033 7221820 7384386 6572563 6155292 6199524 5885761 6101745 6002028
11769 6002028 5552418 5880175 6050347 6007426 5581127 5629925 5615690 5698617 5528108 5179329
11759 5179329 5696125 5441007 5414249 5057895 5233972 5418217 4960430 5422999 5322524 5498952
11749 5498952 4908158 5440724 5780942 5286791 5109046 5392384 5171716 5323556 4973630
11740 4973630 5083093 5146765 5251137 5143961 4972059 4884888 5115367 4540779 4723570 5221281
11730 5221281 5064364 5003896 5255169 4987211 4856081 4841041 5066017 4789783 4835168 4701561
11720 4701561 5248204 5286796 5056027 4864258 4605721 5216367 4844778 4805359 5136351 5111659
11710 5111659 5120608 5495109 4676900 5032152 5108154 4945675 5021595 5254096 5099153 5391771
11700E391771N7327j0708J31766J61080q40560k4359L59125l47621L35133O5375
11690E278329o70124M68564j41948J88032M52218l26602K94370l94202j01529
11681E047108K85205j46394L83051l56651P22671k08786m88574J79558K84108
11672E701296L40673k43059R2769j77366O5626n9991k00532J88949K96083o12198
11662E392250M72415n86523K00205K16595J91590m809n0689k39680j20928K32973
11652E703399K58099K57033l49040n57070j0127K00429J34374n00843j16109L61637
11642E381782M59545K616J36686j64947p3371J89784j16247j22454k5753J89942
11632E857583K15018L10245o01241K78955l46798O1288J34483l85162K37907j5382
$$ plain form
11700 5391771 5449098 5438390 5570156 5731236 4890676 4866317 5225442 4877821 5212954 5278329
11690 5278329 4608205 5076769 4934821 5122853 5575071 5248469 5542839 5148637 5047108
11681 5047108 5332313 5185919 5568970 5212319 5934990 5726204 5237630 5417188 5701296
11672 5701296 6041969 5798910 5891679 5714313 5779939 5719948 5519416 5708365 6004448 5392250
11662 5392250 5864665 5278142 5478347 5694942 5886532 5881723 5831034 5591354 5470426 5703399
11652 5703399 5961498 6218531 5869491 5312421 5302294 5502723 5637097 5136254 5020145 5381782
11642 5381782 5841327 5843943 5980629 5815682 5742311 5932095 5815848 5693394 5667641 5857583
11632 5857583 6072601 6382846 5781605 6060560 5713762 5775050 5909533 5524371 5762278 5746896
11622E746896L71468m22514K37993n29439J92562K2360N425L87500k84171j32962
11612E595118N2859N30930m26754K19651J69728r7412K10930R3373n26301N29048
11602F351170k56379j39938M47737m35802M97163m42524J32352K17628O47140
11593G018547p87458Q40185j53602l64764R6333l89086M03340l75167j82595j53229
11583E952504k65589N79360k10807q266k19819M38060k00429M75146N7507k84982
11573F312685K39654j3753m43444O19345O12844p96156J75297k00158J45648k24743
11563F427219J5506K91602k03313j77305K05471k49693k56074M48834j02983j02383
11553F296881O4239J85721j46187N03737p76958N93403l82586L59587p94304K54540
$$ plain form
11622 5746896 6118364 5695850 5933843 5404404 5596966 5619326 5624751 6012251 5728080 5595118
11612 5595118 5647977 6178907 5752153 5971804 6141532 6044120 6255050 6348423 5822122 6351170
11602 6351170 6094791 5954853 6402590 5966788 6463951 6021427 6153779 6371407 7018547
11593 7018547 6231089 7071274 6917672 6552908 6649241 6260155 6663495 6288328 6105733 5952504
11583 5952504 5686915 6266275 6055468 6047202 5827383 6265443 6065014 6540160 6597667 6312685
11573 6312685 6552339 6538586 6095142 6714487 7327331 6531175 6706472 6506314 6651962 6427219
11563 6427219 6442725 6734327 6531014 6353709 6559180 6309487 6053413 6502247 6399264 6296881
11553 6296881 6361120 6546841 6400654 6904391 6127433 6720836 6338250 6697837 5903533 6158073
11543F158073J51769j60325L10057m49907L25511k30149K21497n3250K57546k96772
11533F234050L12889k75819j09440m7695J27069l39609N71239o39096L18352J10400
11523F262340n14331N56662k86807K59199M7848j12147j77186L82937J96925J54500
11513F769940m73916K34618K92k53978L48920Q3675k56592j65955j9687L1356
11503F298673n5996J39665L05897l48688M25190k02456L3276l26427L98862k53865
11493F414131L30819n25548O95234l10708l2640j42005M866j45558N31219o38
11483F819172j50857M62346l19116j27919J83198o086p0910K06487m91280M40971
11473F946006J0719R5359j71234J2301k68J13100j30046k21152K57081j92150
$$ plain form
11543 6158073 6309842 6149517 6459574 6009667 6335178 6105029 6326526 6273276 6530822 6234050
11533 6234050 6546939 6271120 6161680 6113985 6241054 5901445 6472684 5833588 6151940 6262340
11523 6262340 5748009 6304671 6017864 6277063 6324911 6212764 6035578 6418515 6615440 6769940
11513 6769940 6296024 6530642 6530934 6276956 6625876 6709551 6452959 6287004 6267317 6298673
11503 6298673 6242677 6382342 6688239 6339551 6764741 6562285 6595561 6269134 6667996 6414131
11493 6414131 6744950 6219402 6914636 6603928 6571288 6429283 6434149 6288591 6819810 6819172
11483 6819172 6668315 7130661 6811545 6683626 6866824 6860738 6789828 6996315 6505035 6946006
11473 6946006 6956725 7052084 6880850 6893151 6892883 7005983 6875937 6654785 6911866 6719716
11463F719716k24319K24838j47961J64825k04308q8044K81502K05112k83536K33903
11453F881728n57649j02285M7580J74297j53708Q89224k31398l45066Q86225n54309
11443F934639k10618M77664j1521K0521m40051L80101Q7939K93978n46041L33066
11433G319677O65085n40690L52828k73370J15343O37981K02250m42901J89983
11424H226186j01858m6412O12282L61614K83595M94j96682J21561L29616M94843
11414A0085239m08275O97452j08487K07930L46195j06495L66510K0749J62843
11405A1263661O6367L39256J11124L32289M81273r4347K79120J59722L76973K53743
11395A3569181L02802N63592m9247J19781L72104k4527N23063K92267J69186L48101
$$ plain form
11463 6719716 6495397 6720235 6572274 6737099 6532791 6444747 6726249 6931361 6647825 6881728
11453 6881728 6324079 6221794 6269374 6443671 6289963 7179187 6947789 6602723 7488948 6934639
11443 6934639 6724021 7201685 7190164 7210685 6770634 7150735 7238674 7532652 6986611 7319677
11433 7319677 7984762 7444072 7796900 7523530 7638873 8276854 8479104 8036203 8226186
11424 8226186 8124328 8077916 8690198 9051812 9335407 9335901 9139219 9260780 9590396 10085239
11414 10085239 9676964 10374416 10265929 10473859 10820054 10713559 11080069 11100818 11263661
11405 11263661 11330028 11669284 11780408 12112697 12593970 12499623 12778743 12938465 13315438 13569181
11395 13569181 13871983 14435575 14386328 14506109 14878213 14853686 15376749 15669016 15838202 16186303
11385A6186303j42861M7945R05259o0658J09514M04077L151k22945O53255j41606
11375A7741434N27454M10328o25029L94393K90157M76431k73903j4459P53023
11366A9679829k33825L89375k71545K57860J13832q2669L49717M52483m20423
11357B0234634M29586n19948q12r2512O50963l99454K53633m14016q7507k26774
11347A9827793k12917J69212l03841L62504o61129l38929j5017L1545l2695R2901
11337A8919427p01831n30976k26099K62321j56906k52073l89071j11479K28376
11328A7041689k24559o25901j94759k30060J39968n00517j84858m52091K64733
11319A5033645n48892l37499p4787q16652K83153k49556k27081o34293k53502
$$ plain form
11385 16186303 16043442 16091387 16996646 16935988 17045502 17449579 17452730 17229785 17883040 17741434
11375 17741434 18268888 18679216 18054187 18448580 18738737 19215168 18941265 18926806 19679829
11366 19679829 19446004 19835379 19563834 19821694 19935526 19852857 20202574 20655057 20234634
11357 20234634 20664220 20144272 20143460 20050948 20701911 20302457 20556090 20142074 20054567 19827793
11347 19827793 19614876 19784088 19480247 19842751 19181622 18842693 18827676 18859221 18826526 18919427
11337 18919427 18217596 17686620 17460521 17722842 17565936 17313863 16924792 16813313 17041689
11328 17041689 16817130 16191229 15996470 15766410 15906378 15405861 15221003 14768912 15033645
11319 15033645 14484753 14147254 14072467 13255815 13538968 13289412 13062331 12428038 12174536
11310A2174536l2265k67777J39423p45953M41160q98862l988l90587o7744K54149
11300A0602092n01117l47400K09490p13257m2652k16079K98946p4076m43800o07873
11290H164274k19933Q88044l73616q9750n56504l18341L34803l90943L54772o69190
11280G123616j72333P0406m79177O10807j97137q313O9734o41384j42473L21230
11270F554976n5139J96408j7272k34533k3090r4198L58391o31782L45292l27955
11260F071098J18324o16963J87556P73357j15300r2594o02305K67501r1265K26213
11250F125622m10966O56243r07253M97658k90632K50658J70418M1779l58209O18215
11240F393533o30894K98432J37595k55893P3642k34320J8033K24126L5933m2202
$$ plain form
11310 12174536 12142271 11874494 12013917 11267964 11709124 10810262 10806274 10415687 10347943 10602092
11300 10602092 10100975 9753575 9963065 9249808 9207156 8991077 9290023 9215947 8772147 8164274
11290 8164274 7944341 8832385 8458769 8369019 7812515 7494174 7828977 7438034 7792806 7123616
11280 7123616 6951283 7021689 6542512 7153319 6956182 6947869 7017603 6376219 6233746 6554976
11270 6554976 6499837 6696245 6678973 6444440 6421350 6327152 6685543 6053761 6399053 6071098
11260 6071098 6189422 5572459 5760015 6533372 6418072 6325478 5723173 5990674 5899409 6125622
11250 6125622 5714656 6370899 5463646 5961304 5670672 5921330 6091748 6133527 5775318 6393533
11240 6393533 5762639 6061071 6198666 5942773 6016415 5782095 5800128 6024254 6060187 6017985
11230F017985J9094K84597p2992N95264N72106J551433J274305J487963J508245
11221A3238000O00414K50422N97371P4932k32704l56948j614584j503809o17344
11212A0435750j643897p55967o12987m51008m45341M21816k01335l0920o14069
11203F102042p3929M2069K54890K03782j45447O47153L93021J353219K465555
11194A1242355J246383J119895J056741l31777O63785j03418J41155j259148j032941
11185A2743030j433261j416117j625262o44342l80772O0023o64109p7386N0764
11176F612568j85318j42973j89863N44259J5973j75448k31937K72558J50475j94479
11166F475815R5567k31459J13050O7480k6776N42006o02157M93003K8633k76723
$$ plain form
11230 6017985 6037079 6321676 6248684 6843948 7416054 8967487 10241792 11729755 13238000
11221 13238000 13838414 14088836 14686207 14761139 14528435 14171487 12556903 11053094 10435750
11212 10435750 8791853 8035886 7422899 6971891 6526550 6948366 6747031 6716111 6102042
11203 6102042 6028113 6070182 6325072 6528854 6383407 7030560 7423581 8776800 11242355
11194 11242355 12488738 13608633 14665374 14333597 14997382 14893964 15035119 13775971 12743030
11185 12743030 11309769 9893652 8268390 7624048 7243276 7303299 6639190 6561804 6612568
11176 6612568 6427250 6284277 6094414 6638673 6654646 6479198 6247261 6519819 6670294 6475815
11166 6475815 6571382 6339923 6452973 6520453 6493677 7035683 6433526 6926529 6955162 6678439
11156F678439R2023L02871r76579N43970r4119M71254l60847L10890J61553J63159
11146G292614o30653J01150Q8432j48775O32883m50083M48127k67464j6940j67003
11136F882288K82351N22910o13362L49818j33125L32503j65280k909K91355l70383
11126G376166N02195K84081n64654J77431j90783K89328p8312J49321Q2141j27166
11116G899748J38149l85345J62218j0520L13652n53053O39496q2778r5905M57635
11106H483297m28359J09713j57322K32784j74499Q1873k444k2294K33323l92041
11096G964031q8104J0230J91053j24579L38044n43143k4518L7026N71476m05572
11086G925944m4174M33169m71538q8097N22879m32101P08874p65859J4322K45113
$$ plain form
11156 6678439 6770462 7073333 6096754 6640724 6546605 7017859 6657012 6967902 7129455 7292614
11146 7292614 6661961 6763111 6851543 6702768 7335651 6885568 7333695 7066231 7049291 6882288
11136 6882288 7164639 7687549 7074187 7424005 7290880 7623383 7458103 7455194 7746549 7376166
11126 7376166 7878361 8162442 7597788 7775219 7584436 7873764 7795452 7944773 8026914 7899748
11116 7899748 8037897 7652552 7814770 7804250 8117902 7564849 8204345 8121567 8025662 8483297
11106 8483297 8054938 8164651 8007329 8240113 8065614 8147487 8145043 8122749 8356072 7964031
11096 7964031 7875927 7886157 8077210 7952631 8290675 7747532 7723014 7760040 8331516 7925944
11086 7925944 7881770 8314939 7843401 7755304 8278183 7846082 8554956 7789097 7803419 8048532
11076H048532J47068L19855P1280m25214P32033m22165J93361l5409K29751J25933
11066H985025K47690K47655Q9555m4974O8089L37855j41394L33429N50070l13378
11056A0359622j9597M36670j66229L27377J63288N8811p9033J21371O1688L14995
11046A1578963J36076N77133o17547Q70768k37948J42173Q16253m91983P12949
11037A3486837L31156L59601L73387K85527L20447L88669L66204O09959K35674
11028A6757461Q9600L8057M58100L46420j5879L59051J62824M06674M44449k15948
11018A8830809L17863O8360J11459N39681R03824l93680L78315Q05819J96300
11009B1758750O02015R06231n2902Q67369P97086Q8263N96312N72573j80832M53239
$$ plain form
11076 8048532 8195600 8515455 8586735 8161521 8893554 8471389 8664750 8629341 8859092 8985025
11066 8985025 9232715 9480370 9569925 9524951 9593040 9930895 9789501 10122930 10673000 10359622
11056 10359622 10340025 10776695 10610466 10937843 11101131 11159942 11080909 11202280 11263968 11578963
11046 11578963 11715039 12292172 11674625 12545393 12307445 12449618 13265871 12773888 13486837
11037 13486837 13817993 14177594 14550981 14836508 15156955 15545624 15911828 16521787 16757461
11028 16757461 16847061 16885118 17343218 17689638 17673759 18032810 18195634 18602308 19046757 18830809
11018 18830809 19148672 19217032 19328491 19868172 20771996 20378316 20756631 21562450 21758750
11009 21758750 22360765 23266996 23214094 24081463 24878549 24966812 25563124 26135697 25954865 26408104
10999B6408104P79502J56627K61730P9390J30721Q70563n12087M49444k27875
10990B8396119R85272j71387m2320J047042Q30682N12101o6630J763180J666936
10981C4920995J051266P08178J070813O96377O49535N26933O57866M2285M3223
10972D0367471M67028n08394M19328M11545O87977O58312P83654J142271J065407
10963D5494599K119037k52522J676158P28533J989667N84322J437252K048622
10955E5825668J713651J383926K148195J313289R65910O69424J628696J064973
10947F6713732P04844L66664Q69356O45851O15577R99960J818283J464913J636180
10938G5835360K059961J378133J875340J782020J632616J704103J514772J415841
$$ plain form
10999 26408104 27187606 27344233 27605963 27685353 27816074 28686637 28174550 28623994 28396119
10990 28396119 29381391 29210004 29167684 30214726 31045408 31557509 31490879 33254059 34920995
10981 34920995 35972261 36680439 37751252 38447629 39097164 39624097 40281963 40324248 40367471
10972 40367471 40834499 40326105 40745433 41156978 41844955 42503267 43286921 44429192 45494599
10963 45494599 47613636 47361114 49037272 49765805 51755472 52339794 53777046 55825668
10955 55825668 57539319 58923245 61071440 62384729 63350639 64020063 65648759 66713732
10947 66713732 67418576 67785240 68654596 69300447 69916024 70915984 72734267 74199180 75835360
10938 75835360 77895321 79273454 81148794 82930814 84563430 86267533 87782305 89198146
10930H9198146J434783J297463J055868J560463O43590Q85304O88671P08407L76650
10921I7849345K57059J1148l79070J76794j58540m00019r45353p4106j63072l89745
10911I5784441P07065k09737K38204j57833j4697P44231M46417Q68701N49377
10902I8956169O09685J595812R52471J553485J278594J267385K591760K314991
10894A11120352K425441L026523L716855L181047M439676N320567O338473O447629
10886A46016563P375989Q120121Q789225R969133J0190843J0020515R598936Q971233
10878B19052558P546660O014102L767010K037456m08933k217481l988842o007624
10870B25794906o854922p761008q732636r096085r197209r099807r385378r006881
$$ plain form
10930 89198146 90632929 91930392 92986260 94546723 95190313 96075617 96764288 97472695 97849345
10921 97849345 98106404 98117552 97738482 97915276 97756736 97356717 96411364 96337258 96174186 95784441
10911 95784441 96491506 96281769 96519973 96362140 96347443 97091674 97538091 98406792 98956169
10902 98956169 99565854 101161666 102114137 103667622 104946216 106213601 108805361 111120352
10894 111120352 113545793 116572316 120289171 123470218 127909894 133230461 139568934 146016563
10886 146016563 153392552 161512673 170301898 180271031 190461874 200482389 210081325 219052558
10878 219052558 226599218 232613320 236380330 238417786 238008853 235791372 231802530 225794906
10870 225794906 218939984 211178976 202446340 193350255 184153046 175053239 165667861 156660980
10862A56660980q152278q565841q058378p763185p417328o415325p048038o004561
10854I7236046n610713n475217n225856m710028m260952m063305l440719l705656
10846F0743600l142514l118216l151283l170275k257041j628654k130106j844832
10838D0300679k507002j925005j033113j598178j081309j924776j008734j195286
10830B8027276r47778p84114j462339q15341l49789j506831n56141j038845J08730
10821B0674828p32412o95901o95207m12024p94785m30446n07781n9657n8657n72169
10811A5715789j47015l96604n05642m24761J33357n74895q4638j007108j30189
10802A2578294R5938j99713q7604m70299n39865q4883r3347l58124l3036l82897
$$ plain form
10862 156660980 148508702 139942861 131884483 124121298 116703970 110288645 103240607 97236046
10854 97236046 91625333 86150116 80924260 76214232 71953280 67889975 64449256 60743600
10846 60743600 57601086 54482870 51331587 48161312 45904271 44275617 42145511 40300679
10838 40300679 37793677 35868672 34835559 33237381 32156072 30231296 29222562 28027276
10830 28027276 27079498 26295384 24833045 24017704 23667915 22161084 21604943 20566098 20674828
10821 20674828 19942416 19246515 18551308 18139284 17344499 16914053 16406272 16346615 16287958 15715789
10811 15715789 15568774 15172170 14666528 14241767 14375124 13800229 13715591 12708483 12578294
10802 12578294 12674232 12474519 12386915 11916616 11376751 11291868 11198521 10840397 10807361 10424464
10792A0424464K31386n74499P8023k92144j70514m2961J41035l08276l14831n12018
10782H659665K24638K52985R8742m93960m47136j9188q937j19878l85874M5855
10772G806912j29696r9486j68708k74882K42689k84369j4737k95057K90859r4843
10762F978682j6675m24549L77394J30690q7722m32371j33310M1808k39487N49827
10752F744287n196K84058m16542L92345m24736M56107p24246O16164q59212m7185
10742F015844j88080K32407l43479J80722l44970K46176m29921M69514l62991
10733E475222o0003O0151Q1692q0427N53835l34579K16578N14862o42582L57421
10723F142170k43298m17381K66226L9495o0068N4349k93376m8548j38838k18821
$$ plain form
10792 10424464 10655850 10081351 10159374 9867230 9696716 9653755 9794790 9486514 9171683 8659665
10782 8659665 8884303 9137288 9236030 8742070 8294934 8275746 8266809 8146931 7761057 7806912
10772 7806912 7677216 7577730 7409022 7134140 7376829 7092460 7077723 6782666 7073525 6978682
10762 6978682 6962007 6537458 6914852 7045542 6957820 6525449 6392139 6433947 6194460 6744287
10752 6744287 6739091 7023149 6606607 6998952 6574216 7030323 6306077 6922241 6063029 6015844
10742 6015844 5827764 6060171 5716692 5897414 5552444 5798620 5368699 5838213 5475222
10733 5475222 5415219 5475370 5557062 5476635 6030470 5695891 5912469 6427331 5784749 6142170
10723 6142170 5898872 5481491 5747717 5787212 5727144 5781493 5488117 5439569 5300731 5081910
10713E081910j08903M56003K28136p2910m52462N09419j23163m76740N19424K22669
10703E783383j02048k10292r0794J31085K9776l05753K56831m70999L76150o65564
10693D731775L02331n3063n8151k29681J19396N54975l2607j3561N4550j76558
10683E199406L27159k57554L54068k26413L29060J06586R2173J29393j22159O32510
10673F564229j87652j81067o5138M03589p7950m30206m49617K70391k47629m49270
10663E149680j18044j09188k99780L02276p18428P36352P5845k28832P47639j4692
10653E522828L11767J63001k97423O47699k96863J01676k56557j56221k38555
10644E501352K1034o09303M35188j283797K35229J1517q30878O26814k07846k07073
$$ plain form
10713 5081910 4973007 5429010 5657146 5584236 5131774 5641193 5518030 5041290 5560714 5783383
10703 5783383 5681335 5471043 5380249 5511334 5541110 5235357 5492188 5021189 5397339 4731775
10693 4731775 5034106 4981043 4922892 4693211 4812607 5367582 5334975 5321414 5375964 5199406
10683 5199406 5526565 5269011 5623079 5396666 5725726 5832312 5924485 6053878 5931719 6564229
10673 6564229 6376577 6195510 6130372 6533961 6456011 6025805 5576188 5846579 5598950 5149680
10663 5149680 5031636 4922448 4622668 4924944 4206516 4942868 5018713 4789881 5537520 5522828
10653 5522828 5834595 5997596 5700173 6347872 6051009 6152685 5896128 5739907 5501352
10644 5501352 5522386 4913083 5348271 4064474 4299703 4311220 3480342 4107156 3899310 3692237
10634C692237j03975J52819p9931M34381m80077L15406l50836L36581j92414O3237
10624C787428R1728q2880q8783k8317K76612J05930o98284L15874J31629j6329
10614C794608J40261K63373o11849L36819j792l01533j5421k38355J43840L62130
10604C872081l70741L16097M8213O9861n96154K932M46689K9633k56269K47785
10594C810127j20996L33981m00862n9049J41639p6419j05109M50876k98814j16759
10584C558615p866K74033n48954M70496j63120M70776p67196M92183l39414J75672
10574C615225L62618k84812J15834K97135k88774k2273j39752j49666J10925N8555
10564C675015n80114P3928M1133O9257L67409j88002l45722L49070j20614n55730
$$ plain form
10634 3692237 3588262 3741081 3661150 4095531 3615454 3930860 3580024 3916605 3724191 3787428
10624 3787428 3879156 3796276 3707493 3679176 3955788 4061718 3363434 3679308 3810937 3794608
10614 3794608 3934869 4198242 3586393 3923212 3921420 3619887 3604466 3366111 3509951 3872081
10604 3872081 3501340 3817437 3865650 3935511 3339357 3342289 3788978 3818611 3562342 3810127
10594 3810127 3689131 4023112 3622250 3563201 3704840 3628421 3523312 3974188 3675374 3558615
10584 3558615 3550749 3824782 3275828 3746324 3583204 4053980 3286784 3778967 3439553 3615225
10574 3615225 3977843 3693031 3808865 4106000 3817226 3794953 3655201 3505535 3616460 3675015
10564 3675015 3094901 3168829 3209962 3279219 3646628 3458626 3112904 3461974 3341360 2785630
10554B785630L10679m81890P20548k34080o75176P78556J62367n91361L51537
$$ plain form
10554 2785630 3096309 2614419 3334967 3100887 2425711 3204267 3366634 2775273 3126810
$$ [...]
##END NTUPLES=NMR SPECTRUM
##END=
