##TITLE=Coffee green (M4-ROVE90 + 1.5mL buffer 50/50,  450uL extracto + 50uL (D2O+TMS))
without heating, vortex and centrifuged, temperature 0oC.
##JCAMPDX= 6.0         $$ Bruker NMR JCAMP-DX V2.0
##DATA TYPE= NMR SPECTRUM
##DATA CLASS= NTUPLES
##ORIGIN= Bruker BioSpin GmbH
##OWNER= Administrator
$$ 1.72 TOPSPIN		Version 2.1
$$ 2012-05-22 16:17:13.356 -0700  Administrator@X
$$ Compression mode = diff/dup
##.OBSERVE FREQUENCY= 400.13188198
##.OBSERVE NUCLEUS= ^1H
##.ACQUISITION MODE= SIMULTANEOUS (DQD)
##.ACQUISITION SCHEME= undefined
##.AVERAGES= 64
##.DIGITISER RES= 22
##SPECTROMETER/DATA SYSTEM= spect
##.PULSE SEQUENCE= noesygppr1d
##.SOLVENT NAME= H2O+D2O
##.SHIFT REFERENCE= INTERNAL, H2O+D2O, 1, 14.97969
##AUDIT TRAIL= $$ (NUMBER, WHEN, WHO, WHERE, PROCESS, VERSION, WHAT)
$$ ##TITLE= Audit trail, TOPSPIN		Version 2.1
$$ ##JCAMPDX= 5.01
$$ ##ORIGIN= Bruker BioSpin GmbH
$$ ##OWNER= Administrator
$$ $$ C:/Bruker/TOPSPIN/data/jwist/nmr/11-coffee-green-quantification-2/351/pdata/1/auditp.txt
$$ ##AUDIT TRAIL=  $$ (NUMBER, WHEN, WHO, WHERE, PROCESS, VERSION, WHAT)
(   1,<2011-11-18 16:41:07.982 -0500>,<Administrator>,<TOPSPIN>,<go>,<TOPSPIN 2.1>,
      <created by zg
	started at 2011-11-18 16:32:13.388 -0500,
	POWCHK enabled, PULCHK disabled,
       configuration hash MD5:
       DA 63 81 1B EF 4C B5 72 B4 DF EA D9 B4 DB 4C 08
       data hash MD5: 64K
       E0 33 8C 83 36 47 9D 41 C5 FD 97 52 B6 87 64 CF>)
(   2,<2011-11-18 16:46:57.950 -0500>,<Administrator>,<TOPSPIN>,<proc1d>,<TOPSPIN 2.1>,
      <Start of raw data processing
       efp LB = 0 FT_mod = 6 PKNL = 1 PHC0 = 0 PHC1 = 0 SI = 32K 
       data hash MD5: 32K
       B7 19 89 5E 5C 7E F0 52 A2 D4 63 7B F4 DE C2 EA>)
(   3,<2011-11-18 16:46:58.325 -0500>,<Administrator>,<TOPSPIN>,<proc1d>,<TOPSPIN 2.1>,
      <pk PHC0 = 23.72498 PHC1 = 0 
       data hash MD5: 32K
       53 87 07 98 AB 8B 8A C0 4E 04 56 D4 B9 87 A2 32>)
$$ ##END=
$$ 
$$ $$ hash MD5
$$ $$ 14 53 61 B6 CB A8 A9 86 8D EB BE 81 F4 DF 1F A0
##$RELAX= 
##$RELAX= 
##$RELAX= 
##$RELAX= 
##$RELAX= 
$$ Bruker specific parameters
$$ --------------------------
##$DU= <Z:>
##$EXPNO= 351
##$NAME= <11-coffee-green-quantification-2>
##$PROCNO= 1
##$TYPE= <nmr>
##$USER= <jwist>
##$ACQT0= -8.18042376280013
##$AMP= (0..31)
100 100 100 100 100 100 100 100 100 100 100 100 100 100 100 100 100 100
100 100 100 100 100 100 100 100 100 100 100 100 100 100
##$ANAVPT= -1
##$AQSEQ= 0
##$AQ_mod= 3
##$AUNM= <au_prof>
##$AUTOPOS= <>
##$BF1= 400.13
##$BF2= 400.13
##$BF3= 400.13
##$BF4= 400.13
##$BF5= 400.13
##$BF6= 400.13
##$BF7= 400.13
##$BF8= 400.13
##$BYTORDA= 0
##$CFDGTYP= 0
##$CFRGTYP= 9
##$CHEMSTR= <none>
##$CNST= (0..63)
1 1 145 1 1 1 1 1 1 1 1 1 1 1 1 1 1 1 1 1 1 1 1 1 1 1 1 1 1 1 1 1 1 1 1
1 1 1 1 1 1 1 1 1 1 1 1 1 1 1 1 1 1 1 1 1 1 1 1 1 1 1 1 1
##$CPDPRG= <>
##$CPDPRG1= <>
##$CPDPRG2= <>
##$CPDPRG3= <>
##$CPDPRG4= <mlev>
##$CPDPRG5= <mlev>
##$CPDPRG6= <mlev>
##$CPDPRG7= <mlev>
##$CPDPRG8= <mlev>
##$CPDPRGB= <>
##$CPDPRGT= <>
##$D= (0..63)
$$ [...]
##$TP= (0..7)
150 150 150 150 150 150 150 150
##$TP07= 0
##$TPNAME0= <>
##$TPNAME1= <>
##$TPNAME2= <>
##$TPNAME3= <>
##$TPNAME4= <>
##$TPNAME5= <>
##$TPNAME6= <>
##$TPNAME7= <>
##$TPOAL= (0..7)
0.5 0.5 0.5 0.5 0.5 0.5 0.5 0.5
##$TPOFFS= (0..7)
0 0 0 0 0 0 0 0
##$TUNHIN= 0
##$TUNHOUT= 0
##$TUNXOUT= 0
##$USERA1= <user>
##$USERA2= <user>
##$USERA3= <user>
##$USERA4= <user>
##$USERA5= <user>
##$V9= 5
##$VALIST= <valist>
##$VCLIST= <CCCCCCCCCCCCCCC>
##$VD= 0
##$VDLIST= <DDDDDDDDDDDDDDD>
##$VPLIST= <PPPPPPPPPPPPPPP>
##$VTLIST= <TTTTTTTTTTTTTTT>
##$WBST= 2048
##$WBSW= 25
##$XGAIN= (0..3)
0 0 0 0
##$XL= 0
##$YL= 0
##$YMAX_a= 5185670
##$YMIN_a= -1852149
##$ZGOPTNS= <>
##$ZL1= 120
##$ZL2= 120
##$ZL3= 120
##$ZL4= 120
##$ABSF1= 0
##$ABSF2= 0
##$ABSG= 0
##$ABSL= 0
##$ALPHA= 0
##$AQORDER= 0
##$ASSFAC= 0
##$ASSFACI= 0
##$ASSFACX= 0
##$ASSWID= 0
##$AUNMP= <proc_prof1d>
##$AXLEFT= 0
##$AXNAME= <>
##$AXNUC= <1H>
##$AXRIGHT= 0
##$AXTYPE= 0
##$AXUNIT= <>
##$AZFE= 0.1
##$AZFW= 0.1
##$BCFW= 0
##$BC_mod= 0
##$BYTORDP= 0
##$COROFFS= 0
##$CY= 15
##$DATMOD= 1
##$DC= 0
##$DFILT= <>
##$DTYPP= 0
##$F1P= 0
##$F2P= 0
##$FCOR= 0.5
##$FTSIZE= 32768
##$FT_mod= 6
##$GAMMA= 0
##$GB= 0
##$INTBC= 1
##$INTSCL= 1
##$ISEN= 128
##$LB= 0
##$LEV0= 0
##$LPBIN= 0
##$MAXI= 10000
##$MC2= 0
##$MEAN= 0
##$ME_mod= 0
##$MI= 0
##$NCOEF= 0
##$NC_proc= -7
##$NLEV= 6
##$NOISF1= 0
##$NOISF2= 0
##$NSP= 0
##$NTH_PI= 0
##$NZP= 0
##$OFFSET= 14.97969
##$PC= 1
##$PHC0= 23.72498
##$PHC1= 0
##$PH_mod= 1
##$PKNL= yes
##$PPARMOD= 0
##$PPDIAG= 0
##$PPIPTYP= 0
##$PPMPNUM= 2147483647
##$PPRESOL= 1
##$PSCAL= 4
##$PSIGN= 0
##$PYNMP= <proc.py>
##$REVERSE= no
##$SF= 400.13
##$SI= 32768
##$SIGF1= 0
##$SIGF2= 0
##$SINO= 400
##$SIOLD= 32768
##$SPECTYP= <>
##$SREGLST= <1H.CDCl3>
##$SSB= 0
##$STSI= 32768
##$STSR= 0
##$SW_p= 8223.68421052631
##$SYMM= 0
##$S_DEV= 0
##$TDeff= 65536
##$TDoff= 0
##$TI= <>
##$TILT= no
##$TM1= 0
##$TM2= 0
##$TOPLEV= 0
##$USERP1= <user>
##$USERP2= <user>
##$USERP3= <user>
##$USERP4= <user>
##$USERP5= <user>
##$WDW= 1
##$XDIM= 32768
##$YMAX_p= 502488056
##$YMIN_p= -74606431
##$CURPLOT= <Network HP LaserJet P1505>
##$CURPRIN= <$Network HP LaserJet P1505>
##$DFORMAT= <normdp>
##$LAYOUT= <+/1D_H.xwp>
##$LFORMAT= <normlp>
##$PFORMAT= <normpl>
##$SURQMSG= 1
$$ End of Bruker specific parameters
$$ ---------------------------------
##NTUPLES= NMR SPECTRUM
##VAR_NAME=  FREQUENCY,     SPECTRUM/REAL,   SPECTRUM/IMAG
##SYMBOL=    X,             R,               I
##VAR_TYPE=  INDEPENDENT,   DEPENDENT,       DEPENDENT
##VAR_FORM=  AFFN,          ASDF,            ASDF
##VAR_DIM=   32768,         32768,           32768
##UNITS=     HZ,            ARBITRARY UNITS, ARBITRARY UNITS
##FACTOR=    0.250966925370066, 1,           1
##FIRST=     8223.43324360094, -6826,        -602595
##LAST=      0,             -62822,          -457719
##MIN=       0,             -74606431,       0
##MAX=       8223.43324360094, 502488056,    0
$$ Real data points
##PAGE= N=1
##DATA TABLE= (X++(R..R)), XYDATA
$$ [...]
$$ plain form
19436 2227169 2113286 2545266 2271032 2805443 2653440 2511536 2466596 2491797 2247631 2428887
19426 2428887 2704283 2687883 2811861 2341885 2351835 2364172 2730357 2624433 1974283 2352633
19416 2352633 2276846 2371299 2662376 2647651 1960251 2057993 1928408 2189718 2063212 2150134
19406 2150134 2232567 2254909 2366246 2234712 1916970 2230571 1955156 2261521 2013451 1866352
19396 1866352 2314481 1652297 2024098 1904226 2224053 2256377 2221806 1833244 2249770 1934447
19386 1934447 2059136 2030523 1775981 2230749 2198825 1564848 2291119 1769089 1801793 1580565
19376 1580565 1866235 1925363 2293137 2149382 1943537 2298230 1901977 1706982 2252938 2194854
19366 2194854 1947942 2110885 2310032 1529370 1953231 2241064 1663614 2416653 1688920
$$ packed form
19436B227169j13883M31980k74234N34411j52003j41904m4940K5201k44166J81256
19426B428887K75396j6400J23978m69976R950J2337L66185j05924o50150L78350
19416B352633p5787R4453K91077j4725o87400R7742j29585K61310j26506Q6922
19406B150134Q2433K2342J11337j31534l17742L13601k75415L06365k48070j47099
19396A866352M48129o62184L71801j19872L19827L2324l4571l88562M16526l15323
19386A934447J24689k8613k54542M54768l1924o33977P26271n22030L2704k21228
19376A580565K85670N9128L67774j43755k05845L54693l96253j94995N45956n8084
19366B194854k46912J62943J99147p80662M23861K87833n77450P53039p27733
$$ plain form
19357 1688920 2584864 2097373 2051383 2178428 2071880 1481482 1491544 1645642 2248194 1711337
19347 1711337 2022172 1504479 1232346 1603505 1644060 1741549 1699681 1576300 1622321 2288201
19337 2288201 1593087 1777517 1510702 1888434 1431385 1393792 1401919 1416470 1721943 2170125
19327 2170125 1760648 2038442 1543241 2133513 1967128 1950215 1576058 1710351 1743136 1603906
19317 1603906 1803229 1765991 1384146 2038299 2099562 1719828 1801038 1844014 1967250 1956447
19307 1956447 1244137 1721579 1598628 2056072 1954645 1594123 2085975 1905498 1919307 1674426
19297 1674426 1664870 1864826 1955431 1942968 1981880 2255325 2105308 1916475 1552498 1669191
19287 1669191 1792055 1812501 2238855 1847604 1576012 1894230 1700875 1442245 1833190 2004583
$$ packed form
19357A688920Q95944m87491m5990J27045j06548n90398J0062J54098O02552n36857
19347A711337L10835n17693k72133L71159M0555R7489m1868j23381M6021O65880
19337B288201o95114J84430k66815L77732m57049l7593Q127J4551L05473M48182
19327B170125m09477K77794m95201N90272j66385j6913l74157J34293L2785j39230
19317A603906J99323l7238l81845O54153O1263l79734Q1210M2976J23236j0803
19307A956447p12310M77442j22951M57444j01427l60522M91852j80477J3809k44881
19297A674426r556J99956R0605j2463L8912K73445j50017j88833l63977J16693
19287A669191J22864K0446M26354l91251k71592L18218j93355k58630L90945J71393
$$ plain form
19277 2004583 1712355 1162284 1740157 1885624 1930565 1982800 2127499 1945378 2345264 2248727
19267 2248727 1807355 1772678 2561504 1981816 2021841 2384416 1885189 2135614 1806252 2108701
19257 2108701 1765052 1714374 2032730 1968831 1539690 2030987 1865622 1826125 2375935 1451080
19247 1451080 1794083 1762833 1344994 1833190 2485564 2452961 2664566 2960958 3368406 3186086
19237 3186086 3314482 2936694 2715311 2982174 2512124 2150986 2385318 1785248 1991585
19228 1991585 1345628 1439735 1583132 1893674 1814971 1222012 1203472 1864366 2202267 1927083
19218 1927083 1695006 1444932 1312356 1411065 1482514 1504698 1431718 1675072 2080988 1429728
19208 1429728 1280702 1471228 1996606 1753297 1253601 1455760 1563834 1134535 1312379
$$ packed form
19277B004583k92228n50071N77873J45467M4941N2235J44699j82121L99886r6537
19267B248727m41372l4677P88826n79688M0025L62575m99227K50425l29362L02449
19257B108701l43649n0678L18356o3899m29141M91297j65365l9497N49810r24855
19247A451080L43003l1250m17839M88196O52374l2603K11605K96392M07448j82320
19237C186086J28396l77788k21383K66863m70050l61138K34332o00070K06337
19228A991585o45957R4107J43397L10542p8703n92959j8540O60894L37901k75184
19218A927083k32077k50074j32576R8709P1449K2184p2980K43354M05916o51260
19208A429728j49026J90526N25378k43309m99696K02159J08074m29299J77844
$$ plain form
19199 1312379 1790814 1432935 1816586 1771325 1759542 1297155 1444600 1491132 1534400 1517303
19189 1517303 1562742 1510138 1817967 1957235 1539099 1253398 1272550 1611058 1632709 1091846
19179 1091846 1171465 1351002 1843341 1729517 1348808 1615377 1304427 1907299 2002421 1823835
19169 1823835 1441676 1454872 1459682 1882627 1908789 1770535 1676593 1465145 1211164 1657172
19159 1657172 1716194 1359776 1496625 1610216 1966509 1625342 1494484 1734678 2008449 1904176
19149 1904176 1606774 1408990 1966681 1855993 1570411 1908904 1914762 1730611 1777282 1846822
19139 1846822 2134581 1835752 2185635 1304494 2126135 2172111 2521872 2719283 3229350 3064830
19129 3064830 3270724 3296490 3932571 3915768 3987339 3632460 4067206 3820078 4224349 3738464
$$ packed form
19199A312379M78435l57879L83651m5261j1783m62387J47445M6532M3268j7097
19189A517303M5439n2604L07829J39268m18136k85701J9152L38508K1651n40863
19179A091846P9619J79537M92339j13824l80709K66569l10950O02872R5122j78586
19169A823835l82159J3196M810M22945K6162j38254r3942k11448k53981M46008
19159A657172N9022l56418J36849J13591L56293l41167j30858K40194K73771j04273
19149A904176k97402j97784N57691j10688k85582L38493N858j84151M6671O9540
19139A846822K87759k98829L49883q81141Q21641M5976L49761J97411N10067j64520
19129C064830K05894K5766O36081j6803P1571l54879M34746k47128M04271m85885
$$ plain form
19119 3738464 3549239 3592647 3566537 3571447 3825238 3547036 2964730 3390920 2643696 2805210
19109 2805210 2561646 2568708 2056566 2100202 2176896 2427722 2232601 2715408 2429282 2254656
19099 2254656 2196674 2596104 2422418 2807219 2438574 2382432 2967723 2658185 2089383 2665502
19089 2665502 2399988 2294320 2602309 2533177 3087782 2707523 2629676 2862170 2442521 3013448
19079 3013448 2601449 2688009 2457775 2708701 3138634 2769846 2655534 3786510 3560180
19070 3560180 3534776 4299341 4807101 5206781 5782893 7764276 7991341 10119399 11879301
19061 11879301 12946389 13833076 14373271 15164209 14526325 14453391 13330542 12666525 11285524
19052 11285524 9274847 7914348 7044333 6086832 6096984 5150367 5797399 6172865 7312278
$$ packed form
19119C738464j89225M3408k6110M910K53791k78202n82306M26190p47224J61514
19109B805210k43564P062n12142M3636P6694K50826j95121M82807k86126j74626
19099B254656n7982L99430j73686L84801l68645n6142N85291l09538n68802N76119
19089B665502k65514j05668L07989o9132N54605l80259p7847K32494m19649N70927
19079C013448m11999Q6560k30234K50926M29933l68788j14312J130976k26330
19070C560180k5404P64565N07760L99680N76112J981383K27065K128058J759902
19061A1879301J067088Q86687N40195P90938o37884p2934j122849o64017j381001
19052A1285524k010677j360499q70015r57501J0152r46617O47032L75466J139413
$$ plain form
19043 7312278 7904472 9897622 10725088 11752144 12057838 12232103 12270514 11324719 11004557
19034 11004557 9836882 8870740 7048816 6467477 5395166 4597910 4833971 4534808 4825142
19025 4825142 4324713 4691149 4297551 4863669 5205778 5800309 6251707 7490249 9125466
19016 9125466 10515411 12025736 13176980 14291835 14732076 15018971 15618839 14470408 13826365
19007 13826365 12922692 11028023 9882187 8341959 7750262 7555505 7575605 9006255 10765323
18998 10765323 11250297 12579024 13254961 13127863 12840511 12606088 12629240 11294462 10107411
18989 10107411 8919725 7261689 6383034 5446135 5510134 5146609 5461943 6037462 6471165
18980 6471165 8005742 8965962 10224286 11482242 12216854 12115306 12525812 12384907 11954156
$$ packed form
19043G312278N92194J993150Q27466J027056L05694J74265L8411r45795l20162
19034A1004557j167675r66142j821924n81339j072311p97256K36061k99163K90334
19025D825142n00429L66436l93598N66118L42109N94531M51398J238542J635217
19016I125466J389945J510325J151244J114855M40241K86895N99868j148431o44043
19007A3826365r03673j894669j145836j540228n91697j94757K0100J430650J759068
18998A0765323M84974J328727O75937j27098k87352k34423K3152j334778j187051
18989A0107411j187686j658036q78655r36899O3999l63525L15334N75519M33703
18980F471165J534577R60220J258324J257956P34612j01548M10506j40905m30751
$$ plain form
18971 11954156 11068339 10007504 8692111 7553353 6823561 6187805 6212731 6494992 6534622
18962 6534622 6259092 6842313 7114945 8053778 8296486 9158013 10889388 12616502 14419051
18953 14419051 16830766 20507444 23205389 27434412 32434504 37558627 42544652 47656978
18945 47656978 51535252 55095197 56803843 56639225 55147397 53234002 49245390 44079187
18937 44079187 38839518 32629317 27322766 22592096 18679740 15850000 12918158 11294558
18929 11294558 10254807 8708431 7986661 7141922 6142227 5638867 5074178 5128858 4673523
18920 4673523 4095101 4677649 4712037 4086326 4560560 3633725 4415601 4029403 3829844 4043325
18910 4043325 4155881 3984536 4159103 4178421 3962792 4062464 4348468 3913768 4253955 5059315
$$ packed form
18971A1954156q85817j060835j315393j138758p29792o35756K4926K82261L9630
18962F534622k75530N83221K72632R38833K42708Q61527J731375J727114J802549
18953A4419051K411715L676678K697945M229023N000092N124123M986025N112326
18945D7656978L878274L559945J708646j64618j491828j913395l988612n166203
18937D4079187n239669o210201n306551m730670l912356k829740k931842j623600
18929A1294558j039751j546376p21770q44739r99695n03360n64689N4680m55335
18920D673523n78422N82548L4388o25711M74234r26835P81876l86198j99559K13481
18910D043325J12556j71345J74567J9318k15629R9672K86004m34700L40187Q05360
$$ plain form
18900 5059315 4707906 4615743 4937269 5686288 5258152 6237887 6283099 6969841 7868443 8689510
18890 8689510 9254656 11043084 12478918 14924974 18233163 21623276 26657059 31085898
18882 31085898 36618641 40478482 44012616 45735527 46664438 46425563 44980990 41480195
18874 41480195 37196967 31486234 26549031 21440946 18431701 15007397 12220149 10537737
18866 10537737 9202784 7454114 6912503 6202586 5601235 5044246 4771986 4588776 3547218
18857 3547218 3169397 3321108 2784422 3084558 3008151 3167877 2524503 2427108 2981711 2588284
18847 2588284 2470647 2252127 2159598 2530476 2675306 2172266 2000360 2177475 2124926 2014169
18837 2014169 1794367 2305839 2207079 2219009 2103373 1678102 2386689 1686884 2197084 1981511
$$ packed form
18900E059315l51409r2163L21526P49019m28136R79735M5212O86742Q98602Q21067
18890H689510N65146J788428J435834K446056L308189L390113N033783M428839
18882C1085898N532743L859841L534134J722911R28911k38875j444573l500795
18874D1480195m283228n710733m937203n108085l009245l424304k787248j682412
18866A0537737j334953j748670n41611p09917o01351n56989k72260j83210j041558
18857C547218l77821J51711n36686L00136p6407J59726o43374r7395N54603l93427
18847B588284j17637k18520r2529L70878J44830n03040j71906J77115n2549j10757
18837B014169k19802N11472r8760J1930j15636m25271P08587o99805N10200k15573
$$ plain form
18827 1981511 1540522 1617990 1750401 1533552 1502125 1762774 1778058 1843738 1792338 1258319
18817 1258319 1808921 1597245 1451174 1827392 1632184 1118167 1636342 1857991 1659992
18808 1659992 1102528 1591299 1953424 1961092 1684288 1130031 1934208 1387086 1471771 1691602
18798 1691602 1497950 1726826 1936366 1578061 1300397 1919780 1862340 1864170 2195865 1888904
18788 1888904 1881560 1539655 1552746 2102076 1928286 1713638 2221800 2032907 1898338 1924901
18778 1924901 2132897 1577382 1766561 1565157 1436075 1800950 1780666 1898259 1822704 2087202
18768 2087202 1924303 1719348 1671396 1736359 2333477 1868534 1754100 2037418 2003920 1693850
18758 1693850 1712941 1961472 1673791 2198410 2196331 2081288 2044824 1734405 1237401 1598633
$$ packed form
18827A981511m40989P7468J32411k16849l1427K60649J5284O5680n1400n34019
18817A258319N50602k11676j46071L76218j95208n14017N18175K21649j97999
18808A659992n57464M88771L62125P668k76804n54257Q04177n47122Q4685K19831
18798A691602j93652K28876K09540l58305k77664O19383n7440J830L31695l06961
18788A888904p344l41905J3091N49330j73790k14648N08162j88893j34569K6563
18778A924901K07996n55515J89179k01404j29082L64875k0284J17593p5555K64498
18768B087202j62899k04955m7952O4963N97118m64943j14434K83318l3498l10070
18758A693850J9091K48531k87681N24619k079j15043l6464l10419m97004L61232
$$ plain form
18748 1598633 2021284 1979573 1528208 1728689 1477471 1655864 1586152 1471830 1759437 1398339
18738 1398339 1400246 1333991 1443819 1742818 1471380 1118524 1045341 1586791 2063262 1763519
18728 1763519 1740417 1543990 1548044 1636061 1695025 1344690 1347466 1443573 1459337 1073904 1839531
18717 1839531 1716320 1633379 1606542 1838767 1714692 1787081 1372322 1838065 1297386 1422918
18707 1422918 1758719 1634187 1495402 1623319 1715756 2014429 1758183 1884794 2095190 1842468
18697 1842468 2004746 1675166 1432106 1387565 1494064 1627790 2039823 1590494 1722597 1740004
18687 1740004 1587558 2008520 1890943 1509534 1448703 1839443 1550429 1004567 1376159 1602933
18677 1602933 1266716 1665199 1210500 1625629 1662320 948832 1649116 1524487 1526630 895215
$$ packed form
18748A598633M22651m1711m51365K00481k51218J78393o9712j14322K87607l61098
18738A398339J907o6255J09828K98999k71438l52856p3183N41450M76471k99743
18728A763519k3102j96427M054Q8017N8964l50335K776R6107J5764l85433P65627
18717A839531j23211q2941k6837K32225j24075P2389m14759M65743n40679J25532
18707A422918L35801j24532j38785J27917R2437K98673k56246J26611K10396k52722
18697A842468J62278l29580k43060m4541J06499J33726M12033m49329J32103J7407
18687A740004j52446M20962j17577l81409o0831L90740k89014n45862L71592K26774
18677A602933l36217L98483m54699M15129L6691p13488P00284j24629K143o31415
$$ plain form
18667 895215 1309294 1665587 1681626 1352998 1759508 1086373 1053434 1769042 1147879 1272604
18657 1272604 1483572 1696891 1107280 917154 1737605 1265836 1020025 1389428 1587745
18648 1587745 1428886 1615017 1313661 1379966 1300284 1636969 1438008 1063665 1375744 1313475
18638 1313475 1861138 1187593 1163124 1322549 1445034 1384045 1212555 1307727 1305395 762206
18628 762206 1353589 928557 1094679 1351500 1639141 964324 1500610 1323682 1635654 1696414
18618 1696414 2001134 1138046 1680718 1363919 1616249 1706748 1867966 1838333 1481891 1391754
18608 1391754 1335069 1596502 1704946 1781984 1301961 1294007 1237290 1524928 1591387 1777252
18598 1777252 1817452 1530105 1373263 1582481 1699648 1462106 1356141 1515835 985549 1410158
$$ packed form
18667H95215M14079L56293J6039l28628M06510o73135l2939P15608o21163J24725
18657A272604K10968K13319n89611j90126Q20451m71769k45811L69403J98317
18648A587745j58859J86131l01356O6305p9682L36685j98961l74343L12079o2269
18638A313475N47663o73545k4469J59425J22485o0989j71490R5172k332n43189
18628G62206N91383m25032J66122K56821K87641o74817N36286j76928L11972O0760
18618A696414L04720q63088N42672l16799K52330R0499J61218k9633l56442r0137
18608A391754n6685K61433J08444P7038m80023p954n6717K87638O6459J85865
18598A777252M0200k87347j56842K09218J17167k37542j05965J59694n30286M24609
$$ plain form
18588 1410158 1720253 1670089 1235789 1945196 1227058 1743822 1144776 1603009 1446665 1082427
18578 1082427 880193 1974089 1520820 2058391 1696450 1254058 1033701 1542272 1289106
18569 1289106 1435361 1610601 1638371 1437256 1606896 1566444 1333278 1698346 1729648 1217680
18559 1217680 1231107 1374409 1738675 1508935 1692005 1347823 1342616 1611154 1182104 1231662
18549 1231662 1164360 1640701 1623170 1597856 1273638 1733842 1414248 1378328 775236 1203691
18539 1203691 1308704 1245903 1316687 1291151 1447984 1728386 1005167 1487852 1446548 925671
18529 925671 1206803 923701 1218330 954282 862300 1138219 1604269 1157253 1040512 931549
18519 931549 638600 1262171 1123490 1205209 1099021 580053 1148017 1122579 814876 1150216
$$ packed form
18588A410158L10095n0164m34300P09407p18138N16764n99046M58233j56344l64238
18578A082427k02234J093896m53269N37571l61941m42392k20357N08571k53166
18569A289106J46255J75240K7770k01115J69640m0452k33166L65068L1302n11968
18559A217680J3427J43302L64266k29740J83070l44182n207K68538m29050M9558
18549A231662o7302M76341j7531k5314l24218M60204l19594l5920o03092M28455
18539A203691J05013o2801P0784k5536J56833K80402p23219M82685m1304n20877
18529I25671K81132k83102K94629k64048r1982K75919M66050m47016j16741j08963
18519I31549k92949O23571j38681Q1719j06188n18968N67964k5438l07703L35340
$$ plain form
18509 1150216 1135521 1208652 1550623 1354067 1231490 1218920 1191342 1111498 1320762 849435
18499 849435 623145 1047398 1217113 1344661 1470512 1134874 1228755 872726 927995 724402
18489 724402 731171 1105504 1184232 849393 1240379 908753 1249548 1152819 909422 1310887
18479 1310887 1297934 1475433 1498373 621576 1217228 1318001 1694459 1215741 1049805 750227
18469 750227 937020 1274483 843001 1287267 859311 1598394 1033480 923068 1184268 1167187
18459 1167187 949242 1362938 1024660 1235776 1060635 1259767 1187369 983952 1335566 1166676
18449 1166676 1126643 581560 1155277 1408055 1006295 877099 1596995 848021 1414480 1462766
18439 1462766 1304734 1369089 1622343 1373899 1349658 901021 1429912 803727 1090267 954245
$$ packed form
18509A150216j4695P3131L41971j96556j22577j2570k7578p9844K09264m71327
18499H49435k26290M24253J69715J27548J25851l35638R3881l56029N5269k03593
18489G24402O769L74333P8728l34839L90986l31626L40795r6729k43397M01465
18479A310887j2953J77499K2940F21576N95652J00773L76458m78718j65936k99578
18469G50227J86793L37463m31482M44266m27956P39083n64914j10412K61200j7081
18459A167187k17945M13696l38278K11116j75141J99132p2398k03417L51614j68890
18449A166676m0033n45083N73717K52778m01760j29196P19896p48974N66459M8286
18439A462766j58032O4355K53254k48444k4241m48637N28891o26185K86540j36022
$$ plain form
18429 954245 1362345 1214871 1117200 933947 1488103 825681 1322831 1105661 816447 1315508
18419 1315508 1106159 1091633 925233 1460902 843911 1387602 1185186 1680732 1133276 1175636
18409 1175636 1297400 598347 1127165 1481084 802155 856577 1004332 1318572 908228 1072845
18399 1072845 1685090 1278184 1190612 1063697 1720895 1293466 1029297 1326989 1388842 1107162
18389 1107162 1365355 1078854 1016562 1213690 1081951 1219159 601044 1312092 994156 541130
18379 541130 834658 858319 1208078 690062 1208495 1025684 1053998 735799 646101 1065197
18369 1065197 573459 890336 1077876 859359 1276381 580533 853972 1378456 1434687 1539125
18359 1539125 1249398 1046789 533568 802795 1304559 958002 1161872 993056 868129
$$ packed form
18429I54245M08100j47474r7671j83253N54156o62422M97150k17170k89214M99061
18419A315508k09349j4526j66400N35669o16991N43691k02416M95546n47456M2360
18409A175636J21764E98347N28818L53919o78929N4422J47755L14240m10344J64617
18399A072845O12245m06906q7572j26915O57198m27429k64169K97692O1853k81680
18389A107162K58193k86501o2292J97128j31739J37208F01044P11048l17936m53026
18379E41130K93528K3661L49759n18016N18433j82811K8314l18199q9698M19096
18369A065197m91738L16877J87540k18517M17022E80533K73439N24484N6231J04438
18359A539125k89727k02609n13221K69227N01764l46557K03870j68816j24927
$$ plain form
18350 868129 1540452 1768634 858999 958938 958866 1144885 987193 891092 1396459 1223454 874767
18339 874767 991164 1030669 1250910 1033920 683203 1141351 1294433 1430075 1253556 1025718
18329 1025718 1279775 1207813 1078371 1404693 1049923 1100968 1249741 826259 1171138 1068206
18319 1068206 866132 1111132 1398185 1639222 760839 1099923 1285165 1237640 1424517 1134411
18309 1134411 1138644 1172747 691011 1122951 1347205 763497 1186379 861753 1082159 841280
18299 841280 544754 1380418 1124963 1342923 1327721 1177118 1173239 1614264 1181930 1130211
18289 1130211 1061884 1184304 1530473 813575 1328106 1231188 1031325 1350171 1708652 1368069
18279 1368069 1335625 1333790 820169 985820 1177905 993657 1149338 1000038 1296952 1540273
$$ packed form
18350H68129O72323K28182H58999R9939p2J86019j57692r6101N05367j73005l48687
18339H74767J16397L9505K20241k16990l50717M58148J53082J35642j76519k27838
18329A025718K54057p1962j29442L26322l54770N1045J48773m23482L44879j02932
18319A068206k02074K45000K87053K41037G60839L39084J85242m7525J86877k90106
18309A134411M233L4103m81736M31940K24254n83708M22882l24626K20406k40879
18299H41280k96526Q35664k55455K17960j5202j50603l879M41025m32334n1719
18289A130211o8327J22420L46169p16898N14531r6918j99863L18846L58481l40583
18279A368069l2444j835n13621J65651J92085j84248J55681j49300K96914K43321
$$ plain form
18269 1540273 1196402 903181 884439 1037619 1289139 1678388 959899 977312 1221191 1113428
18259 1113428 1112447 708151 789945 1274539 577945 986315 1241701 1066000 1330495 1099336
18249 1099336 1190842 1146101 1193096 1392229 1265102 1546803 1190680 1281522 1285149 1072325
18239 1072325 1307239 1109142 1118291 1389807 1480164 1085422 1475782 947623 818698 1338567
18229 1338567 968033 1090386 944874 1139650 459744 492797 1228092 1304382 1370818 1214231
18219 1214231 1295737 1261124 737150 1255317 923547 953133 1297842 1185441 1232230 995586
18209 995586 712888 1298691 1113528 1192813 1184910 988296 1448011 1276464 1576923 1355283
18199 1355283 1030586 1049055 1024458 1135952 887632 1501265 1050602 1204964 1504066 1514302
$$ packed form
18269A540273l43871k93221j8742J53180K51520L89249p18489J7413K43879j07763
18259A113428r81m04296Q1794M84594E77945M08370K55386j75701K64495k31159
18249A099336R1506m4741M6995J99133j27127K81701l56123R0842L627k12824
18239A072325K34914j98097R149K71516R0357l94742L90360n28159j28925N19869
18229A338567l70534J22353j45512J94776D59744L3053P35295P6290O6436j56587
18219A214231Q1506l4613n23974N18167l31770K9586L44709j12401M6789k36644
18209I95586k82698N85803j85163P9285p903j96614M59715j71547L00459k21640
18199A355283l24697J8469k4597J11494k48320O13633m50663J54362K99102J0236
$$ plain form
18189 1514302 1095171 1273500 1191595 1222560 1124981 1110536 587281 743765 1417286 1031622
18179 1031622 834793 721154 979419 1177911 1231862 1238547 895145 1318510 1285373 1161060
18169 1161060 874194 890017 1100994 975132 942807 952315 808581 904750 1345727 1058036
18159 1058036 853264 1214379 1224563 991017 1311912 1097255 956162 1266405 899492 905677
18149 905677 1251818 1034114 1216032 1195459 819591 1108351 922882 1024486 1032013 1131558
18139 1131558 972155 1183229 968279 1334942 825232 569624 1429485 531236 702452
18130 702452 1024222 827931 1278249 1419748 694889 1115642 705038 1312817 1062548 1078583
18120 1078583 893906 1273711 892983 838989 873942 657329 1344171 886375 986151 1226041
$$ packed form
18189A514302m19131J78329q1905L0965r7579j4445n23255J56484O73521l85664
18179A031622j96829j13639K58265J98492N3951O685l43402M23365l3137j24313
18169A161060k86866J5823K10977j25862l2325R508j43734R6169M40977k87691
18159A058036k04772L61115J0184k33546L20895k14657j41093L10243l66913O185
18149I05677L46141k17704J81918k0573l75868K88760j85469J01604P527R9545
18139A131558j59403K11074k14950L66663n09710k55608Q59861E31236J71216
18130G02452L21770j96291M50318J41499F94889M20753m10604O07779k50269J6035
18120A078583j84677L79805l80728n3994L4953k16613O86842m57796R9776K39890
$$ plain form
18110 1226041 1001661 1041753 1447767 1539440 1077923 1390049 694190 1183256 822953 962961
18100 962961 1039275 1158619 923754 986950 1356690 1473227 1013128 1191190 1014238 1276295
18090 1276295 945815 995095 859078 703852 1087323 996597 1133481 1263396 318362 621553
18080 621553 1135693 646810 937944 1212848 1368446 1051250 1106928 690676 1010559 1439875
18070 1439875 764080 683348 513277 907844 1312101 890508 935274 625491 890166 1259049
18060 1259049 1178396 1185709 957684 967861 998262 1323848 703731 878867 814035 1250224
18050 1250224 1057042 657671 665798 980108 1296850 927009 762177 746132 787008 822951
18040 822951 986613 709138 535826 1171382 1167738 934449 564442 1053404 1157378 865684
$$ packed form
18110A226041k24380M0092M06014R1673m61517L12126F94190M89066l60303J40008
18100I62961P6314J19344k34865O3196L69740J16537m60099J78062j76952K62057
18090A276295l30480M9280j36017j55226L83471r0726J36884J29915C18362L03191
18080F21553N14140m88883K91134K74904J55598l17196N5678m16252L19883M29316
18070A439875o75795q0732j70071L94567M04257m21593M4766l09783K64675L68883
18060A259049q0653P313k28025J0177L0401L25586o20117J75136o4832M36189
18050A250224j93182l99371Q127L14310L16742l69841j64832j6045M0876L5943
18040H22951J63662k77475j73312O35556l644k33289l70007M88962J03974k91694
$$ plain form
18030 865684 1321259 1044773 1191631 1060765 859056 935470 762141 518143 391072 1338062
18020 1338062 596526 875235 1008620 822616 1174060 1446334 655833 639216 706591 374928
18010 374928 1051313 1182131 883694 938998 1163848 1178667 1336340 888217 1475053 901300
18000 901300 720849 820692 921384 1351557 873322 351559 963633 1075530 1155269 985442
17990 985442 824775 739104 1026348 615961 1130793 1140228 835116 799540 1055763 1370377
17980 1370377 1368331 1303165 1421331 708604 983702 1254727 780750 828126 700903 656862
17970 656862 1441990 1100263 1516389 1053494 988093 1321984 994842 1206080 945890 1112026
17960 1112026 1440858 1264544 1065817 1468681 1210458 1077069 1142689 1168674 927603 1433043
$$ packed form
18030H65684M55575k76486J46858j30866k01709P6414j73329k43998j27071R46990
18020A338062E96526K78709J33385j86004L51444K72274F55833j6617O7375l31663
18010C74928O76385J30818k98437N5304K24850J4819J57673m48123N86836n73753
18000I01300j80451R9843J00692M30173m78235C51559O12074J11897P9739j69827
17990I85442j60667q5671K87244m10387N14832R435l05112l5576K56223L14614
17980A370377k046o5166J18166G08604K75098K71025m73977M7376j27223m4041
17970F56862P85128l41727M16126m62895o5401L33891l27142K11238k60190J66136
17960A112026L28832j76314j98727M02864k58223j33389O5620K5985k41071N05440
$$ plain form
17950 1433043 1180991 1559498 819250 1289558 1038209 857594 1276727 1294321 1325743 1453963
17940 1453963 1416547 1658491 1001173 1776496 1479599 1088170 1080606 1416428 1204346 1324160
17930 1324160 1167162 1285337 1550031 817374 1266508 1204438 1524372 866024 1563237 1059255
17920 1059255 999807 1569243 1574003 1304218 1057722 1395672 1514957 1406252 1395112 1539722
17910 1539722 1296932 1345818 1337183 1915256 2074393 1695474 1776092 1584451 1775614 1158294
17900 1158294 1952345 1598523 1305783 1261507 1692932 1600408 1542137 1831119 1594681 2067978
17890 2067978 1722853 1785117 1639905 1587169 2231493 2001972 1907349 1747684 1910024 1543209
17880 1543209 1658817 1518654 1975340 1513459 1602582 1657048 1855750 1594600 1767065 1785175
$$ packed form
17950A433043k52052L78507p40248M70308k51349j80615M19133J7594L1422J28220
17940A453963l7416K41944o57318P75323k96897l91429p564L35822k12082J19814
17930A324160j56998J18175K64694p32657M49134o2070L19934o58348O97213n03982
17920A059255n9448N69436M760k69785k46496L37950J19285j08705j1140J44610
17910A539722k42790M8886q635N78073J59137l78919Q0618j91641J91163o17320
17900A158294P94051l53822k92740m4276M31425r2524n8271K88982k36438M73297
17890B067978l45125O2264j45212n2736O44324k29521r4623j59665J62340l66815
17880A543209J15608j40163M56686m61881Q9123N4466J98702k61150J72465J8110
$$ plain form
17870 1785175 1716994 1915201 1751825 1649117 2158399 2028274 1734636 1460711 1740888 1399692
17860 1399692 1940413 1750424 1583744 1577303 1357742 1754889 1462603 1473611 1530044 1677141
17850 1677141 1431379 1966585 2016199 2036039 1584091 1159941 1522835 1574907 1688763 1810875
17840 1810875 2108387 1676590 1388910 1509708 1266492 1411685 1590148 1720377 1919212
17831 1919212 1781729 1199071 1671460 1806000 1349726 1091121 1773891 1794211 1221314 1381774
17821 1381774 1389891 1307833 1790899 1660461 1946904 1881737 1886636 2060965 1858790 1900801 1337201
17810 1337201 1391883 1723604 1814507 1710962 1439297 1266507 1332433 1262946 1297757 1857156
17800 1857156 1787478 1592655 2128921 2114427 1369906 1866628 2115734 1911223 1742744 1969084
$$ packed form
17870A785175o8181J98207j63376j02708N09282j30125k93638k73925K80177l41196
17860A399692N40721j89989j66680o441k19561L97147k92286J1008N6433J47097
17850A677141k45762N35206M9614J9840m51948m24150L62894N2072J13856J22112
17840A810875K97512m31797k87680J20798k43216J45193J78463J30229J98835
17831A919212j37483n82658M72389J34540m56274k58605O82770K0320n72897J60460
17821A381774Q117q2058M83066j30438K86443o5167M899J74329k02175M2011n63600
17810A337201N4682L31721R0903j03545k71665j72790O5926o9487L4811N59399
17800A857156o9678j94823N36266j4494p44521M96722K49106k04511j68479K26340
$$ plain form
17790 1969084 2100244 1475617 1058224 1451262 1222271 1510163 1186429 1579856 1620901 764567
17779 1572803 1280418 1244740 1688164 1578731 1491812 1073828 1133149 1214054 1469326 1530960
17769 1530960 1730038 1628509 1534743 1103084 1309528 845843 1204095 751850 1205761 1577871
17759 1577871 1088768 1268124 1533359 1192793 1279392 2088474 1401621 1175359 1591937 1616653
17749 1616653 1742876 1757222 1439024 1460162 1419975 1516037 1176312 1413001 1486240 1531392
17739 1531392 1472762 1364045 1394233 1132994 1693776 1731185 1344914 1634967 1228651 1253819
17729 1253819 1660823 1129059 901807 1333554 1199168 1697260 1551918 1400453 1480079 1204655
17719 1204655 1096963 1485831 1274536 1289480 1494275 1742358 1061739 1739510 1227246 1839278
$$ packed form
17790A969084J31160o24627m17393L93038k28991K87892l23734L93427M1045G64567
17779A572803k92385l5678M43424j09433q6919m17984N9321Q0905K55272O1634
17769A530960J99078j01529r3766m31659K06444m63685L58252m52245M53911L72110
17759A577871m89103J79356K65235l40566Q6599Q09082o86853k26262M16578K4716
17749A616653J26223J4346l18198K1138m0187R6062l39725K36689P3239M5152
17739A531392n8630j08717L0188k61239N60782L7409l86271K90053m06316K5168
17729A253819M07004n31764k27252M31747j34386M98092j45342j51465P9626k75424
17719A204655j07692L88868k11295J4944K04795K48083o80619O77771n12264O12032
$$ plain form
17709 1839278 1851068 1689701 1195690 919464 1662087 968143 1865448 1783285 1621826 1268025
17699 1268025 1049849 881603 1198589 1581047 1364124 1305275 1664412 1373383 1039278 1492382
17689 1492382 1431516 1071452 1325888 1528695 1413538 1508591 1183072 1547867 1753734 1401522
17679 1401522 1564676 1407012 1420606 1552072 1444102 1309250 1673461 1061037 1287062 1178778
17669 1178778 1515163 1125609 1346948 1311758 1274908 1075443 1159189 1221387 1506481 1403960
17659 1403960 1271552 1741410 1583563 1441910 1340047 1495300 1958392 1131497 1478656
17650 1478656 1642967 2013387 1650569 1838149 1589044 1705803 1446774 1765151 1968920
17641 1968920 2252922 1638193 2097915 1609719 1555155 2237581 1817188 1717042 2056742 2283675
$$ packed form
17709A839278J1790j61367m94011k76226P42623o93944Q97305q2163j61459l53801
17699A268025k18176j68246L16986L82458k16923n8849L59137k91029l34105M53104
17689A492382o0866l60064K54436K02807j15157R5053l25519L64795K05867l52212
17679A401522J63154j57664J3594J31466j07970j34852L64211o12424K26025j08284
17669A178778L36385l89554K21339l5190l6850j99465Q3746O2198K85094j02521
17659A403960j32408M69858j57847j41653j01863J55253M63092q26895L47159
17650A478656J64311L70420l62818J87580k49105J16759k59029L18377K03769
17641A968920K84002o14729M59722m88196n4564O82426m20393j00146L39700K26933
$$ plain form
17631 2283675 1604259 2307730 2175206 2367573 2088553 1823198 1859542 2056272 2538174 2073394
17621 2073394 2720840 2143219 2104124 2496048 2158279 1950791 2037292 2665380 2457658 2384515
17611 2384515 2456242 2336301 2599644 2745260 2633839 2364744 2819311 2424559 2809973 2411538
17601 2411538 2838798 2802306 2357699 2704693 2536025 1843763 2668177 2545620 2564483 2732405
17591 2732405 2639418 2605621 2834349 2350932 2650110 2410110 2423907 2166770 2671294 2507025
17581 2507025 2451884 2483378 2649568 2510280 2418754 2623308 2388756 2120687 2919957 2625970
17571 2625970 2221816 2457693 2646463 2254462 2382822 2038491 2252416 2394515 2628002
17562 2628002 2609696 2544779 2617039 2084082 2440296 2276567 2431506 2426118 1926322 2355074
$$ packed form
17631B283675o79416P03471j32524J92367k79020k65355L6344J96730M81902m64780
17621B073394O47446n77621l9095L91924l37769k07488Q6501O28088k07722p3143
17611B384515P1727j19941K63343J45616j11421k69095M54567l94752L85414l98435
17601B411538M27260l6492m44607L46994j68668o92262Q24414j22557J8863J67922
17591B732405r2987l3797K28728m83417K99178k40000J3797k57137N04524j64269
17581B507025n5141L1494J66190j39288r1526K04554k34552k68069P99270k93987
17571B625970m04154K35877J88770l92001J28360l44331K13925J42099K33487
17562B628002j8306o4917P2260n32957L56214j63729J54939n388m99796M28752
$$ plain form
17552 2355074 2350390 2285664 2005539 2724280 2394331 1752682 1846166 2315022 2506690 2553432
17542 2553432 2627958 2056465 2414593 2524627 2605199 2280738 2312683 2770835 2347299 2949372
17532 2949372 2860420 2172602 2509460 2466221 2168855 2598568 2883384 2390269 2370854 2690216
17522 2690216 2380871 2655507 2712867 2571680 2491364 2430600 2610885 2755713 2787347 3194393
17512 3194393 3062461 3377759 3117888 3926926 3775033 3793135 4033134 3965638 4403330 4097669
17502 4097669 3810740 3892097 4159504 3716133 3720580 3941757 4557751 4813906 4847187 5359885
17492 5359885 5624050 6631434 6876871 7118291 9018967 9762176 11306817 15380834 22417866
17483 22417866 32751269 47325282 64064957 78957048 89980020 97018605 100631216
$$ packed form
17552B355074m684o4726k80125P18741l29949o41649R3484M68856J91668M6742
17542B553432P4526n71493L58128J10034Q0572l24461L1945M58152m23536O02073
17532B949372q8952o87818L36858m3239k97366M29713K84816m93115j9415L19362
17522B690216l09345K74636N7360j41187q0316o0764J80285J44828L1634M07046
17512C194393j31932L15298k59871Q09038j51893J8102K39999o7496M37692l05661
17502D097669k86929Q1357K67407m43371M447K21177O15994K56155L3281N12698
17492E359885K64165J007384K45437K41420J900676P43209J544641M074017P037032
17483B2417866J0333403J4574013J6739675J4892091J1022972P038585L612611
$$ plain form
17476 100631216 100951896 98009049 92171024 82085437 68640192 55266377 44365458
17469 44365458 40177570 42722969 51988085 65875203 79760445 91246073 99249149 102330067
17461 102330067 102665836 99955712 93998816 84754674 71246271 55447352 39949388 27897313
17453 27897313 20063551 15374319 12275425 10477425 9903537 8819387 8343411 8150519
17445 8150519 7726534 7942899 8622912 8836595 9324218 9578763 9934691 9589818 10185711
17436 10185711 9686897 9341449 9418613 8480368 8187029 8376965 8309485 8028637 8161540 8771770
17426 8771770 8670346 9281535 8973619 8705888 8617189 8421470 7436085 7317303 6342753 5910467
17416 5910467 6011586 5902419 5959500 5132842 5138018 5547543 5967059 5637107 5646806 5567467
$$ packed form
17476A00631216L20680k942847n838025j0085587j3445245j3373815j0900919
17469D4365458m187888K545399R265116J3887118J3885242J1485628Q003076L080918
17461A02330067L35769k710124n956896r244142j3508403j5798919j5497964j2052075
17453B7897313p833762m689232l098894j798000n73888j084150m75976j92892
17445H150519m23985K16365O80013K13683M87623K54545L55928l44873N95893
17436A0185711m98814l45448P7164r38245k93339J89936o7480k80848J32903O10230
17426H771770j01424O11189l07916k67731q8699j95719r85385j18782r74550m32286
17416E910467J01119j09167N7081q26658N176M09525M19516l29952R699p9339
$$ plain form
17406 5567467 5449536 5561027 5625675 5720670 6398802 6765006 6595820 7182037 6953945 7963481
17396 7963481 7825073 8216223 8225354 8438525 9244507 9106669 9696237 11010382 11456656 12429650
17386 12429650 13307812 14363195 15336071 15631899 16384081 16876369 16841700 16815662 16143480
17377 16143480 15565944 15207555 14610482 14586571 13801770 13949935 14643725 14930971 15824347
17368 15824347 16072109 17387585 17945092 19150392 19564796 20157626 20179693 20422506 20485207
17359 20485207 20773902 20351757 19945353 20138019 19352671 19680747 19540011 19755333 20200699
17350 20200699 20869633 21511114 22389653 23681171 25221544 26616343 27708592 29245534
17342 29245534 30468254 31526223 32226915 32543003 32835002 32628036 32092612 31891772 30689416
$$ packed form
17406E567467j17931J11491O4648R4995O78132L66204j69186N86217k28092J009536
17396G963481j38408L91150R131K13171Q05982j37838N89568J314145M46274R72994
17386A2429650Q78162J055383R72876K95828P52182M92288l4669k6038o72182
17377A6143480n77536l58389n97073k3911p84801J48165O93790K87246Q93376
17368A5824347K47762J315476N57507J205300M14404N92830K2067K42813O2701
17359B0485207K88695m22145m06404J92666p85348L28076j40736K15322M45366
17350B0200699O68934O41481Q78539J291518J540373J394799J092249J536942
17342B9245534J222720J057969P00692L16088K91999k06966n35424k00840j202356
$$ plain form
17333 30689416 29889635 30175780 29123447 29676474 30413535 31220984 32177731 33376211 35039472
17324 35039472 35451732 36900535 37916383 37783436 38380035 38075722 37722536 36577789 35431697
17315 35431697 34595869 33679391 31599534 30652911 29404448 28770753 27214421 26684364 26899939
17306 26899939 26148242 26646082 27230105 27871800 28870055 30114063 31563921 32652226 32537760
17297 32537760 33151920 33462726 32408331 31816930 31539933 30012558 28419385 27016179 25756717
17288 25756717 23901338 23536340 22343459 22144431 21502496 21136580 21553637 20757374 21615948
17279 21615948 20605031 20027609 19649403 18981209 17729135 16601724 15859969 15228351 13790688
17270 13790688 13197911 12138866 12020358 10746904 10397697 9615119 9853194 8865627 9494863
$$ packed form
17333C0689416p99781K86145j052333N53027P37061Q07449R56747J198480J663261
17324C5039472M12260J448803J015848j32947N96599l04313l53186j144747j146092
17315C5431697q35828r16478k079857r46623j248463o33695j556332n30057K15575
17306B6899939p51697M97840N84023O41695R98255J244008J449858J088305j14466
17297C2537760O14160L10806j054395n91401k76997j527375j593173j403206j259462
17288B5756717j855379l64998j192881j99028o41935l65916M17057p96263Q58574
17279B1615948j010917n77422l78206o68194j252074j127411p41755o31618j437663
17270A3790688n92777j059045j18508j273454l49207p82578K38075r87567O29236
$$ plain form
17261 9494863 8516025 8692059 7861767 7735326 8451741 7350351 7291523 7692871 7478124
17252 7478124 7564670 7361133 7471955 7293312 7366168 7168147 6520365 6522414 6838283 5979499
17242 5979499 6474156 5994511 6154040 5798070 5566823 5850336 5863452 6052548 5539889 6186031
17232 6186031 5527519 5777303 5871789 6147995 6397953 6202448 6203265 6501656 6549652 6746497
17222 6746497 6342325 6148648 6383642 6564501 6720768 6417854 6446846 6808228 6158337 5925763
17212 5925763 6628518 6663575 6564274 6902943 6726289 7154817 6953120 7134200 7300987 7355219
17202 7355219 7661133 7559246 7883478 7207888 7251473 6968026 6928113 6686130 6152996 5238120
17192 5238120 5660808 4470885 5038207 4847253 4925970 5179526 4810042 4506220 4504695 4933376
$$ packed form
17261I494863r78838J76034q30292j26441P16415j101390n8828M01348k14747
17252G478124Q6546k03537J10822j78643P2856j98021o47782K049L15869q58784
17242E979499M94657m79645J59529l55970k31247K83513J3116J89096n12659O46142
17232F186031o58512K49784R4486K76206K49958j95505Q17K98391M7996J96845
17222F746497m04172j93677K34994J80859J56267l02914K8992L61382o49891k32574
17212E925763P02755L5057r9301L38669j76654M28528k01697J81080J66787N4232
17202G355219L05914j01887L24232o75590M3585k83447l9913k41983n33134r14876
17192E238120M22688j189923N67322j90954P8717K53556l69484l03822j525M28681
$$ plain form
17182 4933376 4981379 4562997 4099884 4153135 4293963 3968845 4066710 3986121 3951664 4436226
17172 4436226 4265300 4018660 4060823 3965845 4712162 4252621 4027216 3751465 4398273 4400408
17162 4400408 4397524 4797620 4842752 4665442 4904402 5050356 4859787 4978505 4832705 4875863
17152 4875863 5308638 5180000 4951959 5097396 4720356 4794349 4865390 4438758 4850853 4848530
17142 4848530 5091719 4747223 4527075 4807178 5344485 4819022 4692685 4647426 4839519 4966495
17132 4966495 5021630 4706554 4995499 4612643 4728001 4829096 4964209 4714800 4231944 4867114
17122 4867114 4735367 4544372 4903372 4937201 4859243 4754665 4897623 4764768 4237781 4507414
17112 4507414 4220826 4109407 3581883 3839083 3594979 3819365 3395784 3393988 3773367 3084592
$$ packed form
17182D933376M8003m18382m63113N3251J40828l25118R7865q0589l4457M84562
17172D436226j70926k46640M2163r4978P46317m59541k25405k75751O46808K135
17162D400408k884M00096M5132j77310K38960J45954j90569J18718j45800M3158
17152D875863M32775j28638k28041J45437l77040P3993P1041m26632M12095k323
17142D848530K43189l44496k20148K80103N37307n25463j26337m5259J92093J26976
17132D966495N5135l15076K88945l82856J15358J01095J35113k49409m82856O35170
17122D867114j31747j90995L59000L3829p7958j04578J42958j32855n26987K69633
17112D507414k86588j11419n27524K57200k44104K24386m23581j796L79379o88775
$$ plain form
17102 3084592 2987093 2630326 2801211 3257226 2889922 2813731 3147089 3252866 3099466 2805675
17092 2805675 3437227 2653227 2572435 2985792 2459689 2468496 2145959 2438505 2554167 2529777
17082 2529777 2272608 2553435 2359661 2358435 2392744 2396086 2584691 2689077 2153877 2557745
17072 2557745 2381490 2005670 2590364 2238551 1599171 2583181 2299504 2632129 2714995 2429816
17062 2429816 2765798 2371827 2044252 2874331 2681543 2843125 2988205 2581895 2547625 2359020
17052 2359020 2717113 2763572 2396662 3119862 2519761 2659133 3063543 2625950 2995736 3000628
17042 3000628 2588426 2806047 3219304 3127366 3292444 3166357 3031613 2934406 3262758 3174509
17032 3174509 3458182 2787839 2660837 3321131 2564199 2831547 2807469 2837748 2581319 2585469
$$ packed form
17102C084592r7499l56767J70885M56015l67304p6191L33358J05777j53400k93791
17092B805675O31552p84000q0792M13357n26103Q807l22537K92546J15662k4390
17082B529777k57169K80827j93774j226L4309L342J88605J04386n35200M03868
17072B557745j76255l75820N84694l51813o39380R84010k83677L32625Q2866k85179
17062B429816L35982l93971l27575Q30079j92788J61582J45080m06310l4270j88605
17052B359020L58093M6459l66910P23200o00101J39372M04410m37593L69786M892
17042C000628m12202K17621M13257r1938J65078j26087j34744r7207L28352q8249
17032C174509K83673o70343j27002O60294p56932K67348k4078L0279k56429M150
$$ plain form
17022 2585469 2739506 2280351 2685615 3112131 2436912 2332370 2784902 2613771 2277674
17013 2277674 2426742 2481423 2479766 2229727 2097056 2322582 2756748 2589229 2047387 2243684
17003 2243684 2275032 2805115 2367311 1933020 2643161 2178322 2663852 2396623 2819666 2305135
16993 2305135 2267884 2513188 2362887 2518908 2279750 2738207 2664234 2380781 2393717 2489673
16983 2489673 2212405 2152413 1986879 2650459 2501078 2574275 2394852 2846906 3072933 2395232
16973 2395232 2865476 3280809 2561374 3880898 3322651 3938173 4525999 4155931 5036567
16964 5036567 4918968 5159619 5493550 5873484 5875114 6273204 6673923 6424923 7056597 6670106
16954 6670106 7164840 7182097 7354766 6552914 6700434 6331849 6421880 6194168 5726565 5869901
$$ packed form
17022B585469J54037m59155M05264M26516o75219j04542M52532j71131l36097
17013B277674J49068N4681j657k50039j32671K25526M34166j67519n41842J96297
17003B243684L1348N30083m37804m34291P10141m64839M85530k67229M23043n14531
16993B305135l7251K45304j50301J56021k39158M58457p3973k83453J2936R5956
16983B489673k77268n9992j65534O63580j49381P3197j79423M52054K26027o77701
16973B395232M70244M15333p19435J319524n58247O15522N87826l70068Q80636
16964E036567j17599K40651L33931L79934J630L98090M00719k49000O31674l86491
16954F670106M94734J7257J72669q01852J47520l68585R0031k27712m67603J43336
$$ plain form
16944 5869901 5398012 4775666 4750099 4559059 4305460 4287405 3784289 3869502 3245555 3146455
16934 3146455 3369934 3355541 2683607 2862406 2929040 2615834 2716343 2863850 2672266 2807394
16924 2807394 2781611 3016714 2836410 2663270 2330465 2751289 2591913 2993122 2331509 2441810
16914 2441810 2235010 2402439 2265439 1867567 1958379 1787691 2168047 2223897 1671686 1747915
16904 1747915 1757634 2320091 1904753 1947226 1870045 2112713 2086664 2248001 1793140 2369690
16894 2369690 2057930 2060038 1639619 1958199 1959916 1655798 1604846 1787556 1619787 2110695
16884 2110695 1582273 2053832 1801742 1639865 1810010 1696640 1955706 1777968 2081161
16875 2081161 2193734 1723247 2305956 2271940 1658454 2026951 2131334 2191188 1867685 1746408
$$ packed form
16944E869901m71889o22346k5567j91040k53599j8055n03116Q5213o23947r9100
16934C146455K23479j4393o71934J78799O6634l13206J00509J47507j91584J35128
16924B807394k5783K35103j80304j73140l32805M20824j59376M01209o61613J10301
16914B441810k06800J67429j37000l97872R0812j70688L80356N5850n52211P6229
16904A747915R719N62457m15338M2473p7181K42668k6049J61337m54861N76550
16894B369690l11760K108m20419L18580J717l04118n0952J82710j67769M90908
16884B110695n28422M71559k52090j61877J70145j13370K59066j77738L03193
16875B081161J12573m70487N82709l4016o13486L68497J04383N9854l23503j21277
$$ plain form
16865 1746408 1924907 1661037 2022630 2071856 2160454 2106873 2205633 1921752 1934459 1984242
16855 1984242 1974972 2172901 2214871 2008945 2274155 2380624 1943173 2137635 1876627 1732254
16845 1732254 1908715 2134121 2151834 2021270 1625922 1684950 1931274 2260924 2310906 1697928
16835 1697928 1827921 1965266 1737354 2008074 1920268 2290956 1952405 2255702 1950053 1898665
16825 1898665 2089919 2154955 2307845 2289533 1937739 2159196 2504984 2093962 2729683 2534565
16815 2534565 3489587 2699677 2861686 2853530 2939290 2945260 3120890 3067225 2698314 2547536
16805 2547536 3064862 3159136 2522480 2510632 2518562 2999810 2676060 2460490 2244502 2959070
16795 2959070 2808160 2580754 2684166 2371575 2329462 1973438 1632132 1906378 1283901 1498225
$$ packed form
16865A746408J78499k63870L61593M9226Q8598n3581R8760k83881J2707M9783
16855A984242r270J97929M1970k05926K65210J06469m37451J94462k61008j44373
16845A732254J76461K25406J7713j30564l95348N9028K46324L29650M9982o12978
16835A697928J29993J37345k27912K70720q7806L70688l38551L03297l05649n1388
16825A898665J91254O5036J52890j8312l51794K21457L45788m11022O35721j95118
16815B534565R55022p89910J62009q156Q5760N970J75630n3665l68911j50778
16805B547536N17326R4274o36656j1848P930M81248l23750k15570k15988P14568
16795B959070j50910k27406J03412l12591m2113l56024l41306K74246o22477K14324
$$ plain form
16785 1498225 1803260 1335648 1711385 1430977 1987680 2221388 1863510 1488770 1279538
16776 1279538 2374672 1261292 1538062 1180464 1528968 1669298 1687391 1799620 1723506
16767 1723506 1521817 1568709 1367509 1765915 1658609 1493949 1731611 1303528 1544959 1519235
16757 1519235 1649260 1547045 1670975 1100614 1565746 1414385 2253620 1755033 1562446
16748 1562446 1741212 1260965 1742375 1574434 1161704 1212260 1482967 1356899 1426750 1963953
16738 1963953 1503822 1769268 1710574 1513508 2053996 1504930 1754020 1810700 1810039 1830321
16728 1830321 1679332 2053548 1739499 1838238 2076966 2064688 1948788 2147279 2224198 1864265
16718 1864265 2568163 2083106 2706393 2683770 2226553 2429629 2341934 2554490 2373588 2687555
$$ packed form
16785A498225L05035m67612L75737k80408N56703K33708l57878l74740k09232
16776A279538J095134j113380K76770l57598L48504J40330J8093J12229p6114
16767A723506k01689M6892k01200L98406j07306j64660K37662m28083K41431k5724
16757A519235J30025j02215J23930n70361M65132j51361Q39235m98587j92587
16748A562446J78766m80247M81410j67941m12730N0556K70707j26068O9851N37203
16738A963953m60131K65446n8694j97066N40488n49066K49090N6680o61K0282
16728A830321j50989L74216l14049R8739K38728j2278j15900J98491P6919l59933
16718A864265P03898m85057O23287k2623m57217K03076q7695K12556j80902L13967
$$ plain form
16708 2687555 2578425 2740336 2613424 3225210 3192297 3529479 3774056 4147629 4375476 4057161
16698 4057161 4517824 4264577 4576007 4558546 4511619 4342081 3865110 4076749 4026380 4404386
16688 4404386 4526138 4098317 4505310 4393681 4909662 4809995 4174616 3691802 3499966 3783776
16678 3783776 3467954 3153248 3090140 2871111 3218028 3054691 3182497 3132711 3488182 3040198
16668 3040198 3846380 3766040 4100481 4657741 4555330 5058645 4957136 4743237 4642856 4484827
16658 4484827 4154218 3966003 4310028 4129486 4624311 4563983 4843043 4880598 4573817 4458336
16648 4458336 4108691 3761558 3513459 3424712 3100281 2705372 1883700 1904413 1882855 1688186
16638 1688186 1649655 1716751 1279250 1684827 1397801 1092983 1459363 1484871 1597095 1453215
$$ packed form
16708B687555j09130J61911j26912O11786l2913L37182K44577L73573K27847l18315
16698D057161M60663k53247L11430j7461m6927j69538m76971K11639n0369L78006
16688D404386J21752m27821M06993j11629N15981r9667o35379m82814j91836K83810
16678C783776l15822l14706o3108k19029L46917j63337J27806m9786L55471m47984
16668C040198Q06182q0340L34441N57260j02411N03315j01509k13899j00381j58029
16658D484827l30609j88215L44025j80542M94825o0328K79060L7555l06781j15481
16648D458336l49645l47133k48099q8747l24431l94909q21672K0713k1558j94669
16638A688186l8531O7096m37501M05577k87026l04818L66380K5508J12224j43880
$$ plain form
16628 1453215 1594694 1594377 1331497 1782356 1382945 1766865 1998809 1279031 1976086 1240700
16618 1240700 1475033 2146614 1733541 1637000 1843082 2186000 2261978 2074677 2316836 1978396
16608 1978396 1560728 1983052 1721201 1562087 2047531 1887395 2102244 2056531 2067600 2177730
16598 2177730 1912989 2175414 2388232 2339121 2065677 2196844 2060515 2305712 1831851 2305456
16588 2305456 1946135 2428000 2152911 1797955 1877574 2305302 2480065 2114278 1709111 1719948
16578 1719948 1697031 1973936 1199323 1218233 1409300 1241604 1529094 1120678 1146819 1633183
16568 1633183 1281930 1100192 1262430 1721635 1292603 1773690 1746030 1892315 1401553 1716405
16558 1716405 1920827 1881732 2222952 1843916 1951959 2076818 1716677 1375430 2541829
$$ packed form
16628A453215J41479l17k62880M50859l99411L83920K31944p19778O97055p35386
16618A240700K34333O71581m13073r6541K06082L42918P5978j87301K42159l38440
16608A978396m17668M22324k61851j59114M85444j60136K14849m5713J1069J10130
16598B177730k64741K62425K12818m9111k73444J31167j36329K45197m73861M73605
16588B305456l59321M81865k75089l54956P9619M27728J74763l65787m05167J0837
16578A719948k2917K76905p74613J8910J91067j67696K87490m08416K6141M86364
16568A633183l51253j81738J62238M59205m29032M81087k7660J46285m90762L14852
16558A716405K04422l9095L41220l79036J08043J24859l60141l41247J166399
$$ plain form
16549 2541829 1483095 1664920 1528701 2141090 1707276 1291970 1725430 1856543 1311935
16540 1311935 1473163 1421544 1681011 1077530 1223810 1659930 1461673 1055961 1588736 1328896
16530 1328896 1483543 1541229 1102835 1777840 1340513 1458542 1749708 1600906 815930 1394932
16520 1394932 1185739 1288199 1595082 1016294 1038684 1267365 1539992 1558248 1420128 1507251
16510 1507251 1672494 2099288 2053941 2035042 2099878 2336955 2487427 3092526 2620196 2711448
16500 2711448 3123184 2422610 2670015 2442452 2748051 2474990 2291991 1822761 2193176
16491 2193176 2295582 2528498 2076576 2425034 2552063 2738029 2203693 2436217 2001552
16482 2001552 2034380 2184605 1975064 1875962 1618035 1977861 2148736 2235819 2038890 1831654
$$ packed form
16549B541829j058734J81825j36219O12389m33814m15306M33460J31113n44608
16540A311935J61228n1619K59467o03481J46280M36120j98257m05712N32775k59840
16530A328896J54647N7686m38394O75005m37327J18029K91166j48802p84976N79002
16520A394932k09193J02460L06883n78788K2390K28681K72627J8256j38120Q7123
16510A507251J65243M26794m5347j8899O4836K37077J50472O05099m72330R1252
16500B711448M11736p00574K47405k27563L05599k73061j82999m69230L70415
16491B193176J02406K32916m51922L48458J27029J85966n34336K32524m34665
16482B001552L2828J50225k09541r9102k57927L59826J70875Q7083j96929k07236
$$ plain form
16472 1831654 2538942 2122233 2571773 2521321 2846457 3246197 2830334 3979643 3733785
16463 3733785 4212679 4188111 4526565 5026263 4599875 5668661 5299082 5541314 5672339
16454 5672339 6466643 6145723 5748226 5947559 5716421 6208861 6195427 6265775 6727619 6641140
16444 6641140 6827621 7208418 8131390 8615106 9179531 9786565 10827287 11785277 11720772
16435 11720772 13023012 14553899 15744356 17082219 18520021 20152507 22521448 24534735
16427 24534735 26794058 29171035 31825319 34884514 38498072 41582807 46167280 50551097
16419 50551097 56067562 61961399 68508454 75228995 82199700 90286574 98880852 108990464
16411 108990464 120315734 131066985 140704496 147068607 151162116 154962374 158041890 159987194
$$ packed form
16472A831654P07288m16709M49540n0452L25136L99740m15863J149309k45858
16463C733785M78894k4568L38454M99698m26388J068786l69579K42232J31025
16454E672339P94304l20920l97497J99333k31138M92440j3434P0348M61844q6479
16444F641140J86481L80797R22972M83716N64425O07034J040722R57990o4505
16435A1720772J302240J530887J190457J337863J437802J632486K368941K013287
16427B4534735K259323K376977K654284L059195L613558L084735M584473M383817
16419E0551097N516465N893837O547055O720541O970705Q086874Q594278J0109612
16411A08990464J1325270J0751251R637511O364111M093509L800258L079516J945304
$$ plain form
16403 159987194 162188301 163527429 162556801 160153153 155796041 151087250 145671244 140975776
16395 140975776 135441328 129082558 123506466 120074531 121627873 132395045 150525010 167508145
16387 167508145 175199573 174494786 166498916 151033032 131761602 114279368 99004079
16380 99004079 81259182 53039248 11610762 -32798823 -65022237 -74606431 -67708623
16373 -67708623 -52927818 -37679721 -24058955 -14685797 -8639594 -4587898 -1942469 -1500484
16365 -1500484 -862625 -192233 -588534 -201383 14501 -3370 113209 567035 644582 401055
16355 401055 50554 383533 148351 -190989 -88395 -317374 -108350 -201350 -688970 -324377
16344 -20370 128280 283612 390532 749426 -13471 158693 42936 123963 290865 251210
$$ packed form
16403A59987194K201107J339128r70628k403648m357112m708791n416006m695468
16395A40975776n534448o358770n576092l431935J553342J0767172J8129965J6983135
16387A67508145P691428p04787p995870j5465884j9271430j7482234j5275289
16380I9004079j7744897k8219934A1610762c2798823l2223414r584194O897808
16373f7708623J4780805J5248097J3620766R373158O046203M051696a942469M41985
16365a500484O37859a92233l96301b01383A4501c370A13209M53826P7547k43527
16355D01055E0554L32979A48351a90989h8395k28979a08350r3000m87620c24377
16344b0370A28280J55332J06920L58894a3471A58693D2936Q1027J66902l9655
$$ plain form
16334 251210 -294945 -312253 150189 -457201 -116981 385898 220121 385489 364800 295973
16324 295973 433291 788157 705395 935592 750332 243722 196973 1132474 781975 1062922
16314 1062922 915167 890197 1142230 1040842 876930 1586624 1701940 1960321 1794498 1642006
16304 1642006 1791748 1339032 1336473 1334632 1121190 788082 939709 1004518 894160 1657558
16294 1657558 1249444 1170933 1061830 1363838 1836201 1417026 1601537 1007525 1186610 1598645
16284 1598645 1066005 828438 761864 823790 1464238 1271167 1254310 1841138 1351346 2018144
16274 2018144 1833676 1948023 2044807 1669166 1799094 1623128 1481097 1838266 1683311 1631379
16264 1631379 1671167 1668583 1337276 1668390 1488515 1668687 1493080 1475015 1623746 1480698
$$ packed form
16334B51210b94945j7308A50189d57201a16981C85898j65777J65368k0689o8827
16324B95973J37318L54866q2762K30197j85260B43722m6749R35501l50499K80947
16314A062922j47755k4970K52033j01388j63912P09694J15316K58381j65823j52492
16304A642006J49742m52716k559j841k13442l33108J51627O4809j10358P63398
16294A657558m08114p8511j09103L02008M72363m19175J84511n94012J79085M12035
16284A598645n32640k37567o6574O1926O40448j93071j6857N86828m89792O66798
16274B018144j84468J14347R6784l75641J29928j75966j42031L57169j54955n1932
16264A631379L9788k584l31307L31114j79875J80172j75607j8065J48731j43048
$$ plain form
16254 1480698 1630107 1446533 1579078 1210956 1182845 1488460 1212819 1321641 1059182 1195662
16244 1195662 1295969 1414537 1099438 1177018 1727171 1677972 1471187 1654968 1914336 1771983
16234 1771983 1909862 1343506 1408423 1002273 1025684 1372127 1047372 961263 1167898 829595
16224 829595 925995 1224132 405727 1146080 556512 1009881 836992 615897 825141 1065321
16214 1065321 1372974 1022424 1172092 1381123 924501 1300919 746128 1278130 1464186
16205 1464186 1298953 1630818 1138743 1471915 1272025 1346587 1164449 1362630 1522605 1702047
16195 1702047 1651498 1200711 974026 1123204 1114428 1524872 1132265 1588832 1397708 1361894
16185 1361894 1487083 1484061 1755448 1469182 1878588 1851913 2097811 1926884 1562159 2148303
$$ packed form
16254A480698J49409j83574J32545l68122k8111L05615k75641J08822k62459J36480
16244A195662J00307J18568l15099P7580N50153m9199k06785J83781K59368j42353
16234A771983J37879n66356O4917m06150K3411L46443l24755q6109K06635l38303
16224H29595R6400K98137D05727P40353E56512M53369j72889k21095K09244K40180
16214A065321L07653l50550J49668K09031m56622L76418n54791N32002J86056
16205A464186j65233L31865m92075L33172j99890P4562j82138J98181J59975J79442
16195A702047n0549m50787k26685J49178q776M10444l92607M56567j91124l5814
16185A361894J25189l022K71387k86266M09406k6675K45898j70927l64725N86144
$$ plain form
16175 2148303 1657466 2024716 1694859 1931363 1481238 1879837 1481493 1764194 1608700
16166 1608700 1698677 1524454 1732618 1550552 1456040 1473054 1347594 1304902 1189528 987503
16156 987503 1408748 1690222 1479670 1317624 1129481 1098245 1701332 1410421 1617186 1343187
16146 1343187 1803762 2059860 1559360 1981567 1207631 2029998 1787399 1549529 1883726
16137 1883726 1702172 1440222 1381154 1635940 1593937 2145203 1511915 1436788 1354605 1432918
16127 1432918 1294784 1518373 1801335 1674607 1742688 1567417 1908900 1978029 1585755 1830237
16117 1830237 1467384 1876980 1654753 1660269 2071610 1766107 1531983 1985707 1616133 1433385
16107 1433385 1883095 2116487 1762618 1748692 1970951 1574502 1783858 1565812 2150916 1944816
$$ packed form
16175B148303m90837L67250l29857K36504m50125L98599l98344K82701j55494
16166A608700Q9977j74223K08164j82066r4512J7014j25460m2692j15374k02025
16156I87503M21245K81474k10552j62046j88143l1236O03087k90911K06765k73999
16146A343187M60575K56098n00500M22207p73936Q22367k42599k37870L34197
16137A883726j81554k61950n9068K54786m2003N51266o33288p5127q2183P8313
16127A432918j38134K23589K82962j26728O8081j75271L41483O9129l92274K44482
16117A830237l62853M09596k22227N516M11341l05503k34124M53724l69574j82748
16107A433385M49710K33392l53869j3926K22259l96449K09356k18046N85104k06100
$$ plain form
16097 1944816 2538546 2451098 2761842 1837449 1987134 1977082 1617055 2134573 2259012 1987313
16087 1987313 2190347 1726526 2392471 2275383 2074076 1857808 1987923 2146536 2288120
16078 2288120 2517194 2508558 1995560 1875857 2438631 2258347 2612183 2859630 2611908 2838597
16068 2838597 3081437 2882342 2680810 2687211 3020323 2727066 3273513 3339733 2785764 2883405
16058 2883405 2447363 3293377 2699807 2508886 2715996 2576221 2746082 2957899 3020752 3008610
16048 3008610 3097898 2877053 3042709 3316420 2934788 3381820 3289213 3446892 3671760 3446705
16038 3446705 3148824 3569786 3543817 3430157 3236537 3610565 3767624 4069240 4008013 3558617
16028 3558617 3678888 3666463 3958027 4086472 3597495 3831629 4089753 4190628 4114256 4284255
$$ packed form
16097A944816N93730q7448L10744r24393J49685j0052l60027N17518J24439k71699
16087A987313K03034m63821O65945j17088k01307k16268J30115J58613J41584
16078B288120K29074q636n12998j19703N62774j80284L53836K47447k47722K26689
16068B838597K42840j99095k01532O401L33112k93257N46447O6220n53969R7641
16058B883405m36042Q46014n93570j90921K07110j39775J69861K11817O2853j2142
16048C008610Q9288k20845J65656K73711l81632M47032r2607J57679K24868k25055
16038C446705k97881M20962k5969j13660j93620L74028J57059L01616o1227m49396
16028C558617J20271j2425K91564J28445m88977K34134K58124J00875p6372J69999
$$ plain form
16018 4284255 3731738 4040103 4512360 4415818 4375718 5115271 4569880 4619288 4350114 4909734
16008 4909734 4812977 4503527 4992197 4865623 4917130 4856854 4531300 4783825 4883883 4607182
15998 4607182 4668627 4707398 4429503 4714341 4694346 4495431 4493991 4569070 4574400 4518993 4591303
15987 4591303 4641916 4876988 4606550 4998456 4472615 4825965 4782341 4399023 4911613 4812675
15977 4812675 5034962 5122145 4706347 5044544 4703569 5242175 4789511 4629575 4995451 4802722
15967 4802722 4850133 4904086 4914066 4326505 4649634 4705718 4412234 4220193 4576147 4526468
15957 4526468 4605498 4876085 4344460 4407459 3962377 4350513 4393984 4711731 4227867 4131210
15947 4131210 4601565 4683197 4683072 4463422 4359595 4892420 5122774 4816893 4654142 4990396
$$ packed form
16018D284255n52517L08365M72257r6542m0100P39553n45391M9408k69174N59620
16008D909734r6757l09450M88670j26574N1507o0276l25554K52525J00058k76701
15998D607182O1445L8771k77895K84838j9995j98915j440P5079N330n5407P2310
15987D591303N0613K35072k70438L91906n25841L53350m3624l83318N12590r8938
15977D812675K22287Q7183m15798L38197l40975N38606m52664j59936L65876j92729
15967D802722M7411N3953R980n87561L23129N6084k93484j92041L55954m9679
15957D526468P9030K70587n31625O2999m45082L88136M3471L17747m83864r6657
15947D131210M70355Q1632j25k19650j03827N32825K30354l05881j62751L36254
$$ plain form
15937 4990396 5110334 5018051 5010549 5068354 4775291 5098467 4792522 5320817 5051243 5429281
15927 5429281 5873042 5452713 5464187 5729817 5785731 6102448 6019792 6224119 6273992 6714825
15917 6714825 6496042 6536456 7303460 7294601 7624866 8211187 8637072 9327408 9895209 11064273
15907 11064273 12073503 13792928 15575980 18793292 23577618 30159954 39831556 52329395
15899 52329395 67285252 84217459 99562651 113062144 121967375 127362628 128572817
15892 128572817 124951207 116661274 105276467 90405490 73879433 57685889 44770671
15885 44770671 34508307 26282085 20885927 17231055 14193819 11972866 10471223 9561430
15877 9561430 8446028 7995368 7736501 6830675 7087292 6514158 6155901 6185807 5933941
$$ packed form
15937D990396J19938r2283p502N7805k93063L23176l05945N28295k69574L78038
15927E429281M43761m20329J1474K65630N5914L16717q2656K04327M9873M40833
15917F714825k18783M0414P67004q859L30265N86321M25885O90336N67801J169064
15907A1064273J009230J719425J783052L217312M784326O582336R671602J2497839
15899E2329395J4955857J6932207J5345192J3499493Q905231N395253J210189
15892A28572817l621610q289933j1384807j4870977j6526057j6193544j2915218
15885D4770671j0262364q226222n396158l654872l037236k220953j501643r09793
15877I561430j115402m50660k58867r05826K56617n73134l58257K9906k51866
$$ plain form
15868 5933941 5672121 5476245 5726341 5850090 5242048 5234598 5418352 4750259 5137054 4908313
15858 4908313 5037506 4897188 4609465 4797771 4954374 4629461 4848294 4702734 4476908
15849 4476908 4632756 4503540 4292129 4373322 4789492 4341426 4223849 4308514 4247152 4581440
15839 4581440 4814779 4705643 4798648 4609010 5361342 4726914 4752456 5058104 4740277 5237192
15829 5237192 4787299 5231913 4940383 4920346 4785897 4847497 4117303 5080810 4573257 4918707
15819 4918707 4772006 4928133 4494435 4541063 4732526 5256288 5113394 4845511 4895905 5222445
15809 5222445 5260292 5532289 5293962 5433821 5004772 5776016 5366487 5704169 5828468 6030427
15799 6030427 5473575 5882797 6448765 6832531 6732865 7322252 7841203 7354699 8132074 8143821
$$ packed form
15868E933941k61820j95876K50096J23749o08042p450J83754o68093L86795k28741
15858D908313J29193j40318k87723J88306J56603l24913K18833j45560k25826
15849D476908J55848j29216k11411Q1193M16170m48066j17577Q4665o1362L34288
15839D581440K33339j09136R3005j89638P52332o34428K5542L05648l17827M96915
15829E237192m49893M44614k91530k0037j34449O1600p30194R63507n07553L45450
15819D918707j46701J56127m33698M6628J91463N23762j42894k67883N0394L26540
15809E222445L7847K71997k38327J39859m29049P71244m09529L37682J24299K01959
15799F030427n56852M09222N65968L83766r9666N89387N18951m86504P77375J1747
$$ plain form
15789 8143821 8784563 8605353 8576359 8694754 8641048 8678746 9199531 9165313 9615929 10306143
15779 10306143 11081884 11326660 11826839 12159186 12189898 12458630 12372856 12297884 11845505 11832419
15769 11832419 11345630 11125753 11251125 11756970 11836888 11822834 12292161 12263041 12529948 12984670
15759 12984670 12634230 13087746 12696113 12693755 12537264 11628134 11990034 11632647 11396763 10690182
15749 10690182 11224267 11224401 10916239 11294652 11467612 11528649 11723127 12149831 12720967 13141898
15739 13141898 13630611 13790673 14070975 14326413 14656736 14690804 14593480 14376173 14605607 14628601
15729 14628601 15343925 15993768 15716116 16321446 16032796 16352167 16152827 16482183 15569609
15720 15569609 14893512 14900140 13866658 14377933 14830808 14489790 14283947 14685344 14896846
$$ packed form
15789H143821O40742j79210k8994J18395n3706L7698N20785l4218M50616O90214
15779A0306143P75741K44776N00179L32347L0712K68732q5774p4972m52379j3086
15769A1832419m86789k19877J25372N05845P9918j4054M69327k9120K66907M54722
15759A2984670l50440M53516l91633k358j56491r09130L61900l57387k35884p06581
15749A0690182N34085J34l08162L78413J72960O1037J94478M26704N71136M20931
15739A3141898M88713J60062K80302K55438L30323L4068r7324k17307K29434K2994
15729A4628601P15324O49843k77652O05330k88650L19371j99340L29356r12574
15720A5569609o76097O628j033482N11275M52875l41018k05843M01397K11502
$$ plain form
15711 14896846 14353642 14106334 13874326 13299455 13089410 12562782 13294831 13150614 13993616
15702 13993616 14596754 14746961 15794706 16272595 16098734 16849734 16662653 16222081 16798908
15693 16798908 16527908 15900872 15824960 15721713 15480150 15566493 15612096 15222722 14915206 15061131
15683 15061131 15172190 14924760 14585967 13740382 14056635 13717529 13520860 13487248 13740032
15674 13740032 13260202 12702090 11991981 12402124 11954162 12124799 12322958 12290552 12812658
15665 12812658 13105440 13757788 13956657 14957244 16098361 17416220 18224453 19619288 20388096
15656 20388096 21590567 23094640 24386818 26048294 27317793 28712535 30647263 31883734
15648 31883734 32961376 34393679 35642224 37125064 38229795 39175364 40591019 42239048
$$ packed form
15711A4896846n43204k47308k32008n74871k10045n26628P32049j44217Q43002
15702A3993616O03138J50207J047745M77889j73861P51000j87081m40572N76827
15693A6798908k71000o27036p5912j03247k41563Q6343M5603l89374l07516J45925
15683A5061131J11059k47430l38793q45585L16253l39106j96669l3612K52784
15674A3740032m79830n58112p10109M10143m47962J70637J98159l2406N22106
15665A2812658K92782O52348J98869J000587J141117J317859Q08233J394835P68808
15656B0388096J202471J504073J292178J661476J269499J394742J934728J236471
15648C1883734J077642J432303J248545J482840J104731R45569J415655J648029
$$ plain form
15640 42239048 44549196 46570953 48758497 50700997 52397534 53877524 53854877 54847153
15632 54847153 54815445 53859384 53645235 53164165 52224638 51906759 51647210 51119579 51551225
15623 51551225 50685493 50984749 49271422 48448569 46551896 44255326 41750434 39448504
15615 39448504 36462987 34821082 33181795 31535949 30430711 28302264 28091764 27267055
15607 27267055 26260722 25182103 24357159 23557318 22828057 22041024 21669401 21030150 20308111
15598 20308111 20120605 19645269 20164290 20004250 20375492 21269906 22287192 24261244 29131245
15589 29131245 39401337 57463325 77299538 91167854 100064674 105564305 107993960
15582 107993960 107279637 103632213 97366700 86526259 68825356 48761839 34839608
$$ packed form
15640D2239048K310148K021757K187544J942500J696537J479990k2647R92276
15632E4847153l1708r56061k14149m81070r39527l17879k59549n27631M31646
15623E1551225q65732K99256j713327q22853j896673k296570k504892k301930
15615C9448504k985517j641905j639287j645846j105238k128447k10500q24709
15607B7267055j006333j078619q24944p99841p29261p87033l71623o39251p22039
15598B0308111j87506m75336N19021j60040L71242Q94414J017286J974052M870001
15589B9131245J0270092J8061988J9836213J3868316Q896820N499631K429655
15582A07993960p14323l647424o265513j0840441j7700903k0063517j3922231
$$ plain form
15575 34839608 26853366 22159604 19854403 18059546 17070575 16479222 15739425 16213942 15798723
15566 15798723 15807735 16202254 16279777 15843605 16171116 16464213 17094235 17115309 17971729 19953109
15556 19953109 23648251 30975600 47855269 73031093 97678905 114278862 125162496
15549 125162496 131411228 133060457 131710776 125992477 116386096 99447021 75319567 50235978
15541 50235978 34108977 25054374 20602775 17351712 15611403 14182830 13349905 12790195
15533 12790195 12450522 12369683 12369295 12450447 12277204 11940260 11644355 12119496 11262959 11198922
15523 11198922 11182933 10772033 10061598 10622261 10485306 10133285 9908081 10175523 9864623
15514 9864623 10254507 10373783 10492135 10768250 11446797 11270502 11444785 11809586 11837288 12444849
$$ packed form
15575C4839608p986242m693762k305201j794857r88971n91353p39797M74517m15219
15566A5798723R012L94519P7523m36172L27511K93097O30022K1074Q56420J981380
15556A9953109L695142P327349J6879669K5175824K4647812J6599957J0883634
15549A25162496O248732J649229j349681n718299r606381j6939075k4127454k5083589
15541E0235978j6127001r054603m451599l251063j740309j428573q32925n59710
15533A2790195l39673q0839l88Q1152j73243l36944k95905M75141q56537o4037
15523A1198922j5989m10900p10435N60663j36955l52021k25204K67442l10900
15514I864623L89884J19276J18352K76115O78547j76295J74283L64801K7702O07561
$$ plain form
15504 12444849 12633421 11895289 11692512 11442850 11498787 10762859 10927692 10963672 10763689 10914525
15494 10914525 10945931 11180889 11497850 11857696 11552443 11473498 11700263 12109984 12010870 11582539
15484 11582539 12409910 12300703 12835027 12862823 13100909 13228910 13437958 13497762 14011355 13596526
15474 13596526 13861002 13993601 14266319 15008137 16416052 17180267 18732783 19933073 21022695
15465 21022695 21904812 22197208 22337217 21773571 21894337 20974255 19832589 19520631 19614714
15456 19614714 19415221 20338805 21425296 22315734 23631919 24643859 24902222 25689882 25115330
15447 25115330 25506510 24913741 23819188 23692327 22550600 22012322 22240900 22260403 21989438
15438 21989438 22409349 22989097 23180378 23476787 23484621 22894798 22425800 22169743 21715047 20805079
$$ packed form
15504A2444849J88572p38132k02777k49662N5937p35928J64833L5980j99983J50836
15494A0914525L1406K34958L16961L59846l05253p8945K26765M09721r9114m28331
15484A1582539Q27371j09207N34324K7796K38086J28001K09048N9804N13593m14829
15474A3596526K64476J32599K72718P41818J407915P64215J552516J200290J089622
15465B1022695Q82117K92396J40009n63646J20766r20082j141666l11958R4083
15456A9614714j99493R23584J086491Q90438J316185J011940K58363P87660n74552
15447B5115330L91180n92769j094553j26861j141727n38278K28578J9503k70965
15438B1989438M19911N79748J91281K96409P834n89823m68998k56057m54696r09968
$$ plain form
15428 20805079 20355921 19616583 19136984 18928143 18384535 18195671 17418466 17076348 16906758
15419 16906758 16198007 15957015 14864982 14917144 14466021 13943845 13382328 13450726 13039519
15410 13039519 13310070 13049041 13260093 13164689 12944241 13440313 13241261 13067943 13850427
15401 13850427 13821171 14146319 14799320 15018553 15117477 15336107 15921597 15846788 15532640 15758167
15391 15758167 15861316 15688489 15250715 14989732 14791303 14666681 14912639 14732331 14767459
15382 14767459 14835034 14679713 14668783 14388214 14593160 14610797 14015073 13884095 13544747 13670694
15372 13670694 13641230 13552240 13936150 14144974 13983283 14182732 14736388 14963264 14858814 15456857
15362 15456857 15456994 16142444 16071114 16045778 16026206 15991536 15634672 16129151 15906806 16489791
$$ packed form
15428B0805079m49158p39338m79599k08841n43608j88864p77205l42118j69590
15419A6906758p08751k40992j092033N2162m51123n22176n61517O8398m11207
15410A3039519K70551k61029K11052r5404k20448M96072j99052j73318P82484
15401A3850427k9256L25148O53001K19233R8924K18630N85490p4809l14148K25527
15391A5758167J03149j72827m37774k60983j98429j24622K45958j80308L5128
15382A4767459O7575j55321j0930k80569K04946J7637n95724j30978l39348J25947
15372A3670694k9464q8990L83910K08824j61691J99449N53656K26876j04450N98043
15362A5456857J37O85450p1330k5336j9572l4670l56864M94479k22345N82985
$$ plain form
15352 16489791 16857146 17545992 17818587 19791765 22294708 27178299 35667719 47256277
15344 47256277 57400618 64398505 69094567 71952290 72788121 71811933 69903897 65363437
15336 65363437 58070394 48882526 39821338 35385417 31867770 30649586 29543592 28689029
15328 28689029 27936649 27421328 26612918 25612005 25556701 24661083 25060041 25210495 25445539
15319 25445539 25707035 26468711 27282815 29064758 32266489 37615462 49707585 65638816
15311 65638816 84067299 100539765 112209768 118491897 122183348 121700094 118386263 110817153
15303 110817153 98509602 81489622 62735477 47382055 36284366 29778837 26719920
15296 26719920 24880435 23521481 22500139 22984914 22786343 23100344 23200073 23353685 23315061
$$ packed form
15352A6489791L67355O88846K72595J973178K502943M883591Q489420J1588558
15344D7256277J0144341O997887M696062K857723Q35831r76188j908036m540460
15336F5363437p293043r187868r061188m435921l517647j218184j105994q54563
15328B8689029p52380n15321q08410j000913n5304q95618L98958J50454K35044
15319B5445539K61496P61676Q14104J781943L201731N348973J2092123J5931231
15311F5638816J8428483J6472466J1670003O282129L691451m83254l313831p569110
15303A10817153j2307551j7019980j8754145j5353422j1097689o505529l058917
15296B6719920j839485j358954j021342M84775j98571L14001R9729J53612l8624
$$ plain form
15287 23315061 23151554 23773166 23660334 23159733 24038457 23772014 24630255 26806346 31755612
15278 31755612 39978909 49786335 58667382 63557690 67554202 69047918 68451776 67769746
15270 67769746 64127833 59104549 50919115 41323308 33130730 27816338 25284300 23178703
15262 23178703 22608879 21409764 20366953 19747266 19471877 19627608 19447077 19407176 19939999
15253 19939999 19895057 20299495 20865238 21176639 21916842 21646195 22160537 21896504 21665870
15244 21665870 21407116 21000604 20904814 20530874 20934490 20365912 19954560 20075816 21542875
15235 21542875 22443512 23666298 24287190 25464135 25652984 26011326 26195090 25977732 25394294
15226 25394294 24308347 23839132 23219603 22156511 21373235 20871583 20350522 20681840 21175191
$$ packed form
15287B3315061j63507O21612j12832n00601Q78724k66443Q58241K176091M949266
15278C1755612Q223297R807426Q881047M890308L996512J493716n96142o82030
15270F7769746l641913n023284q185434r595807q192578n314392k532038k105597
15262B3178703n69824j199115j042811o19687k75389J55731j80531l9901N32823
15253A9939999m4942M04438N65743L11401P40203k70647N14342k64033k30634
15244B1665870k58754m06512r5790l73940M03616n68578m11352J21256J467059
15235B1542875R00637J222786O20892J176945J88849L58342J83764k17358n83438
15226B5394294j085947m69215o19529j063092p83276n01652n21061L31318M93351
$$ plain form
15217 21175191 21280868 21079157 21330365 22019357 22890301 23202555 23050803 22501119 22432359
15208 22432359 20417384 20247956 19076336 18050231 16459662 15821800 14882082 14367026 13926007
15199 13926007 13056792 12739887 12573398 12412169 12488024 12700458 12954208 13251326 14055801
15190 14055801 14388350 14633707 14536984 15342832 15582532 15905993 16174261 16261341 16401215 16348322
15180 16348322 16853861 16971976 17134750 17727662 18105406 18967806 18833193 19091208 19332802
15171 19332802 18757931 19039927 18665055 18437204 18719729 18520366 18320383 18376567 18419899 18047349
15161 18047349 18625657 18321386 18506781 18526270 18643290 18628539 19142630 19087013 18503970 18333055
15151 18333055 18985804 18376077 18906675 18064367 17581280 18047787 18480899 18051939 17593789
$$ packed form
15217B1175191J05677k01711K51208O88992Q70944L12254j51752n49684o8760
15208B2432359k014975j69428j171620j026105j590569o37862r39718n15056m41019
15199A3926007q69215l16905j66489j61229P5855K12434K53750K97118Q04475
15190A4055801L32549K45357r6723Q05848K39700L23461K68268Q7080J39874n2893
15180A6348322N05539J18115J62774N92912L77744Q62400j34613K58015K41594
15171A9332802n74871K81996l74872k27851K82525j99363j99983N6184M3332l72550
15161A8047349N78308l04271J85395J9489J17020j4751N14091n5617n83043j70915
15151A8333055O52749o09727N30598q42308m83087M66507M33112m28960m58150
$$ plain form
15142 17593789 18165414 18152322 18270115 18315067 18852042 18693118 19339608 19200681 19424648 19271178
15132 19271178 18919407 19041675 18974625 18851840 18879898 18278210 18204442 18141086 18301467 17870522
15122 17870522 17599040 17604060 17521601 17344320 17105836 16820712 17186985 16699625 16014896 16048328
15112 16048328 16458855 15838396 16051520 15510022 15896332 15676888 16213061 16005095 16122633
15103 16122633 16342010 16253892 17158782 17807909 17840478 18657425 18906695 19238769 19911546 20357868
15093 20357868 21051364 22432656 23785451 25666632 28602732 32713566 37193184 40914110
15085 40914110 43519962 44847999 45195470 45471320 44351446 43214489 42074751 39598957
15077 39598957 36933890 36054832 37322770 40309060 44756837 48470584 51157324 53322354
$$ packed form
15142A7593789N71625j3092J17793M4952N36975j58924O46490j38927K23967j53470
15132A9271178l51771J22268o7050j22785K8058o01688p3768o3356J60381m30945
15122A7870522k71482N020q2459j77281k38484k85124L66273m87360o84729L3432
15112A6048328M10527o20459K13124n41498L86310k19444N36173k07966J17538
15103A6122633K19377q8118R04890O49127L2569Q16947K49270L32074O72777M46322
15093B0357868O93496J381292J352795J881181K936100M110834M479618L720926
15085D0914110K605852J328037L47471K75850j119874j136957j139738k475794
15077C9598957k665067q79058J267938K986290M447777L713747K686740K165030
$$ plain form
15069 53322354 54375786 54810539 54734849 53991931 52393925 50654246 52490080 56803799 60884758
15060 60884758 65157187 68725594 72318880 75194388 78324274 81941897 84456357 85563976
15052 85563976 83691151 81794807 82128137 85139403 89169144 93704600 95824056 96103053
15044 96103053 95433325 95264027 95526610 96398293 96630241 94574474 91403444 86515305 81873332
15035 81873332 78013903 74855274 71114811 66631671 62792500 60333660 60428482 62814544
15027 62814544 64534833 65471086 66788066 66324239 66192625 66116400 65347710 64562042 62614866
15018 62614866 60685757 61875363 66969613 74778218 83482835 92471529 99591557 106576678
15010 106576678 112158242 116875135 119538324 121287974 120311346 118152489 115658257 115212247
$$ packed form
15069E3322354J053432M34753p5690p42918j598006j739679J835834M313719M080959
15060F0884758M272429L568407L593286K875508L129886L617623K514460J107619
15052H5563976j872825j896344L33330L011266M029741M535456K119456K78997
15044I6103053o69728j69298K62583Q71683K31948k055767l171030m888139m641973
15035H1873332l859429l158629l740463m483140l839171k458840R4822K386062
15027F2814544J720289R36253J316980m63827j31614p6225p68690p85668j947176
15018F2614866j929109J189606N094250P808605Q704617Q988694P120028O985121
15010A06576678N581564M716893K663189J749650r76628k158857k494232m46010
$$ plain form
15002 115212247 117018458 121650396 129333231 137341528 146422877 154786367 161897201 166413996
14994 166413996 168164619 167908199 164731841 158002841 149602557 140727659 133284566 128970828
14986 128970828 128367384 130595682 135716958 142224619 151224874 162629818 175368291 189405638
14978 189405638 203671410 217668037 229841068 240184537 248751710 254225283 256159141
14971 256159141 253561008 247027048 237281764 223581596 207530678 190060629 172912648
14964 172912648 156797020 141808300 128240639 118163156 109370969 103392077 99919950
14957 99919950 99484451 101919186 108213059 118924532 136075189 160641808 190514310 224834048
14949 224834048 263944060 307745896 351049998 392292144 433700880 471463671 495629198
$$ packed form
15002A15212247J806211M631938P682835Q008297R081349Q363490P110834M516795
14994A66413996J750623k56420l176358o729000q400284q874898p443093m313738
14986A28970828o03444K228298N121276O507661R000255J1404944J2738473J4037347
14978A89405638J4265772J3996627J2173031J0343469Q567173N473573J933858
14971B56159141k598133o533960r745284j3700168j6050918j7470049j7147981
14964A72912648j6115628j4988720j3567661j0077483q792187n978892l472127
14957I9919950m35499K434735O293873J0711473J7150657K4566619K9872502L4319738
14949B24834048L9110012M3801836M3304102M1242146M1408736L7762791K4165527
$$ plain form
14942 495629198 502488056 495003460 477282103 453028336 424821023 394340067 362615648
14935 362615648 327850992 290865025 259322976 237636091 223718156 212836993 201547909
14928 201547909 187666084 171507293 156283749 143193195 133504319 127031173 124771423
14921 124771423 121394076 117985688 112934187 107520693 101526588 95014952 88534417 81092399
14913 81092399 71009679 59607440 48963980 41442516 36478734 32945909 31412523 29960651
14905 29960651 30199966 30143717 30083039 30830389 31983644 33828619 35679835 37447118 40581777
14896 40581777 45019235 52350536 60041423 67323191 72173808 75651325 76560696 76036464
14888 76036464 75540311 73519771 68674956 62154754 54500091 47150324 42639299 40446465
$$ packed form
14942D95629198O858858p484596j7721357k4253767k8207313l0480956l1724419
14935C62615648l4764656l6985967l1542049k1686885j3917935j0881163j1289084
14928B01547909j3881825j6158791j5223544j3090554r688876o473146k259750
14921A24771423l377347l408388n051501n413494n994105o511636o480535p442018
14913H1092399j0082720j1402239j0643460p521464m963782l532825j533386j451872
14905B9960651K39315n6249o0678P47350J153255J844975J851216J767283L134659
14896D0581777M437458P331301P690887P281768M850617L477517R09371n24232
14888G6036464m96153k020540m844815o520202p654663p349767m511025k192834
$$ plain form
14880 40446465 39321472 38657692 37731054 37642170 37554657 38179411 40072832 41443849 42203020
14871 42203020 42556184 42981996 43668733 44283352 44836045 45478792 46078089 45476245 45464786
14862 45464786 46837442 49094931 53593905 60680828 71628319 83838873 96920125 110277341
14854 110277341 122661121 131477745 136253280 136639995 133454664 125580712 114870251 101449924
14846 101449924 88290279 74793601 62951703 53038790 46798776 43080915 40640552
14839 40640552 39122401 38297591 36756993 35987520 34553486 34456727 33134358 31924932 31736705
14830 31736705 31692963 31118058 31511292 31713824 32477744 33136775 34562555 36251780 37977137
14821 37977137 41525900 48190589 58124917 69724150 80898210 88210333 92160860 94726014
$$ packed form
14880D0446465j124993o63780r26638q8884q7513O24754J893421J371017P59171
14871D2203020L53164M25812O86737O14619N52693O42747N99297o01844j1459
14862D5464786J372656K257489M498974P086923J0947491J2210554J3081252J3357216
14854A10277341J2383780Q816624M775535L86715l185331p873952j0710461j3420327
14846A01449924j3159645j3496678j1841898r912913o240014l717861k440363
14839D0640552j518151q24810j540598p69473j434034r6759j322369j209426j88227
14830C1736705m3742n74905L93234K02532P63920O59031J425780J689225J725357
14821C7977137L548763O664689R934328J1599233J1174060P312123L950527K565154
$$ plain form
14813 94726014 94390311 91342117 86489106 78448475 67230270 54583182 43670155 35276427
14805 35276427 30994594 28428365 26977642 25449722 25144835 24599575 24673268 24553989 24227479
14796 24227479 25182813 24754731 24562775 23919908 23571874 23685753 23091756 22940457 22868054
14787 22868054 21832917 21727983 21902406 22206045 22322607 22045255 22508942 22549371 23619735
14778 23619735 25099246 26239136 26921930 28291154 28197875 28352001 28605173 28096789 27450435
14769 27450435 25964675 24421753 23525950 22316166 21137106 20741645 20869623 19737989
14761 19737989 20891096 20943406 20284975 20683378 20853175 21449504 20953469 21433042 21616082
14752 21616082 21875691 22771907 23775913 24690154 24785663 25153894 25287163 25500830 25832916
$$ packed form
14813I4726014l35703l048194m853011q040631j1218205j2647088j0913027q393728
14805C5276427m281833k566229j450723j527920l04887n45260P3693j19279l26510
14796B4227479R55334m28082j91956o42867l48034J13879n93997j51299p2403
14787B2868054j035137j04934J74423L03639J16562k77352M63687M0429J070364
14778B3619735J479511J139890O82794J369224r3279J54126K53172n08384o46354
14769B7450435j485760j542922q95803j209784j179060l95461J27978j131634
14761A9737989J153107N2310o58431L98403J69797N96329m96035M79573J83040
14752B1616082K59609Q96216J004006R14241R5509L68231J33269K13667L32086
$$ plain form
14743 25832916 26129047 25667610 25473855 25759350 27062641 27469185 29141900 31424823 33975926
14734 33975926 37590539 43487093 50286068 62209171 81039869 110370955 150206431
14727 150206431 195827772 243483537 287900146 322673471 344046012 353059497 351274085
14720 351274085 336820151 308729828 269508384 223459599 176209624 133165775 98700775
14713 98700775 73450595 58291361 48410312 41818477 36910163 33708947 30863664 28692899
14705 28692899 26815653 26717592 24621709 23408344 22640623 20727822 19400062 18717109 18261123
14696 18261123 17952082 17913122 18174183 18581636 18346431 18905268 18688799 18901672 19481699
14687 19481699 19306064 18648965 18699209 18440361 18641903 18233429 19143106 20098588 20335777
$$ packed form
14743B5832916K96131m61437j93755K85495J303291M06544J672715K282923K551103
14734C3975926L614613N896554O798975J1923103J8830698K9331086L9835476
14727A50206431M5621341M7655765M4416609L4773325K1372541R013485j785412
14720C51274085j4453934k8090323l9221444m6048785m7249975m3043849l4465000
14713I8700775k5250180j5159234r881049o591835m908314l201216k845283k170765
14705B8692899j877246r8061k095883j213365p67721j912801j327760o82953m55986
14696A8261123l09041l8960K61061M07453k35205N58837k16469K12873N80027
14687A9481699j75635o57099N0244k58848K01542m08474R09677R55482K37189
$$ plain form
14678 20335777 20636671 22215945 23453691 25398163 26484793 27862299 27384014 27398963 26647130
14669 26647130 25409546 24463286 22773128 21953400 20358395 20713080 20078406 20186855 20609834
14660 20609834 20363959 19995275 20183698 19850281 19348045 18085525 16574268 14019494 13957845
14651 13957845 13497406 13610536 13487134 14711975 16159790 16762114 18061227 18636831 19811288
14642 19811288 20755526 21261949 22186593 22734859 24151329 24515731 25506697 26445004 27856076
14633 27856076 28395867 28572428 28412445 27270688 25676980 23557860 20520331 17433543
14625 17433543 14967961 13093181 10945579 10150194 9514562 9446609 9158699 9472815 9123700
14616 9123700 9023083 9131538 9298570 9107546 8910286 8970124 8686493 9059689 8529225 8265521
$$ packed form
14678B0335777L00894J579274J237746J944472J086630J377506m78285J4949p51833
14669B6647130j237584r46260j690158q19728j595005L54685o34674J08449M22979
14660B0609834k45875l68684J88423l33417n02236j262520j511257k554774o1649
14651A3957845m60439J13130j23402J224841J447815O02324J299113N75604J174457
14642A9811288R44238N06423R24644N48266J416470L64402R90966R38307J411072
14633B7856076N39791J76561j59983j141757j593708k119120l037529l086788
14625A7433543k465582j874780k147602p95385o35632o7953k87910L14116l49115
14616I123700j00617J08455J67032j91024j97260N9838k83631L73196n30464k63704
$$ plain form
14606 8265521 8351358 8275849 7838535 8304182 8617991 9594133 11153723 13262326 15301578
14597 15301578 17787203 19592536 20618735 21010664 21323381 20854663 19981358 17873740 16059532
14588 16059532 13704562 12000885 9799284 8908550 8574143 8249978 8321561 8529538 8318972
14579 8318972 8048179 8402078 7822884 8379677 8569299 8682799 9046416 9752303 9682931 10442153
14569 10442153 11051963 11822629 13122636 15037361 17377246 18945019 20393851 21431984
14561 21431984 22912650 25780443 31060400 39845779 51699508 60145876 65903365 69532795
14553 69532795 71689243 72167468 70361870 67185525 61670187 53025347 42220666 32954716
14545 32954716 28652766 29761838 35917634 46886840 58942822 68447346 76602576 80444885
$$ packed form
14606H265521Q5837p5509m37314M65647L13809R76142J559590K108603K039252
14597A5301578K485625J805333J026199L91929L12717m68718q73305k107618j814208
14588A6059532k354970j703677k201601q90734l34407l24165P1583K07977k10566
14579H318972k70793L53899n79194N56793J89622J13500L63617P05887o9372P59222
14569A0442153O09810P70666J300007J914725K339885J567773J448832J038133
14561B1431984J480666K867793N279957Q785379J1853729Q446368N757489L629430
14553F9532795K156448M78225j805598l176345n515338q644840j0804681r265950
14545C2954716m301950J109072O155796J0969206J2055982R504524Q155230L842309
$$ plain form
14537 80444885 81876336 81723119 78919862 73740355 65230255 53719692 42112970 33168727
14529 33168727 27811549 24816243 23583495 22257251 22616140 22010761 21778835 21053801 21587179
14520 21587179 22406418 27431543 34529534 43342619 50705658 55577172 58973821 61008682
14512 61008682 61598825 61213780 60182507 56911794 51214488 44528712 39038525 37782923
14504 37782923 39765397 44599948 51424752 58368115 61852300 64905405 66193097 66225418
14496 66225418 65760083 62275126 59189900 53948243 46680164 38563237 32510446 29472812
14488 29472812 25257220 23077084 20157336 18424489 16425098 13864303 11777465 10091255
14480 10091255 9142576 8789949 7927023 7549134 7553131 7526172 7805016 8006362 8243692 8894395
$$ packed form
14537H0444885J431451j53217k803257n179507q510100j1510563j1606722q944243
14529C3168727n357178k995306j232748j326244L58889o05379k31926p25034N33378
14520B1587179Q19239N025125P097991Q813085P363039M871514L396649K034861
14512F1008682N90143l85045j031273l270713n697306o685776n490187j255602
14504C7782923J982474M834551O824804O943363L484185L053105J287692L2321
14496F6225418m65335l484957l085226n241657p268079q116927o052791l037634
14488B9472812m215592k180136k919748j732847j999391k560795k086838j686210
14480A0091255r48679l52627q62926l77889L997k6959K78844K01346K37330O50703
$$ plain form
14470 8894395 10457261 11639917 13678645 14600751 15052367 15976208 15634116 15243741 15317968
14461 15317968 14571146 13974165 14032641 14697626 16316216 17788229 19059942 19623036 19992240
14452 19992240 19626373 19594041 18674370 16985610 15119218 13424483 12041252 11559121 11289781
14443 11289781 11237539 11552418 11576610 12148828 12515297 13169297 13521310 13932299 14723208 14993544
14433 14993544 15686031 15685783 16956411 18848526 21821367 26337836 33393340 41744312 50324330
14424 50324330 57124209 62052856 65153749 66608586 65790249 64094618 60036564 54092658
14416 54092658 46987973 38731432 32150404 27941379 24454348 21819607 19377006 18381782
14408 18381782 16504132 15331181 13852318 13728541 12827728 12581163 12076209 12402121 12479571
$$ packed form
14470H894395J562866J182656K038728R22106M51616R23841l42092l90375P4227
14461A5317968p46822n96981N8476O64985J618590J472013J271713N63094L69204
14452A9992240l65867l2332r19671j688760j866392j694735j383231m82131k69340
14443A1289781n2242L14879K4192N72218L66469O54000L52013M10989P90909K70336
14433A4993544O92487k48J270628J892115K972841M516469P055504Q350972Q580018
14424E0324330O799879M928647L100893J454837q18337j695631m058054n943906
14416E4092658p104685q256541o581028m209025l487031k634741k442601r95224
14408A8381782j877650j172951j478863j23777r00813k46565n04954L25912P7450
$$ plain form
14399 12479571 12484000 12870953 13787623 14252096 15316091 17613201 21647215 27402620 37712971
14390 37712971 49770208 64111891 77459656 88848107 96487312 101396779 102807377
14383 102807377 101150145 96066897 87118445 74608343 60454461 47695761 37430508
14376 37430508 29029266 23243792 20278396 17271966 16068364 14694957 14447099 14290992
14368 14290992 13507661 13073739 13023947 12606283 12821007 12216550 11870446 11920658 12329287 12331976
14358 12331976 13543114 14355720 16702089 19012836 23280567 28283193 34231247 39670750
14350 39670750 44319539 47277676 48679907 48366031 46713456 43952582 39831520 34762076
14342 34762076 29644093 24241626 19697941 16880297 15383457 15254090 17441886 23360040
$$ packed form
14399A2479571M429L86953R16670M64473J063995K297110M034014N755405J0310351
14390C7712971J2057237J4341683J3347765J1388451P639205M909467J410598
14383A02807377j657232n083248q948452j2510102j4153882j2758700j0265253
14376C7430508q401242n785474k965396l006430j203602j373407k47858j56107
14368A4290992p83331m33922m9792m17664K14724o04457l46104N0212M08629K689
14358A2331976J211138Q12606K346369K310747M267731N002626N948054N439503
14350C9670750M648789K958137J402231l13876j652575k760874m121062n069444
14342C4762076n117983n402467m543685k817644j496840j29367K187796N918154
$$ plain form
14334 23360040 30394740 36753337 39655569 42008715 42501797 42826269 41613128 39235570
14326 39235570 36208944 29971598 21737222 16017369 13496418 12581496 11316598 10620783
14318 10620783 11065924 11345193 10754978 11199190 11519178 12497681 12735117 13492024 14052401
14309 14052401 15244476 16039931 16737054 18339445 19433001 21015268 22441549 23619246
14301 23619246 26472406 28876541 32577246 36281253 41995591 49063737 58418062 70428705
14293 70428705 85618808 107497182 135573875 168898864 204662194 238210000 265324066
14286 265324066 284108983 293333592 294956280 288330894 272529354 248585000 215835440
14279 215835440 179387810 142833380 114167039 90501608 73812686 60204550 50136420
$$ packed form
14334B3360040P034700O358597K902232K353146M93082L24472j213141k377558
14326C9235570l026626o237346q234376n719853k520951r14922j264898o95815
14318A0620783M45141K79269n90215M44212L19988R78503K37436P56907N60377
14309A4052401J192075P95455O97123J602391J093556J582267J426281J177697
14301B3619246K853160K404135L700705L704007N714338P068146R354325J2010643
14293G0428705J5190103K1878374K8076693L3324989L5763330L3547806K7114066
14286B65324066J8784917R224609J622688o625386j5801540k3944354l2749560
14279B15835440l6447630l6554430k8666341k3665431j6688922j3608136j0068130
$$ plain form
14272 50136420 42742874 36083422 31485667 27576780 24183689 21656133 19421657 17591203
14264 17591203 16522426 15076104 13971053 13265597 12899069 11780401 11319142 10263233
14256 10263233 9930751 9187453 9262626 8790369 8265254 8113148 8019615 7597995 7539918 7710339
14246 7710339 7687291 7080887 6869007 6825740 6682780 6359789 6248129 5900562 6124410 6068417
14236 6068417 6445637 5609842 5345912 5970431 5332918 5542280 5341092 4840808 4343961
14227 4343961 5055854 5038993 4808609 5172229 4895842 4829625 4753054 5025498 4878461 5121851
14217 5121851 5037732 5500732 5331130 5187699 5579881 5619691 4970280 5101076 5690036 5759924
14207 5759924 7021974 8184322 8158687 8207247 8656979 8645679 8646343 8484728 8226910 7864231
$$ packed form
14272E0136420p393546o659452m597755l908887l393091k527556k234476j830454
14264A7591203j068777j446322j105051p05456l66528j118668m61259j055909
14256A0263233l32482p43298P5173m72257n25115j52106r3533m21620n8077J70421
14246G710339k3048o06404k11880m3267j42960l22991j11660l47567K23848n5993
14236F068417L77220q35795k63930O24519o37513K09362k01188n00284m96847
14227D343961P11893j6861k30384L63620k76387o6217p6571K72444j47037K43390
14217E121851q4119M63000j69602j43431L92182L9810o49411J30796N88960O9888
14207E759924J262050J162348k5635M8560M49732j1300O64j61615k57818l62679
$$ plain form
14197 7864231 6249647 5030912 4816028 4679881 4910972 4512721 4640366 4655776 4746825
14188 4746825 5131242 4894902 4627564 5289984 5025126 4787442 4502227 4522798 4462021 4607456
14178 4607456 4030506 4114757 4064680 4433772 4493003 4370111 4303850 4837634 4516831 4454403
14168 4454403 4727458 4396188 4357081 4348610 4185524 4077812 4155684 3989043 4392227 4321095
14158 4321095 4468773 4441064 4683735 4928189 4674121 4579617 4857108 4502608 4555629 4378277
14148 4378277 4185418 4509449 4949043 5020122 5145813 5565408 5539596 6719731 7874566
14139 7874566 10505545 13538268 16236974 17700272 19410701 20443593 21158492 20445607
14131 20445607 19982143 18460412 16480655 13574003 11011982 9510266 7911848 6812931
$$ packed form
14197G864231j614584j218735k14884j36147K31091l98251J27645J5410R1049
14188D746825L84417k36340k67338O62420k64858k37684k85215K0571o0777J45435
14178D607456n76950Q4251n0077L69092N9231j22892o6261N33784l20803o2428
14168D454403K73055l31270l9107q471j63086j07712P7872j66641M03184p1132
14158D321095J47678k7709K42671K44454k54068r4504K77491l54500N3021j77352
14148D378277j92859L24031M39594P1079J25691M19595k5812J180135J154835
14139G874566K630979L032723K698706J463298J710429J032892P14899p12885
14131B0445607m63464j521731j979757k906652k562021j501716j598418j098917
$$ plain form
14123 6812931 6349230 5836227 6684198 6990793 7717814 8432650 8640832 8553795 8977237 8859516
14113 8859516 8641155 8237532 7434894 7115296 5911404 5785949 5759091 5521280 5469563 5767925
14103 5767925 5215904 5541563 5491429 6024409 5860415 6678888 7919538 8956689 9775788
14094 9775788 10078121 10545775 11042343 10640788 10321752 10267299 9703703 9195664 8205635 7997180
14084 7997180 8749926 9459307 10893284 11816651 12418035 12180638 12531783 12388858 11815960
14075 11815960 11162181 10361070 8932498 7590598 6991139 6484997 6444624 6289801 5775799
14066 5775799 5753370 6060895 6295101 6044461 6283991 6955098 7322417 8452488 8624136
14057 8624136 9874622 10095608 10361953 10479423 10846993 10717895 10657934 10322752 9656820
$$ packed form
14123F812931m63701n13003Q47971L06595P27021P14836K08182q7037M23442j17721
14113H859516k18361m03623q02638l19598j203892j25455k6858k37811n1717K98362
14103E767925n52021L25659n0134N32980j63994Q18473J240650J037151Q19099
14094I775788L02333M67654M96568m01555l19036n4453n63596n08039r90029k08455
14084G997180P52746P09381J433977R23367O01384k37397L51145j42925n72898
14075A1815960o53779q01111j428572j341900n99459n06142m0373j54823n14002
14066E775799k2429L07525K34206k50640K39530O71107L67319J130071J71648
14057H624136J250486K20986K66345J17470L67570j29098n9961l35182o65932
$$ plain form
14048 9656820 10293468 9866276 11038553 11720022 12865240 12947216 14015706 15343266 15802310
14039 15802310 17148764 17108729 17684710 17545479 17954123 18109098 18082179 18209206 18478304
14030 18478304 19908879 21347009 22682948 25091858 27852088 31105447 34721835 39778366
14022 39778366 46369263 54812703 65908992 80774199 100077462 127603804 160849649
14015 160849649 199739912 235512415 266100453 287263102 299490001 302583519 297700326
14008 297700326 283602046 260696416 228429855 189729470 151645371 119681887 94630359
14001 94630359 75927426 61776065 51405405 43505742 37209197 32329930 28228041 25189680
13993 25189680 22751285 21049093 19108460 17750594 17144527 15884625 16027965 15905424
$$ packed form
14048I656820O36648m27192J172277O81469J145218Q1976J068490J327560M59044
14039A5802310J346454m0035N75981j39231M08644J54975k6919J27027K69098
14030A8478304J430575J438130J335939K408910K760230L253359L616388N056531
14022C9778366O590897Q443440J1096289J4865207J9303263K7526342L3245845
14015A60849649L8890263L5772503L0588038K1162649J2226899L093518m883193
14008B97700326j4098280k2905630l2266561l8700385l8084099l1963484k5051528
14001I4630359j8702933j4151361j0370660p899663o296545m879267m101889l038361
13993B5189680k438395j702192j940633j357866o06067j259902J43340j22541
$$ plain form
13985 15905424 14632212 15718154 15642920 15775399 16131548 16039360 15877792 15618042 15627032 15181989
13975 15181989 14406201 14052616 13056565 11937960 10944396 10587627 10427206 9651402 9030379
13966 9030379 8336971 7478161 7181058 7062826 6661967 6483183 6104338 5966647 5876957 5262835
13956 5262835 5837963 5732443 5274862 5035550 5495357 5477161 5609766 5589329 6718710 7075586
13946 7075586 7160412 7727831 8022946 8307283 8637805 8967811 10469489 10991672 13103780
13937 13103780 18169283 24501435 31975490 39778201 47603087 54393131 59744437 61891337
13929 61891337 62361264 60252283 55677912 48517848 41216711 32566846 25223024 18398276
13921 18398276 13036268 9379534 7970451 7192869 6108018 5711814 5156168 4936233 4237222
$$ packed form
13985A5905424j273212J085942p5234J32479L56149r2188j61568k59750Q990m45043
13975A5181989p75788l53585r96051j118605r93564l56769j60421p75804o21023
13966I030379o93408q58810k97103j18232m00859j78784l78845j37691q9690o14122
13956E262835N75128j05520m57581k39312M59807j8196J32605k0437J129381L56876
13946G075586Q4826N67419K95115K84337L30522L30006J501678N22183K112108
13937A3103780N065503O332152P474055P802711P824886O790044N351306K146900
13929F1891337M69927k108981m574371p160064p301137q649865p343822o824748
13921A8398276n362008l656734j409083p77582j084851l96204n55646k19935o99011
$$ plain form
13912 4237222 4270590 3790492 3824934 4328454 3912608 3960076 3914978 4186617 4367384 4039604
13902 4039604 3654621 3296766 4272618 3680382 3458976 3682187 4108266 3247154 3476759
13893 3476759 3783243 3885623 3666767 3985800 4149091 4453561 3891774 3834791 4519183 4340425
13883 4340425 4174532 4193299 3876398 3540279 4058285 3899009 3999638 3536613 3486494 3358008
13873 3358008 3366920 3601364 3617264 3248383 3696912 3283046 3788279 3749377 3881037 4125933
13863 4125933 3834612 3759164 3833915 3661148 4077206 3928382 3413504 3597236 4009863 3679464
13853 3679464 3865647 4039868 3704742 3568106 3659138 4248621 3985030 4015266 4364140 4197065
13843 4197065 4690577 4522400 4030206 3577400 4445538 3969995 3674668 3446962 3278893
$$ packed form
13912D237222L3368m80098L4442N03520m15846M7468m5098K71639J80767l27780
13902D039604l84983l57855R75852n92236k21406K23211M26079q61112K29605
13893C476759L06484J02380k18856L19033J63291L04470n61787n6983O84392j78758
13883D340425j65893J8767l16901l36119N18006j59276J00629m63025n0119j28486
13873C358008Q912K34444J5900l68881M48529m13866N05233l8902J31660K44896
13863D125933k91321p5448P4751j72767M16058j48824n14878J83732M12627l30399
13853C679464J86183J74221l35126j36636R1032N89483k63591L0236L48874j67075
13843D197065M93512j68177m92194m52806Q68138m75543k95327k27706j68069
$$ plain form
13834 3278893 3615738 3216239 3356040 3413314 3169449 2806383 3721463 3231195 3651470 3208004
13824 3208004 3358341 3731750 3372357 3661211 3188391 3633227 3332773 3481093 3297098
13815 3297098 3142196 2656786 2926529 3090555 3228103 2865895 3388801 3462717 3016173 2869014
13805 2869014 3101103 3328267 3153287 3626335 3471959 2978815 3257734 3114547 3628419
13796 3628419 2980856 3792797 3349809 3945297 3884747 3836031 3503021 3729967 3534960 3464539
13786 3464539 3328640 2825656 3318219 3136534 2749005 3058656 3059244 3143805 2871027 3432086
13776 3432086 2901414 2954707 3363542 3295082 3278323 2818843 3502105 3432560 3753265 3846280
13766 3846280 3645822 3811326 3197960 3476911 3447596 3291358 3506869 3435767 3305345 3677294
$$ packed form
13834C278893L36845l99499J39801N7274k43865l63066R15080m90268M20275m43466
13824C208004J50337L73409l59393K88854m72820M44836l00454J48320j83995
13815C297098j54902m85410K69743J64026J37548l62208N22906P3916m46544j47159
13805B869014K32089K27164j74980M73048j54376m93144K78919j43187N13872
13796C628419o47563Q11941m42988N95488o0550m8716l33010K26946j95007p0421
13786C464539j35899n02984M92563j81685l87529L09651N88Q4561k72778N61059
13776C432086n30672N3293M08835o8460j6759m59480O83262o9545L20705R3015
13766C846280k00458J65504o13366K78951k9315j56238K15511p1102j30422L71949
$$ plain form
13756 3677294 2776253 3502777 3061625 3242810 2808305 3573517 3103900 3329526 2814030
13747 2814030 2993618 3095795 2995583 3036936 3345054 2824366 3281447 3098008 2872238 2622755
13737 2622755 2953076 3387475 2574078 3198780 3153084 3109568 3678246 3962067 3750179 3944496
13727 3944496 4000219 4522738 4614018 4344291 4438148 4421177 4312776 3968973 4263741 4079813
13717 4079813 3879694 3635234 3744613 3272152 3308871 3406609 2795076 3663874 3542317 3151139
13707 3151139 3390987 3520101 3538042 3527191 3448308 3853442 3474937 3740175 3856946 3965187
13697 3965187 3444052 3935854 4459387 4728115 5380587 5651885 5322346 6104956 5579889
13688 5579889 6133247 5846295 5755037 4919677 4955952 4001513 3456331 3535102 3753846 4025913
$$ packed form
13756C677294r01041P26524m41152J81185m34505P65212m69617K25626n15496
13747B814030J79588J02177j00212M1353L08118n20688M57081j83439k25770k49483
13737B622755L30321M34399q13397O24702m5696m3516N68678K83821k11888J94317
13727C944496N5723N22519R1280k69727R3857j6971j08401l43803K94768j83928
13717D079813k00119k44460J09379m72461L6719R7738o11533Q68798j21557l91178
13707C151139K39848J29114J7941j0851p8883M05134l78505K65238J16771J08241
13697C965187n21135M91802N23533K68728O52472K71298l29539P82610n25067
13688E579889N53358k86952r1258q35360L6275r54439n45182P8771K18744K72067
$$ plain form
13678 4025913 3687200 3941248 4336250 4197916 4237372 4464451 4618302 4464477 4863988 4576001
13668 4576001 5062749 5061343 5714414 5928543 6443936 7044337 7451772 7231599 7851714 7384785
13658 7384785 7872472 7427486 6775031 6777171 5773888 5491992 5094032 4851666 5289094 4315435
13648 4315435 4495131 4316892 4232587 4674092 4366815 4012132 4086134 4545066 4206666 4402019
13638 4402019 4222650 4185916 4839733 5009428 5844858 5619737 6106197 6648603 6636976 7125655
13628 7125655 6348976 6196136 5789709 5249340 5057520 4401340 4218345 3518162 3517937 4173287
13618 4173287 3457277 3759403 4011388 3862546 3682289 4017489 3824469 4288109 3963530
13609 3963530 4258560 4553528 4635548 4635419 4571804 5135153 4751161 3882114 4513007 4164305
$$ packed form
13678D025913l38713K54048L95002j38334L9456K27079J53851j53825L99511k87987
13668D576001M86748j406O53071K14129N15393O00401M07435k20173O20115m66929
13658G384785M87687m44986o52455K140j003283k81896l97960k42366M37428r73659
13648D315435J79696j78239q4305M41505l07277l54683P4002M58932l38400J95353
13638D402019j79369l6734O53817J69695Q35430k25121M86460N42406j1627M88679
13628G125655p76679j52840m06427n40369j91820o56180j82995p00183k25O55350
13618D173287p16010L02126K51985j48842j80257L35200j93020M63640l24579
13609C963530K95030K94968Q2020j29o3615N63349l83992q69047O30893l48702
$$ plain form
13599 4164305 4132182 4072519 3880529 3864697 3937597 3883377 3897056 4510258 4435549 4510457 4675761
13588 4675761 4668200 4906800 4391867 4950272 4120747 3997366 4029980 3749066 3461225 3506337
13578 3506337 3070524 3967079 3563866 2852301 3405782 2841417 3589260 3073977 3190094
13569 3190094 3480713 3175226 3568713 3464651 3232044 3663217 3091422 3118012 3386836 3275595
13559 3275595 2763253 3285377 2682249 3768385 3076414 3165510 3415882 3103449 3078540 3408429
13549 3408429 3340907 3365119 3634633 3421141 3156624 3549702 4570542 5357932 5264588 5708693
13539 5708693 5915798 6035690 6463541 6209109 5677941 5314919 5492692 4282223 3755008
13530 3755008 3967233 3961351 3931847 3917821 4147352 5366229 5300961 5815254 6210684 6127412
$$ packed form
13599D164305l2123n9663j91990j5832P2900n4220J3679O13202p4709P4908J65304
13588D675761p561K38600n14933N58405q29525j23381L2614k80914k87841M5112
13578C506337m35813Q96555m03213p11565N53481n64365P47843n15283J16117
13569C190094K90619l05487L93487j04062k32607M31173n71795K6590K68824j11241
13559C275595n12342N22124o03128J086136o91971Q9096K50372l12433k4909L29889
13549C408429o7522K4212K69514k13492k64517L93078J020840P87390r3344M44105
13539E708693K07105J19892M27851k54432n31168l63022J77773j210469n27215
13530C755008K12225n882k9504j4026K29531J218877o5268N14293L95430q3272
$$ plain form
13520 6127412 5788873 5953943 5328908 5470578 4693425 4233282 3381698 3250611 3267200 2620462
13510 2620462 3241627 3369425 3047679 3499366 2998490 2849051 2999214 2814568 2703393
13501 2703393 2657558 2721955 2298631 3301462 2586092 2664110 2674895 2694935 2555094 2732481
13491 2732481 2634383 2930858 2847945 2434524 3060733 2824970 2892488 2948021 2761239 2849240
13481 2849240 2718112 2884933 2903873 2763148 2951476 2734965 2489455 2758124 2601029 3002794
13471 3002794 2617159 2210116 2862192 2309815 2857032 2773506 2410594 3161442 2779634 2755418
13461 2755418 2631355 2685134 3043923 2641579 2693018 2873752 3204167 3394707 3751709 4411377
13451 4411377 5374245 5482580 5554720 5694970 5947433 6104988 5678684 4970055 4660910 4224101
$$ packed form
13520F127412l38539J65070o25035J41670p77153m60143q51584j31087J6589o46738
13510B620462O21165J27798l21746M51687n00876j49439J50163j84646j11175
13501B703393m5835O4397m23324J002831p15370P8018J0785K0040j39841J77387
13491B732481r8098K96475q2913m13421O26209k35763O7518N5533j86782Q8001
13481B849240j31128J66821J8940j40725J88328k16511k45510K68669j57095M01765
13471C002794l85635m07043O52076n52377N47217q3526l62912P50848l81808k4216
13461B755418j24063N3779L58789m02344N1439J80734L30415J90540L57002O59668
13451D411377R62868J08335P2140J40250K52463J57555m26304p08629l09145m36809
$$ plain form
13441 4224101 3735879 3497183 3313978 2717134 3289496 2897578 3183622 3168232 2698982 2972239
13431 2972239 2817664 2565235 2670660 3088585 3088039 2870766 2924979 3389787 4212552 4600621
13421 4600621 4867727 5449862 5507604 6039106 5758084 5400730 5442697 5145411 4534405 4482695
13411 4482695 3900634 3509404 3349537 3133825 2847374 3008911 3156346 2968120 3328247
13402 3328247 2774970 3174548 2994796 2562486 2603570 2713229 2964813 3174402 2887833 3108918
13392 3108918 3317338 3258326 3695952 3942958 3831892 4130662 4295253 4299583 4850891 5890055
13382 5890055 5493051 5740024 5653938 5499781 5503829 5223517 4841448 4598879 3952923 4172972
13372 4172972 3685899 3832789 3397655 3692018 4059533 4524606 4218640 4349575 4027207
$$ packed form
13441D224101m88222k38696j83205n96844N72362l91918K86044j5390m69250K73257
13431B972239j54575k52429J05425M17925n46k17273N4213M64808Q22765L88069
13421D600621K67106N82135N7742N31502k81022l57354M1967k97286o11006n1710
13411D482695n82061l91230j59867k15712k86451J61537J47435j88226L60127
13402C328247n53277L99578j79752m32310M1084J09659K51584K09589k86569K21085
13392C108918K08420n9012M37626K47006j11066K98770J64591M330N51308J039164
13382E890055l97004K46973q6086j54157M048k80312l82069k42569o45956K20049
13372D172972m87073J46890m35134K94363L67515M65073l05966J30935l22368
$$ plain form
13363 4027207 4276017 4080409 3787550 3972891 4063451 3912589 3476112 4066636 4076764 4055755
13353 4055755 4268861 4465747 5457075 4567029 4933274 4810231 4579882 4643588 4060604 3795323
13343 3795323 4000894 3909702 3850866 4200408 3810916 4379946 3488920 4255209 4127284 3562162
13333 3562162 3922086 4166946 3998609 3830499 4099465 3591010 3820743 3760536 4037773 3622760
13323 3622760 3413024 3736601 4078488 4167620 4414273 4018760 4476648 4544979 4859966 5208860
13313 5208860 4866402 5231745 6042950 5564724 5817084 5951011 5597229 6412728 5786539
13304 5786539 5544199 4878838 5377980 5171718 5370140 5610285 5889472 6172993 6149908 6731111
13294 6731111 6086271 6316025 6536781 6757848 5904098 6100514 5722725 5860220 5679161
$$ packed form
13363D027207K48810j95608k92859J85341R0560j50862m36477N90524J0128k1009
13353D055755K13106J96886R91328q90046L66245j23043k30349O3706n82984k65281
13343C795323K05571r1192n8836L49542l89492N69030q91026P66289j27925n65122
13333C562162L59924K44860j68337j68110K68966n08455K29733o0207K77237m15013
13323C622760k09736L23577L41887Q9132K46653l95513M57888O8331L14987L48894
13313E208860l42458L65343Q11205m78226K52360J33927l53782Q15499o26189
13304E786539k42340o65361M99142k06262J98422K40145K79187K83521k3085N81203
13294F731111o44840K29754K20756K21067q53750J96416l77789J37495j81059
$$ plain form
13285 5679161 6046180 5535478 6026777 5435542 5508294 6030325 5965508 6118842 6458049 6106132
13275 6106132 6484355 6527929 6902707 6354826 6537166 6939311 7420639 7458083 6840296 7397180
13265 7397180 7631662 7798915 8747163 8172927 8743439 9370644 9813139 9540434 10358555
13256 10358555 10342934 10624415 11600120 11302057 11644076 12210709 12045052 12211009 12142794 12397545
13246 12397545 12212354 12487923 12376945 12567096 12747325 12683405 12978255 13217198 13376678
13237 13376678 14197768 14650837 14387396 15298777 15905078 16934021 17071545 17943913 18281882
13228 18281882 18654124 19033596 19417429 19119833 18648339 18706811 18231936 18083730 17779784
13219 17779784 17543829 16305362 16517987 16519041 16073938 16146106 16054622 16187928 15506790 15789980
$$ packed form
13285E679161L67019n10702M91299n91235P2752N22031o4817J53334L39207l51917
13275F106132L78223M3574L74778n47881J82340M02145M81328L7444o17787N56884
13265G397180K34482J67253R48248n74236N70512O27205M42495k72705Q18121
13256A0358555j5621K81481R75705k98063L42019N66633j65657J65957o8215K54751
13246A2397545j85191K75569j10978J90151J80229o3920K94850K38943J59480
13237A3376678Q21090M53069k63441R11381O06301J028943J37524Q72368L37969
13228A8281882L72242L79472L83833k97596m71494N8472m74875j48206l03946
13219A7779784k35955j238467K12625J054m45103P2168r1484J33306o81138K83190
$$ plain form
13209 15789980 15466000 15787508 15615797 15842644 15956527 15865865 15986486 15884483 15767516
13200 15767516 15427772 15121913 14825036 14812993 14376249 13715514 13512781 13071714 13119968 12881836
13190 12881836 12425950 12304267 12265302 12242303 11809852 12075370 11291075 11481151 11210791 11138427
13180 11138427 10723501 10421268 10728746 10764399 10561762 10549553 10594368 10788395 10521052 10794972
13170 10794972 10774005 10499806 10268925 10569991 10866840 10456601 10888648 10630906 11226837
13161 11226837 11528922 12147600 12519531 12662205 13294584 12802043 13236605 13574868 14035874
13152 14035874 13671088 13394254 13723074 13320573 12803493 12424734 12761602 12844922 12590531
13143 12590531 12542877 12364887 12285059 12410716 12116205 11777816 11384758 11094792 10313083 10195197
$$ packed form
13209A5789980l23980L21508j71711K26847J13883r0662J20621j02003j16967
13200A5767516l39744l05859k96877j2043m36744o60735k02733m41067M8254k38132
13190A2881836m55886j21683l8965k2999m32451K65518p84295J90076k70360p2364
13180A1138427m14926l02233L07478L5653k02637j2209M4815J94027k67343K73920
13170A0794972k0967k74199k30881L01066K96849m10239M32047k57742N95931
13161A1226837L02085O18678L71931J42674O32379m92541M34562L38263M61006
13152A4035874l64786k76834L28820m02501n17080l78759L36868Q3320k54391
13143A2590531m7654j77990p9828J25657k94511l38389l93058k89966p81709j17886
$$ plain form
13133 10195197 9483010 9109810 8451862 7960697 8469829 8132907 8262715 8281648 8811956
13124 8811956 8886652 8578938 8557070 8411258 8192991 7454528 7300290 6934820 6809543 6328816
13114 6328816 6688539 6318397 6261612 6218847 6355017 6612336 6548742 6209367 5877893 6110737
13104 6110737 5952687 5758190 6668326 6550254 6115501 6533183 7064435 7481017 7739752
13095 7739752 8671469 9177604 9978179 10636929 11447101 11504826 11510777 11470379 11535504 10808393
13085 10808393 10765602 10454768 10285182 10446601 10399130 10674534 10412901 10148093 10207607 9697474
13075 9697474 8493882 8577019 7794502 7277556 7066733 6016085 5696279 5652588 5559814 5646112
13065 5646112 5303557 4948441 5266124 5238627 5102089 5582326 5815148 5509358 6032150 5502772
$$ packed form
13133A0195197p12187l73200o57948m91165N09132l36922J29808J8933N30308
13124H811956P4696l07714k1868j45812k18267p38463j54238l65470j25277m80727
13114F328816L59723l70142n6785m2765J36170K57319o3594l39375l31474K32844
13104F110737j58050j94497R10136j18072m34753M17682N31252M16582K58735
13095G739752R31717N06135Q00575O58750Q10172N7725N951m0398O5125p27111
13085A0808393m2791l10834j69586J61419m7471K75404k61633k64808N9514n10133
13075I697474j203592Q3137p82517n16946k10823j050648l19806m3691r2774Q6298
13065E646112l42555l55116L17683k7497j36538M80237K32822l05790N22792n29378
$$ plain form
13055 5502772 5817727 6440368 5958467 5587211 5990308 5518590 5569546 5618871 5729429 5136738
13045 5136738 5656559 5073187 5068519 5273042 4850452 5557414 5769586 5212895 5730134 5503939
13035 5503939 5360950 5516067 6034549 5809810 5825916 5860158 6304534 6492031 5901192 5681095
13025 5681095 6510614 6326003 6559101 6419071 6614616 6556550 6935832 7215042 7073059 7750129
13015 7750129 7359686 7425335 7580136 7758864 7629692 7892925 8376479 8351229 8688792 9027445
13005 9027445 8634046 9412690 9298511 8957003 9771784 10002369 10318889 10092031 10442800
12996 10442800 10574626 10941515 11094575 11548412 11834340 12082114 12391174 12617587 13208266
12987 13208266 12730710 12650988 12665342 12775444 12780063 13035141 13208482 13410714 13163165 13324580
$$ packed form
13055E502772L14955O22641m81901l71256M03097m71718N0956M9325J10558n92691
13045E136738N19821n83372m668K04523m22590P06962K12172n56691N17239k26195
13035E503939j42989J55117N18482k24739J6106L4242M44376J87497n90839k20097
13025E681095Q29519j84611K33098j40030J95545n8066L79282K79210j41983O77070
13015G750129l90443O5649J54801J78728j29172K63233M83554k5250L37563L38653
13005I027445l93399P78644j14179l41508Q14781K30585L16520k26858L50769
12996A0442800J31826L66889J53060M53837K85928K47774L09060K26413N90679
12987A3208266m77556p9722J4354J10102M619K55078J73341K02232k47549J61415
$$ plain form
12977 13324580 12944657 12807000 12563049 12713865 12217549 11873721 12126789 11990091 12037690
12968 12037690 11980043 11333433 11581353 11287588 10797932 10780371 10646105 10792749 10506060 10941869
12958 10941869 10668941 10712463 10210575 10222680 10148683 10449187 10402124 10343650 10053075 10240689
12948 10240689 9775047 10159783 10108784 10214986 10224533 10087181 10055945 9938383 10136164 10148315
12938 10148315 10153871 10273065 10450853 10271639 10271937 10692862 11180313 11134728 11927655 11756239
12928 11756239 11482523 11172066 11590137 11664040 11245540 11668416 11193929 10987951 11067386 12055391
12918 12055391 11428449 11274513 10529762 11454811 10236920 11236812 10373081 10066842 9962044
12909 9962044 9745868 8847889 9252599 8807438 8512520 8648413 8409789 8195194 7959111
$$ packed form
12977A3324580l79923j37657k43951J50816m96316l43828K53068j36698M7599
12968A2037690n7647o46610K47920k93765m89656j7561j34266J46644k86689M35809
12958A0941869k72928M3522n01888J2105p3997L00504m7063n8474k90575J87614
12948A0240689m65642L84736n0999J06202R547j37352l1236j17562J97781J2151
12938A0148315N556J19194J77788j79214K98M20925M87451m5585P92927j71416
12928A1756239k73716l10457M18071P3903m18500M22876m74487k05978P9435R88005
12918A2055391o26942j53936p44751R25049j217891R99892q63731l06239j04798
12909I962044k16176q97979M04710m45161k94918J35893k38624k14595k36083
$$ plain form
12900 7959111 8270464 7618544 7948675 7589000 7559686 7210801 7271186 7110964 6704476 6463774
12890 6463774 7072785 6899281 6763253 6459854 6623862 6273084 6474395 6337269 6868283
12881 6868283 6341257 6500067 6807512 6105759 5557618 6000991 6031472 5717222 5752684 5777690
12871 5777690 6068762 5623652 5608628 5571053 6214717 5316158 5734420 5657361 5069647 5374515
12861 5374515 5626966 5531510 4767303 5436736 5503424 5756035 5212503 5087161 5542560 5522603
12851 5522603 4923212 5361095 5126620 5685455 5523942 5724423 5559409 5460741 5591471 5460408
12841 5460408 5476938 5274731 5447219 4996964 5458369 5591605 5210393 5298069 5181684 5714326
12831 5714326 5441140 5401073 4866325 5212444 5394630 5539206 5177823 5500195 5641976 5739477
$$ packed form
12900G959111L11353o51920L30131l59675k9314l48885O0385j60222m06488k40702
12890F463774O09011j73504j36028l03399J64008l50778K01311j37126N31014
12881F868283n27026J58810L07445p01753n48141M43373L0481l14250L5462K5006
12871E777690K91072m45110j5024l7575O43664q98559M18262p7059n87714L04868
12861E374515K52451r5456p64207O69433O6688K52611n43532j25342M55399j9957
12851E522603n99391M37883k34475N58835j61513K00481j65014r8668J30730j31063
12841E460408J6530k02207J72488m50255M61405J33236l81212Q7676j16385N32642
12831E714326k73186m0067n34748L46119J82186J44576l61383L22372J41781R7501
$$ plain form
12821 5739477 5577961 5380366 5274759 5155211 5494829 5478994 5353781 5624783 5461400 5574594
12811 5574594 5585204 5320642 4986609 5617826 5325456 4991171 5411147 5824539 5712323 5480491
12801 5480491 5354866 5543084 5982830 5730814 5835258 5849650 5931331 5820031 6096597 5542815
12791 5542815 6021096 5175079 6055870 5920180 5720984 5696518 6541217 6463867 5913830 6059131
12781 6059131 5682018 5540868 5832430 6491744 6196864 5747978 5713513 5905848 5801177 5827228
12771 5827228 5673455 6121076 6343726 6054810 6227244 5743260 5817053 5788043 5972524 6276004
12761 6276004 5998389 5952530 6348656 6430131 6442299 6035117 6358903 5994313 6235353 6148079
12751 6148079 5920528 6170542 6380844 6406431 5988464 6265718 6055950 5951717 6121207 5993879
$$ packed form
12821E739477j61516j97595j05607j19548L39618j5835j25213K71002j63383J13194
12811E574594J0610k64562l34033O31217k92370l34285M19976M13392j12216k31832
12801E480491j25625J88218M39746k52016J04444J4392Q1681j11300K76566n53782
12791E542815M78281q46017Q80791j35690j99196k4466Q44699p7350n50037J45301
12781F059131l77113j41150K91562O59314k94880m48886l4465J92335j04671K6051
12771E827228j53773M47621K22650k88916J72434m83984P3793k9010J84481L03480
12761F276004k77615m5859L96126Q1475J2168m07182L23786l64590K41040q7274
12751F148079k27551K50014K10302K5587m17967K77254k09768j04233J69490j27328
$$ plain form
12741 5993879 6312950 5912036 6695517 6067754 6350806 6396104 5962654 6046611 6447414 5918485
12731 5918485 6026179 6325505 6772628 6171594 6516332 6072486 6255916 6450799 6194858
12722 6194858 6968754 6235171 6583389 6170612 6444055 6621383 6347882 6303397 6261649 6476639
12712 6476639 6361826 6298534 6668356 6774558 6521716 6971456 6913910 6589808 7257064 7534512
12702 7534512 7233556 7578845 7889202 8155065 8433808 8099125 8685768 8951834 8559491
12693 8559491 8861955 8924097 9371443 10412876 11398277 13490813 14871159 15579247 16177799
12684 16177799 16523769 16268768 16302024 15225787 14284782 13247838 11009937 10766327 9849397
12675 9849397 9042014 9388099 8917206 8941248 8873528 8667427 9166310 9645126 9961836 9843088
$$ packed form
12741E993879L19071m00914P83481o27763K83052M5298m33450Q3957M00803n28929
12731E918485J07694K99326M47123o01034L44738m43846J83430J94883k55941
12722F194858P73896p33583L48218m12777K73443J77328k73501m4485m1748K14990
12712F476639j14813o3292L69822J06202k52842M49740n7546l24102O67256K77448
12702G534512l00956L45289L10357K65863K78743l34683N86643K66066l92343
12693H559491L02464O2142M47346J041433R85401K092536J380346P08088N98552
12684A6177799L45970k55001L3256j076237r41005j036944k237901k43610r16930
12675I849397q07383L46085m70893K4042o7720k06101M98883M78816L16710j18748
$$ plain form
12665 9843088 9996101 10514177 10890227 9929270 10059079 9931142 9707195 9347010 9690675
12656 9690675 9172824 9011838 9419465 9307947 9254004 9949845 10115750 10992380 10941097 11302802
12646 11302802 11781489 12281591 12306766 12626883 12507297 12976135 13271353 12339300 12554001
12637 12554001 12340202 12249074 12668722 13061921 12917323 12958974 12529237 12704679 12738502 12618270
12627 12618270 13664475 13937099 13824227 13698714 14254766 13953634 13456372 12967497 13151102
12618 13151102 11890281 11319084 10958391 10692099 10697668 10418138 10789153 11883817 12233015
12609 12233015 13032549 13282658 14456727 15840548 16950840 17034164 16784426 16817049 16846698
12600 16846698 15924884 14771142 14138737 12776369 12047958 11336658 10867531 10382127 9436310
$$ packed form
12665I843088J53013N18076L76050r60957J29809j27937k23947l60185L43665
12656I690675n17851j60986M07627j11518n3943O95841J65905Q76630n1283L61705
12646A1302802M78687N00102K5175L20117j19586M68838K95218r32053K14701
12637A2554001k13799r1128M19648L93199j44598M1651m29737J75442L3823j20232
12627A2618270J046205K72624j12872j25513N56052l01132m97262m88875J83605
12618A3151102j260821n71197l60693k66292N569k79530L71015J094664L49198
12609A2233015P99534K50109J174069J383821J110292Q3324k49738L2623K9649
12600A6846698r21814j153742o32405j362368p28411p11300m69127m85404r45817
$$ plain form
12591 9436310 9628211 9746367 10396970 10699092 10922768 11179417 12096869 11859157 11879615 12157594
12581 12157594 12409587 12941672 13247752 13559918 13943917 14125060 14163353 14468943 14111167
12572 14111167 13914452 13583192 12591228 12065244 11489144 10604167 9801329 10030873 10378733
12563 10378733 9914398 10017688 9680864 9876627 10172336 9842916 9480127 10325437 9637565
12554 9637565 9481054 10035759 9543631 9492234 9518168 9512523 9688011 9567217 10124010 10039713
12544 10039713 9750221 10392195 10484332 10984490 11362513 11760297 12073877 12183846 12464084
12535 12464084 12571423 12495433 12063201 11860186 12043263 11478842 10822467 10264551 10109919
12526 10109919 10007468 10125681 9923606 9932624 10399562 9912568 9922498 10309389 10339134 10748543
$$ packed form
12591I436310J91901J18156O50603L02122K23676K56649R17452k37712K0458K77979
12581A2157594K51993N32085L06080L12166L83999J81143L8293L05590l57776
12572A4111167j96715l31260r91964n25984n76100q84977q02838K29544L47860
12563A0378733m64335J03290l36824J95763K95709l29420l62789Q45310o87872
12554I637565j56511N54705m92128n1397K5934n645J75488j20794N56793q4297
12544A0039713k89492O41974R2137N00158L78023L97784L13580J09969K80238
12535A2464084J07339p5990m32232k03015J83077n64421o56375n57916j54632
12526A0109919j02451J18213k02075R018M66938m86994R930L86891K9745M09409
$$ plain form
12516 10748543 10413844 10391870 11446012 11626488 12174311 13443647 14765142 15294111 16295213
12507 16295213 16560904 16448485 15842001 16147856 15477637 14432644 13606778 12592174 12126109
12498 12126109 11747132 11397939 11036932 11365725 10829730 11419588 10914392 11209120 10860000
12489 10860000 11530863 10793376 11505912 11524280 11004252 11363185 12246921 12803843 13617973
12480 13617973 13947503 14331520 14634300 14440124 14683379 14694291 14867503 14515591 13989814
12471 13989814 13544362 12585913 12700836 12275742 12826270 12444371 12844934 13112621 12653391
12462 12653391 12924796 13390283 13601771 14359915 14646037 14728749 15462627 15546085 16248923 16900350
12452 16900350 17101006 18168162 18233300 19252600 19385232 20158383 20656922 20786188 21188131
$$ packed form
12516A0748543l34699k1974J054142J80476N47823J269336J321495N28969J001102
12507A6295213K65691j12419o06484L05855o70219j044993q25866j014604m66065
12498A2126109l78977l49193l61007L28793n35995N89858n05196K94728l49120
12489A0860000O70863p37487P12536J8368n20028L58933Q83736N56922Q14130
12480A3617973L29530L84017L02780j94176K43255J0912J73212l51912n25777
12471A3989814m45452r58449J14923m25094N50528l81899M00563K67687m59230
12462A2653391K71405M65487K11488P58144K86122Q2712P33878Q3458P02838O51427
12452A6900350K00656J067156O5138J019300J32632P73151M98539J29266M01943
$$ plain form
12443 21188131 21525843 21541450 21575361 21283194 21404283 21236096 20881745 21004565 21069710 20931255
12433 20931255 21457124 21755294 21698418 22185815 22968738 23665274 24374494 25957480 26159355
12424 26159355 27166862 28202955 29753255 29995503 31439279 31920651 32730002 32967808 33421236
12415 33421236 34056653 34213826 33800459 33928772 33590654 33545949 32345934 31990976 31480166
12406 31480166 30876332 30064487 29021741 29008097 27979663 27636802 27437577 27402807 27529213
12397 27529213 28193342 28214235 28980996 28975006 29580794 30802965 31265510 32533733 33569816
12388 33569816 33833900 35097771 35540860 36667489 36460547 36800364 37206632 37291623 37178639
12379 37178639 37218876 36804436 37015139 37004790 36470735 36660502 36936847 37064461 36408628 36653764
$$ packed form
12443B1188131L37712J5607L3911k92167J21089j68187l54351J22820O5145j38455
12433B0931255N25869K98170n6876M87397P82923O96536P09220J582986K01875
12424B6159355J007507J036093J550300K42248J443776M81372Q09351K37806M53428
12415C3421236O35417J57173m13367J28313l38118m4705j200015l54958n10810
12406C1480166o03834q11845j042746j3644j028434l42861j99225l4770J26406
12397B7529213O64129K0893P66761n990O05788J222171M62545J268223J036083
12388C3569816K64084J263871M43089J126629k06942L39817M06268Q4991j12984
12379C7178639M0237m14440K10703j0349n34055J89767K76345J27614o55833K45136
$$ plain form
12369 36653764 36472872 36589760 36985071 36779876 36621760 37161697 36826930 37009796 36819235
12360 36819235 36424363 36629387 36174371 35982142 36286730 35927583 35719969 35930134 35248166
12351 35248166 35578388 35339465 34991858 34766420 34487668 33717378 33418664 33236290 32906400
12342 32906400 33036948 32958605 33865057 34285050 34969440 35817143 36319997 36992395 38283435
12333 38283435 39331284 40145373 40866070 41673419 42366703 43052951 43724686 44527983 44996839
12324 44996839 45478183 45569730 45830157 46394158 45934313 46435214 45948857 46290589 45592784
12315 45592784 46436709 46026763 45737426 46457463 46077327 46214353 47195436 47836820 48019587
12306 48019587 49155633 50608191 51119219 52038651 52244217 52925401 52427548 52460677 51396748
$$ packed form
12369C6653764j80892J16888L95311k05195j58116N39937l34767J82866j90561
12360C6819235l94872K05024m55016j92229L04588l59147k07614K10165o81968
12351C5248166L30222k38923l47607k25438k78752p70290k98714j82374l29890
12342C2906400J30548p8343R06452M19993O84390Q47703N02854O72398J291040
12333C8283435J047849Q14089P20697Q07349O93284O86248O71735Q03297M68856
12324D4996839M81344R1547K60427N64001m59845N00901m86357L41732o97805
12315D5592784Q43925m09946k89337P20037l80136J37026R81083O41384J82767
12306D8019587J136046J452558N11028R19432K05566O81184m97853L3129j063929
$$ plain form
12297 51396748 50132701 49514523 48615903 47309599 45874845 44955799 44463138 43616144 42980490
12288 42980490 42705943 41668545 40994501 40519098 39705493 38385847 36769085 36158861 34823425
12279 34823425 33649770 32380999 32002583 30915618 30064916 30305535 29917570 29415052 29394555
12270 29394555 29196072 28966687 29015065 28900366 28864891 28374197 28444792 28076847 28147010 28078360
12260 28078360 27981855 27822043 27963226 28410613 28413826 29711064 30188048 31372868 32788702
12251 32788702 34223494 36378649 38061767 39881417 42648045 45168304 48037100 49685485
12243 49685485 53135673 54365399 55843492 56793101 57835804 57444794 57520188 57263298 56669345
12234 56669345 55588775 55248646 54510425 53621296 52773700 52603874 51493215 49939432 48489933
$$ packed form
12297E1396748j264047o18178q98620j306304j434754r19046m92661q46994o35654
12288D2980490k74547j037398o74044m75403q13605j319646j616762o10224j335436
12279C4823425j173655j268771l78416j086965q50702K40619l87965n02518k0497
12270B9394555j98483k29385M8378j14699l5475m90694P0595l67945P0163o8650
12260B8078360r6505j59812J41183M47387L213J297238M76984J184820J415834
12251C2788702J434792K155155J683118J819650K766628K520259K868796J648385
12243D9685485L450188J229726J478093R49609J042703l91010P5394k56890n93953
12234E6669345j080570l40129p38221q89129q47596j69826j110659j553783j449499
$$ plain form
12225 48489933 46249317 43814816 41553703 38687644 36074780 33746216 31670711 30340082
12217 30340082 28076301 27616680 26651085 25849029 25072296 24329605 23503932 23085866 22919697
12208 22919697 22200094 21737061 21168279 20412524 20514924 20156498 20659837 20403674 20647873
12199 20647873 20732651 20692549 20597599 20608752 20991301 21325831 21730070 21985846 22497922 23427129
12189 23427129 23710799 24271277 24961423 25638293 25448350 25823138 26268586 26639170 26480724
12180 26480724 26671015 26733260 26376305 26268545 25695140 25353768 26044539 24978769 24696676
12171 24696676 24434620 24694370 25088596 25018137 25460497 24787766 24807933 25389093 25683305 26425111
12161 26425111 27261177 27781664 28553673 29531307 30183266 30612682 30457830 30375014 30241180
$$ packed form
12225D8489933k240616k434501k261113k866059k612864k328564k075505j330629
12217C0340082k263781m59621r65595q02056p76733p42691q25673m18066j66169
12208B2919697p19603m63033n68782p55755J02400l58426N03339k56163K44199
12199B0647873Q4778m0102r4950J1153L82549L34530M04239K55776N12076R29207
12189B3427129K83670N60478O90146O76870j89943L74788M45448L70584j58446
12180B6480724J90291O2245l56955j07760n73405l41372O90771j065770k82093
12171B4696676k62056K59750L94226p0459M42360o72731K0167N81160K94212P41806
12161B6425111Q36066N20487P72009R77634O51959M29416j54852q2816j33834
$$ plain form
12152 30241180 30288411 29981492 30075728 29905864 30545153 31675134 32676233 34528109 35872335
12143 35872335 37490570 38822376 40918433 42365084 44419882 45583398 47798889 49053175
12135 49053175 50417179 52843203 54654199 58015054 61021008 63947305 68168857 72291801
12127 72291801 76807427 81887130 85422945 89232498 92147414 95400969 96784265 98319804
12119 98319804 98858609 98356716 97230764 96104974 94663385 92152006 90063281 87958707
12111 87958707 86071799 83651424 82324613 80199785 78254887 76520184 74344013 73223226
12103 73223226 71862694 71770745 71436595 71005801 71395796 70948067 70886511 70780700 70605980
12094 70605980 70455263 69777907 68699938 68136903 67303050 67520008 68036248 69368530 71186466
$$ packed form
12152C0241180M7231l06919R4236j69864O39289J129981J001099J851876J344226
12143C5872335J618235J331806K096057J446651K054798J163516K215491J254286
12135D9053175J364004K426024J810996L360855L005954K926297M221552M122944
12127G2291801M515626N079703L535815L809553K914916L253555J383296J535539
12119I8319804N38805n01893j125952j125790j441589k511379k088725k104574
12111H7958707j886908k420375j326811k124828j944898j734703k176171j120787
12103G3223226j360532r1949l34150m30794L89995m47729o1556j05811j74720
12094G0605980j50717o77356j077969n63035q33853K16958N16240J332282J817936
$$ plain form
12085 71186466 72868568 74151145 76113086 76997726 78292395 79782600 79831848 79830546 80033010
12076 80033010 79773117 79098216 79809852 79860566 79704401 79813082 78954806 78174474 76663556
12067 76663556 75200791 72927353 70913985 68192595 65821305 63503885 61424658 59369157
12059 59369157 58266446 56848343 56253777 55302176 54151567 52956655 52136721 50739035
12051 50739035 48914377 47945714 46471907 45765481 44820754 44080802 43218564 42856395 42369604
12042 42369604 41200139 40908287 39839248 38452495 37613837 36886118 35640055 34695307 34020150
12033 34020150 33753695 34130041 34330001 35185113 35859374 36777512 37378252 38319125 38574424
12024 38574424 38871335 38269687 37513168 36877682 35381727 33624219 32020511 30532859 29126648
$$ packed form
12085G1186466J682102J282577J961941Q84640J294669J490205M9248j302K02464
12076H0033010k59893o74901P11636N0714j56165J08681q58276p80332j510918
12067G6663556j462765k273438k013368k721390k371290k317420k079227k055501
12059E9369157j102711j418103n94566r51601j150609j194912q19934j397686
12051E0739035j824658r68663j473807p06426r44727p39952q62238l62169m86791
12042D2369604j169465k91852j069039j386753q38658p27719j246063r44748o75157
12033C4020150k66455L76346J99960Q55112O74261R18138O00740R40873K55299
12024C8574424K96911o01648p56519o35486j495955j757508j603708j487652j406211
$$ plain form
12015 29126648 28085703 27062018 25632089 25255764 23982297 23828671 23249227 22184519
12007 22184519 21930135 21242198 20758356 20280607 20594262 19948145 20941520 21043595 21513387
11998 21513387 21535744 21742303 20811610 20678088 20358821 20317787 19979334 19052032 19203386 19419156
11988 19419156 19103861 19283666 18938732 19044096 18871148 18919795 18764128 18115813 18134788 16881982
11978 16881982 16701217 16767709 16923458 16839419 16194123 16329555 16165914 15401962 14809788 14415537
11968 14415537 13467587 13207130 13154438 12754599 12529152 11936518 11515804 12061018 12034510 11435957
11958 11435957 11900291 11389981 12609502 12067584 12197101 12489676 12149738 12472107 12866097
11949 12866097 12834566 12446651 12839207 12853873 13407126 13133348 13897765 13798301 14833884 15136981
$$ packed form
12015B9126648j040945j023685j429929l76325j273467j53626n79444j064708
12007B2184519k54384o87937m83842m77749L13655o46117R93375J02075M69792
11998B1513387K2357K06559r30693j33522l19267m1034l38453r27302J51354K15770
11988A9419156l15295J79805l44934J05364j72948M8647j55667o48315J8975j252806
11978A6881982j80765O6492J55749q4039o45296J35432j63641p63952n92174l94251
11968A4415537r47950k60457n2692l99839k25447n92634m20714N45214k6508n98553
11958A1435957M64334n10310J219521n41918J29517K92575l39938L22369L93990
11949A2866097l1531l87915L92556J4666N53253k73778P64417r9464J035583L03097
$$ plain form
11939 15136981 15352144 16115449 16555306 16842149 17114222 17630780 17511187 18149614 17755978
11930 17755978 17591904 17205191 17377758 16710291 16577293 16246323 16215491 15849712 15581142
11921 15581142 14919074 14541285 14319007 13677928 13150321 12907174 12628449 12470319 12482506
11912 12482506 11954606 12431191 12849722 16042226 21350037 26315432 28970295 30763128
11904 30763128 32055467 31928700 31499690 30504720 29212669 26044229 20543578 15009463
11896 15009463 12484130 11391140 11004772 10465962 10796257 11005231 10633418 10749377 11208654
11887 11208654 11800058 12004988 13578979 15094330 16829099 17005346 18001369 18541742 19219993
11878 19219993 19598547 20003286 19148134 18495968 17322576 16480950 15535108 14379698 13727170
$$ packed form
11939A5136981K15163P63305M39857K86843K72073N16558j19593O38427l93636
11930A7755978j64074l86713J72567o67467j32998l30970l0832l65779k68570
11921A5581142o62068l77789k22278o41079n27607k43147k78725j58130J2187
11912A2482506n27900M76585M18531L192504N307811M965395K654863J792833
11904C0763128J292339j26767m29010r94970j292051l168440n500651n534115
11896A5009463k525333j092990l86368n38810L30295K08974l71813J15959M59277
11887A1208654N91404K04930J573991J515351J734769J76247R96023N40373O78251
11878A9219993L78554M04739q55152o52166j173392q41626r45842j155410o52528
$$ plain form
11869 13727170 12937812 11834125 11713831 10617240 9727952 9679387 9406417 9204533 9257380
11860 9257380 8891558 9275260 9562727 8772808 8987517 9053310 8988649 9616754 9134271 9567317
11850 9567317 9230751 9579832 10188479 10565508 11451122 11170274 11989304 12592424 13502475
11841 13502475 13869114 14674545 15315850 14684966 14829977 14956136 14237426 13955924 13534134
11832 13534134 12962497 12050404 12462415 12397206 12581761 12266769 12469067 12174298 11564395
11823 11564395 10550968 10551303 10072391 8593842 8894734 8390152 7964259 7712022 7406422
11814 7406422 7669921 7175921 7463742 7885183 7321620 7427061 6411392 6759414 6424225
11805 6424225 6524930 6148672 6651939 5998754 6378915 5915376 6117749 6043416 6484736 6274660
$$ packed form
11869A3727170p89358j103687j20294j096591q89288m8565k72970k01884N2847
11860I257380l65822L83702K87467p89919K14709O5793o4661O28105m82483M33046
11850I567317l36566L49081O08647L77029Q85614k80848Q19030O03120R10051
11841A3502475L66639Q05431O41305o30884J45011J26159p18710k81502m21790
11832A3534134n71637r12093M12011o5209J84555l14992K02298k94769o09903
11823A1564395j013427L35m78912j478549L00892n04582m25893k52237l05600
11814G406422K63499m94000K87821M21441n63563J05441j015669L48022l35189
11805F424225J00705l76258N03267o53185L80161m63539K02373p4333M41320k10076
$$ plain form
11795 6274660 5998101 6324324 6074470 6972971 6633455 7174171 8074267 8521187 9801312
11786 9801312 9831918 9907347 10434377 10290461 10044765 9970464 9511711 8326155 8120867 7368026
11776 7368026 7173963 6199656 5880374 5737286 5847439 5804989 5502723 5645881 5474595 5723935
11766 5723935 5251364 5441773 5406406 5185506 5279686 5565272 5421190 5067148 5158116 5296567
11756 5296567 5211449 5235272 5431939 5157907 4912529 5510384 5126607 5215185 5057877 5414061
11746 5414061 4879354 5148634 4757319 5322372 4900703 5043453 5457480 5329729 4920218
11737 4920218 4831861 5148961 4948360 5445146 4782091 4933236 4506243 5182467 4543757 4763060
11727 4763060 4983041 4763853 4685117 5032769 4941518 4240099 5075230 4609504 4893818 4775501
$$ packed form
11795F274660k76559L26223k49854Q98501l39516N40716R00096M46920J280125
11786I801312L0606P5429N27030j43916k45696p4301m58753j185556k05288p52841
11776G368026j94063r74307l19282j43088J10153m2450l02266J43158j71286K49340
11766E723935m72571J90409l5367k20900R4180K85586j44082l54042R0968J38451
11756E296567q5118K3823J96667k74032k45378N97855l83777Q8578j57308L56184
11746E414061n34707K69280l91315N65053m21669J42750M14027j27751m09511
11737D920218q8357L17100k00601M96786o63055J51145m26993O76224o38710K19303
11727D763060K19981k19188p8736L47652r1251p01419Q35131m65726K84314j18317
$$ plain form
11717 4775501 4787984 4844471 5211872 4566669 5056225 4920354 4964734 4664908 4849231 4972646
11707 4972646 5239356 5207227 5067148 5088573 5053543 5019992 4673577 5223870 5745177 5101204
11697 5101204 4911755 4785678 5019152 5118244 4982941 4935391 5200325 5102472 4969677 4927100
11687 4927100 4950356 5617863 5228708 4532249 5477494 5261889 4893507 5061028 4587768 4768827
11677 4768827 5531915 5145104 5288501 5268464 5609430 5530370 5891476 5183980 5841058 5730327
11667 5730327 5616583 5444458 5241680 5349071 5648250 5484464 5276638 5074557 5782949
11658 5782949 5628794 5528044 5726254 5651535 5621226 5190479 5615149 5469237 5264842 5532885
11648 5532885 5549668 5927594 5754771 5458829 5520634 5315450 5517115 5204519 5180140 5548911
$$ packed form
11717D775501J2483N6487L67401o45203M89556j35871M4380k99826J84323J23415
11707D972646K66710l2129j40079K1425l5030l3551l46415N50293N21307o43973
11697E101204j89449j26077K33474R9092j35303m7550K64934r7853j32795m2577
11687D927100K3256O67507l89155o96459R45245k15605l68382J67521m73260J81059
11677D768827P63088l86811J43397k0037L40966p9060L61106p07496O57078j10731
11667E730327j13744j72125k02778J07391K99179j63786k07826k02081P08392
11658E782949j54155j00750J98210p4719l0309m30747M24670j45912k04395K68043
11648E532885J6783L77926j72823k95942O1805k05184K01665l12596k4379L68771
$$ plain form
11638 5548911 5406233 5581833 5546639 5453809 5476141 5630601 5688880 6080333 5942576 5427643
11628 5427643 5535243 5594460 5425937 5630201 5751911 6081215 5665419 5686728 5401610 5749016
11618 5749016 5489803 5826506 5627340 5920323 5785960 5518891 5200098 5925901 5446269
11609 5446269 5543106 5849328 5804459 5889952 6046784 5789188 5523654 5913158 5972916 6235987
11599 6235987 6160607 6644247 6538523 6751150 6142266 7004513 6418438 6171356 6204696 6547794
11589 6547794 6214862 6309242 6100768 6317880 6009552 6254010 6364760 6205594 5733998 5991165
11579 5991165 5991333 6367595 6192968 6328388 6200841 6148990 6781014 6569763 6306051 6714780
11569 6714780 6266503 6517214 6113075 6713083 6286253 6908385 6380232 6717570 6514135
$$ packed form
11638E548911j42678J75600l5194r2830K2332J54460N8279L91453j37757n14933
11628E427643J07600N9217j68523K04264J21710L29304m15796K1309k85118L47406
11618E749016k59213L36703j99166K92983j34363k67069l18793P25803m79632
11609E446269R6837L06222m4869Q5493J56832k57596k65534L89504N9758K63071
11599F235987p5380M83640j05724K12627o08884Q62247n86075k47082L3340L43098
11589F547794l32932R4380k08474K17112l08328K44458J10750j59166m71596K57167
11579E991165J68L76262j74627J35420j27547n1851O32024k11251k63712M08729
11569F714780m48277K50711m04139O00008m26830O22132n28153L37338k03435
$$ plain form
11560 6514135 5898497 6363302 6332364 6128238 6511708 6328368 6065254 6286358 6590803 6513458
11550 6513458 6629429 6379346 6075439 6420362 5848487 6106296 6503586 6246687 6260461 6256859
11540 6256859 5983145 6154073 6262288 5336089 6186070 6095598 5748377 6132212 5937086 5972903
11530 5972903 5648584 5831451 5845916 5733960 5569330 5888705 5891305 5966251 5896129 6109934
11520 6109934 5964944 6062828 6058434 5925924 6085010 6178245 6149510 6065160 6016112 5980885 6137486
11509 6137486 6012991 6253441 6027159 6046325 5899072 6023851 6238550 6334964 5819071 5980808
11499 5980808 5605404 6121249 6188001 6112227 6354822 6079998 6399511 6443941 6421353 6241425
11489 6241425 6709580 6394836 6051293 6282193 6129072 6812138 6068603 6867269 6734406
$$ packed form
11560F514135o15638M64805l0938k04126L83470j83340k63114K21104L04445p7345
11550F513458J15971k50083l03907L44923n71875K57809L97290k56899J3774l602
11540F256859k73714J70928J08215r26199Q49981r0472l47221L83835j95126L5817
11530E972903l24319J82867J4465j11956j64630L19375K600P4946p0122K13805
11520F109934j44990R7884m394j32510J59086R3235k8735q4350m9048l5227J56601
11509F137486j24495K40450k26282J9166j47253J24779K14699R6414n15893J61737
11499E980808l75404N15845O6752p5774K42595k74824L19513M4430k2588j79928
11489F241425M68155l14744l43543K30900j53121O83066p43535P98666j32863
$$ plain form
11480 6734406 6404071 6939139 6624339 6466617 6480006 6760600 6158867 6919818 6701071 6398934
11470 6398934 6871410 6489866 6615511 6417312 6203884 6244312 6583396 6025021 6398899 6154143
11460 6154143 6084310 6274669 6363745 6538073 6496756 6280539 5954139 6372120 6087253 6221403
11450 6221403 6104473 6464297 6491372 6298255 6651329 6267823 6293913 6298402 6080477 6613635
11440 6613635 6645370 7080880 6213674 6300524 6515832 7059613 7318500 7470897 6883186 6763401
11430 6763401 6963997 7738542 7127944 7737011 7120657 8325553 7624358 7707625 8625414
11421 8625414 8116271 8409003 8337929 8640370 8952390 8739007 9068803 9190929 9478459 9407008
11411 9407008 9633390 9871189 9951011 10244272 10338357 10682713 10998313 11088899 11091090 11268758
$$ packed form
11480F734406l30335N35068l14800j57722J3389K80594o01733P60951k18747l02137
11470F398934M72476l81544J25645j98199k13428M0428L39084n58375L73878k44756
11460F154143o9833J90359Q9076J74328m1317k16217l26400M17981k84867J34150
11450F221403j16930L59824K7075j93117L53074l83506K6090M489k17925N33158
11440F613635L1735M35510q67206Q6850K15308N43781K58887J52397n87711j19785
11430F763401K00596P74545o10598O09067o16354J204896p01195Q3267R17789
11421H625414n09143K92732p1074L02441L12020k13383L29796J22126K87530p1451
11411I407008K26382K37799P9822K93261R4085L44356L15600R0586K191J77668
$$ plain form
11401 11268758 11257079 11640317 11885383 12287595 12447406 12934300 12738431 13206635 13723555
11392 13723555 13463408 13830660 14220139 14527090 14618119 13913121 14591591 14982333 15000845 15166101
11382 15166101 15618865 15684063 16153309 15839776 16172942 16663399 16400001 16816881 16876332 17503043
11372 17503043 17197159 17229375 17270979 17351764 18454380 18142103 17801143 18389130 18388191 18218494
11362 18218494 18259723 18797352 18462353 18719175 18245931 18333362 18536735 18631034 18624278 18393770
11352 18393770 18360869 18104834 17946829 18447992 18061009 17462598 17939139 17883782 17817488 17202288
11342 17202288 17082514 17379490 16918562 17032890 16599112 16438014 16820145 16399080 16068285
11333 16068285 16002726 15313231 15621815 15857908 15225615 15085328 14496772 14543574 14500738 14320188
$$ packed form
11401A1268758j1679L83238K45066M02212J59811M86894j95869M68204N16920
11392A3723555k60147L67252L89479L06951R1029p04998O78470L90742J8512J65256
11382A5166101M52764O5198M69246l13533L33166M90457k63398M16880N9451O26711
11372A7503043l05884L2216M1604Q0785J102616l12277l40960N87987r39j69697
11362A8218494M1229N37629l34999K56822m73244Q7431K03373R4299o756k30508
11352A8393770l2901k56035j58005N01163l86983n98411M76541n5357o6294o15200
11342A7202288j19774K96976m60928J14328m33778j61098L82131m21065l30795
11333A6068285o5559o89495L08584K36093o32293j40287n88556M6802m2836j80550
$$ plain form
11323 14320188 13855699 13824990 13644299 13164256 12972671 12968047 12270261 12876158 11928402 11712208
11313 11712208 11911022 11274681 10805285 11275529 10521940 10962306 10434216 10509560 10124426
11304 10124426 9998384 10028868 9554526 9235439 9433814 9009236 8711472 8590285 8627098 8280849
11294 8280849 8324645 8663527 8116468 7791959 7925382 7959925 7256947 7378810 7461530 7215488
11284 7215488 7300429 6817880 7198712 7087858 6910524 7170189 6623374 6293772 6325149 6431968
11274 6431968 6329311 6571327 6187143 6364400 6364578 6075749 6178664 6086190 6370715 5889183
11264 5889183 6065070 6234941 5862399 5950657 6088752 5463913 6129148 6259175 5772389 5687816
11254 5687816 6233834 5648962 6040514 6058860 5640447 5507248 5694613 5504789 6167785 5769633
$$ packed form
11323A4320188m64489l0709j80691m80043j91585m624o97786O05897r47756k16194
11313A1712208J98814o36341m69396M70244p53589M40366n28090P5344l85134
11304A0124426j26042L0484m74342l19087J98375m24578k97764j21187L6813l46249
11294H280849M3796L38882n47059l24509J33423L4543p02978J21863Q2720k46042
11284G215488Q4941m82549L80832j10854j77334K59665n46815l29602L1377J06819
11274F431968j02657K42016l84184J77257J78k88829J02915r2474K84525m81532
11264E889183J75887J69871l72542Q8258J38095o24839O65235J30027m86786q4573
11254E687816N46018n84872L91552J8346m18413j33199J87365j89824O62996l98152
$$ plain form
11244 5769633 5683339 5672920 6097495 6054256 5465801 6079865 5853613 5919672 5681164 5846943
11234 5846943 6041216 5541502 5763123 5972412 6246606 5817869 6063684 6498937 6787786
11225 6787786 7541929 8699364 9837493 12261995 13088394 14740473 14944150 15329978 15056990
11216 15056990 14388417 14381291 12921557 11007545 9087357 8075473 7234366 6962789 6694116
11207 6694116 6272887 5960209 5958034 6222365 6253426 5744103 6517030 6488466 6272492 6695787
11197 6695787 7225346 7407303 8702422 10158029 12662280 13943114 14698627 15125365 15440475
11188 15440475 14830661 14973067 14135491 12787984 11542426 8932770 7324738 6905186 6717562
11179 6717562 6845650 6478493 6353894 6471802 6106915 6643427 6503067 5914284 6460689
$$ packed form
11244E769633q6294j0419M24575m3239n88455O14064k26252O6059k38508J65779
11234E846943J94273m99714K21621K09289K74194m28737K45815M35253K88849
11225F787786P54143J157435J138129K424502Q26399J652079K03677L85828k72988
11216A5056990o68573p126j459734j914012j920188j011884q41107k71577k68673
11207F694116m21229l12678k175K64331L1061n09323P72927k8564k15974M23295
11197F695787N29559J81957J295119J455607K504251J280834P55513M26738L15110
11188A5440475o09814J42406q37576j347507j245558k609656j608032m19552j87624
11179F717562J28088l67157j24599J17908l64887N36512j40360n88783N46405
$$ plain form
11170 6460689 6394091 6168580 5616624 6132995 6339231 5867027 6032303 6343328 6198880 6528112
11160 6528112 6451333 6658960 6535722 6653402 6327532 6566420 7047023 6223379 6252767 6245502
11150 6245502 6834425 6402798 6525204 6534870 6777596 6647764 6952307 7025857 6410984 7227570
11140 7227570 6227473 6511696 7219640 6500480 6631098 7210527 6979673 7507479 7031867
11131 7031867 7159018 7312702 6195215 6727005 6864623 7264008 7645492 7145589 6971230
11122 6971230 7770269 7800195 7228087 7194292 7817878 7405076 7806656 7303455 7201879 7362546
11112 7362546 7412576 7422604 8034445 7749372 7840810 8004802 7538069 7443421 7687646 7770384
11102 7770384 7878462 7675296 7443150 7499318 7845027 8214784 7614437 8149440 7876266 7613028
$$ packed form
11170F460689o6598k25511n51956N16371K06236m72204J65276L11025j44448L29232
11160F528112p6779K07627j23238J17680l25870K38888M80603q23644K9388p265
11150F245502N88923m31627J22406R666K42726j29832L04543P3550o14873Q16586
11140G227570j000097K84223P07944p19160J30618N79429k30854N27806m75612
11131G031867J27151J53684j117487N31790J37618L99385L81484m99903j74359
11122F971230P99039K9926n72108l3795O23586m12802M01580n03201j01576J60667
11112G362546N0030J0028O11841k85073R1438J63992m66733r4648K44225Q2738
11102G770384J08078k03166k32146N6168L45709L69757o00347N35003k73174k63238
$$ plain form
11092 7613028 7355748 7566266 7769287 7604836 7719771 7734381 8151899 7948618 7440244 7576121
11082 7576121 7794566 7975759 7507340 8030068 7902710 7636881 7718395 7449872 7981736 8140060
11072 8140060 7642060 8050641 7942236 8452147 8317172 8982132 8570141 8528088 8999664 8864826
11062 8864826 9234340 9515700 9170067 9337986 9239479 9982685 10222603 10395549 10217185 10304273
11052 10304273 10246552 10361449 10473974 10564653 10996423 11028022 10740993 10861728 11480232 11899431
11042 11899431 12054297 12152710 12041616 13089487 13086687 13124401 13745751 13721172 14240933 14596973
11032 14596973 14661444 15000342 15449137 15515524 15805258 16440924 16465661 16452524 16470129 16995469
11022 16995469 16816935 17572142 17164394 17086952 17546902 17788886 18513238 18200306 18838775
$$ packed form
11092G613028k57280K10518K03021j64451J14935J4610M17518k03281n08374J35877
11082G576121K18445J81193m68419N22728j27358k65829Q1514k68523N31864J58324
11072H140060m98000M08581j08405N09911j34975O64960m11991m2053M71576j34838
11062H864826L69514K81360l45633J67919r8507P43206K39918J72946j78364Q7088
11052A0304273n7721J14897J12525R0679M31770L1599k87029J20735O18504M19199
11042A1899431J54866R8413j11094J047871k800L7714O21350k4579N19761L56040
11032A4596973O4471L38898M48795O6387K89734O35666K4737j3137J7605N25340
11022A6995469j78534P55207m07748p7442M59950K41984P24352l12932O38469
$$ plain form
11013 18838775 19840209 19350009 19972179 20484659 21118405 21713971 22133768 22480648 23103082
11004 23103082 23703909 24084540 24174527 24636504 24803482 25254237 24932935 25548345 25465155 25772711
10994 25772711 25810770 26190875 26312539 26337528 26924897 27280965 27383747 27920096 28375701 28903226
10984 28903226 29920644 30750944 32159146 33084573 34499323 35897883 37150079 37593041
10976 37593041 38294452 38520209 38985765 39552337 39645628 38377337 38444612 38771801 38977971
10967 38977971 40115499 40121515 41333462 42783385 43551538 44668828 45662413 47114721 48236646
10958 48236646 49626060 50993775 52350651 54377579 56398035 57956024 59619446 61062867
10950 61062867 62037163 63440171 64433558 64654194 65274702 65889732 66174258 66486164 67637848
$$ packed form
11013A8838775J001434m90200O22170N12480O33746N95566M19797L46880O22434
11004B3103082O00827L80631Q9987M61977J66978M50755l21302O15410q3190L07556
10994B5772711L8059L80105J21664K4989N87369L56068J02782N36349M55605N27525
10984B8903226J017418Q30300J408202R25427J414750J398560J252196M42962
10976C7593041P01411K25757M65556N66572R3291j268291O7275L27189K06170
10967C8977971J137528O016J211947J449923P68153J117290R93585J452308J121925
10958D8236646J389414J367715J356876K026928K020456J557989J663422J443421
10950F1062867R74296J403008R93387K20636O20508O15030K84526L11906J151684
$$ plain form
10941 67637848 68188133 69651994 71145966 72673637 74230226 75943152 77961032 79070115
10933 79070115 80935085 82574409 83595404 85090917 85827583 86940804 87528076 88588894
10925 88588894 88929049 88915744 89400250 89677147 89703817 89468416 88791566 88598890 88732915 88581055
10915 88581055 87693345 87593087 87386016 87203721 87128068 86804736 86976457 87201602 87723434
10906 87723434 88330895 88680987 89369099 89528115 91117825 91920963 92897253 94586109 96730285
10897 96730285 97829229 100069296 102125202 104959547 108471915 111695627 115950324 120470336
10889 120470336 126017653 132027416 139313870 147445924 155712353 165466709 174666132 184813443
10881 184813443 194488652 202493851 210895672 216538887 220041017 222182370 221804625 219045981
$$ packed form
10941F7637848N50285J463861J493972J527671J556589J712926K017880J109083
10933G9070115J864970J639324J020995J495513P36666J113221N87272J060818
10925H8588894L40155j3305M84506K76897K6670k35401o76850j92676J34025j51860
10915H8581055q87710j00258k07071j82295p5653l23332J71721K25145N21832
10906H7723434O07461L50092O88112J59016J589710Q03138R76290J688856K144176
10897I6730285J098944K240067K055906K834345L512368L223712M254697M520012
10889A20470336N547317O009763P286454Q132054Q266429R754356R199423J0147311
10881A84813443R675209Q005199Q401821N643215L502130K141353l77745k758644
$$ plain form
10873 219045981 214140483 208243633 200278334 191808884 183079147 172890868 163949628 154603815
10865 154603815 146109818 137727657 129450501 121712565 114287237 107066742 100869438 94495926
10857 94495926 88754346 83166869 78425891 73485683 69196382 64781517 61238973 57875241
10849 57875241 54523524 52036101 48726944 46637618 44045918 41752099 39329651 37754259
10841 37754259 36463518 34518855 33062163 31276849 29917510 28652212 27717817 26277390
10833 26277390 25621267 24791832 23454560 22722047 21966656 21505937 20774077 19720139 19474788
10824 19474788 19063926 18362466 17584715 17055090 16987562 16594231 16198692 15628100 15456904
10815 15456904 15275680 14739531 14333118 14350179 13545990 13464253 13527714 13360938 12977940 12272609
$$ packed form
10873B19045981m905498n896850p965299q469450q729737j0188279q941240r345813
10865A54603815q493997q382161q277156p737936p425328p220495o197304o373512
10857I4495926n741580n587477m740978m940208m289301m414865l542544l363732
10849E7875241l351717k487423l309157k089326k591700k293819k422448j575392
10841C7754259j290741j944663j456692j785314j359339j265298r34395j440427
10833B6277390o56123q29435j337272p32513p55391m60719p31860j053938k45351
10824A9474788m10862p01460p77751n29625o7528l93331l95539n70592j71196
10815A5456904j81224n36149m06413J7061q04189q1737O3461j66776l82998p05331
$$ plain form
10805 12272609 12494566 12129506 11604355 11445279 11539569 11265384 10797530 10923214 10432960
10796 10432960 10393937 10115678 10076400 9774366 10013252 9421174 9210096 9756052 9732022 8938989
10786 8938989 8540452 9025460 8727570 8556326 8669775 8815995 8661540 8506927 8038423
10777 8038423 7791934 7774861 7765563 8136936 8065130 7381009 6881672 7155564 6966932 7173908
10767 7173908 7222483 7180952 6827713 6819347 6515287 6733944 5828240 6517586 6385133 6055695
10757 6055695 6843524 6230593 6590311 6309562 5944290 6508029 6474568 6825683 6714359 6591391
10747 6591391 6596436 6287483 6467522 6017386 5856948 5930772 5756773 5599851 5403803 5691154
10737 5691154 5554812 5680832 4751177 5253881 5191021 5538439 5612503 5590229 5510192 5956856
$$ packed form
10805A2272609K21957l65060n25151j59076R4290k74185m67854J25684m90254
10796A0432960l9023k78259l9278l02034K38886n92078k11078N45956k4030p93033
10786H938989l98537M85008k97890j71244J13449J46220j54455j54613m68504
10777H038423k46489j7073r298L71373p1806o84121m99337K73892j88632K06976
10767G173908M8575m1531l53239q366l04060K18657r05704O89346j32453l29438
10757F055695P87829o12931L59718k80749l65272N63739l3461L51115j11324j22968
10747F591391N045l08953J80039m50136j60438P3824j73999j56922j96048K87351
10737E691154j36342J26020r29655N02704o2860L47418P4064k2274q0037M46664
$$ plain form
10727 5956856 5935537 6170223 6420043 5760835 5944539 5675866 5872070 5543812 5993132 5550970
10717 5550970 5592734 5538838 5279670 5019773 4751710 4837046 4928593 5415321 4545504 4817567
10707 4817567 5017913 4667186 4805876 5277229 5293650 5123289 4839757 5553405 5050800 5377400
10697 5377400 5045357 4756210 5183562 5112265 4578993 4901527 5057687 5186409 4653916 5008847
10687 5008847 5291894 4633726 4729459 5241914 4736431 4993195 5086575 4717172 4977580 5181328
10677 5181328 5746573 5701141 5732113 6203275 6213455 6297422 6703601 6664468 6358163 6084569
10667 6084569 6383207 5627230 5392703 5489524 5340411 5016417 4838165 4911299 4479431 4720416
10657 4720416 4497428 4457846 4735675 4945873 5227221 5529750 5911721 5583778 6073867 5880462
$$ packed form
10727E956856k1319K34686K49820o59208J83704k68673J96204l28258M49320m42162
10717E550970M1764n3896k59168k59897k68063Q5336R1547M86728q69817K72063
10707D817567K00346l50727J38690M71353J6421j70361k83532P13648n02605L26600
10697E377400l32043k89147M27352p1297n33272L22534J56160J28722n32493L54931
10687E008847K83047o58168R5733N12455n05483K56764R3380l69403K60408K03748
10677E181328N65245m5432L0972M71162J0180Q3967M06179l9133l06305k73594
10667F084569K98638p55977k34527R6821j49113l23994j78252P3134m31868K40985
10657D720416k22988l9582K77829K10198K81348L02529L81971l27943M90089j93405
$$ plain form
10647 5880462 6446288 5933513 6026499 6154785 4859003 4907489 4523910 4520262 4240163 3484225
10637 3484225 4082643 4240696 3432699 3739841 4035708 3838382 3505854 3961335 3435004
10628 3435004 3760314 3679863 3678131 4186095 3267069 3467703 3301556 3574624 3379199 3183776
10618 3183776 4312629 3788538 4068272 3637226 3731980 3757405 3764168 3293078 3529336 3870336
10608 3870336 3600717 3536571 3709203 3797939 3521203 3741466 3405532 3665413 3953595 3930108
10598 3930108 3767429 3384650 4213751 3867275 3893457 3621970 3328371 3749955 3611947 3691996
10588 3691996 3605389 3475716 3481438 3205072 3709939 3542434 3398461 3073044 3359659 3418861
10578 3418861 3331666 3212510 3369188 3572212 3877866 3602868 3639335 3909020 3359541 3848611
$$ packed form
10647E880462N65826n12775R2986J28286j295782M8486l83579l648k80099p55938
10637C484225N98418J58053q07997L07142K95867j97326l32528M55481n26331
10628C435004L25310q0451j732N07964r19026K00634j66147K73068j95425j95423
10618C183776J128853n24091K79734m31046R4754K5425O763m71090K36258L41000
10608C870336k69619o4146J72632Q8736k76736K20263l35934K59881K88182k3487
10598C930108j62679l82779Q29101l46476K6182k71487k93599M21584j38008Q0049
10588C691996q6607j29673N722k76366N04867j67505j43973l25417K86615N9202
10578C418861q7195j19156J56678K03024L05654k74998L6467K69685n49479M89070
$$ plain form
10568 3848611 3919491 3284556 3772721 3578586 3457514 3894445 2877585 3178969 3440301
10559 3440301 3191709 2699647 3108173 3417374 2791412 2944978 2712967 3395967 2827597
$$ packed form
10568C848611P0880o34935M88165j94135j21072M36931j016860L01384K61332
10559C440301k48592m92062M08526L09201o25962J53566k32011O83000n68370
$$ [...]
##END NTUPLES=NMR SPECTRUM
##END=
