##TITLE=Coffee green (M5-ROVE10 + 1.5mL buffer 50/50,  450uL extracto + 50uL (D2O+TMS))
without heating, vortex and centrifuged, temperature 0oC.
##JCAMPDX= 6.0         $$ Bruker NMR JCAMP-DX V2.0
##DATA TYPE= NMR SPECTRUM
##DATA CLASS= NTUPLES
##ORIGIN= Bruker BioSpin GmbH
##OWNER= Administrator
$$ 1.72 TOPSPIN		Version 2.1
$$ 2012-05-22 16:11:33.106 -0700  Administrator@X
$$ Compression mode = diff/dup
##.OBSERVE FREQUENCY= 400.13188198
##.OBSERVE NUCLEUS= ^1H
##.ACQUISITION MODE= SIMULTANEOUS (DQD)
##.ACQUISITION SCHEME= undefined
##.AVERAGES= 64
##.DIGITISER RES= 22
##SPECTROMETER/DATA SYSTEM= spect
##.PULSE SEQUENCE= noesygppr1d
##.SOLVENT NAME= H2O+D2O
##.SHIFT REFERENCE= INTERNAL, H2O+D2O, 1, 14.97969
##AUDIT TRAIL= $$ (NUMBER, WHEN, WHO, WHERE, PROCESS, VERSION, WHAT)
$$ ##TITLE= Audit trail, TOPSPIN		Version 2.1
$$ ##JCAMPDX= 5.01
$$ ##ORIGIN= Bruker BioSpin GmbH
$$ ##OWNER= Administrator
$$ $$ c:\Bruker\TOPSPIN/data/jwist/nmr/11-coffee-green-quantification-2/61/pdata/1/auditp.txt
$$ ##AUDIT TRAIL=  $$ (NUMBER, WHEN, WHO, WHERE, PROCESS, VERSION, WHAT)
(   1,<2011-11-17 14:43:41.482 -0500>,<Administrator>,<TOPSPIN>,<go>,<TOPSPIN 2.1>,
      <created by zg
	started at 2011-11-17 14:34:46.904 -0500,
	POWCHK enabled, PULCHK disabled,
       configuration hash MD5:
       DA 63 81 1B EF 4C B5 72 B4 DF EA D9 B4 DB 4C 08
       data hash MD5: 64K
       69 E9 11 37 CF A7 A3 A0 35 6E C8 9D EC 7F EB 6D>)
(   2,<2011-11-17 18:15:22.419 -0500>,<Administrator>,<TOPSPIN>,<proc1d>,<TOPSPIN 2.1>,
      <Start of raw data processing
       efp LB = 0 FT_mod = 6 PKNL = 1 PHC0 = 0 PHC1 = 0 SI = 32K 
       data hash MD5: 32K
       80 FA C8 DB 83 26 76 E6 BB 5B 0E 79 F3 69 46 32>)
(   3,<2011-11-17 18:15:22.779 -0500>,<Administrator>,<TOPSPIN>,<proc1d>,<TOPSPIN 2.1>,
      <pk PHC0 = 21.74744 PHC1 = 0 
       data hash MD5: 32K
       C2 D6 51 86 DC D2 AD 15 E9 DD C9 A4 C6 D6 3D 37>)
$$ ##END=
$$ 
$$ $$ hash MD5
$$ $$ FD 26 32 78 9E 2A 38 DD 22 C4 D7 EC 78 43 20 AF
##$RELAX= 
##$RELAX= 
##$RELAX= 
##$RELAX= 
##$RELAX= 
##$RELAX= 
##$RELAX= 
$$ Bruker specific parameters
$$ --------------------------
##$DU= <Z:>
##$EXPNO= 61
##$NAME= <11-coffee-green-quantification-2>
##$PROCNO= 1
##$TYPE= <nmr>
##$USER= <jwist>
##$ACQT0= -8.17507012126584
##$AMP= (0..31)
100 100 100 100 100 100 100 100 100 100 100 100 100 100 100 100 100 100
100 100 100 100 100 100 100 100 100 100 100 100 100 100
##$ANAVPT= -1
##$AQSEQ= 0
##$AQ_mod= 3
##$AUNM= <au_prof>
##$AUTOPOS= <>
##$BF1= 400.13
##$BF2= 400.13
##$BF3= 400.13
##$BF4= 400.13
##$BF5= 400.13
##$BF6= 400.13
##$BF7= 400.13
##$BF8= 400.13
##$BYTORDA= 0
##$CFDGTYP= 0
##$CFRGTYP= 9
##$CHEMSTR= <none>
##$CNST= (0..63)
1 1 145 1 1 1 1 1 1 1 1 1 1 1 1 1 1 1 1 1 1 1 1 1 1 1 1 1 1 1 1 1 1 1 1
1 1 1 1 1 1 1 1 1 1 1 1 1 1 1 1 1 1 1 1 1 1 1 1 1 1 1 1 1
##$CPDPRG= <>
##$CPDPRG1= <>
##$CPDPRG2= <>
##$CPDPRG3= <>
##$CPDPRG4= <mlev>
##$CPDPRG5= <mlev>
##$CPDPRG6= <mlev>
##$CPDPRG7= <mlev>
##$CPDPRG8= <mlev>
##$CPDPRGB= <>
##$CPDPRGT= <>
$$ [...]
150 150 150 150 150 150 150 150
##$TP07= 0
##$TPNAME0= <>
##$TPNAME1= <>
##$TPNAME2= <>
##$TPNAME3= <>
##$TPNAME4= <>
##$TPNAME5= <>
##$TPNAME6= <>
##$TPNAME7= <>
##$TPOAL= (0..7)
0.5 0.5 0.5 0.5 0.5 0.5 0.5 0.5
##$TPOFFS= (0..7)
0 0 0 0 0 0 0 0
##$TUNHIN= 0
##$TUNHOUT= 0
##$TUNXOUT= 0
##$USERA1= <user>
##$USERA2= <user>
##$USERA3= <user>
##$USERA4= <user>
##$USERA5= <user>
##$V9= 5
##$VALIST= <valist>
##$VCLIST= <CCCCCCCCCCCCCCC>
##$VD= 0
##$VDLIST= <DDDDDDDDDDDDDDD>
##$VPLIST= <PPPPPPPPPPPPPPP>
##$VTLIST= <TTTTTTTTTTTTTTT>
##$WBST= 2048
##$WBSW= 25
##$XGAIN= (0..3)
0 0 0 0
##$XL= 0
##$YL= 0
##$YMAX_a= 5257114
##$YMIN_a= -2177216
##$ZGOPTNS= <>
##$ZL1= 120
##$ZL2= 120
##$ZL3= 120
##$ZL4= 120
##$ABSF1= 0
##$ABSF2= 0
##$ABSG= 0
##$ABSL= 0
##$ALPHA= 0
##$AQORDER= 0
##$ASSFAC= 0
##$ASSFACI= 0
##$ASSFACX= 0
##$ASSWID= 0
##$AUNMP= <proc_prof1d>
##$AXLEFT= 0
##$AXNAME= <>
##$AXNUC= <1H>
##$AXRIGHT= 0
##$AXTYPE= 0
##$AXUNIT= <>
##$AZFE= 0.1
##$AZFW= 0.1
##$BCFW= 0
##$BC_mod= 0
##$BYTORDP= 0
##$COROFFS= 0
##$CY= 15
##$DATMOD= 1
##$DC= 0
##$DFILT= <>
##$DTYPP= 0
##$F1P= 14.9796895980835
##$F2P= -5.57284135567231
##$FCOR= 0.5
##$FTSIZE= 32768
##$FT_mod= 6
##$GAMMA= 0
##$GB= 0
##$INTBC= 1
##$INTSCL= 1
##$ISEN= 128
##$LB= 0
##$LEV0= 0
##$LPBIN= 0
##$MAXI= 10000
##$MC2= 0
##$MEAN= 0
##$ME_mod= 0
##$MI= 0
##$NCOEF= 0
##$NC_proc= -6
##$NLEV= 6
##$NOISF1= 0
##$NOISF2= 0
##$NSP= 0
##$NTH_PI= 0
##$NZP= 0
##$OFFSET= 14.97969
##$PC= 1
##$PHC0= 21.74744
##$PHC1= 0
##$PH_mod= 1
##$PKNL= yes
##$PPARMOD= 0
##$PPDIAG= 0
##$PPIPTYP= 0
##$PPMPNUM= 2147483647
##$PPRESOL= 1
##$PSCAL= 4
##$PSIGN= 0
##$PYNMP= <proc.py>
##$REVERSE= no
##$SF= 400.13
##$SI= 32768
##$SIGF1= 0
##$SIGF2= 0
##$SINO= 400
##$SIOLD= 32768
##$SPECTYP= <>
##$SREGLST= <1H.H2O+D2O>
##$SSB= 0
##$STSI= 32768
##$STSR= 0
##$SW_p= 8223.68421052631
##$SYMM= 0
##$S_DEV= 0
##$TDeff= 65536
##$TDoff= 0
##$TI= <>
##$TILT= no
##$TM1= 0
##$TM2= 0
##$TOPLEV= 0
##$USERP1= <user>
##$USERP2= <user>
##$USERP3= <user>
##$USERP4= <user>
##$USERP5= <user>
##$WDW= 1
##$XDIM= 32768
##$YMAX_p= 418242484
##$YMIN_p= -475460
##$CURPLOT= <Network HP LaserJet P1505>
##$CURPRIN= <$Network HP LaserJet P1505>
##$DFORMAT= <normdp>
##$LAYOUT= <+/1D_H.xwp>
##$LFORMAT= <normlp>
##$PFORMAT= <normpl>
##$SURQMSG= 1
$$ End of Bruker specific parameters
$$ ---------------------------------
##NTUPLES= NMR SPECTRUM
##VAR_NAME=  FREQUENCY,     SPECTRUM/REAL,   SPECTRUM/IMAG
##SYMBOL=    X,             R,               I
##VAR_TYPE=  INDEPENDENT,   DEPENDENT,       DEPENDENT
##VAR_FORM=  AFFN,          ASDF,            ASDF
##VAR_DIM=   32768,         32768,           32768
##UNITS=     HZ,            ARBITRARY UNITS, ARBITRARY UNITS
##FACTOR=    0.250966925370066, 1,           1
##FIRST=     8223.43324360094, 99019,        -196811
##LAST=      0,             113505,          -207910
##MIN=       0,             -475460,         0
##MAX=       8223.43324360094, 418242484,    0
$$ Real data points
##PAGE= N=1
##DATA TABLE= (X++(R..R)), XYDATA
$$ [...]
$$ plain form
19694 2042818 1825687 1836811 2076738 1843653 1875237 1751918 1987067 1868035 1986179 1734085
19684 1734085 1699703 1643748 1778728 1848579 1830680 1603443 1854110 1656454 1712049 1791422
19674 1791422 1864156 1768123 1594065 1915138 1865600 1965728 1954207 1756369 1664375 1829012
19664 1829012 1770407 1483626 1665139 1844177 1806240 1867779 1865454 1816670 1724112 1506619 1809232
19653 1809232 1875334 1840604 1526110 1695592 1819908 1595991 1631585 1732892 1731930 1814150 1561158
19642 1561158 1795069 1708838 1653188 1780221 1722135 1751011 2009178 1769712 1849357 1744176
19632 1744176 1842784 1892935 1703346 1677277 1881817 1729675 1727446 1661767 1674783 1695706 1580685
19621 1580685 1582296 1555091 1480447 1573831 1516133 1578029 1557143 1605079 1692625 1524740 1443861
$$ packed form
19694B042818k17131J1124K39927k33085L1584j23319K35149j19032J18144k52094
19684A734085l4382n5955J34980O9851j7899k27237K50667j97656N5595P9373
19674A791422P2734r6033j74058L21073m9538J00128j1521j97838r1994J64637
19664A829012n8605k86781J81513J79038l7937O1539k325m8784r2558k17493L02613
19653A809232O6102l4730l14494J69482J24316k23917L5594J01307r62Q2220k52992
19642A561158K33911q6231n5650J27033n8086K8876K58167k39466P9645j05181
19632A744176R8608N0151j89589k6069K04540j52142k229o5679J3016K0923j15021
19621A580685J611k7205p4644R3384n7698O1896k0886M7936Q7546j67885q0879
$$ plain form
19610 1443861 1759488 1470066 1588602 1359630 1321672 1575552 1257375 1475117 1327448 1511114
19600 1511114 1384743 1407429 1556641 1442205 1450257 1322193 1370007 1371529 1414997 1182204 1357374
19589 1357374 1375038 1134322 1477203 1371067 1488502 1420608 1376318 1480922 1364512 1265419
19579 1265419 1471412 1366651 1206033 1340765 1137858 1432598 1347403 1251679 1352102 1185760
19569 1185760 1321744 1388591 1330416 1089128 1356152 1219738 1250067 1247012 1214758 1428434
19559 1428434 1292472 1180273 985300 975047 1196459 1265815 1208440 1071086 1407673 1245220
19549 1245220 1188670 1250726 1225791 1064406 1242097 1148937 1105020 1298495 1278818 1046365
19539 1046365 1419162 1363200 1176903 1287980 1147181 1423693 1169003 1222663 1135657 1365414
$$ packed form
19610A443861L15627k89422J18536k28972l7958K53880l18177K17742j47669J83666
19600A511114j26371K2686J49212j14436Q052j28064M7814J522M3468k32793J75170
19589A357374J7664k40716L42881j06136J17435o7894m4290J04604j16410r9093
19579A265419K05993j04761j60618J34732k02907K94740q5195r5724J00423j66342
19569A185760J35984O6847n8175k41288K67024j36414L0329l055l2254K13676
19559A428434j35962j12199j94973j0253K21412O9356n7375j37354L36587j62453
19549A245220n6550O2056k4935j61385J77691r3160m3917J93475j9677k32453
19539A046365L72797n5962j86297J11077j40799K76512k54690N3660q7006K29757
$$ plain form
19529 1365414 1511299 896074 1084650 1308123 1325095 1239562 1160590 1142252 1409139 1287015
19519 1287015 1286737 1432944 1279625 1313777 1290145 1165999 1352624 1138877 1084727 1287137
19509 1287137 1188159 1160431 1206528 1158647 1154872 1097033 1071621 1324612 1070478 1085346 1230123
19498 1230123 1152783 1189196 978307 1095219 1176814 1390362 1191843 1067921 855620 1244550
19488 1244550 1313746 1153863 1262326 1015247 1167457 1016745 920023 1204394 1095337 1170520
19478 1170520 1251138 1009891 1115274 1074636 1084076 968080 1154543 884168 1176541 941096
19468 941096 950783 851543 986227 863904 955432 1011817 1076534 924935 826206 809520 547519
19457 547519 694728 797773 827172 926950 932844 1015703 910362 1012467 971264 929155 727834
$$ packed form
19529A365414J45885o15225J88576K23473J6972q5533p8972j8338K66887j22124
19519A287015k78J46207j53319L4152k3632j24146J86625k13747n4150K02410
19509A287137r8978k7728M6097m7881l775n7839k5412K52991k54134J4868J44777
19498A230123p7340L6413k10889J16912Q1595K13548j98519j23922k12301L88930
19488A244550O9196j59883J08463k47079J52210j50712r6722K84371j09057P5183
19478A170520Q0618k41247J05383m0638R440j15996J86463k70375K92373k35445
19468I41096R687r9240J34684j22323R1528N6385O4717j51599r8729j6686k62001
19457E47519J47209J03045K9399R9778N894Q2859j05341J02105m1203m2109k01321
$$ plain form
19446 727834 664199 887665 863138 942694 883467 626723 897025 927080 941119 814359 652363
19435 652363 1039584 626187 1000379 772256 904866 677105 842482 718365 809096 724587
19425 724587 896345 650824 846027 853380 857718 681730 745442 731493 837935 711767 588360
19414 588360 384204 704814 644686 730472 959560 839474 756089 680637 796231 767717
19404 767717 665298 939714 820080 759955 818631 686412 920774 865239 749931 711961
19394 711961 767863 572439 597754 838361 660281 900773 771974 675964 834911 867213
19384 867213 695266 947558 777811 874109 714626 687363 955443 905553 749981 794849
19374 794849 920519 848811 821584 721932 912484 810647 585282 775429 660831 658211
$$ packed form
19446G27834o3635K23466k4527P9556n9227k56744K70302L0055J4039j26760j61996
19435F52363L87221m13397L74192k28123J32610k27761J65377j24117R0731q4509
19425G24587J71758k45521J95203P353M338j75988O3712j3949J06442j26168j23407
19414E88360k04156L20610o0128Q5786K29088j20086q3385p5452J15594k8514
19404G67717j02419K74416j19634o0125N8676j32219K34362n5535j15308l7970
19394G11961N5902j95424K5315K40607j78080K40492j28799r6010J58947L2302
19384H67213j71947K52292j69747R6298j59483k7263K68080m9890j55572M4868
19374G94849J25670p1708k7227r9652J90552j01837k25365J90147j14598k620
$$ plain form
19364 658211 672382 857135 641923 870374 835161 676657 678057 787803 860197 854820 668064
19353 668064 859301 873693 745915 780699 766428 866753 778715 695955 855753 830536 644273
19342 644273 751551 895755 943958 995580 668270 1066412 826785 821193 809841 1047422
19332 1047422 1015892 886843 874381 1106112 890591 1021023 799976 1124275 991554 970661
19322 970661 807932 716854 949772 906019 468694 969141 759616 1009758 743469 888415
19312 888415 751832 837798 565878 841871 667934 810631 931357 738205 720916 787088
19302 787088 750257 639032 607551 690607 817596 628060 550860 936229 779311 667423
19292 667423 738949 706531 654388 699475 577660 542599 597113 644172 662821 508785 766577
$$ packed form
19364F58211J4171J84753k15212K28451l5213j58504J400J09746P2394n377j86756
19353F68064J91237J4392j27778L4784j4271J00325q8038q2760J59798k5217j86263
19342F44273J07278J44204M8203N1622l27310L98142k39627n592j1352K37581
19332A047422l1530j29049j2462K31731k15521J30432k21047L24299j32721k0893
19322I70661j62729r1078K32918m3753m37325N00447k09525K50142k66289J44946
19312H88415j36583Q5966k71920K75993j73937J42697J20726j93152j7289O6172
19302G87088l6831j11225l1481Q3056J26989j89536p7200L85369j56918j11888
19292F67423P1526l2418n2143M5087j21815l5061N4514M7059J8649j54036K57792
$$ plain form
19281 766577 782413 585809 521214 696624 704859 535122 727909 863256 753010 720014
19271 720014 530650 925933 831004 771315 902696 757439 432709 630366 652472 753374
19261 753374 1052590 669404 723588 571810 551925 642901 482838 877759 758268 931165
19251 931165 613725 827803 547783 731206 975783 612778 569126 922031 969935 1114060
19241 1114060 1470317 1246935 1316495 1699871 1567237 1705946 1423103 1465895 969146 1082620
19231 1082620 662600 689707 716643 839773 718970 558861 958234 726161 791021 453141
19221 453141 683849 594935 712680 609337 734263 729788 674331 459639 716528 420326
19211 420326 693164 716334 300708 763875 658091 812305 770955 758566 570985 672090
$$ packed form
19281G66577J5836j96604o4595J75410Q235j69737J92787J35347j10246l2996
19271G20014j89364L95283r4929n9689J31381j45257l24730J97657K2106J00902
19261G53374K99216l83186N4184j51778j9885R0976j60063L94921j19491J72897
19251I31165l17440K14078k80020J83423K44577l63005m3652L52905M7904J44125
19241A114060L56257k23382O9560L83376j32634J38709k82843M2792m96749J13474
19231A082620m20020K7107K6936J23130j20803j60109L99373k32073O4860l37880
19221D53141K30708q8914J17745j03343J24926m475n5457k14692K56889k96202
19211D20326K72838K3170C00708M63167j05784J54214m1350j2389j87581J01105
$$ plain form
19201 672090 724946 521090 581438 658911 468984 804034 661476 691382 486904 506983
19191 506983 988630 726959 554172 442291 793734 759317 721173 722110 528229 739636
19181 739636 838728 798194 958801 678206 629435 704438 968017 948812 1010146 1106573 1115466
19170 1115466 858330 1205910 1052510 934178 932449 1012940 938614 799845 1045179 1086997
19160 1086997 949448 794288 847529 808027 1368047 953751 1121120 1190918 1048256 1003714
19150 1003714 1029250 936357 905538 846671 936325 865633 932359 924003 865124 807952 950589
19139 950589 765034 844002 897300 919294 1079143 989824 846819 800395 979579 1066482 908299
19128 908299 1060628 960287 979568 960663 1181461 1138375 1033136 997034 1162359 1033501
$$ packed form
19201F72090N2856k03856O0348P7473j89927L35050j42558K9906k04478K0079
19191E06983M81647k61671j72787j11881L51443l4417l8144R37j93881K11407
19181G39636R9092m0534J60607k80595m8771P5003K63579j9205O1334R6427Q893
19170A115466k57136L47580j53400j18332j729Q0491p4326j38769K45334M1818
19160A086997j37549j55160N3241l9502N60020m14296J67369O9798j42662m4542
19150A003714K5536r2893l0819n8867Q9654p0692O6726q356n8879n7172J42637
19139I50589j85555P8968N3298K1994J59849q9319j43005m6424J79184Q6903j58183
19128I08299J52329j00341J9281j8905K20798m3086j05239l6102J65325j28858
$$ plain form
19118 1033501 967690 1136892 1103574 1142907 1197182 1071497 1311944 1359161 1282240 1365063 1629151
19107 1629151 1626209 1822721 2040705 2039690 2226774 2760646 3156765 3502790 3816808 3941607
19097 3941607 4368794 4420036 4178712 4090805 3612631 2804607 2429238 2337861 1891582 1859553
19087 1859553 1882925 1680211 1560087 1521052 1430670 1392184 1349812 1182375 1347231 1661508
19077 1661508 1752757 2166289 2348808 3067748 3050934 3177687 3695128 3966346 4022202 3877077
19067 3877077 4016802 3755361 3744027 3573452 3528706 4103447 4094982 4164826 4388429 4044994
19057 4044994 3754002 3318417 3045196 2552004 2278567 2130776 2073524 2003072 1849144 1778033
19047 1778033 1800395 1705597 1590222 1523615 1443888 2089650 2102364 2081822 2715744 3052614
$$ packed form
19118A033501o5811J69202l3318L9333N4275j25685K40447M7217p6921Q2823K64088
19107A629151k942J96512K17984j015J87084N33872L96119L46025L14018J24799
19097C941607M27187N1242k41324q7907m78174q08024l75369r1377m46279l2029
19087A859553K3372k02714j20124l9035r0382l8486m2372j67437J64856L14277
19077A661508R1249M13532J82519P18940j6814J26753N17441K71218N5856j45125
19067C877077J39725k61441j1334j70575m4746N74741q465O9844K23603l43435
19057D044994k90992m35585k73221m93192k73437j47791n7252p0452j53928p1111
19047A778033K2362r4798j15375o6607p9727O45762J2714k0542O33922L36870
$$ plain form
19037 3052614 3443467 3921171 4221856 4202087 4274830 4574631 4105649 3491159 3253271 2770757
19027 2770757 2591237 1994762 1928647 1742751 1687493 1374460 1560201 1877685 1893109 2126390
19017 2126390 1897751 1859001 2253892 2392525 2384673 2750801 3268002 3785901 3996309 4198943
19007 4198943 4645761 4865932 4859295 4840555 4904977 4789533 4928405 5552571 5738527 6239669
18997 6239669 6767679 7489490 7737015 8574589 9586615 10477393 11706609 13629756 14923578
18988 14923578 16787540 17969630 19252353 19496445 19485181 18614080 17326608 15502786 13441748
18979 13441748 11446264 9620544 7987775 6711830 5832953 4943560 4399865 3874774 3436000
18970 3436000 3146911 2896968 2676797 2411157 2210775 2214298 1940670 1928735 1860193 1792819
$$ packed form
19037C052614L90853M77704L00685j9769P2743K99801m68982o14490k37888m82514
19027B770757j79520n96475o6115j85896n5258l13033J85741L17484J5424K33281
19017B126390k28639l8750L94891J38633p852L66128N17201N17899K10408K02634
19007D198943M46818K20171o637j8740O4422j15444J38872O24166J85956N01142
18997F239669N28010P21811K47525Q37574J012026Q90778J229216J923147J293822
18988A4923578J863962J182090J282723K44092j1264q71101j287472j823822k061038
18979A3441748j995484j825720j632769j275945q78877q89393n43695n25091m38774
18970C436000k89089k49943k20171k65640k00382L523k73628j1935o8542o7374
$$ plain form
18960 1792819 1787525 1665886 1996060 1733582 1684985 1623861 1720631 1662183 1645882 1837510 1655223
18949 1655223 1942938 1948417 1754307 1849839 2013860 1978068 1851659 2073190 2372808 2313756
18939 2313756 2230333 2303776 2882272 2984381 3401728 3379855 4050770 4468148 5239994 6072110
18929 6072110 7480582 8815935 10211735 12215663 13706640 15618139 16913498 17555045
18921 17555045 17877116 17633700 16737194 15258776 13437341 11131893 9339214 7741174
18913 7741174 6282244 5372711 4671033 3875941 3782660 3021816 2963144 2399398 2233757 2076771
18903 2076771 2033599 1534716 1617227 1474554 1451866 1210723 1177606 975008 868362 1060607
18893 1060607 929625 925331 959936 891470 815799 904563 966503 843435 869517 685757 706791
$$ packed form
18960A792819n294j21639L30174k62478m8597o1124R6770n8448j6301J91628j82287
18949A655223K87715N479j94110R5532J64021l5792j26409K21531K99618n9052
18939B313756q3423P3443N78496J02109M17347k1873O70915M17378P71846Q32116
18929F072110J408472J335353J395800K003928J490977J911499J295359O41547
18921A7555045L22071k43416q96506j478418j821435k305448j792679j598040
18913G741174j458930r09533p01678p95092r3281p60844n8672n63746j65641j56986
18903B076771m3172m98883Q2511j42673k2688k41143l3117k02598j06646J92245
18893A060607j30982m294L4605o8466p5671Q8764O1940j23068K6082j83760K1034
$$ plain form
18882 706791 764647 633523 729368 571653 738570 807375 781573 680512 922575 765044
18872 765044 693358 621933 634055 734974 565631 710477 548899 756882 672835 1020562
18862 1020562 559816 826748 813874 578833 781485 834897 533541 535823 630335 863501
18852 863501 608249 682097 621472 609687 565342 603707 551478 560094 945905 688927 333462
18840 699302 566174 486928 495818 439727 555992 626316 555891 350117 611992 602530 710978
18829 710978 709275 668014 591224 610568 606834 482835 699322 522323 523297 237449 599062
18818 599062 463685 471324 491042 552321 678095 605229 703126 597189 890993 578409 658818
18807 658818 707992 674204 609818 704188 759728 894071 421201 683331 695606 624275 921744
$$ packed form
18882G06791N7856j31124R5845j57715J66917O8805k5802j01061K42063j57531
18872G65044p1686p1425J2122J00919j69343J44846j61578K07983q4047L47727
18862A020562m60746K66932j2874k35041K02652N3412l01356K282R4512K33166
18852H63501k55252P3848o0625j1785m4345L8365n2229Q616L85811k56978C33462
18840F99302j33128p9246Q890n6091J16265P0324p0425k05774K61875r462J08448
18829G10978j703m1261p6790J9344l734j23999K16487j76999R74B37449L61613
18818E99062j35377P639J9718O1279J25774p2866R7897j05937K93804l12584Q0409
18807F58818M9174l3788o4386R4370N5540J34343D21201K62130J2275p1331K97469
$$ plain form
18796 921744 675013 777021 654848 807490 586655 583343 511408 881235 747677 1018541
18786 1018541 775571 704573 647881 571551 649320 841533 567242 774765 850977 711842
18776 711842 656283 713002 683963 450795 808101 668403 625202 675807 654954 645164 453370
18765 453370 669012 556861 650949 608334 790956 524298 609759 583264 561396 565541 693354
18754 693354 547211 474882 503223 652388 540969 486006 495315 619461 720064 440075
18744 440075 675845 598895 386036 805637 304938 377576 664127 590377 675919 574239
18734 574239 444213 574083 302228 664683 912194 478585 509781 431863 531918 687760
18724 687760 546600 396679 747808 591185 594099 583163 761329 654007 584982 626223
$$ packed form
18796I21744k46731J02008j22173J52642k20835l312p1935L69827j33558K70864
18786A018541k42970p0998n6692p6330P7769J92213k74291K07523P6212j39135
18776G11842n5559N6719k9039k33168L57306j39698m3201N0605k0853r790j91794
18765D53370K15642j12151R4088m2615J82622k66658Q5461k6495k1868M145J27813
18754F93354j46143p2329K8341J49165j11419n4963R309J24146J00603k79989
18744D40075K35770p6950k12859M19601C04938P2638K86551p3750Q5542j01680
18734E74239j30026J29870k71855L62455K47511m33609L1196p7918J00055J55842
18724F87760j41160j49921L51129j56623K914j0936J78166j07322o9025M1241
$$ plain form
18714 626223 239323 506378 683984 692946 594234 734287 500861 648435 421289 620490
18704 620490 315661 776072 697025 645858 276193 471606 678282 448227 642453 376558
18694 376558 530054 764256 524448 455339 834440 537572 627325 418364 705357 624777
18684 624777 640716 462747 634537 633213 479614 707485 704200 707164 525935 619021 602026
18673 602026 663777 768666 637547 709625 464334 587470 605212 491063 473039 632277
18663 632277 586917 760284 556083 526412 522053 369969 511296 560534 667686 552817
18653 552817 730131 568771 852513 513843 281754 244206 515562 564737 443777 585824
18643 585824 634561 546029 576275 543140 552100 408971 607441 456422 479695 647726 583902
$$ packed form
18714F26223B39323K67055J77606Q962r8712J40053k33426J47574k27146J99201
18704F20490l04829M60411p9047n1167B76193J95413K06676k30055J94226k65895
18694C76558J53496K34202k39808o9109L79101k96868Q9753k08961K86993q0580
18684F24777J5939j77969J71790j324j53599K27871l285K964j81229R3086j6995
18673F02026O1751J04889j31119P2078k45291J23136J7742j14149j8024J59238
18663F32277m5360J73367k04201k9671m359j52084J41327M9238J07152j14869
18653E52817J77314j61360K83742l38670k32089l7548K71356M9175j20960J42047
18643E85824M8737q8532L0246l3135Q960j43129J98470j51019K3273J68031o3824
$$ plain form
18632 583902 605736 557277 307824 616864 610875 489762 432356 436901 460246 543434 567072
18621 567072 417067 370308 264891 605314 564983 544996 409912 638819 616167 495558
18611 495558 475322 650224 634127 720047 795874 658803 562373 619429 889228 538915 572654
18600 572654 649442 627586 736510 594445 685594 674683 883842 868958 616878 848978
18590 848978 744143 825181 688351 751997 746673 656574 738092 743937 733916 894929 808742
18579 808742 635082 809354 612110 566661 452313 521774 548958 774521 678185 564249
18569 564249 530221 673575 664603 663030 542959 541296 585632 517219 592138 653644 566470 641076
18557 641076 623189 458987 480424 564244 414164 486952 613688 671582 444854 547986
$$ packed form
18632E83902K1834m8459k49453L09040n989j21113n7406M545K3345Q3188K3638
18621E67072j50005m6759j05417L40423m0331j9987j35084K28907k2652j20609
18611D95558k0236J74902j6097Q5920P5827j37071r6430N7056K69799l50313L3739
18600E72654P6788k1856J08924j42065R1149j0911K09159j4884k52080K32100
18590H48978j04835Q1038j36830O3646n324r0099Q1518N845j0021J61013q6187
18579H08742j73660J74272j97244m5449j14348O9461K7184K25563r6336j13936
18569E64249l4028J43354q972j573j20071j663M4336o8413P4919O1506q7174P4606
18557F41076j7887j64202K1437Q3820j50080P2788J26736N7894k26728J03132
$$ plain form
18547 547986 273321 533733 565996 595285 606973 373653 383885 705410 424259 611855
18537 611855 366053 688176 303528 544189 312094 423090 462671 610634 640072 433211
18527 433211 441357 420721 469571 364395 518603 364296 501252 139019 367773 489777
18517 489777 646607 386730 472065 520458 233983 594484 573650 428500 397228 638625
18507 638625 624218 284799 311670 564832 557263 440394 607168 531203 544936 777268 567554
18496 567554 667684 402456 412988 413675 656009 491638 575768 527041 800279 634073 570115
18485 570115 537194 607723 458641 490879 634338 785585 699069 401365 453530 498650 698509
18474 698509 699463 433323 497771 566272 673169 555945 561617 468112 495948 668724 727712
$$ packed form
18547E47986B73321K60412L2263K9289J1688k33320J0232L21525k81151J87596
18537F11855k45802L22123C03528K40661k32095J10996L9581J47963K9438k06861
18527D33211Q146k0636M8850j05176J54208j54307J36956A39019K28754J22004
18517D89777J56830k59877Q5335M8393B33983L60501k0834j45150l1272K41397
18507F38625j4407B84799K6871K53162p569j16869J66774p5965J3733K32332k09714
18496E67554J00130k65228J0532O87K42334j64371Q4130m8727K73238j66206o3958
18485E70115l2921P0529j49082L2238J43459J51247q6516k97704N2165M5120J99859
18474F98509R54k66140O4448O8501J06897j17224N672r3505K7836J72776N8988
$$ plain form
18463 727712 672741 610339 702988 713022 683457 552992 797921 884374 576601 621375 691172
18452 691172 832248 428996 898182 777292 895859 623266 434769 571488 442851 592339
18442 592339 642402 625239 441712 408152 455935 591104 633635 547692 499175 569302 936014
18431 936014 601404 605868 552390 862463 535771 830524 547653 761039 901511 734669
18421 734669 685461 921994 786220 595432 622258 619308 591535 648446 478690 564307 511306
18410 511306 421678 534315 528481 358265 534908 473550 529316 285100 526676 253645
18399 643194 447527 614711 377587 263766 549457 644723 602583 508765 360631 478935
18389 478935 603624 210648 402785 304855 262600 471979 411216 485820 516078 462954 278740
$$ packed form
18463G27712n4971o2402R2649J0034k9565j30465K44929Q6453l07773M4774O9797
18452F91172J41076m03252M69186j20890J18567k72593j88497J36719j28637J49488
18442E92339N0063j7163j83527l3560M7783J35169M2531q5943m8517P0127L66712
18431I36014l34610M464n3478L10073l26692K94753k82871K13386J40472j66842
18421G34669m9208K36533j35774j90788K6826k950k7773N6911j69756Q5617n3001
18410E11306q9628J12637n834j70216J76643o1358N5766k44216K41576B53645
18399F43194j95667J67184k37124j13821K85691R5266m2140r3818j48134J18304
18389D78935J24689B10648J92137r7930m2255K09379o0763P4604L0258n3124j84214
$$ plain form
18378 278740 383489 548713 413727 499023 322542 418009 243571 827193 644559 663283
18368 663283 565854 494555 618778 386470 455389 491193 661193 650692 277902 834401
18358 834401 519972 452256 542979 615745 651278 443863 639929 662966 438259 688240
18348 688240 593908 634630 569690 740670 506147 635418 561412 735251 859736 649063
18338 649063 552510 585734 470109 589823 333862 530774 632408 734173 514267 687868
18328 687868 460025 484429 499935 353388 473463 451813 603095 472125 664468 617408
18318 617408 566737 517949 550891 727007 612053 786793 959930 417368 694995 416572
18308 416572 436529 602945 306853 691872 455695 638466 344133 667702 660075 225081
$$ packed form
18378B78740J04749J65224j34986Q5296j76481R5467j74438N83622j82634J8724
18368F63283r7429p1299J24223k32308O8919L5804J70000j0501B77902N56499
18358H34401l14429o7716R0723P2766L5533k07415J96066K3037k24707K49981
18348F88240r4332M0722o4940J70980k34523J29271p4006J73839J24485k10673
18338F49063r6553L3224j15625J19714k55961J96912J01634J01765k19906J73601
18328F87868k27843K4404J5506j46547J20075k1650J51282j30970J92343m7060
18318F17408n0671m8788L2942J76116j14954J74740J73137D17368K77627k78423
18308D16572J9957J66416k96092L85019k36177J82771k94333L23569p627B25081
$$ plain form
18297 442277 380906 658113 620785 367809 534634 273948 612504 623421 549292 449229
18287 449229 600265 576737 173326 547357 501251 377003 488577 594869 710338 406249
18277 406249 441356 439809 204136 307498 435652 557712 377598 436880 421376 489280 392269
18266 392269 871071 425111 474832 618746 577714 351684 322341 618676 438396 614434
18256 614434 753107 482307 471848 662618 636561 615632 613671 608748 454618 377303 498573
18245 498573 468868 400270 524533 650351 442654 478461 532027 465716 606059 295252
18234 604499 299294 607925 600302 217546 316149 437408 435611 379344 361278 593874 528081
18223 528081 800496 238086 533415 376191 588302 360476 586006 468685 447820 541337
$$ packed form
18297D42277o1371K77207l7328k52976J66825k60686L38556J0917p4129j00063
18287D49229J51036k3528A73326L74031m6106j24248J11574J06292J15469l04089
18277D06249L5107j547B04136J03362J28154J22060j80114N9282j5504O7904r7011
18266C92269M78802D25111M9721J43914m1032k26030k9343K96335j80280J76038
18256F14434J38673k70800j0459J90770k6057k0929j961m923j54130p7315J21270
18245D98573k9705o8598J24263J25818k07697L5807N3566o6311J40343B95252
18234F04499B99294L08631p623B17546R8603J21259j797n6267j8066K32596o5793
18223E28081K72415B38086K95329j57224K12111k27826K25530j17321k0865R3517
$$ plain form
18213 541337 645969 648326 501451 492072 487698 605117 667113 545542 458675 498863 744671
18202 744671 735474 766646 502518 639293 775378 726864 607279 353676 669387 764140
18192 764140 605272 589102 780590 637544 520247 660338 565984 625122 697646 620617
18182 620617 530670 470970 487957 597015 563433 586341 469292 597480 510285 564083 596218
18171 596218 424199 250633 369807 475261 606426 392852 474783 347771 668232 455117
18161 455117 569723 536933 504857 646656 390265 623777 567811 386709 600564 605499
18151 605499 794164 444682 445489 462076 516092 537353 621970 346745 461922 552531 512014
18140 512014 551074 569688 524746 502272 413352 551602 601316 521823 672859 508936 508212
$$ packed form
18213E41337J04632K357j46875r379m374J17419O1996j21571q6867M0188K45808
18202G44671r197L1172k64128J36775J36085m8514j19585k53603L15711R4753
18192G64140j58868j6170J91488j43046j17297J40091r4354N9138P2524p7029
18182F20617q9947n9700J6987J09058l3582K2908j17049J28188q7195N3798L2135
18171E96218j72019j73566J19174J05454J31165k13574Q1931j27012L20461k13115
18161D55117J14606l2790l2076J41799k56391K33512n5966j81102K13855M935
18151F05499J88665l49482Q07J6587N4016K1261Q4617k75225J15177R0609m0517
18140E12014L9060J8614m4942k2474q8920J38250M9714p9493J51036j63923p24
$$ plain form
18129 508212 448067 579903 513864 555941 565759 593277 475075 460417 736874 640458 164474
18117 428365 506478 684565 510589 674332 586209 583571 492989 755054 717929 532900 506318
18106 506318 577366 568154 597641 476377 413944 386114 544176 534586 537409 492365 792011
18095 792011 490087 514481 351788 609629 553129 289739 422840 578905 517551 505699
18085 505699 493067 650458 370365 213808 458802 396347 236048 571619 380594 674295
18075 674295 539535 485480 675311 427564 625986 547356 290966 659401 549442 421429
18065 421429 393079 610206 412431 417227 436397 511353 538834 599653 409529 434133 502039
18054 502039 624510 561402 429932 571859 474822 439402 482744 558168 537298 142847 372440
$$ packed form
18129E08212o0145J31836o6039M2077R818K7518j18202j4658K76457r6416A64474
18117D28365P8113J78087j73976J63743q8123k638r0582K62065l7125j85029k6582
18106E06318P1048r212K9487j21264o2433k7830J58062r590K823m5044K99646
18095G92011l01924K4394j62693K57841n6500k63390J33101J56065o1354j1852
18085E05699j2632J57391k80093j56557K44994o2455j60299L35571j91025K93701
18075F74295j34760n4055J89831k47747J98422p8630k56390L68435j09959j28013
18065D21429k8350K17127j97775M796J9170P4956K7481O0819j90124K4604O7906
18054E02039J22471o3108j31470J41927r7037l5420M3342P5424k0870A42847K29593
$$ plain form
18043 372440 643454 575851 467182 358282 482369 513902 414752 359597 578220 472854
18033 472854 704791 617557 363008 643956 444490 262557 369992 522127 482393 241818
18023 241818 396865 209605 499110 465365 562817 367756 401115 502230 358377 457537
18013 457537 499874 248127 551493 381208 511393 384894 490385 384319 427608 396724
18003 396724 573088 634053 388105 529699 510943 411684 263445 552838 439723 397733
17993 397733 678266 479667 593562 428552 708152 605238 663598 377260 539350 360759
17983 360759 421433 471328 219481 325266 467643 564833 367177 302290 364804 514777
17973 514777 282390 288599 545564 537691 417587 526277 307996 540066 431598 449320
$$ packed form
18043C72440K71014o7603j08669j08900J24087L1533r9150n5155K18623j05366
18033D72854K31937q7234k54549K80948j99466j81933J07435J52135l9734k40575
18023B41818J55047j87260K89505l3745R7452j95061L3359J01115j43853R9160
18013D57537M2337B48127L03366j70285J30185j26499J05491j06066M3289l0884
18003C96724J76364O0965k45948J41594j8756r9259j48239K89393j13115m1990
17993C97733K80533j98599J13895j65010K79600j02914N8360k86338J62090j78591
17983C60759O0674M9895B19481J05785J42377R7190j97656o4887O2514J49973
17973E14777k32387O209K56965p873j20104J08690k18281K32070j08468J7722
$$ plain form
17963 449320 597768 478527 583367 284714 397409 479965 655118 439550 591603 430021
17953 430021 478828 475571 416393 836124 379004 363370 587145 324205 500270 663106
17943 663106 443901 480460 763932 469700 611761 467811 529345 378248 503217 395246
17933 395246 584979 501850 557338 701151 442747 676092 572040 483124 495900 721009
17923 721009 214277 514259 584714 595952 519823 409817 354137 699050 449648 455735 596141
17912 596141 472181 580359 693814 329761 585703 585608 604740 402881 396852 587538 601986
17901 601986 629187 600850 640631 607672 535466 597231 387467 734965 377613 676850 479165
17890 479165 529086 404183 624211 460452 534420 540111 506325 528099 731435 573121 684288
$$ packed form
17963D49320J48448j19241J04840B84714J12695Q2556J75153k15568J52053j61582
17953D30021M8807l257n9178M19731C79004j5634K23775k62940J76065J62836
17943F63106k19205L6559K83472k94232J42061j43950O1534j51097J24969j07971
17933C95246J89733q3129N5488J43813k58404K33345j04052q8916J2776K25109
17923G21009B14277K99982P0455J1238p6129j10006n5680L44913k49402O087J40406
17912E96141j23960J08178J13455C29761K55942r5J9132k01859o029J90686J4448
17901F01986K7201k8337L9781l2959p2206O1765k09764L47498l57352K99237j97685
17890D79165M9921j24903K20028j63759P3968N691l3786K1774K03336j58314J11167
$$ plain form
17879 684288 637137 709831 464412 540950 468735 675841 565604 509418 367733 733475
17869 733475 461000 440336 490004 655562 549382 641099 521601 580896 946950 809634
17859 809634 760053 644701 526992 643373 514469 689710 729089 532930 615562 505447
17849 505447 533035 612376 607776 564616 403603 568154 494920 653615 186270 699134 768221
17838 768221 643021 647408 643600 734598 660968 658454 753606 674528 581653 772024 630979
17827 630979 768646 517797 437238 445797 638059 651977 628472 641392 735696 888359 881762
17816 881762 952947 1018801 1045452 972396 1074054 971655 1081738 1008177 970549 878157 832349
17805 832349 865809 925607 588238 764500 786152 1086159 857155 1077220 798705 966123
$$ packed form
17879F84288m7151P2694k45419P6538p2215K07106j10237n6186j41685L65742
17869G33475k72475k0664M9668J65558j06180R1717j19498N9295L66054j37316
17859H09634m9581j15352j17709J16381j28904J75241L9379j96159Q2632j10115
17849E05447K7588P9341m600m3160j61013J64551p3234J58695A86270N12864O9087
17838G68221j25200M387l808R0998p3630k514R5152p9078r2875J90371j41045
17827F30979J37667k50849q0559Q559J92262J3918k3505J2920R4304J52663o597
17816H81762P1185O5854K6651p3056J01658j02399J10083p3561l7628r2392m5808
17805H32349L3460N9798l37369J76262K1652L00007k29004K20065k78515J67418
$$ plain form
17795 966123 1060558 1191712 944795 753348 825591 845633 696476 779139 616197 854393
17785 854393 719678 384226 614040 459243 703349 543712 561948 494800 711987 534880
17775 534880 756974 504730 434248 617898 604655 649342 566553 598329 652964 695893 450880
17764 450880 674579 594408 701921 617663 665647 643068 606103 562604 578469 650857 694682
17753 694682 812094 451887 569161 754078 806805 563551 441528 705532 727961 633650
17743 633650 503962 657842 591133 565232 683556 495336 637976 591763 712315 756367
17733 756367 734892 770284 595407 622656 681401 688963 819081 861896 417036 518694 678942
17722 678942 824954 455979 604375 399465 513131 584564 650896 820910 500700 830872
$$ packed form
17795I66123R4435J31154k46917j91447P2243K0042j49157Q2663j62942K38196
17785H54393j34715l35452K29814j54797K44106j59637J8236o7148K17187j77107
17775E34880K22094k52244p0482J83650j3243M4687q2789L1776N4635M2929k45013
17764D50880K23699q0171J07513q4258M7984k2579l6965m3499J5865P2388M3825
17753F94682J17412l60207J17274J84917N2727k43254j22023K64004K2429r4311
17743F33650j29688J53880o6709k5901J18324j88220J42640m6213J20552M4052
17733G56367k1475L5392j74877K7249N8745P562J30118M2815D17036J01658J60248
17722F78942J46012l68975J48396k04910J13666P1433O6332J70014l20210L30172
$$ plain form
17712 830872 630930 736020 498122 405332 696629 486283 457637 573438 537896 461174
17702 461174 949508 710607 667712 468339 723508 433312 712124 796292 675658 524047
17692 524047 723732 758902 716240 324415 732657 589791 733397 514487 584655 940144
17682 940144 666404 539574 516257 554735 382525 693739 706757 490359 777552 423404
17672 423404 671271 737078 586848 760795 610632 608007 637102 733513 886864 887256 850860
17661 850860 689631 432107 631253 746581 708686 481409 800873 829510 1118157 915706
17651 915706 446882 755685 857338 752524 846946 805539 808463 772932 710461 830929 734251
17640 734251 879967 926008 896234 781465 960816 809628 781065 941248 897760 929147
$$ packed form
17712H30872j99942J05090k37898r2790K91297k10346k8646J15801l5542p6722
17702D61174M88334k38901m2895j99373K55169k90196K78812Q4168j20634j51611
17692E24047J99685L5170m2662C24415M08242j42866J43606k18910P0168L55489
17682I40144k73740j26830k3317L8478j72210L11214J3018k16398K87193l54148
17672D23404K47867O5807j50230J73947j50163k625K9095R6411J53351L92l6396
17661H50860j61229k57524J99146J15328l7895k27277L19464K8637K88647k02451
17651I15706D46882L08803J01653j04814R4422m1407K924l5531o2471J20468r6678
17640G34251J45716M6041k9774j14769J79351j51188k8563J60183m3488L1387
$$ plain form
17630 929147 1035038 844491 948067 880054 1106868 1223222 998343 675585 869896 974684
17620 974684 1205385 1053511 822044 1392726 992755 1220718 999415 915468 1122535 970789
17610 970789 1359672 1024868 1224335 1262122 1251813 1428058 1287199 1155894 1322128 1137947
17600 1137947 1145737 1307631 1358276 983685 1234292 1136635 1098623 1390287 1082680 994008
17590 994008 1263456 1225161 1129704 1218540 1245770 967890 1461061 1294404 1100484 1216273
17580 1216273 1266530 1203772 1240584 1190222 901237 1451306 1299609 1148135 1685332 1433672
17570 1433672 1253581 1337515 1213213 1321221 1287308 1259127 1123477 1246846 1129977 1213672
17560 1213672 1313800 1179743 1168969 1124129 1016737 1116798 1165244 1085034 1060799 1101482
$$ packed form
17630I29147J05891j90547J03576o8013K26814J16354k24879l22758J94311J04788
17620I74684K30701j51874k31467N70682l99971K27963k21303q3947K07067j51746
17610I70789L88883l34804J99467L7787j0309J76245j40859j31305J66234j84181
17600A137947P790J61894N0645l74591K50607r7657l8012K91664l07607q8672
17590I94008K69448l8295r5457Q8836K7230k77880M93171j66657j93920J15789
17580A216273N0257o2758L6812n0362k88985N50069j51697j51474N37197k51660
17570A433672j80091Q3934j24302J08008l3913k8181j35650J23369j16869Q3695
17560A213672J00128j34057j0774m4840j07392J00061M8446q0210k4235M0683
$$ plain form
17550 1101482 1163646 1273445 1222936 1087646 1126910 1333955 1096289 1551354 1436505 1479879
17540 1479879 1202391 1411573 1312714 1522227 1549892 1476619 1265183 1517304 1040631 1409173
17530 1409173 1214444 1382427 1400613 1374469 1345006 1132558 1284624 1345353 1502713 1133737
17520 1133737 1509087 1442468 1383704 1573924 1657115 1588262 1713385 1586394 1715931 2070050
17510 2070050 2204639 2167915 2040051 2411528 2232076 2498645 2531690 2287815 2296533 2352486
17500 2352486 2519244 2430339 2672692 2809871 3053989 3534403 3895768 4268943 4442948 5193133
17490 5193133 5390671 6194000 6942762 8634089 11524849 16586545 24904558 37382412
17482 37382412 52322573 67120966 78720858 86791694 91682364 92512447 89048625 80604207
$$ packed form
17550A101482O2164J09799n0509j35290L9264K07045k37666M55065j14849M3374
17540A479879k77488K09182r8859K09513K7665p3273k11436K52121m76673L68542
17530A409173j94729J67983J8186k6144k9463k12448J52066O0729J57360l68976
17520A133737L75350o6619n8764J90220Q3191o8853J25123j26991J29537L54119
17510B070050J34589l6724j27864L71477j79452K66569L3045k43875Q718N5953
17500B352486J66758q8905K42353J37179K44118M80414L61365L73175J74005P50185
17490E193133J97538Q03329P48762J691327K890760N061696Q318013J2477854
17482C7382412J4940161J4798393J1599892Q070836M890670Q30083l463822q444418
$$ plain form
17474 80604207 66859656 51278441 37619958 29885563 27592383 30822486 39839335 52694861
17466 52694861 66659427 78885037 87401391 92193274 93483032 90585866 82971695 69895695
17458 69895695 53262202 36552336 23917677 15798706 11048916 8458494 6532458 5639034
17450 5639034 4669453 4132339 3874312 3504743 3308479 3494069 3160811 3191992 3167246 3214128
17440 3214128 3276783 2857499 2836254 2883279 2646931 2831665 2676842 2641869 2571542 2453926
17430 2453926 2762468 2627154 2795805 2682292 2959120 2865738 2840083 2375772 2522195 2219779
17420 2219779 2153057 1972222 1724303 1868409 2012114 2074179 2121412 1963754 1911806 1777502
17410 1777502 1927001 1897506 1917146 1985031 2253703 2138624 2341123 2359566 2853087 2402984
$$ packed form
17474H0604207j3744551j5581215j3658483p734395k293180L230103R016849J2855526
17466E2694861J3964566J2225610Q516354M791883J289758k897166p614171j3076000
17458F9895695j6633493j6709866j2634659q118971m749790k590422j926036q93424
17450E639034r69581n37114k58027l69569j96264J85590l33258L1181k4746M6882
17440C214128O2655m19284k1245M7025k36348J84734j54823l4973p0327j17616
17430B453926L08542j35314J68651j13513K76828r3382k5655m64311J46423l02416
17420B219779o6722j80835k47919J44106J43705O2065M7233j57658n1948j34304
17410A777502J49499k9495J9640O7885K68672j15079K02499J8443M93521m50103
$$ plain form
17400 2402984 2400904 2418208 3009526 2861209 2945825 3198841 3655655 3868412 4078595 4681880
17390 4681880 5063695 5225422 6047098 6039830 6191568 6410510 6521512 6389099 6429012 6209361
17380 6209361 5932118 5814099 5757411 5580331 5464614 5403239 5469807 5519109 5982060 6411110
17370 6411110 6512802 6610827 7158284 7562224 7574722 7678554 7772042 7857003 7552579 7565651
17360 7565651 7522807 7300227 7262533 7333235 7248890 7502299 7743230 7817460 8409393 8621720
17350 8621720 9336589 9891341 10258940 10778132 11538185 12023146 12594449 12633453 12613464 12819927
17340 12819927 12790614 12669519 12270415 11962996 11627118 11338063 11042083 10735459 10926667
17331 10926667 10980259 11252872 11548544 11992001 12174156 12360940 12890868 13310428 13497865
$$ packed form
17400B402984k080J7304N91318j48317Q4616K53016M56814K12757K10183O03285
17390D681880L81815J61727Q21676p268J51738K18942J11002j32413L9913k19651
17380F209361k77243j18019n6688j77080j15717o1375O6568M9302M62951M29050
17370F411110J01692R8025N47457M03940J2498J03832R3488Q4961l04424J3072
17360G565651m2844k22580l7694P0702q4345K53409K40931P4230N91933K12327
17350H621720P14869N54752L67599N19192P60053M84961N71303L9004j9989K06463
17340A2819927k9313j21095l99104l07419l35878k89055k95980l06624J91208
17331A0926667N3592K72613K95672M43457J82155J86784N29928M19560J87437
$$ plain form
17322 13497865 13435866 13683268 13626963 13605343 13417683 13347647 13038328 12879981 12910720 12600891
17312 12600891 12444216 12327768 12270971 12105573 12291300 12511512 12704676 13006836 13178944
17303 13178944 13529151 13588725 13559001 13714899 13405070 13288961 13287858 12745992 12690591 12606429
17293 12606429 12498230 12278155 12206311 12271429 12383903 12545046 12602291 12780162 12765041 12424519
17283 12424519 12268880 11883057 11545694 10959011 10143758 9663715 8922662 8298280 7494199
17274 7494199 7058480 6594116 6082020 5782329 5505503 5535063 5296670 5184146 5034772 4815375
17264 4815375 4831264 5021301 4605780 4603916 4546381 4381195 4509239 4275675 4189285 3877052
17254 3877052 4191668 3783054 3933906 3712036 3688414 3636033 3583860 3628559 3459571 3292537
$$ packed form
17322A3497865o1999K47402n6305k1620j87660p0036l09319j58347L0739l09829
17312A2600891j56675j16448n6797j65398J85727K20212J93164L02160J72108
17303A3178944L50207N9574k9724J55898l09829j16109j103n41866n5401q4162
17293A2606429j08199k20075p1844O5118J12474J61143N7245J77871j5121l40522
17283A2424519j55639l85823l37363n86683q15253m80043p41053o24382q04081
17274G494199m35719m64364n12096k99691k76826K9560k38393j12524j49374k19397
17264D815375J5889J90037m15521j864n7535j65186J28044k33564q6390l12233
17254C877052L14616m08614J50852k21870k3622n2381n2173M4699j68988j67034
$$ plain form
17244 3292537 3507390 3689081 3538497 3511477 3175849 3335941 3152266 3155109 2980650 3068955
17234 3068955 2888988 2942758 2842288 2803356 2710639 2583834 2624995 2594480 2661544 2573189 2673999
17223 2673999 2696577 2803098 2811992 2776225 2712555 2724061 3045382 2975291 2873468 2953378 2896219
17212 2896219 2694202 2932509 2503905 2633641 2558855 2507904 2628408 2418273 2660450 2495273
17202 2495273 2452180 2613835 2467916 2323289 2394120 2510377 2191086 2135530 2308232 1874947
17192 1874947 1824013 1924879 1985570 1617908 1941992 1794374 1930083 1773842 1824958 1763518
17182 1763518 1812757 1821542 1712403 1777694 1607706 1671457 1686906 1688915 1756328 1872425 1931847
17171 1931847 2023153 1903175 2059693 2114190 2085249 2062779 1903306 1905448 1978322 1989888 1924030
$$ packed form
17244C292537K14853J81691j50584k7020l35628J60092j83675K843j74459Q8305
17234C068955j79967N3770j00470l8932r2717j26805M1161l0515O7064q8355J00810
17223B673999K2578J06521Q894l5767o3670J1506L21321p0091j01823P9910n7159
17212B896219k02017K38307m28604J29736p4786n0951J20504k10135K42177j65177
17202B495273m3093J61655j45919j44627P0831J16257l19291n5556J72702m33285
17192A874947n0934J00866O0691l67662L24084j47618J35709j56241N1116o1440
17182A763518M9239Q785j09139O5291j69988O3751J5449K009O7413J16097N9422
17171A931847R1306j19978J56518N4497k8941k2470j59473K142P2874J1566o5858
$$ plain form
17160 1924030 2068200 2139504 1992963 2136242 2100558 2169339 2340345 2263600 2399848 2434478
17150 2434478 2428526 2569708 2192873 2513057 2316042 2331757 2439997 2373537 2337595 2247308
17140 2247308 2501809 2634442 2487316 2666712 2510119 2540380 2423518 2530607 2440225 2308992
17130 2308992 2349504 2073648 2109673 2012434 2351253 2417086 2148432 2407601 2319258 2458119
17120 2458119 2540845 2490021 2245311 2552515 2244338 2167961 2214469 2210776 2176325 1939939 2277261
17109 2277261 2184607 2557125 2478111 2471488 2669808 2615587 2692937 2360953 2620076 2521601 2328409
17098 2328409 2172656 1753506 1944271 1574376 1732583 1668362 1719528 1537805 1451932 1472782
17088 1472782 1319916 1235380 1112870 1242320 1183811 1024974 961082 1013596 1173756 1125237
$$ packed form
17160A924030J44170P1304j46541J43279l5684O8781J71006p6745J36248L4630
17150B434478n952J41182l76835L20184j97015J5715J08240o6460l5942r0287
17140B247308K54501J32633j47126J79396j56593L0261j16862J07089r0382j31233
17130B308992M0512k75856L6025r7239L38819O5833k68654K59169q8343J38861
17120B458119Q2726n0824k44710L07204l08177p6377M6508l693l4451k36386L37322
17109B277261r2654L72518p9014o623J98320n4221P7350l31984K59123r8475j93192
17098B328409j55753m19150J90765l69895J58207o4221N1166j81723q5873K0850
17088A472782j52866q4536j22510J29450n8509j58837o3892N2514J60160m8519
$$ plain form
17078 1125237 1354549 1185107 1036054 1267211 988068 1081336 1163371 1255744 1250762 1405743
17068 1405743 1281535 1124463 1104611 1429951 898409 1282792 1050214 1053452 1104448 1293652
17058 1293652 1396104 1485721 1516985 1812490 2000507 1927708 2267737 2427729 2563197 2565988
17048 2565988 2628327 2388445 2564869 2494121 2588961 2698021 2654007 2733082 2919882 2903671
17038 2903671 2986108 3093026 2949479 2965007 3078617 2780295 2628322 2403408 2151624 1920396
17028 1920396 1654374 1905991 1741739 1777403 1553619 1432155 1384207 1367319 1243352 1292054
17018 1292054 1228848 1088113 1204616 1088875 1202580 1167858 1033566 1070879 990241 1006174
17008 1006174 1388689 1090974 1023958 1059204 1177266 1084840 1239651 934909 1159451 1177599
$$ packed form
17078A125237K29312j69442j49053K31157k79143R3268Q2035R2373m982J54981
17068A405743j24208j57072j9852L25340n31542L84383k32578L238N0996J89204
17058A293652J02452Q9617L1264K95505J88017p2799L40029J59992J35468K791
17048B565988O2339k39882J76424p0748R4840J09060m4014P9075J86800j6211
17038B903671Q2437J06918j43547J5528J13610k98322j51973k24914k51784k31228
17028A920396k66022K51617j64252L5664k23784j21464m7948j6888j23967M8702
17018A292054o3206j40735J16503j15741J13705l4722j34292L7313q0638J5933
17008A006174L82515k97715o7016L5246J18062r2426J54811l04742K24542J8148
$$ plain form
16998 1177599 1091422 1107441 1193901 1158704 1094432 1131636 1223594 1119588 1058262 1174096 1370198
16987 1370198 997296 1386863 1085739 1228641 1192225 1189146 1057650 1357275 1422852 1524373
16977 1524373 1180534 1305307 1217808 1315836 1133923 1421246 1437512 1544287 1477795 1515670
16967 1515670 1653190 1661934 1765753 1592819 1883246 2080490 2198351 2418875 2264802 2417755
16957 2417755 2545687 2357794 2514147 2377954 2623774 2262335 2491519 2400821 2085324 2028924
16947 2028924 2034748 2076177 1710914 1704894 1768105 1663779 1465949 1514771 1617259 1334337 1270255
16936 1270255 1292669 1367197 1066996 1241995 1270398 1144393 1233306 1146264 1159659 1086014 1077044
16925 1077044 898660 1133712 1031039 923588 986530 858813 699976 866974 1045489 835872
$$ packed form
16998A177599q6177J6019Q6460l5197o4272L7204R1958j04006o1326J15834J96102
16987A370198l72902L89567l01124J42902l6416l079j31496K99625O5577J01521
16977A524373l43839J24773q7499R8028j81913K87323J6266J06775o6492L7875
16967A515670J37520Q744J03819j72934K90427J97244J17861K20524j54073J52953
16957B417755J27932j87893J56353j36193K45820l61439K29184r0698l15497n6400
16947B028924N824M1429l65263o020O3211j04326j97830M8822J02488k82922o4082
16936A270255K2414P4528l00201J74999K8403j26005Q8913q7042J3395p3645q970
16925A077044j78384K35052j02673j07451O2942j27717j58837J66998J78515k09617
$$ plain form
16915 835872 933189 860577 985999 762436 671284 778062 910506 1025659 836766 981640
16905 981640 740440 731776 781894 718024 933894 695750 942470 780104 790084 620514 621510
16894 621510 779698 978570 643435 687449 691647 555856 886203 711075 901727 761863
16884 761863 510032 790922 697690 690802 854304 598691 634755 937455 623553 743921
16874 743921 947626 645794 760149 804369 914374 592710 850470 682629 921588 848397
16864 848397 725912 671961 535799 728328 885273 879764 755053 948131 845960 853326
16854 853326 742539 733099 519558 785855 777125 760519 675973 867987 861477 731705 655380
16843 655380 970569 835409 911750 614262 609361 706424 814575 879026 742393 910106
$$ packed form
16915H35872R7317p2612J25422k23563r1152J06778J32444J15153j88893J44874
16905I81640k41200q664N0118o3870K15870k38144K46720j62366R980j69570R96
16894F21510J58188J98872l35135M4014M198j35791L30347j75128J90652j39864
16884G61863k51831K80890r3232o888J63502k55613L6064L02700l13902J20368
16874G43921K03705l01832J14355M4220J10005l21664K57760j67841K38959p3191
16864H48397j22485n3951j36162J92529J56945n509j24711J93078j02171P366
16854H53326j10787r440k13541K66297q730j6606q4546J92014o510j29772p6325
16843F55380L15189j35160P6341k97488m901R7063J08151O4451j36633J67713
$$ plain form
16833 910106 866163 938480 819786 1080935 747707 953021 1176625 1090283 1015080 896173
16823 896173 1333223 1102136 1161511 1326573 1388212 1359180 1431634 1671836 1656878 1572809 1659427
16812 1659427 1779179 1641469 1394590 1712831 1539554 1507242 1432818 1464038 1537450 1445566
16802 1445566 1214643 1690636 1539778 1780259 1514038 1493902 1621352 1342583 1146823 1181588
16792 1181588 1250428 1157396 1057537 1010501 712722 680666 708436 909975 764517 793418 365333
16780 592982 605957 758036 836746 890876 760991 704847 783638 788616 765603 903966 769733
16769 769733 763687 960421 586142 946987 725438 671868 558294 786970 549817 666498
16759 666498 675094 692273 531600 749061 503716 770254 648739 407254 754957 644183
$$ packed form
16833I10106m3943P2317j18694K61149l33228K05314K23604q6342p5203j18907
16823H96173M37050k31087N9375J65062O1639k9032P2454K40202j4958q4069Q6618
16812A659427J19752j37710k46879L18241j73277l2312p4424L1220P3412r1884
16802A445566k30923M75993j50858K40481k66221k0136J27450k78769j95760L4765
16792A181588O8840r3032r9859m7036k97779l2056K7770K01539j45458K8901C65333
16780E92982J2975J52079P8710N4130j29885n6144P8791M978k3013J38363j34233
16769G69733o046J96734l74279L60845k21549n3570j13574K28676k37153J16681
16759F66498Q596J7179j60673K17461k45345K66538j21515k41485L47703j10774
$$ plain form
16749 644183 809112 830118 824273 830863 593063 657706 610686 545136 784575 856677 688520
16738 688520 756284 931319 984598 970234 477684 873861 996283 723170 859146 642637
16728 642637 857669 900598 957504 830821 896002 1001414 788674 866715 1079002 1017152
16718 1017152 923184 862697 843860 701918 953939 931773 905301 867054 920217 1028011 1125068
16707 1125068 844800 1179400 1158567 1305675 1342904 1622923 1480235 1429720 1423924 1387255
16697 1387255 1700716 1314193 1568592 1575269 1363838 1369279 1586267 1661000 1563938 1584481 1656489
16686 1656489 1695884 1601975 1455028 1316113 1427193 1379745 1137713 1028307 1010174 1088409
16676 1088409 898817 1135921 1145771 774761 982172 988643 1415149 1357618 1370085 1384081 1497952
$$ packed form
16749F44183J64929K1006n845O590k37800O4643m7020o5550K39439P2102j68157
16738F88520O7764J75035N3279j4364D77684L96177J22422k73113J35976k16509
16728F42637K15032M2929N6906j26683O5181J05412k12740P8041K12287o1850
16718A017152r3968o0487j8837j41942K52021k2166k6472l8247N3163J07794R7057
16707A125068k80268L34600k0833J47108L7229K80019j42688n0515n796l6669
16697A387255L13461l86523K54399O677k11431N441K16988P4733r7062K0543P2008
16686A656489L9395r3909j46947j38915J11080m7448k42032j09406j8133P8235
16676A088409j89592K37104R850l71010K07411O471M26506n7531J2467J3996J13871
$$ plain form
16665 1497952 1727805 1530850 1720136 1657981 1755736 1257790 1386069 1306606 1245788 1173769
16655 1173769 1251463 1662994 1489906 1502169 1529842 1542316 1322212 1144262 1065030 823919
16645 823919 952348 750017 695124 641964 735137 745628 823911 728227 892341 722811 543957
16634 543957 531102 504833 601623 726809 676491 683506 646464 753902 628626 852830 862386
16623 862386 880667 709573 721816 1107860 641238 743156 871446 899966 722711 752587
16613 752587 741905 697552 509601 853772 802087 627298 453158 865900 699351 787130
16603 787130 712747 751447 837513 570958 559850 902229 696559 880350 857136 642109
16593 642109 730349 683199 899475 637072 651242 779687 788388 731136 787244 701015 738191
$$ packed form
16665A497952K29853j96955J89286o2155R7755m97946J28279p9463o0818p2019
16655A173769P7694M11531j73088J2263K7673J2474k20104j77950p9232k41111
16645H23919J28429k02331n4893n3160R3173J0491P8283r5684J64114j69530j78854
16634E43957j2855k6269R6790J25186n0318P015l7042J07438j25276K24204R556
16623H62386J8281j71094J2243L86044m66622J01918J28290K8520j77255K9876
16613G52587j0682m4353j87951L44171n1685j74789j74140M12742j66549Q7779
16603G87130p4383L8700Q6066k66555j1108L42379k05670J83791k3214k15027
16593F42109Q8240m7150K16276k62403J4170J28445Q701n7252N6108q6229L7176
$$ plain form
16582 738191 727357 681562 873531 779641 922155 650279 534317 686809 797426 897042
16572 897042 718499 686201 705309 765283 996438 668382 684387 902120 910552 575727 847404
16561 847404 663396 842479 823117 799744 664918 729294 935044 673791 576109 809401
16551 809401 883242 961568 895715 1001414 855948 869747 510150 619007 716841 735273 694835
16540 694835 749746 821805 537975 776898 851837 922328 864381 524800 691094 682118 595552
16529 595552 604217 641064 694927 751952 672514 716505 681448 920393 786555 926310 950259
16518 950259 622072 668594 644577 487961 464362 777241 470783 528251 434255 430342 508168
16507 508168 434819 364270 8363 204095 140280 -27644 156195 83631 100983 190091 379413
$$ packed form
16582G38191j0834m5795J91969r3890J42514k71876j15962J52492J10617R9616
16572H97042j78543l2298J9108N9974K31155l28056J6005K17733Q432l34825K71677
16561H47404j84008J79083j9362k3373j34826O4376K05750k61253r7682K33292
16551H09401P3841P8326o5853J05699j45466J3799l59597J08857R7834J8432m0438
16540F94835N4911P2059k83830K38923P4939P0491n7947l39581J66294q976q6566
16529E95552Q665L6847N3863N7025p9438M3991l5057K38945j33838J39755K3949
16518I50259l28187M6522k4017j56616k3599L12879l06458N7468r3996l913P7826
16507E08168p3349p0549H363J95732o3815b7644A56195p2564J7352Q9108J89322
$$ plain form
16496 379413 294729 458771 712566 759381 891434 1145787 1020430 1241624 1085825 1357689
16486 1357689 1187051 1279512 1264992 1232796 1103987 1442086 1071993 1077219 1237724 997112
16476 997112 1072185 1001335 1135469 1461662 1220946 1248273 1386637 1197708 1383414 1303311
16466 1303311 1307585 1232370 1175279 1358091 1596932 1341110 1276960 1514325 1333170 1307026
16456 1307026 1315518 1286835 1306017 1228386 1226694 1484378 1476891 1383700 1456349 1582334 1460035
16445 1460035 1527293 1190122 1316601 1283974 1694588 1463250 1671253 1852391 1972053 2123992
16435 2123992 1905654 1892971 1778724 1947945 2023501 2109099 2059077 2514376 2723543 3206843
16425 3206843 3548511 3977698 4753836 5890106 6523394 7790207 9021523 10123017 11187285
$$ packed form
16496C79413q4684J64042K53795M6815J32053K54353j25357K21194j55799K71864
16486A357689j70638R2461j4520l2196j28809L38099l70093N226J60505k40612
16476I97112P5073p0850J34134L26193k40716K7327J38364j88929J85706q0103
16466A303311M274p5215n7091J82812K38841k55822o4150K37365j81155k6144
16456A307026Q492k8683J9182p7631j692K57684p487r3191P2649J25985j22299
16445A460035O7258l37171J26479l2627M10614k31338K08003J81138J19662J51939
16435B123992k18338j2683j14247J69221P5556Q5598n0022M55299K09167M83300
16425C206843L41668M29187P76138J136270O33288J266813J231316J101494J064268
$$ plain form
16416 11187285 12381059 13751590 15037787 16300484 17548348 18751410 20032689 21474249
16408 21474249 22758754 23878633 24796316 25912856 26971865 28125218 29601600 31040388
16400 31040388 32556206 34354231 35642780 36695481 37964643 39447190 41780138 45269792
16392 45269792 51240438 60683601 73901212 88957486 100701860 107022143 107739720 104034326
16384 104034326 97433280 87969578 76401415 63218745 47751505 30317238 14189915
16376 3584238 538309 2312118 5736441 8045969 9695012 10194220 10278375 10070615 9707922
16367 9707922 9367201 9204077 8698573 8229761 7807960 7111552 6646030 5879326 5492740
16358 5492740 4591679 4009376 3306904 2932757 2371595 2158202 1893558 1698891 1551059
$$ packed form
16416A1187285J193774J370531J286197J262697J247864J203062J281279J441560
16408B1474249J284505J119879R17683J116540J059009J153353J476382J438788
16400C1040388J515818J798025J288549J052701J269162J482547K332948L489654
16392D5269792N970646R443163J3217611J5056274J1744374O320283P17577l705394
16384A04034326o601046r463702j1568163j3182670j5467240j7434267A4189915
16376C584238E38309J773809L424323K309528J649043M99208Q4155k07760l62693
16367I707922l40721j63124n05504m68812m21801o96408m65522p66704l86586
16358E492740r01061n82303p02472l74147n61162k13393k64644j94667j47832
$$ plain form
16349 1551059 1419913 1253042 1395906 1271826 1220810 1407002 1318283 1347971 1389291 1261004
16339 1261004 1085123 1272103 869985 792650 914356 619509 411851 625754 727836 599874
16329 599874 386652 484171 466525 246671 287992 131667 335450 245818 188242 431009
16319 431009 446646 506343 362291 523559 949978 920320 905341 1002640 995356 1073725 1117621
16308 1117621 1139825 1157378 1309370 1122692 1313110 1082378 1067701 987243 925406 1020395
16298 1020395 1234770 1008923 1138508 1221060 919066 1167485 1012457 1378218 1067861 856484
16288 856484 874255 684907 780745 1070636 938254 688331 759795 586731 701241 738289
16278 738289 767501 466253 1060272 555015 934436 1085595 1166651 789970 1180906 1103337
$$ packed form
16349A551059j31146j66871J42864j24080n1016J86192q8719K9688M1320j28287
16339A261004j75881J86980m02118p7335J21706k94847k07658K13903J02082j27962
16329E99874k13222R7519j7646k19854M1321A31667K03783q9632n7576K42767
16319D31009J5637N9697j44052J61268M26419k9658j4979R7299p284P8369M3896
16308A117621K2204J7553J51992j86678J90418k30732j4677q0458o1837R4989
16298A020395K14375k25847J29585Q2552l01994K48419j55028L65761l10357k11377
16288H56484J7771j89348R5838K89891j32382k49923P1464j73064J14510L7048
16278G38289K9212l01248N94019n05257L79421J51159Q1056l76681L90936p7569
$$ plain form
16268 1103337 1116279 1218295 1001234 1079140 814143 920256 649956 835392 929723 765142
16258 765142 943956 750357 797000 805112 942965 389576 894938 613953 831186 747900
16248 747900 660560 865955 962933 694061 816521 872920 829839 1013880 1135234 969172
16238 969172 1301792 888434 1158841 1096351 1118808 1076070 691645 937952 1183832 819086
16228 819086 1059226 892705 1022232 711765 956774 751902 838787 875367 619948 948320
16218 948320 696126 770566 650733 669166 744366 518677 964936 834262 572131 789766
16208 789766 705423 811018 838615 753872 924431 465229 904312 740556 950250 918217
16198 918217 875795 894817 960644 955698 773625 883548 815622 864607 867985 1169398 837322
$$ packed form
16268A103337J2942J02016k17061P7906k64997J06113k70300J85436R4331j64581
16258G65142J78814j93599M6643Q112J37853C89576N05362k80985K17233q3286
16248G47900q7340K05395R6978k68872J22460N6399m3081J84041J21354j66062
16238I69172L32620m13358K70407o2490K2457m2738l84425K46307K45880l64746
16228H19086K40140j66521J29527l10467K45009k04872Q6885L6580k55419L28372
16218I48320k52194P4440j19833J8433P5200k25689M46259j30674k62131K17635
16208G89766q4343J05595K7597q4743J70559m59202M39083j63756K09694l2033
16198I18217m2422J9022O5827m946j82073J09923o7926M8985L378L01413l32076
$$ plain form
16187 837322 827181 873432 1087781 917522 1075028 835995 806190 1095242 738443 986407
16177 986407 757145 729068 930647 1030091 865145 1042319 1219723 855408 735456 818518
16167 818518 781918 709513 865514 893027 827576 924820 978709 625334 825411 753399 875809
16156 875809 770899 757405 812573 778510 749129 456655 499903 791205 737361 659511 787024
16145 787024 937027 836613 843186 761318 696140 631163 789189 1304273 927468 904956 1127788
16134 1127788 924144 874034 882951 1082151 856426 870810 906086 755212 815795 1040746
16124 1040746 1017840 1003410 822540 911006 909578 944105 890006 899664 1116630 1095425 691609
16113 691609 1102250 888615 999109 955409 962374 902692 921384 1093386 855279 1148234
$$ packed form
16187H37322j0141M6251K14349j70259J57506k39033k9805K89052l56799K47964
16177I86407k29262k8077K01579R9444j64946J77174J77404l64315j19952Q3062
16167H18518l6600p2405J56001K7513o5451R7244N3889l53375K00077p2012J22410
16156H75809j04910j3494N5168l4063k9381k92474M3248K91302n3844p7850J27513
16145G87024J50003j00414O573q1868o5178o4977J58026N15084l76805k2512K22832
16134A127788k03644n0110Q917J99200k25725J4384L5276j50874O0583K24951
16124A040746k2906j4430j80870Q8466j428L4527n4099R658K16966k1205m03816
16113F91609M10641k13635J10494m3700O965n9682J8692J72002k38107K92955
$$ plain form
16103 1148234 890336 1107315 995159 1089025 930688 924470 1136685 976073 999434 1086093
16093 1086093 1026644 997313 1177787 970246 1023224 1005659 1276583 914935 1199737 1047438
16083 1047438 1278003 1227302 1091660 1282533 1316122 1036076 1307092 1221507 1069991 1290280
16073 1290280 1253032 1230380 1239419 1306040 1291894 1249218 1259425 1289015 1348029 1519503 1530034
16062 1530034 1364039 1281205 1466483 1482255 1435253 1348812 1538158 1412931 1646877 1608531
16052 1608531 1482401 1616170 1681365 1662799 1627553 1484681 1818787 1576820 1407044 1677087
16042 1677087 1540730 1570773 1726439 1583611 1748335 1524974 1685345 1591262 1607413 1726790
16032 1726790 1731824 1556107 1492252 1712896 1943207 1640702 1698497 1915133 1861749 2049702
$$ packed form
16103A148234k57898K16979j12156R3866j58337o218K12215j60612K3361Q6659
16093A086093n9449k9331J80474k07541N2978j7565K70924l61648K84802j52299
16083A047438K30565n0701j35642J90873L3589k80046K71016q5585j51516K20289
16073A290280l7248k2652R039O6621j4146m2676J0207K9590N9014J71474J0531
16062A530034j65995q2834J85278J5772m7002q6441J89346j25227K33946l8346
16052A608531j26130J33769O5195j8566l5246j42872L34106k41967j69776K70043
16042A677087j36357L0043J55666j42828J64724k23361J60371r4083J6151J19377
16032A726790N034j75717o3855K20644K30311l02505N7795K16636n3384J87953
$$ plain form
16022 2049702 1757933 1872455 2003133 1974294 2106837 2156726 2051504 1925755 2063750 2051608
16012 2051608 2241343 2130005 2103574 1888560 1886632 1791330 2068623 1983978 1906971 2108046
16002 2108046 2118634 2083963 2020039 2045314 2114789 2108675 2166711 2210725 2023055 1927671 1985066
15991 1985066 1859397 1797634 2083126 2174531 1991862 2186841 2011085 1980108 2197381 2117925
15981 2117925 2278644 2040406 2345630 2279142 2151445 2156536 2166283 2326353 2368993 2393539 2140657
15970 2140657 2300715 2244914 2002317 2162319 1958691 2030846 2258765 2165178 2329426 2177986
15960 2177986 2145044 2188722 1953568 2308374 2111919 2230809 2093971 2162975 2164144 1973587
15950 1973587 2059289 2384736 2133210 2116911 2378777 2143938 2175035 2283557 2630712 2230691
$$ packed form
16022B049702k91769J14522J30678k8839J32543M9889j05222j25749J37995j2142
16012B051608J89735j11338k6431k15014j928r5302K77293q4645p7007K01075
16002B108046J0588l4671o3924K5275O9475o114N8036M4014j87670r5384N7395
15991A985066j25669o1763K85492R1405j82669J94979j75756l0977K17273p9456
15981B117925J60719k38238L05224o6488j27697N091R747J60070M2640K4546k52882
15970B140657J60058n5801k42597J60002k03628P2155K27919r3587J64248j51440
15960B177986l2942M3678k35154L54806j96455J18890j36838O9004J169j90557
15950A973587Q5702L25447k51526j6299K61866k34839L1097J08522L47155m00021
$$ plain form
15940 2230691 2418366 2218896 2510532 2376431 2440256 2687164 2417523 2600456 2536384 2628427
15930 2628427 2713417 2674338 2784012 2683835 2940096 2842864 2889325 3062147 3399477 3370631
15920 3370631 3535579 3676300 4023805 4334895 4711938 5449705 6222303 7093690 8060088
15911 8060088 10127621 12952083 17146851 22769424 30136858 38671642 47396626 55313822
15903 55313822 61418837 65290551 66521635 64676220 60111641 52620423 43708730 34469424
15895 34469424 26297228 19813832 14967834 11630887 9225057 7569079 6540278 5387337
15887 5387337 4962718 4265455 4102191 3446466 3416310 3318973 3095802 2729124 2826486 2776925
15877 2776925 2566536 2369101 2477030 2471472 2721990 2579917 2619838 2756147 2391621 2592758
$$ packed form
15940B230691J87675j99470K91636j34101O3825K46908k69641J82933o4072R2043
15930B628427Q4990l9079J09674j00177K56261r7232M6461J72822L37330k8846
15920C370631J64948J40721L47505L11090L77043P37767P72598Q71387R66398
15911H060088K067533K824462M194768N622573P367434Q534784Q724984P917196
15903E5313822O105015L871714J231084j845415m564579p491218q911693r239306
15895C4469424q172196o483396m845998l336947k405830j655978j028801j152941
15887E387337m24619o97263j63264o55725l0156r7337k23171l66678R7362m9561
15877B776925k10389j97435J07929n558K50518j42073L9921J36309l64526K01137
$$ plain form
15867 2592758 2419240 2376945 2500549 2418469 2361495 2215118 2311104 2173565 2320693 2466744
15857 2466744 2334196 1954003 2015074 2357925 2248532 2047460 2277063 2147516 2197181 2263647
15847 2263647 2267411 2102353 2331969 2030353 1864655 2197574 2085760 2170501 2199869 2388101
15837 2388101 2197933 2587093 2372244 2583382 2474533 2681542 2468012 2601994 2303419
15828 2303419 2347046 2158569 2311829 2420775 2278791 2156785 2147865 2227205 2093724 2047600
15818 2047600 2085102 2388738 2097557 2158244 2239101 2249088 2358271 2300514 2392218 2304844 2520796
15807 2520796 2526994 2316556 2347974 2402718 2252587 2474476 2587346 2683956 2461293 2546788
15797 2546788 2651926 3001026 2862794 2978637 3305710 3379728 3254951 3416929 3482613 3434855
$$ packed form
15867B592758j73518m2295J23604q2080n6974j46377R5986j37539J47128J46051
15857B466744j32548l80193O1071L42851j09393k01072K29603j29547M9665O6466
15847B263647L764j65058K29616l01616j65698L32919j11814Q4741K9368J88232
15837B388101j90168L89160k14849K11138j08849K07009k13530J33982k98575
15828B303419M3627j88477J53260J08946j41984j22006q920P9340j33481m6124
15818B047600L7502L03636k91181O0687Q0857R987J09183n7757R1704q7374K15952
15807B520796O198k10438L1418N4744j50131K21889J12870R6610k22663Q5495
15797B546788J05138L49100j38232J15843L27073P4018j24777J61978O5684m7758
$$ plain form
15787 3434855 3301247 3374505 3255125 3575485 3541379 3838598 3931161 3988109 4130354 4255247
15777 4255247 4318419 4318180 4309844 4361102 4421787 4502808 4412515 3993256 4453527 4427325 4308235
15766 4308235 4391465 4501473 4752257 4724832 4931064 4803304 4821234 4996666 4866931 4913728
15756 4913728 5047542 4960014 5006948 4930701 5084443 5092931 5062171 5351973 5358685 5601358 5576077
15745 5576077 5927591 6138533 6067066 6473209 6566451 6676214 6975736 7177652 7203495 7186613
15735 7186613 7024935 7290776 7336066 7054499 7332800 7340892 7467569 7587512 7695140 7755776
15725 7755776 7493423 7543262 7139904 6862482 6743715 6286614 6509610 6277025 6478811 6522635
15715 6522635 6811514 6655003 6712649 6738661 6748502 6475746 6331702 6310223 6496603 6669382
$$ packed form
15787C434855j33608P3258j19380L20360l4106K97219R2563N6948J42245J24893
15777D255247O3172k39q336N1258O0685Q1021r0293m19259M60271k6202j19090
15766D308235Q3230J10008K50784k7425K06232j27760J7930J75432j29735M6797
15756D913728J33814q7528M6934p6247J53742Q488l0760K89802O712K42673k5281
15745E576077L51514K10942p1467M06143R3242J09763K99522K01916K5843j6882
15735G186613j61678K65841M5290k81567K78301Q092J26677J19943J07628O0636
15725G755776k62353M9839m03358k77422j18767m57101K22996k32585K01786M3824
15715F522635K88879j56511N7646K6012R841k72756j44044k1479J86380J72779
$$ plain form
15705 6669382 6913744 6854626 6928624 7022671 7631362 7481307 7715991 7887047 7569044 8145119
15695 8145119 8015512 8256643 8342191 8368422 8318814 8231289 8211019 8135232 7525395 7653049
15685 7653049 7522555 7327915 7468088 7520382 7415473 7660870 7553827 7596322 7425541 7315417
15675 7315417 7221987 6958093 6589787 6439001 6452123 6684057 6528038 6648053 6587987 6622141
15665 6622141 6584659 6645654 6680345 7080720 7527561 7570242 7928402 7835563 8444687 8913098
15655 8913098 9173626 9544565 10226361 10942595 11403146 12020325 12738392 13139492 13684528
15646 13684528 14032651 14511457 15152355 15759773 16165308 16837267 17533142 18560409 19462952
15637 19462952 20261801 20872450 21482235 21662304 22002235 21947432 21543386 21159641 20750085
$$ packed form
15705F669382K44362n9118P3998R4047O08691j50055K34684J71056l18003N76075
15695H145119j29607K41131Q5548K6231m9608q7525k0270p5787o09837J27654
15685G653049j30494j94640J40173N2294j04909K45397j07043M2495j70781j10124
15675G315417r3430k63894l68306j50786J3122K31934j56019J20015o0066L4154
15665F622141l7482O0995L4691M00375M46841M2681L58160r2839O09124M68411
15655H913098K60528L70939O81796P16234M60551O17179P18067M01100N45036
15646A3684528L48123M78806O40898O07418M05535O71959O95875J027267R02543
15637A9462952P98849O10649O09785J80069L39931n4803m04046l83745m09556
$$ plain form
15628 20750085 20671892 20640057 20841326 20905546 20727020 20742292 20822346 20840653 19839854 19264210
15618 19264210 18050099 17357697 16277596 15407314 14831512 14038579 13793587 13459307 13346011
15609 13346011 12642890 12111596 11800094 11468322 11045929 10849655 10552642 10319354 10143352
15600 10143352 10085249 9973200 9878425 9780726 9923113 10134721 10400992 11055467 11887295 13917866
15590 13917866 17736936 26389845 42256278 60838883 75139180 83775668 89707907 92678198
15582 92678198 93028006 89712168 78720297 58317500 37224726 23805741 17341449 13700789
15574 13700789 11611214 10144434 9061998 8749203 8345356 8386870 8444868 8740940 8849113
15565 8849113 8881662 9068633 9392257 9371496 9725173 10036248 10528042 11149100 12953783 15866708
$$ packed form
15628B0750085p8193l1835K01269O4220j78526J5272Q0054J8307j000799n75644
15618A9264210j214111o92402j080101q70282n75802p92933k44992l34280j13296
15609A3346011p03121n31294l11502l31772m22393j96274k97013k33288j76002
15600A0143352n8103j12049r4775r7699J42387K11608K66271O54475Q31828K030571
15590A3917866L819070Q652909J5866433J8582605J4300297Q636488N932239K970291
15582I2678198L49808l315838j0991871k0402797k1092774j3418985o464292l640660
15574A3700789k089575j466780j082436l12795m03847M1514N7998K96072J08173
15565H849113L2549J86971L23624k0761L53677L11075M91794O21058J804683K912925
$$ plain form
15555 15866708 22021361 35707753 58620659 81799208 98289088 108479950 114896500
15548 114896500 117879779 116672774 110376197 92331536 64075748 38559151 23786813
15541 23786813 16742890 12794947 10251024 8479411 7566304 6705776 6301962 6010523 5955370
15532 5955370 5509822 5753885 5561590 5356978 5390850 4944912 5007581 4602276 4571393 4305810
15522 4305810 4197431 4152878 4016511 3999213 3951446 3876786 4041903 3896722 4084970 4225613
15512 4225613 4391965 4447617 4389744 4534745 4591549 4496132 4814967 4550380 4448157 4503441
15502 4503441 4609345 4487971 4310423 4368595 4263338 4158626 4320742 4316818 4028818 4355036
15492 4355036 4288916 4322981 4368586 4230777 4532883 4427185 4744416 4693881 4910266 5458935
$$ packed form
15555A5866708O154653J3686392K2912906K3178549J6489880J0190862O416550
15548A14896500K983279j207005o296577j8044661k8255788k5516597j4772338
15541B3786813p043923l947943k543923j771613r13107q60528m03814k91439n5153
15532E955370m45548K44063j92295k04612L3872m45938O2669m05305l0883k65583
15522D305810j08379m4553j36367j7298m7767p4660J65117j45181J88248J40643
15512D225613J66352N5652n7873J45001N6804r5417L18835k64587j02223N5284
15502D503441J05904j21374j77548N8172j05257j04712J62116l924k88000L26218
15492D355036o6120L4065M5605j37809L02106j05698L17231n0535K16385N48669
$$ plain form
15482 5458935 5519214 5958967 6123646 6290199 6181871 6300756 6362667 6301800 6210547 6156187
15472 6156187 6394634 6884234 7552987 8579304 9006886 9886117 10735883 11194030 11252216
15463 11252216 11169556 11077216 10241805 9528017 8973881 8635743 8981173 9011831 9532078 10536495
15453 10536495 10954878 11727234 12102490 12238145 12164461 11811586 11220422 10705627 9821170
15444 9821170 9276685 8945650 8733970 8920845 9098804 9661943 9501218 9583343 9884426 9485164
15434 9485164 9482341 8940268 8757153 8325949 7881864 7588378 7201324 7211696 6942179 6781261
15424 6781261 6808018 6722030 6341558 6283314 6198458 5915662 5459502 5459794 4976429 5202670 4914413
15413 4914413 4966131 4959363 4955562 4759140 4987028 4857608 4774945 4941011 4969345 5065508 4919423
$$ packed form
15482E458935O0279M39753J64679J66553j08328J18885O1911o0867r1253n4360
15472F156187K38447M89600O68753J026317M27582Q79231Q49766M58147N8186
15463A1252216q2660r2340q35411p13788n54136l38138L45430L0658N20247J004417
15453A0536495M18383P72356L75256J35655p3684l52875n91164n14795q84457
15444I821170n44485l31035k11680J86875J77959N63139j60725Q2125L01083l99262
15434I485164k823n42073j83115m31204m44085k93486l87054J0372k69517j60918
15424F781261K6757q5988l80472n8244q4856k82796m56160K92m83365K26241k88257
15413D914413N1718o768l801j96422K27888j29420q2663J66066K8334R6163j46085
$$ plain form
15402 4919423 5188616 5391395 5516122 5398921 5440759 5689012 5512117 5575598 5722941 5502855
15392 5502855 5630874 5420477 5516657 5276111 5276756 5423053 5381112 5637463 5550812 5863293
15382 5863293 5975933 5826263 5914482 6196967 6145869 5990326 6006824 6190395 6156287 5883879
15372 5883879 6184454 5799291 5946684 5961845 5878197 6005293 5912113 6226188 6448613 6526737
15362 6526737 6741553 6723870 6956484 6998170 7115807 7305658 7407872 7738670 7855156 7785746
15352 7785746 8263442 8796936 9385009 10045225 11857913 14894094 20620385 29493025 39736409
15343 39736409 47040045 52304942 55895495 57412106 57372480 54935395 47857428 36921961
15335 36921961 26902520 21004603 17848917 16264151 15378395 14830395 14523743 14045377
$$ packed form
15402D919423K69193K02779J24727j17201M1838K48253j76895O3481J47343k20086
15392E502855J28019k10397R6180k40546O45J46297m1941K56351q6651L12481
15382E863293J12640j49670Q8219K82485n1098j55543J6498J83571l4108k72408
15372E883879L00575l85163J47393J5161q3648J27096r3180L14075K22425P8124
15362F526737K14816j7683K32614M1686J17637J89851J02214L30798J16486o9410
15352G785746M77696N33494N88073O60216J812688L036181N726291Q872640J0243384
15343C9736409P303636N264897L590553J516611l9626k437085p077967j0935467
15335C6921961j0019441n897917l155686j584766q85756n48000l06652m78366
$$ plain form
15327 14045377 13575274 12854045 12606689 12361591 12200985 12341441 12512366 12477828 13261531
15318 13261531 13386122 14309924 15629060 17793510 21838033 30374036 43857923 60981560
15310 60981560 77570372 90381584 99115470 103831479 105103013 101898064 92340457 76055240
15302 76055240 56453320 39484190 27860685 21187006 17521996 15277683 14039502 13252051
15294 13252051 12876458 12812293 12578734 12536925 12491562 12272485 12550567 12157806 12080757 11836895
15284 11836895 11562647 11868213 12335705 13077614 14687532 18485698 25004097 33993630 43038446
15275 43038446 49239950 53669998 56076702 56701025 56018348 52228090 44439936 33680000
15267 33680000 24362594 18780832 15918926 13983900 13051601 11831549 10793923 10212066
$$ packed form
15327A4045377m70103p21229k47356k45098j60606J40456J70925l4538P83703
15318A3261531J24591R23802J319136K164450M044523Q536003J3483887J7123637
15310F0981560J6588812J2811212Q733886M716009J271534l204949r557607j6285217
15302G6055240j9601920j6969130j1623505o673679l665010k244313j238181p87451
15294A3252051l75593o4165k33559m1809m5363k19077K78082l92761p7049k43862
15284A1836895k74248L05566M67492P41909J609918L798166O518399Q989533R044816
15275D3038446O201504M430048K406704O24323o82677l790258p788154j0759936
15267C3680000r317406n581762k861906j935026r32299j220052j037626n81857
$$ plain form
15259 10212066 9567584 9088969 8829843 8675631 8782463 9087603 9524636 9401677 9825147
15250 9825147 10070244 10047413 10413811 10353271 10224633 10045307 9887232 9748321 9274281 8779404
15240 8779404 8550222 8236260 8109639 8203156 8192364 8602003 9353816 9758126 10347020 11030057
15230 11030057 11319856 11286258 11405102 11335367 11027935 10613479 10121196 9310766 8908963 8604145
15220 8604145 8538492 8693822 8814033 8965815 9352372 9803833 10343065 10779639 10756803 11308639
15210 11308639 11190985 10912304 10523433 9896543 9638076 8906049 8256211 7864481 7447204
15201 7447204 6832928 6890646 6525212 6228567 6283502 6125762 6086895 6142381 6068459 6168420
15191 6168420 6478232 6473192 6821588 7032605 7120798 6963797 7375944 7404403 7301163 7249861
$$ packed form
15259A0212066o44482m78615k59126j54212J06832L05140M37033j22959M23470
15250I825147K45097k2831L66398o0540j28638j79326j58075j38911m74040m94877
15240H779404k29182l13962j26621R3517j0792M09639P51813M04310N88894O83037
15230A1030057K89799l3598J18844o9735l07432m14456m92283q10430m01803l04818
15220H604145o5653J55330J20211J51782L86557M51461N39232M36574k2836N51836
15210A1308639j17654k78681l88871o26890k58467p32027o49838l91730m17277
15201G447204o14276N7718l65434k96645N4935j57740l8867N5486p3922R9961
15191F168420L09812n040L48396K11017Q8193j57001M12147K8459j03240n1302
$$ plain form
15181 7249861 6971987 6978441 7293268 7461900 7504579 7780603 7786959 8009507 7850321 8238879
15171 8238879 8125504 7926054 7782459 7797775 7601184 7809053 7602129 7681670 7698716 7667241
15161 7667241 7949623 7903667 8326795 8457520 8682760 8748824 8813636 8762638 8862966 8811514
15151 8811514 8755955 8889486 8391112 8676272 8381435 8429493 8374538 8365156 8503674 8184712
15141 8184712 8290398 8381916 8395978 8300385 8213916 8296070 8508536 8352162 8496413 8083645
15131 8083645 8151761 8254407 8115410 8283264 8255076 8431065 8288091 8182298 8320244 8264809
15121 8264809 7887595 7891571 7883495 8138405 7515920 7820130 7610573 7590820 7849853 7751923
15111 7751923 7805760 7848629 7866376 8125432 7977383 8289615 8245340 8589328 8776703 8969150
$$ packed form
15181G249861k77874O454L14827J68632M2679K76024O356K22548j59186L88558
15171H238879j13375j99450j43595J5316j96591K07869k06924P9541J7046l1475
15161G667241K82382m5956M23128J30725K25240O6064O4812n0998J00328n1452
15151H811514n5559J33531m98374K85160k94837M8058n4955r382J38518l18962
15141H184712J05686R1518J4062r5593q6469Q2154K12466j56374J44251m12768
15131H083645O8116J02646j38997J67854k8188J75989j42974j05793J37946n5435
15121H264809l77214L976q076K54910o22485L04210k09557j9753K59033r7930
15111G751923N3837M2869J7747K59056j48049L12232m4275L43988J87375J92447
$$ plain form
15101 8969150 8971475 9131638 9531772 10070177 10028630 10075843 10520758 10866870 11301299 12010058
15091 12010058 12863786 14605722 17241955 20965490 24556775 27282623 29639396 31108329
15083 31108329 31673449 31720487 30509530 28263936 24822072 22066186 20713379 20937604 22776691
15074 22776691 25866057 29268010 32316518 34902654 36443798 37276450 37192638 36777997 34769121
15065 34769121 31964412 30528145 32517021 37816999 43118123 47063917 50538036 53203776
15057 53203776 55170447 57482053 58519702 55472437 51196292 48036077 47837980 49036223
15049 49036223 52041429 55942548 59491167 61561967 62797426 64077853 65428231 67136881
15041 67136881 67889651 66733498 63074115 59258718 56716598 55359082 54464412 53432874
$$ packed form
15101H969150K325J60163M00134N38405m1547M7213M44915L46112M34429P08759
15091A2010058Q53728J741936K636233L723535L591285K725848K356773J468933
15083C1108329N65120M7038j210957k245594l441864k755886j352807K24225J839087
15074B2776691L089366L401953L048508K586136J541144Q32652q3812m14641k008876
15065C4769121k804709j436267J988876N299978N301124L945794L474119K665740
15057E3203776J966671K311606J037649l047265m276145l160215j98097J198243
15049D9036223L005206L901119L548619K070800J235459J280427J350378J708650
15041F7136881P52770j156153l659383l815397k542120j357516q94670j031538
$$ plain form
15033 53432874 51918325 50845618 51656693 54773343 61482000 70334277 79362273 88405037
15025 88405037 97069479 105367251 112276606 117307828 119499726 117181080 112699124 108513509
15017 108513509 104341018 101242361 98590384 96072850 93006039 89936368 87033065 84146817
15009 84146817 80915859 77045132 71622721 64930809 58902633 54777038 51806492 49324866
15001 49324866 47272596 46332041 46662312 47996821 50308911 52879869 54287456 55998361
14993 55998361 56745348 57222067 55805376 53992811 50909019 48093315 46634834 47584373
14985 47584373 49028321 49369980 50159491 51630837 53034738 54070805 53213287 50495674
14977 50495674 45510574 41111454 37554131 34503501 31504771 28899307 27295489 26049966
$$ packed form
15033E3432874j514549j072707Q11075L116650O708657Q852277R027996R042764
15025H8405037Q664442Q297772O909355N031222K191898k318646m481956m185615
15017A08513509m172491l098657k651977k517534l066811l069671k903303k886248
15009H4146817l230958l870727n422411o691912o028176m125595k970546k481626
15001D9324866k052270r40555L30271J334509K312090K570958J407587J710905
14993E5998361P46987M76719j416691j812565l083792k815704j458481R49539
14985D7584373J443948L41659P89511J471346J403901J036067q57518k717613
14977E0495674m985100m399120l557323l050630k998730k605464j603818j245523
$$ plain form
14969 26049966 25855259 26088272 26130869 27062083 27522240 28540327 29132045 29583160 30676289
14960 30676289 31982158 34206549 36780281 40521439 46677433 56136384 69433540 87893522
14952 87893522 113226230 142510372 176155167 214023177 254991930 295083889 333192135
14945 333192135 370484303 401042951 417098136 418242484 407590992 386269404 358616109
14938 358616109 330610106 300096019 264475315 227958587 201045037 185162070 176138477
14931 176138477 168615147 158558233 144940623 130180237 116840881 105192888 95787896
14924 95787896 88716750 84925063 83928508 83476089 82342914 79906215 77157430 74036143
14916 74036143 69683364 62518120 51838748 39849956 30094037 23475010 19492036 17014746
$$ packed form
14969B6049966j94707K33013M2597R31214M60157J018087N91718M51115J093129
14960C0676289J305869K224391K573732L741158O155994R458951J3297156J8459982
14952H7893522K5332708K9284142L3644795L7868010M0968753M0091959L8108246
14945C33192135L7292168L0558648J6055185J144348j0651492k1321588k7653295
14938C58616109k8006003l0514087l5620704l6516728k6913550j5882967r023593
14931A76138477p523330j0056914j3617610j4760386j3339356j1647993r404992
14924I5787896p071146l791687r96555m52419j133175k436699k748785l121287
14916G4036143m352779p165244j0679372j1988792r755919o619027l982974k477290
$$ plain form
14908 17014746 15121606 14330923 13694909 13536609 13662995 14224842 14939848 15922302 17504116
14899 17504116 19063078 20513455 22177066 25116000 29648316 36069801 43003629 48130323
14891 48130323 51322568 52903241 54050532 53118041 49938952 44155009 35912820 27701799
14883 27701799 21990759 18571380 16709668 15886650 15094547 14997271 15131366 15204423 16165791
14874 16165791 17803141 18886166 19647094 20145539 20613007 20855859 21210762 21459426 21007330
14865 21007330 20249423 19529429 19984205 20683454 22498009 25533409 30797395 39515882 50355134
14856 50355134 62380964 74913163 87850377 98850537 106064611 108568954 105547709
14849 105547709 97660179 86352818 73859790 60574040 46918552 35667905 28172055
$$ packed form
14908A7014746j893140p90683o36014j58300J26386N61847P15006R82454J581814
14899A7504116J558962J450377J663611K938934M532316O421485O933828N126694
14891D8130323L192245J580673J147291r32491l179089n783943q242189q211021
14883B7701799n711040l419379j861712q23018p92103r7276J34095P3057R61368
14874A6165791J637350J083025P60928M98445M67468K42852L54903K48664m52096
14865B1007330p57907p19994M54776O99249J814555L035400N263986Q718487J0839252
14856E0355134J2025830J2532199J2937214J1000160P214074K504343l021245
14849A05547709p887530j1307361j2493028j3285750j3655488j1250647p495850
$$ plain form
14842 28172055 23774483 20849860 18910876 17783828 16566854 16153496 15779531 15513697
14834 15513697 15310922 14971232 15104039 15063743 14999846 14901042 15255779 15935867 16894346 17499322
14824 17499322 18269694 19217567 20586199 23214642 27395815 34738455 44533536 55162062
14816 55162062 63732322 69720584 72996449 74030419 72553798 67621137 58399122 45701491
14808 45701491 33600984 24562114 19113641 16040615 14179771 13141168 12320417 11799222
14800 11799222 11154376 10929463 10693484 10454720 10440842 10054355 9638760 9016914 8677594
14791 8677594 8487215 8395531 8051861 7905153 7794347 7865660 7946836 8119014 8101489 8539844
14781 8539844 8681281 9054171 9513365 10842879 11906907 12554050 13306666 13403530 13398646 13257212
$$ packed form
14842B8172055m397572k924623j938984j127048j216974m13358l73965k65834
14834A5513697k02775l39690J32807m0296o3897r8804L54737O80088R58479O04976
14824A7499322P70372R47873J368632K628443M181173P342640R795081J0628526
14816E5162062Q570260N988262L275865J033970j476621m932661r222015j2697631
14808D5701491j2100507r038870n448473l073026j860844j038603q20751n21195
14800A1799222o44846k24913k35979k38764j3878l86487m15595o21846l39320
14791H677594j90379r1684l43670j46708j10806P1313Q1176J72178j7525M38355
14781H539844J41437L72890M59194J329514J064028O47143P52616R6864m884j41434
$$ plain form
14771 13257212 12868621 11756047 10735105 9575006 8904236 8476952 8331970 8323489 8313008
14762 8313008 8774641 8695770 8646028 9138246 9235427 9692224 9783147 10050824 10034269 10213106
14752 10213106 10233148 10691064 10503570 10698047 10973201 10523062 11074901 11266747 11486248
14743 11486248 11818015 12221261 12705848 13206667 14137300 15398564 16529653 18584170 21046421
14734 21046421 24531111 29303165 36358129 47154315 64600044 92011594 129281408
14727 129281408 172638958 217143572 258075734 290021673 309102367 315720159 307319945
14720 307319945 281617263 241397387 194912312 147513083 105302828 74499427 54021433
14713 54021433 40955738 32302107 26728736 22646337 19355212 17309648 15312541 14088571
$$ packed form
14771A3257212l88591j112574j020942j160099o70770m27284j44982q481j0481
14762H313008M61633p8871m9742M92218R7181M56797R0923K67677j6555J78837
14752A0213106K0042M57916j87494J94477K75154m50139N51839J91846K19501
14743A1486248L31767M03246M84587N00819R30633J261264J131089K054517K462251
14734B1046421L484690M772054P054964J0796186J7445729K7411550L7269814
14727A29281408M3357550M4504614M0932162L1945939J9080694O617792q400214
14720C07319945k5702682m0219876m6485075m7399229m2210255l0803401k0477994
14713E4021433j3065695q653631n573371m082399l291125k045564j997107j223970
$$ plain form
14705 14088571 13262587 12189441 11563905 10592832 9522157 8974039 8553667 8228714 7647421
14696 7647421 7604857 7417126 7365010 7249669 7138854 7136950 7416959 7187973 6989215 7310858
14686 7310858 7277702 7304369 7262400 7281931 7633092 7903271 8168534 8305572 8575203 9123210
14676 9123210 9881252 11179114 12059544 12267767 12558251 12556243 12310337 12053847 11120947 9481291
14666 9481291 8387124 7542257 7174518 7423755 7205014 7388254 7367775 7409638 7263322 6989650
14656 6989650 6622664 5930116 5738587 5885623 5720011 5647832 5806539 5837503 6139224 6020690
14646 6020690 6365788 6533799 6806749 6927030 6956630 7057787 7195307 7297305 7416187 7725595
14636 7725595 8329512 8641588 9395036 9612528 10055002 9943022 9691990 9144275 8212884
$$ packed form
14705A4088571q25984j073146o25536r71073j070675n48118m20372l24953n81293
14696G647421m2564j87731n2116j15341j10815j904K80009k28986j98758L21643
14686G310858l3156K6667m1969J9531L51161K70179K65263J37038K69631N48007
14676I123210P58042J297862Q80430K08223K90484k008k45906k56490r32900j639656
14666I481291j094167q44867l67739K49237k18741J83240k0479M1863j46316k73672
14656F989650l66986o92548j91529J47036j65612p2179J58707L0964L01721j18534
14646F020690L45098J68011K72950J20281K9600J01157J37520J01998J18882L09408
14636G725595O03917L12076P53448K17492M42474j11980k51032n47715r31391
$$ plain form
14627 8212884 7402374 6499428 5776519 5073948 4681193 4380299 4595156 4660104 4544657 4751709
14617 4751709 4861987 4613603 4414234 4642351 4274536 4444946 4081626 3957725 3872941 3711931
14607 3711931 3375718 3473354 3190020 3384625 3151973 3266667 3317914 3867169 4491286 5065008
14597 5065008 6091959 6363972 7160966 7657225 7714987 7553488 6966704 6459101 5891860
14588 5891860 4757477 4470664 3978461 3411614 3704956 3664654 3739766 3951863 3806398 3994459
14578 3994459 3761260 3867043 4228021 4235709 4146564 4440171 4524044 4461550 4446464 4525666 5001601
14567 5001601 5153448 6085136 6516996 7265297 8040797 8897025 10196086 13115022 18553332
14558 18553332 27761000 38504655 47395943 53375285 57580969 59987644 60409945 58440444
$$ packed form
14627H212884q10510r02946p22909p02571l92755l00894K14857O4948j15447K07052
14617D751709J10278k48384j99369K28117l67815J70410l63320j23901q4784j61010
14607C711931l36213R7636k83334J94605k32652J14694N1247N49255O24117N73722
14597E065008J026951K72013P96994M96259N7762j61499n86784n07603n67241
14588E891860j134383k86813m92203n66847K93342m0302P5112K12097j45465J88061
14578C994459k33199J05783L60978P688q9145K93607Q3873o2494j5086P9202M75935
14567E001601J51847R31688M31860P48301P75500Q56228J299061K918936N438310
14558A8553332R207668J0743655Q891288N979342M205684K406675M22301j969501
$$ plain form
14550 58440444 52308562 40909542 29383288 21494293 18400303 18433406 21314286 28406881
14542 28406881 39192501 49821080 57472788 62237339 65205735 66055362 64532432 59802861
14534 59802861 49130787 36064337 25107772 18773298 15742653 14437231 13900743 13537661
14526 13537661 13923489 13873319 13796601 13918232 13685879 13868503 15397488 19641445 26735669
14517 26735669 34451212 40535436 44191985 46774995 48097205 48099190 46133997 40849340
14509 40849340 32516155 25135331 21049512 20252597 21333200 24881501 31111377 38528161
14501 38528161 44706347 48478968 50828594 51856315 51424453 49451435 44383449 36277626
14493 36277626 27535491 21142211 17624866 15475427 13339229 11976350 11155630 10046907
$$ packed form
14550E8440444o131882j1399020j1526254p888995l093990L3103K880880P092595
14542B8406881J0785620J0628579P651708M764551K968396Q49627j522930m729571
14534E9802861j0672074j3066450j0956565o334474l030645j305422n36488l63082
14526A3537661L85828n0170p6718J21631k32353J82624J528985M243957P094224
14517B6735669P715543O084224L656549K583010J322210J985j965193n284657
14509D0849340q333185p380824m085819p96915J080603L548301O229876P416784
14501C8528161O178186L772621K349626J027721m31862j973018n067986q105823
14493C6277626q742135o393280l517345k149439k136198j362879q20720j108723
$$ plain form
14485 10046907 8841884 7176595 6017751 5261702 4610189 4240027 4371055 4188476 3992974
14476 3992974 4035783 4077337 3905160 3733227 4057294 4556312 4805969 5458716 6107665 6258962
14466 6258962 6570598 6527633 6624495 6752598 6666088 6054784 6140789 5966874 6626228 7123001
14456 7123001 7540277 8046498 8287425 8105327 7884173 7657128 7043021 6254731 6173073 5961409
14446 5961409 5979106 6294230 6521860 6903068 7206679 7476014 7885091 8142848 8104623 8388742
14436 8388742 8676693 8646803 8721595 9162549 9520620 10217282 11871727 14144923 18080986
14427 18080986 24441330 31922883 39686437 46221962 50878719 54256914 55663612 54969390
14419 54969390 51008490 44503712 36209318 28381780 22570892 18120607 15206023 12856945
$$ packed form
14485A0046907j205023j665289j158844p56049o51513l70162J31028j82579j95502
14476C992974M2809M1554j72177j71933L24067M99018K49657O52747O48949J51297
14466F258962L11636m2965R6862J28103q6510o11304Q6005j73915O59354M96773
14456G123001M17276N06221K40927j82098k21154k27045o14107p88290q1658k11664
14446E961409J7697L15124K27630L81208L03611K69335M09077K57757l8225K84119
14436H388742K87951k9890P4792M40954L58071O96662J654445K273196L936063
14427A8080986O360344P481553P763554O535525M656757L378195J406698o94222
14419E4969390l960900o504778q294394p827538n810888m450285k914584k349078
$$ plain form
14411 12856945 11632194 10248728 9391827 8864915 8483472 8456061 8410512 8353198 8620971
14402 8620971 8553876 8343411 8603062 8662106 8908669 9719520 10597617 11627172 13529773
14393 13529773 17041004 22663391 31131482 42589783 55489352 68034620 78303047
14386 78303047 85724070 89554288 90352416 86607841 78435564 65932361 51780876 38895963
14378 38895963 29228779 22395604 17861372 14496788 12526103 11206951 10173370 9739580
14370 9739580 9274908 9116996 8662103 8534486 8615977 8518328 8321870 8339518 8516115 8721457
14360 8721457 9384099 9770171 10987764 12707702 14760662 17490565 22226321 27097853
14352 27097853 33067740 38997435 43895355 47730876 50516598 51897952 52163668 51781757
$$ packed form
14411A2856945j224751j383466q56901n26912l81443k7411m5549n7314K67773
14402H620971o7095k10465K59651N9044K46563Q10851Q78097J029555J902601
14393A3529773L511231N622387Q468091J1458301J2899569J2545268J0268427
14386G8303047P421023L830218P98128l744575q172277j2503203j4151485j2884913
14378C8895963r667184o833175m534232l364584j970685j319152j033581m33790
14370I739580m64672j57912m54893j27617Q1491r7649j96458J7648J76597K05342
14360H721457O62642L86072J217593J719938K052960K729903M735756M871532
14352B7097853N969887N929695M897920L835521K785722J381354K65716l81911
$$ plain form
14344 51781757 50753112 50671015 53633903 59618968 68914897 79367902 89213437 97391206
14336 97391206 104657366 110075926 111462439 107720907 98857287 85852331 71820162 59116619
14328 59116619 48462189 38889314 29674819 22570388 18168248 15058291 12955336 11191717
14320 11191717 9531902 8733682 7676163 6956534 6182826 5786382 5215339 5001336 4773875
14311 4773875 4314961 4291091 4297054 4183380 3910337 3894998 3707720 3475176 3378833 3167995
14301 3167995 3122443 2986140 2889139 2936458 2859857 2841901 2871753 2682963 2568114 2673202
14291 2673202 2579530 2574597 2453078 2491237 2579867 2564416 2425299 2560878 2469754 2614702 2737256
14280 2737256 2628162 2490320 2773833 2609885 2717297 2482147 2776510 2689318 2724677 2762153
$$ packed form
14344E1781757j028645q2097K962888N985065R295929J0453005R845535Q177769
14336I7391206P266160N418560J386513l741532q863620j3004956j4032169j2703543
14328E9116619j0654430r572875r214495p104431m402140l109957k102955j763619
14320A1191717j659815p98220j057519p19629p73708l96444n71043k14003k27461
14311D773875m58914k3870N963j13674k73043j5339j87278k32544r6343k10838
14301C167995m5552j36303r7001M7319p6601j7956K9852j88790j14849J05088
14291B673202r3672m933j21519L8159Q8630j5451j39117J35579r1124J44948J22554
14280B737256j09094j37842K83513j63948J07412k35150K94363q7192L5359L7476
$$ plain form
14270 2762153 2522228 2503770 2533347 2329699 2513259 2314162 2180619 2340648 2424749 2294866
14260 2294866 2349261 2343355 2178603 2122877 2398440 1902855 1898670 1991601 2243918 1830150 2035976
14249 2035976 2050770 2042093 1938594 1924438 2152212 2081082 1874664 1874420 1830924 1722757 1801283
14238 1801283 1935314 1872999 1944276 2118813 1960079 2199981 2106479 1941965 1732957 1931299
14228 1931299 1698691 1723639 1914546 1946851 1822653 1607882 1875321 1747646 1944525 2090337
14218 2090337 2113506 2196059 2210393 2202597 2280659 2485360 2440199 2519244 2565076 2567984 2911997
14207 2911997 3390754 4091779 4214581 4240597 4637555 4388534 4578536 4705551 4033069 2806602
14197 2806602 1947286 1871306 1878474 1925803 2047847 2150679 1966486 2133286 2294417 1965157
$$ packed form
14270B762153k39925j8458K9577k03648J83560j99097j33543J60029Q4101j29883
14260B294866N4395n906j64752n5726K75563m95585m185R2931K52317m13768K05826
14249B035976J4794q677j03499j4156K27774p1130k06418k44m3496j08167P8526
14238A801283J34031o2315P1277J74537j58734K39902r3502j64514k09008J98342
14228A931299k32608K4948J90907L2305j24198k14771K67439j27675J96879J45812
14218B090337K3169Q2553J4334p796P8062K04701m5161P9045M5832K908L44013
14207B911997M78757P01025J22802K6016L96958k49021J90002J27015o72482j226467
14197B806602q59316p5980P168M7329J22044J02832j84193J66800J61131l29260
$$ plain form
14187 1965157 2193739 2173058 2049915 1966281 2098803 1832660 1862475 2041054 2109863 2193120
14177 2193120 2491374 2747308 2884577 2874058 2907318 2806097 2936733 2560165 2382999 2417378
14167 2417378 1829039 2081817 1924665 1885549 1868345 1834167 1845402 2038164 1839529 1861365
14157 1861365 2038889 2223073 2141909 2203944 2240830 2310021 2073806 2369559 2434597 2371761
14147 2371761 2517119 2424792 2256150 2507354 2724552 3043987 3538653 4236347 5267040
14138 5267040 6255980 6967144 7611464 8451396 8664810 8864680 8352261 7612832 6501098
14129 6501098 5723335 4867049 4506773 3776547 3255294 3027513 2859723 2737608 2992366
14120 2992366 3125307 3548232 3685508 3837736 3882997 4055763 3906965 3846361 3680027 3339683
$$ packed form
14187A965157K28582k0681j23143q3634J32522k66143K9815J78579O8809Q3257
14177B193120K98254K55934J37269j0519L3260j01221J30636l76568j77166L4379
14167B417378n88339K52778j57152l9116j7204l4178J1235J92762j98635K1836
14157A861365J77524J84184q1164O2035L6886O9191k36215K95753O5038o2836
14147B371761J45358r2327j68642K51204K17198L19435M94666O97694J030693
14138E267040R88940P11164O44320Q39932K13414J99870n12419p39429j111734
14129F501098p77763q56286l60276p30226n21253k27781j67790j22115K54758
14120B992366J32941M22925J37276J52228M5261J72766j48798o0604j66334l40344
$$ plain form
14110 3339683 3144022 2913155 2444575 2763934 2559458 2651639 2423926 2682162 2777003 2651380
14100 2651380 2920828 3341735 3381532 3664318 4318328 5105424 5413733 5418597 5780598 5857376
14090 5857376 5563464 5399301 5121931 4688173 4738211 4820165 5255704 5814490 6424870 7263957
14080 7263957 7530229 8022798 8312616 8572499 9190127 9619864 9446840 9968637 10880807
14071 10880807 12093045 13759871 15918716 19267009 23351496 29181698 37284998 47631814
14063 47631814 60582136 73816139 85262764 94541339 101079113 104727408 104456342 99458175
14055 99458175 89907533 75775683 60642421 47642542 37239671 29674358 23591571
14048 23591571 19552016 16327345 14215946 12556610 11082409 10076924 9371914 8726333
$$ packed form
14110C339683j95661k30867m68580L19359k04476R2181k27713K58236R4841j25623
14100B651380K69448M20907L9797K82786O54010P87096L08309M864L62001P6778
14090E857376k93912j64163k77370m33758N0038Q1954M35539N58786O10380Q39087
14080G263957K66272M92569K89818K59883O17628M29737j73024N21797R12170
14071A0880807J212238J666826K158845L348293M084487N830202Q103300J0346816
14063D7631814J2950322J3234003J1446625R278575O537774L648295k71066m998167
14055I9458175r550642j4131850j5133262j2999879j0402871p565313o082787
14048B3591571m039555l224671k111399j659336j474201j005485p05010o45581
$$ plain form
14040 8726333 8165198 7743097 6863135 6387145 5740124 5138633 4823174 4322528 4053468
14031 4053468 3934753 3655667 3563396 3383015 3245235 3145184 3020438 3073847 2662290 3017472
14021 3017472 2754429 2738843 2765611 2484604 2597227 2399609 2520038 2582686 2368830 2373248
14011 2373248 2491326 2635988 2384193 2674554 2312750 2337020 2127574 2119719 2259423 2215906
14001 2215906 2004838 2302975 2130986 2003651 2173704 2181875 2026823 2045887 2431516 2543806
13991 2543806 2459574 2878100 2936981 3489613 3866195 4758452 6001646 7212819 8560697
13982 8560697 9721686 10274309 10503152 10546148 10858326 10054087 8963146 7589805 6244429
13973 6244429 4980569 4418315 4045619 3761412 3615553 3523530 3565474 3223784 3179333 3023219
$$ packed form
14040H726333n61135m22101q79962m75990o47021o01491l15459n00646k69060
14031D053468j18715k79086r2271j80381j37780j00051j24746N3409m11557L55182
14021C017472k63043j5586K6768k81007J12623j97618J20429O2648k13856M418
14011B373248J18078J44662k51795K90361l61804K4270k09446p855J39704m3517
14001B215906k11068K98137j71989j27335J70053Q171j55052J9064L85629J12290
13991B543806q4232M18526N8881N52632L76582Q92257J243194J211173J347878
13982H560697J160989N52623K28843M2996L12178q04239j090941j373341j345376
13973F244429j263860n62254l72696k84207j45859r2023M1944l41690m4451j56114
$$ plain form
13963 3023219 2937681 2673706 2653218 2493907 2336582 2255201 2122577 2169539 2192479 2050288
13953 2050288 1926139 2002481 2011982 2183591 2456454 2676463 2739433 2969247 3093842 3313710
13943 3313710 3398670 3472734 4293811 5779952 8047472 10572230 13209729 16446164 18628273
13934 18628273 20909088 22017110 21652907 20413080 18067070 15179409 11905629 9156452
13926 9156452 6112074 4604520 3665700 2983994 2580878 2597160 2162711 1909472 1822083
13917 1822083 1696275 1727189 1881631 1821469 1494864 1665941 1707190 1476989 1666688 1630625
13907 1630625 1839561 1552789 1617115 1252549 1387903 1365626 1480662 1498644 1648873 1395341
13897 1395341 1272222 1446890 1449491 1664635 1480582 1545655 1404519 1434181 1453683 1629330
$$ packed form
13963C023219q5538k63975k0488j59311j57325q1381j32624M6962K2940j42191
13953B050288j24149P6342R501J71609K72863K20009O2970K29814J24595K19868
13943C313710Q4960P4064Q21077J486141K267520K524758K637499L236435K182109
13934A8628273K280815J108022l64203j239827k346010k887661l273780k749177
13926I156452l044378j507554r38820o81706m03116J6282m34449k53239q7389
13917A822083j25808L0914J54442o0162l26605J71077M1249k30201J89699l6063
13907A630625K08936k86772O4326l64566J35354k2277J15036J7982J50229k53532
13897A395341j23119J74668K601K15144j84053O5073j41136K9662J9502J75647
$$ plain form
13887 1629330 1394740 1359651 1471034 1754710 1471399 1529234 1530838 1343473 1476770 1586900
13877 1586900 1576362 1454209 1289279 1175638 1537626 1353831 1514466 1354139 1543136 1336474
13867 1336474 1670523 1340368 1660392 1432958 1691639 1549656 1374128 1790031 1570479
13858 1570479 1601227 1704889 1536064 1641011 1635365 1592658 1646347 1475435 1375566 1692192
13848 1692192 1385059 1532401 1694160 1603253 1585243 1583366 1397699 1600164 1416404 1455170
13838 1455170 1391065 1409500 1357563 1291339 1478668 1153863 1332998 1462706 1528985 1525658 1529139
13827 1529139 1120696 1432154 1452096 1382629 1431017 1163737 1368578 1577234 1357265 1163898
13817 1163898 1064518 1111218 1309484 1151453 1439896 1181459 1277595 1256656 1402938 1169971
$$ packed form
13887A629330k34590l5089J11383K83676k83311N7835J604j87365J33297J10130
13877A586900j0538j22153j64930j13641L61988j83795J60635j60327J88997k06662
13867A336474L34049l30155L20024k27434K58681j41983j75528M15903k19552
13858A570479L0748J03662j68825J04947n646m2707N3689j70912r9869L16626
13848A692192l07133J47342J61759r0907j8010j877j85667K02465j83760L8766
13838A455170o4105J8435n1937o6224J87329l24805J79135J29708O6279l327L481
13827A529139m08443L11458J9942o9467M8388k67280K04841K08656k19969j93367
13817A163898r9380M6700J98266j58031K88443k58437R6136k0939J46282k32967
$$ plain form
13807 1169971 1167281 1378902 1279425 1393858 1283670 1472862 1674493 1537976 1401434 1246484
13797 1246484 1543402 1622225 1235696 1351875 1483358 1357254 1531649 1259783 1360595 1261717
13787 1261717 1389855 1226642 1133325 1292286 1267705 1300124 1346036 1394680 1383587 1240461
13777 1240461 1428975 1437408 1321909 1580807 1837644 1803581 1792252 1623644 1831761 1980402
13767 1980402 1792635 1641438 1482493 1341096 1671856 1555356 1292832 1390103 1406887 1402154
13757 1402154 1213172 1446134 1304050 1224809 1330691 1237521 1271763 1467747 1555285 1614614
13747 1614614 1556434 1385972 1348099 1734535 1602353 1402647 1539019 1586211 1611674 1675435
13737 1675435 1762642 1736751 1618398 1611622 2048761 1730006 1535944 1896655 2011597 1890217
$$ packed form
13807A169971k690K11621r9477J14433j10188J89192K01631j36517j36542j54950
13797A246484K96918P8823l86529J16179J31483j26104J74395k71866J00812r8878
13787A261717J28138j63213r3317J58961k4581L2419M5912M8644j1093j43126
13777A240461J88514Q433j15499K58898K56837l4063j1329j68608K08117J48641
13767A980402j87767j51197j58945j41397L30760j16500k62524R7271J6784m733
13757A402154j88982K32962j42084p9241J05882r3170L4242J95984Q7538N9329
13747A614614n8180j70462l7873L86436j32182j99706J36372M7192K5463O3761
13737A675435Q7207k5891j18353o776M37139l18755j94062L60711J14942j21380
$$ plain form
13727 1890217 1721121 1843991 1710964 1971734 1780652 1986422 2002757 1932043 2099561 1888259
13717 1888259 2049073 2103469 2249163 2119803 2058414 2228059 2287284 2070410 2210618 2322662
13707 2322662 2206843 2241128 2147354 2065150 2237858 2185824 2123938 2068089 2267077 1777153
13697 1777153 1896131 2305887 2461910 2687655 3078108 2876716 2993537 3223833 3124137 2957470
13687 2957470 3090361 2858789 2434218 2142012 1985473 2000874 1998718 2057953 1705237 2155502
13677 2155502 1942492 2001508 2024121 1994852 1944338 1741151 1780795 1965909 2050484 2121081 2364560
13666 2364560 2465254 2820891 2999801 3148246 3299605 3549229 3322479 3547281 3430444
13657 3430444 2866116 2996220 3002459 2527684 2423772 2524404 1987657 2032062 2149001 2085722
$$ packed form
13727A890217j69096J22870j33027K60770j91082K05770J6335p0714J67518k11302
13717A888259J60814N4396J45694j29360o1389J69645N9225k16874J40208J12044
13707B322662j15819L4285r3774q2204J72708n2034o1886n5849J98988m89924
13697A777153J18978M09756J56023K25745L90453k01392J16821K30296r9696j66667
13687B957470J32891k31572m24571k92206j56539J5401k156N9235l52716M50265
13677B155502k13010N9016K2613k9269n0514k03187L9644J85114Q4575P0597K43479
13666B364560J00694L55637J78910J48445J51359K49624k26750K24802j16837
13657C430444n64328J30104O239m74775j03912J00632n36747M4405J16939o3279
$$ plain form
13647 2085722 2046660 2124734 1874914 1957247 2015082 1958506 1932176 2028263 1698401 2054027 2079082
13636 2079082 2137192 2343605 2713868 2751006 2954902 3216352 3162286 3223019 3014353 2938390
13626 2938390 2754929 2290705 1967094 1851239 1977398 1941235 1706421 1800794 1798796 1756809
13616 1756809 1889965 1804828 1590977 1714997 1854393 1804059 2092947 2370285 2202601 2471938
13606 2471938 2119436 2310997 2436742 2343423 2135703 2213232 1830304 1841348 2024827 1793004
13596 1793004 1983954 2069223 1912447 2315020 2330217 2042489 2519836 2494404 2343080 2249429
13586 2249429 2082165 2113256 1783011 1943807 1984490 1553817 1625409 1765395 1853212 1635702
13576 1635702 1683518 1788006 1419024 1760347 1545458 1396358 1494156 1456289 1811199 1712722
$$ packed form
13647B085722l9062P8074k49820Q2333N7835n6576k6330R6087l29862L55626K5055
13636B079082N8110K06413L70263L7138K03896K61450n4066O0733k08666p5963
13626B938390j83461m64224l23611j15855J26159l6163k34814R4373j998m1987
13616A756809J33156q5137k13851J24020J39396n0334K88888K77338j67684K69337
13606B471938l52502J91561J25745r3319k07720P7529l82928J1044J83479k31823
13596A793004J90950Q5269j56776M02573J5197k87728M77347k5432j51324r3651
13586B249429j67264L1091l30245J60796M0683m30673P1592J39986Q7817k17510
13576A635702M7816J04488l68982L41323k14889j49100R7798l7867L54910r8477
$$ plain form
13566 1712722 1589710 1675357 1829412 1736903 1664820 1674257 1858577 1574318 1638501 1756350
13556 1756350 1717021 1448822 1770951 1480263 1494855 1677386 1466909 1616662 1565582 1825963
13546 1825963 1743395 1557382 1942073 2089165 2358630 2534130 2735991 2745732 2757875 2673956
13536 2673956 2606040 2321793 2235690 1999646 1801378 1850897 1681557 1628269 1792465 1902779
13526 1902779 1947376 2269090 2441348 2585675 2598072 2781077 2790845 2536385 2566425 2154529
13516 2154529 1982516 1848316 1711866 1709533 1713553 1319139 1440421 1322557 1299686 1249950
13506 1249950 1259090 1242556 1307537 904417 1275470 1310610 1225409 1344643 1678307 1331650
13496 1331650 1217590 1342561 1484046 1139246 1286755 1422136 1246249 1270874 1249682 1313585
$$ packed form
13566A712722j23012Q5647J54055r2509p2083R437J84320k84259O4183J17849
13556A756350l9329k68199L22129k90688J4592J82531k10477J49753n1080K60381
13546A825963q2568j86013L84691J47092K69465J75500K01861R741J2143q3919
13536B673956o7916k84247q6103k36044j98268M9519j69340n3288J64196J10314
13526A902779M4597L21714J72258J44327J2397J83005R768k54460L0040m11896
13516B154529j72013j34200j36450k333M020l94414J21282j17864k2871m9736
13506A249950R140j6534O4981m03120L71053L5140q5201J19234L33664l46657
13496A331650j14060J24971J41485l44800J47509J35381j75887K4625k1192O3903
$$ plain form
13486 1313585 1422753 1474071 1421599 1341091 1414441 1210812 1161042 1338758 1271695 1357715 1254519
13475 1254519 1267105 1249944 1242347 1164388 1311878 1229071 1130413 1371741 1395246 1430772 1253686
13464 1253686 1273477 1274424 1397439 1238297 1420279 1471752 1438109 1700892 1541262 1412164
13454 1412164 1866421 1833915 2025935 2430556 2666135 2674762 3050422 2883881 2619986 2530378
13444 2530378 2464484 2200751 2008340 1640109 1664232 1462659 1617891 1740030 1394977 1410240
13434 1410240 1402520 1251724 1503346 1614216 1414922 1552979 1352561 1440749 1597344 1591591
13424 1591591 1862164 1956540 2255182 2369783 2463264 2534531 2982046 2924769 2723165 2870367
13414 2870367 2490456 2426545 2152900 1932167 1709933 1812376 1554042 1620572 1425805 1571839
$$ packed form
13486A313585J09168N1318n2472q0508P3350k03629m9770J77716o7063Q6020j03196
13475A254519J2586j7161p597p7959J47490q2807r8658K41328K3505L5526j77086
13464A253686J9791R47J23015j59142J81982N1473l3643K62783j59630j29098
13454A412164M54257l2506J92020M04621K35579Q627L75660j66541k63895q9608
13444B530378o5894k63733j92411l68231K4123k01573J55232J22139l45053J5263
13434A410240p720j50796K51622J10870j99294J38057k00418Q8188J56595n753
13424A591591K70573R4376K98642J14601R3481P1267M47515n7277k01604J47202
13414B870367l79911o3911k73645k20733k22234J02443k58334O6530j94767J46034
$$ plain form
13404 1571839 1680619 1736472 1437463 1688509 1570417 1608676 1689340 1618049 1508332 1592522
13394 1592522 1530227 1777183 1574079 1750968 2007502 2072483 2106102 1940174 2203189 2102736
13384 2102736 2315103 2705863 2652313 2816033 2630489 2643949 2724611 2633681 2395829 2248960
13374 2248960 2375267 2141106 2097696 2007415 1859568 2151003 2220101 2181544 2370083 2062515
13364 2062515 2334181 2140134 2361707 2322233 2268549 2181690 2209429 2285587 1911404 2508987
13354 2508987 2499578 2581247 2521928 2746516 2749579 2760607 2765315 2678331 2441520 2461411 2220400
13343 2220400 2268213 2100558 2030066 2349339 2463792 2092432 2381575 2148141 2211114 2119755
13333 2119755 2254219 2273812 2264201 2188181 2322857 2135983 2165727 2303537 2294622 2190264 2326503
$$ packed form
13404A571839J08780N5853k99009K51046j18092L8259Q0664p1291j09717Q4190
13394A592522o2295K46956k03104J76889K56534O4981L3619j65928K63015j00453
13384B102736K12367L90760n3550J63720j85544J3460Q0662r0930k37852j46869
13374B248960J26307k34161m3410r0281j47847K91435O9098l8557J88539l07568
13364B062515K71666j94047K21573l9474n3684q6859K7739P6158l74183N97583
13354B508987r409Q1669n9319K24588L063J1028M708q6984k36811J9891k41011
13343B220400M7813j67655p0492L19273J14453l71360K89143k33434O2973r1359
13333B119755J34464J9593r611p6020J34676j86874K9744J37810q915j04358J36239
$$ plain form
13322 2326503 2295661 2190106 2480067 2105847 2282056 2381687 2515115 2808051 2811383 2881422
13312 2881422 3182947 3037407 3289795 3344846 3268131 3136221 3254275 2936266 2983475 2714914
13302 2714914 3009507 2937467 3138566 3053162 3270954 3436258 3591842 3437739 3571401 3581217
13292 3581217 3759630 3515709 3530719 3385081 3289671 3100305 3218187 3307119 3404838 3230000
13282 3230000 3194087 3248661 3302294 3315033 3457639 3318113 3361752 3591117 3692906 3727886
13272 3727886 3632166 3689717 3724687 3769902 3630091 3838720 3989653 4046866 4058873 3947610
13262 3947610 4080669 4269005 4204627 4001946 4474415 4615751 4544509 4789795 4884674 5060677
13252 5060677 5439807 5534528 5423415 5610449 5552356 5951961 6223368 6139964 6183750 6405670
$$ packed form
13322B326503l0842j05555K89961l74220J76209R9631J33428K92936L332P0039
13312B881422L01525j45540K52388N5051p6715j31910J18054l18009M7209k68561
13302B714914K94593p2040K01099q5404K17792J65304J55584j54103J33662R816
13292C581217J78413k43921J5010j45638r5410j89366J17882Q8932R7719j74838
13282C230000l5913N4574N3633J2739J42606j39526M3639K29365J01789L4980
13272C727886r5720N7551L4970M5215j39811K08629J50933N7213J2007j11263
13262C947610J33059J88336o4378k02681M72469J41336p1242K45286R4879J76003
13252E060677L79130R4721j11113J87034n8093L99605K71407q3404M3786K21920
$$ plain form
13242 6405670 6550497 6454404 6641447 6467886 6441286 6539543 6906386 6608318 6900290 6818378
13232 6818378 7233632 7241126 7131290 7418421 7788646 7836129 8183567 8467747 8644243 9153150
13222 9153150 9231389 9262995 9538373 9475923 9545653 9723508 9478179 9534314 9278533 9050085
13212 9050085 9070371 8932467 8713511 8457762 8287653 8254319 7995434 7794508 8032017 7883970
13202 7883970 7652633 7952159 8031219 7798355 7821882 7836928 7608039 7700168 7584828 7498180
13192 7498180 7359449 7252092 6868472 6833491 6760822 6493881 6361074 5972265 5970195 5955597
13182 5955597 5764233 5786745 5288224 5122911 5130174 4970176 4992972 4665920 4578582 4772413
13172 4772413 4509001 4565133 4379131 4447753 4831954 4438910 4579986 4603308 4808486 5047779
$$ packed form
13242F405670J44827r6093J87043j73561k6600R8257L66843k98068K91972q1912
13232F818378M15254P494j09836K87131L70225M7483L47438K84180J76496N08907
13222I153150P8239L1606K75378o2450O9730J77855k45329N6135k55781k28448
13212I050085K0286j37904k18956k55749j70109l3334k58885k00926K37509j48047
13202G883970k31337K99526P9060k32864K3527J5046k28889R2129j15340q6648
13192G498180j38731j07357l83620l4981p2669k66941j32807l88809k070j4598
13182E955597j91364K2512m98521j65313P263j59998K2796l27052q7338J93831
13172D772413k63412N6132j86002O8622L84201l93044J41076K3322K05178K39293
$$ plain form
13162 5047779 5236640 5360017 5860302 6079014 6337431 6670052 6874466 6797069 6963304 7016996
13152 7016996 6812859 6619674 6566078 6592627 6341048 6411807 6320146 6323569 6261490 6183193 6174275
13141 6174275 6004123 5844337 5712732 5312956 5082577 4810971 4558079 4161214 4152048 4026124
13131 4026124 3728730 3807482 3682130 3773281 3941949 3956527 3710002 3941619 4117370 3927299
13121 3927299 3690110 3719621 3561827 3369846 3589872 3268166 3196285 3090729 3065327 3136177
13111 3136177 3273040 2931621 3162152 3549424 3399428 3420210 3228941 3548587 3839509 3951728
13101 3951728 3999536 4127353 4629917 4695874 5143432 5740953 6012576 6517532 6572521 6649747
13091 6649747 6905850 6980598 7259335 7143864 7157345 7012804 6989740 6888406 6718274 6855338
$$ packed form
13162E047779J88861J23377N00285K18712K58417L32621K04414p7397J66235N3692
13152G016996k04137j93185n3596K6549k51579P0759r1661L423o2079p8297q918
13141F174275j70152j59786j31605l99776k30379k71606k52892l96865r166j25924
13131D026124k97394P8752j25352R1151J68668J4578k46525K31617J75751j90071
13121C927299k37189K9511j57794j91981K20026l21706p1881j05556k5402P0850
13111C136177J36863l41419K30531L87272j49996K0782j91269L19646K90922J12219
13101C951728M7808J27817N02564O5957M47558N97521K71623N04956N4989P7226
13091F649747K56103P4748K78737j15471J3481j44541k3064j01334j70132J37064
$$ plain form
13081 6855338 6496974 6653343 6436369 5830128 5592130 5271668 4605066 4473420 4143956
13072 4143956 4048946 3775819 3828881 3468309 3342074 3278262 3324342 3291000 3164211 3290052
13062 3290052 3133998 3152529 3177535 3215358 3356992 3613231 3615717 3747406 3796312 3563807
13052 3563807 3516895 3535978 3378277 3506708 3297808 3303324 3366876 3356003 3199279 3410179
13042 3410179 3368466 3373314 3570672 3415739 3390073 3784213 3819892 3647056 3624063 3775753
13032 3775753 3983453 3825400 4084078 3897856 4200720 4005983 4208263 4153219 4022827 4015254
13022 4015254 3897253 4173986 4367583 4199214 4454736 4442965 4312457 4434757 4510976 4442882
13012 4442882 4437046 4603688 4322766 4765683 4747209 4607351 4852582 4781976 4874388 4701729
$$ packed form
13081F855338l58364J56369k16974o06241k37998l20462o66602j31646l29464
13072D143956r5010k73127N3062l60572j26235o3812M6080l3342j26789J25841
13062C290052j56054J8531K5006L7823J41634K56239K486J31689M8906k32505
13052C563807m6912J9083j57701J28431k08900N516O3552j0873j56724K10900
13042C410179m1713M848J97358j54933k5666L94140L5679j72836k2993J51690
13032C775753K07700j58053K58678j86222L02864j94737K02280n5044j30392p573
13022D015254j18001K76733J93597j68369K55522j1771j30508J22300P6219o8094
13012D442882n836J66642k80922M42917j8474j39858K45231p0606R2412j72659
$$ plain form
13002 4701729 5044964 5095545 5034656 4806639 5165684 5077530 5113519 5255489 5459612 5466598
12992 5466598 5500177 5336571 5462869 5473730 5440217 5478547 5421505 5300726 5282823 5087194
12982 5087194 4974391 5004424 5304196 5443757 5231017 5169197 5115942 5149794 5013294 5008513
12972 5008513 4951856 4883163 4968590 4632978 4909369 4881878 4912647 4900394 4852285 4644266 4787424
12961 4787424 4473514 4597875 4690306 4675186 4615193 4525627 4965413 4635214 4891584 4558149
12951 4558149 4661601 4820655 4701867 4752525 4906979 4872934 4708728 4678879 4881080 4782073
12941 4782073 4709503 4421056 4640658 4736347 4658953 4654225 4660838 4856044 4776741 4708044 4824946
12930 4824946 4891843 4678799 4745924 4672156 4562976 4625454 4490227 4389503 4137712 4459189
$$ packed form
13002D701729L43235N0581o0889k28017L59045q8154L5989J41970K04123O986
12992E466598L3579j63606J26298J0861l3513L8330n7042j20779j7903j95629
12982E087194j12803L0033K99772J39561k12740o1820n3255L3852j36500m781
12972E008513n6657o8693Q5427l35612K76391k7491L0769j2253m8109k08019J43158
12961D787424l13910J24361R2431j5120n9993q9566M39786l30199K56370l33435
12951D558149J03452J59054j18788N0658J54454l4045j64206k9849K02201r9007
12941D782073p2570k88447K19602R5689p7394m728O613J95206p9303o8697J16902
12930D824946O6897k13044O7125p3768j09180O2478j35227j00724k51791L21477
$$ plain form
12920 4459189 4333985 4151422 4415193 4260927 4184625 4350955 4151849 3799616 3901031 3993205
12910 3993205 3882891 3908337 3652770 3862154 3665225 3789588 3690463 3509814 3280668 3309316
12900 3309316 3238863 3228357 3409908 3134846 3238465 2979324 3005962 3271987 3127789 2957002
12890 2957002 3032012 3216714 2917711 3064130 3096642 2945065 2850013 3027645 3124697 3143619
12880 3143619 2984626 3191040 3147352 2880335 2972776 3076694 3068341 2852255 2790615 2965745
12870 2965745 2903503 2730670 2602399 2595515 2809689 2635355 2607828 2820448 2801064 2539648
12860 2539648 2584564 2714581 2940236 2522943 2745519 2665180 2739395 2970648 2717812 2580102
12850 2580102 2742197 2667508 2762991 2520762 2739831 2772395 2733033 2690869 2515181 2696469
$$ packed form
12920D459189j25204j82563K63771j54266p6302J66330j99106l52233J01415R2174
12910C993205j10314K5446k55567K09384j96929J24363r9125j80649k29146K8648
12900C309316p0453j0506J81551k75062J03619k59141K6638K66025j44198j70787
12890B957002P5010J84702k99003J46419L2512j51577r5052J77632R7052J8922
12880C143619j58993K06414m3688k67017R2441J03918q353k16086o1640J75130
12870B965745o2242j72833j28271o884K14174j74334k7527K12620j9384k61416
12860B539648M4916J30017K25655m17293K22576q0339P4215K31253k52836j37710
12850B580102J62095p4689R5483k42229K19069L2564l9362m2164j75688J81288
$$ plain form
12840 2696469 2843345 2774871 2537896 2590658 2540828 2813931 2770126 2671098 2594577 2748084
12830 2748084 2453961 2440717 2849069 2644800 2689134 2581685 2646990 2565014 2825290 2874375
12820 2874375 2854585 2707033 2827963 2769691 2716450 2447727 2512341 2460781 2860145 2755672
12810 2755672 2926414 2807754 2645036 2616508 3029144 2828140 2687940 2675066 3031765 2931034
12800 2931034 2727196 2721442 3056687 2959791 2816295 3178997 2918535 2829692 2738335 2920382
12790 2920382 2815335 2911881 2845413 3069632 2977959 2920831 3081516 2971780 2977262 3100800
12780 3100800 2938486 2804172 2846599 2953209 2823252 2942423 2782431 2966466 2888858 3133581
12770 3133581 2983994 3003003 3126057 3039649 3064036 2877543 2982785 3132719 2879687 3011314
$$ packed form
12840B696469J46876o8474k36975N2762m9830K73103m3805r9028p6521J53507
12830B748084k94123j3244M08352k04269M4334j07449O5305q1976K60276M9085
12820B874375j9790j47552J20930n8272n3241k68723O4614n1560L99364j04473
12810B755672J70742j18660j62718k8528M12636k01004j40200j2874L56699j00731
12800B931034k03838n754L35245r6896j43496L62702k60462q8843r1357J82047
12790B920382j05047R6546o6468K24219r1673n7128J60685j09736N482J23538
12780C100800j62314j34314M2427J06610j29957J19171j59992J84035p7608K44723
12770C133581j49587J9009J23054q6408K4387j86493J05242J49934k53032J31627
$$ plain form
12760 3011314 2865701 3082800 3155880 2967772 3172245 2882868 3096902 2929449 3200074 2826332
12750 2826332 3107847 3090981 2738257 3012306 2929384 3177528 2931813 3200100 2887709 3121874
12740 3121874 2818528 2786294 2963823 3070781 2958054 2986692 3144696 3160193 3252091 3137750
12730 3137750 2983845 3048388 3197772 3103869 2932376 3134443 3136969 3553726 3402805 3149048
12720 3149048 3128255 3126866 3291851 3186471 3022959 3352317 3263741 3467881 3411522 3143297
12710 3143297 3460600 3303971 3445252 3285594 3536391 3706268 3840712 3798473 4007495 4111103
12700 4111103 4366603 4302221 4445162 4615497 4701387 4964814 5257786 5656861 5633808 5968725
12690 5968725 6162554 6598147 7043387 7714599 7568661 7539450 7512169 7392046 7239365 6787682
$$ packed form
12760C011314j45613K17099P3080j88108K04473k89377K14034j67453K70625l73742
12750B826332K81515j6866l52724K74049q2922K48144k45715K68287l12391K34165
12740C121874l03346l2234J77529J06958j12727K8638J58004J5497R1898j14341
12730C137750j53905O4543J49384r3903j71493K02067K526M16757j50921k53757
12720C149048k0793j389J64985j05380j63512L29358q8576K04140n6359k68225
12710C143297L17303j56629J41281j59658K50797J69877J34444m2239K09022J03608
12700D111103K55500o4382J42941J70335Q5890K63427K92972L99075k3053L34917
12690E968725J93829M35593M45240O71212j45938k9211k7281j20123j52681m51683
$$ plain form
12680 6787682 6193290 5569560 5027601 4720361 4452298 4564522 4386042 4501674 4710967
12671 4710967 4733820 4567211 4488855 4600043 4747260 5026457 5130897 5098496 4976449 5047066
12661 5047066 5196144 5155231 5014141 5190227 5259590 5270103 5604959 5730600 6096830 5958035
12651 5958035 6404960 6295456 6555661 6766748 6522633 6470694 6346169 6050197 6228758 6205053
12641 6205053 6422676 6456078 6530654 6855217 6882706 7109308 7332777 7517378 7457064 7529544
12631 7529544 7679506 7568912 7900460 7592620 7819438 7482718 7181914 6868498 6499033
12622 6499033 6432076 6237168 5779645 5734173 5416047 5269729 4946217 5039527 4992834 5042325
12612 5042325 5384138 5715333 6195924 7158813 7695229 8365114 8714022 9308701 9753440
$$ packed form
12680F787682n94392o23730n41959l07240k68063J12224j78480J15632K09293
12671D710967K2853j66609p8356J11188J47217K79197J04440l2401j22047P0617
12661E047066J49078m0913j41090J76086O9363J0513L34856J25641L66230j38795
12651E958035M46925j09504K60205K11087k44115n1939j24525k95972J78561k3705
12641F205053K17623L3402P4576L24563K7489K26602K23469J84601o0314P2480
12631G529544J49962j10594L31548l07840K26818l36720l00804l13416l69465
12622F499033o6957j94908m57523m5472l18126j46318l23512R3310m6693M9491
12612E042325L41813L31195M80591R62889N36416O69885L48908N94679M44739
$$ plain form
12603 9753440 10073595 9672259 9366173 8835083 8228245 7746856 7148162 6549173 6155936
12594 6155936 6108193 5877000 5869339 5885071 6090044 5987911 6022569 6031343 6184008 6011814 6048805
12583 6048805 5913928 5535869 5664878 5886987 6190786 6539232 7055116 7509704 7589622 7697661
12573 7697661 7847107 7850405 7583535 7102589 6324511 5849573 5320720 5099420 5024010 4690133
12563 4690133 4517529 4870017 4807528 4819566 4860965 5058505 4856949 4874511 4779951 4893684
12553 4893684 4931494 4811265 4907647 4850313 4978263 4976898 4967964 4909757 5142872 5191547 5135006
12542 5135006 5109708 5251935 5457983 5835106 5779622 6119226 6085312 6021362 5932822 5639001
12532 5639001 5553961 5141655 5099217 4795488 4623136 4836783 4838826 4796945 4705466 5049005
$$ packed form
12603I753440L20155m01336l06086n31090o06838m81389n98694n98989l93237
12594F155936m7743k31193p661J5732K04973j02133L4658Q774J52665j72194L6991
12583F048805j34877l78059J29009K22109L03799L48446N15884M54588P9918J08039
12573G697661J49446L298k66870m80946p78078m74938n28853k21300p5410l33877
12563D690133j72604L52488o2489J2038M1399J97540k01556J7562r4560J13733
12553D893684L7810j20229R6382n7334J27950j365q934n8207K33115M8675n6541
12542E135006k5298J42227K06048L77123n5484L39604l3914o3950q8540k93821
12532E639001q5040m12306m2438l03729j72352K13647K043m1881r1479L43539
$$ plain form
12522 5049005 4842708 5000272 4967817 5085006 5068652 5086922 5053098 5035015 5338805 5384270
12512 5384270 5749055 6431811 7036253 7461976 7671160 7686394 7727938 7702821 7591815 7044849
12502 7044849 6390664 5782772 5609705 5455026 5234819 5366969 5308233 5267213 5225879 5348705
12492 5348705 5306161 5655610 5252695 5319048 5376292 5467909 5498625 5305532 5616568 5522363
12482 5522363 6026028 6034585 6293146 6502992 6418006 6789681 6708253 6703524 6558926 6108225
12472 6108225 5798506 5651755 5483657 5466804 5680735 5324781 5551688 5742681 5725023 5633723
12462 5633723 5489930 5595510 5686120 5895728 5779363 5839385 5857352 6107337 6425813 6200178
12452 6200178 6463388 6294705 6566154 6764041 6905870 7116060 7428005 7470311 7799556 7934594
$$ packed form
12522E049005k06297J57564l2455J17189j6354J8270l3824j8083L03790M5465
12512E384270L64785O82756O04442M25723K09184J5234M1544k5117j11006n46966
12502G044849o54185o07892j73067j54679k20207J32150n8736m1020m1334J22826
12492E348705m2544L49449m02915O6353N7244R1617L0716j93093L11036r4205
12482E522363N03665Q557K58561K09846q4986L71675q1428m729j44598m50701
12472F108225l09719j46751j68098j6853K13931l55954K26907J90993j7658r1300
12462E633723j43793J05580R0610K09608j16365O0022J7967K49985L18476k25635
12452F200178K63210j68683K71449J97887J41829K10190L11945M2306L29245J35038
$$ plain form
12442 7934594 8177165 8496335 8816341 8864244 9288566 9245877 9711252 9553732 9453988 9667518
12432 9667518 9881293 9834460 9975196 10069804 10234528 10339505 9994951 10310633 10183738 10440173
12422 10440173 10595995 10463340 10759835 10750146 11259542 11293884 11694108 12253110 12826894 13156248
12412 13156248 13874058 14003809 14426722 14945266 15201666 15259481 15262680 15026406 15056172 14860398
12402 14860398 14748615 14560989 14364433 14316948 14005003 13743866 13384810 13468131 13261639 13369475
12392 13369475 13266620 13429043 13367003 13678549 14057233 14350075 14450510 14857051 15329796
12383 15329796 15536294 15860798 16024039 16471121 16649067 16480364 16829614 16812954 17070091
12374 17070091 16835139 16797947 16572098 16535994 16477571 16269666 16337496 16095031 15918918 15729216
$$ packed form
12442G934594K42571L19170L20006M7903M24322m2689M65375j57520r9744K13530
12432I667518K13775m6833J40736R4608J64724J04977l44554L15682j26895K56435
12422A0440173J55822j32655K96495r689N09396L4342M00224N59002N73784L29354
12412A3156248P17810J29751M22913N18544K56400N7815L199k36274K9766j95774
12402A4860398j11783j87626j96556m7485l11945k61137l59056Q3321k06492J07836
12392A3369475j02855J62423o2040L11546L78684K92842J00435M06541M72745
12383A5329796K06498L24504J63241M47082J77946j68703L49250j6660K57137
12374A7070091k34952l7192k25849l6104n8423k07905O7830k42465j76113j89702
$$ plain form
12364 15729216 15544772 15816733 15593337 15300203 15129092 15114409 14698567 14813692 14605262
12355 14605262 14462897 14292289 14339013 14115189 13937776 13928912 13523632 13393723 13175259 13146991
12345 13146991 12703231 12765751 12634989 12731932 12914577 13152176 13355974 13627571 13684896 13967775
12335 13967775 14437538 14817567 15069281 15368227 15827011 15723961 16014556 16653724 16701829
12326 16701829 16963347 16913815 17361716 17299651 17685704 17727238 17745552 17673729 17819942 17777313
12316 17777313 17894864 17661804 17710136 17883705 17626136 17744333 18174193 18296877 18362173 18601417
12306 18601417 19091485 19184757 19553975 19622319 20189089 20313173 20251055 20108028 19762711 19586013
12296 19586013 19159574 18543249 18185700 18029394 17561480 17161144 17242340 17168574 17117609 16748712
$$ packed form
12364A5729216j84444K71961k23396k93134j71111j4683m15842J15125k08430
12355A4605262j42365j70608M6724k23824j77413q864m05280j29909k18464k8268
12345A3146991m43760O2520j30762R6943J82645K37599K03798K71597N7325K82879
12335A3967775M69763L80029K51714K98946M58784j03050K90595O39168M8105
12326A6701829K61518m9532M47901o2065L86053M1534J8314p1823J46213m2629
12316A7777313J17551k33060M8332J73569k57569J18197M29860J22684O5296K39244
12306A8601417M90068R3272L69218O8344N66770J24084o2118j43027l45317j76698
12296A9586013m26439o16325l57549j56306m67914m00336Q1196p3766n0965l68897
$$ plain form
12286 16748712 16509129 16032064 15558639 15212931 14454302 14020798 13527361 13204148 12871427
12277 12871427 12651997 12371898 12019515 11923943 11739978 11710178 11392459 11442435 11491621 11520579
12267 11520579 11591460 11444933 11375103 11230657 11397004 11385484 11626296 11166382 11447121 11262726
12257 11262726 11382421 11295569 11788012 11998364 12245787 12698607 13296854 13579142 14346288
12248 14346288 15117030 15845465 16760721 17744594 18601458 19749004 20373859 21038063 21645997
12239 21645997 22192924 22047972 22098287 21808884 21515765 21671231 21096674 21251467 20898852
12230 20898852 20968611 20887544 20625445 20234446 19453879 18635901 17908584 16787615 16032501
12221 16032501 14819239 14085221 13205133 12441736 12223461 11965867 11645407 11327522 11342801
$$ packed form
12286A6748712k39583m77065m73425l45708p58629m33504m93437l23213l32721
12277A2871427k19430k80099l52383r5572j83965k9800l17719M9976M9186K8958
12267A1520579P0881j46527o9830j44446J66347j1520K40812m59914K80739j84395
12257A1262726J19695q6852M92443K10352K47423M52820N98247K82288P67146
12248A4346288P70742P28435R15256R83873Q56864J147546O24855O64204O07934
12239B1645997N46927j44952N0315k89403k93119J55466n74557J54793l52615
12230B0898852O9759q1067k62099l90999p80567q17978p27317j120969p55114
12221A6032501j213262p34018q80088p63397k18275k57594l20460l17885J5279
$$ plain form
12212 11342801 10821473 10767343 10570357 10380580 9969427 9762524 9454488 9319814 9207067
12203 9207067 9089298 9346240 9007461 9211837 9185125 9030216 9269001 9423222 9434652 9410101
12193 9410101 9333549 9194498 9649988 9653882 9774045 9972629 10095380 10320883 10542245 10560206
12183 10560206 10969609 10985945 11277440 11242130 11308706 11315590 11652931 11670553 11313770 10972059
12173 10972059 11031094 11055139 11000018 10925022 11357106 11442355 11248363 11798436 11749107 11968185
12163 11968185 12104263 12503427 13513887 14019474 14587792 15169319 15595487 15703459 16068210
12154 16068210 15616367 15191334 14696170 14431184 14246849 14163766 14655018 15033331 15389114
12145 15389114 15749971 16332360 16629802 16840071 17349190 17714510 17870751 18294050 18498466
$$ packed form
12212A1342801n21328n4130j96986j89777m11153k06903l08036j34674j12747
12203I207067j17769K56942l38779K04376k6712j54909K38785J54221J1430k4551
12193I410101p6552j39051M55490L894J20163J98584J22751K25503K21362J7961
12183A0560206M09403J6336K91495l5310O6576O884L37341J7622l56783l41711
12173A0972059N9035K4045n5121p4996M32084Q5249j93992N50073m9329K19078
12163A1968185J36078L99164J010460N05587N68318N81527M26168J07972L64751
12154A6068210m51843m25033m95164k64986j84335q3083M91252L78313L55783
12145A5389114L60857N82389K97442K10269N09119L65320J56241M23299K04416
$$ plain form
12136 18498466 19128722 19745738 20962347 21727662 23043786 24513644 25776446 27811561
12128 27811561 29632267 31415867 33049150 34917310 35839226 36857697 37760539 37847133 38116479
12119 38116479 38061836 37477188 37032534 36837452 36319378 36016402 35699408 35210202 34942568
12110 34942568 34707745 34222907 33822405 33622245 33393970 33332276 33247626 33701832 33965519 34353771
12100 34353771 35058839 35388658 35538138 35467982 35331815 35049522 34358800 33137545 32210901
12091 32210901 31331991 30908254 30630362 30969262 31289862 31911343 32904345 33617686 34197366
12082 34197366 35012771 35250074 35336019 35064375 34615417 34560667 34406846 34292324 34174350 34062798
12072 34062798 33646687 33461787 33065680 32679707 32007672 31200780 30074310 29218827 27912629
$$ packed form
12136A8498466O30256O17016J216609P65315J316124J469858J262802K035115
12128B7811561J820706J783600J633283J868160R21916J018471R02842Q6594K69346
12119C8116479n4643n84648m44654j95082n18074l02976l16994m89206k67634
12110C4942568k34823m84838m00502k00160k28275o1694q4650M54206K63687L88252
12100C4353771P05068L29819J49480p0156j36167k82293o90722j221255r26644
12091C2210901q78910m23737k77892L38900L20600O21481R93002P13341N79680
12082C4197366Q15405K37303Q5945k71644m48958n4750j53821j14522j17974j11552
12072C4062798m16111j84900l96107l85973o72035q06892j126470q55483j306198
$$ plain form
12063 27912629 27050053 25930538 25440914 24814403 24139948 23696215 23633105 23323123 23082492
12054 23082492 22512781 22146531 21720815 21244561 21012750 20590930 20305825 19961460 19777899
12045 19777899 19585575 19036951 18673700 18429256 18153584 17776162 17397853 17055674 16576584
12036 16576584 16174280 15831031 15495118 15405035 15475850 15605364 15873426 16115716 16583648 16805405
12026 16805405 17218470 17165770 16954635 16876774 16067472 15539876 14988566 14407752 13913367 13294033
12016 13294033 13475252 13339507 13256910 12971811 12911208 12682928 12559906 12032085 11585249 10991863
12006 10991863 11178798 11304407 11280913 11276460 11829797 11823895 11977634 12448200 12389858 12300633
11996 12300633 11748755 11347281 11030861 10563788 10179590 9856415 9663702 9595396 9573298 9631061
$$ packed form
12063B7912629q62576j119515m89624o26511o74455m43733o3110l09982k40631
12054B3082492n69711l66250m25716m76254k31811m21820k85105l44365j83561
12045A9777899j92324n48624l63251k44444k75672l77422l78309l42179m79090
12036A6576584m02304l43249l35913r0083P0815J29514K68062K42290M67932K21757
12026A6805405M13065n2700k11135p7861q09302n27596n51310n80814m94385o19334
12016A3294033J81219j35745q2597k85099o0603k28280j23022n27821m46836n93386
12006A0991863J86935J25609k3494m453N53337n902J53739M70566n8342q9225
11996A2300633n51878m01474l16420m67073l84198l23175j92713o8306k2098N7763
$$ plain form
11986 9631061 9823409 9447506 9297634 9170848 8842800 8517249 8314286 7723013 7566749
11977 7566749 7520391 7541986 7388057 7405292 7297736 6922111 7034773 6802643 6507061 6397904
11967 6397904 6165794 5997345 5844210 5713907 5644408 5518788 5383810 5606124 5594940 6028631
11957 6028631 5982198 5936376 6237559 6550992 6628745 6491077 6580660 6388794 6385376 6228879
11947 6228879 6535121 6337227 6479422 6433965 6858186 7248885 7272242 7502247 7501355 7366092
11937 7366092 7877503 7784860 7858843 7966580 7745525 8052018 7848012 7944963 8009871 7790888
11927 7790888 7875742 7645065 7534498 7273940 7468031 6922468 6755852 6693214 6335789 6597386
11917 6597386 6313721 6261398 6242790 6150148 6094962 6028699 6190822 6146006 7031817 8663637
$$ packed form
11986I631061J92348l75903j49872j26786l28048l25551k02963n91273j56264
11977G566749m6358K1595j53929J7235j07556l75625J12662k32130k95582j09157
11967F397904k32110j68449j53135j30303o9499j25620j34978K22314j1184M33691
11957F028631m6433m5822L01183L13433P7753j37668Q9583j91866l418j56497
11947F228879L06242j97894J42195m5457M24221L90699K3357K30005q92j35263
11937G366092N11411r2643P3983J07737k21055L06493k04006R6951O4908k18983
11927G790888Q4854k30677j10567k60558J94091n45563j66616o2638l57425K61597
11917F597386k83665n2323j8608r2642n5186o6263J62123m4816Q85811J631820
$$ plain form
11907 8663637 10982311 12629862 13560663 13855811 14003866 13902367 13856517 12559332 10205283
11898 10205283 7549452 6010207 5513533 5568753 5420440 5173725 5391208 5363747 5310836
11889 5310836 5675568 5998315 6469435 6809955 7753151 8300687 9152435 9695318 10006665
11880 10006665 10459496 10589851 10410983 10063319 9553572 9006634 8138487 7618405 7298643
11871 7298643 6805601 6430597 6090974 5739118 5253314 5085086 4819965 4957005 4674768
11862 4674768 4747782 4349741 4510734 4417682 4475615 4501115 4413182 4555202 4885722 4580881
11852 4580881 4640263 4878217 5046468 5060396 5297972 5425250 5979019 5931826 6506138 6984220
11842 6984220 7614786 8081653 8477499 8784440 8792186 8889595 8775708 8692379 8031312 7680889
$$ packed form
11907H663637K318674J647551R30801K95148J48055j01499m5850j297185k354049
11898A0205283k655831j539245m96674N5220j48313k46715K17483k7461n2911
11889E310836L64732L22747M71120L40520R43196N47536Q51748N42883L11347
11880A0006665M52831J30355j78868l47664n09747n46938q68147n20082l19762
11871G298643m93042l75004l39623l51856m85804j68228k65121J37040k82237
11862D674768P3014l98041J60993r3052N7933K5500q7933J42020L30520l04841
11852D580881N9382K37954J68251J3928K37576J27278N53769m7193N74312M78082
11842F984220O30566M66867L95846L06941P746R7409j13887q3329o61067l50423
$$ plain form
11832 7680889 7459476 7291578 7487558 7567377 7611426 7563812 7466910 7233017 6655664 6402884
11822 6402884 5659259 5214179 4903679 4541746 4257844 4092593 4147171 3944034 4029499 3910475
11812 3910475 4092368 3773484 3917868 3798886 3450746 3491046 3586387 3651503 3585754 3647695
11802 3647695 3415014 3668418 3429360 3803899 3569524 3636344 3683430 3599460 3647536 3758851
11792 3758851 3874564 3974568 4643305 4951573 5379493 5829958 6388563 6277927 6458555
11783 6458555 6387237 6243540 5877091 5707223 4925456 4623429 4104876 3771406 3442246 3377761
11773 3377761 3258542 3310638 3149799 3091508 3007803 2933033 2948623 3226383 2970279 2956883
11763 2956883 3123192 2687881 2915329 2857994 2775180 2979511 2968008 2732428 2838963 2495910
$$ packed form
11832G680889k21413j67898J95980P9819M4049m7614r6902k33893n77353k52780
11822F402884p43625m45080l10500l61933k83902j65251N4578k03137Q5465j19024
11812C910475J81893l18884J44384j18982l48140M0300R5341O5116o5749O1941
11802C647695k32681K53404k39058L74539k34375O6820M7086q3970M8076J11315
11792C758851J15713J00004O68737L08268M27920M50465N58605j10636J80628
11783F458555p1318j43697l66449j69868p81767l02027n18553l33470l29160o4485
11773C377761j19219N2096j60839n8291q3705p4770J5590K77760k56104j3396
11763B956883J66309m35311K27448n7335q2814K04331j1503k35580J06535l43053
$$ plain form
11753 2495910 2738937 2882009 3011376 2860399 2909650 2976406 2944885 2958774 2991068 2935794
11743 2935794 2949802 3029432 2709621 2846076 2770412 2663400 2724448 2827287 2661827 2559421
11733 2559421 2824687 2843630 2748253 2736012 2536770 2605711 2501696 2721662 2521877 2671852
11723 2671852 2659734 2725485 2730327 2868456 2673341 2675188 2569932 2861660 2449030 2664550
11713 2664550 2675762 2728317 2832545 2552517 2495221 2639431 2716592 2667851 2388554 2570960
11703 2570960 2592625 2761109 2769688 2710550 2778596 2488039 2814181 2946504 2919831 2896466 2964963
11692 2964963 3192955 3111010 3178804 3037882 3011509 3015000 3349450 3321399 3314187 3199974 3439388
11681 3439388 3149676 3483280 3517042 3591486 3562957 3606018 3464539 3547974 3430292 3608468
$$ packed form
11753B495910K43027J43072J29367j50977M9251O6756l1521J3889L2294n5274
11743B935794J4008P9630l19811J36455p5664j07012O1048J02839j65460j02406
11733B559421K65266J8943r5377j2241j99242O8941j04015K19966j99785J49975
11723B671852j2118O5751M842J38129j95115J847j05256K91728m12630K15520
11713B664550J1212N2555J04228k80028n7296J44210P7161m8741k79297J82406
11703B570960K1665J68484Q579n9138O8046k90557L26142J32323k6673k3365O8497
11692B964963K27992q1945O7794j40922k6373L491L34450k8051p212j14213K39414
11681C439388k89712L33604L3762P4444k8529M3061j41479Q3435j17682J78176
$$ plain form
11671 3608468 3505507 3796086 3455836 3630286 3636509 3653246 3733278 3659071 3563524 3467078 3446592
11660 3446592 3543649 3391154 3315876 3529506 3364306 3559471 3255160 3167687 3415115 3328407
11650 3328407 3280976 3351828 3386582 3427967 3441635 3299578 3464506 3402154 3111664 3224515
11640 3224515 3208700 3140392 3371668 3245314 3287426 3098931 3320715 3273557 2959033 3142319
11630 3142319 3185743 3330931 3097463 2941571 3173247 3155060 3159791 3084078 3020868 3127404
11620 3127404 2893327 2902792 3297017 2861870 3107850 3176797 2997745 3059531 3150363 3041849
11610 3041849 2904043 2959130 2881123 3061004 3324722 3089835 3362031 3237916 3300832 3343380
11600 3343380 3235518 3349794 3104607 3391861 3319181 3391345 3199333 3409436 3422391 3407139
$$ packed form
11671C608468j02961K90579l40250J74450O223J6737Q0032p4207r5547r6446k0486
11660C446592R7057j52495p5278K13630j65200J95165l04311q7473K47428q6708
11650C328407m7431P0852L4754M1385J3668j42057J64928o2352k90490J12851
11640C224515j5815o8308K31276j26354M2112j88495K21784m7158l14524J83286
11630C142319M3424J45188k33468j55892K31676j8187M731p5713o3210J06536
11620C127404k34077R465L94225m35147K45980O8947j79052O1786R0832j08514
11610C041849j37806N5087p8007J79881K63718k34887K72196j24115O2916M2548
11600C343380j07862J14276k45187K87254p2680P2164j92012K10103J2955j5252
$$ plain form
11590 3407139 3419567 3337846 3469408 3402208 3234294 3363408 3165699 3253033 3240139 3378495
11580 3378495 3371545 3122623 3453838 3576754 3615490 3463730 3467911 3492413 3391932 3566048
11570 3566048 3473905 3605825 3490953 3419896 3462117 3543760 3470853 3405309 3404247 3403550 3624830
11559 3624830 3589266 3389137 3673434 3477809 3632998 3605498 3633400 3905069 3594720 3566120
11549 3566120 3435324 3588412 3618197 3444629 3280945 3331725 3259173 3324697 3315382 3301663 3324358
11538 3324358 3120376 3140888 3285131 3342607 3441174 3246055 3219114 3505265 3713640 3340036
11528 3340036 3409155 3489704 3311745 3233471 3307115 3080523 3322257 3216460 3341638 3393740
11518 3393740 3410854 3477028 3663478 3415787 3285865 3612135 3508778 3576263 3561162 3536117
$$ packed form
11590C407139J2428q1721J31562o7200j67914J29114j97709Q7334j2894J38356
11580C378495o950k48922L31215J22916L8736j51760M181K4502j00481J74116
11570C566048r2143J31920j14872p1057M2221Q1643p2907o5544j062o97K21280
11559C624830l5564k00129K84297j95625J55189k7500K7902K71669l10349k8600
11549C566120j30796J53088K9785j73568j63684N0780p2552O5524r315j3719K2695
11538C324358k03982K0512J44243N7476R8567j95119k6941K86151K08375l73604
11528C340036O9119Q0549j77959p8274P3644k26592K41734j05797J25178N2102
11518C393740J7114O6174J86450k47691j29922L26270j03357O7485j5101k5045
$$ plain form
11508 3536117 3555751 3477591 3794102 3693933 3692024 3752399 3547723 3857582 3701255 3552212
11498 3552212 3619544 3535886 3450827 3482604 3791993 3513159 3970198 3537780 3646250 3550390
11488 3550390 3786662 3692099 3800280 3997261 3672081 3714014 4010058 3754454 3898677 3650591
11478 3650591 4110340 3920778 3944938 3891615 3669088 3900299 3860393 3898086 4045534 4079026
11468 4079026 3766374 3750724 3774285 3891454 3777986 3684677 3553889 3646974 3982040 3671101
11458 3671101 3671497 3708497 3764529 3742111 3638803 3753655 3706636 3678495 3605971 3817390 3946674
11447 3946674 3723793 3724847 3905067 3867866 3850853 4029182 4127987 4012905 4104037 4025038 4245969
11436 4245969 4303697 4196247 4247158 4558466 4490578 4362794 4540742 4480285 4853765 4785938
$$ packed form
11508C536117J9634p8160L16511j00169j909O0375k04676L09859j56327j49043
11498C552212O7332q3658q5059L1777L09389k78834M57039m32418J08470r5860
11488C550390K36272r4563J08181J96981l25180M1933K96044k55604J44223k48086
11478C650591M59749j89562K4160n3323k22527K31211l9906L7693J47448L3492
11468D079026l12652j5650K3561J17169j13468r3309j30788R3085L35066l10939
11458C671101L96L7000N6032k2418j03308J14852m7019k8141p2524K11419J29284
11447C946674k22881J054J80220l7201j7013J78329R8805j15082R1132p8999K20931
11436D245969N7728j07450N0911L11308o7888j27784J77948o0457L73480o7827
$$ plain form
11426 4785938 4823238 4680659 4697623 4722050 5014887 4892285 4748036 4706470 4896322 4796669
11416 4796669 4832858 4909469 5025126 4994958 4819529 5115729 5203161 5085910 5295669 5293290
11406 5293290 5423423 5621016 5685025 5665338 5654631 5804935 6015174 5958016 6067465 5891731
11396 5891731 6422071 6327964 6439281 6672483 6829111 6735787 6866305 7032606 7165244 7077439
11386 7077439 7364453 7486918 7633597 7649456 7861453 7786659 7762298 8060752 7959327 8027104
11376 8027104 8145590 8095522 8392341 8481938 8384099 8606005 8671631 8570667 8618840 8960222
11366 8960222 8776420 8798284 8872105 9045828 8862220 8882253 9056933 9178013 9112325 9026351
11356 9026351 9321347 9018300 9064891 9276729 9148290 9139058 9528251 9314521 9340870 9220989
$$ packed form
11426D785938L7300j42579J6964K4427K92837j22602j44249m1566J89852r9653
11416D796669L6189P6611J15657l0168j75429K96200Q7432j17251K09759k379
11406E293290J30133J97593O4009j9687j0707J50304K10239n7158J09449j75734
11396E891731N30340r4107J11317K33202J56628r3324J30518J66301J32638q7805
11386G077439K87014J22465J46679J5859K11997p4794k4361K98454j01425O7777
11376H027104J18486n0068K96819Q9597r7839K21906O5626j00964M8173L41382
11366H960222j83802K1864P3821J73723j83608K0033J74680J21080o5688q5974
11356I026351K94996l03047M6591K11838j28439r232L89193k13730K6349j19881
$$ plain form
11346 9220989 9458599 9499765 9322843 9215063 9404944 9351480 8935148 9094412 9178032 8803030
11336 8803030 8886142 9089531 8645861 8679517 8526730 8594077 8486748 8597887 8169146 8112686
11326 8112686 8187231 8033260 7945479 8036737 7641803 7686016 7568431 7249032 7317163 7335249
11316 7335249 7258043 6986545 6908951 6716894 6822705 6431476 6556434 6326957 6254151 6023689
11306 6023689 5856232 5735046 5760463 5539491 5416575 5247482 5424993 5236647 5120066 4941831
11296 4941831 4820267 4767508 4660160 4797549 4576938 4692567 4427295 4170041 4488658 4298160
11286 4298160 4191277 3991435 4121626 4033609 3832907 3892952 3892819 3732674 3494286 3583502
11276 3583502 3509911 3314603 3429121 3326489 3353731 3065709 3409629 3285414 3332890 3221825
$$ packed form
11346I220989K37610M1166j76922j07780J89881n3464m16332J59264Q3620l75002
11336H803030Q3112K03389m43670L3656j52787O7347j07329J11139m28741n6460
11326H112686P4545j53971q7781R1258l94934M4213j17585l19399O8131J8086
11316G335249p7206k71498p7594j92057J05811l91229J24958k29477p2806k30462
11306F023689j67457j21186K5417k20972j22916j69093J77511j88346j16581j78235
11296D941831j21564n2759j07348J37389k20611J15629k65272k57254L18617j90498
11286D298160j06883j99842J30191q8017k00702O0045j33j60145k38388Q9216
11276C583502p3591j95308J14518j02632K7242k88022L43920j24215M7476j11065
$$ plain form
11266 3221825 3147845 3118126 3102602 3082207 3216862 3022515 2948523 3112052 2709522 2923653
11256 2923653 2896263 3160076 2722802 2953082 2999462 2899338 2721754 2810506 2813467 2984395
11246 2984395 2736565 2969132 2914605 2769214 3027994 2964437 2994201 2968544 2858908 2786116
11236 2786116 2666944 2690333 3038504 2872040 2833937 2882106 2830832 3072066 3160562 2928931
11226 2928931 3101653 3354889 3516416 4276425 5348184 5696173 6434675 6574549 6989806
11217 6989806 6929457 6877270 6460128 5627910 4457968 3800518 3333969 3207856 3348340 2942405
11207 2942405 2899673 2909616 3125440 3039016 2906357 2921061 2844239 2808581 3091238 3015067 3170461
11196 3170461 3257950 3780999 4570197 5411381 6013312 6400918 6603254 7065072 7156977 7043006
$$ packed form
11266C221825p3980k9719j5524k0395J34655j94347p3992J63529m02530K14131
11256B923653k7390K63813m37274K30280M6380j00124j77584Q8752K961J70928
11246B984395k47830K32567n4527j45391K58780o3557K9764k5657j09636p2792
11236B786116j19172K3389L48171j66464l8103M8169n1274K41234Q8496k31631
11226B928931J72722K53236J61527P60009J071759L47989P38502J39874M15257
11217F989806o0349n2187m17142q32218j169942o57450m66549j26113J40484m05935
11207B942405m2732R943K15824q6424j32659J4704p6822l5658K82657p6171J55394
11196C170461Q7489N23049P89198Q41184O01931L87606K02336M61818R1905j13971
$$ plain form
11186 7043006 6462010 5566032 4376881 3811720 3481906 3489968 3451468 3063675 3256826 3247401
11176 3247401 3248039 3408000 3118209 3143217 3120393 3127603 3189018 3102355 3122967 3346125 3307132
11165 3307132 3226671 3110561 3209098 3325657 3338782 3091476 3429847 3362462 3237567 3444939
11155 3444939 3403890 3385378 3284133 3190043 3348132 3375426 3211140 3358877 3362436 3432063 3459950
11144 3459950 3375711 3340434 3507279 3535594 3693926 3411196 3456144 3561460 3588291 3533935
11134 3533935 3488519 3686656 3657815 3868595 3837142 3784785 3766739 3704957 3816742 3762408 3693999
11123 3693999 3908825 4269724 3918279 3858311 3867160 3858436 4182857 4219386 4326926 4170777
11113 4170777 4257414 4041411 4062255 3946190 3978046 4120516 4180716 4030417 4057620 3993120
$$ packed form
11186G043006n80996q95978j189151n65161l29814Q062l8500l87793J93151r425
11176C247401O38J59961k89791K5008k2824P210O1415q6663K0612K23158l8993
11165C307132q0461j16110R8537J16559J3125k47306L38371o7385j24895K07372
11155C444939m1049j8512j01245r4090J58089K7294j64286J47737L559O9627K7887
11144C459950q4239l5277J66845K8315J58332k82730M4948J05316K6831n4356
11134C533935m5416J98137k8841K10780l1453n2357j8046o1782J11785n4334o8409
11123C693999K14826L60899l51445n9968Q849q724L24421L6529J07540j56149
11113D170777Q6637k16003K0844j16065L1856J42470O0200j50299K7203o4500
$$ plain form
11103 3993120 3959010 4001885 3864400 4088056 4072876 3956662 3979983 3865208 3834073 3813862
11093 3813862 3876228 3704709 3861877 3669339 3837503 4023323 3827518 4017732 3767191 3933776
11083 3933776 3841064 3877788 3911156 3767639 3627661 3937845 3959254 4032007 3864883 3925703
11073 3925703 3762561 3932768 3927534 4046060 4148543 4107608 3941246 4118645 4153648 4323316
11063 4323316 4327149 4124323 4419344 4552200 4808446 4589687 4676305 4615336 4795225 4875600
11053 4875600 4801218 4856987 4694523 4727758 4897862 4711347 5011089 4952454 4956609 5080125
11043 5080125 5019709 5166179 5071239 5302768 4966145 5446922 5405814 5482219 5570131 5632293
11033 5632293 5723771 5969679 6244414 6404665 6273280 6495498 6957135 6938410 6949257 7309386
$$ packed form
11103C993120l4110M2875j37485K23656j5180j16214K3321j14775l1135k0211
11093C813862O2366j71519J57168j92538J68164J85820j95805J90214k50541J66585
11083C933776r2712L6724L3368j43517j39978L10184K1409P2753j67124O0820
11073C925703j63142J70207n234J18526J02483m0935j66362J77399L5003J69668
11063D323316L833k02826K95021J32856K56246k18759Q6618o0969J79889Q0375
11053D875600p4382N5769j62464L3235J70104j86515K99742n8635M155J23516
11043E080125o0416J46470r4940K31529l36623M80777m1108P6405Q7912O2162
11033E632293R1478K45908K74735J60251j31385K22218M61637j8725J0847L60129
$$ plain form
11023 7309386 7439790 7552647 7690400 7788195 7859798 8204049 8334302 8325690 8439557 8204180
11013 8204180 8313350 8732029 8740972 8719362 8769513 9010424 9051023 9353108 9471955 9591827
11003 9591827 9715262 9947188 9938713 10336331 10664723 10927833 11127787 11131046 11392106 11555324
10993 11555324 11933199 12125539 12300573 12285804 12546180 12651554 12684433 12761605 12933420 13109447
10983 13109447 13374546 13301246 14068324 14405494 14639243 14874931 15218120 15469162 15621578
10974 15621578 15886821 15849127 15805470 15973313 16140411 16234691 16874152 17224057 17193469 17574911
10964 17574911 17869591 18304381 18791931 18873372 19002143 19366713 20003721 20190135 20554272
10955 20554272 20843896 21596004 22070212 22546177 23024571 23684076 23799488 24494082 24578654
$$ packed form
11023G309386J30404J12857J37753R7795P1603L44251J30253q612J13867k35377
11013H204180J09170M18679Q943k1610N0151K40911M0599L02085J18847J19872
11003I591827J23435K31926q475L97618L28392K63110J99954L259K61060J63218
10993A1555324L77875J92340J75034j4769K60376J05374L2879P7172J71815J76027
10983A3109447K65099p3300P67078L37170K33749K35688L43189K51042J52416
10974A5621578K65243l7694m3657J67843J67098R4280O39461L49905l0588L81442
10964A7574911K94680M34790M87550Q1441J28771L64570O37008J86414L64137
10955B0554272K89624P52108M74208M75965M78394O59505J15412O94594Q4572
$$ plain form
10946 24578654 25015027 25361959 25757426 25955867 26663709 27030136 27303876 27920462 28399698
10937 28399698 28968304 29286096 30188222 30604301 31067377 31509605 32134370 32793808 33457383
10928 33457383 33997051 34664767 35650257 36446038 37031060 37955512 38690340 39321715 39960825
10919 39960825 40565776 40937328 41375466 41463172 41582445 41532838 41591764 41843394 41726553 41610450
10909 41610450 41739643 41526260 41734286 41585583 41514859 41692433 41771749 41589943 41646311 41846896
10899 41846896 41908021 42173303 42357864 42604583 42828571 43388506 43569435 44012224 44447370
10890 44447370 45159080 45852353 46528819 47050863 48248677 49262097 50537776 52093379 54002637
10881 54002637 55559053 57624006 59973084 62508358 65596154 68975812 72629322 76055541
$$ packed form
10946B4578654M36373L46932L95467J98441P07842L66427K73740O16586M79236
10937B8399698N68606L17792R02126M16079M63076M42228O24765O59438O63575
10928C3457383N39668O67716R85490P95781N85022R24452P34828O31375O39110
10919C9960825O04951L71552M38138Q7706J19273m9607N8926K51630j16841j16103
10909D1610450J29193k13383K08026j48703p0724J77574P9316j81806N6368K00585
10899D1846896O1125K65282J84561K46719K23988N59935J80929M42789M35146
10890D4447370P11710O93273O76466N22044J197814J013420J275679J555603J909258
10881E4002637J556416K064953K349078K535274L087796L379658L653510L426219
$$ plain form
10873 76055541 80109294 83699262 87540213 90643089 93072190 95410564 96643195 97122508
10865 97122508 96959652 96034876 94617793 92236557 89418547 86400745 83023080 79400580
10857 79400580 75672342 71876699 68225695 64409684 60932369 57628498 54450352 51312962
10849 51312962 48103890 45498069 42534444 40389318 37763287 35522765 33556990 31460472
10841 31460472 29888627 27941772 26640402 25247041 23652084 22455297 21276862 20076324
10833 20076324 19315614 18629914 17533760 16692943 15995621 15384285 14625933 13972760 13358588
10824 13358588 12633893 12114700 11880021 11133801 10727100 10617012 10220384 9946147 9793109
10815 9793109 9477511 9321488 9269943 9174684 8872798 8611932 8586835 8384572 8217587 7932157
$$ packed form
10873G6055541M053753L589968L840951L102876K429101K338374J232631M79313
10865I7122508j62856r24776j417083k381236k818010l017802l377665l622500
10857G9400580l728238l795643l651004l816011l477315l303871l178146l137390
10849E1312962l209072k605821k963625k145126k626031k240522j965775k096518
10841C1460472j571845j946855j301370j393361j594957j196787j178435j200538
10833B0076324p60710o85700j096154q40817o97322o11336p58352o53173o14172
10824A3358588p24695n19193k34679p46220m06701j10088l96628k74237j53038
10815I793109l15598j56023n1545r5259l01886k60866k5097k02263j66985k85430
$$ plain form
10805 7932157 7647212 7285051 7049247 6767143 6539973 6157328 6000897 5949969 5813137 5738099
10795 5738099 5514371 5615051 5287980 5206089 4852645 5114311 4901012 4829033 4854150 4815211
10785 4815211 4589742 4760606 4424312 4700208 4267450 4494807 4370508 4254133 4257584 4009176
10775 4009176 4009225 3904979 4050666 3810369 3943719 3660532 3577706 3609518 3540798 3543171 3736330
10764 3736330 3395665 3399246 3298022 3531037 3527793 3418269 3300622 3661372 3276375 3293076
10754 3293076 3474576 3495401 3439004 3318792 3265607 3225575 3496220 3280406 3185440 3240622
10744 3240622 3185587 3102646 3065629 2677427 2922140 2730305 2804507 2796692 2930505 2820505
10734 2820505 2695273 2934218 3106151 3005593 2878501 2926646 3151270 3137057 3185559 3082656
$$ packed form
10805G932157k84945l62161k35804k82104k27170l82645j56431n0928j36832p5038
10795E738099k23728J00680l27071q1891l53444K61666k13299p1979K5117l8939
10785D815211k25469J70864l36294K75896m32758K27357j24299j16375L451k48408
10775D009176M9j04246J45687k40297J33350k83187q2826L1812o8720K373J93159
10764C736330l40665L581j01224K33015l244j09524j17647L60750l84997J6701
10754C293076J81500K0825n6397j20212n3185m0032K70645k15814r4966N5182
10744C240622n5035q2941l7017l88202K44713j91835P4202p815J33813j10000
10734B820505j25232K38945J71933j00558j27092M8145K24624j4213M8502j02903
$$ plain form
10724 3082656 3042218 3222501 3056803 3060958 3092629 3120073 2939118 2803896 3098682 2811889
10714 2811889 3080826 2977947 2787632 3064017 3144067 3010162 3043659 3113287 3239880 3184040
10704 3184040 3174842 3215653 2941696 2879934 3153554 2927992 2864584 2854339 2811811 2855946 2477248
10693 2477248 2682463 2632711 2623292 2699588 2919343 2800604 2958643 2746325 2975480 2795592
10683 2795592 2789284 2722604 2575637 2504661 2751358 2469687 2578664 2811133 2519480 2845036
10673 2845036 2840250 2993282 2798580 2830893 2653751 2611888 2733650 2537450 2443761 2658657
10663 2658657 2480626 2432611 2256757 2149497 2442226 2328755 2059272 2260868 2155706 2139105
10653 2139105 2258726 2321098 2097714 2454691 2354829 2476314 2285612 2264056 2407732 2110561
$$ packed form
10724C082656m0438J80283j65698M155L1671K7444j80955j35222K94786k86793
10714B811889K68937j02879j90315K76385Q0050j33905L3497O9628J26593n5840
10704C184040r198M0811k73957o1762K73620k25562o3408j0245m2528M4135l78698
10693B477248K05215m9752r419P6296K19755j18739J58039k12318K29155j79888
10683B795592o308o6680j46967p0976K46697k81671J08977K32469k91653L25556
10673B845036m786J53032j94702L2313j77142m1863J21762j96200r3689K14896
10663B658657j78031m8015j75854j07260K92729j13471k69483K01596j05162j6601
10653B139105J19621O2372k23384L56977r9862J21485j90702k1556J43676k97171
$$ plain form
10643 2110561 2167166 1874746 1944644 2019151 1905488 1731938 2036789 2050460 1937027 2015306
10633 2015306 1942673 1695917 1996295 1877289 1663794 1780248 1774579 1875712 1932358 1950830
10623 1950830 1972151 1753969 1833873 1981430 1869651 1844173 1749696 1855901 2075259 1908610
10613 1908610 1922546 1698634 2051201 1637589 1779044 1860397 2015057 2016162 1630381 1827831
10603 1827831 1787801 1695232 1703077 1772613 1722553 1859743 1683132 1737227 1839553 1778651 1745256
10592 1745256 1854208 1778797 1904099 1685622 1623982 1587233 1725824 1786519 1689635 1949729
10582 1949729 1617275 1699266 1764516 1890367 2076295 1853341 1964457 1722013 1674333 1661967
10572 1661967 1737955 1825972 1720346 1703695 1469365 1823548 1661120 1344172 1587450 1382592
$$ packed form
10643B110561N6605k92420O9898P4507j13663j73550L04851J3671j13433P8279
10633B015306p2633k46756L00378j19006k13495J16454n669J01133N6646J8472
10623A950830K1321k18182P9904J47557j11779k5478r4477J06205K19358j66649
10613A908610J3936k23912L52567m13612J41455Q1353J54660J105l85781J97450
10603A827831m0030r2569P845O9536n0060J37190j76611N4095J02326o0902l3395
10592A745256J08952p5411J25302k18477o1640l6749J38591O0695r6884K60094
10582A949729l32454Q1991O5250J25851J85928k22954J11116k42444m7680j2366
10572A661967P5988Q8017j05626j6651k34330L54183j62428l16948K43278k04858
$$ plain form
10562 1382592 1560051 1664510 1476487 1628404 1600362 1422588 1316546 1595127 1460705 1605937
10552 1605937 1362662 1289766 1276081 1362896 1508102 1363254 1379295 1718863 1370004 1388899
10542 1388899 1470987 1446605 1380265 1548424 1325846 1222114 1472836 1465764 1520589 1466488 1287371
10531 1287371 1359194 1393590 1526927 1380337 1538978 1498100 1440018 1589236 1667382 1740805
10521 1740805 1913440 1745269 2058715 2090562 2217134 2526871 2715937 2586651 2237552 2460421
10511 2460421 2134381 2259198 1806269 1823800 1622347 1648358 1687022 1701916 1590939 1822659
10501 1822659 1969553 1906611 1917247 1876952 1928239 1920748 2288658 2078117 1960808 2016432 2211949
10490 2211949 2235693 2324069 2646631 2647716 2522295 2526132 2437027 2490561 2153791 2269328 2009727
$$ packed form
10562A382592J77459J04459j88023J51917k8042j77774j06042K78581j34422J45232
10552A605937k43275p2896j3685Q6815J45206j44848J6041L39568l48859J8895
10542A388899Q2088k4382o6340J68159k22578j03732K50722p072N4825n4101j79117
10531A287371P1823L4396J33337j46590J58641m0878n8082J49218P8146P3423
10521A740805J72635j68171L13446L1847J26572L09737J89066j29286l49099K22869
10511B460421l26040J24817m52929J7531k01453K6011L8664J4894j10977K31720
10501A822659J46894o2942J0636m0295N1287p491L67910k10541j17309N5624J95517
10490B211949K3744Q8376L22562J085j25421L837q9105N3534l36770J15537k59601
$$ plain form
10479 2009727 2173277 1892648 2196710 2225010 2095559 2129970 1939618 2176748 1963332 1970585
10469 1970585 2132863 2161787 2300168 2191552 2507737 2514959 2618198 2553817 2443542 2738133
10459 2738133 2685302 2793637 2399876 2344050 2704614 2592036 2650399 2590382 2569947 2873102
10449 2873102 2916807 3018656 3039370 2654681 2539536 2841108 2757251 2408712 2452639 2527348
10439 2527348 2691490 3137274 3175257 3388938 3446357 3533147 3414629 3534307 3615479 3300783
10429 3300783 2820053 2505855 2383763 2197665 2065459 2371381 2151482 2161649 2186197 2170339
10419 2170339 2151568 2041615 2183932 2237821 1981367 2226238 2167843 2436892 2593528 2775792
10409 2775792 3112416 3276065 3590510 3741554 3953492 4253548 4365094 4346710 4372798 4017984
$$ packed form
10479B009727J63550k80629L04062K8300j29451L4411j90352K37130k13416P253
10469A970585J62278K8924J38381j08616L16185P222J03239o4381j10275K94591
10459B738133n2831J08335l93761n5826L60564j12578N8363o0017k0435L03155
10449B873102M3705J01849K0714l84689j15145L01572q3857l48539M3927P4709
10439B527348J64142M45784L7983K13681N7419Q6790j18518J19678Q1172l14696
10429C300783m80730l14198j22092j86098j32206L05922k19899J0167K4548j5858
10419B170339j8771j09953J42317N3889k56454K44871n8395K69049J56636J82264
10409B775792L36624J63649L14445J51044K11938L00056J11546j8384K6088l54814
$$ plain form
10399 4017984 4169259 4200244 4410419 4664147 4716576 5236284 5369846 5804138 6128209 6425847
10389 6425847 6286561 6755047 6663843 6687807 6661567 6525944 6376358 6227613 6126925 6010302
10379 6010302 5893796 5696092 5796143 5988298 5901335 5787158 6153225 5901776 5861114 6039872
10369 6039872 6079314 6344846 6250354 6247462 6724848 6605613 6306966 6312264 6089741 6194640
10359 6194640 6010733 5892981 5682954 5658571 5311331 5648567 5389916 5279868 5154380 4866968
10349 4866968 4687836 4487278 4542406 4481388 4428882 4274767 4212174 4120847 4184466 4015332
10339 4015332 4198667 4148309 4508092 4674208 4281675 4692090 4472916 4671986 4789302 4313053
10329 4313053 4457045 4133011 4392466 4388507 4236261 4169158 4258776 4270557 4377304 4281688
$$ packed form
10399D017984J51275L0985K10175K53728N2429N19708J33562M34292L24071K97638
10389F425847j39286M68486r1204K3964k6240j35623j49586j48745j00688j16623
10379F010302j16506j97704J00051J92155q6963j14177L66067k51449m0662J78758
10369F039872L9442K65532r4492k892M77386j19235k98647N298k22523J04899
10359F194640j83907j17752k10027k4383l47240L37236k58651j10048j25488k87412
10349D866968j79132k00558N5128o1018n2506j54115o2593r1327O3619j69134
10339D015332J83335n0358L59783J66116l92533M10415k19174J99070J17316m76249
10329D313053J43992l24034K59455l959j52246o7103Q9618J1781J06747r5616
$$ plain form
10319 4281688 4494606 4117982 4275112 4312407 4490797 4286155 4407551 4556148 4410222 4712770
10309 4712770 4704404 4978855 5064477 5189199 5026786 5277142 5241158 4920110 5458041 5071543
$$ packed form
10319D281688K12918l76624J57130L7295J78390k04642J21396J48597j45926L02548
10309D712770q366K74451Q5622J24722j62413K50356l5984l21048N37931l86498
$$ [...]
##END NTUPLES=NMR SPECTRUM
##END=
