##TITLE=Coffee green (M5-ROVE20 + 1.5mL buffer 50/50,  450uL extracto + 50uL (D2O+TMS))
without heating, vortex and centrifuged, temperature 0oC.
##JCAMPDX= 6.0         $$ Bruker NMR JCAMP-DX V2.0
##DATA TYPE= NMR SPECTRUM
##DATA CLASS= NTUPLES
##ORIGIN= Bruker BioSpin GmbH
##OWNER= Administrator
$$ 1.72 TOPSPIN		Version 2.1
$$ 2012-05-22 16:12:44.762 -0700  Administrator@X
$$ Compression mode = diff/dup
##.OBSERVE FREQUENCY= 400.13188198
##.OBSERVE NUCLEUS= ^1H
##.ACQUISITION MODE= SIMULTANEOUS (DQD)
##.ACQUISITION SCHEME= undefined
##.AVERAGES= 64
##.DIGITISER RES= 22
##SPECTROMETER/DATA SYSTEM= spect
##.PULSE SEQUENCE= noesygppr1d
##.SOLVENT NAME= H2O+D2O
##.SHIFT REFERENCE= INTERNAL, H2O+D2O, 1, 14.97969
##AUDIT TRAIL= $$ (NUMBER, WHEN, WHO, WHERE, PROCESS, VERSION, WHAT)
$$ ##TITLE= Audit trail, TOPSPIN		Version 2.1
$$ ##JCAMPDX= 5.01
$$ ##ORIGIN= Bruker BioSpin GmbH
$$ ##OWNER= Administrator
$$ $$ c:\Bruker\TOPSPIN/data/jwist/nmr/11-coffee-green-quantification-2/121/pdata/1/auditp.txt
$$ ##AUDIT TRAIL=  $$ (NUMBER, WHEN, WHO, WHERE, PROCESS, VERSION, WHAT)
(   1,<2011-11-17 16:31:34.435 -0500>,<Administrator>,<TOPSPIN>,<go>,<TOPSPIN 2.1>,
      <created by zg
	started at 2011-11-17 16:22:37.154 -0500,
	POWCHK enabled, PULCHK disabled,
       configuration hash MD5:
       DA 63 81 1B EF 4C B5 72 B4 DF EA D9 B4 DB 4C 08
       data hash MD5: 64K
       A1 69 BD 6C 96 CB C4 B2 5B 57 37 AB CE B5 7C AD>)
(   2,<2011-11-17 18:21:30.029 -0500>,<Administrator>,<TOPSPIN>,<proc1d>,<TOPSPIN 2.1>,
      <Start of raw data processing
       efp LB = 0 FT_mod = 6 PKNL = 1 PHC0 = 0 PHC1 = 0 SI = 32K 
       data hash MD5: 32K
       15 D9 9B AD F7 B1 91 F7 96 9F AE C2 69 DE F0 A5>)
(   3,<2011-11-17 18:21:30.404 -0500>,<Administrator>,<TOPSPIN>,<proc1d>,<TOPSPIN 2.1>,
      <pk PHC0 = 24.4281 PHC1 = 0 
       data hash MD5: 32K
       75 F4 F1 60 A3 51 DF 0A E8 EF 56 90 F2 90 0F 0E>)
$$ ##END=
$$ 
$$ $$ hash MD5
$$ $$ 31 CD 11 EB 0B 7B 95 DF 07 31 8E 74 4B 88 60 18
##$RELAX= 
##$RELAX= 
##$RELAX= 
##$RELAX= 
##$RELAX= 
$$ Bruker specific parameters
$$ --------------------------
##$DU= <Z:>
##$EXPNO= 121
##$NAME= <11-coffee-green-quantification-2>
##$PROCNO= 1
##$TYPE= <nmr>
##$USER= <jwist>
##$ACQT0= -8.16572462295132
##$AMP= (0..31)
100 100 100 100 100 100 100 100 100 100 100 100 100 100 100 100 100 100
100 100 100 100 100 100 100 100 100 100 100 100 100 100
##$ANAVPT= -1
##$AQSEQ= 0
##$AQ_mod= 3
##$AUNM= <au_prof>
##$AUTOPOS= <>
##$BF1= 400.13
##$BF2= 400.13
##$BF3= 400.13
##$BF4= 400.13
##$BF5= 400.13
##$BF6= 400.13
##$BF7= 400.13
##$BF8= 400.13
##$BYTORDA= 0
##$CFDGTYP= 0
##$CFRGTYP= 9
##$CHEMSTR= <none>
##$CNST= (0..63)
1 1 145 1 1 1 1 1 1 1 1 1 1 1 1 1 1 1 1 1 1 1 1 1 1 1 1 1 1 1 1 1 1 1 1
1 1 1 1 1 1 1 1 1 1 1 1 1 1 1 1 1 1 1 1 1 1 1 1 1 1 1 1 1
##$CPDPRG= <>
##$CPDPRG1= <>
##$CPDPRG2= <>
##$CPDPRG3= <>
##$CPDPRG4= <mlev>
##$CPDPRG5= <mlev>
##$CPDPRG6= <mlev>
##$CPDPRG7= <mlev>
##$CPDPRG8= <mlev>
##$CPDPRGB= <>
##$CPDPRGT= <>
##$D= (0..63)
$$ [...]
##$TP= (0..7)
150 150 150 150 150 150 150 150
##$TP07= 0
##$TPNAME0= <>
##$TPNAME1= <>
##$TPNAME2= <>
##$TPNAME3= <>
##$TPNAME4= <>
##$TPNAME5= <>
##$TPNAME6= <>
##$TPNAME7= <>
##$TPOAL= (0..7)
0.5 0.5 0.5 0.5 0.5 0.5 0.5 0.5
##$TPOFFS= (0..7)
0 0 0 0 0 0 0 0
##$TUNHIN= 0
##$TUNHOUT= 0
##$TUNXOUT= 0
##$USERA1= <user>
##$USERA2= <user>
##$USERA3= <user>
##$USERA4= <user>
##$USERA5= <user>
##$V9= 5
##$VALIST= <valist>
##$VCLIST= <CCCCCCCCCCCCCCC>
##$VD= 0
##$VDLIST= <DDDDDDDDDDDDDDD>
##$VPLIST= <PPPPPPPPPPPPPPP>
##$VTLIST= <TTTTTTTTTTTTTTT>
##$WBST= 2048
##$WBSW= 25
##$XGAIN= (0..3)
0 0 0 0
##$XL= 0
##$YL= 0
##$YMAX_a= 5301461
##$YMIN_a= -2187562
##$ZGOPTNS= <>
##$ZL1= 120
##$ZL2= 120
##$ZL3= 120
##$ZL4= 120
##$ABSF1= 0
##$ABSF2= 0
##$ABSG= 0
##$ABSL= 0
##$ALPHA= 0
##$AQORDER= 0
##$ASSFAC= 0
##$ASSFACI= 0
##$ASSFACX= 0
##$ASSWID= 0
##$AUNMP= <proc_prof1d>
##$AXLEFT= 0
##$AXNAME= <>
##$AXNUC= <1H>
##$AXRIGHT= 0
##$AXTYPE= 0
##$AXUNIT= <>
##$AZFE= 0.1
##$AZFW= 0.1
##$BCFW= 0
##$BC_mod= 0
##$BYTORDP= 0
##$COROFFS= 0
##$CY= 15
##$DATMOD= 1
##$DC= 0
##$DFILT= <>
##$DTYPP= 0
##$F1P= 0
##$F2P= 0
##$FCOR= 0.5
##$FTSIZE= 32768
##$FT_mod= 6
##$GAMMA= 0
##$GB= 0
##$INTBC= 1
##$INTSCL= 1
##$ISEN= 128
##$LB= 0
##$LEV0= 0
##$LPBIN= 0
##$MAXI= 10000
##$MC2= 0
##$MEAN= 0
##$ME_mod= 0
##$MI= 0
##$NCOEF= 0
##$NC_proc= -6
##$NLEV= 6
##$NOISF1= 0
##$NOISF2= 0
##$NSP= 0
##$NTH_PI= 0
##$NZP= 0
##$OFFSET= 14.97969
##$PC= 1
##$PHC0= 24.4281
##$PHC1= 0
##$PH_mod= 1
##$PKNL= yes
##$PPARMOD= 0
##$PPDIAG= 0
##$PPIPTYP= 0
##$PPMPNUM= 2147483647
##$PPRESOL= 1
##$PSCAL= 4
##$PSIGN= 0
##$PYNMP= <proc.py>
##$REVERSE= no
##$SF= 400.13
##$SI= 32768
##$SIGF1= 0
##$SIGF2= 0
##$SINO= 400
##$SIOLD= 32768
##$SPECTYP= <>
##$SREGLST= <1H.CDCl3>
##$SSB= 0
##$STSI= 32768
##$STSR= 0
##$SW_p= 8223.68421052631
##$SYMM= 0
##$S_DEV= 0
##$TDeff= 65536
##$TDoff= 0
##$TI= <>
##$TILT= no
##$TM1= 0
##$TM2= 0
##$TOPLEV= 0
##$USERP1= <user>
##$USERP2= <user>
##$USERP3= <user>
##$USERP4= <user>
##$USERP5= <user>
##$WDW= 1
##$XDIM= 32768
##$YMAX_p= 380064142
##$YMIN_p= -63945281
##$CURPLOT= <Network HP LaserJet P1505>
##$CURPRIN= <$Network HP LaserJet P1505>
##$DFORMAT= <normdp>
##$LAYOUT= <+/1D_H.xwp>
##$LFORMAT= <normlp>
##$PFORMAT= <normpl>
##$SURQMSG= 1
$$ End of Bruker specific parameters
$$ ---------------------------------
##NTUPLES= NMR SPECTRUM
##VAR_NAME=  FREQUENCY,     SPECTRUM/REAL,   SPECTRUM/IMAG
##SYMBOL=    X,             R,               I
##VAR_TYPE=  INDEPENDENT,   DEPENDENT,       DEPENDENT
##VAR_FORM=  AFFN,          ASDF,            ASDF
##VAR_DIM=   32768,         32768,           32768
##UNITS=     HZ,            ARBITRARY UNITS, ARBITRARY UNITS
##FACTOR=    0.250966925370066, 1,           1
##FIRST=     8223.43324360094, -34570,       -201470
##LAST=      0,             115924,          -313487
##MIN=       0,             -63945281,       0
##MAX=       8223.43324360094, 380064142,    0
$$ Real data points
##PAGE= N=1
##DATA TABLE= (X++(R..R)), XYDATA
$$ [...]
$$ plain form
19680 1994331 1878865 1748820 1898692 1879650 1742081 1973814 2022441 1843345 1888993 1836753
19670 1836753 1768708 1863868 1968018 2010932 1790787 1885938 1677001 1873883 1859321 1677667
19660 1677667 1794314 1681184 2019159 1840685 1968971 1755823 1697368 1875508 1756314 1928151
19650 1928151 1891691 1992190 1775680 1815839 1836948 1838136 1766145 1751861 1751523 1725906 1783492
19639 1783492 1773042 1685020 1983408 1934711 1762685 1632544 1967932 1941377 1982610 1759685
19629 1759685 1852103 1902206 1797255 1831451 1627991 1786095 1810522 1761236 1640478 1770197
19619 1770197 1654023 1570585 1770526 1485456 1928572 1530974 1620461 1565253 1605198 1605148 1648144
19608 1648144 1605832 1807504 1579068 1617491 1484355 1652089 1437673 1745291 1442122 1551954
$$ packed form
19680A994331j15466j30045J49872j9042j37569K31733M8627j79096M5648n2240
19670A836753o8045R5160J04150M2914k20145R5151k08937J96882j4562j81654
19660A677667J16647j13130L37975j78474J28286k13148n8455J78140j19194J71837
19650A928151l6460J00499k16510M0159K1109J188p1991j4284l38k5617N7586
19639A783492j0450q8022K98388m8697j72026j30141L35388k6555M1233k22925
19629A759685R2418N0103j04951L4196k03460J58104K4427m9286j20758J29719
19619A770197j16174q3438J99941k85070M43116l97598Q9487n5208L9945n0M2996
19608A648144m2312K01672k28436L8423j33136J67734k14416L07618l03169J09832
$$ plain form
19598 1551954 1480944 1601566 1487645 1575924 1523947 1465890 1625827 1642073 1540446 1595973
19588 1595973 1519381 1520814 1391411 1442125 1321543 1502341 1425649 1484046 1307283 1372815 1464845
19577 1464845 1477841 1374240 1482284 1283950 1258443 1482895 1237224 1516314 1323088 1279472
19567 1279472 1500697 1335097 1518351 1547352 1327283 1402301 1322687 1156625 1500086 1236802
19557 1236802 1237891 1394326 1535527 1261126 1244295 1335925 1288866 1286096 1444924 1285542 1029204
19546 1029204 1202046 1387998 1196249 1295941 1242949 1232058 1239355 1245928 1208982 1631069 1079395
19535 1079395 1569038 1464855 1372724 1444479 1303406 1248540 1355160 1481606 1232784 1621612
19525 1621612 1226578 1410542 1219018 1331148 1283924 1584785 1452516 1336974 1382506 1414617
$$ packed form
19598A551954p1010J20622j13921Q8279n1977n8057J59937J6246j01627N5527
19588A595973p6592J433j29403N0714j20582J80798p6692N8397j76763O5532R2030
19577A464845J2996j03601J08044j98334k5507K24452k45671K79090j93226m3616
19567A279472K21225j65600J83254K9001k20069P5018p9614j66062L43461k63284
19557A236802J089J56435J41201k74401j6831R1630m7059k770J58828j59382k56338
19546A029204J72842J85952j91749R9692n2992j0891P297O573l6946M22087n51674
19535A079395M89643j04183r2131P1755j41073n4866J06620J26446k48822L88828
19525A621612l95034J83964j91524J12130m7224L00861j32269j15542M5532L2111
$$ plain form
19515 1414617 1175654 1314053 1184239 1414358 1217408 1356548 1467985 1444603 1283421 1092582
19505 1092582 1368508 1266102 1388875 1280499 1321439 1283671 1277948 1082797 1541541 1125645
19495 1125645 1181195 1387473 1094707 1281654 1137798 1278246 1368558 1225521 1193937 1255213
19485 1255213 1378959 1238852 1236465 1299339 1220409 1147603 1187832 1184785 1168384 1092356 949229
19474 949229 1124281 944884 1182813 1319265 1047718 1000663 1010780 962255 1092958 1254829
19464 1254829 1012137 1035652 808514 1175480 1001396 961882 908965 1011458 954509 924867
19454 924867 906784 888342 846939 712043 810660 875393 967399 826912 814745 1014535 998859
19443 998859 794782 960550 764367 941206 838123 796807 753658 969116 657818 930553
$$ packed form
19515A414617k38963J38399j29814K30119j96950J39140J11437k3382j61182j90839
19505A092582K75926j02406J22773j08376M0940l7768n723j95151M58744m15896
19495A125645N5550K06278k92766J86947j43856J40448R0312j43037l1584O1276
19485A255213J23746j40107k387O2874p8930p2806M0229l047j6401p6028j43127
19474I49229J75052j79397K37929J36452k71547m7055J0117m8525J30703J61871
19464A254829k42692K3515k27138L66966j74084l9514n2917J02493n6949k9642
19454I24867j8083j8442m1403j34896R8617O4733R2006j40487j2167J99790j5676
19443I98859k04077J65768j96183J76839j03083m1316m3149K15458l11298K72735
$$ plain form
19433 930553 918948 1073769 781378 824595 705359 859031 962780 990826 827873 779789
19423 779789 962945 982888 732671 921324 886045 829497 868351 666399 997786 755375
19413 755375 822106 905991 916640 895172 853786 738075 843222 673149 784799 696997 844320
19402 844320 821277 696235 782272 974685 858434 802251 737020 1064479 705355 865815
19392 865815 711785 857394 787822 859847 797873 700693 697616 809756 795968 1039837 1042566
19381 1042566 911589 735947 723557 676900 833448 930627 753472 700570 1155259 939028
19371 939028 737715 795909 704638 855189 786043 715475 793059 724273 797955 785768 674497
19360 674497 777279 775812 1151519 779867 797827 708918 795885 798292 858331 895714 800056
$$ packed form
19433I30553j1605J54821k92391M3217j19236J53672J03749K8046j62953m8084
19423G79789J83156J9943k50217J88653l5279n6548L8854k01952L31387k42411
19413G55375O6731Q3885J0649k1468m1386j15711J05147j70073J11650q7802J47323
19402H44320k3043j25042Q6037J92413j16251n6183o5231L27459l59124J60460
19392H65815j54030J45609o9572P2025o1974r7180l077J12140j3788K43869K729
19381A042566j30977j75642j2390m6657J56548R7179j77155n2902M54689k16231
19371I39028k01313N8194r1271J50551o9146p0568P7584o8786P3682j2187j11271
19360F74497J02782j467L75707l71652J7960q8909Q6967K407O0039L7383r5658
$$ plain form
19349 800056 836908 921217 1024566 635754 638922 996560 751723 719876 786113 753428 849680
19338 849680 818165 991050 969534 696767 726269 729873 1010020 861911 739602 857670
19328 857670 1003061 895084 821495 890314 1092635 924314 766853 960004 805941 1139310
19318 1139310 897490 1049690 835439 987958 964111 860967 852426 793120 775601 857510
19308 857510 878476 864504 650866 890977 1025727 862407 828754 767764 874841 720482
19298 720482 901705 725972 913887 1080799 788053 724996 417887 788731 605069 1012666
19288 1012666 926865 753333 720057 734280 594061 777615 619486 728501 653651 834834
19278 834834 745267 605740 562848 616078 757367 1021204 706190 666018 843293 847995 781912
$$ packed form
19349H00056L6852Q4309J03349l88812L168L57638k44837l1847O6237l2685R6252
19338H49680l1515J72885k1516k72767K9502L604K80147j48109j22309J18068
19328H57670J45391j07977p3589O8819K02321j68321j57461J93151j54063L33369
19318A139310k41820J52200k14251J52519k3847j03144q541n9306j7519Q1909
19308H57510K0966j3972k13638K40111J34750j63320l3653o0990J07077j54359
19298G20482J81223j75733J87915J66912k92746o3057l07109L70844j83662M07597
19288A012666q5801j73532l3276J4223j40219J83554j58129J09015p4850J81183
19278H34834q9567j39527m2892N3230J41289K63837l15014m0172J77275M702o6083
$$ plain form
19267 781912 728405 669266 819057 727452 853271 715259 775206 872771 706809 524160
19257 524160 832690 734818 915254 822038 943061 743478 555589 775202 621664 841802
19247 841802 763650 715739 748240 969338 901595 1385675 1362135 1690939 1172136 1586648
19237 1586648 1321762 1348459 1253839 892279 901288 814669 863417 964314 902122 573763 863805
19226 863805 655656 850507 623626 562750 654967 781364 809536 704358 652310 506553
19216 506553 730542 705242 563985 746087 563120 808686 611800 631364 820249 713346
19206 713346 729061 552615 736905 686140 782955 508803 793171 774710 714961 822926
19196 822926 809663 830012 654575 541911 650794 974251 846650 824647 639113 564704
$$ packed form
19267G81912n3507n9139J49791r1605J25819j38012N9947R7565j65962j82649
19257E24160L08530r7872J80436r3216J21023j99583j87889K19613j53538K20138
19247H41802p8152m7911L2501K21098o7743M84080k3540L28804n18803M14512
19237A586648k64886K6697r4620l61560R009q6619M8748J00897o2192l28359K90042
19226H63805k08149J94851k26881o0876R2217J26397K8172j05178n2048j45757
19216E06553K23989k5300j41257J82102j82967K45566j96886J9564J88885j06903
19206G13346J5715j76446J84290n0765R6815k74152K84368j8461n9749J07965
19196H22926j3263K0349j75437j12664J08883L23457j27601k2003j85534p4409
$$ plain form
19186 564704 683336 875849 710262 827172 768451 657309 806266 899010 648957 829776
19176 829776 738248 951248 791688 889469 705718 1044851 737081 1039323 972421 1128650
19166 1128650 1151407 1022689 1110559 1151030 1077868 1241883 1094137 1022410 951284 1149226
19156 1149226 1051763 1044919 994966 968059 1015960 1081110 1343714 1332213 1077754 1090838 1180666
19145 1180666 957294 1115002 811835 897709 854419 1106186 999186 946484 1067701 833829
19135 833829 951490 674366 1094397 1078203 1069968 825121 943874 1031584 797669 1086706
19125 1086706 1137041 999247 1131902 957293 1125504 1116850 1173917 1096100 1195399 1066520
19115 1066520 1184603 1339966 1200204 1130075 1148531 1155753 1293456 1237978 1326966 1421402 1462208
$$ packed form
19186E64704J18632J92513j65587J16910n8721j11142J48957R2744k50053J80819
19176H29776r1528K13000j59560R7781j83751L39133l07770L02242o6902J56229
19166A128650K2757j28718Q7870M0471p3162J64015j47746p1727p1126J97942
19156A149226r7463o844m9953k6907M7901O5150K62604j1501k54459J3084Q9828
19145A180666k23372J57708l03167Q5874m3290K51767j07000n2702J21217k33872
19135H33829J17661k77124M20031j6194q235k44847J18753Q7710k33915K89037
19125A086706N0335j37794J32655j74609J68211q654N7067p7817R9299j28879
19115A066520J18083J55363j39762p0129J8456P222J37703n5478Q8988R4436M0806
$$ plain form
19104 1462208 1361500 1564471 1859416 1931768 2084843 2321999 2740974 2939339 3243545 3593993
19094 3593993 3886202 4035294 4161637 4214852 4359666 3950437 3567618 3167457 2859264 2561207
19084 2561207 2561755 2073081 2086280 1830542 1588310 1752592 1494353 1438455 1737980 1648731
19074 1648731 2059998 1976572 2379862 2614339 3093406 3198203 3599021 3561659 3723409 3854683
19064 3854683 3887958 3533327 3528653 3329700 3467762 3407076 3830035 3896165 4440731 4480572
19054 4480572 4369542 4199781 4100006 4056249 3958339 3559199 3057636 2718344 2441615 2352129
19044 2352129 2194935 1888053 1879862 1862785 1970402 1802650 1759775 2316992 2197927 2462644
19034 2462644 2692589 3022975 3578530 3812322 4087214 4319410 4263614 4164306 3966531 3685144
$$ packed form
19104A462208j00708K02971K94945P2352J53075K37156M18975J98365L04206L50448
19094C593993K92209J49092J26343N3215J44814m09229l82819m00161l08193k98057
19084B561207N48m88674J3199k55738k42232J64282k58239n5898K99525q9249
19074A648731M11267q3426M03290K34477M79067J04797M00818l7362J61750J31274
19064C854683L3275l54631m674j98953J38062o0686M22959O6130N44566L9841
19054D480572j11030j69761r9775m3757r7910l99140n01563l39292k76729q9486
19044B352129j57194l06882q191j7077J07617j67752m2875N57217j19065K64717
19034B462644K29945L30386N55555K33792K74892K32196n5796r9308j97775k81387
$$ plain form
19024 3685144 3464256 2886853 2722555 2383160 2262376 2124128 1881993 2059311 1907130
19015 1907130 1853441 1841506 2061042 2131892 2115171 2308592 2368646 2948786 3122168 3642063
19005 3642063 3944184 4114650 4211647 4542712 4711587 4336532 4497042 4483126 4550646 4919721
18995 4919721 5075540 5704290 5994264 6688309 7286061 7812507 8856647 9583735 10564400
18986 10564400 11688860 13247692 14373747 16012217 16998786 18118316 18878343 19088051
18978 19088051 18752054 17875634 16298095 15048204 13242212 11331409 9898323 8418618
18970 8418618 7430905 6120424 5596822 4776277 4394597 3752185 3487310 2896760 2793072
18961 2793072 2563676 2261955 2273331 2132506 2005256 2014034 1797619 1973971 1644199 1861094
$$ packed form
19024C685144k20888n77403j64298l39395j20784j38248k42135J77318j52181
19015A907130n3689j1935K19536P0850j6721J93421O0054N80140J73382N19895
19005C642063L02121J70466R6997L31065J68875l75055J60510j3916O7520L69075
18995D919721J55819O28750K89974O94045N97752N26446J044140P27088R80665
18986A0564400J124460J558832J126055J638470R86569J119530P60027K09708
18978A9088051l35997q76420j577539j249891j805992j910803j433086j479705
18970H418618r87713j310481n23602q20545l81680o42412k64875n90550j03688
18961B793072k29396l01721J1376j40825j27250Q778k16415J76352l29772K16895
$$ plain form
18951 1861094 1758279 1798700 1781999 1662306 1785779 1763698 1548040 1800642 1938936 1863926
18941 1863926 1586386 2141389 1911712 2114951 2096406 2233592 2168630 2346114 2647204 2582397
18931 2582397 2986161 3135059 3388655 3875471 4271545 4996812 5769503 6727470 7893383
18922 7893383 9570025 11223358 12862850 14393515 15783670 16691308 17090991 17338131 16782081
18913 16782081 15628465 14527569 12605384 11008412 9606165 8231236 6677541 5818832
18905 5818832 5130052 4492389 3717987 3402510 3040061 2621427 2342274 2320891 2052574 2100280
18895 2100280 1511181 1694233 1538196 1352645 1295572 1127638 1056132 1129022 885223 1141719
18885 1141719 922672 966188 1046944 849561 1007630 1169891 913220 732164 845817 812539
$$ packed form
18951A861094j02815M0421j6701j19693J23473k2081k15658K52602J38294p5010
18941A863926k77540N55003k29677K03239j8545J37186o4962J77484L01090o4807
18931B582397M03764J48898K53596M86816L96074P25267P72691R57967J165913
18922G893383J676642J653333J639492J530665J390155R07638L99683K47140n56050
18913A6782081j153616j100896j922185j596972j402247j374929j553695q58709
18905E818832o88780o37663p74402l15477l62449m18634k79153k1383k68317M7706
18895B100280n89099J83052j56037j85551n7073j67934p1506P2890k43799K56496
18885A141719k19047M3516Q0756j97383J58069J62261k56671j81056J13653l3278
$$ plain form
18875 812539 701082 840359 879150 854066 836384 771461 816172 1075673 677076 870170
18865 870170 796914 741194 764933 680067 675424 766124 855207 699818 728954 700500 761110
18854 761110 746289 826377 860349 740810 719215 787350 918496 954762 888827 476030 724784
18843 724784 569504 831758 756623 625465 748756 693994 566914 744756 549535 694108
18833 694108 411326 688478 481284 750726 527179 655131 758240 491663 433301 646074
18823 646074 543626 770701 712304 707468 658641 448967 631501 472081 708484 587395
18813 587395 670823 650645 662468 524446 704453 776425 538284 469658 617322 743756
18803 743756 640587 738001 774048 500486 844314 697812 539340 689819 800088 574330
$$ packed form
18875H12539j11457J39277L8791k5084j7682o4923M4711K59501l98597J93094
18865H70170p3256n5720K3739q4866m643R0700Q9083j55389K9136k8454O0610
18854G61110j4821Q0088L3972j19539k1595O8135J31146L6266o5935m12797K48754
18843G24784j55280K62254p5135j31158J23291n4762j27080J77842j95221J44573
18833F94108k82782K77152k07194K69442k23547J27952J03109k66577n8362K12773
18823F46074j02448K27075n8397m836m8827k09674J82534j59420K36403j21089
18813E87395Q3428k0178J1823j38022J80007P1972k38141o8626J47664J26434
18803G43756j03169R7414L6047k73562L43828j46502j58472J50479J10269k25758
$$ plain form
18793 574330 643192 561932 812464 729356 710134 649036 787638 687915 961571 999987 876251
18782 876251 829193 918259 733351 892783 761066 975502 661103 574426 804384 542613
18772 542613 584161 477638 581656 640941 605755 723797 593360 619723 628009 743195 477696
18761 477696 774312 709259 729879 849008 585796 485985 789262 364192 626811 757857
18751 757857 555379 623042 731367 743576 684809 594114 590472 521281 778422 602695 547345
18740 547345 567160 537226 625249 641464 517066 620611 672999 610963 743503 683489 674732
18729 674732 530497 617993 827586 644302 551322 380263 537429 729527 638230 660918
18719 660918 724388 828795 595768 596286 605850 831880 635452 336339 597910 750599 483498
$$ packed form
18793E74330O8862q1260K50532q3108j9222o1098J38602r9723K73656L8416j23736
18782H76251m7058Q9066j84908J59432j31717K14436l14399q6677K29958k61771
18772E42613M1548j06523J04018N9285l5186J18042j30437K6363Q286J15186k65499
18761D77696K96616o5053K0620J19129k63212r9811L03277C64192K62619J31046
18751G57857k02478O7663J08325J2209n8767r0695l642o9191K57141j75727n5350
18740E47345J9815k9934Q8023J6215j24398J03545N2388o2036J32540o0014q757
18729F74732j44235Q7496K09593j83284r2980j71059J57166J92098r1297K2688
18719F60918O3470J04407k33027N18R564K26030j96428k99113K61571J52689k67101
$$ plain form
18708 483498 718164 671780 608599 452114 991084 487309 529059 474140 563895 603456 671720
18697 671720 676826 732576 786097 594942 676368 573365 438463 547790 521779 580530 838720
18686 838720 677200 684384 685466 677248 505560 613708 435095 781220 554575 421868 847107
18675 847107 804816 511341 656903 645178 547135 482968 668600 506129 535232 456839 784308
18664 784308 427438 661491 829150 605736 737864 819020 565382 534598 461337 670257
18654 670257 819688 421232 765184 565087 634548 781025 697389 404541 741210 661895
18644 661895 588779 789768 624776 306606 518673 684797 660365 580221 391970 848932
18634 848932 700480 619595 493964 648438 595431 519288 559737 483933 453082 611445 443331
$$ packed form
18708D83498K34666m6384o3181j56485N38970D87309M1750n4919Q9755L9561O8264
18697F71720N106N5750N3521j91155Q1426j03003j34902J09327k6011N8751K58190
18686H38720j61520P184J082q218j71688J08148j78613L46125k26645j32707M25239
18675H47107m2291k93475J45562j1725r8043o4167J85632j62471K9103p8393L27469
18664G84308l56870K34053J67659k23414J32128Q1156k53638l0784p3261K08920
18654F70257J49431l98456L43952k00097O9461J46477q3636k92848L36669p9315
18644F61895p3116K00989j64992C06606K12067J66124k4432q0144j88251M56962
18634H48932j48452q0885j25631J54474n3007p6143M0449p5804l0851J58363j68114
$$ plain form
18623 443331 543477 406434 672426 461448 712471 344634 517410 818630 402489 484335
18613 484335 697183 753114 613785 491682 797860 470926 428653 410417 325089 395497
18603 395497 585389 663902 536148 437581 549497 624452 796812 674051 648310 435416
18593 435416 794087 540857 984913 772300 774962 811104 703295 745260 881810 940421
18583 940421 778191 816395 805877 667178 685673 699741 574970 784899 584203 596820
18573 596820 737450 777976 511953 832928 726222 523665 514753 519627 613106 398668 594639
18562 594639 740989 484066 512901 586347 635841 608883 759193 538364 501107 747552
18552 747552 619087 352568 809858 299374 443953 319575 426202 450258 618471 689609
$$ packed form
18623D43331J00146j37043K65992k10978K51023C44634J72776L01220D02489Q1846
18613D84335K12848N5931j39329j22103L06178l26934m2273j8236q5328P0408
18603C95497J89892P8513j27754r8567J11916P4955J72360j22761k5741k12894
18593D35416L58671k53230M44056k12613K662L6142j07809M1965J36550N8611
18583I40421j62230L8204j0518j38699J8495J4068j24771K09929k00696J2617
18573E96820J40630M0526k66023L20975j06706k02557q912M874R3479k14438J95971
18562E94639J46350k56923K8835P3446M9494k6958J50310k20829l7257K46445
18552G47552j28465k66519M57290B99374J44579j24378J06627K4056J68213P1138
$$ plain form
18542 689609 407629 677399 654764 504354 582547 685023 348482 597963 577885 447398
18532 447398 491990 754554 567813 396329 528447 756336 429508 650346 546092 572911
18522 572911 481353 446911 508984 602878 638442 731238 416458 354016 330723 372200 551980
18511 551980 926460 505136 440353 553751 548733 560101 432308 301104 532387 514310
18501 514310 573339 382494 584657 730229 221682 573177 470363 556825 603548 411233
18491 411233 421931 618632 645553 587551 589670 481556 605407 550405 617151 541583 344014
18480 344014 423769 697745 223387 573956 658051 507864 622048 370317 767930 558029
18470 558029 507059 531851 576402 530447 412866 484897 548864 445368 644440 724382 439511
$$ packed form
18542F89609k81980K69770k2635j50410P8193J02476l36541K49481k0078j30487
18532D47398M4592K62564j86741j71484J32118K27889l26828K20838j04254K6819
18522E72911r1558l4442O2073R3894L5564R2796l14780o2442k3293M1477J79780
18511E51980L74480m21324o4783J13398n018J1368j27793j31204K31283j8077
18501E14310N9029j90845K02163J45572B21682L51495j02814Q6462M6723j92315
18491D11233J0698J96701K6921n8002K119j08114J23851n5002O6746p5568j97569
18480C44014P9755K73976B23387L50569Q4095j50187J14184k51731L97613k09901
18470E58029n0970K4792M4551m5955j17581P2031O3967j03496J99072P9942k84871
$$ plain form
18459 439511 761262 680407 577414 783111 492143 714436 783050 822329 608329 759468
18449 759468 517128 790739 799213 883302 587709 793855 765580 643367 817484 758197
18439 758197 535809 594388 767470 381040 598183 783552 660081 526243 485007 725187
18429 725187 786813 698969 548787 563473 530244 605315 525126 696468 723575 642309 856567
18418 856567 752647 605315 620713 476082 539226 453839 387563 721132 620420 440637
18408 440637 651677 552225 294108 415065 540854 537151 529618 399206 585910 502792 535924
18397 535924 478600 567240 404602 478190 492483 436201 378292 453197 535906 312944 385248
18386 385248 470783 313437 281037 434721 630892 536220 612808 740214 531956 640079
$$ packed form
18459D39511L21751q0855j02993K05697k90968K22293O8614L9279k14000J51139
18449G59468k42340K73611Q474Q4089k95593K06146k8275j22213J74117n9287
18439G58197k22388N8579J73082C81040K17143J85369j23471j33838m1236K40180
18429G25187O1626q7844j50182J4686l3229P5071q0189J71342K7107q1266K14258
18418H56567j03920j47332J5398j44631O3144q5387o6276L33569j00712j79783
18408D40637K11040r9452k58117J20957J25789l703p533j30412J86704q3118L3132
18397E35924n7324Q8640j62638P3588J4293n6282n7909P4905Q2709k22962P2304
18386C85248Q5535j57346l2400J53684J96171r4672P6588J27406k08258J08123
$$ plain form
18376 640079 455176 523011 514950 530454 479919 536258 447627 630439 790738 680120 634295
18365 634295 462779 505358 625288 625392 611771 516160 470042 489763 680570 574190 406437
18354 406437 599571 790810 310555 483220 714417 503548 662383 450697 593711 575941
18344 575941 537190 775861 599051 513368 789901 535048 723447 768245 626403 766929
18334 766929 599090 607177 752891 640437 457028 557831 403822 621049 489810 485156
18324 485156 520430 417658 490559 286338 449122 656370 335747 382938 597134 471139
18314 471139 785799 598918 667309 697649 501018 671565 571569 659304 646586 724465 645164
18303 645164 595860 456469 608717 608159 418476 476335 691698 700048 638771 470909 344031
$$ packed form
18376F40079j84903O7835q061J5504n0535N6339q8631J82812J60299j10618m5825
18365F34295j71516M2579J19930J04j3621r5611m6118J9721J90807j06380j67753
18354D06437J93134J91239C10555J72665K31197k10869J58835k11686J43014j7770
18344E75941l8751K38671j76810q5683K76533k54853J88399M4798j41842J40526
18334G66929j67839Q087J45714j12454j83409J00803j54009K17227j31239m654
18324D85156L5274j02772P2901k04221J62784K07248l20623M7191K14196j25995
18314D71139L14660j86881O8391L0340j96631J70547r9996Q7735j2718P7879p9301
18303F45164m9304j39391J52248n58j89683N7859K15363Q350o1277j67862j26878
$$ plain form
18292 344031 390079 574690 512213 384716 490902 656314 575768 603980 472901 599675
18282 599675 515646 546071 450961 619702 535516 285761 452576 462562 475363 442226 548534
18271 548534 493070 473742 515004 313538 637882 558539 577981 695276 741427 612995 493071
18260 493071 555124 496118 463092 444183 632848 721488 422539 568920 907236 421315
18249 644935 620471 518012 370430 444925 462898 513173 651827 384103 462935 334530
18239 334530 606464 542350 483940 401451 560538 455804 301052 329757 649666 480834
18229 480834 456101 792649 678284 565484 384643 565067 463084 413945 483037 705940
18219 705940 544749 701408 581882 418010 593718 371446 386826 463615 615229 435672
$$ packed form
18292C44031M6048J84611o2477j27497J06186J65412q0546K8212j31079J26774
18282E99675q4029L0425r5110J68741q4186k49755J66815R986J2801l3137J06308
18271E48534n5464j9328M1262k01466L24344p9343J9442J17295M6151j28432j19924
18260D93071O2053n9006l3026j8909J88665Q8640k98949J46381L38316D21315
18249F44935k4464j02459j47582P4495J7973N0275J38654k67724P8832j28405
18239C34530K71934o4114n8410q2489J59087j04734j54752K8705L19909j68832
18229D80834k4733L36548j14365j12800j80841J80424j01983m9139O9092K22903
18219G05940j61191J56659j19526j63872J75708k22272J5380P6789J51614j79557
$$ plain form
18209 435672 513585 459360 589051 681453 700392 538859 532835 352380 440153 525100 893739
18198 893739 471762 632955 653086 611791 791059 756046 480128 477181 764342 722402 659200
18187 659200 623524 587094 623511 782102 488429 529898 355445 436126 704763 537884
18177 537884 486667 464701 456534 687014 665554 438085 310472 579700 391907 657026
18167 657026 644431 615808 636031 687959 481987 605093 591984 485948 483200 641599 465707
18156 465707 525014 637844 514026 663167 469485 605802 478239 488323 453940 507405
18146 507405 507085 645085 519100 672816 515899 443890 602899 400279 452502 620348
18136 620348 599471 382711 582578 450598 513688 385631 669135 634349 493280 445016
$$ packed form
18209D35672P7913n4225J29691R2402J8939j61533o024j80455Q7773Q4947L68639
18198H93739m21977J61193K0131m1295J79268l5013k75918k947K87161m1940o3202
18187F59200l5676l6430L6417J58591k93673M1469j74453Q0681K68637j66879
18177E37884n1217k1966q167K30480k1460k27469j27613K69228j87793K65119
18167F57026j2595k8623K0223N1928k05972J23106j3109j06036k748J58399j75892
18156D65707N9307J12830j23818J49141j93682J36317j27563J0084l4383N3465
18146E07405l20J38000j25985J53716j56917p2009J59009k02620N2223J67846
18136F20348k0877k16760J99867j31980O3090j28057K83504l4786j41069m8264
$$ plain form
18126 445016 431700 664929 614958 628446 671497 501147 545315 505407 705864 388206 590231
18115 590231 592762 607550 600882 561009 512516 495353 518859 483018 618448 425764 560515
18104 560515 388081 728758 621783 701290 434262 405344 463459 446657 714086 460027
18094 460027 606206 456594 500970 534699 516686 559717 673113 645809 436763 447972 600291
18083 600291 396084 564248 628694 501736 467992 369391 577349 563447 358146 521458
18073 521458 258087 397309 489243 640002 460388 411568 449748 653618 769865 396174
18063 396174 628029 622812 601706 612198 676912 604205 485891 472981 379157 619076 650659
18052 650659 594798 428138 281597 407150 433513 566048 344468 489620 428686 555151
$$ packed form
18126D45016j3316K33229m9971J3488M3051j70350M4168l9908K00457l17658K02025
18115E90231K531J4788o668l9873m8493j7163K3506l5841J35430j92684J34751
18104E60515j72434L40677j06975P9507k67028k8918N8115j6802K67429k54059
18094D60027J46179j49612M4376L3729j8013M3031J13396k7304k09046J1209J52319
18083F00291k04207J68164O4446j26958l3744r8601K07958j3902k05301J63312
18073E21458B58087J39222R1934J50759j79614m8820L8180K03870J16247l73691
18063C96174K31855n217k1106J0492O4714p2707j18314j2910r3824K39919L1583
18052F50659n5861j66660j46541J25553K6363J32535k21580J45152o0934J26465
$$ plain form
18042 555151 481436 406294 395975 624673 498670 548212 234471 552047 459630 553625 458816
18031 458816 486837 385495 591545 257875 399411 568243 308637 290647 462447 388707
18021 388707 521269 557148 510249 571936 592601 545588 391005 519452 370684 390047 550883
18010 550883 520432 610393 529242 545453 444811 642962 458888 494400 272414 671202
18000 671202 378642 584063 540270 628925 303108 433445 671659 558694 235030 519912
17990 519912 512898 411222 551736 699384 697768 630223 230195 628449 519161 297506
17980 297506 556983 494177 475613 654623 562053 504787 446397 690079 495963 647239
17970 647239 665020 482632 496178 498269 344958 839150 317620 514819 506610 707150 362262
$$ packed form
18042E55151p3715p5142j0319K28698j26003M9542B34471L17576r2417R3995r4809
18031D58816K8021j01342K06050B57875J41536J68832k59606j7990J71800p3740
18021C88707J32562L5879m6899O1687K0665m7013j54583J28447j48768J9363J60836
18010E50883l0451Q9961q1151J6211j00642J98151j84074L5512k21986L98788
18000F71202k92560K05421m3793Q8655C03108J30337K38214j12965B35030K84882
17990E19912p014j01676J40514J47648j616o7545B30195L98254j09288k21655
17980B97506K59477o2806j8564J79010r2570n7266n8390K43682j94116J51276
17970F47239J7781j82388J3546K091j53311M94192C17620J97199q209K00540l44888
$$ plain form
17959 362262 635937 497239 774526 523047 409593 532290 762172 432885 499310 351023
17949 351023 608033 436531 370211 461845 436433 701706 441027 378716 573661 616796
17939 616796 517191 401239 631279 502183 512195 673747 615050 787980 654340 573176
17929 573176 568229 638120 306425 617950 620003 529875 465106 562289 666996 779736 562992
17918 562992 519526 546793 660420 527714 741874 608287 567232 466041 722938 443027
17908 443027 782558 680364 699011 804740 344641 671239 634390 529132 496967 628080
17898 628080 616985 715062 549700 688811 700976 670833 425245 608868 570429 620055 572317
17887 572317 539348 681193 400715 742655 678322 516579 551416 717317 609049 791192
$$ packed form
17959C62262K73675j38698K77287k51479j13454J22697K29882l29287O6425j48287
17949C51023K57010j71502o6320R1634k5412K65273k60679o2311J94945M3135
17939F16796r9605j15952K30040j29096J0012J61552n8697J72930j33640q1164
17929E73176m947O9891C06425L11525K053r0128o4769R7183J04707J12740k16744
17918E62992m3466K7267J13627j32706K14160j33587m1055j01191K56897k79911
17908D43027L39531j02194J8647J05729C44641L26598l6849j05258l2165J31113
17898F28080j1095R8077j65362J39111J2165l0143k45588J83623l8439M9626m7738
17887E72317l2969J41845k80478L41940o4333j61743L4837J65901j08268J82143
$$ plain form
17877 791192 760390 626093 485829 347662 662216 409805 715687 491360 810785 499990
17867 499990 567104 817501 702430 729878 644650 534556 515908 642019 549692 493303 724399
17856 724399 626639 464848 447180 624140 395043 659922 774927 861026 899795 687315
17846 687315 707933 630503 585438 609025 766895 971522 627021 711164 635620 630304 627627
17835 627627 637868 718501 677839 596658 784067 636698 593405 674143 717012 664908 736606
17824 736606 709854 657410 553959 695319 902880 818668 765473 848663 915269 789173 1031376
17813 1031376 915197 964704 910524 887664 914570 733247 969053 1004524 918877 520835
17803 520835 744490 856273 869770 1172170 917915 1139444 1083697 972077 869997 1056299
$$ packed form
17877G91192l0802j34297j40264j38167L14554k52411L05882k24327L19425l10795
17867D99990O7114K50397j15071K7448q5228j10094j8648J26111r2327n6389K31096
17856G24399r7760j61791j7668J76960k29097K64879J15005Q6099L8769k12480
17846F87315K0618p7430m5065K3587J57870K04627l44501Q4143p5544n316k677
17835F27627J0241Q0633m0662q1181J87409j47369m3293Q0738M2869n2104P1698
17824G36606k6752n2444j03451J41360K07561q4212n3195Q3190O6606j26096K42203
17813A031376j16179M9507n4180k2860K6906j81323K35806L5471q5647l98042
17803E20835K23655J11783J3497L02400k54255K21529n5747j11620j02080J86302
$$ plain form
17793 1056299 796525 1007934 919527 691824 887012 811945 591384 826707 526552 621239
17783 621239 478326 800876 828024 699790 577927 625066 813814 427851 731448 774814
17773 774814 640696 547615 631057 686829 671931 584398 464893 680277 698919 716273 775644
17762 775644 742407 659849 513131 520275 710884 698460 535833 621645 553963 626129 790868
17751 790868 498515 587315 468040 558505 608668 886264 740569 638887 572712 782229
17741 782229 483326 779691 669626 817040 689498 803923 527105 939657 687632 621613
17731 621613 543178 571877 722402 836956 585521 727672 638597 866281 696000 574063
17721 574063 566868 530035 705066 570062 580497 574107 635971 773843 655095 759794 769000
$$ packed form
17793A056299k59774K11409q8407k27703J95188p5067k20561K35323l00155R4687
17783F21239j42913L22550K7148j28234j21863M7139J88748l85963L03597M3366
17773G74814j34118r3081Q3442N5772j4898q7533j19505K15384J8642J7354N9371
17762G75644l3237q2558j46718P144J90609j2424j62627Q5812o7682P2166J64739
17751G90868k92353Q8800j19275R0465N0163K77596j45695j01682o6175K09517
17741G82229k98903K96365j10065J47414j27542J14425k76818M12552k52025o6019
17731F21613p8435K8699J50525J14554k51435J42151q9075K27684j70281j21937
17721E74063p195l6833J75031j35004J0435o390O1864J37872j18748J04699R206
$$ plain form
17710 769000 592605 541231 749160 538698 668160 761300 647143 865263 642616 535062
17700 535062 538869 866745 578838 598667 798205 434962 432324 742165 667369 763280 826729
17689 826729 792550 987477 872707 608405 692000 746800 508048 628813 879358 637861
17679 637861 587984 984122 700124 813425 700474 566590 686648 734926 762538 754959
17669 754959 666838 498597 793807 660218 762757 753582 757211 657334 784759 579417 923263
17658 923263 827085 799294 788603 887990 857197 877211 920247 771129 886747 753368 819345
17647 819345 884592 1064417 1026536 788226 828142 754003 815486 876384 1126358 1029851 808103
17636 808103 685957 1046030 872002 850181 882585 769555 1084241 1136203 941497 1165594
$$ packed form
17710G69000j76395n1374K07929k10462J29462R3140j14157K18120k22647j07554
17700E35062L807L27876k87907J9829J99538l63243k638L09841p4796R5911O3449
17689H26729l4179J94927j14770k64302Q3595N4800k38752J20765K50545k41497
17679F37861m9877L96138k83998J13301j12951j33884J20058M8278K7612p579
17669G54959q8121j68241K95210j33589J02539r175L629r9877J27425k05342L43846
17658I23263r6178k7791j0691R9387l0793K0014M3036j49118J15618j33379O5977
17647H19345O5247J79825l7881k38310L9916p4139O1483O0898K49974r6507k21748
17636H08103j22146L60073j74028k1821L2404j13030L14686N1962j94706K24097
$$ plain form
17626 1165594 1087616 1049924 970343 957255 1015926 1099293 1089648 1203819 1302314 1160468 879682
17615 879682 1134070 1198615 1084276 1296114 986124 1248521 1071454 1240337 1293564 1037666
17605 1037666 1392968 1277232 1314408 1066091 1120023 1383565 1241036 996932 1159654 1313402
17595 1313402 1267779 1437339 1286939 1408845 1364684 1348612 1393202 1226907 1110517 1396065
17585 1396065 1372069 1277477 1407790 1111255 1199827 1539765 1284645 1350882 1299859 1199766
17575 1199766 1499805 1418264 1388180 1231024 1587232 1212979 1188123 1420857 1372386 1282041
17565 1282041 1353782 1410088 1195288 1234988 1260087 1190656 1142323 1241436 1011330 1181468 1044328
17554 1044328 1211313 1258376 1217082 1098769 1171681 1260179 1139953 1097187 1261787 1209321
$$ packed form
17626A165594p7978l7692p9581j3088N8671Q3367r645J14171R8495j41846k80786
17615H79682K54388O4545j14339K11838l09990K62397j77067J68883N3227k55898
17605A037666L55302j15736L7176k48317N3932K63542j42529k44104J62722J53748
17595A313402m5623J69560j50400J21906m4161j6072M4590j66295j16390K85548
17585A396065k3996r4592J30313k96535Q8572L39938k55120O6237n1023j00093
17575A199766L00039q1541l0084j57156L56208l74253k4856K32734m8471r0345
17565A282041P1741N6306k14800L9700K5099o9431m8333R9113k30106J70138j37140
17554A044328J66985M7063m1294j18313P2912Q8498j20226m2766J64600n2466
$$ plain form
17544 1209321 1259460 1337102 1326266 1312254 1437063 1416996 1232329 1395947 1467405 1559572 1344745
17533 1344745 1412297 1402399 1241197 1346374 1394632 1386491 1475470 1296078 1451472 1267408 1249838
17522 1249838 1405881 1390720 1435916 1416515 1317553 1624066 1563038 1613513 1455824 1693342
17512 1693342 1992748 2067603 2225538 2116839 2302608 2213538 2287353 2390172 2406263 2461163
17502 2461163 2434589 2431718 2578909 2827987 2772339 2961655 3205264 3601070 3900396 4435396
17492 4435396 4734454 5266094 5732957 6495987 7885942 10193605 14256044 20668635 30873968
17483 30873968 42790378 55767816 66958045 74529542 79116099 80608688 78801223 73801171
17475 73801171 65570507 55756806 46102809 38777900 34631854 34911222 39508745 48113376
$$ packed form
17544A209321N0139P7642j0836j4012J24809k0067j84667J63618P1458R2167k14827
17533A344745O7552r898j61202J05177M8258q141Q8979j79392J55394j84064j7570
17522A249838J56043j5161M5196j9401r8962L06513o1028N0475j57689K37518
17512A693342K99406P4855J57935j08699J85769q9070P3815J02819J6091N4900
17502B461163k6574k871J47191K49078n5648J89316K43609L95806K99326N35000
17492D435396K99058N31640M66863P63030J389955K307663M062439O412591J0205333
17483C0873968J1916410J2977438J1190229P571497M586557J492589j807465n000052
17475G3801171q230664r813701r653997p324909m146046K79368M597523Q604631
$$ plain form
17467 48113376 59098105 69201420 76876157 81023111 82382804 80697270 75733090 67521801
17459 67521801 56467154 45103141 34830489 26010574 19932755 15309392 11770944 9603985
17451 9603985 7656461 6277785 5413335 4763287 4208410 3896281 3738795 3603189 3496460
17442 3496460 3512801 3473955 3355904 3104862 3045160 2931647 2871223 2753982 3062987 2615912
17432 2615912 2658597 2990804 2888224 2830131 2896901 3033853 2873377 2548515 2721400 2414637
17422 2414637 2545709 2009394 2164380 2178195 2490460 2142168 2241011 2122528 2012811 2099226
17412 2099226 2301656 2095213 2145765 2315048 2104506 2063494 2385989 2153641 2413039 2388558
17402 2388558 2731411 2936097 2971033 3171586 2954395 3111341 3154244 3611737 3994728 4238572
$$ packed form
17467D8113376J0984729J0103315P674737M146954J359693j685534m964180q211289
17459F7521801j1054647j1364013j0272652q819915o077819m623363l538448k166959
17451I603985j947524j378676q64450o50048n54877l12129j57486j35606j06729
17442C496460J6341l8846j18051k51042n9702j13513o0424j17241L09005m47075
17432B615912M2685L32207j02580n8093O6770J36952j60476l24862J72885l06763
17422B414637J31072n36315J54986J3815L12265l48292R8843j18483j09717Q6415
17412B099226K02430k06443N0552J69283k10542m1012L22495k32348K59398k4481
17402B388558L42853K04686L4936K00553k17191J56946M2903M57493L82991K43844
$$ plain form
17392 4238572 4258673 4968572 5103178 5599522 5982508 6082246 6090749 6734769 6543171 6644039
17382 6644039 6550720 6156154 6111294 6034352 5853331 5956239 5738663 5663826 5809815 6194884
17372 6194884 6263842 6752139 6894208 7113080 7377942 7857658 7896987 8005727 7978663 8054909
17362 8054909 7909539 8240953 7778852 7772800 7775110 7637106 7917694 8044625 8177767 8632879
17352 8632879 8629309 9251838 9445265 10312895 10856142 11563346 11876930 12465757 12988272 13041226
17342 13041226 13124084 13184680 13050240 12900776 12630286 12101779 12024413 11697232 11531561 11540614
17332 11540614 11431014 11740549 12047069 12359122 12751235 13054100 13387364 13743253 13927906
17323 13927906 14028275 14491861 14580842 14412931 14386271 14181981 14137607 13838569 13776778 13480165
$$ packed form
17392D238572K0101P09899J34606M96344L82986R9738Q503O44020j91598J00868
17382F644039r3319l94566m4860p6942j81021J02908k17576p4837J45989L85069
17372F194884O8958M88297J42069K18872K64862M79716L9329J08740k7064P6246
17362H054909j45370L31414m62101o052K310j38004K80588J26931J33142M55112
17352H632879l570O22529J93427Q67630N43247P07204L13584N88827N22515N2954
17342A3041226Q2858O0596j34440j49464k70490n28507p7366l27181j65671R053
17332A1540614j09600L09535L06520L12053L92113L02865L33264L55889J84653
17323A3927906J00369M63586Q8981j67911k6660k04290m4374k99038o1791k96613
$$ plain form
17313 13480165 13298609 13200682 13041190 12667944 13146463 13095129 13632464 13414736 13661407 13997686
17303 13997686 13859695 14256336 14360710 14022568 14137066 14096329 13873745 13446203 13542246 13234133
17293 13234133 13348042 13005042 13091009 13143035 13149792 13292745 13407300 13321450 13122716 12916174
17283 12916174 12506601 12232927 11555086 11038163 10391116 9609901 8854515 8699056 7936379
17274 7936379 7475226 7013019 6582918 6172180 6004774 5686787 5586327 5632539 5393096 5098808
17264 5098808 5176963 5202342 4945656 5079369 4822030 4778114 4777495 4583831 4636299 4336150 3994251
17253 3994251 4003553 3861206 3990024 4041760 3732320 3728509 3825278 3718546 3823904 3594366
17243 3594366 3659393 3625126 3485827 3562734 3528945 3506542 3244776 3188681 3279682 2978860 3122384
$$ packed form
17313A3480165j81556r7927j59492l73246M78519n1334N37335k17728K46671L36279
17303A3997686j37991L96641J04374l38142J14498m0737k22584m27542R6043l08113
17293A3234133J13909l43000Q5967N2026O757J42953J14555q5850j98734k06542
17283A2916174m09573k73674o77841n16923o47047p81215p55386j55459p62677
17274G936379m61153m62207m30101m10738j67406l17987j00460M6212k39443k94288
17264E098808P8155K5379k56686J33713k57339m3916o19j93664N2468l00149l41899
17253C994251R302j42347J28818N1736l09440l811R6769j06732J05358k29538
17243C594366O5027l4267j39299P6907l3789k2403k61766n6095R1001l00822J43524
$$ plain form
17232 3122384 2902474 2806166 2820089 2828917 2684629 2641165 2552767 2860488 2799353 2916442 2918481
17221 2918481 2985318 2967184 3062902 2957138 3114836 2835042 2996700 2894735 3134328 2948626
17211 2948626 2990407 2931055 2913895 3087637 2814304 2898100 3055681 2881681 2699066 2988233
17201 2988233 2970559 2621395 2580416 2782825 2584218 2384309 2190429 2130695 2422119 2277700
17191 2277700 2120000 1966214 1889786 1848604 2068287 2065810 2201990 1877480 1983044 1949364
17181 1949364 1829678 2014604 1647535 1696235 1961709 2067576 1937111 1804184 1882010 1848316
17171 1848316 1851635 2048013 2163145 2034003 2194343 2185373 2209036 2191646 2192742 2463866 2495608
17160 2495608 2160398 2175991 2575954 2314373 2523508 2489260 2414531 2445323 2470041 2314390
$$ packed form
17232C122384k19910r6308J3923Q828j44288m3464q8398L07721o1135J17089K039
17221B918481O6837j8134R5718j05764J57698k79794J61658j01965K39593j85702
17211B948626M1781n9352j7160J73742k73333Q3796J57581j74000j82615K89167
17201B988233j7674l49164m0979K02409j98607j99909j93880n9734K91424j44419
17191B277700j57700j53786p6428m1182K19683k477J36180l24510J05564l3680
17181A949364j19686J84926l67069M8700K65474J05867j30465j32927P7826l3694
17171A848316L319J96378J15132j29142J60340q970K3663j7390J096K71124L1742
17160B495608l35210J5593L99963k61581K09135l4248p4729L0792K4718j55651
$$ plain form
17150 2314390 2711725 2270824 2619488 2591159 2735419 2537742 2581614 2449313 2383526 2541386
17140 2541386 2457967 2678788 2734540 2436693 2511613 2645152 2566234 2618691 2752373 2292706
17130 2292706 2602032 2426102 2376921 2349347 2300016 2653871 2343476 2637279 2713923 2427463
17120 2427463 2706070 2347702 2387981 2496651 2474254 2494951 2411616 2303199 2301815 2405259
17110 2405259 2478921 2302696 2592301 2592279 2532700 2484368 2485824 2415355 2460634 2346852 2455161
17099 2455161 2078614 2002477 2307038 2192855 1719311 2038988 1654065 1649162 1584194 1434404
17089 1434404 1539289 1141693 1285720 1321794 1391138 1206497 1191283 1149865 1161007 1100243
17079 1100243 1167501 1291369 1159803 1166771 1340134 1389325 1260890 1026303 1355370 1228491
$$ packed form
17150B314390L97335m40901L48664k8329J44260j97677M3872j32301o5787J57860
17140B541386q3419K20821N5752k97847P4920J33539p8918N2457J33682m59667
17130B292706L09326j75930m9181k7574m9331L53855l10395K93803P6644k86460
17120B427463K78607l58368M0279J08670k2397K0697q3335j08417j384J03444
17110B405259P3662j76225K89605k2n9579m8332J456p0469M5279j13782J08309
17099B455161l76547p6137L04561j14183m73544L19677l84923m903o4968j49790
17089A434404J04885l97596J44027L6074O9344j84641j5214m1418J1142o0764
17079A100243O7258J23868j31566O968J73363M9191j28435k34587L29067j26879
$$ plain form
17069 1228491 1386404 1189498 1236973 940162 1275255 1110934 1076211 1175836 1274522 1243508
17059 1243508 1249172 1245846 1522556 1701836 1762079 1848859 2208082 2076479 2143466 2291055 2241761
17048 2241761 2563417 2390628 2536683 2415179 2512386 2517687 2687112 2803367 3015070 2952849
17038 2952849 2802300 2846168 3082443 2959783 2816510 2674888 2435481 2279515 2177170 1822162
17028 1822162 2061429 2009910 1819193 1799311 1690979 1479536 1547271 1412656 1297969 1314186
17018 1314186 1255813 1207420 1488252 1269993 1300003 1176693 1211916 1116806 1285154 1153690
17008 1153690 1265148 1003464 1054561 1212555 1019715 1229096 944164 1061979 1259370 1155214
16998 1155214 1092357 1230089 1385093 1375795 961186 1335973 1165900 1220192 1269630 1157624
$$ packed form
17069A228491J57913j96906M7475k96811L35093j64321l4723R9625R8686l1014
17059A243508N664l326K76710J79280O0243Q6780L59223j31603O6987J47589m9294
17048B241761L21656j72789J46055j21504R7207N301J69425J16255K11703o2221
17038B952849j50549M3868K36275j22660j43273j41622k39407j55966j02345l55008
17028A822162K39267n1519j90717j9882j08332k11443O7735j34615j14687J6217
17018A314186n8373m8393K80832k18259L0010j23310L5223r5110J68348j31464
17008A153690J11458k61684N1097J57994j92840K09381k84932J17815J97391j04156
16998A155214o2857J37732J55004r298m14609L74787j70073N4292M9438j12006
$$ plain form
16988 1157624 1270049 1229136 1181883 920440 1022482 1140074 1433672 1196267 1478777 1236372
16978 1236372 1307304 1302709 1324349 1226641 1314311 1336828 1391050 1402118 1712041 1436669 1373066
16967 1373066 1880194 1898323 2002139 1752989 2111954 2067026 2067585 2321529 2320364 2389969 2561165
16956 2561165 2407401 2383135 2424761 2380407 2390124 2394818 2274101 2469405 2487174 2216464 2172202
16945 2172202 2017874 2062828 1671876 1706293 1723860 1529881 1306042 1569259 1327865 1345740
16935 1345740 1135107 1296346 1072364 1447107 1367803 1182730 1029900 1146813 1371075 1270734
16925 1270734 1257521 949257 864074 1004485 1388418 764612 1470005 1047302 1168732 1010004
16915 1010004 897757 594619 757971 1010982 970972 1106678 767429 949566 684157 955447
$$ packed form
16988A157624J12425m0913m7253k61443J02042J17592K93598k37405K82510k42405
16978A236372P0932m595K1640r7708Q7670K2517N4222J1068L09923k75372o3603
16967A373066N07128J8129J03816k49150L58965m4928N59K53944j165O9605J71196
16956B561165j53764k4266M1626m4354R717M694j20717J95304J7769k70710m4262
16945B172202j54328M4954l90952L4417J7567j93979k23839K63217k41394J7875
16935A345740k10633J61239k23982L74743p9304j85073j52830J16913K24262j00341
16925A270734j3213l08264q5183J40411L83933o23806P05393m22703J21430j58728
16915A010004j12247l03138J63352K53011m0010J35706l39249J82137k65409K71290
$$ plain form
16905 955447 935437 502317 936408 791953 1001268 647807 995423 841007 859324 854953
16895 854953 867739 672183 831328 752302 903550 791410 845169 861296 791096 739146 708762
16884 708762 944119 599775 763902 764755 541200 812156 843345 786848 741569 718610 922975
16873 922975 886350 1056631 646625 992890 886372 826219 852244 954219 939160 1070573
16863 1070573 844505 946171 762254 880030 676699 736883 688114 941513 877742 647493
16853 647493 834396 1104274 899736 921688 851899 924510 741122 818150 1084073 826938
16843 826938 969336 771906 651826 759936 660932 623997 757293 731985 1146121 975876
16833 975876 770678 854293 969924 863513 950616 836820 928495 1075921 1092166 1121157
$$ packed form
16905I55447k0010m33120M34091j44455K09315l53461L47616j54416J8317m371
16895H54953J2786j95556J59145p9026J51248j12140N3759J6127p0200n1950l0384
16884G08762K35357l44344J64127Q53k23555K70956L1189n6497m5279k2959K04365
16873I22975l6625J70281m10006L46265j06518o0153K6025J01975j5059J31413
16863A070573k26068J01666j83917J17776k03331O0184m8769K53399o3771k30249
16853F47493J86903K69878k04538K1952o9789P2611j83388P7028K65923k57135
16843H26938J42398j97430j20080J08110r9004l6935J33296k5308M14136j70245
16833I75876k05198Q3615J15631j06411Q7103j13796R1675J47426J6245K8991
$$ plain form
16823 1121157 1117911 1337337 1468458 1316329 1311376 1401562 1419626 1648614 1565207 1528518 1581497
16812 1581497 1661863 1628036 1774397 1617914 1749602 1460903 1641416 1459918 1668032 1770262
16802 1770262 1437348 1518139 1588087 1423421 1484943 1445944 1213766 1301516 1127733 1432951
16792 1432951 1035635 923381 1364988 1268560 800611 915407 884931 868619 940884 970582
16782 970582 766096 553242 558190 830713 1017442 708147 755679 526536 773496 836045
16772 836045 978876 694995 938492 812178 685963 937695 819939 805748 610042 543342
16762 543342 1013595 821322 874989 629023 991928 811479 620879 844300 813848 763380
16752 763380 670163 822168 765105 837147 893890 787835 831802 860695 540757 891794 803085
$$ packed form
16823A121157l246K19426J31121j52129m953R0186J8064K28988q3407l6689N2979
16812A581497Q0366l3827J46361j56483J31688k88699J80513j81498K08114J02230
16802A770262l32914Q0791O9948j64666O1522l8999k32178Q7750j73783L05218
16792A432951l97316j12254M41607r6428m67949J14796l0476j6312P2265K9698
16782I70582k04486k12854M948K72523J86729l09295M7532k29143K46960O2549
16772H36045J42831k83881K43497j26314j26215K51732j17756j4191j95706o6700
16762E43342M70253j92273N3667k45966L62905j80449j90600K23421l0452n0468
16752G63380r3217J52005n7063P2042N6743j06055M3967K8893l19938L51037q8709
$$ plain form
16741 803085 721695 794642 581846 772934 767995 676354 783151 742752 762805 680903 818430
16730 818430 685243 1133462 697745 864256 812074 780222 1003333 855073 926114 753641
16720 753641 888755 960595 1001842 1064404 1066150 1058747 870232 1091202 752702 1239261 935377
16709 935377 855205 1207886 1214044 980112 1336577 1427826 1555845 1529247 1564844 1376847 1367556
16698 1367556 1540153 1287198 1292966 1529174 1368883 1504285 1294100 1600400 1822093 1467322
16688 1467322 1625135 1439727 1282066 1378837 1557652 1462297 1347716 1418277 1407413 1080734
16678 1080734 1258050 1147411 939580 1165654 976560 1289772 1184617 1377827 1367730 1404389
16668 1404389 1538081 1604773 1651854 1776131 1665502 1716328 1571719 1595728 1565822 1513282
$$ packed form
16741H03085q1390P2947k12796J91088m939r1641J06797m0399K0053q1902J37527
16730H18430j33187M48219m35717J66511n2182l1852K23111j48260P1041j72473
16720G53641J35114P1840M1247O2562J746p403j88515K20970l38500M86559l03884
16709I35377q0172L52681O158k33932L56465R1249J28019k6598L5597j87997r291
16698A367556J72597k52955N768K36208j60291J35402k10185L06300K21693l54771
16688A467322J57813j85408j57661R6771J78815r5355j14581P0561j0864l26679
16678A080734J77316j10639k07831K26074j89094L13212j05155J93210j0097L6659
16668A404389J33692O6692M7081J24277j10629N0826j44609K4009k9906n2540
$$ plain form
16658 1513282 1520314 1674377 1648589 1787907 1724022 1436008 1938457 1664909 1574020 1575693 1352867
16647 1352867 1280892 1236993 1031572 1211199 961099 947861 745418 887745 969006 753701
16637 753701 634053 749523 659850 815159 865260 516420 683722 784713 800934 838599
16627 838599 592099 762433 846916 774691 778873 777320 805745 819761 678950 479986 826090
16616 826090 711104 721193 792088 742398 562651 644960 617243 592604 698407 589446 549685
16605 549685 718975 660918 721082 659696 938621 864654 782693 660692 947106 723063
16595 723063 873628 867939 1041879 796962 939375 985901 1009715 1045726 1141542 881107 939925
16584 939925 969713 952591 1185245 773293 677462 950411 763557 769493 944363 941111 786734
$$ packed form
16658A513282P032J54063k5788J39318o3885k88014N02449k73548r0889J673k22826
16647A352867p1975m3899k05421J79627k50100j3238k02443J42327Q1261k15305
16637G53701j19648J15470q9673J55309N0101l48840J67302J00991J6221L7665
16627H38599k46500J70334Q4483p2225M182j553K8425J4016j40811j98964L46104
16616H26090j14986J0089P0895m9690j79747Q2309k7717k4639J05803j08961l9761
16605E49685J69290n8057O0164o1386K78925p3967q1961j22001K86414k24043
16595G23063J50565n689J73940k44917J42413M6526K3814L6011R5816k60435N8818
16584I39925K9788j7122K32654m11952r5831K72949j86854N936J74870l252j54377
$$ plain form
16573 786734 775334 692780 789210 576154 497127 719678 617571 750265 601052 869895
16563 869895 881922 886172 810326 787294 840446 934620 907515 956709 622192 906414 668114
16552 668114 847159 726903 872765 725313 739739 963146 776424 735268 759632 611872
16542 611872 577634 648578 586240 947012 725122 732560 582117 587466 811160 917292 765620
16531 765620 916404 929515 848572 655138 910506 645194 677698 613202 961811 667618
16521 667618 964991 771906 860985 726257 484876 589216 774606 863850 840593 854321
16511 854321 831614 763345 674504 1040175 915795 1063845 915818 888079 1035429 979125
16501 979125 1261014 1191780 1216957 1175235 1415346 1256599 1005969 830822 870290 1072125
$$ packed form
16573G86734j1400q2554R6430k13056p9027K22551j02107J32694j49213K68843
16563H69895J2027M250p5846k3032N3152R4174k7105M9194l34517K84222k38300
16552F68114J79045j20256J45862j47452J4426K23407j86722m1156K4364j47760
16542F11872l4238P0944o2338L60772k21890P438j50443N349K23694J06132j51672
16531G65620J50784J3111q0943j93434K55368k65312L2504o4496L48609k94193
16521F67618K97373j93085Q9079j34728k41381J04340J85390Q9244k3257J3728
16511H54321k2707o8269q8841L65671j24380J48050j48027k7739J47350n6304
16501I79125K81889o9234K5177m1722K40111j58747k50630j75147L9468K01835
$$ plain form
16491 1072125 1001407 876038 781480 865686 918126 741854 667039 919427 768160 725134
16481 725134 934278 897379 1242937 1084768 947526 900187 901632 883843 1058546 974691 748454
16470 748454 845245 950690 1156028 859848 831579 1123745 1154489 1298663 1332428 1242100
16460 1242100 1509551 1473615 1429131 1705813 1405516 1822366 1758171 1571199 1669551 1581257
16450 1581257 1786326 1631584 1742708 1683471 1513840 1874652 1606940 1616210 1767634 1797292
16440 1797292 1994490 2134004 2254017 2337473 2783627 2864967 3208046 3585958 4138213 4426556
16430 4426556 5137887 5543275 6032235 6362408 7076794 7907725 8542561 9383753 10047242
16421 10047242 11116951 12310017 13408629 14685619 16224689 17709294 19574861 21350163
$$ packed form
16491A072125p0718j25369r4558Q4206N2440j76272p4815K52388j51267m3026
16481G25134K09144l6899L45558j58169j37242m7339J445j7789J74703q3855k26237
16470G48454R6791J05445K05338k96180k8269K92166L0744J44174L3765r0328
16460A242100K67451l5936m4484K76682l00297M16850o4195j86972R8352q8294
16450A581257K05069j54742J11124n9237j69631L60812k67712R270J51424K9658
16440A797292J97198J39514J20013Q3456M46154Q1340L43079L77912N52255K88343
16430D426556P11331M05388M88960L30173P14386Q30931O34836Q41192O63489
16421A0047242J069709J193066J098612J276990J539070J484605J865567J775302
$$ plain form
16413 21350163 23400327 25783360 28129027 30461839 33020904 35696623 38785639 41509035
16405 41509035 44493611 46891218 49906270 52310053 53737901 54178094 54114508 53444669 52473448
16396 52473448 51196958 49673705 49138613 50726515 55577536 65085465 78536919 93496339
16388 93496339 104949735 109384959 107671147 100969268 91172386 80460940 68529843 53737144
16380 53737144 34604409 11125261 -15240604 -39289183 -56252295 -63945281 -63142905
16373 -63142905 -55190553 -42307272 -27901621 -14836301 -4940864 1891026 6072131 8369258
16365 8369258 8892324 8529221 7607367 6599669 5719043 4754396 3982721 3505524 3007041
16356 3007041 2780832 2326629 2260386 1809874 1741991 1854010 1657969 1640930 1641923 1365969
$$ packed form
16413B1350163K050164K383033K345667K332812K559065K675719L089016K723396
16405D1509035K984576K397607L015052K403783J427848M40193o3586o69839r71221
16396E2473448j276490j523253n35092J587902M851021R507929J3451454J4959420
16388I3496339J1453396M435224j713812o701879r796882j0711446j1931097j4792699
16380E3737144j9132735A1125261a5240604k4048579j6963112p692986Q02376
16373f3142905P952352J2883281J4405651J3065320d940864A891026M181105K297127
16365H369258N23066l63103r21854j007698q80626r64647p71675m77197m98483
16356C007041k26209m54203o6243m50512o7883J12019j96041j7039R93k75954
$$ plain form
16346 1365969 1564872 1160935 1203107 1156388 708322 1015073 643877 730418 545507 410886
16336 410886 587356 360947 742776 496098 712686 777827 880956 728310 1095758 858443
16326 858443 579127 572154 337483 589346 475970 295491 507564 11474 235727 335504
16316 335504 87368 120569 110037 257299 222613 31117 64944 322017 212194 234330 451262
16305 451262 694980 523237 516759 592096 450191 615967 779113 834087 545284 586265
16295 586265 706530 554966 275340 462950 655613 343079 431096 547907 664854 492886
16285 492886 697001 733144 1048352 969483 1063708 840569 968525 1089469 1014494 934472
16275 934472 902679 812336 748847 795057 592670 613827 716800 584919 923040 614848
$$ packed form
16346A365969J98903m03937M2172m6719m48066L06751l71196Q6541j84911j34621
16336D10886J76470k26409L81829k46678K16588O5141J03129j52646L67448k37315
16326H58443k79316o973k34671K51863j13376j80479K12073A1474K24253R9777
16316C35504H7368L3201j0532J47262l4686C1117L3827K57073j09823K2136K16932
16305D51262K43718j71743o478P5337j41905J65776J63146N4974k88803M0981
16295E86265J20265j51564B75340J87610J92663l12534Q8017J16811J16947j71968
16285D92886K04115L6143L15208p8869R4225k23139J27956J20944p4975q0022
16275I34472l1793r0343o3489M6210k02387K1157J02973j31881L38121l08192
$$ plain form
16265 614848 504573 619672 649136 581047 542044 417618 670332 696999 284896 574824
16255 574824 596506 557478 716242 427654 508743 455352 570150 513736 581865 630832 575340
16244 575340 811092 887027 884596 1126843 760989 1144571 1069830 1154154 1072095 1188445 1306385
16233 1306385 1167765 1277129 961513 944942 954702 1105678 1117380 1164841 891355 801120
16223 801120 880344 851634 691443 768518 888582 619972 779204 869887 820140 658325
16213 658325 877864 591589 746913 907873 709156 647801 744458 567355 563217 862764
16203 862764 898432 862184 862443 657693 552044 845962 815874 810211 840358 996423 799509
16192 799509 1047349 972208 952070 895240 1065567 991045 1046282 994720 1154578 1028320 844824
$$ packed form
16265F14848j10275J15099K9464o8089l9003j24426K52714K6667B84896K89928
16255E74824K1682l9028J58764k88588Q1089n3391J14798n6414O8129M8967n5492
16244E75340K35752P5935k431K42247l65854L83582p4741Q4324q2059J16350J17940
16233A306385j38620J09364l15616j6571R760J50976J1702M7461k73486r0235
16223H01120P9224k8710j60191P7075J20064k68610J59232R0683m9747j61815
16213F58325K19539k86275J55324J60960j98717o1355R6657j77103m138K99547
16203H62764L5668l6248K59k04750j05649K93918l0088n663L0147J56065j96914
16192G99509K47840p5141k0138n6830J70327p4522N5237n1562J59858j26258j83496
$$ plain form
16181 844824 929833 876801 851137 947218 763013 724767 766815 870355 816164 856000 935611
16170 935611 955666 741604 875393 714562 826678 737188 910894 860013 851985 1064711
16160 1064711 793192 894423 1060529 642439 632999 844767 896212 820250 800306 774142
16150 774142 922458 778728 766244 950483 838383 874236 930899 920303 876689 921589 741747
16139 741747 768780 868912 1004709 764833 952465 672235 680628 810431 716780 808157
16129 808157 693397 763771 897182 980661 692102 641697 838233 881084 759008 980111
16119 980111 818972 1090224 658776 950041 1079178 955810 876778 1134783 1145484 807877
16109 807877 985870 1069544 941179 854223 707939 813777 757083 1124795 978292 766767
$$ packed form
16181H44824Q5009n3032k5664R6081j84205l8246M2048J03540n4191L9836P9611
16170I35611K0055k14062J33789j60831J12116q9490J73706n0881q028K12726
16160A064711k71519J01231J66106m18090r440K11768N1445p5962j9944k6164
16150G74142J48316j43730j2484J84239j12100L5853N6663j0596m3614M4900j79842
16139G41747K7033J00132J35797k39876J87632k80230Q393J29803r3651R1377
16129H08157j14760P0374J33411Q3479k88559n0405J96536M2851j22076K21103
16119I80111j61139K71252m31448K91265J29137j23368p9032K58005J0701l37607
16109H07877J77993Q3674j28365q6956j46284J05838n6694L67712j46503k11525
$$ plain form
16099 766767 923554 1063375 973896 1172473 1059322 902324 942764 1182565 1160158 1068503
16089 1068503 933555 1107550 1244267 1305560 984699 1142246 1292037 1276713 1286377 1029679
16079 1029679 1116122 1224862 1269874 1063933 1093542 1103461 1280687 1210745 1221100 1308906 1210054
16068 1210054 1217215 1276115 1149577 1439600 1246298 1328080 1445343 1227352 1455769 1531634
16058 1531634 1219001 1544258 1485201 1668011 1396688 1362526 1393440 1818256 1683002 1814321
16048 1814321 1691967 1760417 1727405 1590196 1469792 2109061 1602886 2046773 1626743 1667277
16038 1667277 1816023 1781007 1514992 1697658 1600968 1822279 2190404 1880200 1756442 1810926
16028 1810926 1626265 1876381 2039568 1842248 1959127 1962911 1921551 1918108 1968677 2057234 2234227
$$ packed form
16099G66767J56787J39821q9479J98577j13151j56998M0440K39801k2407r1655
16089A068503j34948J73995J36717O1293l20861J57547J49791j5324R664k56698
16079A029679Q6443J08740M5012k05941K9609R919J77226o9942J0355Q7806r8852
16068A210054P161N8900j26538K90023j93302Q1782J17263k17991K28417P5865
16058A531634l12633L25257n9057J82810k71323l4162L0914M24816j35254J31319
16048A814321j22354O8450l3012j37209j20404O39269n06175M43887m20030M0534
16038A667277J48746l5016k66015J82666r6690K21311L68125l10204j23758N4484
16028A810926j84661K50116J63187j97320J16879L784m1360l443N0569Q8557J76993
$$ plain form
16017 2234227 2122318 2105064 2000544 2223572 2255061 2148471 2145644 2162452 2088048 2011023 1902233
16006 1902233 2090802 2017429 2072846 1870032 2090709 1903204 2140316 2260922 2251854 1902331
15996 1902331 2005508 2113855 2147786 2016793 2220327 1871739 2175371 2185137 1991735 2145951
15986 2145951 2181487 2244935 2044520 2221736 2153523 2148326 2290115 2482278 2087487 2261728
15976 2261728 2260103 2377998 2093301 2152059 2228070 2128893 2303802 2182000 2190593 2017015 2090614
15965 2090614 2080007 2152450 2125733 2331255 2094253 2116568 2467453 2280658 2174091 2017955
15955 2017955 2274836 2205712 2348133 2005375 2491803 2295332 2435094 2343168 2327473 2125223
15945 2125223 2318573 2335283 2348238 2371934 2305689 2405641 2606925 2423703 2277954 2477778
$$ packed form
16017B234227j11909j7254j04520K23028L1489j06590k827J6808p4404p7025j08790
16006A902233J88569p3373N5417k02814K20677j87505K37112J20606r068l49523
15996A902331J03177J08347L3931j30993K03534l48588L03632R766j93402J54216
15986B145951L5536O3448k00415J77216o8213n197J41789J92163l94791J74241
15976B261728j625J17895k84697N8758P6011r9177J74909j21802Q593j73578P3599
15965B090614j0607P2443k6717K05522k37002K2315L50885j86795j06567j56136
15955B017955K56881o9124J42421l42758M86428j96471J39762r1926j5695k02250
15945B125223J93350J6710J2955K3696o6245R9952K01284j83222j45749J99824
$$ plain form
15935 2477778 2465940 2520230 2880624 2778094 2583029 2884459 2878489 2828351 2976432 3004287
15925 3004287 2977627 3183815 3316888 3489245 3638911 3910649 4243818 4233237 4615856 4903040
15915 4903040 5593590 6129682 6841359 8337716 10331804 13195727 17137403 22682236 29199825
15906 29199825 36981598 44743727 51755812 57238204 60442887 61349007 60196673 56760084
15898 56760084 51230925 44602388 37835004 31110021 24960993 20285562 16280290 13296773
15890 13296773 10921737 9148202 7637789 6292290 5420329 4954039 4100752 3722363 3701273
15881 3701273 3259947 3237580 2932367 2786581 2727368 2709480 2773185 2544250 2799321 2359690
15871 2359690 2581483 2622543 2510434 2431018 2301225 2447511 2514199 2559705 2261739 2106094
$$ packed form
15935B477778j1838N4290L60394j02530j95065L01430n970n0138J48081K7855
15925C004287k6660K06188J33073J72357J49666K71738L33169j0581L82619K87184
15915D903040O90550N36092P11677J496357J994088K863923L941676N544833O517589
15906B9199825P781773P762129P012085N482392L204683R06120j152334l436589
15898E6760084n529159o628537o767384o724983o149028m675431m005272k983517
15890A3296773k375036j773535j510413j345499q71961m66290q53287l78389k1090
15881C701273m41326k2367l05213j45786n9213j7888O3705k28935K55071m39631
15871B359690K21793M1060j12109p9416j29793J46286O6688M5506k97966j55645
$$ plain form
15861 2106094 2423379 2193744 2256955 2111316 2151132 2135904 2017828 2037466 2197439 2073838
15851 2073838 2111064 2164808 2074616 2246127 2022216 2233315 2227052 1947605 2280514 2263152
15841 2263152 1912314 2199777 2201559 2356392 2490170 2335200 2389463 2572050 2532852 2453508
15831 2453508 2480316 2407862 2616349 2369236 2321817 2382879 2192676 2305055 2326292 2451556
15821 2451556 2383276 2397727 2348622 2352266 2140935 2290284 2438751 2211231 2362327 2521677
15811 2521677 2361488 2241911 2485634 2583672 2567340 2532810 2440870 2427026 2494369 2768989
15801 2768989 2438102 2528466 2538453 2782130 2659081 2915383 2969104 3087177 3164906 3311323
15791 3311323 3394999 3294593 3290059 3241352 3531767 3508905 3486886 3789929 3882343 4053149 3999545
$$ packed form
15861B106094L17285k29635O3211j45639L9816j5228j18076J9638J59973j23601
15851B073838L7226N3744r0192J71511k23911K11099o263k79447L32909j7362
15841B263152l50838K87463J782J54833J33778j54970N4263J82587l9198p9344
15831B453508K6808p2454K08487k47113m7419O1062j90203J12379K1237J25264
15821B451556o8280J4451m9105L644k11331J49349J48467k27520J51096J59350
15811B521677j60189j19577K43723R8038j6332l4530r1940j3844O7343K74620
15801B768989l30887R0364R987K43677j23049K56302N3721J18073P7729J46417
15791C311323Q3676j00406m534m8707K90415k2862k2019L03043R2414J70806n3604
$$ plain form
15780 3999545 4139818 4428609 4303629 4324993 4399770 4422139 4583657 4744500 4444469 4477065
15770 4477065 4668441 4725647 4575218 4666661 4669958 4696907 4605106 4755977 5058260 4794427
15760 4794427 4757281 5001184 4834425 4985069 4983296 4950271 5142405 4886677 5016817 5311976
15750 5311976 5211235 5290714 5323966 5555198 5633934 5824009 6124970 6139550 6345410 6672447
15740 6672447 6686868 6792478 7247724 7272910 6998708 7326983 7144644 7253827 7110783 7180322
15730 7180322 7314996 7740564 7630300 7683707 7713179 7299690 7127211 7256513 6635739 6704840
15720 6704840 6585554 6814777 6588106 6894234 6738954 6871166 6789095 6721257 6800582 6625863
15710 6625863 6423967 6780656 6679985 6774935 6849198 6722112 6929637 7136745 7376714 7433720
$$ packed form
15780C999545J40273K88791j24980K1364P4777K2369J61518J60843l00031L2596
15770D477065J91376N7206j50429R1443L297K6949r1801J50871L02283k63833
15760D794427l7146K43903j66759J50644j773l3025J92134k55728J30140K95159
15750E311976j00741P9479L3252K31232P8736J90075L00961J4580K05860L27037
15740F672447J4421J05610M55246K5186k74202L28275j82339J09183j43044O9539
15730G180322J34674M25568j10264N3407K9472m13489j72479J29302o20774O9101
15720F704840j19286K29223k26671L06128j55280J32212q2071o7838P9325j74719
15710F625863k01896L56689j00671R4950P4263j27086K07525K07108K39969N7006
$$ plain form
15700 7433720 7607447 7876410 7912649 8046515 8125647 8286923 8288216 8329789 8311765 8310471 8143563
15689 8143563 8093440 8059377 7789629 7786907 7600383 7508382 7702233 7796944 7716813 7677062 7534645
15678 7534645 7560632 7328002 7373446 7102559 6686281 6676319 6818647 6702410 6606073 6913033
15668 6913033 6649287 6530651 6989167 6860454 7042651 7299160 7297159 7531336 7851398 8135075
15658 8135075 8412442 8875853 9314087 9717796 10560515 10922881 11282928 11920969 12487815
15649 12487815 13180468 13861704 14288618 14791396 15061893 15915030 16500601 17327283 17894519
15640 17894519 18940111 19733615 20203942 20990923 21728752 21671171 22079374 22185056 22134029
15631 22134029 21807134 21795587 21588770 21550635 21433845 21689624 21379609 21338474 21135809 21066492
$$ packed form
15700G433720J73727K68963L6239J33866P9132J61276J293M1573j8024j294j66908
15689H143563n0123l4063k69748k722j86524r2001J93851R4711q0131l9751j42417
15678G534645K5987k32630M5444k70887m16278r962J42328j16237r6337L06960
15668F913033k63746j18636M58516j28713J82197K56509k001K34177L20062K83677
15658H135075K77367M63411M38234M03709Q42719L62366L60047O38041N66846
15649A2487815O92653O81236M26914N02778K70497Q53137N85571Q26682N67236
15640A7894519J045592P93504M70327P86981P37829n7581M08203J05682n1027
15631B2134029l26895j1547k06817l8135j16790K55779l10015m1135k02665o9317
$$ plain form
15621 21066492 20375755 19893685 18993847 18338968 17359347 16483951 15685291 15067020 14572577
15612 14572577 14192853 13574396 13403979 12899630 12503327 11938890 11632587 11200210 10832457
15603 10832457 10596672 10601171 10490123 10072222 10127746 10169704 9989930 10115697 10466896 11192119
15593 11192119 11727936 13476524 17192546 23413804 34847428 50563343 63829890 72583082
15585 72583082 77998355 81034384 81350797 78516766 70421076 59082628 46755814 36388533
15577 36388533 27701291 21999069 18262707 15192711 12913690 11246281 10438082 9687544
15569 9687544 9093712 9251313 9059153 9107916 9023980 9104614 9404427 9713219 9751758 10108818
15559 10108818 11078476 12543311 15015657 20461584 30259762 47441604 67940597 83973223
$$ packed form
15621B1066492o90737m82070q99838o54879r79621q75396p98660o18271m94443
15612A4572577l79724o18457j70417n04349l96303n64437l06303m32377l67753
15603A0832457k35785M499j11048m17901N5524M1958j79774J25767L51199P25223
15593A1192119N35817J748588L716022O221258J1433624J5715915J3266547Q753192
15585G2583082N415273L036029L16413k834031q095690j1338448j2326814j0367281
15577C6388533q687242n702222l736362l069996k279021j667409q08199p50538
15569I687544n93832J57601j92160M8763q3936Q0634K99813L08792L8539L57060
15559A0108818R69658J464835K472346N445927R798178J7181842K0498993J6032626
$$ plain form
15551 83973223 94057769 100317431 103267412 102270445 96795660 84494015 68583334 52926680
15543 52926680 40032467 30067792 22657812 18074374 14735628 11855283 10200316 8852703
15535 8852703 7463415 6840407 6549757 6222431 6009936 5721496 5554563 5384567 5049525
15526 5049525 5045928 4698597 4661591 4273376 4356021 4134940 4417987 4132097 4299157 4150667
15516 4150667 4315954 4130006 4205404 4396401 4410318 4436615 4738084 4662358 4775974 4929225
15506 4929225 4866536 4631604 4578854 4906453 4701511 4469248 4417327 4469174 4551153 4093104
15496 4093104 4282777 4307406 4420418 4573707 4349776 4531668 4435180 4754298 4852278 4801968
15486 4801968 4794392 5014429 5386513 5560448 5837457 5821214 6176222 6089831 6281859 6463812
$$ packed form
15551H3973223J0084546O259662K949981r96967n474785j2301645j5910681j5656654
15543E2926680j2894213r964675p409980m583438l338746k880345j654967j347613
15535H852703j389288o23008k90650l27326k12495k88440j66933j69996l35042
15526E049525l597l47331l7006l88215Q2645k21081K83047k85890J67060j48490
15516D150667J65287j85948P5398J90997J3917K6297L01469p5726J13616J53251
15506D929225o2689k34932n2750L27599k04942k32263n1921N1847Q1979m58049
15496D093104J89673K4629J13012J53289k23931J81892r6488L19118R7980n0310
15486D801968p576K20037L72084J73935K77009j6243L55008q6391J92028J81953
$$ plain form
15476 6463812 6510751 6181131 6378854 6695320 6966782 7466402 8331583 9202671 9448664 10289640
15466 10289640 10605904 10803554 10845864 10815020 10624877 10389182 9943677 9413500 9422116 9532616
15456 9532616 9962585 10282592 11164705 11497402 11942394 11901987 12065903 11704793 11756289 11116006
15446 11116006 10591558 10225159 9803011 9557638 9741190 10030156 9967623 10024283 10256260 10127529
15436 10127529 10054755 9882765 9617563 9532011 9191424 8934452 8392728 7954286 7963702 7821652
15426 7821652 7609785 7219637 7085748 6864341 6963408 6423327 6370146 6230209 5807818 5773861
15416 5773861 5487257 5066939 5352911 5384546 5189637 5046107 5116867 5156984 5355151 5201606
15406 5201606 5236423 5048315 5318609 5414026 5295584 5493123 5562767 5632293 5898207 5756536
$$ packed form
15476F463812M6939l29620J97723L16466K71462M99620Q65181Q71088K45993Q40976
15466A0289640L16264J97650M2310l0844j90143k35695m45505n30177Q616J10500
15456I532616M29969L20007Q82113L32697M44992m0407J63916l61110N1496o40283
15446A1116006n24448l66399m22148k45373J83552K88966o2533N6660K31977j28731
15436A0127529p2774j71990k65202q5552l40587k56972n41724m38442R416j42050
15426G821652k11867l90148j33889k21407R9067n40081n3181j39937m22391l3957
15416E773861k86604m20318K85972L1635j94909j43530P0760M0117J98167j53545
15406E201606L4817j88108K70294R5417j18442J97539O9644O9526K65914j41671
$$ plain form
15396 5756536 6034201 5498497 5540604 5879645 5664291 5904104 5870454 5914958 5580078 5665476
15386 5665476 5827667 5986443 5988492 5858165 6104809 6119925 6278115 6191399 6101916 6308286
15376 6308286 6272619 5876915 6325195 6346960 6072644 6202658 6038755 6117131 6084027 6471723
15366 6471723 6465778 6605826 6609709 6648101 6882776 6814340 7032501 7174760 7296495 7460506
15356 7460506 7801726 8070422 8108616 8355504 8830893 9221233 9861529 11522025 13955089
15347 13955089 18608427 25831100 34286093 41324426 46345627 49338076 51126470 51066371
15339 51066371 49046994 44507201 38663002 32462462 27523995 23392128 20651894 18784136
15331 18784136 17672519 16449612 15541532 14570730 14098329 13377884 13321504 12831861 12860464
$$ packed form
15396E756536K77665n35704M2107L39041k15354K39813l3650M4504l34880Q5398
15386E665476J62191J58776K049j30327K46644J5116J58190q6716q9483K06370
15376F308286l5667l95704M48280K1765k74316J30014j63903P8376l3104L87696
15366F471723n945J40048L883L8392K34675o8436K18161J42259J21735J64011
15356G460506L41220K68696L8194K46888M75389L90340O40296J660496K433064
15347A3955089M653338P222673Q454993P038333N021201K992449J788394o0099
15339E1066371k019377m539793n844199o200540m938467m131867k740234j867758
15331A8784136j111617j222907r08080r70802m72401p20445n6380m89643K8603
$$ plain form
15322 12860464 12682518 13071132 13376000 13451390 14274534 15477461 17380380 21042726 27386494
15313 27386494 37853952 52066937 66368795 78055267 86295960 91049303 92583494
15306 92583494 90258532 83765178 73532294 61611136 49407570 39027392 31215168
15299 31215168 25474666 21511087 18698201 16567606 15426423 14465891 13912565 13387297
15291 13387297 13347311 12798256 12860741 12556857 12488894 12288395 12068210 12261575 12653909 13172456
15281 13172456 14678591 17635816 22459133 29604193 37381431 43352678 47372299 50062428
15273 50062428 50624714 50181582 47612010 42267667 36175643 29971285 24606240 20781306
15265 20781306 17853596 15928522 14663838 13014682 11853450 10743609 9880640 9675452
$$ packed form
15322A2860464j77946L88614L04868P5390Q23144J202927J902919L662346O343768
15313B7386494J0467458J4212985J4301858J1686472Q240693M753343J534191
15306I2583494k324962o493354j0232884j1921158j2203566j0380178p812224
15299C1215168n740502l963579k812886k130595j141183r60532n53326n25268
15291A3387297l9986n49055O2485l03884o7963k00499k20185J93365L92334N18547
15281A3172456J506135K957225M823317P145060P777238N971247M019621K690129
15273E0062428N62286m43132k569572n344343o092024o204358n365045l824934
15265B0781306k927710j925074j264684j649156j161232j109841q62969k05188
$$ plain form
15257 9675452 9573061 9307229 9526261 9680720 9782298 9951442 10087628 10375819 10554101
15248 10554101 10560038 10708005 10279425 10285601 9976660 9641401 9548693 9297750 8863464 8924375
15238 8924375 8798277 9045007 9613869 9616865 10216838 10897213 11036886 11491623 11558476 11771766
15228 11771766 11644826 11464844 11119155 10640489 10514641 9736082 9529815 9676351 9427766
15219 9427766 9387273 9552275 9942955 10134548 10543294 10760700 11111706 11531729 11255827 11067929
15209 11067929 10738806 10413723 10006978 9396111 8926248 8352400 7931054 7738014 7428307
15200 7428307 6937689 7000341 6645845 6453484 6321022 6478195 6292494 6552211 6461378 6701848
15190 6701848 7027642 7048338 7044324 7167073 7284439 7305640 7175671 7562672 7194609 7415743
$$ packed form
15257I675452j02391k65832K19032J54459J01578J69144J36186K88191J78282
15248A0554101N937J47967m28580O176l08941l35259r2708k50943m34286O0911
15238H924375j26098K46730N68862K996N99973O80375J39673M54737O6853K13290
15228A1771766j26940j79982l45689m78666j25848p78559k06267J46536k48585
15219I427766m0493J65002L90680J91593M08746K17406L51006M20023k75902j87898
15209A1067929l29123l25083m06745o10867m69863n73848m21346j93040l09707
15200G428307m90618O2652l54496j92361j32462J57173j85701K59717r0833K40470
15190F701848L25794K0696m014J22749J17366K1201j29969L87001l68063K21134
$$ plain form
15180 7415743 7457013 7620243 7960634 7871215 8122181 8175705 8065784 8151947 8492225 8344858
15170 8344858 8184001 8158621 8076831 8094654 7930552 8154044 7875643 7925353 8080195 8184759
15160 8184759 8463294 8753269 8959996 8863170 8994681 9028040 9035828 8984280 8605518 9066771
15150 9066771 8853191 8728933 8579819 8669684 8646603 8591728 8590486 8743065 8636620 8585627
15140 8585627 8664993 8463639 8686286 8750052 8826277 8780828 8722821 8904434 8812048 8596169
15130 8596169 8610099 8706319 8596912 8729656 8853338 8873379 8637390 8451653 8480884 8535370
15120 8535370 8215668 8363399 8101827 8166177 8101869 8078893 8206585 8150726 7975405 8073714
15110 8073714 8152321 8115289 8030108 8149241 8244228 8510328 8740928 8906023 9088621 9244431
$$ packed form
15180G415743M1270J63230L40391q9419K50966N3524j09921Q6163L40278j47367
15170H344858j60857k5380q1790J7823j64102K23492k78401M9710J54842J04564
15160H184759K78535K89975K06727r6826J31511L3359P788n1548l78762M61253
15150I066771k13580j24258j49114Q9865k3081n4875j242J52579j06445n0993
15140H585627P9366k01354K22647O3766P6225m5449n8007J81613r2386k15879
15130H596169J3930R6220j09407J32744J23682K0041k35989j85737K9231N4486
15120H535370l19702J47731k61572O4350o4308k2976J27692n5859j75321R8309
15110H073714P8607l7032q5181J19133R4987K66100K30600J65095J82598J55810
$$ plain form
15100 9244431 9432327 9561393 9792358 10291333 10697431 10592417 11144414 11784898 12688691
15091 12688691 13970455 16299823 19141029 22299222 24968678 27032481 28619991 29226751
15083 29226751 29418002 28767508 27643908 25591839 23999385 22506189 22309173 23331685
15075 23331685 25205091 28094174 30847434 32720721 34187093 34679441 34909939 34779773
15067 34779773 33570274 32434901 31817187 32565927 36175849 40724617 44393136 47190590
15059 47190590 49312796 51172416 52465837 53519789 52705188 51333614 49888736 49152070
15051 49152070 49111976 50765727 53477255 56229167 58798442 60101970 61147919 61586726
15043 61586726 62697058 62956457 62113934 60323454 57892451 55450612 53076846 50775196
$$ packed form
15100I244431J87896J29066K30965M98975M06098j05014N51997O40484R03793
15091A2688691J281764K329368K841206L158193K669456K063803J587510O06760
15083B9226751J91251o50494j123600k052069j592454j493196j97016J022512
15075B3331685J873406K889083K753260J873287J466372M92348K30498j30166
15067C4779773j209499j135373o17714P48740L609922M548768L668519K797454
15059D7190590K122206J859620J293421J053952q14601j371574j444878p36666
15051D9152070m0094J653751K711528K751912K569275J303528J045949M38807
15043F1586726J110332K59399q42523j790480k431003k441839k373766k301650
$$ plain form
15035 50775196 49029799 47336746 45648267 44994629 45867952 48585541 53576280 58693244
15027 58693244 63316501 67738460 72804558 78121939 83940583 89413672 93950147 99061899
15019 99061899 104258158 109988675 115929198 121125325 125276899 127217061 126414075 123903376
15011 123903376 119508948 113982348 107212458 99291051 90883162 83047920 75816394 69475174
15003 69475174 64523974 60519842 57709592 56014167 55394022 55657733 56452672 57225263 57496239
14994 57496239 57496247 57134224 56322696 54779751 52391487 50104039 48897136 48759632 49619482
14985 49619482 50092967 50564966 50753403 51557301 52003055 51271969 49084204 46180063 43045985
14976 43045985 39812415 36770885 34058582 31729432 29722063 28540885 27367838 27101561
$$ packed form
15035E0775196j745397j693053j688479o53638Q73323K717589M990739N116964
15027E8693244M623257M421959N066098N317381N818644N473089M536475N111752
15019I9061899N196259N730517N940523N196127M151574J940162q02986k510699
15011A23903376m394428n526600o769890p921407q407889p835242p231526o341220
15003F9475174m951200m004132k810250j695425o20145K63711P94939P72591K70976
14994E7496239Ql62023q11528j542945k388264k287448j206903j37504Q59850
14985D9619482M73485M71999J88437Q03898M45754p31086k187765k904141l134078
14976D3045985l233570l041530k712303k329150k007369j181178j173047k66277
$$ plain form
14968 27101561 26838689 27105980 27589172 27993769 28693313 29054238 29973472 31186762 32820409
14959 32820409 34953994 38395691 43743792 51757110 62784415 77786213 98083271 123529598
14951 123529598 152008140 183808761 218998856 255125663 289649429 322415310 351644033
14944 351644033 372257980 380064142 376111609 362856020 344431085 323049839 299285935
14937 299285935 272830420 246278388 222243688 203129059 188061412 175485791 163302934
14930 163302934 150550463 137866271 125071213 113408951 103077129 95187826 89894007
14923 89894007 87215873 85812047 83604971 81013100 77444846 73132843 68655923 62134537
14915 62134537 54032091 45599952 37902882 31174753 26319567 22267283 19563733 17552833
$$ packed form
14968B7101561k62872K67291M83192M04597O99544L60925R19234J213290J633647
14959C2820409K133585L441697N348101Q013318J1027305J5001798K0297058K5446327
14951A23529598K8478542L1800621L5190095L6126807L4523766L2765881K9228723
14944C51644033K0613947P806162l952533j3255589j8424935k1381246k3763904
14937B99285935k6455515k6552032k4034700j9114629j5067647j2575621j2182857
14930A63302934j2752471j2684192j2795058j1662262j0331822p889303n293819
14923H9894007k678134j403826k207076k591871l568254m312003m476920o521386
14915F2134537q102446q432139p697070o728129m855186m052284k703550k010900
$$ plain form
14907 17552833 16089942 15503851 14937841 15126084 15447889 16204597 17176860 18465050 19733958
14898 19733958 21338340 23595486 27529032 32904285 38728128 43842833 46874110 48620358
14890 48620358 49522357 48691598 46484718 42628378 37486795 32083033 27240881 23574331
14882 23574331 20963693 19005112 17783624 17094858 16613350 16529658 16779865 17674779 18829404
14873 18829404 19427601 20141297 20459358 20675731 21142142 21076166 21117637 20870534 20981349 21210700
14863 21210700 21639097 22885199 25218658 29384154 36774209 45417269 56134402 66583304
14855 66583304 77766651 87290402 93963573 96544797 95368466 90638749 83491291 74292305
14847 74292305 64274840 53791698 44694601 37121966 31430427 26745657 23633425 21532822
$$ packed form
14907A7552833j462891n86091n66010J88243L21805P56708R72263J288190J268908
14898A9733958J604382K257146L933546N375253N823843N114705L031277J746248
14890D8620358R01999q30759k206880l856340n141583n403762m842152l666550
14882B3574331k610638j958581j221488o88766m81508q3692K50207Q94914J154625
14873A8829404N98197P13696L18061K16373M66411o5976M1471k47103J10815K29351
14863B1210700M28397J246102K333459M165496P390055Q643060J0717133J0448902
14855F6583304J1183347R523751O673171K581224j176331m729717p147458r198986
14847G4292305j0017465j0483142r097097p572635n691539m684770l112232k100603
$$ plain form
14839 21532822 19845029 18538926 17399680 16505762 16329431 15910995 15550937 15576461 15455398
14830 15455398 15296231 15506119 16023274 16697413 17322262 17882492 18679501 20122776 22221754
14821 22221754 25847905 31620660 39734027 48981222 57027176 62522768 65623905 66941110
14813 66941110 65648574 62109991 56066972 47987208 39588775 32384048 26294692 21864946
14805 21864946 18711440 16578500 14962004 13875873 12756276 11920712 11645008 11089793
14797 11089793 10775300 10674654 10309734 9748618 9631532 9386581 9011269 8755128 8583800
14788 8583800 8317106 8363857 8656564 8472534 8699966 8740125 8959773 9492331 9999979 10500891
14778 10500891 11685906 12289760 12932445 13123148 13027022 13210276 12976822 12275601 11505995
$$ packed form
14839B1532822j687793j306103j139246q93918j76331m18436l60058K5524j21063
14830A5455398j59167K09888N17155O74139O24849N60230P97009J443275K098978
14821B2221754L626151N772755Q113367R247195Q045954N495592L101137J317205
14813F6941110j292536l538583o043019q079764q398433p204727o089356m429746
14805B1864946l153506k132940j616496j086131j119597q35564k75704n55215
14797A1089793l14493j00646l64920n61116j17086k44951l75312k56141j71328
14788H583800k66694M6751K92707j84030K27432M0159K19648N32558N07648N00912
14778A0500891J185015O03854O42685J90703r6126J83254k33454p01221p69606
$$ plain form
14769 11505995 10819169 10170308 9693128 9357565 8987862 8762286 9207529 9030450 9116075
14760 9116075 9248225 9399604 9789044 9891207 10039784 10121242 10240639 10262777 10495250 10759832
14750 10759832 10919259 10960734 11054405 11061531 11106078 11507403 11769468 11833332 12496000 13091212
14740 13091212 13588786 14712008 15716782 17410234 19609843 22415357 26495948 32749758
14732 32749758 41754636 55665420 77988746 108701097 145115104 183123419 219344102
14725 219344102 248574664 267667874 275422198 272004820 257711216 232836483 201554591
14718 201554591 167006869 133726027 104674545 81561650 63929511 50746293 40861718
14711 40861718 33346413 27898561 23453803 19994514 17417219 15793630 14247929 13115769
$$ packed form
14769A1505995o86826o48861m77180l35563l69703k25576M45243j77079Q5625
14760I116075J32150J51379L89440J02163J48577Q1458J19397K2138K32473K64582
14750A0759832J59427M1475R3671P126M4547M01325K62065O3864O62668N95212
14740A3091212M97574J123222J004774J693452K199609K805514M080591O253810
14732C2749758R004878J3910784K2323326L0712351L6414007L8008315L6220683
14725B19344102K9230562J9093210P754324l417378j4293604k4874733l1281892
14718B01554591l4547722l3280842k9051482k3112895j7632139j3183218r884575
14711D0861718p515305n447852m444758l459289k577295j623589j545701j132160
$$ plain form
14703 13115769 11976781 11093707 10339565 9429687 9071888 8528018 7972367 8140777 7748671
14694 7748671 7902820 7787526 7833111 7726825 7581897 7766345 7852470 7723524 7591072 7842310
14684 7842310 7894799 7731888 8323185 8278622 8470596 8824595 9024660 9765040 10860746 11439351
14674 11439351 12148591 12340880 12571426 12307253 12252602 11359553 10499036 9433950 8678234
14665 8678234 8608475 8563776 8570553 8215246 8292600 8173439 7957352 7725152 7538813 6737036
14655 6737036 6524922 6616434 6277972 5993018 6120037 6242539 6324850 6893451 6982907 7069806
14645 7069806 7417218 7314278 7769737 7812290 7967435 7772420 8346411 8366589 8892208 9348641
14635 9348641 9777971 10252537 10488641 10424619 10354544 9577605 9017806 8379007 7403492 6670529
$$ packed form
14703A3115769j138988q83074p54142r09878l57799n43870n55651J68410l92106
14694G748671J54149j15294M5585j06286j44928J84448Q6125j28946j32452K51238
14684G842310N2489j62911N91297m4563J91974L53999K00065P40380J095706N78605
14674A1439351P09240J92289K30546k64173n4651q93049q60517j065086p55716
14665H678234o9759m4699O777l55307P7354j19161k16087k32200j86339q01777
14655F737036k12114R1512l38462k84954J27019J22502Q2311N68601Q9456Q6899
14645G069806L47412j02940M55459M2553J55145j95015N73991K0178N25619M56433
14635I348641M29330M74566K36104o4022p0075p76939n59799o38799r75515p32963
$$ plain form
14625 6670529 6063200 5485381 5201430 4880769 4605721 4684365 4650957 4610051 4811184 4377002
14615 4377002 4349705 4434867 4530547 4566731 4535714 4295069 4273426 4094881 4145002 3764774 3511537
14604 3511537 3642182 3620956 4011054 4265043 4525712 5065631 6120249 6655857 7167231
14595 7167231 7550839 7893936 7731931 7579446 6754502 6672884 5681570 5113075 4822000 4389576
14585 4389576 4337286 4028812 3869730 3991538 3889519 3947741 4086151 4091774 4063948 3950471
14575 3950471 4185219 4328062 4284906 4436015 4547434 4507749 4866636 5408589 6012392 6628490
14565 6628490 7364020 8005475 8844322 10158305 12705529 16916536 23631471 32761566 41002552
14556 41002552 46845556 50716630 52806292 53549146 51967667 48096943 41407435 34503360
$$ packed form
14625F670529o07329n77819k83951l20661k75048P8644l3408m0906K01133m34182
14615D377002k7297Q5162R5680L6184l1017k40645k1643j78545N0121l80228k53237
14604C511537J30645k1226L90098K53989K60669N39919J054618N35608N11374
14595G167231L83608L43097j62005j52485q24944q1618r91314n68495k91075m32424
14585D389576n2290l08474j59082J21808j02019N8222J38410N623k7826j13477
14575C950471K34748J42843m3156J51109J11419l9685L58887N41953O03803O16098
14565F628490P35530O41455Q38847J313983K547224M211007O714935R130095Q240986
14556D1002552N843004L871074K089662P42854j581479l870724o689508o904075
$$ plain form
14548 34503360 28445219 24229075 22340511 23429813 27675984 35297369 44171683 50975193
14540 50975193 55489702 58458366 59309072 58152678 54797875 48191475 40410914 32873625
14532 32873625 26800581 22086356 19223829 17550559 16453977 15391059 14765643 14392798
14524 14392798 13896998 13745168 14189225 15246351 18501447 23874152 30402604 35934776
14516 35934776 39855997 42165288 43313449 43520569 41825939 38870872 34217983 29677114
14508 29677114 26251430 24311361 24022468 25894278 29658881 35300925 40650132 44000780
14500 44000780 46345931 47125869 46865037 45319682 42233315 37258413 31615174 27093926
14492 27093926 22947613 19716571 16978260 15006664 13211779 12003320 10232849 8842511
$$ packed form
14548C4503360o058141m216144j888564J089302M246171P621385Q874314O803510
14540E0975193M514509K968664Q50706j156394l354803o606400p780561p537289
14532C2873625o073044m714225k862527j673270j096582j062918o25416l72845
14524A4392798m95800j51830M44057J057126L255096N372705O528452N532172
14516C5934776L921221K309291J148161K07120j694630k955067m652889m540869
14508B9677114l425684j940069k88893J871810L764603N642044N349207L350648
14500D4000780K345151P79938k60832j545355l086367m974902n643239m521248
14492B7093926m146313l231042k738311j971596j794885j208459j770471j390338
$$ plain form
14484 8842511 7704242 6478115 5780048 5199335 5006507 4718291 4495376 4255919 4068637
14475 4068637 4222485 4338635 4066256 4582467 4842976 5578897 6065258 6394269 6796704
14466 6796704 6750668 6750594 6734447 6390002 6269709 6572649 6580782 7018137 7400667 7870841 8213539
14455 8213539 8162066 8477391 8318220 8050512 7548430 7014907 6684599 6478019 6358161 6583301
14445 6583301 6725230 6930468 7229269 7316667 7850598 7677308 8038103 8286477 8306953 8722722
14435 8722722 8642468 9207573 9573572 10215953 11410856 13146675 16447089 21542544 27836514
14426 27836514 34604747 40530226 45187844 47933159 49429293 49248586 46959358 43096020
14418 43096020 37984016 32451994 27272099 22679763 19255682 16522396 14104765 12531501
$$ packed form
14484H842511j138269j226127o98067n80713j92828k88216k22915k39457j87282
14475D068637J53848J16150k72379N16211K60509P35921M86361L29011M02435
14466F796704m6036p4j6147l44445j20293L02940Q133M37355L82530M70174L42698
14455H213539n1473L15325j59171k67708n02082n33523l30308k06580j19858K25140
14445F583301J41929K05238K98801Q7398N33931j73290L60795K48374K0476M15769
14435H722722q0254N65105L65999O42381J194903J735819L300414N095455O293970
14426B7836514O768233N925479M657618K745315J496134j80707k289228l863338
14418D3096020n112004n532022n179895m592336l424081k733286k417631j573264
$$ plain form
14410 12531501 11352898 10171100 9363435 9042612 8719326 8552521 8177819 8388273 8352074
14401 8352074 8381084 8533691 8845093 9153035 9896455 11126455 12808703 15468117 19987899
14392 19987899 26826041 36229017 47008299 58149594 67369655 74117018 78202471 79770124
14384 79770124 77844823 72419412 64509967 55050830 45562963 37141153 29974008 24198183
14376 24198183 20063869 16764741 14070351 12706984 11223702 10166032 9596454 9144774
14368 9144774 8743147 8627996 8247164 8294283 8143033 8359969 8388049 8635635 9070769 9984881
14358 9984881 10900602 12743213 15067330 18347222 22327212 27225824 31902266 35755876
14350 35755876 39167228 40674811 41584131 40807658 39424351 37112294 34499022 32125121
$$ packed form
14410A2531501j178603j181798q07665l20823l23286j66805l74702K10454l6199
14401H352074K9010J52607L11402L07942P43420J230000J682248K659414M519782
14392A9987899O838142R402976J0779282J1141295R220061O747363M085453J567653
14384G9770124j925301n425411p909445r459137r487867q421810p167145n775825
14376B4198183m134314l299128k694390j363367j483282j057670n69578m51680
14368I144774m01627j15151l80832M7119j51250K16936K8080K47586M35134R14112
14358I984881R15721J842611K324117L279892L979990M898612M676442L853610
14350C5755876L411352J507583R09320p76473j383307k312057k613272k373901
$$ plain form
14342 32125121 30955586 30892730 33014564 37141427 43911592 53491584 67304260 82159188
14334 82159188 95239008 105120387 111489887 114533498 114036927 110351207 102585333 91544860
14326 91544860 78513616 65461795 54003414 44098157 36211641 29842238 25051537 20944331
14318 20944331 17323809 14700727 12672109 11324632 9991159 8780300 7943659 7254074
14310 7254074 7009939 6545587 6101632 5925570 5314305 4996812 4775102 4406049 4269602
14301 4269602 4081641 4046272 3922127 3936937 3472176 3565743 3430675 3256929 3166615 3039725
14291 3039725 2907217 2991836 3163456 2627638 2901824 2755847 2615388 2880258 2945871 2850050
14281 2850050 2941869 3007283 2816945 3148857 2966626 2977514 3003793 3088892 3037794 2999234 3013116
$$ packed form
14342C2125121j169535o2856K121834M126863O770165R579992J3812676J4854928
14334H2159188J3079820R881379O369500L043611m96571l685720p765874j1040473
14326I1544860j3031244j3051821j1458381r905257p886516o369403m790701m107206
14318B0944331l620522k623082k028618j347477j333473j210859q36641o89585
14310G254074k44135m64352m43955j76062o11265l17493k21710l69053j36447
14301D269602j87961l5369j24145J4810m64761R3567j35068j73746r0314j26890
14291C039725j32508Q4619J71620n35818K74186j45977j40459K64870O5613r5821
14281B850050R1819O5414j90338L31912j82231J0888K6279Q5099n1098l8560J3882
$$ plain form
14270 3013116 3165293 2799565 2841044 2825866 2640035 2433738 2610667 2765228 2506962 2721973
14260 2721973 2418864 2293196 2325150 2339677 2336798 2224713 2365060 1962683 2368637 2058649
14250 2058649 2225691 2343849 1945846 1923467 2178045 2007926 2154905 1978883 2260830 2163984
14240 2163984 1965872 1934998 2165264 2282181 2384156 1990231 2052023 2019666 2131448 2066795
14230 2066795 2183353 1998373 1859007 1877781 1875063 1988187 1921795 1740643 2007872 1902755
14220 1902755 2197351 1988673 1882608 2200220 2166364 2498144 2574659 2683438 2477686 2477006
14210 2477006 2559703 2786403 3140453 3840933 4240488 4473354 4674159 4487348 4650143 4244116
14200 4244116 3832791 3554961 2937318 2546877 2342662 2275354 2242993 2225411 2003117 1924316
$$ packed form
14270C013116J52177l65728M1479j5178j85831k06297J76929J54561k58266K15011
14260B721973l03109j25668L1954J4527k879j12085J40347m02377M05954l09988
14250B058649J67042J18158l98003k2379K54578j70119J46979j76022K81947r6846
14240B163984j98112l0874K30266J16917J01975l93925O1792l2357J11782o4653
14230B066795J16558j84980j39366J8774k718J13124o6392j81152K67229j05117
14220A902755K94596k08678j06065L17612l3856L31780P6515J08779k05752o80
14210B477006Q2697K26700L54050P00480L99555K32866K00805j86811J62795m06027
14200D244116m11325k77830o17643l90441k04215o7308l2361j7582k22294p8801
$$ plain form
14190 1924316 2434487 2125648 2367584 2199942 2229931 2039093 1900287 2187269 2056947 2198767
14180 2198767 2003364 2137972 2371130 2432806 2613601 2651729 2677949 2782540 2535445 2699545
14170 2699545 2587258 2593984 2260265 2235451 2200465 2220642 2084855 2203655 2126916 2072746 1948193
14159 1948193 2143426 2065884 2108826 2367802 2020878 2306719 2233896 2469360 2304453 2417237
14149 2417237 2290495 2379066 2411690 2461809 2776846 2911036 3045877 3478218 4154045 4871163
14139 4871163 5904065 6615840 7578199 7902030 8517073 8521323 8329546 7859328 7268558 6445410
14129 6445410 5830488 5018201 4589880 4011234 3800083 3383295 3190952 3368981 3532857
14120 3532857 3767886 3726460 4010733 4209655 4396229 4419949 4089530 3997565 3701140 3706036
$$ packed form
14190A924316N10171l08839K41936j67642K9989j90838j38806K86982j30322J41820
14180B198767j95403J34608K33158O1676J80795L8128K6220J04591k47095J64100
14170B699545j12287O726l33719k4814l4986K0177j35787J18800p6739n4170j24553
14159A948193J95233p7542M2942K58976l46924K85841p2823K35464j64907J12784
14149B417237j26742Q8571L2624N0119L15037J34190J34841M32341O75827P17118
14139D871163J032902P11775R62359L23831O15043M250j91777m70218n90770q23148
14129F445410o14922q12287m28321n78646k11151m16788j92343J78029J63876
14120C532857K35029m1426K84273J98922J86574K3720l30419r1965k96425M896
$$ plain form
14110 3706036 3389234 3016693 3055987 2899689 2850654 2791912 2767817 2775922 2816431 2935345 3017270
14099 3017270 3353702 3915098 4320130 4672432 5107020 5539090 5451467 5569553 5277436 5339758
14089 5339758 5064995 4707722 4716647 4798107 5148233 5353378 5872758 6460958 6856014 7354627
14079 7354627 7343848 7631120 7628233 7582666 7665377 7562209 7929305 8049528 8587900 9266244
14069 9266244 10264189 11220896 12727061 14390337 16913430 20096930 24315926 30136062
14061 30136062 38237154 48900787 61943447 75609337 87904772 97080058 102806701
14054 102806701 105184169 104209439 100165514 93419372 83263508 71598141 59867309 49490206
14046 49490206 40986113 34012477 28495341 24376099 20284289 17843655 15408969 13365808
$$ packed form
14110C706036l16802l72541L9294j56298m9035n8742k4095Q105M0509J18914Q1925
14099C017270L36432N61396M05032L52302M34588M32070q7623J18086k92117O2322
14089E339758k74763l57273Q925Q1460L50126K05145N19380N88200L95056M98613
14079G354627j0779K87272k887m5567Q2711j03168L67096J20223N38372O78344
14069I266244R97945R56707J506165J663276K523093L183500M218996N820136
14061C0136062Q101092J0663633J3042660J3665890J2295435R175286N726643
14054A02806701K377468r74730m043925o746142j0155864j1665367j1730832j0377103
14046D9490206q504093o973636n517136m119242m091810k440634k434686k043161
$$ plain form
14038 13365808 11829654 10250298 9354485 8071512 7253948 6680960 6024704 5642202 5030312
14029 5030312 4829519 4682606 4442608 4132442 4008023 3862863 3775930 3474133 3584437 3237049
14019 3237049 3022226 3146066 3262973 2948588 2857578 2771844 2798239 2704867 2726873 2654006
14009 2654006 2809543 2748449 2670924 2501180 2539250 2412541 2429872 2270117 2363029 2474006
13999 2474006 2213793 2425518 2363334 2370795 2353073 2310013 2558137 2475964 2705259 3065967
13989 3065967 3585755 3852216 4465553 5393869 6168482 7626341 8679091 9191145 9477983
13980 9477983 9598518 9789242 9608597 8769936 8001760 6966765 6189611 5391557 4817353
13971 4817353 4358905 4213761 3959030 3816021 3684020 3643111 3288211 3019210 3027695 2804088
$$ packed form
14038A3365808j536154j579356q95813j282973q17564n72988o56256l82502o11890
14029E030312k00793j46913k39998l10166j24419j45160q6933l01797J10304l47388
14019C237049k14823J23840J16907l14385r1010q5734K6395r3372K2006p2867
14009B654006J55537o1094p7525j69744L8070j26709J7331j59755R2912J10977
13999B474006k60213K11725o2184P461j7722m3060K48124q2173K29295L60708
13989C065967N19788K66461O13337R28316P74613J457859J052750N12054K86838
13980I477983J20535J90724j80645q38661p68176j034995p77154p98054n74204
13971D817353m58448j45144k54731j43009j32001m0909l54900k69001Q485k23607
$$ plain form
13961 2804088 2513323 2203504 2483244 2609809 2125846 2275594 2027256 2078389 2359763 2031723
13951 2031723 2219962 2496740 2575490 2591643 2949643 3069631 3161234 3748307 3603400 4441480
13941 4441480 5130733 6861051 9485587 12116520 14885730 17726334 19682832 21235281
13933 21235281 22026718 21474237 20044819 18305420 15640702 12852799 10708498 8220416
13925 8220416 6355541 5165676 4275834 3496008 2953550 2728598 2344374 2292915 2022463
13916 2022463 1928830 2065156 1630365 1845841 1829378 1546961 1667936 1706344 1560410 1607012
13906 1607012 1631269 1603547 1589272 1379091 1261941 1515239 1350447 1762091 1239284 1516195
13896 1516195 1486734 1344216 1660030 1354016 1660629 1544242 1428800 1394203 1510316 1775392
$$ packed form
13961B804088k90765l09819K79740J26565m83963J49748k48338N1133K81374l28040
13951B031723J88239K76778P8750J6153L58000J19988R1603N87073j44907Q38080
13941D441480O89253J730318K624536K630933K769210K840604J956498J552449
13933B1235281P91437n52481j429418j739399k664718k787903k144301k488082
13925H220416j864875j189865q89842p79826n42458k24952l84224n1459k70452
13916B022463r3633J36326m34791K15476j6463k82417J20975L8408j45934M6602
13906A607012K4257k7722j4275k10181j17150K53298j64792M11644n22807K76911
13896A516195k9461j42518L15814l06014L06613j16387j15442l4597J16113K65076
$$ plain form
13886 1775392 1543313 1652052 1606722 1372199 1347114 1546894 1378418 1322071 1547548 1330186
13876 1330186 1521838 1415309 1395528 1467220 1355108 1427278 1452239 1299614 1529028 1382297
13866 1382297 1572871 1579608 1343626 1479094 1758275 1607801 1773300 1795760 1620293 1698597
13856 1698597 1770118 1667044 1764289 1445137 1793666 1609487 1551713 1561061 1586761 1755869
13846 1755869 1779795 1622666 1566552 1664359 1749333 1591597 1540443 1632974 1313072 1321328 1529064
13835 1529064 1489627 1469014 1330371 1455874 1333140 1498643 1419335 1502581 1395740 1761429
13825 1761429 1451523 1501695 1411409 1416231 1384596 1442418 1403740 1487692 1276597 1282585 1161621
13814 1161621 1406006 1388111 1509039 1566227 1407676 1425011 1225170 1388047 1207623 1451835
$$ packed form
13886A775392k32079J08739m5330k34523k5085J99780j68476n6347K25477k17362
13876A330186J91652j06529j9781P1692j12112P2170K4961j52625K29414j46731
13866A382297J90574O737k35982J35468K79181j50474J65499K2460j75467P8304
13856A698597P1521j03074R7245l19152L48529j84179n7774R348K5700J69108
13846A755869K3926j57129n6114R7807Q4974j57736n1154R2531l19902Q256K07736
13835A529064l9437k0613j38643J25503j22734J65503p9308Q3246j06841L65689
13825A761429l09906N0172r0286M822l1635N7822l8678Q3952k11095N988j20964
13814A161621K44385j7895J20928N7188j58551J7335j99841J62877j80424K44212
$$ plain form
13804 1451835 1254103 1355383 1290672 1468491 1592947 1479277 1588656 1519448 1692326 1639292
13794 1639292 1409330 1423680 1318256 1476906 1198212 1386802 1483079 1386493 1294173 1423763
13784 1423763 1392862 1262361 1293088 1294865 1468604 1440171 1415219 1410724 1447019 1423072 1224725
13773 1224725 1616483 1531063 1612030 1634026 1914168 1844826 1973872 1942112 1710107 1825917
13763 1825917 1624119 1734026 1869626 1594525 1503084 1602231 1600912 1449245 1457244 1653027
13753 1653027 1468299 1424023 1562009 1320967 1683857 1563045 1482942 1417106 1608330 1541692
13743 1541692 1702035 1582850 1374036 1672264 1581221 1645268 1849657 1930684 1555549 1733988
13733 1733988 1622249 1734878 1686498 1831987 1436888 1596020 1729918 1684054 1856005 2034992
$$ packed form
13804A451835j97732J01280o4711J77819J24456j13670J09379o9208J72878n3034
13794A639292k29962J4350j05424J58650k78694J88590R6277r6586r2320J29590
13784A423763l0901j30501L0727J777J73739k8433k4952m495L6295k3947j98347
13773A224725L91758q5420Q0967K1996K80142o9342J29046l1760k32005J15810
13763A825917k01798J09907J35600k75101r1441R9147j319j51667P999J95783
13753A653027j84728m4276J37986k41042L62890j20812q0103o5836J91224o6638
13743A541692J60343j19185k08814K98228r1043O4047K04389Q1027l75135J78439
13733A733988j11739J12629m8380J45489l95099J59132J33898m5864J71951J78987
$$ plain form
13723 2034992 1877011 1802700 1888325 1644185 2094675 2006067 2045151 2175764 1928329 1840418
13713 1840418 1941688 1996565 2109281 2205960 2330637 2205886 2171282 2186339 2205398 2175397
13703 2175397 2304952 2085108 2306610 2067555 2291709 1965032 2346025 2348559 2507656 2784736
13693 2784736 2908953 2971108 2882416 3064044 3223583 3014895 2855218 2776862 2522435 2385054
13683 2385054 2237955 2100413 1978615 1960101 2035663 1985195 1989594 2084589 1919825 1947834 2029646
13672 2029646 2166788 2040943 2267920 2208759 2431411 2707827 2666780 2693471 3417727 3422491
13662 3422491 3670088 3502822 3722951 3480059 3647625 3144828 2990735 2806383 2927745
13653 2927745 2629687 2247711 2422638 2378119 2045837 2152262 2235622 2126113 2095395 2308272
$$ packed form
13723B034992j57981p4311Q5625k44140M50490q8608L9084J30613k47435q7911
13713A840418J01270N4877J12716R6679J24677j24751l4604J5057J9059l0001
13703B175397J29555k19844K21502k39055K24154l26677L80993K534J59097K77080
13693B784736J24217O2155q8692J81628J59539k08688j59677p8356k54427j37381
13683B385054j47099j37542j21798j8514P5562n0468M399R4995j64764K8009Q1812
13672B029646J37142j25845K26977n9161K22652K76416m1047K6691P24256M764
13662C422491K47597j67266K20129k42892J67566n02797j54093j84352J21362
13653B927745k98058l81976J74927m4519l32282J06425Q3360j09509l0718K12877
$$ plain form
13643 2308272 1768743 1954695 2034574 1968283 1981220 1876984 2319009 2491325 2425834 2869237
13633 2869237 3020669 3221051 3254254 3267738 3121154 2970944 2943364 2728109 2429370 2254415
13623 2254415 2244971 1983638 1910833 2075079 1841745 1662239 1892059 1941611 1762059 1795183
13613 1795183 1837602 1928313 2079279 2040092 2014714 2299701 2195584 2391238 2328726 2416411
13603 2416411 2203933 2184263 2100286 2063152 1992101 2028084 2114251 2077016 2214568 1845334 2102604
13592 2102604 2119515 2237584 2244110 2257495 2251064 2218582 2224371 1961342 1812031 1655975 1923930
13581 1923930 1863150 1613626 1763414 1790931 1773014 1461585 1761024 1757009 1460024 1482785
13571 1482785 1482781 1708933 1690890 1384709 1454314 1499336 1705256 1658824 1737984 1540563 1790900
$$ packed form
13643B308272n39529J85952P9879o6291J2937j04236M42025J72316o5491M43403
13633B869237J51432K00382L3203J3484j46584j50210k7580k15255k98739j74955
13623B254415r444k61333p2805J64246k33334j79506K29820M9552j79552L3124
13613A795183M2419R0711J50966l9187k5378K84987j04117J95654o2512Q7685
13603B416411k12478j9670q3977l7134p1051L5983Q6167l7235J37552l69234K57270
13592B102604J6911J18069O526J3385o431l2482N789k63029j49311j56056K67955
13581A923930o0780k49524J49788K7517j7917l11429K99439m015k96985K2761
13571A482785mK26152j8043l06181O9605M5022K05920m6432P9160j97421K50337
$$ plain form
13560 1790900 1622545 1590556 1421998 1882869 1501397 1391660 1536250 1544373 1670595 1490153
13550 1490153 1494624 1565559 1756600 1690410 1714610 1904507 2073025 2442988 2602738 2441604
13540 2441604 2820084 2901247 2763258 2665906 2547089 2449250 2274272 2183036 2196098 1953588
13530 1953588 1896489 1726101 1976957 2205001 2139786 2492811 2268028 2545430 2672156 2782123
13520 2782123 2605163 2367616 2332258 2130950 2044912 1767690 1612441 1585059 1597261 1397340
13510 1397340 1473786 1503535 1350004 1433558 1317743 1324642 1462960 1343290 1248051 1292523 1434905
13499 1434905 1385324 1449617 1348001 1509165 1431206 1321885 1350307 1470879 1311400 1540398
13489 1540398 1417368 1400915 1383546 1362928 1447536 1311326 1544925 1471936 1475526 1421396 1346769
$$ packed form
13560A790900j68355l1989j68558M60871l81472j09737J44590Q123J26222j80442
13550A490153M471P0935J91041o6190K4200J89897J68518L69963J59750j61134
13540B441604L78480Q1163j37989r7352j18817r7839j74978r1236J3062k42510
13530A953588n7099j70388K50856K28044o5215L53025k24783K77402J26726J09967
13520B782123j76960k37547l5358k01308q6038k77222j55249k7382J2202j99921
13510A397340P6446K9749j53531Q3554j15815O899J38318j19670r5239M4472J42382
13499A434905m9581O4293j01616J61164p7959j09321K8422J20572j59479K28998
13489A540398j23030j6453j7369k0618Q4608j36210K33599p2989L590n4130p4627
$$ plain form
13478 1346769 1504888 1334233 1266693 1370927 1298612 1189841 1356877 1301475 1325493 1358865
13468 1358865 1478025 1271306 1376110 1368715 1354058 1587694 1526685 1368444 1419238 1269573
13458 1269573 1546325 1370363 1653340 1801325 1943925 2114680 2160699 2552474 2639770 2732538
13448 2732538 2936611 2760293 2639078 2638913 2239720 2097518 2083530 1898466 1930317 1743942
13438 1743942 1569793 1622723 1700974 1483850 1522939 1555291 1568142 1537606 1652058 1486796
13428 1486796 1629894 1605637 1605841 1625061 1797694 1965233 2060770 2470950 2647147 3010255
13418 3010255 2778921 2918763 2720405 2947887 2675266 2308628 2059424 2045369 1828112 1674681
13408 1674681 1792368 2043639 1763353 1862860 1615784 1729573 1609778 1726667 1575009 1406522
$$ packed form
13478A346769J58119j70655o7540J04234p2315j08771J67036n5402K4018L3372
13468A358865J19160k06719J04804p395j4657K33636o1009j58241N0794j49665
13458A269573K76752j75962K82977J47985J42600J70755M6019L91775Q7296R2768
13448B732538K04073j76318j21215j65l99193j42202j3988j85064L1851j86375
13438A743942j74149N2930P8251k17124L9089L2352J2851l0536J14452j65262
13428A486796J43098k4257K04J9220J72633J67539R5537M10180J76197L63108
13418C010255k31334J39842j98358K27482k72621l66638k49204j4055k17257j53431
13408A674681J17687K51271k80286R9507k47076J13789j19795J16889j51658j68487
$$ plain form
13398 1406522 1665832 1641875 1485344 1614065 1870046 1676348 1984021 2226325 2015004 2113993
13388 2113993 2162569 2492959 2228216 2577236 2567500 2797453 2706100 2878977 2831873 2809841
13378 2809841 2843170 2315314 2426444 2267140 2439473 1939494 2039199 2400026 2117144 2316803
13368 2316803 2156730 2483786 2324954 2362698 2314455 2383333 2190043 2555787 2181849 2305273
13358 2305273 1990080 2212153 2364514 2130398 2380455 2508785 2556997 2642866 2630221 2592109
13348 2592109 2373603 2541805 2424085 2062071 2387482 2422019 2327439 2245280 2630747 2205518
13338 2205518 2124905 2304314 2240162 2215849 2384913 2094525 2344720 2118229 2249379 2225281
13328 2225281 2293615 2335133 2186335 2374614 2338259 2431809 2415500 2196043 2286610 2306822 2645388
$$ packed form
13398A406522K59310k3957j56531J28721K55981j93698L07673K42304k11321R8989
13388B113993M8576L30390k64743L49020r736K29953r1353J72877m7104k2032
13378B809841L3329n27856J11130j59304J72333m99979R9705L60827k82882J99659
13368B316803j60073L27056j58832L7744m8243O8878j93290L65744l73938J23424
13358B305273l15193K22073J52361k34116K50057J28330M8212Q5869j2645l8112
13348B592109k18506J68202j17720l62014L25411L4537r4580q2159L85467m25229
13338B205518q0613J79409o4152k4313J69064k90388K50195k26491J31150k4098
13328B225281O8334M1518j48798J88279l6355R3550j6309k19457R0567K0212L38566
$$ plain form
13317 2645388 2681283 2777301 2692355 2914262 3153185 3131628 3086381 3142970 3319739 3164993
13307 3164993 3342942 3366783 3056482 3168544 3110989 3087571 3122404 3271215 3197305 3533830
13297 3533830 3591197 3518803 3588676 3642033 3658522 3619619 3434864 3461588 3302538 3604812 3222483
13286 3222483 3302360 3212352 3306548 3253514 3334991 3253195 3465214 3491123 3602573 3644231 3572319
13275 3572319 3712148 3578021 3705762 3951127 3649742 4025056 3628044 3957138 4031423 3973942
13265 3973942 4061276 4078745 4112661 4051708 4412459 4178260 4629756 4668848 4605147 4681023 4898102
13254 4898102 5112351 5410251 5364930 5682901 5736425 5856186 6085287 6250477 6275187 6482442
13244 6482442 6530287 6607882 6737028 6631700 6685600 6792926 6907431 7019251 6926729 7052246
$$ packed form
13317B645388L5895R6018q4946K21907K38923k1557m5247N6589J76769j54746
13307C164993J77949K3841l10301J12062n7555k3418L4833J48811p3910L36525
13297C533830N7367p2394O9873N3357J6489l8903j84755K6724j59050L02274l82329
13286C222483P9877r0008R4196n3034Q1477q1796K12019K5909J11450M1658p1912
13275C572319J39829j34127J27741K45365l01385L75314l97012L29094P4285n7481
13265C973942Q7334J7469L3916o0953L60751k34199M51496L9092o3701P5876K17079
13254D898102K14249K97900m5321L17971N3524J19761K29101J65190K4710K07255
13244F482442M7845P7595J29146j05328N3900J07326J14505J11820r2522J25517
$$ plain form
13234 7052246 7116294 7107351 7506325 7608343 7933082 7832182 8105820 8224181 8982103 8938283
13224 8938283 8925533 9442301 9316196 9685206 9861106 9840605 9790723 9777438 9792785 9743211
13214 9743211 9629439 9403931 9418682 8991748 8984860 8911622 8527360 8320265 8473303 8480489
13204 8480489 8400397 8475402 8336843 8041933 8013696 8231211 8218031 8027861 7913129 7776118
13194 7776118 7962972 7615368 7522859 7298457 7304056 7033366 6868848 6648684 6528980 6268961
13184 6268961 6105411 5727905 5644089 5807978 5530978 5593455 5144052 5279764 4877990 4921986
13174 4921986 4940932 4878079 4831693 4723079 4795371 4579758 4777655 4630618 5005031 4784842
13164 4784842 4880333 5060603 5550428 5621014 6024218 6355894 6324192 6629145 6634888 6924097
$$ packed form
13234G052246O4048q943L98974J02018L24739j00900K73638J18361P57922m3820
13224H938283j2750N16768j26105L69010J75900k0501m9882j3285J5347m9574
13214I743211j13772k25508J4751m26934o888p3238l84262k07095J53038P186
13204H480489q0092P5005j38559k94910k8237K17515j3180j90170j14732j37011
13194G776118J86854l47604r2509k24402N599k70690j64518k20164j19704k60019
13184F268961j63550l77506q3816J63889k77000O2477m49403J35712m01774M3996
13174D921986J8946o2853m6386j08614P2292k15613J97897j47037L74413k20189
13164D784842R5491J80270M89825P0586M03204L31676l1702L04953N743K89209
$$ plain form
13154 6924097 6919141 6733767 6737312 6587505 6854114 6485566 6632442 6336833 6574341 6402935
13144 6402935 6439571 6299691 6321642 6018396 5714665 5618930 5229565 4953899 4857965 4676933
13134 4676933 4216333 4222083 3962017 3989252 3840013 3709951 3807781 3927461 3960613 4151650
13124 4151650 3963837 4011648 3924755 3902147 3749405 3744136 3569034 3414811 3266963 3316352
13114 3316352 3213706 3424605 3210489 3109372 3565457 3328344 3343588 3454141 3361997 3392087
13104 3392087 3778926 3924847 3990715 4201963 4389801 4651165 5094370 5147151 5654748 5979262
13094 5979262 6213939 6313941 6795571 6647844 6912842 7014611 6922122 6969168 6684264 6807462
13084 6807462 6746407 6774914 6595373 6489864 6415825 5963478 5810475 5580815 5077521 4816729
$$ packed form
13154F924097m956j85374L545j49807K66609l68548J46876k95609K37508j71406
13144F402935L6636j39880K1951l03246l03731r5735l89365k75666r5934j81032
13134D676933m60600N750k60066K7235j49239j30062R7830J19680L3152J91037
13124D151650j87813M7811q6893k2608j52742n269j75102j54223j47848M9389
13114C316352j02646K10899k14116j01117M56085k37113J5244J10553r2144L0090
13104C392087L86839J45921O5868K11248J87838K61364M43205N2781N07597L24514
13094E979262K34677J00002M81630j47727K64998J01769r2489M7046k84904J23198
13084F807462o1055K8507j79541j05509p4039m52347j53003k29660n03294k60792
$$ plain form
13074 4816729 4718797 4302975 3987882 4144775 3695188 3610446 3456199 3690439 3570481 3436891
13064 3436891 3217860 3368747 3062929 3215362 3439483 3378387 3411212 3633212 3593860 3618725
13054 3618725 3749162 3580113 3792679 3575798 3543240 3595559 3573738 3618036 3349665 3519122
13044 3519122 3713665 3483949 3506896 3526330 3339476 3710498 3654463 3484911 3648401 3683976
13034 3683976 3797776 3878697 3869220 3979895 3913344 4254891 4153992 3956800 3944957 3992757
13024 3992757 4101179 4370379 4029520 4135875 4532724 4229839 4218229 4413048 4519231 4557432
13014 4557432 4466545 4529426 4748198 4707644 4648041 4881767 4650125 4928845 4760007 4782314
13004 4782314 4839516 4948748 5080734 5049183 5154139 5176072 5108646 5112275 5441082 5340466
$$ packed form
13074D816729r7932m15822l15093J56893m49587q4742j54247K34240j19958j33590
13064C436891k19031J50887l05818J52433K24121o1096L2825K22000l9352K4865
13054C618725J30437j69049K12566k16881l2558N2319k1821M4298k68371J69457
13044C519122J94543k29716K2947J9434j86854L71022n6035j69552J63490L5575
13034C683976J13800Q0921r477J10675o6551L41547j00899j97192j1843M7800
13024C992757J08422K69200l40859J06355L96849l02885j1610J94819J06183L8201
13014D557432r0887O2881K18772m0554n9603K33726k31642K78720j68838K2307
13004D782314N7202J09232J31986l1551J04956K1933o7426L629L28807j00616
$$ plain form
12994 5340466 5438878 5313366 5494403 5557918 5600025 5471390 5308766 5447752 5469501 5196963
12984 5196963 5278842 5258046 5259160 5209437 5212239 5334803 5343696 5223070 5282828 5344477 5297300
12973 5297300 4943858 4950724 5117255 4949119 4782548 4903292 4911336 4793559 4773545 4827508
12963 4827508 4805882 4849245 4774660 4881339 4867601 4848717 4840550 4910208 4607011 4638446 4814235
12952 4814235 4868754 4837621 4777544 4699905 4757321 4907143 4907408 5028550 4806507 4616888 4916493
12941 4916493 4524727 4823853 4866496 4691561 4737358 4675356 4726585 4636184 4879844 4746446
12931 4746446 5073750 4785687 4753186 4741736 4669712 4700176 4613826 4500824 4703532 4607546
12921 4607546 4588487 4484349 4499162 4416905 4432416 4404924 4187249 4267584 4200242 3870415 3894951
$$ packed form
12994E340466R8412j25512J81037O3515M2107j28635j62624J38986K1749k72538
12984E196963Q1879k0796J114m9723K802J22564Q893j20626N9758O1649m7177
12973E297300l53442O866J66531j68136j66571J20744Q044j17777k0014N3963
12963D827508k1626M3363p4585J06679j3738j8884q167O9658l03197L1435J75789
12952D814235N4519l1133o0077p7639N7416J49822K65J21142k22043j89619K99605
12941D916493l91766K99126M2643j74935M5797o2002N1229r0401K43660j33398
12931D746446L27304k88063l2501j1450p2024L0464q6350j13002K02708r5986
12921D607546j9059j04138J4813q2257J5511k7492k17675Q0335o7342l29827K4536
$$ plain form
12910 3894951 3938005 3810882 3706075 3646766 3623177 3709238 3569876 3482202 3461293 3414626 3519278
12899 3519278 3208162 3178492 3164520 3245188 3084691 3142468 3045961 3077182 3158657 3164069 3118240
12888 3118240 3241501 3100359 3166633 3130335 3259292 2955532 3093846 2938260 3161987 3025286
12878 3025286 3081867 2989835 3154345 3041819 2822462 2957792 2918718 3140488 2853722 2849818
12868 2849818 2842449 2757224 2765349 2815621 2901507 2676241 2494308 2515309 2682626 2922851 2675803
12857 2675803 2459061 2651324 2576930 2946658 2789406 2869939 3019284 2644037 2748946 2562194
12847 2562194 3003409 2464137 2567704 2763411 2781319 2764087 2888415 2793008 2702521 2615377
12837 2615377 2720599 2988783 2666977 2809458 2960330 2919426 2700549 2800496 2577238 2737014
$$ packed form
12910C894951M3054j27123j04807n9309k3589Q6061j39362q7674k0909m6667J04652
12899C519278l11116k9670j3972Q0668j60497N7777r6507L1221Q1475N412m5829
12888C118240J23261j41142O6274l6298J28957l03760J38314j55586K23727j36701
12878C025286N6581r2032J64510j12526k19357J35330l9074K21770k86766l904
12868B849818p369q5225Q125N0272Q5886k25266j81933K1001J67317K40225k47048
12857B675803k16742J92263p4394L69728j57252Q0533J49345l75247J04909j86752
12847B562194M41215n39272J03567J95707J7908j7232J24328r5407r0487q7144
12837B615377J05222K68184l21806J42481J50872m0904k18877R9947k23258J59776
$$ plain form
12827 2737014 2605939 2879899 2704346 2592072 2707769 2808167 2577239 2929179 2794318
12818 2794318 2628758 2563516 2728688 2805469 3024184 2746438 2765716 2749002 2822606 2677942
12808 2677942 2643747 2782834 2641350 2970148 2773767 2762262 2773514 2666933 2738075 2896480
12798 2896480 2745105 2845961 2950377 3067119 2780713 2955203 2702099 2825139 2732134 3037940
12788 3037940 3083708 3176574 2927883 3236152 3206561 2983483 2910312 3046291 2866365 3091164
12778 3091164 3007338 2787188 2815880 2891750 2955784 2958948 3158249 2873074 2830379 3185096 3030425
12767 3030425 2936242 3084521 3160732 3269315 3163221 3132713 3164318 3176757 3223599 3258066 2919907
12756 2919907 3176503 3307691 3182773 3215566 2984642 3178678 3127013 2968043 2983872 3011719
$$ packed form
12827B737014j31075K73960j75553j12274J15697J00398k30928L51940j34861
12818B794318j65560o5242J65172P6781K18715k77746J9278j6714P3604j44664
12808B677942l4195J39087j41484L28798j96381j1505J1252j06581P1142J58405
12798B896480j51375J00856J04416J16742k86406J74490k53104J23040r3005L05806
12788C037940M5768R2866k48691L08269k9591k23078p3171J35979j79926K24799
12778C091164q3826k20150K8692P5870O4034L164J99301k85175m2695L54717j54671
12767C030425r4183J48279P6211J08583j06094l0508L1605J2439M6842L4467l38159
12756B919907K56596J31188j24918L2793k30924J94036n1665j58970J5829K7847
$$ plain form
12746 3011719 3381013 3226062 3139985 3115415 3197151 3089378 2908523 3193253 3100894 3272426
12736 3272426 3325123 3213857 3156527 3188616 3443269 3254495 3384635 3496603 3038861 3118641
12726 3118641 3505252 3250805 3221706 3161178 3245994 3360824 3180215 3266862 3380789 3300666
12716 3300666 3377969 3348688 3202205 3314823 3638650 3519976 3662943 3540908 3567136 3500385
12706 3500385 3707478 3658838 3734711 3949574 4175162 4331064 4247986 4402174 4464258 4773799
12696 4773799 4820359 4918503 5159399 5404781 5758310 6143762 6417959 6895153 7297386 7646177
12686 7646177 7788644 7645207 7541885 7385761 7237215 6586655 6098696 5716519 5467742
12677 5467742 5110605 4784927 4940383 4647960 4632691 4607995 4687246 4657681 4865117 4817630
$$ packed form
12746C011719L69294j54951q6077k4570Q1736j07773j80855K84730r2359J71532
12736C272426N2697j11266n7330L2089K54653j88774J30140J11968m57742P9780
12726C118641L86611k54447k9099o0528Q4816J14830j80609Q6647J13927q0123
12716C300666P7303k9281j46483J12618L23827j18674J42967j22035K6228o6751
12706C500385K07093m8640P5873K14863K25588J55902q3078J54188O2084L09541
12696D773799M6560R8144K40896K45382L53529L85452K74197M77194M02233L48791
12686G646177J42467j43437j03322j56124j48546o50560m87959l82177k48777
12677E467742l57137l25678J55456k92423j5269k4696P9251k9565K07436m7487
$$ plain form
12667 4817630 4878910 4898400 4902591 5119620 5052121 5339917 5110051 5336883 5356904 5093449
12657 5093449 5374638 5314643 5449684 5732400 5883787 5894404 6237172 6433667 6498236 6581994
12647 6581994 6563308 6348630 6499489 6208335 6244124 6512434 6617198 6498171 6735062 6815342
12637 6815342 7201579 7029291 7249898 7361605 7443371 7385471 7676001 7579125 7702170 7715677
12627 7715677 7584579 7389820 7101237 7030605 6823851 6567132 6388939 5937080 5837524 5690969
12617 5690969 5377340 5611193 5200340 5316497 5578981 5868008 6529948 6899949 7136381
12608 7136381 7908890 8571201 8757558 9336196 9259978 9370712 9197555 8529210 8475338 7818685
12598 7818685 7504238 6961928 6496676 6302202 5974127 6004307 6098252 6004945 6150613 6060164
$$ packed form
12667D817630O1280J9490M191K17029o7499K87796k29866K26832K0021k63455
12657E093449K81189n9995J35041K82716J51387J0617L42768J96495O4569Q3758
12647F581994j8686k14678J50859k91154L5789K68310J04764j19027K36891Q0280
12637F815342L86237j72288K20607J11707Q1766n7900K90530r6876J23045J3507
12627G715677j31098j94759k88583p0632k06754k56719j78193m51859r9556j46555
12617E690969l13629K33853m10853J16157K62484K89027O61940L70001K36432
12608G136381P72509O62311J86357N78638p6218J10734j73157o68345n3872o56653
12598G818685l14447n42310m65252j94474l28075L0180R3945r3307J45668r0449
$$ plain form
12588 6060164 6609008 6457861 6043424 6088739 6185249 6202685 5982075 6271997 6522507 6598473
12578 6598473 6762713 7279235 7447999 7682847 7737985 7680608 7348537 7241912 6815159 6096395
12568 6096395 5816536 5485957 5335187 5006631 4994350 4940341 5200546 5086157 5004250 4834336
12558 4834336 4826214 5079779 4904626 4792533 4795982 5031067 5045204 4929210 4801316 4982623
12548 4982623 4984915 4864304 5002219 4864937 5047972 5489726 5594846 5648429 5630841 5904098
12538 5904098 5941439 6353546 6194197 5975266 5821505 5549474 5340587 5387954 5194368 5168078
12528 5168078 5149315 5065749 4987122 5173328 4986097 5169018 5031434 5044917 5257363 5145493
12518 5145493 5164214 5330450 5329647 5334222 5826120 6121046 6741769 7069753 7488152 7604574
$$ packed form
12588F060164N48844j51147m14437M5315R6510J7436k20610K89922K50510P5966
12578F598473J64240N16522J68764K34848N5138n7377l32071j06625m26753p18764
12568F096395k79859l30579j50770l28556j2281n4009K60205j14389q1907j69914
12558D834336q122K53565j75153j12093L449K35085J4137j15994j27894J81307
12548D982623K292j20611J37915j37282J83035M41754J05120N3583j7588K73257
12538E904098L7341M12107j59349k18931j53761k72031k08887M7367j93586k6290
12528E168078j8763q3566p8627J86206j87231J82921j37584J3483K12446j11870
12518E145493J8721J66236q03M575M91898K94926O20723L27984M18399J16422
$$ plain form
12508 7604574 7713425 7989204 7700077 7705128 7395180 6957914 6503554 6399228 6002410 5769713
12498 5769713 5832526 5796571 5338559 5553396 5433560 5652464 5418656 5385886 5269720 5552254
12488 5552254 5657474 5579776 5760723 5714471 5807311 6098945 6382648 6583236 6988362 6840900
12478 6840900 6848908 7025624 6934445 6756897 6527853 6119954 5898513 5813721 5878603 5734678
12468 5734678 5692127 5616191 6154583 5749392 5980866 5887754 6060806 6126992 6014481 6038069
12458 6038069 6159568 6269719 6486355 6502954 6423714 6750388 6813491 6718448 6961851 7128106
12448 7128106 7445349 7620181 8048969 8280311 8536548 8779185 9063716 9104786 9369899 9985333
12438 9985333 9691849 9893470 10216752 10371082 10195013 10251458 10329707 10245540 10615528 10275558
$$ packed form
12508G604574J08851K75779k89127N051l09948m37266m54360j04326l96818k32697
12498E769713O2813l5955m58012K14837j19836K18904k33808l2770j16166K82534
12488E552254J05220p7698J80947m6252R2840K91634K83703K00588M05126j47462
12478F840900Q008J76716r1179j77548k29044m07899k21441q4792O4882j43925
12468E734678m2551p5936N38392m05191K31474r3112J73052O6186j12511K3588
12458F038069J21499J10151K16636J6599p9240L26674O3103r5043K43403J66255
12448G128106L17243J74832M28788K31342K56237K42637K84531M1070K65113O15434
12438I985333k93484K01621L23282J54330j76069N6445P8249q4167L69988l39970
$$ plain form
12428 10275558 10678625 10830247 10783658 10742152 10882952 11322968 11200587 11451673 11609448 11850970
12418 11850970 12322890 12763282 13168064 13675366 13932475 14391156 14976316 15264626 15541023
12409 15541023 15729713 15927170 15969288 15832104 15781399 16078202 15613696 15392408 15219113 14937147
12399 14937147 14826589 14647523 14611740 14248296 14149791 14239712 14145228 14017424 14415415 14518497
12389 14518497 14596935 15002356 15160749 15589223 15981793 16150290 16244360 16895156 17105649 17503568
12379 17503568 17406368 17399546 17514029 17634059 17617454 17619049 17253113 17386856 17150695 17030934
12369 17030934 17063665 16528355 16806880 16699069 16548473 16260154 15978829 15816522 15806851 15685718
12359 15685718 15731094 15588546 15251777 15204660 14976570 14795412 14591215 14703136 14393815 14259326
$$ packed form
12428A0275558M03067J51622m6589m1506J40800M40016j22381K51086J57775K41522
12418A1850970M71920M40392M04782N07302K57109M58681N85160K88310K76397
12409A5541023J88690J97457M2118j37184n0705K96803m64506k21288j73295k81966
12399A4937147j10558j79066l5783l63444r8505Q9921r4484j27804L97991J03082
12389A4518497P8438M05421J58393M28474L92570J68497R4070O50796K10493L97919
12379A7503568r7200o822J14483J20030j6605J595l65936J33743k36161j19761
12369A7030934L2731n35310K78525j07811j50596k88319k81325j62307r671j21133
12359A5685718M5376j42548l36769m7117k28090j81158k04197J11921l09321j34489
$$ plain form
12349 14259326 14042565 13799406 13661450 13456901 13634187 13453416 13579480 13817921 13742454
12340 13742454 13770964 14251751 14197958 14754938 14988373 15292752 15532920 15835255 15925729 16191065
12330 16191065 16604727 16917486 17268044 17600589 17636786 17640130 17905144 18074512 18115622 18248384
12320 18248384 18213951 18302899 18150010 18311584 18265332 18366931 18266501 18420811 18635216 18556228
12310 18556228 18864980 18963647 19209796 19244824 19642143 20205398 20336702 20756683 20838362 20645430
12300 20645430 20715027 20467644 20188037 19863935 19413504 18889463 18737861 18377954 18150657
12291 18150657 18055497 17743835 17619988 17181397 16989481 16800349 16451631 15704350 15344464
12282 15344464 14931379 14365620 14030369 13537186 13349481 13014125 12743836 12812566 12260019
$$ packed form
12349A4259326k16761k43159j37956k04549J77286j80771J26064K38441p5467
12340A3742454K8510M80787n3793N56980K33435L04379K40168L02335R0474K65336
12330A6191065M13662L12759L50558L32545L6197L344K65014J69368M1110J32762
12320A8248384l4433Q8948j52889J61574m6252J01599j00430J54310K14405p8988
12310A8556228L08752R8667K46149L5028L97319N63255J31304M19981Q1679j92932
12300B0645430O9597k47383k79607l24102m50431n24041j51602l59907k27297
12291A8150657r5160l11662j23847m38591j91916j89132l48718p47281l59886
12282A5344464m13085n65759l35251m93183j87705l35356k70289O8730n52547
$$ plain form
12273 12260019 12515158 12236411 12015243 11853261 12148333 11774730 11887757 11817153 11659186
12264 11659186 11876474 11643384 11794653 11702926 11757075 11793741 11963413 12158563 12275439 12263023
12254 12263023 12713250 12938776 13391234 14054475 14564148 15279462 16163859 16943885 17947951
12245 17947951 18970780 19648829 20627919 21600623 21807515 22079383 22474326 22509890 22571650
12236 22571650 22453270 22375786 21896982 22025747 21818854 21765305 21533527 21311418 20740765 20143988
12226 20143988 19858138 18754768 17737739 17013644 15922967 15061294 14446472 13629959 13372323
12217 13372323 12762301 12479695 11854315 11574760 11452319 11268881 11123580 10720075 10451358
12208 10451358 10302993 9945045 9874872 9834395 9805221 9578945 9673155 9606701 9544537 9679399
$$ packed form
12273A2260019K55139k78747k21168j61982K95072l73603J13027p0604j57967
12264A1659186K17288k33090J51269r1727N4149L6666J69672J95150J16876j2416
12254A2263023M50227K25526M52458O63241N09673P15314Q84397P80026J004066
12245A7947951J022829O78049R79090R72704K06892K71868L94943L5564O1760
12236B2571650j18380p7484m78804J28765k06893n3549k31778k22109n70653n96777
12226B0143988k85850j103370j017029p24095j090677q61673o14822q16513k57636
12217A3372323o10022k82606o25380k79555j22441j83438j45301m03505k68717
12208A0451358j48365l57948p0173m0477k9174k26276R4210o6454o2164J34862
$$ plain form
12198 9679399 9427738 9476560 9404831 9457845 9572608 9717757 9747051 9950897 10129889 10198672
12188 10198672 10624697 10597063 10711662 11020582 10891183 11211023 11259819 11458768 11619064 11637888
12178 11637888 11775054 11492188 11632523 11488348 11485188 11326279 11379667 11551810 11716521 11715671
12168 11715671 11789004 12048933 12113653 12259848 12510673 12652861 13252180 14039617 14480028 15013691
12158 15013691 15397731 15557452 15620182 15470362 15328007 15154904 15104168 14813153 14811889 15020239
12148 15020239 15185236 15758212 16229171 16526126 16923589 17307336 17487792 17817677 18307052
12139 18307052 18597164 19043598 19883997 20498500 21330800 22188643 23700343 24761181 26249213
12130 26249213 27837741 29752409 31414636 33056923 34835674 35892463 37002915 37769633
$$ packed form
12198I679399k51661M8822p1729N3014J14763J45149K9294K03846J78992O8783
12188A0198672M26025k7634J14599L08920j29399L19840M8796J98949J60296J8824
12178A1637888J37166k82866J40335j44175l160j58909N3388J72143J64711q50
12168A1715671P3333K59929O4720J46195K50825J42188N99319P87437M40411N33663
12158A5013691L84040J59721O2730j49820j42355j73103n0736k91015j264K08350
12148A5020239J64997N72976M70959K96955L97463L83747J80456L29885M89375
12139A8307052K90112M46434Q40399O14503Q32300Q57843J511700J060838J488032
12130B6249213J588528J914668J662227J642287J778751J056789J110452P66718
$$ plain form
12122 37769633 38488112 38484239 38602875 38640678 38517240 38255273 38022170 37532884 37092285 36790147
12112 36790147 36365825 35802237 35775170 35075288 34972440 34930053 34585374 34647274 34645899 35162940
12102 35162940 35428287 35684266 35953202 36233524 36485768 36282108 35811337 35190060 34527078
12093 34527078 33667032 33159829 32423980 32371699 32404793 32813244 33106794 34026286 34559767 35376503
12083 35376503 35752229 36228266 36372783 36404500 36165333 36314008 35819330 35828450 35584739 35471692
12073 35471692 35206635 35000977 34758264 34062600 33582418 32736750 31925411 30837358 29855163
12064 29855163 28727184 27988045 27148947 26406910 25721416 25556065 24882009 24421099 24224746
12055 24224746 23935314 23431564 23091431 22801452 22381997 21711663 21414721 21299542 20867480
$$ packed form
12122C7769633P18479l873J18636L7803j23438k61967k33103m89286m40599l02138
12112C6790147m24322n63588k7067o99882j02848m2387l44679O1900j375N17041
12102C5162940K65347K55979K68936K80322K52244k03660m70771o21277o62982
12093C4527078q60046n07203p35849n2281L3094M08451K93550R19492N33481Q16736
12083C5376503L75726M76037J44517L1717k39167J48675m94678R120k43711j13047
12073C5471692k65057k05658k42713o95664m80182q45668q11339j088053r82195
12064B9855163j127979p39139q39098p42037o85494j65351o74056m60910j96353
12055B4224746k89432n03750l40133k89979m19455o70334k96942j15179m32062
$$ plain form
12046 20867480 20663396 20161801 20054420 19482594 19343996 18727594 18355788 18128290 17593579
12037 17593579 17218590 16839060 16481787 16511514 16265244 16450102 16646579 17071608 16945675
12028 16945675 17398205 17393725 17321586 17576129 17282666 16873345 16351193 15758529 15192931 14728291
12018 14728291 14267917 13980417 13757673 13614283 13612232 13221530 12947200 12889378 12343687 12088843
12008 12088843 11793666 11691478 11600357 11477938 11493240 11771434 11986956 12440007 12394929 12311013
11998 12311013 12206949 12221574 11616669 11385524 11062417 10693628 10388932 10224175 10199963 9952898
11988 9952898 10014352 9858032 9656372 9537543 9239789 9070701 8550897 8464337 8514646 8164151
11978 8164151 8175133 7909138 7814971 7655478 7634430 7433979 7345157 7212656 6602008 6708693
$$ packed form
12046B0867480k04084n01595j07381n71826j38598o16402l71806k27498n34711
12037A7593579l74989l79530l57273K9727k46270J84858J96477M25029j25933
12028A6945675M52530m480p2139K54543k93463m09321n22152n92664n65598m64640
12018A4728291m60374k87500k22744j43390k051l90702k74330n7822n45691k54844
12008A2088843k95177j02188r1121j22419J5302K78194K15522M53051m5078q3916
11998A2311013j04064J4625o04905k31145l23107l68789l04696j64757k4212k47065
11988I952898O1454j56320k01660j18829k97754j69088n19804q6560N0309l50495
11978H164151J0982k65995r4167j59493k1048k00451q8822j32501o10648J06685
$$ plain form
11968 6708693 6584179 6207859 6298998 5994786 6089254 5915958 5797750 5827830 5901335 5888078
11958 5888078 5943243 6175157 6493107 6277282 6739608 6808048 6700124 6384627 6642729 6578290
11948 6578290 6449535 6629645 6822541 6724328 6959779 7275391 7242261 7428493 7620305 7888048
11938 7888048 7865191 7902353 7908854 8046197 8168188 7852801 8014606 8039812 8276033 8213922
11928 8213922 8214425 7755828 7797362 7654710 7587011 7345675 7152018 6862206 6659303 6941166
11918 6941166 6693759 6459768 6219921 6150559 6233968 6153078 6031769 6451006 7257220 8209275
11908 8209275 10546974 12066069 13054395 13610339 13949166 13951386 13415792 12228871 11072430
11899 11072430 9431833 7836746 7220386 6514745 6145536 5856755 5548538 5675916 5805964
$$ packed form
11968F708693j24514l76320R1139l04212R4468j73296j18208L0080P3505j3257
11958E888078N5165K31914L17950k15825M62326O8440j07924l15497K58102o4439
11948F578290j28755J80110J92896r8213K35451L15612l3130J86232J91812K67743
11938G888048k2857L7162O501J37343J21991l15387J61805K5206K36221o2111
11928H213922N03m58597M1534j42652o7699k41336j93657k89812k02903K81863
11918F941166k47407k33991k39847o9362Q3409q0890j21309M19237Q06214R52055
11908H209275K337699J519095R88326N55944L38827K220n35594j186921j156441
11899A1072430j640597j595087o16360p05641l69209k88781l08217J27378J30048
$$ plain form
11890 5805964 5700651 6133810 6345051 6810900 7314345 8105496 8772615 9501258 9596399 9976756
11880 9976756 10218319 10399942 10047487 10121956 9213682 9039382 8469893 8057503 7702033 7154900
11870 7154900 6744730 6315440 5962201 5624003 5464457 5263302 5167522 4697953 4990478 4763136
11860 4763136 4717870 4732244 4816441 4719036 4509017 4681521 5021397 4957828 4933800 5168678
11850 5168678 5162900 5575153 5767163 6048625 6212052 6573857 6833129 7643187 7846021 8319469
11840 8319469 8591329 8627311 8775506 8802517 8478453 8105544 7904105 8107507 7699269 7641495
11830 7641495 7716399 7837554 7680373 7223527 7134156 6867231 6238778 5967478 5296138 5370555
11820 5370555 4905388 4674358 4409230 4256982 4263182 4184131 4090324 3858459 3884159 4018539
$$ packed form
11890E805964j05313M33159K11241M65849N03445P91151O67119P28643R5141L80357
11880I976756K41563J81623l52455P4469r08274j74300n69489m12390l55470n47133
11870G154900m10170m29290l53239l38198j59546k01155r5780m69569K92525k27342
11860D763136m5266J4374Q4197r7405k10019J72504L39876o3569k4028K34878
11850E168678n778M12253J92010K81462J63427L61805K59272Q10058K02834M73448
11840H319469K71860L5982J48195K7011l24064l72909k01439K03402m08238n7774
11830G641495P4904J21155j57181m56846q9371k66925o28453k71300o71340P4417
11820E370555m65167k31030k65128j52248O200p9051r3807k31865K5700J34380
$$ plain form
11810 4018539 3904820 3675567 3823475 3739965 3445335 3464208 3601798 3478238 3775636 3525283
11800 3525283 3634370 3734262 3558026 3592030 3822674 3730205 3850103 3931663 4255375 4633443
11790 4633443 4614664 5176872 5609893 5981594 6225607 6276498 6126393 6152199 6096130 5729203
11780 5729203 5159207 4938681 4142596 4064935 4083054 3994177 3581101 3345095 3261345 3302727
11770 3302727 3322851 3306207 3198469 3345068 3065249 3197499 3050274 2978222 3134273 3008026
11760 3008026 2978777 3160457 3089336 2887391 2781309 3008503 2930022 3013905 2838290 2920697
11750 2920697 2778631 2964593 3058777 2959955 2970727 2962141 2878861 2986444 3072720 2721785 2852065
11739 2852065 2851595 2729445 2841897 2737678 2816265 2802481 2436927 2861693 2629683 2680918
$$ packed form
11810D018539j13719k29253J47908q3510k94630J8873J37590j23560K97398k50353
11800C525283J09087R9892j76236L4004K30644r2469J19898Q1560L23712L78068
11790D633443j8779N62208M33021L71701K44013N0891j50105K5806n6069l66927
11780E729203n69996k20526p96085p7661J8119q8877m13076k36006q3750M1382
11770C302727K0124j6644j07738J46599k79819J32250j47225p2052J56051j26247
11760C008026k9249J81680p1121k01945j06082K27194p8481Q3883j75615Q2407
11750B920697j42066J85962R4184r8822J0772q586q3280J07583Q6276l50935J30280
11739B852065m70j22150J12452j04219P8587j3784l65554M24766k32010N1235
$$ plain form
11729 2680918 2698027 2593776 2954953 2438336 2613448 2530636 2852482 2823529 2721762 2864200
11719 2864200 2525746 2715885 2645552 2509914 2698771 2856299 2554274 2906533 2749798 2624290
11709 2624290 2718170 2569914 2859147 2558135 2728636 2724753 2742027 2656661 2789909 2732988
11699 2732988 2975571 2901865 2941916 2793046 2839690 3168425 2853550 3054598 2874520 2887679
11689 2887679 3079639 3149145 3253624 3058656 3226104 3091730 3436811 3186630 3364769 3244161
11679 3244161 3394188 3473149 3600803 3696454 3493038 3517393 3486958 3576493 3432535 3374499
11669 3374499 3668088 3416473 3626174 3663893 3472074 3726765 3532909 3425944 3720460 3640971
11659 3640971 3616689 3448051 3693996 3417195 3633196 3616930 3445534 3333821 3409621 3164288
$$ packed form
11729B680918J7109j04251L61177n16617J75112q2812L21846k8953j01767J42438
11719B864200l38454J90139p0333j35638J88857J57528l02025L52259j56735j25508
11709B624290R3880j48256K89233l01012J70501l883J7274q5366J33248n6921
11699B732988K42583p3706M0051j48870M6644L28735l14875K01048j80078J3159
11689B887679J91960O9506J04479j94968J67448j34374L45081k50181J78139j20608
11679C244161J50027P8961J27654R5651k03416K4355l0435Q9535j43958n8036
11669C374499K93589k51615K09701L7719j91819K54691j93856j06965K94516p9489
11659C640971k4282j68638K45945k76801K16001j6266j71396j11713P5800k45333
$$ plain form
11649 3164288 3201628 3406274 3297893 3327596 3219541 3383886 3062323 3453369 3107427 3207893
11639 3207893 3392247 3111213 3078337 2990418 3414027 3354205 3122308 3307710 3068433 3146694
11629 3146694 3221907 3217995 3002070 3379843 3085500 3101349 3049920 3274679 3097281 3092445 3033873
11618 3033873 2924201 3028964 2887948 3009095 3034312 3207151 3120760 3042121 3056080 3026902
11608 3026902 3166888 3078758 3244814 3482051 3329435 3454495 3485391 3451836 3241632 3407393
11598 3407393 3339487 3517154 3504677 3237928 3383085 3660775 3421627 3576266 3379166 3307652
11588 3307652 3340904 3306275 3445721 3416523 3340659 3418695 3239194 3385880 3619399 3542207
11578 3542207 3319573 3684715 3497100 3602413 3677294 3625774 3670656 3787501 3425590 3778013
$$ packed form
11649C164288L7340K04646j08381K9703j08055J64345l21563L91046l45942J00466
11639C207893J84354k81034l2876q7919M23609n9822k31897J85402k39277P8261
11629C146694P5213l912k15925L77773k94343J5849n1429K24759j77398m836n8572
11618C033873j09672J04763j41016J21147K5217J72839q6391p8639J3959k9178
11608C026902J39986q8130J66056K37237j52616J25060L0896l3555k10204J65761
11598C407393o7906J77667j2477k66749J45157K77690k39148J54639j97100p1514
11588C307652L3252l4629J39446k9198p5864P8036j79501J46686K33519p7192
11578C542207k22634L65142j87615J05313P4881n1520M4882J16845l61911L52423
$$ plain form
11568 3778013 3617372 3460037 3577546 3398887 3765849 3636533 3397188 3534677 3553969 3305576
11558 3305576 3605035 3781734 3453701 3741215 3465276 3542963 3721270 3756436 3529199 3660757
11548 3660757 3477335 3457102 3560705 3777372 3272730 3502134 3586468 3329612 3604622 3397964
11538 3397964 3326943 3622022 3441208 3313901 3365107 3342069 3463614 3442252 3586305 3468305
11528 3468305 3307004 3431572 3427352 3288945 3420211 3434606 3386068 3400802 3428554 3167668
11518 3167668 3324584 3249411 3504614 3317628 3300502 3537720 3467521 3499396 3524065 3477224
11508 3477224 3807585 3717431 3599562 3664949 3618523 3634521 3630039 3709154 3857355 3874740 3460254
11497 3460254 3661643 3739265 3799524 3730243 3648102 3784798 3877895 3864250 3726940 3757155 4015923
$$ packed form
11568C778013j60641j57335J17509j78659L66962j29316k39345J37489J9292k48393
11558C305576K99459J76699l28033K87514k75939P7687J78307L5166k27237J31558
11548C660757j83422k0233J03603K16667n04642K29404Q4334k56856K75010k06658
11538C397964p1021K95079j80814j27307N1206k3038J21545k1362J44053j18000
11528C468305j61301J24568m220j38407J31266J4395m8538J4734K7752k60886
11518C167668J56916p5173K55203j86986j7126K37218p0199L1875K4669m6841
11508C477224L30361r0154j17869O5387m6426J5998m482P9115J48201J7385m14486
11497C460254K01389P7622O0259o9281q2141J36696R3097j3645j37310L0215K58768
$$ plain form
11486 4015923 3659772 3803591 3744689 3872192 3891011 4061370 3816411 3707698 4022105 4004364
11476 4004364 3844054 3959387 3773491 4062815 3914408 4019218 3923579 3854872 3758507 3914505
11466 3914505 3975367 3884329 3606596 4048425 3745842 3490935 3952017 3924059 3787257 3554042
11456 3554042 3586251 3712884 3842867 3659608 3709653 3726726 3788151 3702746 4007642 3901586
11446 3901586 3946213 3769559 3998455 3881907 3672007 4094688 4200240 4076786 4139285 4237068
11436 4237068 4373916 4333128 4375256 4501636 4483626 4428622 4716425 4700456 4458024 4836416
11426 4836416 4639406 4792217 5094933 4883603 4823847 5154371 4868876 5057056 4918192 5118834
11416 5118834 5191672 4977353 5268466 5346508 5208199 5337228 5331801 5434283 5481577 5583402
$$ packed form
11486D015923l56151J43819n8902J27503J8819J70359k44959j08713L14407j7741
11476D004364j60310J15333j85896K89324j48407J04810r5639o8707r6365J55998
11466C914505O0862r1038k77733M41829l02583k54907M61082k7958j36802k33215
11456C554042L2209J26633J29983j83259N0045J7073O1425q5405L04896j06056
11446C901586M4627j76654K28896j16548k09900M22681J05552j23454O2499R7783
11436D237068J36848m0788M2128J26380j8010n5004K87803j5969k42432L78392
11426D836416j97010J52811L02716k11330n9756L30524k85495J88180j38864K00642
11416E118834P2838k14319K91113P8042j38309J29029n427J02482M7294J01825
$$ plain form
11406 5583402 5556590 5780348 5656631 5837457 5765437 6037026 6428085 6383045 6186251 6739669
11396 6739669 6399092 6885556 6753437 6903065 7046085 6996915 6990549 7318603 7457224 7415722
11386 7415722 7712038 7908491 7691595 8014340 8152946 8141753 8250505 8624198 8553006 8624353
11376 8624353 8670629 8820476 9062100 8950709 8747947 9152200 9070187 9194402 9368176 9459676
11366 9459676 9296184 9422195 9327608 9440125 9262009 9584093 9762322 9759853 9786223 9588868
11356 9588868 9471188 9659344 9759793 9886800 9914975 9804487 9774669 9925567 9856031 9780353
11346 9780353 9860973 9782242 9699471 9579916 9535680 9842268 9687824 9629382 9491379 9350270
11336 9350270 9447075 9357990 9181950 9261464 8896046 9035530 9043070 8629349 8937438 8791404
$$ packed form
11406E583402k6812K23758j23717J80826p2020K71589L91059m5040j96794N53418
11396F739669l40577M86464j32119J49628J43020m9170o366L28054J38621m1502
11386G415722K96316J96453k16896L22745J38606j1193J08752L73693p1192P1347
11376H624353M6276J49847K41624j11391k02762M04253q2013J24215J73774R1500
11366I459676j63492J26011r4587J12517j78116L22084J78229k469K6370j97355
11356I588868j17680J88156J00449J27007K8175j10488k9818J50898o9536p5678
11346I780353Q0620p8731q2771j19555m4236L06588j54444n8442j38003j41109
11336I350270R6805q9085j76040P9514l65418J39484P540m13721L08089j46034
$$ plain form
11326 8791404 8397692 8195874 8391342 8127724 8057050 8030790 8067181 7845097 7531832 7457325
11316 7457325 7267987 7289134 7057532 7173131 7003824 6793760 6350873 6615188 6494481 6280138
11306 6280138 6139183 5669345 5820737 5814093 5657294 5586517 5434574 5578758 5315416 5031598
11296 5031598 5148601 5085637 4890424 4927802 4807012 4520370 4519834 4481583 4570414 4446685 4360781
11285 4360781 4096447 4461806 3953932 3703120 3853230 3719213 3998711 3926530 3884446 3752317
11275 3752317 3488893 3602104 3688920 3356294 3403408 3262862 3357950 3406447 3430278 3291106
11265 3291106 3541105 3307183 3224351 3290532 3087481 3129376 3305897 3082966 3128679 3115059
11255 3115059 3088998 2941608 2871994 2795667 2885851 2806326 2931372 2929636 2892411 2743352 3166512
$$ packed form
11326H791404l93712k01818J95468k63618p0674k6260L6391k22084l13265p4507
11316G457325j89338K1147k31602J15599j69307k10064m42887K64315j20707k14343
11306F280138j40955m69838J51392o644j56799p0777j51943J44184k63342k83818
11296E031598J17003o2964j95213L7378j20790k86642n36l8251Q8831j23729q5904
11285D360781k64334L65359n07874k50812J50110j34017K79498p2181m2084j32129
11275C752317k63424J13211Q6816l32626M7114j40546R5088M8497K3831j39172
11265C291106K49999k33922q2832O6181k03051M1895J76521k22931M5713j3620
11255C115059k6061j47390o9614p6327R0184p9525J25046j736l7225j49059M23160
$$ plain form
11244 3166512 2895823 3028794 2919165 3067068 2862436 3001088 2932750 2814973 3197493 3064660
11234 3064660 3030195 2970051 2817474 2945655 2917960 3395669 3110734 3256283 3523711 3629820
11224 3629820 4091544 5011955 5648833 6379513 6757118 6901071 6994222 6802145 6641486 5912403
11214 5912403 5284854 4502811 4204383 3830632 3758441 3461343 3178812 3106337 3162337 3182607
11204 3182607 3142528 2942076 2890217 3116361 3225388 3117416 3221408 3526402 3870310 4366678
11194 4366678 4983830 5970236 6736731 6727621 6928303 7015383 6862202 6469624 5819603 5089933
11184 5089933 4567796 4195835 3821527 3843088 3479537 3544497 3609822 3223960 3436766 3325217
11174 3325217 3318723 3361196 3153305 3025749 3224002 3407022 3319416 3275370 3312561 3458687
$$ packed form
11244C166512k70689J32971j09629J47903k04632J38652o8338j17777L82520j32833
11234C064660l4465o0144j52577J28181k7695M77709k84935J45549K67428J06109
11224C629820M61724R20411O36878P30680L77605J43953R3151j92077j60659p29083
11214E912403o27549p82043k98428l73751p2191k97098k82531p2475N6000K0270
11204C182607m0079k00452n1859K26144J09027j07972J03992L04994L43908M96368
11194D366678O17152R86406P66495r110K00682Q7080j53181l92578o50021p29670
11184E089933n22137l71961l74308K1561l63551O4960O5325l85862K12806j11549
11174C325217o494M2473k07891j27556J98253J83020q7606m4046L7191J46126
$$ plain form
11164 3458687 3412056 3391633 3361703 3591307 3432900 3432803 3424066 3318182 3365953 3508053 3431752
11153 3431752 3458412 3275573 3527474 3574387 3306623 3638530 3555305 3373947 3496088 3351784
11143 3351784 3587061 3565125 3496280 3740290 3551978 3712233 3484263 3743661 3789737 3780028
11133 3780028 3653837 3539368 3738312 3976552 4015630 3928602 3835391 3756149 4016423 3960095
11123 3960095 4096336 4009618 3992926 3986396 4062618 4128936 4220900 4156759 4303526 4070017 4238056
11112 4238056 4111259 4297134 4015842 4212470 4333446 4204473 4224621 4138724 4133815 4184276
11102 4184276 4313337 4052463 4073243 4081145 4190800 4027456 4011767 4063306 3951298 4058864
11092 4058864 3870694 4063745 3896464 3776335 3798593 4044609 3804637 3919651 3880859 3953344
$$ packed form
11164C458687m6631k0423k9930K29604j58407r7q737j05884M7771J42100p6301
11153C431752K6660j82839K51901M6913k67764L31907q3225j81358J22141j44304
11143C351784K35277k1936o8845K44010j88312J60255k27970K59398M6076r709
11133C780028j26191j14469J98944K38240L9078q7028r3211p9242K60274n6328
11123C960095J36241q6718j6692o530P6222O6318R1964o4141J46767k33509J68039
11112D238056j26797J85875k81292J96628J20976j28973K0148q5897m909N0461
11102D184276J29061k60874K0780P902J09655j63344j5689N1539j12008J07566
11092D058864j88170J93051j67281j20129K2258K46016k39972J15014l8792P2485
$$ plain form
11082 3953344 3696681 3887825 3900039 3928423 3891046 4096969 4100903 3850853 4110154 3948558
11072 3948558 4138628 4022682 4238514 4197782 4497878 4235203 4361286 4488863 4297397 4712904
11062 4712904 4287568 4725454 4841993 4525273 4778150 4909279 4921957 5088115 4873761 4838156
11052 4838156 5064439 4986112 5328411 5212430 5209425 5093720 5106313 5271019 5252836 5430973
11042 5430973 5289341 5339802 5718319 5568429 5547707 5785518 6010282 5878275 6144514 6143405
11032 6143405 6283199 6521741 6681986 6749943 7101762 7285292 7322456 7654312 7680394 7839452
11022 7839452 8186451 8183183 8281302 8640766 8499515 8543964 8823237 8698493 9246158 8943855
11012 8943855 9160000 9353610 9430384 9535777 9771338 9793985 10008585 9949520 10413556 10425073
$$ packed form
11082C953344k56663J91144J2214K8384l7377K05923L934k50050K59301j61596
11072C948558J90070j15946K15832m0732L00096k62675J26083J27577j91466M15507
11062D712904m25336M37886J16539l16720K52877J31129J2678J66158k14354l5605
11052D838156K26283p8327L42299j15981l005j15705J2593J64706j8183J78137
11042E430973j41632N0461L78517j49890k0722K37811K24764j32007K66239j109
11032F143405J39794K38542J60245O7957L51819J83530L7164L31856K6082J59058
11022G839452L46999l268R8119L59464j41251M4449K79273j24744N47665l02303
11012H943855K16145J93610P6774J05393K35561K2647K14600n9065M64036J1517
$$ plain form
11002 10425073 10691316 11264092 11449444 11518737 11886679 11752862 12193936 12476878 12748425
10993 12748425 12882582 13098110 12963930 13159659 13436821 13493334 13413745 13796937 13758947 14058057
10983 14058057 14334234 14793530 15167204 15549612 15672846 15983445 16388376 16638465 16708406
10974 16708406 16630664 17107775 17033479 17227489 17439734 17922762 18077333 18195989 18823102 18952218
10964 18952218 19537764 19523242 20060722 20587359 20823061 21118232 21526989 21853345 22592462
10955 22592462 23068548 23720934 24174075 24487768 25297537 25610507 25880012 26272553 26715645
10946 26715645 27199009 27399983 27994489 28366858 28809868 29125162 29875993 30484953 31090544
10937 31090544 31691599 32055713 32506944 33249843 33846270 34775118 35414037 36121660 36674175
$$ packed form
11002A0425073K66243N72776J85352O9293L67942j33817M41074K82942K71547
10993A2748425J34157K15528j34180J95729K77162N6513p9589L83192l7990K99110
10983A4058057K76177M59296L73674L82408J23234L10599M04931K50089O9941
10974A6708406p7742M77111p4296J94010K12245M83028J54571J18656O27113J29116
10964A8952218N85546j4522N37480N26637K35702K95171M08757L26356P39117
10955B2592462M76086O52386M53141L13693Q09769L12970K69505L92541M43092
10946B6715645M83364K00974N94506L72369M43010L15294P50831O08960O05591
10937C1090544O01055L64114M51231P42899N96427R28848O38919P07623N52515
$$ plain form
10928 36674175 37404335 38234465 39005386 39491369 40244584 41047481 41887403 42472320 43237003
10919 43237003 43575987 43988146 44463464 44635625 44658250 44530841 44616669 44814807 44653577 44611332
10909 44611332 44740257 44667718 44604533 44677247 44513307 44764407 44575378 44877685 44905664 45038172
10899 45038172 45248754 45428012 45685268 46007469 46346148 46734989 47059781 47767180 48257810
10890 48257810 49385280 49910679 50841420 51803605 53191102 54406418 56086357 57945953
10882 57945953 59706062 62270643 64839506 67694700 70892518 74276336 78169629 82181079
10874 82181079 85868518 89788304 93395887 96127614 98960362 100728367 101918922 102548822
10866 102548822 102136046 101380596 99505624 97270488 94688449 91793544 88237010 84664201
$$ packed form
10928C6674175P30160Q30130P70921M85983P53215Q02897Q39922N84917P64683
10919D3237003L38984M12159M75318J72161K2625j27409Q5828J98138j61230m2245
10909D4611332J28925p2539o3185P2714j63940K51100j89029L02307K7979J32508
10899D5038172K10582J79258K57256L22201L38679L88841L24792P07399M90630
10890D8257810J127470N25399R30741R62185J387497J215316J679939J859596
10882E7945953J760109K564581K568863K855194L197818L383818L893293M011450
10874H2181079L687439L919786L607583K731727K832748J768005J190555O29900
10866A02548822m12776p55450j874972k235136k582039k894905l556534l572809
$$ plain form
10858 84664201 81132432 77437315 73579512 69822943 66210043 62598628 59190284 55740711
10850 55740711 52621937 49608103 46769722 44169589 41390456 39010791 36815404 34525202
10842 34525202 32631505 30880715 29219349 27316021 26130795 24495699 23353886 22088567
10834 22088567 21083908 20004373 19103247 18068365 17511729 16453430 15755078 14839853 14400876
10825 14400876 13607091 13312656 12541478 12082569 11764584 11382514 10820131 10455678 10110690
10816 10110690 10017365 9890681 9458200 9194203 9180462 8963866 8940966 8608538 8520352 8356076
10806 8356076 7944796 7989398 7605997 7553092 6854364 6791557 6581100 6353592 6365020 6060089
10796 6060089 5998014 5774170 5570171 5574662 5387128 5061914 5083935 5115102 4903447 5015153
$$ packed form
10858H4664201l531769l695117l857803l756569l612900l611415l408344l449573
10850E5740711l118774l013834k838381k600133k779133k379665k195387k290202
10842C4525202j893697j750790j661366j903328j185226j635096j141813j265319
10834B2088567j004659j079535r01126j034882n56636j058299o98352r15225m38977
10825A4400876p93785k94435p71178m58909l17985l82070n62383l64453l44988
10816A0110690r3325j26684m32481k63997j3741k16596k2900l32428q8186j64276
10806H356076m11280M4602l83401n2905o98728o2807k10457k27508J1428l04931
10796F060089o2075k23844k03999M491j87534l25214K2021L1167k11655J11706
$$ plain form
10786 5015153 4885769 4732182 4753319 4791010 4813616 4547772 4393130 4310931 4446885 4388216
10776 4388216 4055106 4223640 3965160 3950861 3803207 3739576 3969433 3818005 3765023 3752814
10766 3752814 3651569 3570101 3498433 3578549 3622751 3653143 3661480 3553661 3437998 3367128 3243087
10755 3243087 3547134 3691589 3498693 3345491 3483637 3659672 3592072 3340868 3345030 3410993
10745 3410993 3230542 3059628 3080611 3182995 3001269 3107879 2752333 2736872 2878919 2921590
10735 2921590 2957347 2924045 2847386 2951564 3121154 3119496 3222028 3168396 3106121 3031857 3109237
10724 3109237 3253474 3112640 3260363 3005838 3134360 3029152 2992817 2935189 2885272 3052705
10714 3052705 2888974 2990336 3130784 3296890 3140419 3172059 3306405 3202785 2998837 3146538
$$ packed form
10786E015153j29384j53587K1137L7691K2606k65844j54642q2199J35954n8669
10776D388216l33110J68534k58480j4299j47654o3631K29857j51428n2982j2209
10766C752814j01245q1468p1668Q0116M4202L0392Q337j07819j15663p0870j24041
10755C243087L04047J44455j92896j53202J38146J76035o7600k51204M162O5963
10745C410993j80451j70914K0983J02384j81726J06610l55546j5461J42047M2671
10735B921590L5757l3302p6659J04178J69590j658J02532n3632o2275p4264P7380
10724C109237J44237j40834J47723k54525J28522j05208l6335n7628m9917J67433
10714C052705j63731J01362J40448J66106j56471L1640J34346j03620k03948J47701
$$ plain form
10704 3146538 3145231 3017938 3034411 3057508 2930872 3235874 2725907 2924802 2918560 2798714
10694 2798714 2766551 3136406 2951195 2887457 3053697 2753785 2967070 2904039 2918530 3028229
10684 3028229 2893365 2656066 2867611 2723494 2798131 2710767 2848994 2769656 2783975 2902420
10674 2902420 3046491 2892406 2931144 2917811 2858841 2980278 2674256 2623763 2485309 2539437
10664 2539437 2427559 2339284 2506170 2573743 2537728 2444272 2394112 2361545 2462868 2266662
10654 2266662 2321631 2302293 2401687 2449796 2485705 2642415 2616270 2521434 2427030 2333150 2206496
10643 2206496 2164384 2318028 2240206 1985142 1892489 1961593 1893047 1883012 1936923 2081910 2133199
10632 2133199 1947646 1831859 1927990 2047616 1690360 2049913 1898521 1754602 1826957 1923228
$$ packed form
10704C146538j307j27293J6473K3097j26636L05002n09967J98895o242j19846
10694B798714l2163L69855j85211o3738J66240k99912K13285o3031J4491J09699
10684C028229j34864k37299K11545j44117P4637q7364J38227p9338J4319J18445
10674B902420J44071j54085L8738j3333n8970J21437l06022n0493j38454N4128
10664B539437j11878q8275J66886O7573l6015r3456n0160l2567J01323j96206
10654B266662N4969j9338R9394M8109L5909J56710k6145r4836r4404r3880j26654
10643B206496m2112J53644p7822k55064r2653O9104o8546j0035N3911J44987N1289
10632B133199j85553j15787R6131J19626l57256L59553j51392j43919P2355R6271
$$ plain form
10622 1923228 1790715 1843722 1932958 1873761 1621061 1805925 1844881 1889710 1937258 1706398
10612 1706398 1874622 1948748 2067277 1960439 1819764 1760649 1845019 1580305 1914160 1933874
10602 1933874 1881849 1701769 1988234 1773861 1949840 1863004 1699104 1747491 1841473 1528925
10592 1528925 1664811 1908444 1674898 1896632 1555630 1675638 1657510 1834016 2071273 2020536
10582 2020536 2006730 1734681 1803663 1951491 1775491 1868755 1904961 1959441 1860505 1620698
10572 1620698 1915363 1579466 1862307 1802057 1728102 1535857 1720449 1676337 1449363 1714354
10562 1714354 1520533 1611842 1553010 1597015 1512724 1524441 1607808 1467629 1657587 1299565
10552 1299565 1526692 1423352 1570089 1559856 1526315 1564860 1493401 1454737 1393609 1158971
$$ packed form
10622A923228j32513N3007Q9236n9197k52700J84864L8956M4829M7548k30860
10612A706398J68224P4126J18529j06838j40675n9115Q4370k64714L33855J9714
10602A933874n2025j80080K86465k14373J75979q6836j63900M8387R3982l12548
10592A528925J35886K43633k33546K21734l41002J20008j8128J76506K37257n0737
10582B020536j3806k72049O8982J47828j76000R3264L6206N4480r8936k39807
10572A620698K94665l35897K82841o0250p3955j92245J84592m4112k26974K64991
10562A714354j93821R1309n8832M4005q4291J1717Q3367j40179J89958l58022
10552A299565K27127j03340J46737j0233l3541L8545p1459l8664o1128k34638
$$ plain form
10542 1158971 1273346 1395159 1358509 1561979 1562229 1571525 1333878 1603816 1543367 1431461 1675462
10531 1675462 1386603 1560639 1632047 1531494 1739639 1422907 1658919 1698412 1563543 1788030
10521 1788030 1818301 2095914 2249024 2386560 2675818 2727229 2618104 2675648 2473854 2166290
10511 2166290 2291525 2045579 2191515 1870449 2022545 1927760 1877992 1827245 1668071 1781120
10501 1781120 1944612 1787937 1906051 1754267 1870421 1857839 1903145 1950446 2255115 2264347
10491 2264347 2348347 2472228 2618043 2745939 2677435 2817764 2451676 2663857 2333475 2266299
10481 2266299 2231943 2151029 2096104 1944812 2106372 2156700 2037128 2023363 2072934 2090636 2201866
10470 2201866 2410304 2197066 2236602 2484830 2329238 2283493 2728730 2687743 2782183 2670316
$$ packed form
10542A158971J14375J21813l6650K03470K50R296k37647K69938o0449j11906K44001
10531A675462k88859J74036P1408j00553K08145l16732K36012L9493j34869K24487
10521A788030L0271K77613J53110J37536K89258N1411j09125N7544k01794l07564
10511B166290J25235k45946J45936l21066J52096r4785m9768n0747j59174J13049
10501A781120J63492j56675J18114j51784J16154j2582M5306M7301L04669R232
10491B264347Q4000J23881J45815J27896o8504J40329l66088K12181l30382o7176
10481B266299l4356q0914n4925j51292J61560N0328j19572j3765M9571J7702J11230
10470B201866K08438k13238L9536K48228j55592m5745M45237m0987R4440j11867
$$ plain form
10460 2670316 2758245 2666075 2480405 2639089 2402248 2657239 2406721 2634045 2648320 2840723
10450 2840723 2638215 2757338 2949462 2865207 2628624 2914124 2787178 2432570 2849083 2741439
10440 2741439 2742483 2987720 3261184 3576412 3591699 3680196 3552324 3699873 3318721 3361734
10430 3361734 2930801 2769122 2645678 2560949 2449522 2318976 2054595 2287788 2393826 2248561
10420 2248561 2246810 2142605 2067054 2169139 2303114 2135894 2400683 2461702 2367373 2698568
10410 2698568 2984954 3262407 3357183 3591798 4069665 4126950 4022971 4119440 4143625 4176844
10400 4176844 4023824 4170245 4292286 4456461 4570746 4768091 5084172 5328541 5407553 5565571
10390 5565571 5839650 5877580 6202589 6395409 6358825 6589694 6315274 6518881 6296952 6199792
$$ packed form
10460B670316Q7929r2170j85670J58684k36841K54991k50518K27324J4275J92403
10450B840723k02508J19123J92124q4255k36583K85500j26946l54608M16513j07644
10440B741439J044K45237K73464L15228J5287Q8497j27872J47549l81152M3013
10430C361734m30933j61679j23444q4729j11427j30546k64381K33193J06038j45265
10420B248561j751j04205p5551J02085J33975j67220K64789O1019r4329L31195
10410B698568K86386K77453R4776K34615M77867N7285j03979R6469K4185L3219
10400D176844j53020J46421J22041J64175J14285J97345L16081K44369P9012J58018
10390E565571K74079L7930L25009J92820l6584K30869k74420K03607k21929r7160
$$ plain form
10380 6199792 6122371 6223327 6062277 5954629 5976381 5833811 5971998 5892056 6240613 5868729
10370 5868729 6025843 6159276 6403319 6239792 6433705 6311252 6376150 6275556 6088484 5971278
10360 5971278 6008912 5854311 5682663 5616528 5704115 5772500 5765681 5692732 5567584 4995845 5111800
10349 5111800 4956222 4971844 4746795 4642384 4569750 4530389 4261538 4355569 4516525 4353717
10339 4353717 4696675 4537978 4548427 4609769 4611800 4753300 4684530 4881268 4673606 4427543
10329 4427543 4483531 4469555 4455664 4393238 4180049 4405647 4548843 4409210 4536322 4383567
10319 4383567 4494505 4360198 4307946 4713872 4598063 4656841 4458728 4735135 4860065 4924420
$$ packed form
10380F199792p7421J00956j61050j07648K1752j42570J38187p9942L48557l71884
10370E868729J57114J33433K44043j63527J93913j22453O4898j00594j87072j17206
10360E971278L7634j54601j71648o6135Q7587O8385o819p2949j25148n71739J15955
10349E111800j55578J5622k25049j04411p2634l9361k68851R4031J60956j62808
10339D353717L42958j58697J0449O1342K031J41500o8770J96738k07662k46063
10329D427543N5988j3976j3891o2426k13189K25598J43196j39633J27112j52755
10319D383567J10938j34307n2252M05926j15809N8778j98113K76407J24930O4355
$$ [...]
##END NTUPLES=NMR SPECTRUM
##END=
