##TITLE=Coffee green (M5-ROVE40 + 1.5mL buffer 50/50,  450uL extracto + 50uL (D2O+TMS))
without heating, vortex and centrifuged, temperature 0oC.
##JCAMPDX= 6.0         $$ Bruker NMR JCAMP-DX V2.0
##DATA TYPE= NMR SPECTRUM
##DATA CLASS= NTUPLES
##ORIGIN= Bruker BioSpin GmbH
##OWNER= Administrator
$$ 1.72 TOPSPIN		Version 2.1
$$ 2012-05-22 16:13:51.762 -0700  Administrator@X
$$ Compression mode = diff/dup
##.OBSERVE FREQUENCY= 400.13188202
##.OBSERVE NUCLEUS= ^1H
##.ACQUISITION MODE= SIMULTANEOUS (DQD)
##.ACQUISITION SCHEME= undefined
##.AVERAGES= 64
##.DIGITISER RES= 22
##SPECTROMETER/DATA SYSTEM= spect
##.PULSE SEQUENCE= noesygppr1d
##.SOLVENT NAME= H2O+D2O
##.SHIFT REFERENCE= INTERNAL, H2O+D2O, 1, 14.97979
##AUDIT TRAIL= $$ (NUMBER, WHEN, WHO, WHERE, PROCESS, VERSION, WHAT)
$$ ##TITLE= Audit trail, TOPSPIN		Version 2.1
$$ ##JCAMPDX= 5.01
$$ ##ORIGIN= Bruker BioSpin GmbH
$$ ##OWNER= Administrator
$$ $$ c:\Bruker\TOPSPIN/data/jwist/nmr/11-coffee-green-quantification-2/181/pdata/1/auditp.txt
$$ ##AUDIT TRAIL=  $$ (NUMBER, WHEN, WHO, WHERE, PROCESS, VERSION, WHAT)
(   1,<2011-11-17 18:12:14.029 -0500>,<Administrator>,<TOPSPIN>,<go>,<TOPSPIN 2.1>,
      <created by zg
	started at 2011-11-17 18:03:19.482 -0500,
	POWCHK enabled, PULCHK disabled,
       configuration hash MD5:
       DA 63 81 1B EF 4C B5 72 B4 DF EA D9 B4 DB 4C 08
       data hash MD5: 64K
       A0 B4 23 C5 DA 50 EC 1A 35 E9 FE B5 75 F7 98 E7>)
(   2,<2011-11-17 18:40:31.779 -0500>,<Administrator>,<TOPSPIN>,<proc1d>,<TOPSPIN 2.1>,
      <Start of raw data processing
       efp LB = 0 FT_mod = 6 PKNL = 1 PHC0 = 0 PHC1 = 0 SI = 32K 
       data hash MD5: 32K
       0A 29 3A DF C2 99 67 5B 74 B0 52 19 38 81 5A A7>)
(   3,<2011-11-17 18:40:32.154 -0500>,<Administrator>,<TOPSPIN>,<proc1d>,<TOPSPIN 2.1>,
      <pk PHC0 = 20.37964 PHC1 = 0 
       data hash MD5: 32K
       4A 39 33 CA FA E2 10 31 0E 15 4F 8B B8 92 EC A2>)
$$ ##END=
$$ 
$$ $$ hash MD5
$$ $$ F3 9B 3D 53 FF 2A DA A5 61 C3 5E 06 5F AB 94 4F
##$RELAX= 
##$RELAX= 
##$RELAX= 
##$RELAX= 
##$RELAX= 
$$ Bruker specific parameters
$$ --------------------------
##$DU= <Z:>
##$EXPNO= 181
##$NAME= <11-coffee-green-quantification-2>
##$PROCNO= 1
##$TYPE= <nmr>
##$USER= <jwist>
##$ACQT0= -8.17640701383314
##$AMP= (0..31)
100 100 100 100 100 100 100 100 100 100 100 100 100 100 100 100 100 100
100 100 100 100 100 100 100 100 100 100 100 100 100 100
##$ANAVPT= -1
##$AQSEQ= 0
##$AQ_mod= 3
##$AUNM= <au_prof>
##$AUTOPOS= <>
##$BF1= 400.13
##$BF2= 400.13
##$BF3= 400.13
##$BF4= 400.13
##$BF5= 400.13
##$BF6= 400.13
##$BF7= 400.13
##$BF8= 400.13
##$BYTORDA= 0
##$CFDGTYP= 0
##$CFRGTYP= 9
##$CHEMSTR= <none>
##$CNST= (0..63)
1 1 145 1 1 1 1 1 1 1 1 1 1 1 1 1 1 1 1 1 1 1 1 1 1 1 1 1 1 1 1 1 1 1 1
1 1 1 1 1 1 1 1 1 1 1 1 1 1 1 1 1 1 1 1 1 1 1 1 1 1 1 1 1
##$CPDPRG= <>
##$CPDPRG1= <>
##$CPDPRG2= <>
##$CPDPRG3= <>
##$CPDPRG4= <mlev>
##$CPDPRG5= <mlev>
##$CPDPRG6= <mlev>
##$CPDPRG7= <mlev>
##$CPDPRG8= <mlev>
##$CPDPRGB= <>
##$CPDPRGT= <>
##$D= (0..63)
$$ [...]
##$TP= (0..7)
150 150 150 150 150 150 150 150
##$TP07= 0
##$TPNAME0= <>
##$TPNAME1= <>
##$TPNAME2= <>
##$TPNAME3= <>
##$TPNAME4= <>
##$TPNAME5= <>
##$TPNAME6= <>
##$TPNAME7= <>
##$TPOAL= (0..7)
0.5 0.5 0.5 0.5 0.5 0.5 0.5 0.5
##$TPOFFS= (0..7)
0 0 0 0 0 0 0 0
##$TUNHIN= 0
##$TUNHOUT= 0
##$TUNXOUT= 0
##$USERA1= <user>
##$USERA2= <user>
##$USERA3= <user>
##$USERA4= <user>
##$USERA5= <user>
##$V9= 5
##$VALIST= <valist>
##$VCLIST= <CCCCCCCCCCCCCCC>
##$VD= 0
##$VDLIST= <DDDDDDDDDDDDDDD>
##$VPLIST= <PPPPPPPPPPPPPPP>
##$VTLIST= <TTTTTTTTTTTTTTT>
##$WBST= 2048
##$WBSW= 25
##$XGAIN= (0..3)
0 0 0 0
##$XL= 0
##$YL= 0
##$YMAX_a= 5306941
##$YMIN_a= -2080076
##$ZGOPTNS= <>
##$ZL1= 120
##$ZL2= 120
##$ZL3= 120
##$ZL4= 120
##$ABSF1= 0
##$ABSF2= 0
##$ABSG= 0
##$ABSL= 0
##$ALPHA= 0
##$AQORDER= 0
##$ASSFAC= 0
##$ASSFACI= 0
##$ASSFACX= 0
##$ASSWID= 0
##$AUNMP= <proc_prof1d>
##$AXLEFT= 0
##$AXNAME= <>
##$AXNUC= <1H>
##$AXRIGHT= 0
##$AXTYPE= 0
##$AXUNIT= <>
##$AZFE= 0.1
##$AZFW= 0.1
##$BCFW= 0
##$BC_mod= 0
##$BYTORDP= 0
##$COROFFS= 0
##$CY= 15
##$DATMOD= 1
##$DC= 0
##$DFILT= <>
##$DTYPP= 0
##$F1P= 0
##$F2P= 0
##$FCOR= 0.5
##$FTSIZE= 32768
##$FT_mod= 6
##$GAMMA= 0
##$GB= 0
##$INTBC= 1
##$INTSCL= 1
##$ISEN= 128
##$LB= 0
##$LEV0= 0
##$LPBIN= 0
##$MAXI= 10000
##$MC2= 0
##$MEAN= 0
##$ME_mod= 0
##$MI= 0
##$NCOEF= 0
##$NC_proc= -6
##$NLEV= 6
##$NOISF1= 0
##$NOISF2= 0
##$NSP= 0
##$NTH_PI= 0
##$NZP= 0
##$OFFSET= 14.97979
##$PC= 1
##$PHC0= 20.37964
##$PHC1= 0
##$PH_mod= 1
##$PKNL= yes
##$PPARMOD= 0
##$PPDIAG= 0
##$PPIPTYP= 0
##$PPMPNUM= 2147483647
##$PPRESOL= 1
##$PSCAL= 4
##$PSIGN= 0
##$PYNMP= <proc.py>
##$REVERSE= no
##$SF= 400.13
##$SI= 32768
##$SIGF1= 0
##$SIGF2= 0
##$SINO= 400
##$SIOLD= 32768
##$SPECTYP= <>
##$SREGLST= <1H.CDCl3>
##$SSB= 0
##$STSI= 32768
##$STSR= 0
##$SW_p= 8223.68421052629
##$SYMM= 0
##$S_DEV= 0
##$TDeff= 65536
##$TDoff= 0
##$TI= <>
##$TILT= no
##$TM1= 0
##$TM2= 0
##$TOPLEV= 0
##$USERP1= <user>
##$USERP2= <user>
##$USERP3= <user>
##$USERP4= <user>
##$USERP5= <user>
##$WDW= 1
##$XDIM= 32768
##$YMAX_p= 322634825
##$YMIN_p= -56551809
##$CURPLOT= <Network HP LaserJet P1505>
##$CURPRIN= <$Network HP LaserJet P1505>
##$DFORMAT= <normdp>
##$LAYOUT= <+/1D_H.xwp>
##$LFORMAT= <normlp>
##$PFORMAT= <normpl>
##$SURQMSG= 1
$$ End of Bruker specific parameters
$$ ---------------------------------
##NTUPLES= NMR SPECTRUM
##VAR_NAME=  FREQUENCY,     SPECTRUM/REAL,   SPECTRUM/IMAG
##SYMBOL=    X,             R,               I
##VAR_TYPE=  INDEPENDENT,   DEPENDENT,       DEPENDENT
##VAR_FORM=  AFFN,          ASDF,            ASDF
##VAR_DIM=   32768,         32768,           32768
##UNITS=     HZ,            ARBITRARY UNITS, ARBITRARY UNITS
##FACTOR=    0.250966925370065, 1,           1
##FIRST=     8223.43324360092, 44217,        -299225
##LAST=      0,             59356,           -126023
##MIN=       0,             -56551809,       0
##MAX=       8223.43324360092, 322634825,    0
$$ Real data points
##PAGE= N=1
##DATA TABLE= (X++(R..R)), XYDATA
$$ [...]
19674B107583L8546j91787L1306J89262j99337M435N4312L2986j3467j27577j06383
$$ 2107583 2146129 1954342 1985648 2174910 1975573 1980008 2034320 2067306 2053839 1926262 1819879
19663A819879K05697j60501L39900k05974J85193j09864K7391l5528k01246J33007
$$ 1819879 2025576 1865075 2204975 1999001 2184194 2074330 2101721 2066193 1864947 1997954
19653A997954j46578O3707L5972r3014J37410j5373q9733L58044m06486J19004
$$ 1997954 1851376 1915083 1951055 1858041 1995451 1980078 1890345 2248389 1841903 1960907
19643A960907M0263O913j12718j08868K34078p407j53215J32853l7389N716O9230
$$ 1960907 2001170 2008083 1895365 1786497 2020575 2013168 1859953 1992806 1955417 1961133 2030363
19632B030363N3567j01649l7063j54071R7704Q6713J30437k84061l0276M7957
$$ 2030363 2083930 1982281 1945218 1791147 1888851 1975564 2106001 1821940 1791664 1839621
19622A839621Q2871j59594m6070K42343n58m4054n3186r0900J96205j06945k73012
$$ 1839621 1922492 1762898 1716828 1959171 1958613 1914559 1861373 1770473 1966678 1859733 1586721
19611A586721Q4833K08947P5515j99078P1138j57586K53343j77437Q8392l91598
$$ 1586721 1671554 1880501 1956016 1756938 1828076 1670490 1923833 1746396 1834788 1443190
19601A443190J54069K27472L9485J6293k34033O4487r3409O2579J7202J02467
$$ 1443190 1597259 1824731 1864216 1880509 1646476 1710963 1617554 1680133 1697335 1799802
19591A799802m6657J20321l96153K54777J26609M0094l47391J22206p887J34467
$$ 1799802 1753145 1873466 1477313 1732090 1858699 1898793 1551402 1673608 1665721 1800188
19581A800188j23339r9812L40374j28651l8772q7380N9492k48004J7157K26394
$$ 1800188 1676849 1577037 1917411 1788760 1749988 1662608 1722100 1474096 1491253 1717647
19571A717647j57380o8211K53002j56068j91720J14401m297J16098n6551Q8599
$$ 1717647 1560267 1492056 1745058 1588990 1397270 1511671 1507374 1623472 1566921 1655520
19561A655520K10623k93362K10178j03785J50038k17568P3864K2028n9229l01454
$$ 1655520 1866143 1572781 1782959 1679174 1829212 1611644 1685508 1707536 1648307 1346853
19551A346853J41846J61504j67002p3429K30851k45706O2461M4719j96668M6970
$$ 1346853 1488699 1650203 1483201 1409772 1640623 1394917 1457378 1502097 1305429 1352399
19541A352399O6425J71723k14577M408q4427J80032L5156n8079m5979K84901k89404
$$ 1352399 1418824 1590547 1375970 1380378 1295951 1475983 1511139 1453060 1407081 1691982 1402578
19530A402578J40395p8929k59998J58453l617P2635Q4336m0222o6052N4197R2306
$$ 1402578 1542973 1464044 1204046 1362499 1358882 1431517 1515853 1475631 1409579 1463776 1556082
19519A556082p1387j4145J74087j99617k5748p7235J35154K4602J19304k96287
$$ 1556082 1484695 1470550 1644637 1445020 1419272 1342037 1477191 1501793 1621097 1324810
19509A324810K22485l4663q6666j7076j273o1100R0628m199J2938n4012J14033
$$ 1324810 1547295 1512632 1425966 1408890 1407617 1346517 1437145 1432946 1445884 1391872 1505905
19498A505905j37162P1496o1651j6473L4116n3942M0431j02426r6612L75086k93978
$$ 1505905 1368743 1440239 1378588 1362115 1396231 1342289 1382720 1280294 1183682 1558768 1264790
19487A264790J17359j46011J68514k279k55542L80O8045P7810K65920m09275M9545
$$ 1264790 1382149 1236138 1404652 1402373 1146831 1147211 1215256 1293066 1558986 1149711 1199256
19476A199256J29526n183K12635l47623L8826p8173j22847J86372j09337J4047
$$ 1199256 1328782 1323599 1536234 1188611 1227437 1149264 1026417 1212789 1103452 1117499
19466A117499l099J3793J8572N8572O8301j87533K21356k35522J2912O8781j64087
$$ 1117499 1114400 1128193 1146765 1205337 1273638 1086105 1307461 1071939 1084851 1153632 989545
19455I89545L1620K79015j79437M7108J14038k52373j00286J45320j84629Q0971
$$ 989545 1021165 1300180 1120743 1167851 1281889 1029516 929230 1074550 889921 970892
19445I70892j037J04733j00607j94811J53705K01811j23618j04740J72148j82644
$$ 970892 969855 1074588 973981 779170 932875 1134686 1011068 906328 1078476 895832
19435H95832J15160j25150P793O0279J23869m7997j66396j27994J39128J74388
$$ 895832 1010992 885842 893635 953914 1077783 1029786 863390 735396 874524 1048912
19425A048912j48613L9839j72869L80008m32044K3854m7612L19886j42449K5935
$$ 1048912 900299 940138 767269 1147277 715233 739087 691475 1011361 868912 894847
19415H94847q5051n1304L8691L3619k6108q6482L97920q8077j27445r9270K51845
$$ 894847 809796 758492 797183 830802 804694 718212 1116132 1028055 900610 801340 1053185
19404A053185j12411j23230J73447k01408M7364J31189k35713J75501j49035K37680
$$ 1053185 940774 817544 990991 789583 836947 968136 732423 907924 758889 996569
19394I96569o1612j20229L7076R5602k9209l3143J50041j98910L601J88543o3008
$$ 996569 934957 814728 851804 947406 918197 885054 1035095 836185 839786 1028329 965321
19383I65321J2331j50898O2012J42998l76714J67068J23469r7868K2599p470J5168
$$ 965321 977652 826754 888766 1031764 655050 822118 945587 847719 870318 862848 878016
19372H78016J62610m78080M16203l21457L15985k81689k0493K77785m3172k59404
$$ 878016 1040626 562546 978749 657292 973277 691588 671095 948880 905708 646304
19362F46304L50772N3764K5304r6823j57901m2360N9938j11097P1497J41992j67558
$$ 646304 997076 1050840 1076144 979321 821420 779060 838998 727901 799398 941390 773832
19351G73832K20899l38790J99396K74415l46263J31839k724m340j44820J42319
$$ 773832 994731 655941 855337 1129752 783489 915328 912604 908264 763444 905763
19341I05763p4835k7002j64729K30624l62891M11620j37094L0658k22N4477k23067
$$ 905763 830928 803926 639197 869821 506930 918550 781456 812114 811892 866369 643302
19330F43302J27454k6574J18709m0869J13044j90132J2016J81944o8440q2652
$$ 643302 770756 744182 862891 822022 935066 744934 756950 938894 870454 787802
19320G87802m946J02664K58765l14136J11862o4263K2781j22317N5452Q222P6345
$$ 787802 782856 885520 1144285 830149 942011 877748 900529 778212 833664 841886 918231
19309I18231K66415m86624K02881J83635n02650L91721o4646J02321j64548L31033
$$ 918231 1184646 698022 900903 1084538 581888 973609 908963 1011284 846736 1177769
19299A177769l82984J92004j74768K44440k88541J05541J54430N501k84065J73648
$$ 1177769 794785 986789 812021 1056461 767920 873461 1027891 1033392 749327 922975
19289I22975o8740k0384J99270j36162l0010K11799j33959L2428j82446P0526
$$ 922975 854235 833851 1033121 896959 866949 1078748 944789 977217 794771 865297
19279H65297R9032P1012k74408k5322L02074p9795j38395J84824K5684m11816
$$ 865297 964329 1035341 760933 735611 1037685 957890 819495 1004319 1030003 618187
19269F18187j5997J65928K05327k99377K23099j72068K08364L8437m18984M00674
$$ 618187 602190 768118 973445 674068 897167 725099 933463 971900 552916 953590
19259I53590p4962p5715J15109r9151J58152l22800Q991O0867Q9591r855M1636
$$ 953590 878628 802913 918022 818871 977023 654223 663214 724081 813672 803817 845453
19248H45453K64588n22579J63140N647p5889p7324M29159J26107J57141l7623
$$ 845453 1110041 587462 750602 756249 680360 603036 1032195 1158302 1315443 1277820
19238A277820j07638Q2173L87737l12925R0355j16269j82219J75738j36992l58595
$$ 1277820 1170182 1252355 1640092 1327167 1417522 1301253 1119034 1294772 1157780 799185
19228G99185r6758J83194j48111p555J09595N0350j011J03664l76200K30113m7338
$$ 799185 702427 885621 737510 729955 839550 889900 888889 992553 616353 846466 799128
19217G99128K11113k86558J66052k72159Q5055j21333K99580j48569J17439J8009
$$ 799128 1010241 723683 889735 617576 702631 581298 880878 732309 849748 867757
19207H67757l77914J68292j3572K20866j09776o5841K36388k35133K0752J8224
$$ 867757 489843 658135 644563 865429 755653 689812 926200 691067 711819 730043
19197G30043J59057j57968M0396j44560O0701j49752J16470o6576J33379k2745
$$ 730043 889100 731132 771528 626968 687669 537917 654387 587811 721190 698445
19187F98445J00943m9819l134k22529K41320n2179j46495L7600K74658j66008
$$ 698445 799388 749569 746435 523906 765226 713047 566552 604152 878810 712802
19177G12802M0245J63511l47066K03306K39700k34628j02867N8884j10146K16121
$$ 712802 753047 916558 569492 772798 1012498 777870 675003 733887 623741 839862
19167H39862j35243R8909L5226J93903j02510j64706j12216K59164q0238O8986
$$ 839862 704619 803528 838754 1032657 930147 765441 653225 912389 832151 901137
19157I01137r5495K11523m1247P2352j9115J45320K8958Q8806O0860Q7044l47900
$$ 901137 805642 1017165 975918 1048270 1029155 1174475 1203433 1292239 1353099 1440143 1092243
19146A092243N35105k61243j70090K8836k96270K56045M8496k92680J44588Q520
$$ 1092243 1627348 1366105 1196015 1224851 928581 1184626 1233122 940442 1085030 1093550
19136A093550K40565k95388J28516K2477J03914J5374k60535n0123m8024l3903
$$ 1093550 1334115 1038727 1167243 1189720 1293634 1309008 1048473 998350 950326 916423
19126I16423L36649k44268K35748j84620r9488j8607k8295j67837K85877J63231
$$ 916423 1253072 1008804 1244552 1059932 960444 941837 913542 745705 1031582 1194813
19116A194813n3443m7966r1984K62464k91669K12203m9011R2568k30384J73355
$$ 1194813 1141370 1093404 1001420 1263884 972215 1184418 1135407 1227975 997591 1170946
19106A170946l39478M42937j92319J45377J58176r8839o8055n7071M9705Q3602
$$ 1170946 831468 1274405 1082086 1227463 1385639 1286800 1218745 1161674 1211379 1294981
19096A294981q570j18704R9544K35605j86447M07261j70871L35347k36694J85514
$$ 1294981 1286411 1167707 1267251 1502856 1316409 1723670 1552799 1888146 1651452 1836966
19086A836966K18528N25009M99114J65720O11209P3184L70849o8539M39234q3260
$$ 1836966 2055494 2580503 3079617 3245337 3856546 3929730 4300579 4232040 4671274 4588014
19076D588014O7961j85443n16288j69716l21158m70578m73758m32224J82645n5402
$$ 4588014 4655975 4470532 3954244 3784528 3463370 2992792 2519034 2086810 2269455 2214053
19066B214053j07952j30463n9544K0337J39622K00739L86114K71442L47408K31974
$$ 2214053 2106101 1975638 1916094 1936431 2076053 2276792 2662906 2934348 3281756 3513730
19056C513730J48992P8700K62243l3297q6392q9814q169o54601j93260j70357
$$ 3513730 3662722 3741422 4003665 3970368 3883976 3794162 3785993 3131392 2938132 2767775
19046B767775n4993L7230N30465m1723M02517N81659L36269J46243Q4193J37870
$$ 2767775 2712782 2750012 3280477 3238754 3641271 4222930 4559199 4705442 4789635 4927505
19036D927505J21631Q1553l21853l38073m89364m73935n74695l08267o2933j09933
$$ 4927505 5049136 5130689 4808836 4470763 3981399 3507464 2932769 2624502 2561569 2451636
19026B451636k72149M8148N5316j77873K12460L99140K94736K79179M23975L52103
$$ 2451636 2179487 2227635 2282951 2105078 2317538 2716678 3011414 3290593 3714568 4066671
19016D066671p9780K97954K84376j95828k3905j30953n07376j74876o73369k10086
$$ 4066671 3986891 4284845 4569221 4373393 4349488 4218535 3711159 3536283 2862914 2652828
19006B652828l05766j45535m30635K08573R78o5210J34383Q9051K43602L90010
$$ 2652828 2347062 2201527 1770892 1979465 1980443 1915233 2049616 2138667 2382269 2772279
18996B772279K56207K64561N22335J81519J94412l7505L49650R8208k20886m2545
$$ 2772279 3028486 3293047 3815382 3996901 4191313 4153808 4503458 4601666 4380780 4338235
18986D338235j77746l66901K91562j31433j26830M41008K68373O78289P87627
$$ 4338235 4160489 3793588 4085150 3953717 3826887 4267895 4536268 5214557 6002184
18977F002184N71495Q85610Q91804P36453J178638J072799J739074J632862J478966
$$ 6002184 6573679 7459289 8351093 9087546 10266184 11338983 13078057 14710919 16189885
18968A6189885J131277R85278Q95908L51348J33376p7496m83375j197415j705929
$$ 16189885 17321162 18306440 19202348 19553696 19687072 19609576 19126201 17928786 16222857
18959A6222857j564144j876770k036680j547361j465295j164384q69951p15997
$$ 16222857 14658713 12781943 10745263 9197902 7732607 6568223 5698272 4982275
18951D982275p82412l54735j74704o36117l0822m05272k84391K00972m14753k57566
$$ 4982275 4199863 3845128 3670424 3034307 3003485 2598213 2313822 2514794 2100041 1842475
18941A842475n7359K83729j28346m5266j88724K8486j8113M8547j1258J94114
$$ 1842475 1785116 2068845 1940499 1895233 1706509 1734995 1716882 1765429 1754171 1948285
18931A948285J8782l49858K68408j87877Q3808K0274K16078J41096l37470M75911
$$ 1948285 1967067 1617209 1885617 1697740 1781548 1801822 2017900 2158996 1821526 2297437
18921B297437m07072J62038K40373J06884M09986R7720K13906J90233P48020K71065
$$ 2297437 1890365 2052403 2292776 2399660 2809646 2907366 3121272 3311505 4059525 4330590
18911D330590Q47059N78649J251480J424599J453236J558773J895556J495490
$$ 4330590 5177649 5756298 7007778 8432377 9885613 11444386 13339942 14835432
18903A4835432J081523R67253P81703K02385j98742r79927q89550j690730j654310
$$ 14835432 15916955 16884208 17665911 17868296 17669554 16689627 15800077 14109347 12455037
18894A2455037j868357j758565j204090j379921p29044p90753r17160o04127j77725
$$ 12455037 10586680 8828115 7624025 6244104 5515060 4724307 3807147 3203020 3025295
18885C025295m56730l08898k0421M1843l34044m18924M180m394l60330J46207
$$ 3025295 2568565 2259667 2239246 2281089 1947045 1528121 1532301 1527907 1167577 1313784
18875A313784Q1098j58975o6596r0552R634J66395k14377m5037q0282J00797K9156
$$ 1313784 1394882 1235907 1169311 1078759 1088393 1254788 1040411 995374 915092 1015889 1045045
18864A045045Q979L523j89017J69894j86510j23361R0790j10455K56224j65657
$$ 1045045 1054024 1057547 868530 1038424 851914 728553 819343 708888 965112 799455
18854G99455q9075o5227J97828o2991Q7254P874k01450K11836j053q8342j36654
$$ 799455 710380 645153 842981 779990 867244 875118 673668 885504 884451 796109 659455
18843F59455K24367j26628J50084p2370k82084O8287J70622j611j64843j23629
$$ 659455 883822 757194 907278 834908 552824 621111 791733 790122 625279 501650
18833E01650K69695p9707k2760p7305J98283k57742p5081R6923J95589k7637P7677
$$ 501650 771345 691638 668878 591573 789856 532114 457033 553956 749545 721908 799585
18822G99585q4140q1431J94179Q4498n2079j48287k3497K4797J44833k90552l6358
$$ 799585 715445 634014 828193 912691 860612 712325 688828 713625 858458 567906 531548
18811E31548K89059p2427j00279J0494O3366Q8555j83923R8649j61073L21976
$$ 531548 820607 748180 647901 658395 721761 810316 626393 725042 563969 885945
18801H85945j87294o9093K26985k59661j2305J27692p1945k9754K43727j56590
$$ 885945 698651 629558 856543 596882 584577 712269 640324 610570 854297 697707
18791F97707J91400r0092r051j08984m4893J58964k11565K49334K6042n8189J90984
$$ 697707 889107 799015 789964 680980 636087 795051 583486 832820 858862 800673 991657
18780I91657j35820l7796O8949J08594l35282L3786O7132j90858M03431k88948
$$ 991657 855837 818041 886990 995584 660302 694088 761220 570362 973793 684845
18770F84845r4338J48027k13603J27371J57082M8114j97391j1679n2669n680L15237
$$ 684845 590507 738534 524931 652302 809384 857498 660107 648428 595759 590079 905316
18759I05316l13658J72047k40218K21400p6906L1602j29538n3743J33716J12642
$$ 905316 591658 763705 523487 744887 667981 699583 570045 516302 650018 762660
18749G62660l8778m8381q3322J45790j84156N6697m2942J38411j34472j1592J24255
$$ 762660 723882 675501 592179 737969 553813 610510 567568 705979 571507 559915 684170
18738F84170r8826K7244J10726J38837p0001K2480k24291k55298L62762O0988
$$ 684170 585344 612588 723314 862151 792150 814630 590339 335041 697803 758791
18728G58791j56061r3022J58174R9276j54861J22503q6723J62541m0313k45929
$$ 758791 602730 509708 667882 767158 612297 734800 648077 810618 770305 524376
18718E24376J02805J09251J57202k09116L8510J14048j45026N5965r3844j4380
$$ 524376 627181 736432 893634 684518 723028 837076 692050 748015 654171 639791
18708F39791J64868o0308p4740j20781J08023J96185k44227P6884l5526N664l0689
$$ 639791 804659 744351 669611 548830 656853 853038 608811 685695 650169 655833 625144
18697F25144r0422O2356J89145k38183L7704n5841K60928j41209j41777J42840
$$ 625144 534722 597078 786223 548040 585744 529903 790831 649622 507845 650685
18687F50685N0701J45358l06848o5623M7663J74247j41231O8829M6739P1819n1528
$$ 650685 701386 846744 539896 474273 521936 696183 554952 623781 670520 742339 690811
18676F90811j41840J27126K4725p8870O1338J67969l89880K1952K10828l7279
$$ 690811 548971 676097 700822 621952 683290 851259 461379 483331 694159 656880
18666F56880M3848l9470P2758j46447M0631j02152j71210K00871O1330n6927J04047
$$ 656880 700728 661258 734016 587569 628200 526048 354838 555709 617039 560112 664159
18655F64159O1113j62892J45498l15495K96386o28j63162k3767N4609m1244J24185
$$ 664159 725272 562380 707878 392383 688769 688141 524979 501212 555821 514577 638762
18644F38762j11088J98013n7721L2927k31450J24570l483R3392M0804m5697J11701
$$ 638762 527674 725687 667966 700893 469443 594013 590530 683922 724726 679029 790730
18633G90730j60053K59983k67677J01229j4958p7766J09459l66708L03873j04531
$$ 790730 630677 890660 622983 724212 709254 631488 740947 374239 678112 573581
18623E73581j50848r5301M22818J17629C73247K25500J73265j66064k8832o8790
$$ 573581 422733 327432 750250 867879 373247 598747 772012 605948 577116 508326
18613E08326O546J68863m0779P2334l01917L45417k14595n0035K04387j36410
$$ 508326 514872 683735 642956 715290 413373 758790 544195 494160 698547 562137
18603E62137P9609j2335K0426J64178p2943j60522K20787j33945J73849j38616
$$ 562137 641746 629411 649837 814015 741072 580550 801337 667392 841241 702625
18593G02625j61593L01221j92346J45529k09085J34423j6502J02705o1463N6623
$$ 702625 541032 842253 649907 795436 586351 720774 704272 806977 745514 802137
18583H02137l33969K04659k5620j540J24431n6053n3903L06257j40626j25713
$$ 802137 468168 672827 647207 645667 770098 714045 660142 966399 825773 700060
18573G00060l4930J24919J21253o1599k14774J21209j94853J17747n3906k61516
$$ 700060 665130 790049 911302 849703 634929 756138 561285 679032 625126 363610
18563C63610K22417k8909J21611k7349J82835k70425N2575r1665K35709C73389
$$ 363610 586027 557118 678729 651380 834215 563790 616365 524700 760409 373389
18552G86129l3806k24949k3753K54950o5632r8407l6832j43446q9947K27535J0034
$$ 786129 752323 527374 503621 758571 692939 594532 557700 414254 324307 551842 561876
18541E61876q3613N9331K68842l76542J92088j05743O961B02411M33696J5168
$$ 561876 478263 537594 806436 429894 621982 516239 523200 202411 636107 651275
18531F51275M5952k32275P7429O1953r7756B46405N51548j69131j22191r349O3196
$$ 651275 697227 464952 542381 604334 506578 246405 797953 628822 506631 497282 560478
18520E60478O575K34309j03551k40848Q867J46890J38612j82671k39776L29126
$$ 560478 567053 801362 697811 456963 465830 612720 751332 568661 328885 658011
18510F58011j84182Q0301m854m5873j0152K6611m1312K2733K8720n1421j84103
$$ 658011 473829 554130 549276 503403 493251 519862 478550 501283 530003 478582 294479
18499B94479L90287j42007J11070k03819K737K60578j73205j07188m0980J69460
$$ 294479 684766 542759 653829 450010 452747 713325 540120 432932 391952 561412
18489E61412R7427l3759B81722L01636r924P47k4927J58295N9821j71391M062
$$ 561412 658839 625080 281722 583358 573434 574181 549254 707549 767370 595979 600041
18478F00041O6413j61107j06417K6686J34246j29234K07150k72770O3883Q7752
$$ 600041 666454 505347 398930 425616 559862 430628 637778 365008 428891 516643
18468E16643B57926J64347J02170m5672L06192j42853N4286j7403l4101o8849
$$ 516643 257926 422273 524443 478771 784963 642110 696396 678993 644892 576043
18458E76043j4841N8542p2146n7173J37170p8157Q3700Q9864P3426k61547j02480
$$ 576043 561202 619744 547598 490425 627595 549438 633138 723002 796428 534881 432401
18447D32401J60163K10817m0558k3477j63291k33978J81176J72213J46140k7608
$$ 432401 592564 803381 762823 739346 576055 342077 523253 695466 841606 813998
18437H13998j49742L2783k33824Q9770J49423l4029L69889E11122J71795q8523
$$ 813998 664256 697039 463215 552985 702408 668379 1038268 511122 682917 594394
18427E94394q3079K80178k12966k5139j21075R1327J28347j23718J37107J36270
$$ 594394 511315 791493 578527 553388 432313 523640 651987 528269 665376 801646
18417H01646k35309N8315k78505M32749l76728K05772O449o3403K09808O9022
$$ 801646 566337 624652 346147 778896 402168 607940 614389 550986 760794 829816
18407H29816j03835j24149K6090J9678m8261j8297j0177j1331J68737j01502o2611
$$ 829816 725981 601832 627922 647600 599339 581042 570865 559534 728271 626769 564158
18396E64158O7460J3189k67337L8144L16021C21547j9545L07288q3177j79741
$$ 564158 631618 644807 377470 415614 731635 321547 302002 609290 526113 346372
18386C46372N4667j46144K09309L6908q2224J12455m686K41817r8627k23503p4120
$$ 346372 401039 254895 464204 501112 418888 531343 526657 768474 669847 446344 372224
18375C72224K05585p6069J0995A73327M53245K20162l32895q8962K50148j64363
$$ 372224 577809 501740 512735 173327 626572 846734 513839 424877 675025 510662
18365E10662Q836j66285L13375k20912K04738j71084m1818Q9486N3112J54907
$$ 510662 519498 353213 666588 445676 650414 479330 437512 526998 580110 735017
18355G35017k70037j6487N6207j38923K08740q3167K26010p7984l12175L06332
$$ 735017 464980 448493 504700 365777 574517 491350 717360 639376 327201 633533
18345F33533j33754J76094O9783O89j44433j40661K4926J9397K4469J7136l5570
$$ 633533 499779 675873 745656 746345 601912 461251 486177 505574 530043 547179 511609
18334E11609K33338k98219J96733n6068R7320j11696L30806k55532J91496k50071
$$ 511609 744947 446728 643461 587393 684713 573017 903823 648291 839787 589716
18324E89716q681r3395L45386j41642p6698k59082K41377j89716L84389C48687
$$ 589716 581035 487640 833026 691384 614686 355604 596981 407265 791654 348687
18313D16891K77571K9022k27782j64541K75937k05645L23095j28546o502o7344
$$ 416891 694462 723484 495702 331161 607098 401453 724548 596002 589500 522156
18303E22156L18279l55511J00553l56K24350j26584J53410l1787j66909j26244
$$ 522156 840435 484924 585477 585121 809471 682887 836297 804510 637601 511357
18293E11357R4167q9331j4742J91461L9479l63782L33756q1998k51728R5054J70692
$$ 511357 605524 516193 501451 692912 732391 368609 702365 620367 368639 463693 634385
18282F34385o9706J00119k05847K25601j97639q8257n5507J37661q6531k9194
$$ 634385 564679 664798 458951 684552 486913 398656 343149 480810 394279 365085
18272C65085K22509j14501J46135j6030n4072N5375j21630N4682R0446k35770
$$ 365085 587594 473093 619228 603198 549126 604501 482871 537553 627999 392229
18262C92229J00693P4787j77252K44365k22618K60654j58592K34934m594j54928
$$ 392229 492922 567709 390457 634822 412204 672858 514266 749200 744606 589678
18252E89678B44268N34346l11594K33289K9800j95220R8406j64964J72070J7874
$$ 589678 244268 778614 467020 700309 730109 534889 633295 468331 640401 658275
18242F58275j17824R4599q0765K26518k07937k06714K39993k8549p0346J07451
$$ 658275 540451 635050 554285 780803 572866 366152 606145 577596 507250 614701
18232F14701k76501K93509o4234J6973r8597J22469n9526q6654K05468k13063
$$ 614701 338200 631709 567475 584448 485851 608320 548794 462140 667608 454545
18222D54545j1189K21137k43416K24884l665J28453j96877J50588j01450l3784
$$ 454545 443356 664493 421077 645961 642296 770749 573872 724460 623010 589226
18212E89226j23056J02693l5894o7862J20118B13860K44234P546l9205L9302L6098
$$ 589226 466170 568863 532969 465107 585225 213860 458094 465640 426435 465737 501835
18201E01835j16175K92100r9818m5846n059K27045j18919R9002j64013o3005J955
$$ 501835 385660 677760 577942 532096 527037 754082 635163 734165 570152 507147 509102
18190E09102J21868j54877K20971o2923n8734J14380j44887j83973K72907Q6588
$$ 509102 630970 476093 697064 634141 575407 689787 544900 360927 633834 720422
18180G20422j08534j84600J9210L7000k2769K33559j84222L8451l9973o0827L3986
$$ 720422 611888 427288 446498 483498 460729 694288 510066 548517 508544 447717 481703
18169D81703j72278Q3110R3867O3645O736J65943C27316J19805J14151N6732B39854
$$ 481703 309425 392535 486402 550047 556783 722726 327316 447121 561272 618004 239854
18157G11426j44333J31785j8799n7174K5642k31567O4916r3683J84063R764l6689
$$ 711426 567093 698878 680079 622905 648547 416980 481896 388213 572276 582040 545351
18146E45351o4836J22244o1191J91563j75115J298L74687l20987j06757R4882
$$ 545351 480515 602759 541568 733131 558016 559314 934001 613014 506257 601139
18136F01139N581B87638J48899J66900J27627j78103k5839n4400J05197j23746
$$ 601139 606720 287638 436537 603437 731064 552961 527122 472722 577919 454173
18126D54173J85521j81836J97362j46194j61090L0129J30178j5099J3380j03139
$$ 454173 639694 457858 655220 509026 347936 378065 508243 493144 506524 403385
18116D03385L49079j76002p8435r7939J82020q9548p3901L09981j48257k20274
$$ 403385 752464 576462 498027 400088 582108 492560 418659 728640 580383 360109
18106C60109J11639Q8585L2949j7802J6431m5803n2658j47292L05014q3871B82382
$$ 360109 471748 560333 593282 575480 591911 546108 493450 346158 651172 567301 282382
18094F32490k96163K49200j43733m0876n006J16860j7542N1491J01497j84631
$$ 632490 336327 585527 441794 400918 395912 512772 495230 546721 648218 463587
18084D63587r5774K01891j09031j7597k9839Q9773j97879K40435J66427j49554
$$ 463587 367813 569704 460673 443076 413237 503010 305131 545566 711993 562439
18074E62439N4528j19461j1854J5982o6410L9426K56580k41136M7522O5584o6699
$$ 562439 616967 497506 485652 501634 435224 474650 731230 490094 537616 603200 536501
18063E36501K2445k66620L54862C18282J14506M5325J46592j45183j16376Q3204
$$ 536501 558946 292326 647188 318282 432788 478113 624705 479522 363146 446350
18053D46350J79416J1242k00978Q4177q7892j23444O5540R2696m0970r7602J78447
$$ 446350 625766 637008 436030 520207 432315 308871 374411 467107 426137 328535 506982
18042E06982q2775P8155M269j47281m1166m7777K8940J86830l0587J87545k19585
$$ 506982 424207 502362 506631 359350 318184 270407 299347 486177 455590 643135 423550
18031D23550m681Q2188O2926J9862n1078q8508j06445J62269L3249n525j00052
$$ 423550 418869 501057 563983 583845 532767 444259 337814 500083 533332 527807 427755
18020D27755J97379j07257n7273L6769Q5402k4826A65952K66203J05976M2566
$$ 427755 625134 517877 460604 497373 582775 557949 165952 432155 538131 580697
18010E80697n041k33725K29312k6639q6448O7914L6177R4110p6333j43151M5974
$$ 580697 575656 341931 571243 544604 458156 526070 562247 656357 580024 436873 482847
17999D82847R9403B61775L69240B60169K09919j6849K73830j54063j91563j1920
$$ 482847 582250 261775 631015 260169 470088 453239 727069 573006 381443 369523
17989C69523R1464q3631J86039j42110N8860O4064M4193j71712j24514L00415
$$ 369523 460987 377356 563395 421285 480145 544209 588402 416690 292176 592591
17979E92591j66186k5386J18054K8473J4885q1129P2818k9858k0999P5070q4247
$$ 592591 426405 401019 519073 547546 562431 481302 554120 524262 503263 578333 494086
17968D94086O4711O1491r9570m2773k972L41251k15296j49432K80992j51580N167
$$ 494086 558797 620288 520718 477945 474973 816224 600928 451496 732488 580908 586075
17957E86075j4870m7533r9951L31283k79685O0807J44804o2251j04966L0531k15670
$$ 586075 571205 523672 423721 755004 475319 536126 680930 618679 513713 544244 328574
17946C28574K26260r9040j4740J48930P5537j47298m8637j08571K50109k07257
$$ 328574 554834 455794 441054 589984 665521 518223 469586 361015 611124 403867
17936D03867J33986q4733N1589j4384K42463o5553l7524o1526O3316C05128L27980
$$ 403867 537853 453120 504709 490325 732788 667235 629711 568185 631501 305128 633108
17925F33108j87634K31265j45232k5353k31199L61015J34373j67799O8550n6944
$$ 633108 445474 676739 531507 506154 274955 635970 770343 602544 671094 614150
17915F14150l1015K09519k29169L44256l95486J35007J58349m4722q994l1587
$$ 614150 583135 792654 563485 907741 512255 647262 805611 760889 751895 720308
17905G20308j97838P7611O4337n4352J78208R4199l67621J72619K052k43685L35552
$$ 720308 522470 600081 664418 610066 788274 882473 514852 687471 689523 445838 781390
17894G81390j17653q177L8284o3144j95313K15985r681O6884M7653L185j28226
$$ 781390 663737 655560 693844 630700 435387 651372 641691 708575 756228 759413 631187
17883F31187J74136j70353j749J75762n1353Q1743j28127J66962n8175k59306
$$ 631187 805323 634970 633221 808983 757630 839373 711246 878208 820033 560727
17873E60727J894J5179J37204r6460r0022J70995p0701P3547j5543j55750J42990
$$ 560727 562621 577800 715004 618544 528522 699517 628816 702363 686820 531070 674060
17862F74060n7768R0282l18289K80590p185l7635K31128k98474o1385J88260j77616
$$ 674060 616292 706574 388285 668875 661690 624055 855183 556709 495324 683584 505968
17851E05968J47520K94256k80706K5648k39368R9042J02911J00392j77880p5444
$$ 505968 653488 947744 667038 692686 453318 552360 655271 755663 577783 502339
17841E02339J64030j26519l3797M9201J25799K10507k1682j12788j68438J69672
$$ 502339 666369 539850 506053 555254 681053 891560 869878 757090 588652 758324
17831G58324j23894k7098J83728k84721r116J05177N7718J6926k15735K06708
$$ 758324 634430 607332 791060 506339 497223 602400 660118 677044 461309 668017
17821F68017O6509Q7051L8071q0596j0562l2389Q0260l2577j53845M02147k46407
$$ 668017 734526 821577 859648 779052 768490 736101 816361 783784 629939 1032086 785679
17810G85679J00066R024r027r5597l5741K02083J29656j99512k88584M26302k27781
$$ 785679 885745 894769 885742 790145 754404 956487 1086143 886631 598047 1024349 796568
17799G96568J74281J97048m12040L314m8337L52774k82265j5154J50247J03985
$$ 796568 970849 1167897 755857 759171 710834 1063608 781343 766189 916436 1020421
17789A020421l87675l1261K68100n4109j42449j18684k3814K84042k08855J17382
$$ 1020421 632746 601485 869585 815476 673027 554343 530529 814571 605716 723098
17779G23098P0085l84753L10205j3498k05488J26710k7298J96768j0857l06677
$$ 723098 793183 408430 718635 705137 499649 626359 599061 795829 784972 478295
17769D78295R8828O1311j7772k50119J74008K04799k6030l31174N8673K16937
$$ 478295 577123 638434 620662 370543 544551 749350 723320 392146 450819 667756
17759F67756j07780l3910J30341q0870R641K8469L16715D51066L11375r3283o8590
$$ 667756 559976 526066 656407 575537 585178 613647 930362 451066 762441 669158 600568
17748F00568K1390K6485j4493J9501j31147P4599p9291M15286j74737l8406K7380
$$ 600568 621958 648443 633950 653451 522304 596903 517612 932898 758161 719755 747135
17737G47135J15174j9055j23224M8126k15228L7962Q0067q914N9578o1882O8813
$$ 747135 862309 843254 720030 768156 552928 590890 670957 662043 721621 659739 728552
17726G28552n5643r7264J22486j5383o3651m9380J62318j7413j27839J5954P4916
$$ 728552 672909 575645 698131 682748 619097 569717 732035 714622 586783 602737 677653
17715F77653j24035R667J77710j73095l9564J93648j25953Q6708k74068J67839
$$ 677653 553618 563285 740995 567900 528336 721984 596031 682739 408671 576510
17705E76510l5859P5698M2874l7772m5979J5556J04975M4180l55102L51714j5226
$$ 576510 540651 616349 659223 621451 575472 591028 696003 740183 385081 736795 721569
17694G21569j74642Q2943J37455C68493K85271k5379J15711j57030o9062J25992
$$ 721569 546927 629870 767325 368493 653764 628385 744096 587066 518004 643996
17684F43996p3116j8075J73011Q1325O1282j54775J64852j097J0427k94956P1235
$$ 643996 570880 552805 725816 807141 868423 713648 878500 877403 887830 592874 664109
17673F64109J84728M1036j04634j93300J88050Q5510k05829J17935M2127k450
$$ 664109 848837 889873 785239 591939 779989 865499 659670 777605 819732 817282
17663H17282j11338J48859j6538j5980J2488r9153N8936N2571M4263k51433J82041
$$ 817282 705944 854803 838265 822285 834773 735620 794556 847127 891390 639957 821998
17652H21998K6739J30848k86983K6830J04152K09197j43254L08798l31313j96422
$$ 821998 848737 979585 692602 719432 823584 1032781 889527 1198325 867012 670590
17642F70590J96549K54992k66458j23816M18052l60777L50443j23572j85666q1391
$$ 670590 867139 1122131 855673 731857 1149909 789132 1139575 1016003 830337 748946
17632G48946K83227j13506p1683J63427j74594J85163R2240l1212j10124m0805
$$ 748946 1032173 918667 846984 1010411 835817 1020980 1113220 1082008 971884 931079
17622I31079J94047J16481j70923M2862j11653J52275n6873R8588J4352J36863
$$ 931079 1125126 1241607 1070684 1113546 1001893 1154168 1097295 1195883 1210235 1347098
17612A347098j64737j82092K69526N06M1074l02494K76841j13329j48904J53223
$$ 1347098 1182361 1000269 1269795 1270301 1311375 1008881 1285722 1172393 1023489 1176712
17602A176712n644j35856K85396r8517J07827k31852K3652J46270l7433J13927
$$ 1176712 1171068 1035212 1320608 1222091 1329918 1098066 1121718 1267988 1230555 1344482
17592A344482k74484R9204K65867j06719q1039J6883k47428K87475k5680k6457
$$ 1344482 1069998 1169202 1435069 1328350 1247311 1264194 1016766 1304241 1278561 1252104
17582A252104n3435J87271j75535J25205l9349J02438j13765j7121q6605J24464
$$ 1252104 1198669 1385940 1210405 1335610 1296261 1398699 1284934 1267813 1181208 1305672
17572A305672m7582m1946O133P0886j37211O3740R5557L7550j75687p7721p9212
$$ 1305672 1258090 1216144 1222277 1293163 1155952 1219692 1315249 1352799 1177112 1099391 1020179
17561A020179L89064p1248j48862Q3368M6787m9760N9427l4965j88977k1943P2837
$$ 1020179 1409243 1337995 1189133 1272501 1319288 1269528 1328955 1293990 1105013 1083070 1155907
17550A155907J94000j66354N7685m96N5393j71916N3356J42552j79204Q3950K62665
$$ 1155907 1349907 1183553 1241238 1240742 1296135 1124219 1177575 1320127 1140923 1224873 1487538
17539A487538k01850J31572j63221n3505K19284N1452O4379j36152j06022J50368
$$ 1487538 1285688 1417260 1254039 1200534 1419818 1471270 1535649 1399497 1293475 1443843
17529A443843j36268j08213L29205j24682O4938k21063J47299J23457j24961K30110
$$ 1443843 1307575 1199362 1528567 1403885 1468823 1247760 1395059 1518516 1393555 1623665
17519A623665l12521K05411m7662j23434O4230r1375L13259J8203K55527m456
$$ 1623665 1311144 1516555 1468893 1345459 1409689 1318314 1631573 1649776 1905303 1900847
17509A900847j27412K09703J97946l4630J66508j01503J3841K5472J82328j64869
$$ 1900847 1773435 1983138 2181084 2146454 2312962 2211459 2225300 2250772 2433100 2268231
17499B268231R1732O0835K27255P055L6755L23655K09305K87474L83417J98133
$$ 2268231 2359963 2420798 2648053 2655108 2691863 3015518 3224823 3512297 3895714 4093847
17489D093847N47358L38123R85250J448490K614900M223042O791099R124814R803102
$$ 4093847 4641205 4979328 5964578 7413068 10027968 14251010 21042109 30166923 39970025
17480C9970025Q847744O448618M308589L385417J756750P5197k052871m136327
$$ 39970025 48817769 55266387 59574976 62960393 64717143 64792340 62739469 58603142
17472E8603142o463200p981575p399410m893951M33803M373504P078272P536890
$$ 58603142 52139942 44158367 36758957 31865006 32298809 36672313 43750585 51287475
17464E1287475N786254M528394K667059J399015j83390k065344m413107o787137
$$ 51287475 57073729 61602123 64269182 65668197 65484807 63419463 59006356 52219219
17456E2219219r210057r817032q874141p057542m645120l250056j626761j737964
$$ 52219219 43009162 33192130 24317989 17260447 12615327 9365271 7738510 6000546
17448F000546r26426p20363m51615j90648J76548j19023J5095m8178k08369O0795
$$ 6000546 5074120 4353757 3902142 3711494 3888042 3769019 3784114 3735936 3527567 3588362
17438C588362R8926l28224k3799k52761J50992k19508l6128R5679k22166l18J46332
$$ 3588362 3687288 3359064 3335265 3082504 3233496 3013988 2977860 3073539 2851373 2851055 2997387
17427B997387J57298L2589m715l44870L84507l14807j81628J57424m21174N7609
$$ 2997387 3154685 3187274 3182559 2837689 3222196 2907389 2725761 2883185 2462011 2519620
17417B519620r1253j18124m4223o3159J47431l33307Q6446p100K4662R0610n1328
$$ 2519620 2428367 2310243 2266020 2202861 2350292 2016985 2103431 2096331 2120993 2211603 2160275
17406B160275M8950j98701J47467L18020n6042K19694J61886J13416J71252j61651
$$ 2160275 2209225 2010524 2157991 2476011 2419969 2639663 2801549 2914965 3086217 2924566
17396B924566L36610j22737K70532L87084J05524K15036L31556M79193L74386
$$ 2924566 3261176 3138439 3408971 3796055 3901579 4116615 4448171 4927364 5301750
17387E301750M80126L14392J08031M61007K99282Q576J72186q5556l19534l44098
$$ 5301750 5781876 6096268 6204299 6665306 6964588 6973164 7145350 7059794 6740260 6396162
17377F396162K3100k33149m3618l27728J16578J55614M916L93505L71834L41861
$$ 6396162 6419262 6186113 6142495 5814767 5931345 6086959 6091875 6485380 6857214 7199075
17367G199075J27325J66197N63592K18217Q0758K36012j91470K09029k42541j76258
$$ 7199075 7326400 7492597 8056189 8274406 8355164 8591176 8399706 8608735 8366194 8189936
17357H189936J23794j23005k46376K31160p2843M49296K88261K47804N72942L42942
$$ 8189936 8313730 8190725 7944349 8175509 8102666 8551962 8840223 9088027 9660969 10003911
17347A0003911P34691M97477O19694L20026Q17493Q4361K12402K62665R51j73205
$$ 10003911 10738602 11236079 11855773 12175799 12993292 13077653 13290055 13552720 13553671 13380466
17337A3380466n9090k96549K0401m83134l36099k44793M5173J01201r7007M23410
$$ 13380466 13321376 13024827 13045228 12562094 12225995 11981202 12026375 12127576 12030569 12453979
17327A2453979K73512J89687M37168M83840M99766K45141M00155J02402M33447
$$ 12453979 12727491 12917178 13354346 13838186 14337952 14583093 14983248 15085650 15519097
17318A5519097k87437l27375J09177j17018k43755m14094j51349l51188m8395
$$ 15519097 15231660 14904285 15013462 14896444 14652689 14238595 14087246 13736058 13687663
17309A3687663m79664l5629J02848J48872K42725k101L49329K20665R6798K23392
$$ 13687663 13207999 13172370 13275218 13424090 13666815 13664714 14014043 14234708 14331506 14554898
17299A4554898K30545O2338r2974p8976j41894k43137k67576p6133k89313J37435
$$ 14554898 14785443 14847781 14754807 14675831 14533937 14290800 14023224 13947091 13657778 13795213
17289A3795213l53781j29873Q8131k78525L78988l95293M5832l58355j08557j99284
$$ 13795213 13441432 13311559 13399690 13121165 13500153 13104860 13150692 12792337 12683780 12484496
17279A2484496p31480o65376l12493p47454q23627m24705n09322n50486m79802
$$ 12484496 11753016 11087640 10775147 10027693 9204066 8779361 8270039 7719553 7239751
17270G239751m26612k89412k68642l01195k45794K1576k47200K19l81560L22384
$$ 7239751 6813139 6523727 6255085 5953890 5708096 5729672 5482472 5482691 5101131 5423515
17260E423515l86063j02543k24261L9786k06601K570j34127Q912J9650n54700
$$ 5423515 5037452 4934909 4710648 4750434 4543833 4546403 4412276 4421188 4440838 3886138
17250C886138L76218l63884m9207K57278k12410p8592j23552j5585P1681l3932
$$ 3886138 4262356 3898472 3849265 4106543 3894133 3815541 3691989 3676404 3748085 3714153
17240C714153o7406P0481j00309q8173N4123k95344k8987k9527k47453L1583j29870
$$ 3714153 3646747 3717228 3616919 3528746 3582869 3287525 3258538 3229011 2981558 3013141 2883271
17229B883271o7615l4362L52568l93223J91852N051l7420Q9544o7531J90869m0818
$$ 2883271 2815656 2781294 3133862 2740639 2932491 2937542 2900122 2989666 2922135 3113004 3072186
17218C072186J38404p1631K24142j37926k36671K32521n7313j3271N048j83438
$$ 3072186 3210590 3138959 3363101 3225175 2988504 3221025 3163712 3150441 3155489 2972051
17208B972051m9533J66065m4945J72908k5789m7499K7446j89921O8037q1882J41106
$$ 2972051 2922518 3088583 3043638 3216546 3190757 3143258 3170704 2980783 3048820 2966938 3108044
17197C108044m03j54820j12083n9840k31988l2925j93402l3204P1291k77668J01602
$$ 3108044 3107641 2952821 2840738 2780898 2548910 2515985 2322583 2289379 2360670 2083002 2184604
17186B184604N6576L870p1781J5694q2891l6547m1736l4412k3517M1835J12195
$$ 2184604 2241180 2245050 2173269 2188963 2106072 2069525 2027789 1993377 1969860 2011695 2123890
17175B123890j15318p410N4924k8531j49291M4304O1381L7353J75114j6083n0802
$$ 2123890 2008572 2001162 2056086 2027555 1878264 1922568 1983949 2021302 2196416 2180333 2129531
17164B129531N1977J561O5708L2631M4678j43899M9532K79415j16511M2311n3767
$$ 2129531 2181508 2183069 2248777 2281408 2326086 2182187 2231719 2511134 2394623 2436934 2383167
17153B383167O3118k8764j16766J57120K27025n8406j25872r2237J09066J77346
$$ 2383167 2446285 2417521 2300755 2457875 2684900 2626494 2500622 2408385 2517451 2694797
17143B694797m90272K53256j2352q4989p7417K11471P5206k40130L07698j87887
$$ 2694797 2204525 2457781 2445429 2360440 2283023 2494494 2569700 2329570 2637268 2449381
17133B449381J66764J27884n72494K50232J10189p7462j75823K32600L4169J08223
$$ 2449381 2616145 2744029 2171535 2421767 2531956 2454494 2278671 2511271 2545440 2653663
17123B653663P1656p2362J14607j89368L35090l64902K61505k07056K35000k42256
$$ 2653663 2725319 2652957 2767564 2578196 2913286 2548384 2809889 2602833 2837833 2595577
17113B595577k44474K04735j44925q9973j07305j82769K72386k34770J15881N3762
$$ 2595577 2351103 2555838 2410913 2320940 2213635 2030866 2303252 2068482 2184363 2238125
17103B238125j2461j68984k4185l0645K85009j17122k57212P6314m00110L68025
$$ 2238125 2225664 2056680 2032495 2001850 2286859 2169737 1912525 1988839 1588729 1956754
17093A956754m07433J75310P758j80313J54875l9133m28538M54373p39172M17942
$$ 1956754 1549321 1724631 1732389 1552076 1706951 1667818 1239280 1693653 954481 1372423
17083A372423k13011J53600p2027m3025J87851l15528K28884l07987L66311k31299
$$ 1372423 1159412 1313012 1240985 1197960 1385811 1070283 1299167 991180 1357491 1126192
17073A126192J32666j3929p9827K6303m9733l1275k55700M49674j35297p0569
$$ 1126192 1258858 1244929 1165102 1191405 1141672 1110397 854697 1304371 1169074 1098505
17063A098505N1681l3912J39359o2693j07981J54796J51635j5182r3936O3046
$$ 1098505 1150186 1116274 1255633 1192940 1084959 1239755 1391390 1376208 1282272 1345318
17053A345318K08077N30854k58742j33331K2384J90579k1303J01190n5200M5923
$$ 1345318 1553395 2084249 1825507 1692176 1714560 1905139 1883836 1985026 1929826 1975749
17043A975749L46180j01053j98678K92704o8935K62756Q1204k05767O4420O8675
$$ 1975749 2321929 2220876 2022198 2314902 2245967 2508723 2589927 2384160 2448580 2517255
17033B517255J76298k47980k70586o8355M2279k49954l87125M33034k56141j70539
$$ 2517255 2693553 2445573 2174987 2106632 2148911 1898957 1511832 1944866 1688725 1518186
17023A518186j53524J64245k9296l73618J96779q0100J10220k52785J04213k27811
$$ 1518186 1364662 1528907 1499611 1125993 1322772 1242672 1352892 1100107 1204320 976509
17013I76509P5032P8724j63873K81408j02245l57970J77006M10001j98251p9436
$$ 976509 1051541 1130265 966392 1247800 1145555 787585 964591 1374592 1176341 1096905
17003A096905o3152O0665L312o7929J80068k43101K14833m0113P483J76093k99728
$$ 1096905 1033753 1094418 1097730 1029801 1209869 966768 1181601 1141488 1148971 1325064 1025336
16992A025336J12421k06156K34615p3280K33720l26692O5204K889k7344Q8899
$$ 1025336 1137757 931601 1166216 1092936 1326656 999964 1065168 1068057 1040713 1129612
16982A129612O3021J0926J63933q1849n8066K519N7046J35534n613M2119j22198
$$ 1129612 1192633 1203559 1367492 1285643 1227577 1230096 1287142 1422676 1417063 1459182 1336984
16971A336984j48388K94246J36889J07286k55008L75076l01302M73796p9542P8256
$$ 1336984 1188596 1482842 1619731 1727017 1472009 1847085 1545783 2019579 1940037 2018293
16961B018293P8197J7022J58377k6520K33056M999O0606r7076J33264J2198n4833
$$ 2018293 2096490 2113512 2271889 2245369 2478425 2483424 2544030 2446954 2580218 2592416 2537583
16950B537583L7058m9389j21653q7694N8948o8473j87623q8966L2461j74606O775
$$ 2537583 2574641 2525252 2403599 2315905 2374853 2306380 2118757 2029791 2062252 1887646 1894421
16939A894421j82333j2487k37294J78641l69976R0748L6724j07333j71147R7571
$$ 1894421 1712088 1699601 1462307 1640948 1270972 1361720 1398444 1291111 1119964 1217535
16929A217535J21815j95096o5370n0875J92660j1811k33982J51340R1675m43514
$$ 1217535 1339350 1144254 1078884 1028009 1220669 1208858 974876 1126216 1217891 774377
16919G74377L67962j53553l4476m1692K43612k53049j39160K36175q8526r9743
$$ 774377 1142339 988786 954310 912618 1156230 903181 764021 1000196 911670 811927
16909H11927J9463n9518M5391r3056p4544J82525j7544O7483J06994j98413n7288
$$ 811927 831390 771872 817263 724207 649663 832188 814644 882127 989121 790708 733420
16898G33420j24055L4593K12011N7556j88393L46721n1084j95736k254o0337j80222
$$ 733420 609365 643958 855969 913525 725132 1071853 1020769 825033 822779 762442 582220
16887E82220L03082K7299p4596j54918L20472l72147J33369k04576K50091K06052
$$ 582220 885302 912601 838005 683087 1003559 631412 764781 560205 810296 1016348
16877A016348K2349l03415R3840k53390L28551k55824R5363j4795j4267J82192
$$ 1016348 1038697 735282 829122 575732 904283 648459 743822 729027 714760 896952
16867H96952M5066p1129k4377j57822K17673J86868j91099J4582O7365l67414
$$ 896952 942018 870889 846512 688690 906363 1093231 902132 916714 984079 616665
16857F16665K21429R7433j72253J31442O0227l16104L65136k9950q0330k15491
$$ 616665 838094 935527 763274 894716 954943 638839 1003975 974025 893695 678204
16847F78204P0255K9613r6982J04105o4803K21765k58370L74863k11483j37267
$$ 678204 748459 778072 681090 785195 720392 942157 683787 1058650 847167 709900
16837G09900M402J08729K40647k16035K2719k5981J12124j89706Q0669J31153
$$ 709900 714302 823031 1063678 847643 870362 844381 956505 766799 847468 978621
16827I78621j73979O1812k70834N62911l32004K75659N640N4698K39098j98272
$$ 978621 804642 866454 595620 1158531 826527 1102186 1107826 1162524 1401622 1203350
16817A203350J35175r6164o3903K30994M5850l3284m6514J58656j34574j03104
$$ 1203350 1338525 1242361 1178458 1409452 1455302 1422018 1375504 1534160 1399586 1296482
16807A296482L03279k70514L0644K45256l13208L05249K7708j61124J70055j54718
$$ 1296482 1599761 1329247 1359891 1605147 1291939 1597188 1624896 1463772 1633827 1479109
16797A479109r7117r3856O7221j44537j42738l0310J19119J20336m64029o7550
$$ 1479109 1381992 1288136 1355357 1210820 1068082 1037772 1156891 1277227 813198 745648
16787G45648J01202k44240J88614o3845k82695K16452q0872Q9584j21559J02543
$$ 745648 846850 602610 791224 727379 444684 661136 580264 669848 548289 650832
16777F50832k89831K01492j57522K41383j17943R4922l5389P8473N044j62014
$$ 650832 361001 562493 404971 646354 528411 623333 587944 666417 671461 509447
16767E09447j10700K80424K46184l43134N4991K35407k84716j20413J33427j12965
$$ 509447 398747 679171 925355 582221 637212 872619 587903 467490 600917 487952
16757D87952L76580j26814M306k3122q1641m2896K34588j8677j25168J68960k13792
$$ 487952 864532 737718 742024 718902 637261 594365 828953 810276 685108 854068 640276
16746F40276J37847l50774J89500K29513o9920O4354p7121l03962K31634J14765
$$ 640276 778123 427349 616849 846362 776442 840796 763675 459713 691347 806112
16736H06112k03579J51723K8317J78908k14071j1087R2719J7576n2406K42245
$$ 806112 602533 754256 782573 961481 747410 736323 829042 846618 794212 1036457
16726A036457l30305L6731j7021K08586J9636j80866K31087k0929R587j82592
$$ 1036457 706152 742883 725862 934448 954084 773218 1004305 983376 992963 810371
16716H10371R3770m7531K57945l99029M28409k8255n788j45751K35207k67203
$$ 810371 904141 856610 1114555 715526 1143935 1115680 1109892 964141 1199348 932145
16706I32145L0465L83208l6832P0520k01755J91721O4567N4712M6833L02887m18509
$$ 932145 962610 1345818 1308986 1379506 1177751 1369472 1434039 1488751 1535584 1838471 1419962
16695A419962M1512o5826m2251q2601J53606N6918j8510l225L26420l09382M7191
$$ 1419962 1461474 1395648 1353397 1270796 1424402 1481320 1462810 1459585 1786005 1476623 1523814
16684A523814J25311j56142R3833j96094J54711k20229J08113k91740o3124j34640
$$ 1523814 1649125 1492983 1586816 1390722 1545433 1325204 1433317 1141577 1078453 943813
16674I43813J43425N4343J29950k82507K39112q8575j00617J85174O9601K65865
$$ 943813 1087238 1141581 1271531 989024 1228136 1139561 1038944 1224118 1293719 1559584
16664A559584j72848p7524J67136J444J14222j81912P7161r3389M750J60478m7346
$$ 1559584 1386736 1309212 1476348 1477792 1592014 1410102 1487263 1393874 1398624 1559102 1511756
16653A511756J41358k098j9665j78188J8658K1826M1377n2201l31510J57703m00781
$$ 1511756 1653114 1651016 1631351 1453163 1471821 1493647 1535024 1482823 1151313 1309016 908235
16642I08235j12156p8330Q3815k23374J14032j9816R1507j32940j06807J49981
$$ 908235 796079 717749 801564 578190 692222 672406 763913 630973 524166 674147
16632F74147q0893L5513p4010Q9469k15374J35469M3665l4338J26178J1119l0154
$$ 674147 593254 628767 554757 644226 428852 564321 607986 573648 699826 710945 680791
16621F80791o8849J27884j59306K37827j76050j67547j40382K58716M1900q8611
$$ 680791 611942 739826 580520 818347 642297 474750 334368 593084 634984 546373
16611E46373J6025K25033l90806L68346j47454J92156k8770q2639j18932K57337
$$ 546373 562398 787431 396625 764971 617517 809673 780903 698264 579332 836669
16601H36669r2626N1054M8924l6658n4937J08195m9748j26035J20533R0276n3189
$$ 836669 744043 795097 844021 807363 752426 860621 810873 684838 805371 895647 842458
16590H42458l588P5079j62531m7408K36178j404O6055j48854k13322L02713k08241
$$ 842458 838870 913949 751418 704010 940188 938784 1004839 855985 642663 945376 737135
16579G37135K06097j68732J07546k18918J23247l0266j93567J75703M6866j72880
$$ 737135 943232 774500 882046 663128 786375 756109 562542 738245 785111 612231
16569F12231Q7566j44900L9723l6320j60033M56159M2027j87873j11876J29590
$$ 612231 699797 554897 594620 558300 398267 854426 896453 708580 596704 726294
16559G26294q5479k06158j51054J93693l7200j32075O6008K04770r5745k08522
$$ 726294 640815 434657 283603 477296 440096 308021 374029 578799 483054 274532
16549B74532J21087J89920J03897C07129N7032J56785n0848J12951k9613Q2445
$$ 274532 395619 585539 689436 307129 364161 520946 470098 583049 553436 635881
16539F35881j92994p9947J64262J18395k20674B03580N79369B57197N5533L09485
$$ 635881 442887 362940 527202 645597 424923 203580 782949 257197 312730 622215
16529F22215k00972J66394M5356M3300r2880j82194K76511k21981r5653K55477
$$ 622215 421243 587637 632993 676293 583413 401219 677730 455749 360096 615573
16519F15573l04321J12786J46813K3499k51895L4674l1681K76978j13916J62324
$$ 615573 311252 424038 570851 594350 342455 377129 345448 622426 508510 670834
16509F70834B09310L10435k59651L15634l4089q464J24237j03572K38839k21295
$$ 670834 209310 519745 260094 575728 541639 533175 657412 553840 792679 571384
16499E71384k42909O3010K59220r2750M8735j31651N6099m3069J33143J04769
$$ 571384 328475 391485 650705 557955 606690 475039 531138 488069 621212 725981
16489G25981j97893L52034j40463L63692L1231p3551M02627j53783J58506l13295
$$ 725981 528088 880122 739659 1103351 1134582 1061031 1463658 1309875 1468381 1155086
16479A155086J94123K97849k65761k15106N2547K23086o4735N2766j0285j88232
$$ 1155086 1349209 1647058 1381297 1166191 1218738 1441824 1377089 1429855 1419570 1231338
16469A231338n2779J94777j57515J17796m8255J46985k7138j72880Q4792J43609
$$ 1231338 1178559 1373336 1215821 1333617 1285362 1432347 1405209 1232329 1317121 1460730
16459A460730K7952K79383l20982J78717n0713K03729j63292J05283O1159J08292
$$ 1460730 1488682 1768065 1447083 1625800 1575087 1778816 1615524 1720807 1781966 1890258
16449A890258K0028K52612L4169N49196P9538r126K28047K19887K14167M51129
$$ 1890258 1910286 2162898 2197067 2746263 2825801 2816675 3044722 3264609 3478776 3929905
16439C929905J23747L94355M81845J92948M37318N88139O04793P24755O56457
$$ 3929905 4053652 4448007 4929852 5122800 5560118 6148257 6753050 7477805 8134262
16430H134262P91411O02201Q88945P54411J232243J226912J311990J466810J366183
$$ 8134262 8925673 9527874 10416819 11171230 12403473 13630385 14942375 16409185 17775368
16421A7775368J790096K160109J999174K272977K315504K469249L061565L116497
$$ 17775368 19565464 21725573 23724747 25997724 28313228 30782477 33844042 36960539
16413C6960539L555298M131234L960221L946801K963565J796019J006690O19526
$$ 36960539 40515837 44647071 48607292 52554093 55517658 57313677 58320367 58939893
16405E8939893J66743l73640p43117o32245r52883j222191j739042k090662k525341
$$ 58939893 59106636 58732996 57989879 57357634 56404751 55182560 53443518 51352856 48827515
16396D8827515k355256k099375j142560R32301L971828Q120274J3036199J5654831
$$ 48827515 46472259 44372884 43230324 44162625 48134453 56254727 69290926 84945757
16388H4945757J3343946N250942l503149q765840j0750295j0560909j0146275
$$ 84945757 98289703 103540645 100037496 91271656 80521361 69960452 59814177
16381E9814177j1154518j1997516j4423180C209985a9362379k1266677j4073566
$$ 59814177 48659659 36662143 22238963 3209985 -19362379 -40629056 -54702622
16374e4702622j849187J0701227J8591699f697916A0040450J0860081N078315
$$ -54702622 -56551809 -45850582 -27258883 -6697916 10040450 20900531 25978846
16367B5978846Q81607j604047k683839k453321l099518k585059j936270k043023
$$ 25978846 26860453 25256406 22572567 20119246 17019728 14434669 12498399 10455376
16359A0455376j367191j359446q72207o93762o22189o93167r1924j429k96426
$$ 10455376 9088185 7728739 6856532 6162770 5540581 4847414 4755490 4754061 4457635
16350D457635k22773j17030J55247l19714r397k41699j56115k33927k20633j27200
$$ 4457635 4234862 4117832 4273079 3953365 3943968 3702269 3546154 3312227 3091594 2964394
16340B964394l52679l23692j58206k42910j58972j6755l84255r443q4298j2740
$$ 2964394 2611715 2288023 2129817 1886907 1727935 1711180 1326925 1317482 1233184 1220444
16330A220444p5869j94005n1854K50804k50202J28733j87463o7641J47622n9478
$$ 1220444 1144575 950570 898716 1149520 899318 1028051 840588 772947 920569 861091
16320H61091K42442r6684n5372O9939l8374j63779O5137M3302R1282o1863k28101
$$ 861091 1103533 1006849 951477 1021416 983042 819263 884400 927702 1018984 957121 729020
16309G29020l4538j35067J84475j07277j57474K69870M6787n0927K4609K392K0781
$$ 729020 694482 559415 743890 636613 479139 749009 795796 744869 769478 771870 792651
16298G92651k63141M0480J73705n5179n6740K12723j72532J5967J61091j50058
$$ 792651 529510 569990 743695 688516 631776 844499 671967 687934 849025 698967
16288F98967P4609J13834M0837L17073m5350n0669J75637k45113K42155k33596
$$ 698967 773576 887410 928247 1245320 1199970 1149301 1324938 1079825 1321980 1088384
16278A088384J56038j05667l2440J80860p5894j20129K99462l240l9802k23937
$$ 1088384 1244422 1138755 1106315 1287175 1211281 1091152 1390614 1387374 1347572 1123635
16268A123635M40054j44890o7231K2874j43788K25893j45710r996J25635m24005
$$ 1123635 1563689 1418799 1351568 1374442 1230654 1456547 1310837 1300841 1426476 1002471
16258A002471N9956n9042j3694J82889q9713j37813l426K4194k85642J90614P3411
$$ 1002471 1062427 1003385 989691 1172580 1082867 945054 941628 965822 680180 870794 944205
16247I44205j74377j47228O5631Q063J43399j81266J78560j55916L02085M4750
$$ 944205 769828 622600 688231 696294 839693 658427 836987 681071 983156 1027906
16237A027906K17389m8569N0783n1306N1621m7795n5759p4969L0805J0507m4327
$$ 1027906 1245295 1196726 1247509 1196203 1247824 1200029 1144270 1069301 1100106 1110613 1066286
16226A066286j74254O6268k18283J78950j90109k9767p253J65418J04525m0135
$$ 1066286 892032 958300 740017 918967 728858 699091 691838 857256 961781 921646
16216I21646j96681m8321K13852l2551l9618O7898P6301j03821K17437k28834
$$ 921646 724965 676644 890496 857945 818327 886225 962526 858705 1076142 847308
16206H47308J81922k37193N3917j92610M7666J94657o4443P6896l40394L64121
$$ 847308 1029230 792037 845954 653344 701010 895667 831224 908120 567726 931847
16196I31847P5893q6438N1725j55161J31529K43384J8309m36803L69235J6613
$$ 931847 1007740 921302 973027 817866 949395 1192779 1211088 774285 1143520 1160133
16186A160133j03812j81510R3131j4562J20364n1809L0270J12873k45469J29548
$$ 1160133 1056321 874811 967942 953380 1073744 1021935 1052205 1165078 919609 1049157
16176A049157m4965J18223M8813k70384O6058r5700J43054P9253j42502K1706
$$ 1049157 1004192 1122415 1171228 900844 966902 871202 1014256 1093509 951007 972713
16166I72713n6357J59817q7703q6852K06203j65859j40495P566o2860l3177K25077
$$ 972713 916356 1076173 988470 901618 1107821 941962 801467 809033 746173 712996 938073
16155I38073j55682K51652p1423k6162j57397J32920q3730J50472K0493l93545
$$ 938073 782391 1034043 962620 936458 779061 911981 828251 978723 999216 605671
16145F05671K39387j47867P8021K42331j29535J66523O0396k08867J58724j02583
$$ 605671 845058 697191 775212 1017543 888008 1054531 1114927 906060 1064784 962201
16135I62201N2080N4211K04523q8396R2915l15202J60317K28810l90109N1780
$$ 962201 1014281 1068492 1273015 1184619 1277534 962332 1122649 1351459 961350 1013130
16125A013130N2927k04505n9261J24745m4694r1299L13551k18825K2413J13995
$$ 1013130 1066057 861552 802291 927036 882342 791043 1104594 885769 908182 1022177
16115A022177m039k64872O7399P8804K4177L0770J24524J69625k35915N2062J15481
$$ 1022177 1018138 753266 820665 899469 923646 954416 1078940 1248565 1012650 1064712 1180193
16104A180193l48713K78912L8401k97509L68199j22730K08474j26966q783j79167
$$ 1180193 831480 1110392 1148793 851284 1219483 1096753 1305227 1178261 1169478 990311
16094I90311l9723L6939K18825r8013K75307q4841l2404J6904l131n5210j23844
$$ 990311 950588 987527 1206352 1108339 1383646 1298805 1266401 1283305 1280174 1224964 1101120
16083A101120N7853K18949j15948o4876N9281J03077q6345J7133J84857l12533
$$ 1101120 1158973 1377922 1261974 1197098 1256379 1359456 1273111 1290244 1475101 1162568
16073A162568L63427k58078J12815j24367J70004K0450k88571L52353n3184J52503
$$ 1162568 1525995 1267917 1380732 1256365 1426369 1446819 1158248 1510601 1457417 1609920
16063A609920j16445j83119L43952k22637K55666l66240J07852K98812l76565
$$ 1609920 1493475 1310356 1654308 1431671 1687337 1321097 1428949 1727761 1351196
16054A351196L37158K6911j12618k3435K2860O2339Q4595J62389j76315J10151
$$ 1351196 1688354 1715265 1602647 1579212 1602072 1664411 1749006 1911395 1735080 1845231
16044A845231j5142m8178P4772P8480o0112L1796l67467K10661j3444r1770J30371
$$ 1845231 1830089 1781911 1856683 1935163 1875051 1906847 1539380 1750041 1736597 1644827 1775198
16033A775198J43057O2792k02808L6793O1687L0191P5158O6983J01197l29376
$$ 1775198 1918255 1981047 1778239 1815032 1876719 1906910 1982068 2049051 2150248 1820872
16023A820872J66065r7286J6599K31522k22012J43352N2583l0171R9283k7449
$$ 1820872 1986937 1889651 1906250 2137772 1915760 2059112 2111695 2081524 2180807 2153358
16013B153358J60438q1406j6122o203q4972J12341q2921J24389j08066j38990
$$ 2153358 2313796 2232390 2216268 2210065 2125093 2237434 2154513 2278902 2170836 2031846
16003B031846J90977Q5839k32101J52081j08188j33358K14199j66808L25850k35681
$$ 2031846 2222823 2308662 2076561 2228642 2120454 1987096 2201295 2034487 2360337 2124656
15993B124656N4054K7232J70911j21049J44432k77858J31047p6855N1792l5975
$$ 2124656 2178710 2205942 2376853 2255804 2400236 2122378 2253425 2176570 2228362 2192387
15983B192387J76503P2534r0785r9039J17482M3900k3654O1545j13885R0834K4330
$$ 2192387 2368890 2441424 2350639 2251600 2369082 2412982 2389328 2450873 2336988 2427822 2452152
15972B452152r0161j06987K76706n5285J4848j92079l8884J49632j06380p7168
$$ 2452152 2361991 2255004 2531710 2476425 2491273 2299194 2260310 2409942 2303562 2226394
15962B226394Q373Q942j20242r6797o3037K43194R7094K5330m6212M1999j49135
$$ 2226394 2234767 2243709 2123467 2026670 1963633 2206827 2303921 2329251 2283039 2325038 2175903
15951B175903J69772k87302L68538n2812n8495q4814K68318j9969k02131J72064
$$ 2175903 2345675 2058373 2426911 2374099 2315604 2230790 2499108 2479139 2277008 2449072
15941B449072J4678P6831K26494l45908J43036l48j79352J94538J72945k01501
$$ 2449072 2463750 2540581 2767075 2421167 2564203 2563855 2384503 2579041 2751986 2550485
15931B550485K95916k46993K73486J2083j23941K55261J3003K2542M9661L53496
$$ 2550485 2846401 2599408 2872894 2884977 2761036 3016297 3029300 3051842 3101503 3454999
15921C454999p4695K47282j03454L00265J83713J44892M05260j378O31029M61310
$$ 3454999 3380304 3627586 3524132 3824397 4008110 4153002 4558262 4556884 5187913 5649223
15911E649223P66422O75293J135065J733572K456831L731072M780539N968258
$$ 5649223 6415645 7090938 8226003 9959575 12416406 16147478 20928017 26896275
15903B6896275O865688O820022O097515N355627L539992K050919P24948j267067
$$ 26896275 33761963 40581985 46679500 52035127 55575119 57626038 58350986 57083919
15895E7083919k743756m736259n955767o885545o889796o250129n098406l794444
$$ 57083919 54340163 49603904 43648137 36762592 29872796 23622667 18524261 14729817
15887A4729817l179535k260737j699340j090236q89516o09698n13995n05795n6225
$$ 14729817 11550282 9289545 7590205 6499969 5610453 5000755 4486760 3980965 3924740
15878C924740l61130r925n51378k315n059k05365p1514J42219k7551r5214L0278
$$ 3924740 3563610 3553685 3002307 2999992 2994933 2789568 2718054 2860273 2832722 2737508 2767786
15867B767786j646n7030l4308J41736k85295j42863J87584j64184r3984M9340
$$ 2767786 2766140 2709110 2674802 2816538 2531243 2388380 2575964 2411780 2317796 2367136
15857B367136j77504K75572j43584k14920K15446j18111J91558j79944j10984
$$ 2367136 2189632 2465204 2321620 2106700 2322146 2204035 2395593 2215649 2104665
15848B104665Q3774k2042O3037R6618j45101k3245K59490m7690j19241p2499J0538
$$ 2104665 2188439 2166397 2229434 2326052 2180951 2157706 2417196 2369506 2250265 2177766 2188304
15837B188304K32039R8382J43952k24696K83822k22357J23540L6358M0556k20223
$$ 2188304 2420343 2518725 2662677 2437981 2721803 2499446 2622986 2659344 2699900 2479677
15827B479677l5099J71682k21618J19730p9997N0453j48154m6118J9265m13K2039
$$ 2479677 2444578 2616260 2394642 2514372 2434375 2484828 2336674 2290556 2309821 2309408 2331447
15816B331447j30269K99015k24761J71828j28541J50542J37727l61804L39436
$$ 2331447 2201178 2500193 2275432 2447260 2318719 2469261 2606988 2245184 2584620
15807B584620j51039J60206j48335K78059k24038N1197K08678n9179J34260K0842
$$ 2584620 2433581 2593787 2445452 2723511 2499473 2550670 2759348 2700169 2834429 2855271
15797B855271J79031j38912L25551k1821J57919O7890J3649J95128J14409j16863
$$ 2855271 3034302 2895390 3220941 3199120 3357039 3424929 3438578 3633706 3748115 3631252
15787C631252K51558k75825J17615K20382K90601k18422K43578J62383R4663p8910
$$ 3631252 3882810 3606985 3724600 3944982 4235583 4017161 4260739 4423122 4517785 4438875
15777D438875K80423l88K21167q6654J38650j26952j50886L29169k72091O5043
$$ 4438875 4719298 4718910 4940077 4853423 4992073 4865121 4714235 5043404 4771313 4836356
15767D836356l2055J26929J63842P6365k2140J12253j86462P3490J4528J6609
$$ 4836356 4804301 4931230 5095072 5171437 5149297 5261550 5075088 5148578 5163106 5179715
15757E179715R7090j63441n5222K05122j13775j8009j10933K67114m6510J32614
$$ 5179715 5276805 5113364 5058142 5263264 5149489 5131480 5020547 5287661 5241151 5373765
15747E373765j46480M12780j36949J23796K42535J94668R2235K84733R4725J9783
$$ 5373765 5227285 5640065 5503116 5626912 5869447 6064115 6156350 6441083 6535808 6555591
15737F555591M59223j23221J96035O0062J18140n383K01093N3700o1059K53757
$$ 6555591 7014814 6891593 7087628 7147690 7265830 7260447 7461540 7515240 7454181 7707938
15727G707938n7670P7656K83920k19153k15073j81730J01679j8112l56822j22644
$$ 7707938 7650268 7727924 8011844 7792691 7577618 7395888 7497567 7479455 7122633 6999989
15717F999989L5703n14802K02673J71356r9844O6325o5756q2013P775j53535n5320
$$ 6999989 7035692 6520890 6723563 6894919 6795075 6861400 6795644 6713631 6721406 6567871 6512551
15706F512551k3473o4429J8832M29343k5732M27036R8946J14038L84468j35942
$$ 6512551 6489078 6424649 6443481 6872824 6847092 7274128 7373074 7487112 7871580 7735638
15696G735638L59312M7975O3337K6190L3652Q706K8124k32218J01912k76917o7275
$$ 7735638 8094950 8142925 8206262 8232452 8266104 8274810 8302934 8070716 8172628 7895711 7828436
15685G828436l2155j00608k36264J24920R2582R0321l78443m349J54632k18297
$$ 7828436 7796281 7695673 7459409 7584329 7676911 7767232 7388789 7384440 7539072 7320775
15675G320775k74760K11527k1763j43931l28016r1409O3845j96549N2001N62J8169
$$ 7320775 7046015 7257542 7235779 7091848 6763832 6672423 6736268 6539719 6591720 6592282 6610451
15664F610451K31007J03823Q3600M01065J62702M33832n7305P10326L12149N60633
$$ 6610451 6841458 6945281 7028881 7429946 7592648 8026480 7969175 8679501 8991650 9552283
15654I552283L97379M71945O09514Q16924M80729N31069O43293Q16660M49844
$$ 9552283 9949662 10421607 11031121 11848045 12328774 12859843 13503136 14319796 14769640
15645A4769640N37895N56520O12158L76425Q29029J090423M70076O21814R15437
$$ 14769640 15307535 15864055 16476213 16852638 17681667 18772090 19242166 19863980 20779417
15636B0779417O58696N37728O92068J82970K22273J41856j8331r4178l23924j44867
$$ 20779417 21438113 21975841 22667909 22850879 23073152 23215008 23196677 23102499 22778575 22633708
15626B2633708l2979k05405k18899k71575M2283k19981n00916l73047q16274q62273
$$ 22633708 22600729 22395324 22176425 21904850 21947133 21727152 21226236 20853189 20036915 19174642
15616A9174642q24901p97662j032072p88797q87394l46567n91700m34150n35112
$$ 19174642 18349741 17552079 16520007 15731210 14843816 14497249 13905549 13471399 12936287
15607A2936287k52629m91215k95534n18995j98367j95191m28494k56977k20068
$$ 12936287 12683658 12192443 11896909 11377914 11179547 10984356 10555862 10298885 10078817
15598A0078817r0989j12389J28049q7373K01109K05080M48305Q37105K071014
$$ 10078817 9987828 9875439 10003488 9916115 10117224 10322304 10770609 11607714 13678728
15589A3678728M552950Q684974J2728239R677135O427414M334603L718056J897998
$$ 13678728 18231678 26916652 39644891 49322026 55749440 60084043 63802099 65700097
15581F5700097L52660r54885l306495o391070r878489j1789026r200199n984500
$$ 65700097 66052757 65097872 61791377 55400307 45521818 33732792 24532593 18548093
15573A8548093l604607k523143j690312j110845m51942k87574k71860m5668j17615
$$ 18548093 14943486 12420343 10730031 9619186 9167244 8879670 8607810 8562142 8444527
15564H444527Q5434O4746J96257J40850M14439Q4636N13214Q04499J542620L340627
$$ 8444527 8529961 8594707 8790964 8931814 9346253 9430889 9944103 10748602 12291222 15631849
15554A5631849O851366J3385784J5957002J1611028P630896N583205L797452K311210
$$ 15631849 22483215 35868999 51826001 63437029 71067925 76651130 80448582 82759792
15546H2759792J23827k304160n396914r794618j3944299j5380329j1082399o782506
$$ 82759792 82883619 80579459 75182545 65387927 51443628 36063299 24980900 18198394
15538A8198394m228640k899146j788511j534079q38457k71910k83823p8467m79469
$$ 18198394 13969754 11070608 9282097 7748018 6909561 6637651 6353828 6275361 5795892
15529E795892k700j63302K66190n14103n8309j2745l09696k899j58467j37742
$$ 5795892 5793192 5629890 5896080 5381977 5323668 5310923 5001227 4998328 4839861 4702119
15519D702119k29976p5949r7830K6427J2211J4399K04766J34520j1700Q2184M25423
$$ 4702119 4472143 4396194 4298364 4324791 4337002 4351401 4556167 4690687 4678987 4761171 5186594
15508E186594j60956M9042J25379J38535k13865j71891l5556K78686l93931j60508
$$ 5186594 5025638 5074680 5200059 5338594 5124729 4952838 4917282 5195968 4802037 4641529
15498D641529L24897k51821J38884j53830J12205J7117j4520j02454K00751j10760
$$ 4641529 4966426 4714605 4853489 4699659 4811864 4828981 4814461 4712007 4912758 4801998
15488D801998J89393l2056J92006J2538K06048L38134j0138N20314j49311Q7249
$$ 4801998 4991391 4959335 5151341 5163879 5369927 5708061 5697923 6218237 6068926 6156175
15478F156175J55363j03194K35350L21297k85709L58298o2825K67014M78721O70674
$$ 6156175 6311538 6208344 6443694 6764991 6479282 6837580 6774755 7041769 7520490 8191164
15468H191164L91313R29613L81300L06786K40325L38677k9002L28456k61661k96405
$$ 8191164 8582477 9512090 9893390 10200176 10440501 10779178 10750176 11078632 10816971 10520566
15458A0520566k51419l61125r1671J32727M31621L86375M25229K48930O26132
$$ 10520566 10269147 9908022 9816351 9949078 10380699 10767074 11192303 11441233 12067365
15449A2067365M9962J71398k04401p0198k81610l46168m25915l66245r2852l8921
$$ 12067365 12117327 12288725 12084324 12014126 11732516 11386348 10960433 10594188 10501336 10462415
15439A0462415P3173K70438k90144K49384N9752K10233j50015k53126m27050j90507
$$ 10462415 10535588 10806026 10515882 10765266 10825018 11035251 10885236 10632110 10205060 10014553
15429A0014553l78764k30934n33318k23436j86488l32091j15648l60890j97322
$$ 10014553 9635789 9404855 8871537 8648101 8461613 8129522 8013874 7652984 7455662
15420G455662l14659J46127l81114k32970k42817n8189l55981j88855p4025J52687
$$ 7455662 7141003 7287130 6906016 6673046 6430229 6372040 6016059 5827204 5753179 5905866
15410E905866k11446j90100J913m2152J35757J50672J72510j93820J72847J25239
$$ 5905866 5694420 5504320 5506233 5464081 5599838 5750510 5923020 5729200 5902047 6027286
15400F027286J20306l12652M67954J49124k63018L83786k96775L62812k45317
$$ 6027286 6147592 5834940 6302894 6452018 6189000 6572786 6276011 6638823 6393506
15391F393506j61642J82374J61000l68757L0702j09918K698J29794R634K64716
$$ 6393506 6231864 6414238 6575238 6206481 6237183 6127265 6129963 6259757 6269391 6534107
15381F534107m2275q1822K03318j19390K1263M5833J08550j11528N5643k2367
$$ 6534107 6491832 6410010 6613328 6493938 6515201 6561034 6669584 6558056 6613699 6591332
15371F591332j50106p9751O8242j00504J61016O7884J23572K8122N241L31996
$$ 6591332 6441226 6361475 6429717 6329213 6490229 6558113 6681685 6709807 6715048 7047044
15361G047044j57427K00152J75756J85488L51443k06231K05040L01537K95533
$$ 7047044 6889617 7089769 7265525 7451013 7802456 7596225 7801265 8102802 8398335
15352H398335J42645J83163L85703O90340J129534J674469L630104N895820O434017
$$ 8398335 8540980 8724143 9109846 9800186 10929720 12604189 16234293 22130113 28564130
15343B8564130M953799L698185K600284J914657J251556K67426n07215k220728
$$ 28564130 33517929 37216114 39816398 41731055 42982611 43250037 42742822 40522094
15335D0522094l528209n378652n703555m184327k620721j741925j160030q58547
$$ 40522094 36993885 31615233 25911678 21727351 19106630 17364705 16204675 15346128
15327A5346128m50014j73677o34196n60102l08359M2637m04453r4995J21623K73681
$$ 15346128 14896114 14722437 14088241 13528139 13219780 13262417 12857964 12762969 12884592 13158273
15317A3158273N42701P99809J223637K365376N042300Q310033J0571895J0545065
$$ 13158273 13700974 14500783 15724420 18089796 23132096 31442129 42014024 52559089
15309E2559089Q626401O441212M046419K836530J254641j078831k915650o186300
$$ 52559089 61185490 67626702 71673121 74509651 75764292 74685461 71769811 65583511
15301F5583511r319729j1247911j0369804q164769n417184l420146k090232j467381
$$ 65583511 56263782 45015871 34646067 26481298 21064114 17643968 15553736 14086355
15293A4086355q60183l08898k35164q8886q2893j30692n4399K23465J81144j81665
$$ 14086355 13226172 12917274 12682110 12593224 12510331 12379639 12325240 12548705 12729849 12548184
15283A2548184J59969j81846L66927Q03015J703755L922557N732460N782598M066990
$$ 12548184 12708153 12526307 12893234 13696249 15400004 19322561 25055021 30837619 34904609
15274C4904609L184569K207200J382166M21251j60666j252865k295225m481266
$$ 34904609 38089178 40296378 41678544 42099795 41939129 40686264 38391039 33909773
15266C3909773n589654n730253m096360k678066j753522j671515r47927m11424
$$ 33909773 28320119 22589866 18493506 15815440 14061918 12390403 11442476 11031052
15258A1031052q64671k16647j82780k79429K30720k50216p7265L50245J73962
$$ 11031052 10166381 9949734 9766954 9487525 9718245 9468029 9390764 9741009 9914971
15249I914971N82034J28336J01222K0671j10559n5220p7907j48341j44343m4366
$$ 9914971 10497005 10625341 10726563 10747234 10636675 10581455 10503548 10355207 10210864 10166498
15239A0166498m15835l17571P7586N71668k11794O57432M13221P84450P3654M06483
$$ 10166498 9750663 9433092 9510678 10082346 9870552 10527984 10941205 11725655 11799309 12205792
15229A2205792K32481l2942k6247K0978k57249o1244k59931n46977m44369m88171
$$ 12205792 12438273 12405331 12379084 12400062 12142813 12081569 11821638 11274661 10830292 10342121
15219A0342121m7549j95764K38480R3363J56247M28357J77967K25982K92977K4167
$$ 10342121 10294572 10098808 10337288 10430651 10586898 11015255 11193222 11419204 11712181 11736348
15209A1736348l18324l01595j66539m15125m72239l85577o47561n38629m31545
$$ 11736348 11418024 11116429 10949890 10534765 10062526 9676949 9029388 8490759 8059214
15200H059214l24967l61450j86514k28357O8705m74139J25404j28552M9359J78330
$$ 8059214 7734247 7372797 7186283 6957926 7026631 6552492 6677896 6549344 6598703 6777033
15190F777033o7035L66927n1473N0657K54985J27746K11745R3740J21167l30262
$$ 6777033 6709998 7076925 7025452 7076109 7331094 7458840 7670585 7764325 7885492 7555230
15180G555230J19242O7249K54780L20107j2815K25124p5576M2387m11M01811k97404
$$ 7555230 7674472 7741721 7996501 8316608 8303793 8528917 8453341 8495728 8495317 8897128 8599724
15169H599724j7050M3960j53672q6610m1405K7569n4226o4247J83609R5575l7118
$$ 8599724 8582674 8626634 8472962 8386352 8344947 8372516 8318290 8254043 8437652 8533227 8496109
15158H496109k1918J52851J57771K15334q7263J24961K16166j17982r8194j21585
$$ 8496109 8474191 8627042 8784813 9000147 8912884 9037845 9254011 9136029 9037835 8916250
15148H916250J44509j18664r1392K28323l93751N5988J1559L4709K03849j09026
$$ 8916250 9060759 8942095 8850703 9079026 8685275 8741263 8752822 8787531 8991380 8882354
15138H882354J50094J50050J4946n0663J52758j3512p1481p6018J00148P8688
$$ 8882354 9032448 9182498 9197444 9146781 9299539 9286027 9214546 9138528 9238676 9317364
15128I317364P9163k09744j06690O8330q6118m2710J68535k99028m5541k24641
$$ 9317364 9396527 9186783 9080093 9148423 9062305 9019595 9188130 8889102 8843561 8618920
15118H618920j39271J24716j03976j89992J79180j66180j8440J2785j45550J06798
$$ 8618920 8479649 8604365 8500389 8310397 8489577 8323397 8304957 8317742 8172192 8278990
15108H278990j35332P2985n6807J43888n4545K79095o3822K33155N42837p8477
$$ 8278990 8143658 8216643 8159836 8303724 8249179 8528274 8464452 8697607 9240444 9161967
15098I161967L34341K01702N19484O5450L6850N87931P26747O55133R99390J672631
$$ 9161967 9496308 9698010 10217494 10282944 10319794 10907725 11634472 12289605 13288995 14961626
15088A4961626K053346K483940K317225J590322J485804Q32087P50399L18865
$$ 14961626 17014972 19498912 21816137 23406459 24892263 25724350 26474749 26793614
15080B6793614j71174p22743r67731j311668j254077j79247P55539K122636J858804
$$ 26793614 26622440 25899697 24931966 23620298 22366221 22186974 22942513 25065149 26923953
15071B6923953J501394J132857R27818N67824K81432K29605j18179m28581O54934
$$ 26923953 28425347 29558204 30486022 31053846 31335278 31564883 31446704 31018123 31673057
15062C1673057J836225K476946J957666J469191J875905J972673J859829J998511
$$ 31673057 33509282 35986228 37943894 39413085 41288990 43261663 45121492 47120003
15054D7120003J872694Q26860o73084j703678j531390p9269K102686K357103K269222
$$ 47120003 48992697 49819557 49146473 47442795 45911405 45832136 47934822 50291925 52561147
15045E2561147J059707K70894J46325O42456J094402L57539k52883j629117k490825
$$ 52561147 53620854 53891748 54038073 54680529 55774931 56132470 55879587 54250470 51759645
15036E1759645l289399l291276k188069j634240k270281j748238j400558J9037
$$ 51759645 48470246 45178970 42990901 41356661 39086380 37338142 35937584 35956621
15028C5956621J656295K013248J665735J268703J381571J700380J405860J538818
$$ 35956621 37612916 39626164 41291899 42560602 43942173 45642553 47048413 48587231
15020D8587231J296694Q50000M45592J145023K821267N360070P251173P296592
$$ 48587231 49883925 50733925 51179517 52324540 55145807 60505877 67757050 75053642
15012G5053642P260380P348643P573429P640062P234285O391496N481537L490467
$$ 75053642 82314022 89662665 97236094 104876156 112110441 118501937 123983474 127473941
15004A27473941J459066l87930p67504j050752j758714k465014l034552l833219
$$ 127473941 128933007 128545077 127777573 126726821 124968107 122503093 119468541 115635322
14996A15635322m270273n246903o047809n906240n760724n702504n357787n211302
$$ 115635322 111365049 106118146 100070337 94164097 88403373 82700869 77343082 72131780
14988G2131780m873555l790101l112482k162721j602225j800512j214012o38960
$$ 72131780 67258225 63468124 60355642 58192921 56590696 54790184 53576172 52937212
14980E2937212q04586p68445j236718j725560k495492l183107l021666l012962
$$ 52937212 52132626 51364181 50127463 48401903 45906411 42723304 39701638 36688676
14972C6688676k284700k047428j869350j622749r02909o59147r1043Q8096M00365
$$ 36688676 34403976 32356548 30487198 28864449 27961540 27302393 27211350 27299446 27699811
14963B7699811N39474M17540M85349P22202J189441J507283K525632L804156N678169
$$ 27699811 28239285 28656825 29142174 29864376 31053817 32561100 35086732 38890888 44569057
14954D4569057P474078J0799950J4589247J9010649K1129369K4552651K7473950
$$ 44569057 52043135 62843085 77432332 96442981 117572350 142125001 169598951
14947A69598951K8974442K8768251K9021990K8454289K2304881J2640532K871489
$$ 169598951 198573393 227341644 256363634 284817923 307122804 319763336 322634825
14940C22634825m133164r263265j1950066j6071071j8934997k1238269k3371667
$$ 322634825 318501661 309238396 297288330 281217259 262282262 241043993 217672326
14933B17672326k3947540k0564149j5200970j0977531q969996q955310j0187198
$$ 217672326 193724786 173160637 157959667 146982136 138012140 129056830 118869632
14926A18869632j0527455r949002p940910n392321l227050k609773l258429l780538
$$ 118869632 108342177 98393175 90452265 85059944 81832894 79223121 75964692 72184154
14918G2184154l494460l611444l806195l356068m262573m911065o440134o830723
$$ 72184154 68689694 65078250 61272055 57915987 53653414 48742349 42302215 35471492
14910C5471492o547827n190886l416513k408904j566255r01994k71416n8517q3117
$$ 35471492 28923665 23732779 20316266 17907362 16341107 15439113 15167697 15109180 15026063
14901A5026063O47686O56927J136272R35646J310820J977593L384291M403509
$$ 15026063 15673749 16330676 17466948 18402594 19713414 21691007 25075298 29478807
14893B9478807M482663L896201K576888J526763J050199J29943J8078j168044
$$ 29478807 33961470 37857671 40434559 41961322 43011521 43141464 43159542 41991498
14885D1991498k091022l602605n202457m256546l797137k453172j755969l72005
$$ 41991498 39900476 36297871 31095414 26838868 23041731 20588559 18832590 18460585
14877A8460585j037328m72401p9214R71679P52733P07271L22125M36266L16970
$$ 18460585 17423257 16950856 16871642 17843321 18596054 19303325 19625450 20061716 20378686
14868B0378686K18407P40133J96928K69528Q3739k05629N7934Q97128J722730
$$ 20378686 20597093 21337226 21534154 21803682 21887421 21681792 21739726 22636854 24359584
14859B4359584L297831N270480O966684P579241Q031710Q504099P302170N733247
$$ 24359584 27657415 32927895 39894579 47473820 55505530 64009629 71311799 77045046
14851G7045046L440379J446296o02007k713188n515838p473186q303576q078890
$$ 77045046 80485425 81931721 81329714 78616526 73100688 65627502 57323926 49245036
14843D9245036q220715p611037n708972l237416k654990j555926j445383o91812
$$ 49245036 41024321 33413284 27704312 24466896 21811906 20255980 18810597 18118785
14835A8118785r72713m21802k43622k09131j00748k17016k09404P8763J49529
$$ 18118785 17146072 16724270 16480648 16271517 16170769 15953753 15744349 15823112 15972641
14826A5972641L26245M27697M68754P39742J036792J460769K954107M611719O320293
$$ 15972641 16298886 16726583 17195337 17935079 18971871 20432640 23386747 27998466 34318759
14817C4318759P096907N838534M042250K721418J601149N25860p49991j578562
$$ 34318759 41415666 47254200 51296450 54017868 55619017 56144877 55394886 53816324
14809E3816324l893468n653408p464295p344357n958190m259248k828639j641521
$$ 53816324 49922856 44269448 36805153 29460796 23502606 19243358 16414719 14773198
14801A4773198r03746r08580q47492k37191l07141j84253l38316n5237p114m26720
$$ 14773198 13869452 12960872 12113380 11876189 11569048 11384795 11046479 10991242 10984128 10557408
14791A0557408j53388j66572l27124J1962j73946j74855k80660Q6239L3880O3610
$$ 10557408 10404020 10237448 9910324 9922286 9748340 9573485 9292825 9379064 9412944 9476554
14781I476554K48147M40120M8521Q22227Q02814O75819L4981M76590K46107M2986
$$ 9476554 9724701 10164821 10213342 11035569 11838383 12514202 12549183 13025773 13271880 13314866
14771A3314866p3993k17128l51352j52122r40094p27733p49008l17376j15764
$$ 13314866 13240873 13023745 12672393 12520271 11580177 10852444 10103436 9786060 9670296
14762I670296m52056J19340M8474J67604J3860K99484O6263O8938J28016J81226
$$ 9670296 9218240 9337580 9386054 9553658 9567518 9867002 9933265 10002203 10130219 10311445
14752A0311445L38547L42431l5965K04914L84440J53730J42123o4880L91183K2657
$$ 10311445 10649992 10992423 10956458 11161372 11545812 11699542 11841665 11776785 12167968 12190625
14742A2190625L25630O2897L21302N87773L11107J063254R90797J626563K132394
$$ 12190625 12516255 12579152 12900454 13488227 13799334 14862588 15853385 17479948 19612342
14733A9612342K947786M129365O368175R955114J5871108K2515052K7096950K8671545
$$ 19612342 22560128 26689493 33057668 43012782 58883890 81398942 108495892 137167437
14725A37167437K8387991K4043004J7657439J1778106N790836m52396p310809
$$ 137167437 165555428 189598432 207255871 219033977 224824813 224372417 217061608
14718B17061608j5326490k3209646k8245563k9562911k7810647k2838914j7027204
$$ 217061608 201735118 178525472 150279909 120716998 92906351 70067437 53040233
14711E3040233j1725313q349485o175548m152281k922599k460382j389784j360904
$$ 53040233 41314920 32965435 26789887 22637606 19715007 17254625 15864841 14503937
14703A4503937j173584n09723r75597j038605q77561l42676p68949k84467k12866
$$ 14503937 13330353 12820630 11845033 10806428 9928867 9586191 8817242 8532775 8319909
14694H319909j87687K07101n1350J3803n1116n3668R4961J52190K330j16629J98983
$$ 8319909 8132222 8339323 8287973 8301776 8250660 8196992 8291953 8444143 8446473 8329844 8528827
14683H528827l7012k21942p8202K16245O11544j57530P02273O43734P00396R22971
$$ 8528827 8491815 8269873 8191671 8407916 9019460 8861930 9564203 10207937 10908333 11831304
14673A1831304M68615m1949L96220k45998j34352n01842m06907l69021o56973
$$ 11831304 12299919 12257970 12654190 12408192 12273840 11771998 11365091 10996070 10339097
14664A0339097l11495k2888n20419k93267n7214n7531k8784j4051m02854j21523
$$ 10339097 10027602 10004714 9484295 9191028 9133814 9076283 9047499 9033448 8630594 8509071
14654H509071l67911p07139n13458m48408M5446j39969o0251O94596N47207K55643
$$ 8509071 8141160 7434021 6920563 6472155 6517601 6377632 6317381 7011977 7559184 7814827
14644G814827J20883K53609L46613j68643N62192K92293J92198N91067J32530
$$ 7814827 7935710 8189319 8535932 8367289 8929481 9221774 9413972 10005039 10137569
14635A0137569M68723L18386O08060J25687o7823j57345r6530n40886o72903q29773
$$ 10137569 10606292 10924678 11532738 11658425 11590602 11433257 11336727 10795841 10122938 9293165
14625I293165q41391r34275j121809n23616m78583p09798o7225j99587N2064J3186
$$ 9293165 8451774 7517499 6395690 5872074 5393491 4683693 4616468 4416881 4468945 4482131
14615D482131j57246J81784q0799r7074N3614j03700j74221J17261j96412J992
$$ 4482131 4324885 4506669 4425870 4328796 4382410 4278710 4104489 4221750 4025338 4027330
14605D027330m4373K97254j33453q9863M41842J79438O44077R65155N99563Q90668
$$ 4027330 3982957 4280211 4146758 4056895 4498737 4678175 5322252 6287407 6886970 7777638
14595G777638N47718N51353K89649O1736k37275j86384n61512p35553l97507r97054
$$ 7777638 8325356 8876709 9166358 9228094 8990819 8804435 8242923 7507370 7109863 6112809
14585F112809r33304m19312l07859l6714l37042N762J79957j46584N5639k08585
$$ 6112809 5179505 4760193 4452334 4415620 4078578 4084340 4264297 4117713 4173352 3964767
14575C964767L09908k11072L28929J02814O3820K61665o613M81796M5272R33395
$$ 3964767 4274675 4063603 4392532 4495346 4559166 4820831 4814218 5296014 5341286 6274681
14565F274681Q98384O43648O89208O82112J127101J537587K838897N458132P086450
$$ 6274681 7173065 7816713 8505921 9188033 10315134 11852721 14691618 20149750 27236200
14556B7236200O341399M030336K792487K030323J259705M50658k51054j746762
$$ 27236200 33577599 37607935 40400422 42430745 43690450 44141108 43890054 42143292
14548D2143292l088817n206253o163993n148359j497521J475007N526128O431322
$$ 42143292 39054475 33848222 27684229 22535870 21038349 22513356 28039484 34470806
14540C4470806N270728L983613K991777J704162R78958j01592j681191k671025
$$ 34470806 39741534 43725147 46716924 48421086 49400044 49298452 47617261 44946236
14532D4946236m869220o740356p050654n090059l558676j849747j323621p90686
$$ 44946236 40077016 33336660 26286006 21195947 17637271 15787524 14463903 13673217
14524A3673217l60223j65375m3627K32492O16561K104367M192504M968584L631326
$$ 13673217 13312994 13147619 13103992 13336484 13953045 16057412 20249916 25218500 28849826
14515B8849826K910108K330366J471416J160144L84070P6695p71058k298330l919373
$$ 28849826 31759934 34090300 35561716 36721860 37105930 37182625 36411567 34113237 30193864
14506C0193864l853959k586995l55303K035009M066300M024762K903310J727033
$$ 30193864 26339905 23752910 23397607 25432616 29498916 33523678 36426988 38154021
14498C8154021J256090N90917J73154j010513j289597k411577l509705n231555
$$ 38154021 39410111 40001028 40174182 39163669 37874072 35462495 31952790 26721235
14490B6721235m528826l431908k422974k470820j301336j555149j184550q85043
$$ 26721235 22192409 18760501 16337527 13866707 12565371 11010222 9825672 8940629
14482H940629j367886j160728n50358q73047j93203l19593m84206K879k8403J41661
$$ 8940629 7572743 6412015 5861657 4988610 4795407 4475814 3991608 3994487 3966084 4107745
14472D107745q0097L16952P48475N96226M48444J59713L58585L74208l1526j41923
$$ 4107745 4027648 4344600 5093075 5689301 6137745 6297458 6656043 7030251 6998725 6856802
14462F856802J09650K23070k78915M08249K22719J5480N72842L55191J05094L70341
$$ 6856802 6966452 7189522 6910607 7318856 7541575 7557055 8129897 8485088 8590182 8960523
14452H960523j80291J12397l12892k18391m62764n06244o59141l97642N2281O2999
$$ 8960523 8780232 8892629 8579737 8361346 7898582 7392338 6733197 6335555 6387836 6450835
14442F450835J16415J02177K38835L36112K55585K40143l742L55236J57150J47832
$$ 6450835 6567250 6669427 6908262 7244374 7499959 7740102 7736360 8091596 8248746 8396578
14432H396578M16122N62448L98309J642102K367470L804469M602388N287027M328605
$$ 8396578 8812700 9375148 9773457 11415559 13783029 17587498 22189886 27476913 31805518
14423C1805518L474504K926898J763239J350798J20163q64856k249510l592914
$$ 31805518 35280022 38206920 39970159 41320957 41441120 40576264 38326754 34733840
14415C4733840m915813m924988m419250l308255k406098j902538j657923o81880
$$ 34733840 29818027 24893039 20473789 17165534 14759436 12856898 11198975 10517095
14407A0517095j086172p41068l92246k69077k23321K21068j82658M0262N2418
$$ 10517095 9430923 8689855 8297609 8028532 7805211 8026279 7843621 7883883 7936301
14398G936301L8728K56276M77602Q58733J060240J871162L009522N084776O951799
$$ 7936301 7975029 8231305 8708907 9567640 10627880 12499042 15508564 20593340 27545139
14389B7545139Q148414Q701364P303129N769369M373451K757395J101825q17686
$$ 27545139 35693553 44394917 51698046 57467415 61840866 64598261 65700086 64882400
14381F4882400k835865n303990o921654q341459q276197p109953n400623l982915
$$ 64882400 62046535 56742545 49820891 41479432 33203235 26093282 20692659 16709744
14373A6709744l025609j926707j366392r48250o05562l89358l74547l49407Q566
$$ 16709744 13684135 11757428 10391036 9442786 8837224 8447866 8073319 7723912 7732478
14364G732478j62970l01772K85852l8318M8323R8530N86676P70955Q08706J486386
$$ 7732478 7569508 7267736 7553588 7515270 7563593 7662123 8248799 9019754 9828460 11314846
14354A1314846K473563K893026L743216L552400L102581K163498J775321J105026
$$ 11314846 13788409 16681435 20424651 23977051 27079632 29243130 31018451 32123477
14346C2123477K2975m47936j482605k265528k844265l337961k978820k472847
$$ 32123477 32146452 31698516 30215911 27950383 25106118 21768157 18789337 16316490
14338A6316490j882415r72199N81408K306655K800729K339582J750116K044001
$$ 16316490 14434075 13461876 14043284 16349939 19150668 21490250 23240366 25284367
14330B5284367K042241J913675K211139K876416K929779L644897M448377O126024
$$ 25284367 27326608 29240283 31451422 34327838 37257617 40902514 45350891 51476915
14322E1476915R253059J1727546J1361345R810871P410290N390168K441678K23990
$$ 51476915 60729974 72457520 83818865 93629736 101040026 106430194 108871872 109095862
14314A09095862k273814m523609p273410j0391914j2388537j2108064j1083271
$$ 109095862 106822048 102298439 95025029 84633115 72244578 60136514 49053243
14307D9053243r234081p404814n767344m390989l487788k593000k359302j581667
$$ 49053243 39819162 32414348 26647004 22256015 18768227 16175227 13815925 12234258
14299A2234258j469545j201112q70932n34077o90027n04776m84770j90647p38003
$$ 12234258 10764713 9563601 8692669 8158592 7468565 6963789 6479019 6288372 5550369
14290E550369k06445j76261l52240k35201m5515k10444q4065l51205o8838J98345
$$ 5550369 5343924 5167663 4815423 4580222 4534707 4324263 4240198 3888993 3820155 4018500
14280D018500l22743L6157q8661K80406m31782O3682M4999L25728l76957J92803
$$ 4018500 3695757 3731914 3643253 3923659 3491877 3555559 3600558 3926286 3549329 3742132
14270C742132j36470l24515O8152K25025m63047P5790j8192j25194j62250N1218
$$ 3742132 3605662 3281147 3349299 3574324 3111277 3187067 3168875 3043681 2881431 2932649
14260B932649J98002k16354k64009K94841m44632P9740n9540K32396k07265l4198
$$ 2932649 3130651 2914297 2650288 2945129 2500497 2580237 2520697 2753093 2545828 2511630
14250B511630q6785J33089r4699j82314P2034L0650p3229k16753K28857J3685
$$ 2511630 2424845 2557934 2463235 2280921 2352955 2383605 2310376 2093623 2322480 2336165
14240B336165j12921J4737j4736k95376K62198K84471m41208K27864N6079p3072
$$ 2336165 2223244 2237981 2223245 1927869 2190067 2474538 2033330 2261194 2317273 2244201
14230B244201l4405j13723j13522J13568p2431P8929j3108L2720K0986L6403P998
$$ 2244201 2209796 2096073 1982551 2096119 2023688 2102617 2089509 2122229 2143215 2179618 2187616
14219B187616P0082l2168j57693M1968K84577r6186K24165p2045J05992j82996
$$ 2187616 2257698 2225530 2067837 2109805 2394382 2298196 2522361 2450316 2556308 2373312
14209B373312K08427L33548K47427L70941N32559j8094n2755M06858n7252Q593
$$ 2373312 2581739 2915287 3162714 3533655 4066214 4048120 3995365 4402223 4344971 4353564
14199D353564Q9419l38252j71742p09255q68476j83785N7301j49961L4593m9098
$$ 4353564 4442983 4104731 3932989 3223734 2355258 2171473 2228774 2078813 2113406 2064308
14189B064308J44719M0378Q618r0755J99866l88922L38612j36401O5974J34639
$$ 2064308 2209027 2249405 2258023 2167268 2367134 1978212 2316824 2180423 2246397 2381036
14179B381036N0346n1196r1408j90282M34617q9238J13044K53459q4930J3244
$$ 2381036 2431382 2380186 2288778 2098496 2533113 2443875 2556919 2810378 2725448 2738692
14169B738692Q0990l2048m11285m840K95658j90101J85612k65404n0184o7562
$$ 2738692 2819682 2787634 2376349 2371509 2667167 2477066 2662678 2397274 2347090 2279528
14159B279528k58733j9800J17705J21586L0539j11802j76020L12027R2443P5329
$$ 2279528 2020795 2000995 2118700 2240286 2270825 2159023 1983003 2295030 2387473 2462802
14149B462802j66808j06986J58017Q2146k5382o8533L45650Q767K81640N61230
$$ 2462802 2295994 2189008 2347025 2429171 2403789 2335256 2680906 2689673 2971313 3532543
14139C532543P82107J219806O54891O76664N07772O85203R990L04819R7589m92150
$$ 3532543 4314650 5534456 6189347 6866011 7373783 8058986 8068976 8373795 8471384 7979234
14129G979234l53822o24309j174132p13751p32012j86605o31216k63789J24518
$$ 7979234 7625412 7001103 5826971 5113220 4381208 4194603 3563387 3299598 3424116
14120C424116k45169M55037P28L98372N7162K9652J75542J0527j20605O9165k09340
$$ 3424116 3178947 3633984 3634712 4033084 4090246 4119898 4295440 4305967 4185362 4254527 4045187
14109D045187k89363j35163j95723m43515P8416j70566J52867k15852p4074R3209
$$ 4045187 3755824 3620661 3424938 2981423 3059839 2889273 3042140 2826288 2752214 2845423
14099B845423J35787L80943L25739M33832J15329M60688K49791J39658p5590K83977
$$ 2845423 2981210 3362153 3687892 4121724 4237053 4697741 4947532 5087190 5011600 5295577
14089E295577m7286k52609J19690p06377P8638r8795K86019M09082N61966J56071
$$ 5295577 5248291 4995682 5115372 4408995 4487633 4388838 4674857 5083939 5645905 5801976
14079E801976K75177K07130N3095M0377k06662j14878j39059j83800k17809o95733
$$ 5801976 6077153 6284283 6337378 6377755 6171093 6056215 5917156 5733356 5515547 4819814
14069D819814Q8719P4126K09150R458K94296J4283N02234K08104O78148O42355
$$ 4819814 4908533 4982659 5191809 5201267 5495563 5509846 6012080 6220184 6898332 7540687
14059G540687R57692J065753Q30523J131633J259536J619094J731466K340713
$$ 7540687 8498379 9564132 10394655 11526288 12785824 14404918 16136384 18477097
14051A8477097K828113L857170M922551O815179Q940777J1918966J3570363J3380178
$$ 18477097 21305210 25162380 30084931 36900110 45840887 57759853 71330216 84710394
14043H4710394J1404014Q528918N884791K863845P78955k259061m649453p799532
$$ 84710394 96114408 104643326 110528117 113391962 114170917 111911856 107262403 99462871
14035I9462871j1127731j2981282j3815851j1655656j0001770p616114n961753
$$ 99462871 88335140 75353858 61538007 49882351 39880581 32264467 26302714
14028B6302714m332567l395290k643783k098475j664277j354622j001752r15088
$$ 26302714 21970147 18574857 15931074 13832599 12168322 10813700 9811948 8896860
14020H896860p80851n65220n82955m88336n72987j56703n30160j94358j88525
$$ 8896860 8116009 7550789 6967834 6479498 5906511 5749808 5219648 5025290 4836765
14011D836765l15833j86729j23484k78282L0884k57492j04921j03758k1765j01412
$$ 4836765 4520932 4334203 4210719 3932437 3963321 3705829 3600908 3497150 3475385 3373973
14001C373973k55547j41427J53933r3310q492j60389J1995P8928k50605J91677
$$ 3373973 3118426 2976999 3130932 3037622 3029130 2868741 2880736 2959664 2709059 2900736
13991B900736P856J76348K41007K55834L33743N10765M08243O11612Q56303P16305
$$ 2900736 2908592 3084940 3325947 3581781 3915524 4426289 4834532 5446144 6302447 7018752
13981G018752P90798N58539o1950M46874L8474m683l03762n28634q22670o99411
$$ 7018752 7809550 8368089 8306139 8753013 8791487 8786804 8483042 7954408 7131738 6432327
13971F432327q08319n14488o45520L835o92656j42817Q225j57861j66649r4492
$$ 6432327 5624008 5109520 4464000 4467835 3775179 3632362 3640587 3482726 3316077 3221585
13961C221585j1485l12951j47639j27146j19282n6132m2036P5591j01292j45174
$$ 3221585 3210100 2897149 2749510 2622364 2503082 2446950 2404914 2480505 2379213 2234039
13951B234039l2054K76264K31350m5887j6285M52079j6248L3968M25539P6229
$$ 2234039 2201985 2478249 2709599 2663712 2647427 3099506 3083258 3117226 3542765 3618994
13941C618994N99259N97592J155961J656607K349590K720329K698330K855374
$$ 3618994 4218253 4815845 5971806 7628413 9978003 12698332 15396662 18252036
13933A8252036K288417J891801R48489N72721m02046r96286j918817k900672l035970
$$ 18252036 20540453 22432254 23380743 23953464 23551418 22555132 20636315 17735643 14699673
13924A4699673l085072k644493k215529j700273q28007r55112m34587k40540l26800
$$ 14699673 11614601 8970108 6754579 5054306 4226299 3271187 2836600 2596060 2269260
13915B269260k32880J41827q8101j66119O4068j22974k61022R0290P7377K44350
$$ 2269260 2036380 2178207 2090106 1923987 1988055 1865081 1604059 1694349 1771726 2016076
13905B016076l76260Q0981M191j02041k7383M0666k7639j88912K76672k2863p0582
$$ 2016076 1639816 1720797 1724988 1622947 1595564 1636230 1608591 1419679 1696351 1673488 1602906
13894A602906k04494J62472J39329J5975o9511p7617M01694j12167l53863K37016
$$ 1602906 1398412 1560884 1700213 1716188 1646677 1569060 1970754 1858587 1504724 1741740
13884A741740J37743k35144J9526M464L6331p4402j48361K05427m7099j26644
$$ 1741740 1879483 1644339 1663865 1668329 1704660 1630258 1481897 1687324 1640225 1513581
13874A513581j28623J43841O9322n5807q568Q3589R10k78389M02519k05173K25753
$$ 1513581 1384958 1528799 1598121 1542314 1533746 1617335 1618245 1339856 1742375 1537202 1762955
13863A762955n0040J61081J40411j24048n0106j56463K21107j90478J85990L4322
$$ 1762955 1712915 1873996 2014407 1890359 1840253 1683790 1904897 1714419 1900409 1934731
13853A934731m5997R592j79611J57692P603k38252O4188j31296K08549n4419o2760
$$ 1934731 1888734 1898326 1718715 1876407 1884010 1645758 1709946 1578650 1787199 1732780 1670020
13842A670020J3234r9332R4176J06928k39594K17376l01934K27856j76351J29647
$$ 1670020 1683254 1583922 1678098 1785026 1545432 1762808 1460874 1688730 1512379 1642026
13832A642026j0289m6824r5613j12861P8699o9238L07955j0671k635k70725K27472
$$ 1642026 1631737 1584913 1489300 1376439 1455138 1385900 1693855 1683184 1680549 1409824 1637296
13821A637296o8699j40050K7601j74679K04820r1686n8261o5869Q6064L1812j06891
$$ 1637296 1568597 1428547 1456148 1281469 1486289 1394603 1336342 1270473 1356537 1388349 1281458
13810A281458K68253r2236o4527j33379k86P5591j04250Q7525n9116K49009O9797
$$ 1281458 1549711 1457475 1392948 1259569 1259283 1334874 1230624 1318149 1259033 1508042 1577839
13799A577839p0035r4345n4239J53149J73310k13070J30202m8006J4276O1497
$$ 1577839 1507804 1413459 1359220 1512369 1685679 1472609 1602811 1554805 1569081 1630578
13789A630578j37857j39064j3761L84849k40600j83289N1985O2784r8847P0548
$$ 1630578 1492721 1353657 1339896 1724745 1484145 1300856 1352841 1415625 1316778 1387326
13779A387326k18960k5975J01568j11421O4369J02543J25034q0844O9092L03431
$$ 1387326 1168366 1142391 1243959 1132538 1196907 1299450 1424484 1343640 1412732 1716163
13769A716163j43027q9151p0041j70076L53065m918k2600J25282L4933p3776J50345
$$ 1716163 1573136 1483985 1413944 1243868 1596933 1592015 1569415 1694697 1729630 1655854 1806199
13758A806199k78711K56094J21106o1334J15716L293j26884O3929J07874j2591
$$ 1806199 1527488 1783582 1904688 1843354 1959070 1962363 1835479 1899408 2007282 1994691
13748A994691k13535K43467p8891k8483l92816l4039J02863k54287K17924J16152
$$ 1994691 1781156 2024623 1945732 1917249 1524433 1490394 1593257 1338970 1556894 1673046
13738A673046m3060n4604K3996j19754J66271M4466K5732j75471M5230K85223
$$ 1673046 1629986 1575382 1599378 1479624 1645895 1690361 1716093 1540622 1585852 1871075
13728A871075j97927J40935n2886l6792o1610j29161K46923k1045J49400l48093
$$ 1871075 1673148 1814083 1761197 1724405 1662795 1533634 1780557 1759512 1908912 1560819
13718A560819R5266M3054J27837J15268L5578k9813j07752o7920P0672O275J25299
$$ 1560819 1656085 1699139 1826976 1942244 1977822 1948009 1840257 1772337 1843009 1849284 1974583
13707A974583m9768K16451j79309L3723J77853R6225j25942q7777M5151J32918
$$ 1974583 1924815 2141266 1961957 1995680 2173533 2269758 2143816 2056039 2101190 2234108
13697B234108j69144j30135M60166K72869p3946K71442K15012N9064J03849L3323
$$ 2234108 2064964 1934829 2394995 2667864 2593918 2865360 3080372 3139436 3243285 3276608
13687C276608l13705K09523j53211k34600l42420k78389p6121J66944j18076j49550
$$ 3276608 2962903 3172426 3019215 2784615 2442195 2163806 2087685 2254629 2136553 1987003
13677A987003Q9845N337o1924J1044Q8033K44412j8227j24236r218m1137J87534
$$ 1987003 2076848 2082185 2020261 2031305 2119338 2363750 2345523 2221287 2212069 2170932 2358466
13666B358466L64815L18828J89438J89122J10331J81477K7526j9897O5965K46067
$$ 2358466 2723281 3042109 3231547 3420669 3531000 3712477 3740003 3720106 3786071 4032138
13656D032138m24021J746k68730m17510K0579l25138j17648R1521q2980l29539
$$ 4032138 3608117 3609863 3341133 2923623 2944202 2619064 2501416 2592937 2509957 2180418
13646B180418p3688p3405J59697q5476j09825L4563K83602m29754M31798k00401
$$ 2180418 2106730 2033325 2193022 2107546 1997721 2032284 2315886 1886132 2317930 2117529
13636B117529J80881K25687Q6482K78237K27963j169L8684Q6351J05996J21329
$$ 2117529 2298410 2524097 2610579 2888816 3116779 3115610 3154294 3240645 3346641 3467970
13626C467970k41211K488m61947k76024j53266l15271K5177j84425l7286J35131
$$ 3467970 3226759 3229247 2767300 2491276 2338010 2022739 2047916 1863491 1826205 1961336
13616A961336j83692O5965o1986M817Q399J54508K836K73662n1170j470J18766
$$ 1961336 1777644 1843609 1781623 1786440 1794839 1949347 1952183 2225845 2174675 2173205 2291971
13605B291971j85529K01285K56610l09504O1288J47248l29084n9720o8623L7080
$$ 2291971 2106442 2307727 2564337 2254833 2316121 2463369 2134285 2074565 2005942 2043022
13595B043022n5494K3060k28785K32778K99971l2502j20073L3497J68626j65275
$$ 2043022 1987528 2010588 1781803 2014581 2314552 2282050 2161977 2195474 2364100 2198825
13585B198825J17106m19184J23755l62j00533j04849q7680J24282P4616j39216
$$ 2198825 2315931 1896747 2020502 2020140 1919607 1814758 1727078 1851360 1925976 1786760
13575A786760l35141L85727l78240Q5051K54854k05703M1860j13584J85685J05819
$$ 1786760 1451619 1837346 1459106 1544157 1799011 1593308 1635168 1521584 1707269 1813088
13565A813088j73240J55929m4562l69019N40228q9812n456j50757j13882K306
$$ 1813088 1639848 1795777 1751215 1382196 1922424 1832612 1827156 1676399 1562517 1564823
13555A564823K02423j74633j22349l6621J14298J79457q9511M7226l5550k9172
$$ 1564823 1767246 1592613 1470264 1433643 1547941 1727398 1637887 1685113 1649563 1620391
13545A620391J45699J89618j4496N09190J03118J28441J04487o9881R833K39732
$$ 1620391 1766090 1955708 1941212 2450402 2553520 2681961 2786448 2716567 2726400 2966132
13535B966132L9505k42830k22852o9294q6838n14064Q5112o6408p4947K63121
$$ 2966132 3005637 2762807 2539955 2470661 2383823 1869759 1954871 1888463 1813516 2076637
13525B076637K39056J09821M8768J28918L20308k2306j64915N012l3806k60955
$$ 2076637 2315693 2425514 2474282 2603200 2923508 2901202 2736287 2741299 2707493 2446538
13515B446538k18464o9503j07358n88546R5767J67712k93914m8489N2751j21461
$$ 2446538 2228074 2158571 2051213 1462667 1558434 1726146 1432232 1383743 1436494 1315033
13505A315033J80102l52088K53724j52120J18263O137j94779J06099n7007n5875
$$ 1315033 1495135 1143047 1396771 1244651 1362914 1369051 1174272 1280371 1223364 1167489
13495A167489J77960l0433p6751J33946J1673j25260K15327k16997K17923r5163
$$ 1167489 1345449 1315016 1238265 1372211 1383884 1258624 1473951 1256954 1474877 1379714
13485A379714J62656k31525n5213J89815N7564K324k8880l47251L98721j71953
$$ 1379714 1542370 1310845 1255632 1445447 1503011 1505335 1476455 1129204 1527925 1355972
13475A355972Q4015k36962j27635N24903l90591J0567J48924j60693M16937k41452
$$ 1355972 1439987 1203025 1075390 1600293 1209702 1220269 1369193 1208500 1625437 1383985
13465A383985J12332j71253n2529J66866j10082L2344J94665p7291O773J8956
$$ 1383985 1496317 1325064 1272535 1439401 1329319 1361663 1556328 1479037 1485810 1504766
13455A504766N8550J98851N6935P6888L93254K49946N0528J99094J35364L5906
$$ 1504766 1563316 1762167 1819102 1895990 2289244 2539190 2589718 2788812 2924176 2960082
13445B960082l21137J81582k48013J09211n09423j23155k52566j1251j75986j6887
$$ 2960082 2638945 2820527 2572514 2681725 2172302 2049147 1796581 1785330 1609344 1592457
13435A592457M977j68678n9118K66598J10569l03235J14090m565J71925K4306
$$ 1592457 1597434 1428756 1369638 1636236 1746805 1443570 1557660 1553095 1725020 1749326
13425A749326j65068K00576j2823M06907o0423K49710M03809j68349J57778P0330
$$ 1749326 1584258 1784834 1772011 2178918 2118495 2368205 2772014 2603665 2761443 2831773
13415B831773k0211o2880q2177o5875l22111j34095j67438Q0162m19891K86024
$$ 2831773 2811562 2748682 2666505 2600630 2278519 2144424 1976986 2057148 1637257 1923281
13405A923281k10188L1400j96408m6737L08360k29352K44371l57798K89064j73935
$$ 1923281 1713093 1744493 1548085 1501348 1809708 1580356 1824727 1466929 1755993 1582058
13395A582058K55911j35526j5613j19527K35175J65076j91638K36873J96527j89710
$$ 1582058 1837969 1702443 1686830 1567303 1802478 1967554 1775916 2012789 2209316 2019606
13385B019606M59849j80018L40535Q7040o8343J28644J31114p800k84208P7227
$$ 2019606 2479455 2299437 2639972 2727012 2658669 2787313 2918427 2910627 2626419 2703646
13375B703646k17793N8134l14626k96585J44531K26135j98184J40542r0601O3841
$$ 2703646 2485853 2543987 2229361 1932776 2077307 2303442 2105258 2245800 2155199 2219040
13365B219040N674O5868k8939j22237J61240m3265n5299N4279j64305J8623M7822
$$ 2219040 2224714 2290582 2261643 2139406 2300646 2257381 2202082 2256361 2092056 2110679 2158501
13354B158501K36442p8954R4436P224N6121k06069K51915L1031J67960l06093
$$ 2158501 2394943 2315989 2410425 2417649 2473770 2267701 2519616 2550647 2718607 2412514
13344B412514O7416R331j36676m5807k89647J95573J03156R6134l43386q4837
$$ 2412514 2479930 2489261 2352585 2306778 2017131 2212704 2315860 2411994 2068608 1983771
13334A983771J55480K02J11308k34790Q84K45679j80476K5253O6846l2179K3307
$$ 1983771 2139251 2139453 2250761 2015971 2016855 2262534 2082058 2107311 2174157 2141978 2165285
13323B165285j39859K49816P4576P5627k7831N9224l61493L44850P0586J93658
$$ 2165285 2025426 2275242 2349818 2425445 2397614 2456838 2095345 2440195 2510781 2704439
13313B704439K40351k01367K44502O5685N8220J24467j70597K9243J85710p5989
$$ 2704439 2944790 2743423 2987925 3053610 3111830 3236297 3065700 3094943 3280653 3204664
13303C204664j11924p4786q4595p0760K90924J04819J67692m4481O525q3078L89046
$$ 3204664 3092740 3017954 2933359 2862599 3153523 3258342 3426034 3381553 3388078 3305000 3694046
13292C694046k37909J4379M1592N6790J9854l90312J38496j59407K97955l42604
$$ 3694046 3456137 3470516 3512108 3568898 3588752 3198440 3336936 3177529 3475484 3132880
13282C132880K24754k49286K56809j16178p3299K70982k2078J76894N8908j44557
$$ 3132880 3357634 3108348 3365157 3248979 3175680 3446662 3424584 3601478 3660386 3515829
13272C515829J07329K1139o0799K62952k13072J60941L04460l04515L43563j03248
$$ 3515829 3623158 3644297 3583498 3846450 3633378 3794319 4098779 3794264 4137827 4034579
13262D034579o3650O7983L13909J33656j76984M4127K68431J57270J24661Q2508
$$ 4034579 3970929 4038912 4352821 4486477 4309493 4353620 4622051 4779321 4903982 4986490
13252D986490J44164L39698J57923N6302J54790K86343K45497k14418L9690L27079
$$ 4986490 5130654 5470352 5628275 5684577 5839367 6125710 6371207 6156789 6196479 6523558
13242F523558l9718L51218j31804n9068O5422K01528j29646J84546l9337K14749
$$ 6523558 6483840 6835058 6703254 6644186 6709608 6911136 6781490 6966036 6926699 7141448
13232G141448L15806m6886K02723J10724M42003L1839R4952M01725M47453j74893
$$ 7141448 7457254 7410368 7613091 7723815 8165818 8197657 8292609 8694334 9141787 8966894
13222H966894L66694J4734N25644j73029K05227M5692n8624j10551J09005k35318
$$ 8966894 9333588 9348322 9873966 9700937 9906164 9951856 9893232 9782681 9891686 9656368
13212I656368l88047J8823J2376q0558k59464k02907p6039J9004j85150j0721
$$ 9656368 9268321 9287144 9299520 9218962 8959498 8756591 8680552 8699556 8514406 8503685
13202H503685J37560l99934K11431j07701l1501L0962p8185j60563l6703P3521
$$ 8503685 8641245 8241311 8452742 8345041 8313540 8344502 8266317 8105754 8069051 8142572
13192H142572j08909k86431k46575K31051m18042l70549O7204j80148j35615k61723
$$ 8142572 8033663 7747232 7500657 7731708 7313666 6943117 7010321 6830173 6694558 6432835
13182F432835j75618r1747m9421l18568J7529l17450K5588k57673J72942k75864
$$ 6432835 6257217 6165470 6116049 5797481 5815010 5497560 5523148 5265475 5438417 5162553
13172E162553j8778j89104j12753J06518m2450k03517L04760k20940J09135J60326
$$ 5162553 5143775 4954671 4841918 4948436 4905986 4702469 5007229 4786289 4895424 5055750
13162E055750P5118L74464K7190R8976N56627J02454K26602j9144L69446J92127
$$ 5055750 5130868 5505332 5532522 5631498 6188125 6290579 6517181 6498037 6867483 7059610
13152G059610l06568R4951j82324q8340n8147J23627o9259k29081o5919p0357
$$ 7059610 6753042 6847993 6665669 6577329 6519182 6642809 6573550 6344469 6278550 6208193
13142F208193j01871J27160j50328k54489j16648l11674j81371j17985k14612
$$ 6208193 6106322 6233482 6083154 5828665 5712017 5400343 5218972 5100987 4886375
13133D886375l37656j78077k38762j38874j8232N0988R3255N7219k68453J57370
$$ 4886375 4548719 4370642 4131880 3993006 3974774 4025762 4119017 4176236 3907783 4065153
13123D065153o1561j53997N9188J36267j85671l6923j23416L5095j34775l13071
$$ 4065153 4003592 3849595 3908783 4045050 3859379 3822456 3699040 3734135 3599360 3286289
13113C286289k35774K82675k98186j3640L16822j44966j97498J53998K40688J80451
$$ 3286289 3050515 3333190 3035004 3021364 3338186 3193220 2995722 3149720 3390408 3570859
13103C570859k65303j5877K97082j23856N04274K66814K56157J39246M00806L13212
$$ 3570859 3305556 3289679 3586761 3462905 3967179 4233993 4490150 4629396 5030202 5343414
13093E343414M02339K14745R7748L71814m6866J96126j75329K78477L7843j87757
$$ 5343414 5745753 5960498 6058246 6430060 6383194 6579320 6403991 6682468 6720311 6532554
13083F532554j00507j80484J03668l32501L5834j00574r0250l84349J9265m18339
$$ 6532554 6432047 6251563 6355231 6022730 6058564 5957990 5867740 5483391 5502656 5084317
13073E084317l90235m34256k94177K461m46769K8738k41001l7062K06364j82506
$$ 5084317 4694082 4259826 3965649 3968110 3521341 3550079 3309078 3272016 3478380 3295874
13063C295874j46649j5414J38381j75171O3251p3471L93331l14579K02088j6545
$$ 3295874 3149225 3133811 3272192 3097021 3160272 3086801 3480132 3165553 3367641 3351096
13053C351096M3527J05801q3349o3572k10195J17578J29794j8802J7052m60861
$$ 3351096 3394623 3500424 3417075 3353503 3143308 3260886 3390680 3371878 3388930 2928069
13043B928069J96952Q1826q4504J49971j42970j027J58010P0379L59840k21537
$$ 2928069 3125021 3206847 3122343 3272314 3129344 3128317 3286327 3356706 3716546 3495009
13033C495009m9782J47324M0153o5356K68937l0338K02469l72123M28282l54462
$$ 3495009 3445227 3592551 3632704 3567348 3836285 3805947 4008416 3636293 4064575 3710113
13023C710113J10951O8290K92006j98450J07648L25907l0897o2451o4968J37896
$$ 3710113 3821064 3889354 4181360 3982910 4090558 4416465 4385568 4323117 4258149 4396045
13013D396045J62154j11718J38711J68715k44569J62075O7221k07935L92622J0361
$$ 4396045 4558199 4446481 4585192 4753907 4509338 4671413 4738634 4530699 4923321 4933682
13003D933682m6230K5497J31750o8551J97728O8413k3548m7219l3675L02785N1406
$$ 4933682 4887452 4912949 5044699 4976148 5173876 5242289 5218741 5171522 5137847 5440632 5492038
12992E492038R4786J07992k98651J53146J64656j50215l26024M82297j96620p9660
$$ 5492038 5586824 5694816 5396165 5549311 5713967 5563752 5237728 5720025 5523405 5443745
12982E443745J67263K0460j45048L0982L8283J34265m4597j39509r9813k81207
$$ 5443745 5611008 5631468 5486420 5517402 5555685 5689950 5645353 5505844 5406031 5124824
12972E124824K55898r6586k04915Q6406j90320n3963K01733l6563p1918M4614
$$ 5124824 5380722 5284136 5079221 5165627 4975307 4921344 5123077 5086514 5014596 5059210
12962E059210j52238M0233p1665l6938K11276j05074k77794K93109p7454J30017
$$ 5059210 4906972 4947205 4875540 4838602 5049878 4944804 4667010 4960119 4882665 5012682
12952E012682q7762n3114J35482k08104K15834l03870N31233m28607R8842M1435
$$ 5012682 4924920 4871806 5007288 4799184 5015018 4711148 5242381 4813774 4912616 4954051
12942D954051j06348p2472O1472j293O7121N3148j90984N5236j50492J63684o539
$$ 4954051 4847703 4775231 4836703 4835410 4902531 4955679 4764695 4819931 4669439 4833123 4826584
12931D826584L87958q6334j64865N4893K68773j07461k06447o6058k35131R8946
$$ 4826584 5214542 5128208 4963343 5018236 5287009 5179548 4973101 4907043 4671912 4770858
12921D770858j08093Q2975o7186j5528J3318J3241j25865j07642K5820j13245
$$ 4770858 4662765 4745740 4678554 4663026 4676344 4689585 4563720 4456078 4481898 4368653
12911D368653k58026L13281j82277k87755j72475N0573R5476k4660m5912J09174
$$ 4368653 4110627 4423908 4241631 3953876 3781401 3831974 3927450 3902790 3856878 3966052
12901C966052n17580K563K51117l0396m44790P1216K8222k01474K38985j76311
$$ 3966052 3448472 3451035 3702152 3671756 3226966 3298182 3326404 3124930 3363915 3187604
12891C187604O3268L4476p1053J5979j01680k6825J85548j32405j4901M3876j29704
$$ 3187604 3250872 3285348 3214295 3230274 3128594 3101769 3287317 3154912 3140011 3183887 3054183
12880C054183Q4020p0382Q7092K0924j00747j86435J49811j40109R3215j48563
$$ 3054183 3138203 3067821 3154913 3175837 3075090 2888655 3038466 2898357 2991572 2843009
12870B843009O0764J53617N1510k27403K540k07344J32233j48381k9342J04045
$$ 2843009 2903773 3057390 3108900 2881497 2884037 2676693 2808926 2660545 2631203 2735248
12860B735248M8424J84958l32871K71880j3637m7394j26591Q1558N3016K3440
$$ 2735248 2783672 2968630 2635759 2907639 2894002 2846608 2720017 2801575 2854591 2878031
12850B878031Q0796k45578K60514m0891j71531p9456J34409K2226L374k22930
$$ 2878031 2958827 2713249 2973763 2932872 2761341 2681885 2816294 2838520 2841894 2618964
12840B618964K25620k42839K63002j40649P9146o8980J29098j92181J54959k1534
$$ 2618964 2844584 2601745 2864747 2724098 2803244 2734264 2863362 2671181 2826140 2804606
12830B804606J54946k25941r0170k35708J27437J72679J32504j11159J10650P8513
$$ 2804606 2959552 2733611 2643441 2407733 2535170 2707849 2840353 2729194 2839844 2918357
12820B918357j47186q0713p1760K26317j18187K7670K50553k73434k4753J89244
$$ 2918357 2771171 2690458 2618698 2845015 2726828 2754498 3005051 2731617 2706864 2896108
12810B896108l07793J54007J0602k35425R5214J13489L67316l26563K29426q3746
$$ 2896108 2588315 2742322 2752924 2517499 2612713 2726202 3093518 2766955 2996381 2912635
12800B912635k34905J13948K43436j81800Q2486k38149L88555l32804N7060J94423
$$ 2912635 2677730 2791678 3035114 2853314 2935800 2697651 3086206 2753402 2810462 3004885
12790C004885J65935k99190K60401j05324m6569J00961l07586J84650O6405P0710
$$ 3004885 3170820 2871630 3132031 3026707 2980138 3081099 2773513 2958163 3024568 3095278
12780C095278m0226j04925P4815j40106K00080k60089k8942K47123r6675L7540
$$ 3095278 3055052 2950127 3024942 2884836 3084916 2824827 2795885 3043008 2946333 2983873
12770B983873q8856L04393m43423M25567k13977J76176P9026J00609j17792K41966
$$ 2983873 2895017 3199410 2755987 3181554 2967577 3143753 3222779 3323388 3205596 3447562
12760C447562k47397l775j95868J74747M5646p4696j12214J48939j845M2458q5433
$$ 3447562 3200165 3196390 3000522 3175269 3220915 3146219 3034005 3182944 3181099 3223557 3138124
12749C138124k008K21781j77471k38649J79634j95132J76256l8905P8578O930
$$ 3138124 3136116 3357897 3180426 2941777 3121411 2926279 3102535 3063630 3142208 3149138
12739C149138j9855p6156K53732l00422K20271K20150k30818r0732j70752K62458
$$ 3149138 3129283 3053127 3306859 3006437 3226708 3446858 3216040 3125308 2954556 3217014
12729C217014P8648L1546K72603n14319m3074J93771M3945l6885l9000N688N4949
$$ 3217014 3295662 3327208 3599811 3085492 3042418 3236189 3280134 3243249 3204249 3209937 3264886
12718C264886P3514j59542k09223J08348K74080j31964J12610n006P391p2402
$$ 3264886 3338400 3178858 2969635 3077983 3352063 3220099 3332709 3327703 3335094 3262692
12708C262692K74601k72332K18978N8710K50320j00798Q8486r1770M83556q7164
$$ 3262692 3537293 3264961 3483939 3542649 3792969 3692171 3780657 3688887 4172443 4085279
12698D085279r5920L48816p436L19734K3713J70785L1243M03568R6040M73941
$$ 4085279 3989359 4338175 4330739 4650473 4674186 4844971 4876214 5279782 5375822 5849763
12688E849763O97772N98852R8604K91446J75227K55812m14496N8669m37148k6337
$$ 5849763 6547535 7146387 7244991 7536437 7711664 7967476 7552980 7611649 7174501 7148164
12678G148164o12087m48367o75117j03660l52054l43308J05281N3024l6902J16477
$$ 7148164 6536077 6087710 5412593 5308933 4956879 4613571 4718852 4771876 4734974 4851451
12668D851451q9510m4157M38528p2845j20444n4819J34215j851N7604j00381K19557
$$ 4851451 4761941 4717784 5156312 5083467 4963023 4908204 5042419 5040568 5098172 4997791 5217348
12657E217348j08129J87531j39908o0227L15586R9642L70275n6659K14310Q1740
$$ 5217348 5109219 5296750 5156842 5096615 5412201 5511843 5882118 5825459 6039769 6121509
12647F121509m2549M9305M3124K01094N8980J17156k23080K38257K5852j49999
$$ 6121509 6078960 6128265 6171389 6372483 6431463 6548619 6325539 6563796 6589648 6439649
12637F439649O3423J68032O4227J47459m7902L6472M00175r7449K17065k02323
$$ 6439649 6503072 6671104 6735331 6882790 6834888 6871360 7271535 7174086 7391151 7188828
12627G188828J53142Q9208J56362l37295m75450K67578l12026j94333n10505O2440
$$ 7188828 7341970 7431178 7587540 7250245 6774795 7042373 6730347 6536014 6025509 6087949
12617F087949l63637q6048j73691l56342J67286J70228J44700M11013L21228N01807
$$ 6087949 5724312 5638264 5464573 5108231 5275517 5445745 5590445 6001458 6322686 6824493
12607F824493M24223O10464N82604N6315O27869J42317m41523k12108k99541k55398
$$ 6824493 7248716 7859180 8441784 8498099 9125968 9268285 8826762 8614654 8315113 8059715
12597H059715m91386n90492j0778p76779k21344k79488K16422k81933N9714R9197
$$ 8059715 7568329 6977837 6967059 6190280 5968936 5689448 5905870 5623937 5683651 5782848
12587E782848K43966k04635L24936j67606L20835q758j52140J20340J27660J11927
$$ 5782848 6026814 5822179 6147115 5979509 6300344 6291586 6139446 6259786 6387446 6499373
12577F499373L89157K29941q7608J56171K04017M6065n1306k52255l33284k12289
$$ 6499373 6888530 7118471 7030863 7187034 7391051 7437116 7385810 7133555 6800271 6587982
12567F587982m91025o37644o9393k44092k03914L08652l10635l3274k2710q428
$$ 6587982 6096957 5459313 5389920 5145828 4941914 5250566 4939931 4906657 4883947 4875519
12557D875519R2074m0400m5144l8458R3683K5801L1689o0750J32782P5573j75087
$$ 4875519 4967593 4927193 4882049 4843591 4937274 4963075 4994764 4934014 5066796 5142369 4967282
12546D967282O2590J44730j20305J24242O1817L46394J67845P2551J64453J49690
$$ 4967282 5029872 5174602 5054297 5178539 5240356 5586750 5754595 5827146 5991599 6141289
12536F141289o0060K74369j44426O5648q9667j08024k38816l18501k01966p6085
$$ 6141289 6081229 6355598 6211172 6276820 6187153 6079129 5840313 5521812 5319846 5243761
12526E243761j46604j35180j15462O1194J98155j52446M8070k453K41517L49266
$$ 5243761 5097157 4961977 4846515 4907709 5105864 4953418 5001488 4999035 5240552 5589818
12516E589818l79457J46945J81106K16801J03078O27331N08905L74655J57796
$$ 5589818 5210361 5357306 5538412 5755213 5858291 6485622 6994527 7369182 7526978
12507G526978L85387J04293J20006n6118r660o540q08299k61426p35181j21962
$$ 7526978 7912365 8016658 8136664 8080546 8070886 8064346 7256047 6994621 6259440 6137478
12497F137478j95273j15670l72763J72731m818j55272k1631P5619J05850L5806
$$ 6137478 5942205 5826535 5453772 5626503 5621685 5466413 5444782 5520401 5626251 5662057
12487E662057j16096K28197j55626O2576K21048K40499K37046L84503Q2320J42039
$$ 5662057 5545961 5774158 5618532 5681108 5902156 6142655 6379701 6764204 6846524 6988563
12477F988563J44918K06758k90351K64192k42425J310n04146q0404k59971l11679
$$ 6988563 7133481 7340239 7049888 7314080 7071655 7072965 6568819 6488415 6228444 5916765
12467E916765J32113k41102j3482N8836J99865j41654J8249M20111j05296j56062
$$ 5916765 6048878 5807776 5794294 5853130 6052995 5911341 5929590 6349701 6244405 6088343
12457F088343O89286n56395P0046L30421K21793l7842J48932J75820K13973J91741
$$ 6088343 6777629 6221234 6291280 6621701 6843494 6805652 6954584 7130404 7344377 7536118
12447G536118L33957q1355L75006M9465M89787K80731K68339J53252L40806P3345
$$ 7536118 7870075 7788720 8163726 8213191 8702978 8983709 9252048 9405300 9746106 9819451
12437I819451K76964J84777R474K8677J11468K28499p2216K1981P8767P6016J35942
$$ 9819451 10096415 10281192 10290666 10319343 10430811 10659310 10587094 10609075 10687842 10763858 10899800
12426A0899800R3277K94964j34986J15184K24982K75787J01257K83915K65247
$$ 10899800 10993077 11288041 11153055 11268239 11493221 11769008 11870265 12154180 12419427
12417A2419427L96194K32951N29876L94418L53877N46413L72948M94869L72030
$$ 12419427 12815621 13048572 13578448 13972866 14326743 14873156 15246104 15740973 16113003
12408A6113003K4654O4956J41324M0590j08951j07245r9443m63128k25663J27449
$$ 16113003 16137657 16202613 16343937 16384527 16275576 16168331 16068888 15605760 15380097 15507546
12398A5507546n58333K82354m42097q2989k47265R6118J21656k8334Q4598M20820
$$ 15507546 14949213 15231567 14789470 14706481 14459216 14555334 14676990 14648656 14733254 15154074
12388A5154074J28527P8810N05639L39348L88570J89417L24136n111O92501O7183
$$ 15154074 15282601 15361411 15867050 16206398 16594968 16784385 17108521 17103410 17795911 17863094
12378A7863094J62003O4502K10297m4804r9611r4564m2950K13040m10948j67709
$$ 17863094 18025097 18089599 18299896 18255092 18155481 18060917 18017967 18231007 17820059 17652350
12368A7652350n7758l2488j24121k17706l44258Q300n1015k21113p6340m3411
$$ 17652350 17594592 17562104 17437983 17220277 16876019 16884319 16833304 16612191 16535851 16492440
12358A6492440j77935j64931j14543j02766k04278j24918N4639j42132k91160
$$ 16492440 16314505 16149574 16035031 15932265 15727987 15603069 15657708 15515576 15224416
12349A5224416p5747m20094j05830j28445k35508k4447k105J39556l3320J4205
$$ 15224416 15148669 14728575 14622745 14494300 14258792 14234345 14232240 14371796 14338476 14352681
12339A4352681K18234J76509L97821J25658L17263K65830K83833N12890L85776
$$ 14352681 14570915 14747424 15145245 15270903 15588166 15853996 16137829 16650719 17036495
12330A7036495N4922K70573M33154P6277M68099K0793K8770L69636L16097k9653
$$ 17036495 17091417 17361990 17795144 17871421 18339520 18360313 18389083 18758719 19074816 19045163
12320A9045163L5795P4765Q6369l5301R3454k1004k22515M73464k28386l6602
$$ 19045163 19080958 19155723 19242092 19206791 19300245 19279241 19056726 19530190 19301804 19265202
12310A9265202m46L68561K5265J22302N10733L08508Q1369K91713L55240J31972
$$ 19265202 19264756 19633317 19658582 19780884 20291617 20600125 20681494 20973207 21328447 21460419
12300B1460419J65427p9653k41349j57319k03017n43035m20158k32788k65321
$$ 21460419 21625846 21546193 21304844 21147525 20944508 20401473 19981315 19748527 19483206
12291A9483206l83905m97062m22680R7152k45880m42155k40072l54204n83016
$$ 19483206 19099301 18602239 18179559 18276711 18030831 17588676 17348604 16994400 16411384
12282A6411384k17248l58214o04889k40602r28339l30556k270l88806l88638P8887
$$ 16411384 16194136 15835922 15231033 14990431 14062092 13731536 13729266 13340460 12951822 13030709
12272A3030709k52436j48992j44639j93741J96362j99562J08612j88982J63698
$$ 13030709 12778273 12629281 12484642 12290901 12487263 12287701 12396313 12207331 12371029
12263A2371029l09318r1843J01739j5198j3261n3076J58309k68K91186L82265
$$ 12371029 12061711 11969868 12071607 12056409 12043148 11990072 12148381 12148113 12439299 12821564
12253A2821564L03055M79973K93923O05375M90575P76295R71027O91503R66496
$$ 12821564 13124619 13604592 13898515 14503890 14994465 15770760 16741787 17433290 18399786
12244A8399786J090376J271785M98903Q57697M89091M49202J65759L89034j5696
$$ 18399786 19490162 20761947 21260850 22118547 22607638 23056840 23222599 23611633 23595937
12235B3595937l13396L0263K20480m72274p6451j66736o63747j2642k08147r96219
$$ 23595937 23282541 23312804 23533284 23061010 22984559 22817823 22154076 22141434 21933287 20937068
12225B0937068m47980n32166j057616r44568j062243r16931q62187n50099r22181
$$ 20937068 20489088 19956922 18899306 17954738 16892495 15975564 15113377 14563278 13641097
12216A3641097o18712k88050m84037m36645q9101j8337l85947l32574j29668j90720
$$ 13641097 13022385 12734335 12250298 11813653 11724552 11706215 11320268 10987694 10858026 10667306
12206A0667306l70546O7951l46581l25538l0264o8199l01301L39881j57471K31429
$$ 10667306 10296760 10364711 10018130 9692592 9662328 9594129 9292828 9632709 9475238 9706667
12196I706667l3829Q0250q4957q0726K00194J23202J80796M74241p6193M4590
$$ 9706667 9672838 9753088 9668131 9587405 9787599 9910801 10091597 10565838 10489645 10534235
12186A0534235J46102L89265j44239N96012j49634J93438J23093J74393m0557
$$ 10534235 10680337 11069602 10925363 11521375 11371741 11565179 11688272 11862665 11822108
12177A1822108j70664L45955j40785k09826P6685J48601j27831J82031j60511
$$ 11822108 11651444 11997399 11856614 11646788 11723473 11872074 11744243 11926274 11765763
12168A1765763J77770n0160j27330J77488O0925M52768M82998K68170J21577R11544
$$ 11765763 11943533 11893373 11766043 11943531 12004456 12457224 12940222 13208392 13329969 14241513
12158A4241513K74580K31542K64736O2904M40209J27934j0161j50842r7113k71173
$$ 14241513 14516093 14747635 15012371 15075275 15515484 15643418 15633257 15482415 15385302 15114129
12148A5114129J03606j13601M58698M33983K95604O61794N33064L29971P51087
$$ 15114129 15217735 15104134 15562832 15996815 16292419 16954213 17487277 17817248 18568335
12139A8568335K27009O74288M24377O30090J95297J090246R51883J000304J243441
$$ 18568335 18795344 19469632 19894009 20524099 20719396 21809642 22761525 23761829 25005270
12130B5005270J474996J597218J677166J669887J588745K072169J300875J507292
$$ 25005270 26480266 28077484 29754650 31424537 33013282 35085451 36386326 37893618
12122C7893618R78574P57297N66501K09138O2740Q0502n72511l27485k70487n16922
$$ 37893618 38872192 39629489 40195990 40405128 40467868 40548370 39975859 39648374 39377887 38860965
12112C8860965o78502p49026k21593k91506m34220m97755k89375k91948k66058
$$ 38860965 38182463 37433437 37211844 36920338 36486118 35988363 35698988 35407040 35140982
12103C5140982p4709K75198L6771L06958L88986n023J15633j20739m07983m5244
$$ 35140982 35066273 35341471 35378242 35685200 36074186 36069163 36184796 36064057 35656074 35610830
12093C5610830l34376l70706p52220l91881m00988P4796p5782M16057M62413M19240
$$ 35610830 35276454 34905748 34153528 33761647 33360659 33435455 33359673 33775730 34238143 34657383
12083C4657383M80373R57282M65692M70889M70544K30849K0710j8665l12975l28243
$$ 34657383 35137756 36095038 36560730 37031619 37502163 37733012 37753722 37735057 37422082 37093839
12073C7093839k28742j64374n4976n89679m1228q56006q53139p54466r01094q55241
$$ 37093839 36865097 36700723 36645747 36056068 36014840 35158834 34305695 33551229 32650135 31794894
12063C1794894j030200j208116j023272n78190q66438n22920m93153n43338l92964
$$ 31794894 30764694 29556578 28533306 27955116 27088678 26565758 26072605 25529267 25136303
12054B5136303l93245k65255m88968j81146r71306M086n43673l49463k96284l36792
$$ 25136303 24743058 24477803 23988835 23807689 22836383 22840469 22296796 21947333 21651049 21314257
12044B1314257m65976l14598n85125q5993l78847n24272k28616n80937m4649q41437
$$ 21314257 20848281 20533683 19948558 19862565 19483718 18959446 18730830 18149893 18105244 17263807
12034A7263807L6678l95927K0334O166j82014M85608R6406K16759K35155M356
$$ 17263807 17300485 16904558 16924892 16931058 16749044 17234652 17331058 17547817 17782972 17787328
12024A7787328P7791r4637l54252j06280q79699m06388l86102p74061k73162m02177
$$ 17787328 17865119 17770482 17416230 17309950 16430251 16023863 15637761 14863700 14590538 14188361
12014A4188361l13163l85665l37965j07898j83336m38212k27466k34090L9491
$$ 14188361 13875198 13489533 13151568 13043670 12860334 12422122 12194656 11960566 12000057
12005A2000057l38261m5803j21757l0914K71939L0114K22468J92782L7961j77206
$$ 12000057 11661796 11615993 11494236 11463322 11735261 11765375 11987843 12180625 12218586 12041380
11995A2041380o0517l41040k79676j71592l23497k75994m53478L8930j81200p3750
$$ 12041380 11980863 11639823 11360147 11188555 10865058 10589064 10135586 10174516 9993316 9919566
11985I919566j18313j67947k82885J18158l47559j05270l18052l80300j30821
$$ 9919566 9801253 9633306 9350421 9468579 9121020 9015750 8697698 8317398 8186577
11976H186577j21154j72202j07570J07391j13057l92982k03302J16145n01815
$$ 8186577 8065423 7893221 7785651 7893042 7779985 7387003 7183701 7299846 6798031
11967F798031j47524j26756j07977j62009j50108j14780K2095j99219N7100j52660
$$ 6798031 6650507 6523751 6415774 6253765 6103657 5988877 6010972 5811753 5868853 5716193
11957E716193L78939k07810L94844K58550R460N3900J38283j37067m7669J98362
$$ 5716193 6095132 5887322 6282166 6540716 6550176 6604076 6742359 6605292 6557623 6755985
11947F755985j07321K44645r7656J31269K0600l2599K94700M4350L15368J87976
$$ 6755985 6648664 6893309 6795653 6926922 6947522 6914923 7209623 7253973 7569341 7757317
11937G757317J27026L4380L6205K57454j1710j4913J60576j47381J38758O827
$$ 7757317 7884343 7918723 7954928 8212382 8200672 8185759 8346335 8198954 8337712 8344539
11927H344539l25609j6735K9130k82497P862k2843m75096j05859o4578q2296k51854
$$ 8344539 8018930 8002195 8031325 7748828 7756690 7733847 7258751 7152892 7088314 7006018 6754164
11916F754164k04393J44383k88827p5428k34493j04423K39747N66110J446272
$$ 6754164 6549771 6694154 6405327 6329899 6095406 5990983 6230730 6796840 8243112
11907H243112K174777J605578O90616N14440R9496K40512L68258m5588n78839
$$ 8243112 10417889 12023467 12714083 13228523 13328019 13568531 13936789 13891201 13312362
11898A3312362j285644j415686k130675j226126q66334l44939k96568j43257q455
$$ 13312362 12026718 10611032 8480357 7254231 6387897 6042958 5746390 5603133 5594678
11889E594678J44622J24357K53135K96446M79532P61037M60450N87048N42867
$$ 5594678 5739300 5863657 6116792 6413238 6892770 7653807 8114257 8701305 9244172
11880I244172L27210M52643J82955P4577m6780j41943l51311n55708n77467k54793
$$ 9244172 9571382 10024025 10206980 10281557 10234777 10092834 9741523 9185815 8608348 8353555
11870H353555p54793n70726m08441k61792j65715o01512k35032O0176m74881l1472
$$ 8353555 7598762 7028036 6619595 6357803 6192088 5590576 5355544 5415720 4940839 4909367
11860D909367j73046m4881J0816J29126k33250j1449J08091J30560o6374K81019
$$ 4909367 4736321 4691440 4702256 4831382 4598132 4586683 4694774 4825334 4758960 5039979
11850E039979J51912J3601J47810K74631J55414J91458L63667L24387M57315L00683
$$ 5039979 5191891 5205492 5353302 5627933 5783347 5974805 6338472 6662859 7120174 7420857
11840G420857L70502L28088J75191K88114k76825r7271Q5935l18611J50590k14248
$$ 7420857 7791359 8119447 8294638 8582752 8305927 8208656 8294591 7975980 8126570 7912322
11830G912322j17646k91477l8721l51444Q97n2775k00859k33358l73988m44206
$$ 7912322 7794676 7503199 7464478 7113034 7113931 7061156 6860297 6626939 6252951 5808745
11820E808745j35047o28918k75111j42365l13699k03785J31170j56790k05789
$$ 5808745 5673698 5044780 4769669 4627304 4313605 4109820 4240990 4084200 3878411
11811C878411r2024P8770l59857Q1154j10195N9451K10583o8862l29423m3397
$$ 3878411 3786387 3865157 3505300 3586454 3476259 3535710 3746293 3677431 3348008 3304611
11801C304611K34491k4801p2408k00129J62215J32047o6358J70680P0170R0799
$$ 3304611 3539102 3514301 3441893 3241764 3403979 3536026 3469668 3640348 3710518 3801317
11791C801317J70604J33338K46514L30479M90903L12471K92670L7349L60694l50789
$$ 3801317 3971921 4105259 4351773 4682252 5173155 5485626 5778296 5815645 6176339 5825550
11781E825550K04934k82055l86166j84991n87910j80668l93437k12242k76490
$$ 5825550 6030484 5748429 5362263 5177272 4589362 4408694 4015257 3803015 3526525
11772C526525n9676o8360k8876j54930J44581m81806K52728j90060J81013k11116
$$ 3526525 3466849 3398489 3369613 3214683 3359264 2877458 3130186 2940126 3121139 2910023
11762B910023J07640j41784J89006r1596j25786r1511K42510j02847n8934k03
$$ 2910023 3017663 2875879 3064885 2973289 2847503 2755992 2998502 2895655 2836721 2836518
11752B836518J12639j28801J13418L1630J54753l04960K8607J65655j28448o0416
$$ 2836518 2949157 2820356 2933774 2965404 3120157 2815197 2843804 3009459 2881011 2820595
11742B820595J52928q8409J55605j43419j9039j10456k5322P3635L5578m22310
$$ 2820595 2973523 2885114 3040719 2897300 2878261 2767805 2742483 2816118 2851696 2429386
11732B429386J94015J61368o1519k11785K16124j05130J848j77175L88155j54495
$$ 2429386 2623401 2784769 2723250 2511465 2727589 2622459 2624307 2447132 2835287 2680792
11722B680792k5013j9879r472j76221K98295J205m1448l35099J60163K35907Q0455
$$ 2680792 2655779 2635900 2626428 2450207 2748502 2749707 2708259 2373160 2533323 2769230 2849685
11711B849685n87108N15796k89039N6084J74921j89995p2833K17159N7743j38365
$$ 2849685 2262577 2778373 2489334 2545418 2720339 2530344 2457511 2674670 2732413 2594048
11701B594048J72966J38613k81650n615J78655r3767R0052k01694J73228O3753
$$ 2594048 2767014 2905627 2623977 2618362 2797017 2703250 2793302 2591608 2764836 2828589
11691B828589o8836K19384l96348K78442K97575k93897J00250N9930P1029k4518
$$ 2828589 2759753 2979137 2582789 2861231 3158806 2864909 2965159 3025089 3096118 3071600
11681C071600l2650J29080L9245l2792k8532K08751j01270N4454q0866J92591
$$ 3071600 3038950 3168030 3207275 3174483 3145951 3354702 3253432 3307886 3227020 3419611
11671C419611j34229O8860J40086l44874R1141j6129K93506K4053j3309q2942
$$ 3419611 3285382 3354242 3494328 3149454 3240595 3224466 3517972 3542025 3528716 3445774
11661C445774j35606J05973L1265j36957P6729j68105K4105R8475K4527k6415
$$ 3445774 3310168 3416141 3447406 3310449 3387178 3219073 3243178 3341653 3366180 3339765
11651C339765J45941q7539j19310Q1019j50498j48032J05991k878q3766J41264
$$ 3339765 3485706 3398167 3278857 3359876 3209378 3061346 3167337 3164459 3080693 3221957
11641C221957m15323K90690n3334J0113K64826l20121K95854l6706j68488k2157
$$ 3221957 2806634 3097324 3043990 3054103 3318929 2998808 3294662 3257956 3089468 3067311
11631C067311M1620J87647j23520o3808K96403k19638P0354j41807j4142J24313
$$ 3067311 3108931 3296578 3173058 3109250 3405653 3186015 3256369 3114562 3100420 3224733
11621C224733j94591k19557J68234J04227P4864o0346o9470j7070o7618N7408
$$ 3224733 3030142 2810585 2978819 3083046 3157910 3097564 3028094 3011024 2943406 3000814
11611C000814p5532P8999j22341q4846M92188l22796J90498j50816P0653J80945
$$ 3000814 2925282 3004281 2881940 2797094 3289282 2966486 3156984 3006168 3076821 3257766
11601C257766p5540K20338K6336o1818n7781q8472P0906J10617J24180m6379k30879
$$ 3257766 3182226 3402564 3428900 3367082 3309301 3220829 3291735 3402352 3526532 3480153 3249274
11590C249274J25464L4862j45995O8388k17619L25746j33840n282J5964P5267
$$ 3249274 3374738 3409600 3263605 3331993 3114374 3440120 3306280 3300998 3316962 3392229
11580C392229K16594O7506k73649r8306P8046J70972J2409K69398l86133j1762
$$ 3392229 3608823 3676329 3402680 3304374 3382420 3553392 3565801 3835199 3449066 3437304
11570C437304K13606K1886k25216K33046m2158l3037M340n1706l8893M4250p1454
$$ 3437304 3650910 3672796 3447580 3680626 3638468 3605431 3609771 3558065 3519172 3563422 3491968
11559C491968j24566J8263O1261n3564P4071O7246J06230J91887n04008P8900
$$ 3491968 3367402 3385665 3446926 3393362 3467433 3534679 3640909 3832796 3328788 3407688
11549C407688Q4704k3467P5950M716j58066k23605K48443o9627J44274j17680
$$ 3407688 3492392 3468925 3544875 3549591 3391525 3167920 3416363 3346736 3491010 3373330
11539C373330J7987j80822K59276j57553n7592L00001j24936j2772k37259L58112
$$ 3373330 3391317 3210495 3469771 3312218 3254626 3554627 3429691 3416919 3179660 3537772
11529C537772k89871j19588L29750j72535J76327m09400J79263n2506K58230j56680
$$ 3537772 3247901 3128313 3458063 3285528 3461855 3052455 3231718 3179212 3437442 3280762
11519C280762q2164P0832J59792j65097L7893j4476L8536J0566L9924J2638j16784
$$ 3280762 3198598 3269430 3429222 3264125 3302018 3287542 3326078 3336644 3376568 3389206 3272422
11508C272422J05380J73687J64935l34677J48780N4919n4835r9540J91817j55646
$$ 3272422 3377802 3551489 3716424 3381747 3530527 3585446 3530611 3431071 3622888 3467242
11498C467242J00716n8469j28369K97773m1236o4484q9445p5198L01905l19566
$$ 3467242 3567958 3509489 3381120 3678893 3637657 3573173 3483728 3408530 3710435 3390869
11488C390869K39765l1552j73363L10538J2659j19024j1826N8617J23663j46180
$$ 3390869 3630634 3599082 3425719 3736257 3748916 3629892 3618066 3676683 3800346 3654166
11478C654166K3888K60228j29920J54831j04161o9839J90526m9883N1078K9337
$$ 3654166 3678054 3938282 3808362 3963193 3859032 3789193 3979719 3929836 3980914 4010251
11468D010251m05993J44358J2684j666j86346K78545J9309j90669j33523O0220
$$ 4010251 3604258 3748616 3761300 3759634 3573288 3851833 3871142 3680473 3546950 3607170
11458C607170K96981k44360j24809K07430k28752J37360N8567k8674K79914q2608
$$ 3607170 3904151 3659791 3534982 3742412 3513660 3651020 3709587 3680913 3960827 3878219
11448C878219l6328k75914K19882n81k30819K48965M9040M798k713P61J12474
$$ 3878219 3841891 3565977 3785859 3785278 3554459 3803424 3852464 3857262 3854549 3855310 3967784
11437C967784k26136J97646n7145K28028p2725r9229J76046k1116L06002Q0830
$$ 3967784 3741648 3939294 3882149 4110177 4037452 3938223 4114269 4093153 4399155 4479985
11427D479985l0218J17169k69688K45052q5568J28553K61413k4356Q2912k10469
$$ 4479985 4449767 4566936 4297248 4542300 4456732 4585285 4846698 4822342 4905254 4694785
11417D694785q1078J97178K75389j96202K05463J20201J699L7580p8775K46482
$$ 4694785 4613707 4810885 5086274 4890072 5095535 5215736 5217435 5255015 5176240 5422722
11407E422722r3018J84070J19519k68417K24108K90562N1332k70785L39198J8684
$$ 5422722 5329704 5513774 5633293 5364876 5588984 5879546 5930878 5660093 5999291 6017975
11397F017975J73317n0908K43076J51839J33011k2770K07633r2620N37844j06401
$$ 6017975 6191292 6140384 6383460 6535299 6668310 6645540 6853173 6760553 7298397 7191996
11387G191996N1664J61164P1329M9669K86056k02436J10719L13804K85387p5048
$$ 7191996 7243660 7404824 7476153 7525822 7811878 7609442 7720161 8033965 8319352 8244304
11377H244304O5587J86236Q3204k0919K69491M2434J71109K8192J8964N7218K77294
$$ 8244304 8309891 8496127 8579331 8558412 8827903 8870337 9041446 9069638 9088602 9145820 9423114
11366I423114k78659K03779P8115L9155J85931j00411l0440J66584L3001O0164
$$ 9423114 9144455 9348234 9426349 9465504 9651435 9551024 9520584 9687168 9720169 9780333
11356I780333M9742o9327J30296R470r1372o56J84982k29531K08447k9681j75768
$$ 9780333 9830075 9760748 9891044 9900514 9809142 9808486 9993468 9763937 9972384 9942703 9766935
11345I766935k75k5289J57326k98945J55678J02389k74400j25848K30522l75137
$$ 9766935 9766660 9741371 9898697 9599752 9755430 9857819 9583419 9457571 9688093 9312956
11335I312956j5304l0659j54796J17089l0292j92082l1035l7429j06364j65142
$$ 9312956 9297652 9266993 9112197 9229286 9198994 9006912 8975877 8938448 8832084 8666942
11325H666942r7834j1320k29177j96295K45369k42723k4967p2773m42041J33162
$$ 8666942 8569108 8557788 8328611 8132316 8377685 8134962 8109995 8037222 7595181 7728343
11315G728343k72034J6210j26361n3814j21290k06708j2219m47935J63074k0657
$$ 7728343 7456309 7472519 7346158 7292344 7171054 6964346 6952127 6504192 6667266 6646609
11305F646609l88703q4630k04678q9253j93939M0155o6589k81696o8819j76424
$$ 6646609 6257906 6173276 5968598 5879345 5685406 5725561 5658972 5377276 5308457 5132033
11295E132033J2869J51593k24929k21741k59256J48950M4809k30724j59045J17817
$$ 5132033 5144902 5296495 5071566 4849825 4590569 4739519 4784328 4553604 4394559 4512376
11285D512376j58531J36641l35158j49446R3004j66384O5k4844J59573k42208
$$ 4512376 4353845 4490486 4155328 4005882 4098886 3932502 3932567 3907723 4067296 3825088
11275C825088N983l32256J72661l4466m1805J00233j42176q0068J21963l59186
$$ 3825088 3831071 3498815 3671476 3637010 3595205 3695438 3553262 3473194 3595157 3235971
11265C235971Q6741J47248k18040j04181K41109p4971Q5798j93305O4114k16501
$$ 3235971 3322712 3469960 3251920 3147739 3388848 3313877 3399675 3206370 3270484 3053983
11255C053983J20801o7534O56q7534j38804R835K27978k9853r7700J38428m4477
$$ 3053983 3174784 3107250 3107906 3020372 2881568 2891403 3119381 3089528 2991828 3130256 3085779
11244C085779r5073j25648L40440k00515r9076J22936P9431r7685P8710k24358
$$ 3085779 2990706 2865058 3205498 3004983 2905907 3028843 3108274 3010589 3089299 2864941
11234B864941R1516L47535o4291r0086j74113L1505k7189m0680J57227O4241N17606
$$ 2864941 2956457 3303992 3239701 3149615 2975502 3007007 2979818 2939138 3096365 3160606 3678212
11223C678212M90402Q96979P12450M57414L27978J08983J40397N0041J5024k58465
$$ 3678212 4168614 5065593 5778043 6235457 6563435 6672418 6812815 6862856 6877880 6619415
11213F619415p3469q19007o01144o24186q33025J00599m77722j78656R6631j24372
$$ 6619415 6545946 5726939 5125795 4501609 3668584 3769183 3291461 3112805 3209436 3085064
11203C085064K36892l30620R7771P0832j33374K34353n6176M04688K16890L99376
$$ 3085064 3321956 2991336 3089107 3159939 3026565 3260918 3204742 3609430 3826320 4225696
11193D225696R29535P77878M40936L69648K77992J51225m21322K99939k16212
$$ 4225696 5155231 5933109 6374045 6743693 7021685 7172910 6751588 7051527 6835315
11184F835315m92414n60875p00749p87098n05709k63510j27750k05020L005o5471
$$ 6835315 6342901 5782026 5081277 4294179 3788470 3524960 3397210 3192190 3195195 3129724
11174C129724r2237O0267J27069K7375l04722L57348L8867n0106o0902J86058
$$ 3129724 3037487 3097754 3224823 3252198 2947476 3304824 3343691 3293585 3232683 3418741
11164C418741k87606L4836J7550K29308K3214m2161j09719J17999J17889M2592
$$ 3418741 3131135 3165971 3183521 3412829 3436043 3393882 3284163 3402162 3520051 3562643
11154C562643k39395J20897j2241q8869K67093j63688o6687K53550k3793J5750
$$ 3562643 3323248 3444145 3431904 3343035 3610128 3446440 3379753 3633303 3609510 3625260
11144C625260j86736R8127M0190J0352j00964r4870K92122q3650j11592K63804
$$ 3625260 3438524 3536651 3576841 3587193 3486229 3391359 3683481 3599831 3488239 3752043
11134C752043K0837o4728k74725L23638j03970J84410j73774J36336Q6671J3311
$$ 3752043 3772880 3708152 3433427 3757065 3653095 3837505 3663731 3800067 3886738 3900049
11124C900049l7909k92522J83848L15031k13277j3471J1124J21099p208J3045
$$ 3900049 3862140 3569618 3753466 4068497 3855220 3841749 3852873 3973972 3966764 3979809
11114C979809r5592P5433K06810j2353P7703j8106j29556j19374K04641k60202
$$ 3979809 3884217 3959650 4166460 4154107 4231810 4213704 4084148 3964774 4169415 3909213
11104C909213L02061k75575K64962J30283r3123p6878j31341o8794J47500P318
$$ 3909213 4211274 3935699 4200661 4330944 4237821 4160943 4029602 3960808 4108308 4115626
11094D115626o9300L58805m24105M7082l9293m1727K45730k16191j87051J85881
$$ 4115626 4046326 4405131 3981026 4028108 3988815 3947088 4192818 3976627 3789576 3975457
11084C975457j6387N5869j06290R3567l4910P553m9945n7906K46683j5331m2613
$$ 3975457 3959070 4014939 3908649 4002216 3967306 3974859 3924914 3867008 4113691 4098360 4055747
11073D055747j68762Q0688o8366q3197K15825J30989J02466Q9302J51343j17754
$$ 4055747 3886985 3967673 3899307 3816110 4031935 4162924 4265390 4354692 4506035 4388281
11063D388281K14503j84778L18664j23196j9581J82125R7130J74367j15755l9433
$$ 4388281 4602784 4418006 4736670 4613474 4593893 4776018 4873148 5047515 4931760 4892327
11053D892327J54157n997L41768k39193O3598j9203l3151J92681p820K6945J14053
$$ 4892327 5046484 5040487 5382255 5143062 5206660 5187457 5154306 5346987 5339167 5366112 5480165
11042E480165l5589M1644N5407J84285J72438j43850M1486J1559K22233L80010
$$ 5480165 5444576 5486220 5541627 5725912 5898350 5754500 5795986 5807545 6029778 6409788
11032F409788j28928K39447L9336J43811O2663M80517L08689j03976L54728p5152
$$ 6409788 6280860 6520307 6559643 6703454 6766117 7246634 7555323 7451347 7806075 7730923
11022G730923L14594j2221J37039L90518k14201K01504m2839M20404L7045J42724
$$ 7730923 8045517 8033296 8170335 8560853 8346652 8548156 8505317 8925721 8962766 9105490
11012I105490K83838j43568K73986N7581N7897P5154L28440K39064R2051J04870
$$ 9105490 9389328 9245760 9519746 9577327 9635224 9710378 10038818 10277882 10369933 10474803
11002A0474803L77877L40111Q1925K68327K87755J48994J91064J61032K65045
$$ 10474803 10852680 11192791 11274716 11543043 11830798 11979792 12170856 12331888 12596933
10993A2596933Q7293M13240j4207J82690J68441K63371k3955l0173L40248M5746
$$ 12596933 12684226 13097466 13083259 13265949 13434390 13697761 13673806 13643633 13983881 14029627
10983A4029627J18127M34147L87398N11117K12768K56377K52833L06492K19763
$$ 14029627 14147754 14581901 14969299 15480416 15693184 15949561 16202394 16508886 16728649
10974A6728649M84055j03717M12715o0496K77403L11712K8243M37479K01597M14664
$$ 16728649 17212704 17108987 17521702 17461206 17738609 18050321 18078564 18516043 18717640 19132304
10964A9132304L33880J21477O85754K84926O25604K50734M06029Q3876O86951
$$ 19132304 19466184 19587661 20273415 20558341 21183945 21434679 21840708 21924584 22611535
10955B2611535M92484N41072O77104M29433M47307M84733N63557K81202N21966
$$ 22611535 23104019 23645091 24322195 24751628 25198935 25683668 26247225 26528427 27050393
10946B7050393M49508M40028O29901J83519M61104K74406P49579K58427P28876
$$ 27050393 27499901 27939929 28569830 28753349 29214453 29488859 30238438 30496865 31225741
10937C1225741N83029N85868Q14813O27896N04782O61520Q45272N31191P82442
$$ 31225741 31808770 32394638 33209451 33837347 34342129 35003649 35848921 36380112 37162554
10928C7162554P27076N73344Q10713O05858P05844P52341O68459O82644O40818
$$ 37162554 37889630 38462974 39273687 39879545 40585389 41337730 42006189 42688833 43329651
10919D3329651N79644L93329O33688K47419J13659M40276O1713J36673Q6509m73450
$$ 43329651 43909295 44302624 44936312 45183731 45297390 45737666 45799379 45936052 46022561 45549111
10909D5549111K27796k87977K02811p1162j69679M9371K03894l9155J81869j04620
$$ 45549111 45776907 45488930 45691741 45620579 45450900 45500271 45704165 45665010 45846879 45742259
10899D5742259L74795Q3607K89027M56642J56266K62487N42110M19140O78358
$$ 45742259 46117054 46200661 46489688 46946330 47102596 47365083 47907193 48326333 49004691
10890D9004691N04609P79575J025884P91055J122644J413209J488274J627712
$$ 49004691 49509300 50288875 51314759 52105814 53228458 54641667 56129941 57757653
10882E7757653K147688J748384K465097K786124L207537L342564L567410L767365
$$ 57757653 59905341 61653725 64118822 66904946 70112483 73455047 77022457 80789822
10874H0789822L855016L916688L693020L569359K935942K456537J692153J280347
$$ 80789822 84644838 88561526 92254546 95823905 98759847 101216384 102908537 104188884
10866A04188884L30190j83598j270746j697614j853285l045432k804249l241533
$$ 104188884 104519074 104335476 103064730 101367116 99513831 96468399 93664150 90422617
10858I0422617l773132l411065l943263l475707m153162l343911l615791l499539
$$ 90422617 86649485 83238420 79295157 75819450 71666288 68322377 64706586 61207047
10850F1207047l222495l360392k896568l124687k586286k777923k703733j937016
$$ 61207047 57984552 54624160 51727592 48602905 46016619 43238696 40534963 38597947
10842C8597947k417031j873136k032516j738826j648981j472850j532595j362230
$$ 38597947 36180916 34307780 32275264 30536438 28887457 27414607 25882012 24519782
10834B4519782j357367j062274j175687j062096r53828r07999p91315n94893q19853
$$ 24519782 23162415 22100141 20924454 19862358 18908530 18000531 17209216 16614323 15794470
10825A5794470o26445p73596o98082k74486o22757o34352l21049l49860n84229
$$ 15794470 15168025 14394429 13696347 13421861 12799104 12164752 11843703 11493843 10909614
10816A0909614j57727m05336k69750k78053k96346l16978j26233l98879Q0481
$$ 10909614 10751887 10346551 10076801 9798748 9502402 9185424 9059191 8660312 8740793
10807H740793l54237j04791j42973k40708j44501k9492l29457j3490k90763m47070
$$ 8740793 8386556 8281765 8138792 7898084 7753583 7724091 7394634 7381144 7090381 6643311
10797F643311k0069l32248j03715j29316k46977k03980O90j75936p8581q6068
$$ 6643311 6623242 6290994 6187279 6057963 5810986 5607006 5607696 5431760 5353179 5267111
10787E267111r9063K49868j67881j21366r5540j7526j16080r9995q6358j29595
$$ 5267111 5168048 5417916 5250035 5128669 5033129 5015603 4899523 4799528 4713170 4583575
10777D583575k31820j23451M02365k00262K082m40390J68827R2202l09658j10527
$$ 4583575 4351755 4228304 4630669 4430407 4432489 3992099 4160926 4253128 3943470 3832943
10767C832943J9907m445j25950Q9885q4115O4294j42008q9024j39754L68304m0654
$$ 3832943 3852850 3848405 3722455 3812340 3728225 3792519 3650511 3561487 3421733 3790037 3749383
10756C749383l05718L2756J25575j79056J07554Q6104J17229l6775k60699K37194
$$ 3749383 3443665 3476421 3601996 3422940 3530494 3616598 3733827 3697052 3436353 3673547
10746C673547k98975K14797k52778J08794j86493j9421j88731j27589J46758q5622
$$ 3673547 3374572 3589369 3336591 3445385 3258892 3239471 3050740 2923151 3069909 2984287
10736B984287o1317j37096l5053l853J75797Q926J54778j8324k52660K77643R1985
$$ 2984287 2922970 2785874 2750821 2746968 2922765 2931691 3086469 3068145 2815485 3093128 3185113
10725C185113j88886N9645m5840K47244o9208n5330j13840J8113Q0441r6138j39412
$$ 3185113 2996227 3055872 3010032 3257276 3188068 3132738 3018898 3037011 3117452 3021314 2881902
10714B881902r5241K58293k37578L35044l41775K27923l7845Q2322M629M4198
$$ 2881902 2786661 3044954 2807376 3142420 2800645 3028568 2990723 3073045 3077674 3121872
10704C121872J07121n9246q1137j06019r423l470r247M3808l4425n86J78683k06631
$$ 3121872 3228993 3169747 3088610 2982591 2973168 2969698 2960451 3004259 2969834 2969248 3147931 2941300
10692B941300K38742j90351j65135P9357J9881j58151J08889j60057N7097m9385
$$ 2941300 3180042 2989691 2824556 2903913 2923794 2765643 2874532 2714475 2771572 2722187
10682B722187l455m3652K80933k84538Q8983J0203M226J31462O1551L15463p8551
$$ 2722187 2718732 2675080 2956013 2671475 2760458 2770661 2774887 2906349 2967900 3283363 3204812
10671C204812q0128O2110J20441k40033j70253K07278k93415J44023l17510J48906
$$ 3204812 3124684 3186794 3307235 3067202 2896949 3104227 2810812 2954835 2637325 2786231
10661B786231j29694j18964J4342j24026J66066j04828j33666K837M9523Q885
$$ 2786231 2656537 2537573 2551915 2427889 2593955 2489127 2355461 2358298 2407821 2416706
10651B416706J86876J47539P420Q4365j94335J56594k1984m1927j71204J24588
$$ 2416706 2603582 2751121 2758541 2842906 2648571 2805165 2783181 2741254 2570050 2694638
10641B694638k23243j62341p6352O801r8420j64158R075k5153N2913j40474J27829
$$ 2694638 2471395 2309054 2232702 2239503 2141083 1976925 1986000 1960847 2013760 1873286 2001115
10630B001115k5597j56228J45462j689q9278r8195P0528J58075Q6765J1746k91088
$$ 2001115 1975518 1819290 1964752 1963063 1873785 1775590 1846118 2004193 2090958 2102704 1811616
10619A811616K62003k4663o884j28068O8743j81538L31871p6762l19069K80551
$$ 1811616 2073619 2048956 2042072 1914004 1982747 1801209 2133080 2056318 1737249 2017800
10609B017800m6579m4831r5384r2935J7467J70520k54397m5962N20806j77232
$$ 2017800 1971221 1926390 1831006 1738071 1755538 1926058 1671661 1625699 2146505 1969273
10599A969273o6621l3402J4837k23241N10903k77211N632k1651j77803P1193l2703
$$ 1969273 1902652 1869250 1884087 1660846 2171749 1894538 1900170 1878519 1700716 1771909 1739206
10588A739206O4477p8462J84296M2041l19791J14388J15956R7834j50838L2315
$$ 1739206 1803683 1725221 1909517 1951558 1631767 1746155 1862111 1959945 1809107 1841422
10578A841422p4194p6639L21603M5289k35124M40076m28915K1186j04126K16586
$$ 1841422 1767228 1690589 2012192 2057481 1822357 2262433 1833518 1854704 1750578 1967164
10568A967164M9638j95343k73254K63365m3680j77882j67730J44476j29262L43780
$$ 1967164 2016802 1821459 1548205 1811570 1767890 1590008 1422278 1566754 1437492 1781272
10558A781272n2253l93330l3430K66861M205j29598j50374L58674j67790J02927
$$ 1781272 1729019 1335689 1302259 1569120 1573325 1443727 1293353 1652027 1484237 1587164
10548A587164j9892N2288m34148J71577N9907k42886K48058r3158L7476R1821
$$ 1587164 1567272 1619560 1185412 1356989 1416896 1174010 1422068 1328910 1366386 1458207
10538A458207j16927L33023k03205J56086j72778J15664k30294J04988J17110
$$ 1458207 1341280 1674303 1471098 1627184 1454406 1570070 1339776 1444764 1561874
10529A561874j6644j22769j10800K18865R0052Q3024k28444J32783K47639p7286
$$ 1561874 1545230 1422461 1311661 1530526 1620578 1703602 1475158 1607941 1855580 1778294
10519A778294L15816N2303K71501M3095p5708L43597L9614r7495J36406j71912
$$ 1778294 2094110 2146413 2417914 2461009 2385301 2728898 2768512 2671017 2807423 2635511
10509B635511j38065k1544m22576k26279o2798k4545K02877j97607K20354m21734
$$ 2635511 2497446 2475902 2053326 1827047 1764249 1739704 1942581 1744974 1965328 1543594
10499A543594J69607j095R6780J2833J23463R4139j78222J67407J28052J30528
$$ 1543594 1713201 1712106 1808886 1821719 1945182 2039321 1861099 2028506 2156558 2287086
10489B287086K35714J03616J60004q1956N0512J61245L0559k57430J38843l36980
$$ 2287086 2522800 2626416 2786420 2704464 2754976 2916221 2946780 2689350 2828193 2491213
10479B491213q1350j37265k23100J03265r93k52035M10024k96002L2835O6147
$$ 2491213 2409863 2272598 2049498 2152763 2151770 1899735 2309759 2013757 2046592 2112739
10469B112739M4048k2760j41970K36806J15572J44544k984J45520J64437p7785
$$ 2112739 2156787 2134027 1992057 2228863 2344435 2488979 2485995 2631515 2795952 2718167
10459B718167p5194J4418m7964J68605j72037n6084k36356j20541N5029J66757
$$ 2718167 2642973 2657391 2609427 2778032 2605995 2549911 2313555 2193014 2248043 2414800
10449B414800K28101l39093J24057j03741J30903k8882J58095J05692r6932N8499
$$ 2414800 2642901 2303808 2427865 2324124 2455027 2426145 2584240 2689932 2593000 2651499
10439B651499L44523K60407K53308o8969L15140O8293J61724k58576J86643j90431
$$ 2651499 2996022 3256429 3509737 3440768 3755908 3824201 3985925 3727349 3913992 3723561
10429C723561j97649k12460j20611j72988l66156q8360j10661M517n8395O9813
$$ 3723561 3525912 3313452 3192841 3019853 2653697 2565337 2454676 2459193 2400798 2470611
10419B470611l46045K00237j74455K54422j79525J14589O8510k29149L13856J62553
$$ 2470611 2124566 2324803 2150348 2404770 2225245 2339834 2408344 2179195 2493051 2655604
10409B655604N5190O69404j64485K79927q3327K97106L02375O2975n371k70602
$$ 2655604 2710794 3380198 3215713 3495640 3412313 3709419 4011794 4074769 4069398 3798796
10399C798796J74848l1111j43569K15258R734J98597m7878L84207o9130J79028
$$ 3798796 3973644 3942533 3798964 4014222 4023956 4222553 4174675 4558882 4489752 4668780
10389D668780J07551K46092K84264J97542P1835J1029j12021K37317j18102J0279
$$ 4668780 4776331 5022423 5306687 5504229 5576064 5587093 5475072 5712389 5594287 5604566
10379E604566J43198J699J02030n4419K6076j28843L2729K977L30945l20603O1764
$$ 5604566 5747764 5749463 5851493 5797074 5823150 5694307 5727036 5730013 6060958 5740355 5802119
10368E802119K81829j43818P802J55882m0327r2264J73822q9358k9889k50886
$$ 5802119 6083948 5940130 5947932 6103814 6063487 5971223 6145045 6055687 6025798 5774912
10358E774912J0283l76425K05176k63940L6124j42140k0874J79282j49804o237
$$ 5774912 5785195 5408770 5613946 5350006 5386130 5243990 5223116 5402398 5252594 5246357
10348E246357O9083k24971k40561M9854j26538j6782k24738j22502K38k882m9470
$$ 5246357 5315440 5090469 4849908 4899762 4773224 4756442 4531704 4409202 4409440 4406558 4357088
10337D357088J23417m2176J44871J61581k55232M04455n5830J43045l45443J30370
$$ 4357088 4480505 4438329 4583200 4744781 4489549 4894004 4838174 4981219 4635776 4766146
10327D766146K4387r5355l6043q4019j31095N7187j15568J57809n4636P3401j85271
$$ 4766146 4790533 4695178 4659135 4575116 4444021 4501208 4385640 4543449 4488813 4562214 4376943
10316D376943J32827o3458k6081K84104j28059K0774j2068K48767J34694J57217
$$ 4376943 4509770 4446312 4420231 4704335 4576276 4597050 4584982 4833749 4968443 5125660
10306E125660O3974K12165J04696j68079P1475J98000K3870n9485k03083j93004
$$ 5125660 5189634 5401799 5506495 5338416 5409891 5607891 5631761 5572276 5369193 5176189
$$ [...]
##END NTUPLES=NMR SPECTRUM
##END=
