##TITLE=Coffee green (M5-ROVE60 + 1.5mL buffer 50/50,  450uL extracto + 50uL (D2O+TMS))
without heating, vortex and centrifuged, temperature 0oC.
##JCAMPDX= 6.0         $$ Bruker NMR JCAMP-DX V2.0
##DATA TYPE= NMR SPECTRUM
##DATA CLASS= NTUPLES
##ORIGIN= Bruker BioSpin GmbH
##OWNER= Administrator
$$ 1.72 TOPSPIN		Version 2.1
$$ 2012-05-22 16:14:50.340 -0700  Administrator@X
$$ Compression mode = diff/dup
##.OBSERVE FREQUENCY= 400.13188198
##.OBSERVE NUCLEUS= ^1H
##.ACQUISITION MODE= SIMULTANEOUS (DQD)
##.ACQUISITION SCHEME= undefined
##.AVERAGES= 64
##.DIGITISER RES= 22
##SPECTROMETER/DATA SYSTEM= spect
##.PULSE SEQUENCE= noesygppr1d
##.SOLVENT NAME= H2O+D2O
##.SHIFT REFERENCE= INTERNAL, H2O+D2O, 1, 14.97969
##AUDIT TRAIL= $$ (NUMBER, WHEN, WHO, WHERE, PROCESS, VERSION, WHAT)
$$ ##TITLE= Audit trail, TOPSPIN		Version 2.1
$$ ##JCAMPDX= 5.01
$$ ##ORIGIN= Bruker BioSpin GmbH
$$ ##OWNER= Administrator
$$ $$ C:\Bruker\TOPSPIN/data/jwist/nmr/11-coffee-green-quantification-2/251/pdata/1/auditp.txt
$$ ##AUDIT TRAIL=  $$ (NUMBER, WHEN, WHO, WHERE, PROCESS, VERSION, WHAT)
(   1,<2011-11-18 14:00:58.404 -0500>,<Administrator>,<TOPSPIN>,<go>,<TOPSPIN 2.1>,
      <created by zg
	started at 2011-11-18 13:52:03.794 -0500,
	POWCHK enabled, PULCHK disabled,
       configuration hash MD5:
       DA 63 81 1B EF 4C B5 72 B4 DF EA D9 B4 DB 4C 08
       data hash MD5: 64K
       46 8C 2D 4A DA 98 7F 5B 7B 93 E3 DC 52 28 23 1C>)
(   2,<2011-11-18 15:25:21.966 -0500>,<Administrator>,<TOPSPIN>,<proc1d>,<TOPSPIN 2.1>,
      <Start of raw data processing
       efp LB = 0 FT_mod = 6 PKNL = 1 PHC0 = 0 PHC1 = 0 SI = 32K 
       data hash MD5: 32K
       D3 85 57 79 CC 69 D0 22 89 A7 C1 8C AB A6 F1 B2>)
(   3,<2011-11-18 15:25:22.372 -0500>,<Administrator>,<TOPSPIN>,<proc1d>,<TOPSPIN 2.1>,
      <pk PHC0 = 23.15369 PHC1 = 0 
       data hash MD5: 32K
       F9 B2 A0 7A 6E 99 9C D1 A0 0B 61 FA 86 DD D7 2D>)
$$ ##END=
$$ 
$$ $$ hash MD5
$$ $$ 81 AE DA 3F EC 5B DE 29 C8 27 89 1F 43 EA 50 AC
##$RELAX= 
##$RELAX= 
##$RELAX= 
##$RELAX= 
##$RELAX= 
$$ Bruker specific parameters
$$ --------------------------
##$DU= <Z:>
##$EXPNO= 251
##$NAME= <11-coffee-green-quantification-2>
##$PROCNO= 1
##$TYPE= <nmr>
##$USER= <jwist>
##$ACQT0= -8.18310422632632
##$AMP= (0..31)
100 100 100 100 100 100 100 100 100 100 100 100 100 100 100 100 100 100
100 100 100 100 100 100 100 100 100 100 100 100 100 100
##$ANAVPT= -1
##$AQSEQ= 0
##$AQ_mod= 3
##$AUNM= <au_prof>
##$AUTOPOS= <>
##$BF1= 400.13
##$BF2= 400.13
##$BF3= 400.13
##$BF4= 400.13
##$BF5= 400.13
##$BF6= 400.13
##$BF7= 400.13
##$BF8= 400.13
##$BYTORDA= 0
##$CFDGTYP= 0
##$CFRGTYP= 9
##$CHEMSTR= <none>
##$CNST= (0..63)
1 1 145 1 1 1 1 1 1 1 1 1 1 1 1 1 1 1 1 1 1 1 1 1 1 1 1 1 1 1 1 1 1 1 1
1 1 1 1 1 1 1 1 1 1 1 1 1 1 1 1 1 1 1 1 1 1 1 1 1 1 1 1 1
##$CPDPRG= <>
##$CPDPRG1= <>
##$CPDPRG2= <>
##$CPDPRG3= <>
##$CPDPRG4= <mlev>
##$CPDPRG5= <mlev>
##$CPDPRG6= <mlev>
##$CPDPRG7= <mlev>
##$CPDPRG8= <mlev>
##$CPDPRGB= <>
##$CPDPRGT= <>
##$D= (0..63)
$$ [...]
##$TP= (0..7)
150 150 150 150 150 150 150 150
##$TP07= 0
##$TPNAME0= <>
##$TPNAME1= <>
##$TPNAME2= <>
##$TPNAME3= <>
##$TPNAME4= <>
##$TPNAME5= <>
##$TPNAME6= <>
##$TPNAME7= <>
##$TPOAL= (0..7)
0.5 0.5 0.5 0.5 0.5 0.5 0.5 0.5
##$TPOFFS= (0..7)
0 0 0 0 0 0 0 0
##$TUNHIN= 0
##$TUNHOUT= 0
##$TUNXOUT= 0
##$USERA1= <user>
##$USERA2= <user>
##$USERA3= <user>
##$USERA4= <user>
##$USERA5= <user>
##$V9= 5
##$VALIST= <valist>
##$VCLIST= <CCCCCCCCCCCCCCC>
##$VD= 0
##$VDLIST= <DDDDDDDDDDDDDDD>
##$VPLIST= <PPPPPPPPPPPPPPP>
##$VTLIST= <TTTTTTTTTTTTTTT>
##$WBST= 2048
##$WBSW= 25
##$XGAIN= (0..3)
0 0 0 0
##$XL= 0
##$YL= 0
##$YMAX_a= 5391146
##$YMIN_a= -1919899
##$ZGOPTNS= <>
##$ZL1= 120
##$ZL2= 120
##$ZL3= 120
##$ZL4= 120
##$ABSF1= 0
##$ABSF2= 0
##$ABSG= 0
##$ABSL= 0
##$ALPHA= 0
##$AQORDER= 0
##$ASSFAC= 0
##$ASSFACI= 0
##$ASSFACX= 0
##$ASSWID= 0
##$AUNMP= <proc_prof1d>
##$AXLEFT= 0
##$AXNAME= <>
##$AXNUC= <1H>
##$AXRIGHT= 0
##$AXTYPE= 0
##$AXUNIT= <>
##$AZFE= 0.1
##$AZFW= 0.1
##$BCFW= 0
##$BC_mod= 0
##$BYTORDP= 0
##$COROFFS= 0
##$CY= 15
##$DATMOD= 1
##$DC= 0
##$DFILT= <>
##$DTYPP= 0
##$F1P= 0
##$F2P= 0
##$FCOR= 0.5
##$FTSIZE= 32768
##$FT_mod= 6
##$GAMMA= 0
##$GB= 0
##$INTBC= 1
##$INTSCL= 1
##$ISEN= 128
##$LB= 0
##$LEV0= 0
##$LPBIN= 0
##$MAXI= 10000
##$MC2= 0
##$MEAN= 0
##$ME_mod= 0
##$MI= 0
##$NCOEF= 0
##$NC_proc= -6
##$NLEV= 6
##$NOISF1= 0
##$NOISF2= 0
##$NSP= 0
##$NTH_PI= 0
##$NZP= 0
##$OFFSET= 14.97969
##$PC= 1
##$PHC0= 23.15369
##$PHC1= 0
##$PH_mod= 1
##$PKNL= yes
##$PPARMOD= 0
##$PPDIAG= 0
##$PPIPTYP= 0
##$PPMPNUM= 2147483647
##$PPRESOL= 1
##$PSCAL= 4
##$PSIGN= 0
##$PYNMP= <proc.py>
##$REVERSE= no
##$SF= 400.13
##$SI= 32768
##$SIGF1= 0
##$SIGF2= 0
##$SINO= 400
##$SIOLD= 32768
##$SPECTYP= <>
##$SREGLST= <1H.CDCl3>
##$SSB= 0
##$STSI= 32768
##$STSR= 0
##$SW_p= 8223.68421052631
##$SYMM= 0
##$S_DEV= 0
##$TDeff= 65536
##$TDoff= 0
##$TI= <>
##$TILT= no
##$TM1= 0
##$TM2= 0
##$TOPLEV= 0
##$USERP1= <user>
##$USERP2= <user>
##$USERP3= <user>
##$USERP4= <user>
##$USERP5= <user>
##$WDW= 1
##$XDIM= 32768
##$YMAX_p= 290397122
##$YMIN_p= -409795
##$CURPLOT= <Network HP LaserJet P1505>
##$CURPRIN= <$Network HP LaserJet P1505>
##$DFORMAT= <normdp>
##$LAYOUT= <+/1D_H.xwp>
##$LFORMAT= <normlp>
##$PFORMAT= <normpl>
##$SURQMSG= 1
$$ End of Bruker specific parameters
$$ ---------------------------------
##NTUPLES= NMR SPECTRUM
##VAR_NAME=  FREQUENCY,     SPECTRUM/REAL,   SPECTRUM/IMAG
##SYMBOL=    X,             R,               I
##VAR_TYPE=  INDEPENDENT,   DEPENDENT,       DEPENDENT
##VAR_FORM=  AFFN,          ASDF,            ASDF
##VAR_DIM=   32768,         32768,           32768
##UNITS=     HZ,            ARBITRARY UNITS, ARBITRARY UNITS
##FACTOR=    0.250966925370066, 1,           1
##FIRST=     8223.43324360094, 25655,        -256705
##LAST=      0,             -22212,          -196222
##MIN=       0,             -409795,         0
##MAX=       8223.43324360094, 290397122,    0
$$ Real data points
##PAGE= N=1
##DATA TABLE= (X++(R..R)), XYDATA
$$ [...]
19647B201750r2934K42652j22507j50630M3419J33139m1371R300J006k50812L81854
19636B354866j32960j383M9196r3980L78065l03896J92850k82042j2209n0637
19626B097870L24193j36230m15884M06395j69806J52675k61396O5831R6921m7335
19616B113234j47025J16549K28941k88720J23197k35641O925J22631m8585j89080
19606A802426J15292j03818R5554P2859k03530K20262J6707j60742J6162j03996
19596A767176L55330k85607O603J24368n3814K6211P8698r9135q2918K71349k38205
19585A870056K0071Q8595q8582p5237K94373j49152K7298j01538K16454j12836
19575A989502J06913j83631k01741K66103o502j41782O5485p4591o7348J71034
$$ plain form
19647 2201750 2108816 2351468 2228961 2078331 2121750 2254889 2213518 2222818 2223824 1973012 2354866
19636 2354866 2221906 2220523 2269719 2175739 2553804 2249908 2442758 2160716 2148507 2097870
19626 2097870 2422063 2285833 1869949 2276344 2106538 2259213 1997817 2063648 2160569 2113234
19616 2113234 1966209 2082758 2311699 2022979 2146176 1910535 1917460 2040091 1991506 1802426
19606 1802426 1917718 1813900 1909454 1982313 1778783 1999045 2015752 1855010 1871172 1767176
19596 1767176 2122506 1836899 1843502 1967870 1914056 1940267 2018965 1919830 1836912 2108261 1870056
19585 1870056 1890127 1978722 1890140 1814903 2109276 1960124 1987422 1885884 2102338 1989502
19575 1989502 2096415 1912784 1711043 1977146 1970644 1828862 1894347 1819756 1752408 1923442
19565A923442j68648J83731L09213l88053J60099j26363P1109J56205m885j59778
19555A956072k03533L55424k65535Q2987j10382J34625k78226K40073j4659j31607
19545A765239K34605j15520j12343J95539j27736j01872N6824J714j4657P871
19535A789664j45919M8089J4371J5890j83500K85956l50239K69315m9735j02230
19525A591662K08818k82107K85795o627q0838M3324j37365p6311K79843j30349
19515A695845J20550r2230Q6419l8931L118k62143J53708q7432o240K16226k19749
19504A569141K50661O0129k06255q0116J69517j90198J64354j96157J99772j96433
19494A544415P8650r2783L3979M148J93308r8697j01599j04661J45059l2168r6656
$$ plain form
19565 1923442 1754794 1938525 2247738 1859685 2019784 1893421 1964530 2120735 2115850 1956072
19555 1956072 1752539 2107963 1842428 1925415 1815033 1949658 1671432 1911505 1896846 1765239
19545 1765239 1999844 1884324 1771981 1967520 1839784 1737912 1794736 1796450 1781793 1789664
19535 1789664 1643745 1691834 1706205 1722095 1538595 1824551 1474312 1743627 1693892 1591662
19525 1591662 1800480 1518373 1804168 1797541 1716703 1760027 1622662 1546351 1826194 1695845
19515 1695845 1816395 1724165 1810584 1771653 1774771 1512628 1666336 1578904 1572664 1788890 1569141
19504 1569141 1819802 1879931 1673676 1593560 1763077 1572879 1737233 1541076 1740848 1544415
19494 1544415 1623065 1530282 1564261 1568409 1761717 1663020 1561421 1456760 1601819 1569651 1472995
19483A472995L65334k16251Q4853m28243K40496K02832k45985j21863j40986J16980
19473A330162K34344j39567J54521l49802R3656J54022j39642m6512L4865J39285
19463A465332j22903j71188L6605N0246j24603L18865n3990l2192R5907o8775
19453A393304j72300k7681p1421j02952K78171K39998k88823j570J10684j09390
19443A248020J18779r556k60820P1044N2033j43326K84071l24411L48481j74979
19433A209336q2066j0264J77698l1074m08920N32572m07658L76047l59488K61890
19423A258073j51434k3187K772K14434k77382K13505j08756P9405l339j17642
19413A086449j67506K43891k72296J54728J16046k18731L07456m40332M44062
$$ plain form
19483 1472995 1838329 1622078 1706931 1278688 1519184 1722016 1476031 1354168 1213182 1330162
19473 1330162 1564506 1424939 1579460 1229658 1323314 1477336 1337694 1291182 1326047 1465332
19463 1465332 1342429 1171241 1207846 1258092 1133489 1452354 1398364 1366172 1462079 1393304
19453 1393304 1221004 1193323 1121902 1018950 1297121 1537119 1248296 1246726 1357410 1248020
19443 1248020 1366799 1357243 1096423 1167467 1219500 1076174 1360245 1035834 1384315 1209336
19433 1209336 1127270 1117006 1294704 1263630 854710 1387282 979624 1355671 996183 1258073
19423 1258073 1106639 1083452 1086224 1300658 1023276 1236781 1128025 1207430 1204091 1086449
19413 1086449 918943 1162834 890538 1045266 1161312 942581 1250037 809705 1253767
19404A253767k76235Q8866J68965j62266J4028k52621J62612J91203m19462L44722
19394A113579k12015R0516K29999l34694K03612k46445J42740Q0054q5569j58329
19384H23448l4958J75651J10883p7376j73606K871J05644j9341o8566R0057j01776
19373H32931J77526J12836j68803L03720k83404J85027j75549N3237j03461n5085
19363H78975J04598o1493J29764o0030q0091R5294j02418M5681n9032n4466N5001
19352H91783N7742J13567J31418j60023j45961J90205l14784L77402l77056K8579
19342G92872p9041L10080j0582J7901k36973J96935j99432L35223k75726L59840
19332A211097j98825M4440j3595k29332J35200L1718J21940L6485j85618R0612
$$ plain form
19404 1253767 977532 1066398 1235363 1073097 1087125 834504 997116 1188319 768857 1113579
19394 1113579 901564 992080 1222079 887385 1090997 844552 987292 1067346 981777 823448
19384 823448 788490 964141 1075024 997648 824042 826913 932557 913216 844650 934707 832931
19373 832931 1010457 1123293 954490 1258210 974806 1159833 984284 1037521 934060 878975
19363 878975 983573 922080 1051844 991814 911723 1007017 904599 950280 891248 836782 891783
19352 891783 949525 1063092 1194510 1034487 888526 1078731 763947 1141349 764293 792872
19342 792872 713831 1023911 1013329 1031230 794257 991192 791760 1126983 851257 1211097
19332 1211097 1012272 1056712 1043117 813785 948985 980703 1102643 1139128 953510 1044122
19322A044122J80993k32283K9489R2539j29379m7878j6638k35362J01645J43214
19312I30462J0836j07136K31418l43033J71283j498J54602j63039J58537K79900
19302A322332k33301q9954J75760K06239l41662L3939M5439n744K39145k32131
19292A120062k37523R9612K45264k97109j50792L97262k31867j25964L82257j53747
19282A047455j76413J03659j1428J91504r3288j59378K9076J16161P0818j42015
19272I76151k7584K89964q855j7060j83812k0816j83386J75379L6793j2580j36303
19261H87891q9993Q5916k73076L35652o0457l7152l830K03057r4982r6031l7461
19250H19534J7564J77014l46839J88200K4180J0036j61071N43876N8031K34605
$$ plain form
19322 1044122 1225115 992832 1022321 1114860 985481 937603 920965 685603 787248 930462
19312 930462 941298 834162 1065580 722547 893830 892332 1046934 883895 1042432 1322332
19302 1322332 1089031 999077 1174837 1381076 1039414 1073353 1118792 1113048 1352193 1120062
19292 1120062 882539 982151 1227415 930306 779514 1176776 944909 818945 1201202 1047455
19282 1047455 871042 974701 963273 1154777 1061489 902111 931187 1047348 1118166 976151
19272 976151 948567 1238531 1229676 1212616 1028804 1007988 824602 999981 1036774 1024194 887891
19261 887891 797898 883814 610738 946390 885933 848781 844951 1048008 953026 856995 819534
19250 819534 837098 1014112 667273 855473 879653 889689 728618 1272494 1330525 1565130
19240A565130k8660J05159n7544J29095m8739j15693Q7434l75284l48033n306
19230I07559o8198j05642n204J99759Q4443q0416k651K12176l62491q6139J29837
19219H23033j78597K44786j04959K28022j10669L51779j57178j00798j1684J08787
19209A092522k65397O2285N9204j01887j7822n3648p9542M0531M6267n0466K68205
19198A000252j29827j28135J47630p4256J11964j29962l1513J63518P2907o7429
19188I35149k44669J20081K518j01969L09215k04716j46479Q9640p874J88174
19178I39070j85511K50385k53531R7481q7420l4553J46360j21548j0852L15470
19168A055351j27717j87074J63070k8875J8639K99N1671k35400L06462p4194r9511
$$ plain form
19240 1565130 1536470 1641629 1584085 1713180 1664441 1548748 1636182 1260898 912865 907559
19230 907559 839361 733719 728515 928274 1012717 932301 929650 1141826 779335 693196 823033
19219 823033 644436 889222 784263 1012285 901616 1253395 1096217 995419 983735 1092522
19209 1092522 827125 889410 948614 846727 828905 775257 695715 736246 782513 732047 1000252
19198 1000252 870425 742290 889920 815664 927628 797666 766153 929671 1002578 935149
19188 935149 690480 810561 813079 711110 1020325 815609 669130 758770 750896 939070
19178 939070 753559 1003944 750413 847894 760474 725921 872281 750733 739881 1055351
19168 1055351 927634 740560 903630 874755 893394 893693 945364 709964 1016426 942232 842721
19157H42721M143j05732J08698j97818K09363o5542L8256m2024M6988K45347q3047
19146A001353J10651k43706N12465l36359K51851L2156L24034n5238k2917j0316
19136A563974K53269k23454j62672Q2526j03406O2731j1476K67430n67509K87496
19126A448909J46533j17401k11152K04365j46812J14959n6600j49544j62635j00363
19116I70259l5821J58504R0116q2802Q4420L0200k17911J23315R8509L3182j61736
19105A090235J18971J8931K3321j2344K52907P131o4189J60261k72279O8962l2801
19094A359106k496L8202o6759j33206P9488R766o6372j16942M31504l63102L34597
19083A503786k4333n3038J95441L23282J07778M5940L89107M4106K59767O34312
$$ plain form
19157 842721 846864 741132 849830 652012 861375 795833 834089 792065 839053 1084400 1001353
19146 1001353 1112004 868298 1380763 1044404 1296255 1328411 1652445 1597207 1574290 1563974
19136 1563974 1817243 1593789 1431117 1513643 1410237 1472968 1461492 1728922 1161413 1448909
19126 1448909 1595442 1478041 1266889 1471254 1324442 1439401 1382801 1233257 1070622 970259
19116 970259 934438 1092942 1183058 1100256 1184676 1214876 996965 1120280 1218789 1251971 1090235
19105 1090235 1209206 1228137 1251458 1239114 1492021 1499152 1434963 1595224 1322945 1391907 1359106
19094 1359106 1356610 1394812 1328053 1194847 1274335 1284101 1217729 1100787 1532291 1169189 1503786
19083 1503786 1479453 1426415 1621856 1945138 2052916 2098856 2487963 2532069 2791836 3426148
19073C426148Q6233Q35949L78476M42382N0980K21503L8828j7967r8855m67069
19063D896608m09607q06504n24168l14613k05495k10983l44657L1790M9461K94273
19053B456105J14236N36627K47663K44550M29170K42880J27148L07308o5694J17035
19043D757028n19854m48390l06870o99449p8382j92406j06722j13592q9107K83537
19033B485793J71877K45783M64147O78662N79128L51557O72180K50256K79194
19024F178577L67211l06072m50310m5584o71561n36985p27844m15536n03843l18836
19014B569217R8322K00249j84371K21599M52779M22039M53961Q3953M78804J17495
19004D914047O4238K778O5191j40288o61562m37180o28619m26967j55809m04353
$$ plain form
19073 3426148 3512381 4348330 4726806 5169188 5220168 5441671 5480499 5462532 5363677 4896608
19063 4896608 4487001 3680497 3156329 2841716 2636221 2425238 2080581 2112371 2161832 2456105
19053 2456105 2570341 3106968 3354631 3599181 4028351 4271231 4398379 4705687 4639993 4757028
19043 4757028 4237174 3788784 3481914 2782465 2704083 2511677 2404955 2291363 2202256 2485793
19033 2485793 2657670 2903453 3367600 4046262 4625390 4976947 5649127 5899383 6178577
19024 6178577 6545788 6239716 5789406 5743822 5072261 4535276 3807432 3391896 2888053 2569217
19014 2569217 2667539 2867788 2683417 2905016 3357795 3779834 4233795 4317748 4796552 4914047
19004 4914047 4978285 4981063 5046254 4905966 4244404 3807224 3178605 2751638 2595829 2191476
18994B191476o5583q0044R8556J32968K22161L46376L83634L58494K68331N76482
18984D432851L68584o4882K76691j62599k86416K1588l26928m92100l32132k35495
18974C199162P859k5404K79624O531L83064N16431O25804L94936J291503P80790
18964G460300J268311J064033J062032J507936J631073J979945K034956J452625
18956A9461211J257481J013727L94997K64702k04077q79227j382180j650400k349613
18947A5926621k382413k338837j683091j524777j394827q39613r51207m02215
18939D409641m67460l54766m22205j81951j20819l77096r1745J658k79645j57319
18929A958293O3362J10297k29958J08257m4784j92187L5046J80245J24956l09800
$$ plain form
18994 2191476 2125893 2045849 2144405 2277373 2499534 2845910 3229544 3588038 3856369 4432851
18984 4432851 4801435 4736553 5013244 4850645 4564229 4585817 4258889 3766789 3434657 3199162
18974 3199162 3207021 3181617 3461241 3467772 3850836 4367267 4993071 5388007 6679510 7460300
18964 7460300 8728611 9792644 10854676 12362612 13993685 15973630 18008586 19461211
18956 19461211 20718692 21732419 22127416 22392118 22188041 21308814 19926634 18276234 15926621
18947 15926621 13544208 11205371 9522280 7997503 6602676 5763063 4811856 4409641
18939 4409641 3942181 3587415 3165210 2983259 2862440 2485344 2393599 2395257 2115612 1958293
18929 1958293 2021655 2131952 1901994 2010251 1965467 1773280 1808326 1988571 2113527 1803727
18919A803727K17604J58559k23359J6653p8053K17085j33743J82652P3468J44119
18909B378712K9912M7218k6841N09159R5818J57469K45589K70620P71623O79838
18899E159117Q67192R01047J316444J524172J933155J877895J912361J547964
18891A7039347J189459P59609P36333l73876o53338j332518j983305k015776k289488
18882A1076447j742824j694811j317167j105733q21773o72682n15259k28318l68987
18873B608893k41705k70559p7343j0258l30680l2428J39235l28929l6067Q7428
18863A507587k53333R7855k248l0010J1273k64294J30580j81457N4441l7011J37838
18852A171221j64239J22301k13991J11195K3420l01989K94528j05021m7766J39955
$$ plain form
18919 1803727 2021331 2179890 1956531 1973184 1895131 2112216 1978473 2161125 2234593 2378712
18909 2378712 2408624 2455842 2429001 2938160 3033978 3191447 3437036 3707656 4479279 5159117
18899 5159117 6026309 6927356 8243800 9767972 11701127 13579022 15491383 17039347
18891 17039347 18228806 18988415 19724748 19350872 18697534 17365016 15381711 13365935 11076447
18882 11076447 9333623 7638812 6321645 5215912 4394139 3721457 3206198 2977880 2608893
18873 2608893 2367188 2096629 2019286 2009028 1678348 1645920 1785155 1456226 1420159 1507587
18863 1507587 1254254 1352109 1349861 1319851 1331124 1066830 1197410 1015953 1070394 1033383 1171221
18852 1171221 1006982 1129283 915292 1026487 1049907 747918 1042446 937425 889659 1029614
18842A029614j03807k9383j6871L3797m5149M2665p7220o114M3519j84576p2288
18831F14187L10407j68394L9707j47243J04875P5670p6832j67124J58467K4990
18821G68710J87300o4185j67361O1294m9765K21554j41074j39922O1654J69753
18811I07958J47017j93276k243k27793J32734L698q9563K96001k31959k05914
18801E36660K81957j39738J98631O4054k9218k20492j2422o5100J28572L5982
18791G78886J71727j56075k83086L96298q929j02913L11311p0381k30351K479
18781H08966K50260j20695k06931J77441k06618J84810o0402M6229J42763j05252
18771I10571p224O4312k7602q0174r9582L59134l57622k9877L54962l73798J54822
$$ plain form
18842 1029614 925807 896424 879553 913350 868201 910866 833646 827532 871051 686475 614187
18831 614187 924594 756200 795907 648664 753539 829209 752377 585253 743720 768710
18821 768710 956010 891825 724464 785758 735993 957547 816473 676551 738205 907958
18811 907958 1054975 861699 859456 631663 764397 768095 678532 974533 742574 536660
18801 536660 818617 678879 877510 941564 912346 691854 679432 614332 742904 778886
18791 778886 950613 794538 511452 907750 898821 795908 1107219 1036838 806487 808966
18781 808966 1059226 938531 731600 909041 702423 887233 826831 873060 1015823 910571
18771 910571 903347 967659 940057 859883 760301 1119435 761813 731936 1086898 713100 867922
18760H67922l5605j33969K01309l48180J88224J90353j22669l6273r925j02271
18750F58916J62814q4914k42998J32982N0673k2302j20753K42579m8732J84758
18740I13023l01170J55258j47860L0477J25550j05614J43977j34419J41155Q8378
18730I08755j50094R3894k36828M93798l93508K46144k43727q7814K13102r0351
18720G53371q3872k9231M37391E36548R9497J83933p4921Q7097N988Q1198j36441
18709G82899N6827j84136J15159L33041l45625R7041K2631k72349J15015o9005
18699F51498J04416L8113K04370J3628p7208r1498M1396K2192M962j46582o1215
18688G04072o5914J77521k08260K48585k88664J88501J2436k36846R6431j05173
$$ plain form
18760 867922 832317 698348 899657 551477 739701 930054 807385 771112 761187 658916
18750 658916 821730 736816 493818 626800 677473 655171 534418 776997 728265 913023
18740 913023 611853 767111 619251 649728 775278 669664 813641 679222 820377 908755
18730 908755 758661 852555 615727 1109525 716017 962161 718434 630620 843722 753371
18720 753371 669499 640268 1077659 536548 636045 819978 745057 832154 838142 919340 782899
18709 782899 839726 655590 770749 1103790 758165 855206 877837 605488 720503 651498
18699 651498 755914 794027 998397 1012025 934817 843319 884715 906907 911869 765287 704072
18688 704072 638158 815679 607419 856004 567340 755841 768277 531431 627862 522689
18678E22689J49327P7473j55126j31232L56609m9405K4617p8515k39415J95185
18668F72207O8553j48180O2665J72029k87912k1016J472j851J32898J56224j51456
18657F55633n5127o3905K04509o1077r4060k172J05383j11078J43056n214q1127
18646F34821J48898j73022P6557j07075K01453j59444p3461J21579k11363K61433
18636G20376k11019J65283J44279j90996j9079N8768K0400m4685J63769j76113
18626F30983J5185J77557o8107j02248P1890J38483k02638l1290J59203l08185
18616D80833M90613l19185J09870r2082J03371j85512p9188K99401r2813k9738
18606F85570N4475J18972M2144j8392J70824l35378M38j10028L41374j75890j38713
$$ plain form
18678 522689 672016 749489 594363 463131 819740 770335 794952 716437 477022 672207
18668 672207 740760 592580 655245 827274 539362 518346 519818 517967 650865 807089 655633
18657 655633 600506 536601 741110 680033 585973 583801 689184 578106 721162 715948 634821
18646 634821 783719 610697 687254 580179 781632 622188 548727 670306 458943 720376
18636 720376 509357 674640 818919 627923 608844 667612 688012 643327 807096 630983
18626 630983 646168 823725 755618 653370 725260 863743 661105 629815 789018 480833
18616 480833 971446 652261 762131 670049 773420 587908 508720 808121 715308 685570
18606 685570 740045 859017 901161 882769 1053593 718215 718653 608625 949999 774109 635396
18595F35396K47270K776n2636l0560L5101J56940n999k76079n3821K63417k94840
18584F26965K41945k2902N5934j94390J78087j6046k04627P9127J03992k02836
18574F45249J13715N2684k38856J87949p7744q8630L55495n3301r3110o3834j40825
18563E98792J58896K23769n1462P2343l15791j99574L63780K4265k37319P1053
18553G08752J38346k63248j26782k6009L13241r6031k0366L8859Q7696l10452
18543D44006J67826K8295J34469r2957j05388J09537j9946o0228l1455m1255j38857
18532C94047J53149j3426K42030j48811n5827J48605o183n0589j97331J72726
18522F38390j02240k909L15239l76176J56621j19244J81365q0001J72287l67653
$$ plain form
18595 635396 882666 885442 832806 802246 837347 994287 988288 712209 658388 921805 626965
18584 626965 868910 846008 901942 707552 885639 869593 664966 744093 848085 645249
18574 645249 758964 811648 572792 760741 682997 594367 949862 896561 803451 739617 598792
18563 598792 757688 981457 929995 1002338 686547 486973 850753 875018 637699 708752
18553 708752 847098 583850 457068 431059 744300 648269 627903 666762 754458 444006
18543 444006 611832 640127 774596 681639 576251 685788 665842 605614 574159 532904 394047
18532 394047 547196 533770 775800 626989 571162 719767 713584 662995 465664 638390
18522 638390 536150 533241 848480 472304 628925 509681 691046 611045 783332 415679
18512D15679J78525r1864J09989j31184O567K32218j87045J41925J09692m1021
18502G43481p4442j99992N1938M851J39821J38585C66875L27893j33464J43957
18492G05261j84726m9394L21982k76966J10615j01153J32616n6253J79673r7493
18482F84162j70719J21603o16J08289k47338K26209l9860k15150K21443n0853
18472F37170p407J48544j55670j32852L0581l6637K31744p1538j03162J92973
18462G33746K64442l43190q1498J68420J18089k62726K3273K13480j07478j34674
18452E91884o0470l3594p337P1107Q651K35662m5467r6160j73640R4607m0332
18441E44911j16522J55264k33076J96650L70687o9123k60135R5521N527J52225
$$ plain form
18512 415679 594204 502340 612329 481145 487712 719930 532885 674810 784502 743481
18502 743481 669039 469047 520985 525836 665657 804242 366875 694768 561304 705261
18492 705261 520535 471141 793123 516157 626772 525619 658235 601982 781655 684162
18482 684162 513443 635046 634430 742719 495381 721590 681730 466580 688023 637170
18472 637170 629763 778307 622637 489785 520366 483729 715473 643935 540773 733746
18462 733746 998188 654998 573500 741920 860009 597283 620556 834036 726558 591884
18452 591884 531414 497820 490483 561590 570241 805903 760436 664276 490636 585243 544911
18441 544911 428389 583653 350577 547227 917914 848791 588656 684177 689704 841929
18431H41929K3301j99908N1243J58843j78631k64359K56631J55185j82032j75388
18421D86814J53467P7432M7824j97263p7565J07133J47824l36685J07964k0621
18411D96324K09795r9646K77625M1318l26982K99751r3080k4257J00318n392p1958
18400H03816j67095P7235n3224K68992l94302J7679J11180J73604j13016k29049
18390D95820K49773j20484m0941p4350J8748M9794J1706R6347l22530L05035r8483
18379E70435j19022K26482j50948J55884j56106j75669N4861Q1147j37719K49990
18369E99335j7120m9525k2548K00699j5403J7860l03955L06423M5082j66777R8541
18358F92612j46292j44067K40415p3559j44103K66948j76278K91422j81904J02087
$$ plain form
18431 841929 865230 665322 716565 875408 696777 432418 689049 844234 662202 486814
18421 486814 640281 717713 765537 568274 490709 597842 745666 408981 516945 496324
18411 496324 706119 606473 884098 925416 598434 898185 805105 780848 881166 875774 803816
18400 803816 636721 713956 660732 929724 535422 553101 664281 837885 724869 495820
18390 495820 745593 625109 584168 509818 528566 578360 590066 686413 363883 668918 570435
18379 570435 451413 677895 526947 682831 526725 351056 405917 487064 349345 599335
18369 599335 582215 532690 510142 710841 695438 713298 409343 715766 760848 594071 692612
18358 692612 546320 402253 642668 569109 425006 691954 515676 807098 625194 727281
18348G27281n1400k4369L109k13396J03523L35365j67237j98181O8796J39997
18338G23488k389k66548J19823k48844L23281o8124j06787o052K84843m8155n6226
18327F48310r4731L1173m9278K1134J4978L12866k85341K39299k19809J86088
18317H04689j59664K5013j04501p305J36904O72m0778k40276M1374K77386k13026
18306E20488K73511p6330q7134M5812O8359k79148L43790j88695j54380J77231
18296F43504R1078r5971K95585k68288Q2814N3271k93685K83959m2834k79973
18286D69460Q3928J53575L6811M6006o960l02438Q7752k80567K66686n0252J22402
18275F26403Q0514k16266n359K54518j06930B37367L90528j7201L657n4221J0055
$$ plain form
18348 727281 675881 651512 654621 441225 544748 880113 712876 514695 583491 723488
18338 723488 721099 454551 574374 325530 648811 580687 473900 467848 752691 704536 648310
18327 648310 553579 584752 535474 556608 571586 884452 599111 838410 618601 804689
18317 804689 645025 670038 565537 558232 695136 695808 655030 414754 456128 733514 520488
18306 520488 793999 717669 630535 676347 744706 465558 809348 620653 466273 643504
18296 643504 734582 638611 934196 665908 748722 801993 508308 792267 749433 469460
18286 469460 553388 706963 743774 789780 782820 480382 568134 287567 554253 504001 626403
18275 626403 706917 490651 485292 739810 632880 237367 627895 610694 614351 560130 570185
18264E70185j5723K77069j20280l25146K57673J59388k63837R5275k8498j07515
18254D98591k070K46893j56519N7517J43038j3294J2980P7376O8033l17489m3798
18243E71258j40180J00155k3986J09208j20023J8509j61173L44262r3444j47041
18233D57545R8390m8351R2193k7828J42303o8334J07513l19315J09549K3825j40582
18222D26908J52014L2807O9297k47257Q6745J34572q4937J92492p1492j31866
18212E59283n9418P9652J68923k71315q4029K6626L3552N800K39199Q8217j03279
18201F83211N224k54765J95115R3374j85030K45654j05325j68795J71206p0933
18191F08936J26204k04296R0543n7163P2632J28275k38055P7950J3548J73795
$$ plain form
18264 570185 554462 831531 711251 386105 643778 803166 539329 634604 606106 498591
18254 498591 496521 743414 586895 644412 787450 774156 787136 864512 932545 615056 571258
18243 571258 431078 531233 507247 616455 496432 514941 353768 698030 604586 457545
18233 457545 555935 507584 599777 571949 714252 645918 753431 434116 543665 567490 426908
18222 426908 578922 611729 681026 433769 520514 655086 570149 762641 691149 559283
18212 559283 499865 579517 748440 477125 393096 419722 453274 459074 698273 786490 683211
18201 683211 688435 433670 628785 722159 537129 782783 677458 508663 679869 608936
18191 608936 735140 530844 621387 564224 636856 765131 527076 605026 618574 792369
18181G92369l4486o9741j16299J31690B08605M23616O4075C34689J46707J20362
18171F01758J01966j62958j1580J3494p0657J30042m9624m2641J53849l1366j17670
18160E14613j5356J07160J00734k59859L61263k90896J88492Q9756K25k53759
18150E42373j4949L20866k92903L1710l2108K7419n4912n6488J19268J45382j50350
18139E85308K85314j27245k73035J96397j32575J99360k14169Q5295K9493k40787
18129C93356K31800M3482J05838l13368P4999P2236n9725N172J17233j77034j94030
18118B99959K26798M7492J08083L371O9243k61752O5135J48818j62890J88682
18108G32939j92684J17408k11054J67631q0280K0482J25628j33670Q184l1657
$$ plain form
18181 792369 757883 688142 571843 703533 208605 632221 696296 334689 481396 601758
18171 601758 703724 540766 529186 542680 472023 602065 552441 509800 663649 632283 514613
18160 514613 499257 606417 707151 447292 808555 517659 706151 795907 796132 542373
18150 542373 527424 848290 555387 587097 554989 582408 527496 471008 590276 735658 585308
18139 585308 870622 743377 470342 666739 534164 733524 519355 604650 634143 393356
18129 393356 625156 668638 774476 461108 536107 608343 548618 553790 671023 493989 299959
18118 299959 526757 574249 682332 685703 754946 493194 558329 707147 544257 732939
18108 732939 540255 657663 446609 614240 533960 554442 680070 546400 554584 522927
18098E22927r2064K13051j21841K06461C05296K16502K94777j96134K50222k15582
18088F55081O3833L7119O8632k29930J17999B88635K95867O6261j18566K18770
18078G50967k57021R8256m5538R0223j71047j63484K3815J89410R1778q3607Q6365
18067F10117m7863k25902L43223j05811n1634j18105K07398N9239j7054Q4193
18057G37801k02199K1836K8878q6888j4444Q4725j58408K04168k61194J10910
18047D65185J38409j06429K78570k76341Q4038k43396J54184K1026J78233q3509
18037F09970m290l4595q2509j31902L58261p6050j21075j59104L04972k63501
18027D00177J88601j79486J22855K11207l34093q2465Q8919K41322j1853q4334
$$ plain form
18098 522927 430863 643914 522073 728534 305296 521798 816575 620441 870663 655081
18088 655081 718914 756033 824665 594735 712734 288635 584502 650763 532197 750967
18078 750967 493946 592202 546664 636887 465840 302356 326171 515581 607359 523752 610117
18067 610117 562254 336352 679575 573764 522130 404025 611423 670662 653608 737801
18057 737801 535602 557438 586316 499428 484984 569709 411301 615469 354275 465185
18047 465185 603594 497165 775735 499394 583432 340036 494220 515246 693479 609970
18037 609970 605680 571085 488576 356674 714935 638885 517810 358706 663678 400177
18027 400177 588778 409292 532147 743354 409261 326796 415715 657037 645184 560850
18017E60850m7394p6994J55333k66039L59229j56757k28446L56619r5106R4207
18007F55502m3189K54587j69825j10013r0666J93865l05259K99526j47744l3072
17997E03712J21440L2420K05565C26610K77701j92467L58199k51279o9669m123
17987D44972K36624n0071p1553k18200O1061J65511k36357K15980L29055k99266
17977E77756n5859R4492J96431j02897o809j20704K91558m25731L45415k45003
17967E48649J80888J75671m11465j85620J33710J41503j40457J44144K46679p1209
17957G62493l01657K26106k70568J85888l0175r9022J33718R331l0332k72042
17947C13740M10640k13472B04761M76272j02727j08876P9208j4142J88650K5947
$$ plain form
18017 560850 513456 436462 591795 325756 684985 528228 299782 656401 561295 655502
18007 655502 612313 866900 697075 587062 496396 690261 385002 684528 536784 503712
17997 503712 625152 657572 863137 326610 604311 411844 770043 518764 449095 444972
17987 444972 681596 631525 559972 341772 402833 568344 331987 547967 877022 577756
17977 577756 521897 616389 812820 709923 703114 582410 873968 448237 793652 548649
17967 548649 729537 905208 493743 308123 441833 583336 442879 587023 833702 762493
17957 762493 460836 686942 416374 602262 572087 473065 606783 616114 585782 313740
17947 313740 724380 510908 204761 681033 578306 469430 548638 534496 723146 749093
17937G49093j16179j52128J2637J33436J48829r9304j81187L10023M8852j31064
17927G23008o9968j10987P690K93508j34276j7935j37001k6823K80316n2462j5414
17916G39656R2986q2222p0696n9485j2738J47189M3557q9341m4778l1284J24430
17905G57274P9843J05936l15971K08890r1828o1621q0386J80082o145P7449m1427
17894H12096J54028k39506O853q1971N0436o6540N3340J40040r0483Q2303j27730
17883F92866J89158k71850K23901j8670J05177J3043j19543j36037J74865R2753
17873I45663k83918J41633J77668r7073q9265r8710q3168K30409k85730K92891
17863H50400K15714l00596k36584K77105n374r0653J10274O2878r3213j27623
$$ plain form
17937 749093 632914 480786 493423 626859 775688 676384 495197 805220 854072 723008
17927 723008 653040 542053 549743 843251 708975 691040 554039 527216 807532 755070 739656
17916 739656 832642 750420 679724 620239 607501 754690 798247 708906 664128 632844 757274
17905 757274 837117 943053 627082 835972 744144 682523 602137 782219 776074 853523 812096
17894 812096 966124 726618 733471 651500 701936 635396 688736 828776 738293 820596 692866
17883 692866 882024 610174 834075 815405 920582 933625 814082 678045 852910 945663
17873 945663 661745 803378 981046 883973 794708 695998 612830 843239 557509 850400
17863 850400 1066114 765518 528934 806039 800665 710012 820286 883164 789951 662328
17853F62328M0241L7056k20565L65605k9320o1649r4582J3830M1551P4048j91847
17842F36696J34285o6835P6826m2774J78496p8490L5663l62943L24547k59545
17832E75926J98659j06826J34558j45778L75306k14634L0855q7215N5716r9536
17822G17031K61842j40218n7505M9024j37427J99475J85985m5192p5238J01576
17812A059353k46362J49781N4127R0960k98194k8069L35890j70408K5346k6986
17802I45438j21362n0834J21532J85431q5552M9798j51017Q4027l1332J36631
17792A082760m53929J95522p2923J51700j92144Q5468j683j88308M22317l36563
17782F92217j30716K91768j16724q4264j28952J5778m2539J50392J0651J26875
$$ plain form
17853 662328 702569 739625 519060 884665 855345 793696 699114 712944 754495 828543 636696
17842 636696 770981 704146 780972 738198 916694 838204 873867 510924 835471 575926
17832 575926 774585 667759 802317 656539 1031845 817211 848066 760851 816567 717031
17822 717031 978873 838655 781150 830174 692747 892222 1078207 1033015 957777 1059353
17812 1059353 812991 962772 1016899 1107859 809665 781596 1117486 947078 972424 945438
17802 945438 824076 773242 894774 1080205 994653 1044451 893434 977461 946129 1082760
17792 1082760 628831 824353 751430 903130 710986 796454 794771 606463 1028780 692217
17782 692217 561501 853269 736545 652281 523329 539107 496568 646960 657611 784486
17772G84486m9187J76919j80176j31389j8487K60736l11917K69789k44333J57741
17762G14182K6897P2259k1728k7632O6770r1697r1525J41883j05359j97989K06705
17751F92766J42597l06871J44477J27963j96783j65860J77000J44434J56745j23808
17741G92660j05329J01614M2460J8931l19613L18507j66526j00018J46221k51283
17731D77624M31079j18627J31646l91166P7381Q332K33333j94539j17836R3298
17721F30525L28119j88283K582k13941P5047l4208k51734M79680o2395p8827j76521
17710E10044K27261j29821N7106J16162M6200K4719K9136j94206r1775N9707J17345
17699G71878k91045K75246j12803K16434k16034r091M3872J6728O8151k9843N8098
$$ plain form
17772 784486 735299 912218 732042 600653 582166 842902 530985 800774 556441 714182
17762 714182 741079 813338 791610 763978 830748 739051 647526 789409 684050 486061 692766
17751 692766 835363 528492 672969 800932 604149 438289 615289 759723 916468 792660
17741 792660 687331 788945 831405 850336 530723 849230 682704 582686 728907 477624
17731 477624 908703 790076 921722 530556 607937 616269 849602 655063 537227 630525
17721 630525 958644 770361 772943 559002 634049 599841 348107 827787 765392 686565 510044
17710 510044 737305 607484 664590 780752 826952 851671 880807 686601 594826 654533 771878
17699 771878 480833 756079 643276 859710 643676 634585 678457 695185 763336 733493 791591
17688G91591l08865L86055P1987l38564N8843K01674K102j14217J08995j10436
17678G49165j18383O2316j11421J76537J23389r3565R1332k11405K55124k29337
17668F93752K54993l07553J36402k58915L63827k49044O0902o446J02429M4351
17658H34698J4639R7189L81337n80084L15780j98978j73172J44337n6306K7094
17648H06534m6626j01241K61255j78454J86472J86012r1638k0815J29521j25583
17638A005437P6531j28077J15419m9972J55498K71735l25466n6610N265j9966
17628A049794R7084J34224j86364M655J49350N3436Q2131p9021J61258k61361
17618A205186M9386j69142J42994J04337j3880p2697j9355R459M4360J59634j11877
$$ plain form
17688 791591 482726 868781 940768 602204 661047 862721 864823 750606 859601 749165
17678 749165 630782 693098 581677 758214 881603 788038 879370 667965 923089 693752
17668 693752 948745 641192 777594 518679 882506 633462 694364 687918 790347 834698
17658 834698 849337 946526 1327863 747779 1063559 864581 691409 835746 779440 806534
17648 806534 759908 658667 919922 741468 927940 1113952 1022314 1001499 1131020 1005437
17638 1005437 1081968 953891 1069310 1019338 1174836 1446571 1121105 1064495 1069760 1049794
17628 1049794 1146878 1281102 1094738 1099393 1248743 1302179 1384310 1305289 1466547 1205186
17618 1205186 1254572 1085430 1228424 1332761 1318881 1246184 1226829 1236288 1280648 1440282 1328405
17607A328405P6322k17680L76872n5815k53485J24182j03375K0302N2748j9J87978
17596A536435j77440J03589P097j72676R7925J3359K3373J1270J47400k59762
17586A330570L90686n07608J59490J65047j77936j64829J32558J02617J65536
17577A596131l07055Q6684k7441J35217r8146M4045R7569k03956r1504k3610R2689
17566A300623K10300q8921J20389r5303j91918K7238J63182j22557k0840P4617
17556A376810J39805l50527J02640r3149J13846Q0506n5280J7911J06627j90689
17546A248500q4330j897L0040M9995K74735j02452k46004L58832j57810l759R0917
17535A456767l14338K72701k05253K63576k48091P4598J28874k0440k05221K68607
$$ plain form
17607 1328405 1404727 1187047 1563919 1508104 1254619 1378801 1275426 1295728 1348476 1348457 1536435
17596 1536435 1358995 1462584 1469681 1297005 1394930 1408289 1431662 1442932 1590332 1330570
17586 1330570 1721256 1213648 1373138 1538185 1360249 1195420 1327978 1430595 1596131
17577 1596131 1289076 1375760 1348319 1483536 1385390 1429435 1527004 1323048 1231544 1207934 1300623
17566 1300623 1510923 1422002 1542391 1447088 1255170 1282408 1445590 1323033 1302193 1376810
17556 1376810 1516615 1166088 1268728 1175579 1289425 1369931 1314651 1332562 1439189 1248500
17546 1248500 1164170 1162273 1192313 1242308 1517043 1414591 1168587 1527419 1369609 1365850 1456767
17535 1456767 1142429 1415130 1209877 1473453 1225362 1299960 1428834 1408394 1203173 1471780
17525A471780j25366J0634j26492J84310J02874N7319j32466J8740j99620K74710
17515A536423K04004j23512j4970K22374R4110J81969P282j8023K26495o2022
17505B254130M6817l85423K30319K55290L3422l5389M3693l6723K99155K20708
17495B925999L39449J92025J67738L06791L80522N81787P95214R38006J878292
17486H505823L240273N547420P304746Q949173Q206596O730052N228539L394067
17478E7106689J795941M29987j603942m178630o847898q977948q078845n002275
17470B4643079q07884L902236O783066P544951P092861N230484L403806J822010
17462E9614609K20850j706001l802752o797065r249587j0263951r187507o488154
$$ plain form
17525 1471780 1346414 1357048 1230556 1414866 1517740 1575059 1442593 1461333 1261713 1536423
17515 1536423 1740427 1616915 1601945 1824319 1918429 2100398 2107680 2089657 2316152 2254130
17505 2254130 2300947 1915524 2145843 2401133 2434555 2399166 2442859 2406136 2705291 2925999
17495 2925999 3265448 3457473 3625211 3932002 4312524 4894311 5689525 6627531 8505823
17486 8505823 11746096 17293516 24598262 33547435 41754031 48484083 53712622 57106689
17478 57106689 58902630 59332617 57728675 53550045 46702147 37724199 29645354 24643079
17470 24643079 23835195 27737431 34520497 42065448 49158309 54388793 57792599 59614609
17462 59614609 59835459 58129458 54326706 47529641 38280054 28016103 18828596 12340442
17454A2340442l593627k282687j134785n75563n85564j09267r2927q3611o6030
17445C816381j03254J30687M00928k27324k3275J03855j61347K3801o0832k21355
17435C678265l41484p4042P5587j28539R5837j6959J67143l8750K05241l81804
17425C240495L80524k01621j17658l34163k47984j53465L0133j69249J0587q9525
17415B348074J46686k35477J95987Q2964k91891J74570k1679j78713L88620k24188
17405B384953K42906O5223Q6745P6297J03392M03028J5677M9849m793L42400J67140
17394C932817J59876J86218L90263K69658K80121N24846M46882N15919K92278
17385F998878L41112J26561o876J41466k78752j17720l39983k6637m81582K83623
$$ plain form
17454 12340442 8746815 6464128 5329343 4753780 4168216 4058949 3966022 3882411 3816381
17445 3816381 3713127 3843814 4244742 4017418 3994143 4097998 3936651 3960452 3899620 3678265
17435 3678265 3336781 3262739 3338326 3209787 3305624 3288665 3455808 3417058 3622299 3240495
17425 3240495 3621019 3419398 3301740 2967577 2719593 2566128 2596261 2427012 2437599 2348074
17415 2348074 2494760 2259283 2455270 2538234 2246343 2420913 2399234 2220521 2609141 2384953
17405 2384953 2627859 2693082 2779827 2856124 2959516 3362544 3378221 3428070 3423277 3765677 3932817
17394 3932817 4092693 4278911 4669174 4938832 5218953 5743799 6190681 6706600 6998878
17385 6998878 7339990 7466551 7459675 7601141 7322389 7204669 6864686 6838049 6356467 6640090
17375F640090l35404k04716M92883k04801O63518J07574M81318L82849M83180
17366H506491L36070N9564K73460J01380o0746N3248k72840j98590m4963k91449
17356H461625J18044n6885K38701N99275l8197N16501M55302O63103M04704Q48689
17346A2210862M92524O64722N76126J4610P47643O9952n37937M6705m15379j13548
17336A3756280o11914k62875p3242m23339K60053k95011R7017Q13192M10583L87533
17326A4058277N81525L78326O49784J3344N89742K09088m2304J26036k07051q75189
17316A5481578k61966k95730l20472o48767l69384r2158n78027J02355Q2459N1409
17306A3151297M07182r4390O60178j0879M57200K35862L88979j42570J22166o179
$$ plain form
17375 6640090 6304686 6099970 6592853 6388052 7051570 7159144 7640462 8023311 8506491
17366 8506491 8842561 8902125 9175585 9276965 9216219 9269467 8996627 8798037 8753074 8461625
17356 8461625 8579669 8522784 8761485 9360760 9322563 9839064 10294366 10957469 11362173 12210862
17346 12210862 12703386 13368108 13944234 13958844 14706487 14776439 14238502 14285207 13869828 13756280
17336 13756280 13144366 12881491 12808249 12384910 12644963 12349952 12446969 13260161 13670744 14058277
17326 14058277 14639802 15018128 15667912 15681256 16270998 16480086 16437782 16563818 16356767 15481578
17316 15481578 15219612 14923882 14603410 13954643 13585259 13493101 12915074 13017429 13099888 13151297
17306 13151297 13558479 13464089 14124267 14113388 14570588 14806450 15195429 15052859 15175025 15168846
17296A5168846k76634k95224k70417j70582l76455m37015O0567l96417Q9333k06809
17286A2889193j55946M4161p11207J76716m34667m39073n30474l13563o71748
17277I853392o89321n06958o44876n99481m14890o98157j29230l57166j31577
17268E681736j15419M6643k85542L439k87804J65634k72224k54413O1829l22738
17258D421141P1909K6060m05229N7263l1680k1602M7239Q9730k70291J68022p9695
17247D072867j68881j31735N5482j96334K24765j98240J3631m4380j28324p1909
17237C426942r7481j24213J378j18679j93n889n4090J67048j68843r3345K40454
17226C173089k25614J39168L30847k78863J19352j17535P5179K01637l01450J15374
$$ plain form
17296 15168846 14892212 14596988 14326571 14155989 13779534 13342519 13403086 13006669 13096002 12889193
17286 12889193 12733247 12777408 12066201 12242917 11808250 11369177 10838703 10525140 9853392
17277 9853392 9164071 8657113 8012237 7412756 6997866 6299709 6170479 5813313 5681736
17268 5681736 5566317 5612960 5327418 5330857 5043053 5208687 4936463 4682050 4743879 4421141
17258 4421141 4493050 4519110 4113881 4171144 4139464 4117862 4165101 4254831 3984540 4152562 4072867
17247 4072867 3903986 3772251 3827733 3631399 3856164 3657924 3671555 3627175 3498851 3426942
17237 3426942 3329461 3205248 3206626 3087947 3087754 3081865 3027775 3194823 3025980 2932635 3173089
17226 3173089 2947475 3086643 3417490 3138627 3257979 3140444 3215623 3417260 3115810 3231184
17216C231184M8082N9809K71790l27463J06030P5440p2926Q0277k08693M69985
17206C733515j48714j5089j53569M09631q4118r3947o2719k10042R6886j21487
17196C350347l99170Q247k19209k05947j2617m9015q7923L85036o24070K97051
17186B442730Q4417J47227k72594O0802N9191j48026K0589k96865L04267j51457
17176B250281j59615k25805K70552j14929N4158n5625L20457j06926R1466j5998
17166B308016j48541L9017j733L9175J35679o0188J63705L1932r1081J56457l27219
17155B245219N38852j42509N6191j76860J05517N06J18243l25456J23360k02891
17145B340172l0760J36384J05669j40780j55909K54517o2049P5242r9138L14700
$$ plain form
17216 3231184 3279266 3339075 3610865 3283402 3389432 3464872 3391946 3472223 3263530 3733515
17206 3733515 3584801 3569712 3416143 3825774 3741656 3647709 3584990 3374948 3471834 3350347
17196 3350347 2951177 2959424 2740215 2534268 2521651 2472636 2384713 2769749 2145679 2442730
17186 2442730 2527147 2674374 2401780 2462582 2521773 2373747 2394336 2097471 2401738 2250281
17176 2250281 2090666 1864861 2135413 2020484 2074642 2019017 2339474 2232548 2324014 2308016
17166 2308016 2159475 2198492 2196759 2235934 2371613 2311425 2475130 2507062 2415981 2572438 2245219
17155 2245219 2784071 2641562 2697753 2520893 2626410 2626916 2745159 2419703 2543063 2340172
17145 2340172 2309412 2445796 2551465 2410685 2254776 2509293 2447244 2522486 2423348 2738048
17135B738048n8357k7811M5428j06285Q2677l08744K76902j56278J71507L0612
17125B687699L26651k33202K4798j10670K32840l34774M78714j39685j88993j60298
17115B583080J932j68880p48j4676J51670j23052k46769q5300K1485p1666Q123
17104B055199j8171N8674j74739K06008j86268M7552j13986J21775j23104j30416
17094A742524M9238Q3936l79606J54417k65864K72471k05154J40648p5360q6637
17084A430613L2508j74852n6343j74120M03906j88007J76737m7744l0172J9046
17074A391572j49369J27401j4939R2658k59250K49586j95450J81547q0101k08639
17064A135016L46365j32868p3710r9897J03905L7706l0687J63465l4784J73434
$$ plain form
17135 2738048 2679691 2651880 2697308 2591023 2673700 2364956 2641858 2485580 2657087 2687699
17125 2687699 3014350 2781148 2805946 2695276 2928116 2593342 3072056 2932371 2743378 2583080
17115 2583080 2585012 2416132 2415384 2400708 2552378 2429326 2182557 2097257 2118742 2047076 2055199
17104 2055199 2037028 2095702 1920963 2126971 1940703 1988255 1874269 1996044 1872940 1742524
17094 1742524 1791762 1875698 1496092 1650509 1384645 1657116 1451962 1592610 1517250 1430613
17084 1430613 1463121 1288269 1231926 1057806 1461712 1273705 1450442 1402698 1372526 1391572
17074 1391572 1242203 1369604 1354665 1447323 1188073 1437659 1242209 1423756 1343655 1135016
17064 1135016 1481381 1348513 1274803 1174906 1278811 1316517 1285830 1449295 1414511 1587945
17054A587945N6436j32118M11636l66540J81629J4903p9269L02369j80714j58848
17044A637429J85674J29018J04332q5042o5860K23922k9901J25459k39384L43967
17034B329614j80541P8355j72399M5509j88548k25627J2833j83078K25322l0116
17024A711324k50290J28159q6812o3012J90558l67833J53334j02560P4381j80561
17014A206688J23507r8856l7651L15460k47772O9350j34633J56630R8760k34336
17004A217147j09156L56697k85554n6225Q8865K35080k44201R2474j78803L86126
16994A502450j70233p432Q6278j76539j73478J49102p844m7879J65577j56568
16984A163434j3379J76540J93354l03323K97601m7629j67590J85675k15672L30971
$$ plain form
17054 1587945 1644381 1512263 1923899 1557359 1738988 1753891 1674622 1976991 1796277 1637429
17044 1637429 1823103 1952121 2056453 1971411 1905551 2129473 2099572 2225031 1985647 2329614
17034 2329614 2149073 2227428 2055029 2100538 1911990 1686363 1699196 1516118 1741440 1711324
17024 1711324 1461034 1589193 1502381 1439369 1629927 1262094 1415428 1312868 1387249 1206688
17014 1206688 1330195 1231339 1193688 1509148 1261376 1330726 1196093 1352723 1451483 1217147
17004 1217147 1107991 1464688 1179134 1122909 1211774 1446854 1202653 1295127 1116324 1502450
16994 1502450 1332217 1324785 1411063 1234524 1061046 1210148 1202304 1154425 1320002 1163434
16984 1163434 1150055 1326595 1519949 1216626 1514227 1466598 1299008 1484683 1269011 1599982
16974A599982j76442Q26K21319j23396K87774M4780R4902N4747L64400j46440
16964B222452P6380M0065L39507k03976L99819n4306K1396J10330Q7755j0153
16954C029269j7946K3951k28012K03152k66277O7420j27778j01128R4612k22880
16944B454383N959l23216P1770l03685q5187k76298K26523q8352k15409p5041
16934A391447K90922j69297j67347K0744N14j33388N6999J83244j17678m1598
16924A314562K6363n1543j78586J36068j11347j6223N4503n6504k7765K05253
16914A294781k4228p688q8628q5671O0984j5501k43901K24995p6350J5519j63458
16903H90854J94116M4134j77974P4535l7370M1856l4253O4175o5440L8393P1481
$$ plain form
16974 1599982 1423540 1424366 1645685 1522289 1810063 1854843 1949745 2004492 2368892 2222452
16964 2222452 2298832 2338897 2678404 2474428 2874247 2819941 2841337 2951667 3039422 3029269
16954 3029269 3011323 3035274 2807262 3010414 2744137 2811557 2683779 2582651 2677263 2454383
16944 2454383 2460342 2137126 2208896 1905211 1820024 1543726 1770249 1681897 1466488 1391447
16934 1391447 1682369 1513072 1345725 1366469 1366983 1233595 1290594 1473838 1356160 1314562
16924 1314562 1340925 1289382 1110796 1246864 1135517 1119294 1173797 1117293 1089528 1294781
16914 1294781 1270553 1262865 1174237 1088566 1149550 1134049 890148 1115143 1038793 1054312 890854
16903 890854 1084970 1129104 951130 1025665 988295 1030151 995898 1060073 994633 1033026 1104507
16892A104507j74411j82071Q9861P8915j0744O4964j62081K05005j57252K2975
16882H79668K00597n6494P8532j65753r7522k4178J64205O5059j13774m7765R2301
16871I74876p2628J29456K08163k63411K48824k96041k16681J65133O0121Q5303
16861A023115o1371J44183j73647J93631l5528M4177M251j8555k04209M21735
16851A337782l02204r3388J15451r3022M7474J35962j73082P4276j65875P483
16841H90857O8807j66472R5749O1064J02943k73624N2030K78378k49132J33474
16831I94074K35148j37855l8359L314r2783L32296l6789Q182O3865m2050K0533
16820A309576J48512j10783M6502J22081j3286J79606O1835j17170m7885J411
$$ plain form
16892 1104507 930096 748025 837886 916801 906057 971021 808940 1013945 856693 879668
16882 879668 1080265 1023771 1102303 936550 839028 814850 979055 1044114 930340 882575 974876
16871 974876 902248 1031704 1239867 976456 1225280 929239 712558 877691 937812 1023115
16861 1023115 961744 1105927 932280 1125911 1090383 1134560 1138811 1120256 916047 1337782
16851 1337782 1035578 942190 1057641 964619 1012093 1148055 974973 1049249 883374 890857
16841 890857 959664 793192 888941 950005 1052948 779324 831354 1109732 860600 994074
16831 994074 1229222 1091367 1053008 1056322 963539 1295835 1259046 1267228 1331093 1289043 1309576
16820 1309576 1458088 1347305 1393807 1515888 1502602 1682208 1744043 1626873 1578988 1580399
16810A580399k38207L30515K0409j75230Q9659l89027K50529J37091R6176k02914
16800A499400l6112j71998L0667l0956K84486l10690J24741q3866o2240J1683
16790A255115l28671J65061j34658l06964L88944Q4627n1334M212j04984j10052
16780H61296J54159j91641J28853m43k40658J69354Q844D19236L70553K77248
16770A067037k32025R6662j06781n1064n5983J48048l7025N7976r8303j3512J20315
16759H95345m9170j66321J47788J20662r7683P2788K6735R4828j66281K67346
16749A146037k51632J6911n4425J93901j07346k9008L9763j86279Q0741L65372
16739A214035j09695m3285q5461R904J60030j21029K23836k69901K49578k30484
$$ plain form
16810 1580399 1342192 1672707 1693116 1517886 1607545 1218518 1469047 1606138 1702314 1499400
16800 1499400 1463288 1291290 1321957 1291001 1575487 1264797 1389538 1305672 1243432 1255115
16790 1255115 926444 1091505 956847 649883 1038827 1123454 1072120 1076332 971348 861296
16780 861296 1015455 823814 952667 952224 711566 880920 889764 419236 789789 1067037
16770 1067037 835012 931674 824893 773829 717846 865894 828869 886845 788542 775030 895345
16759 895345 846175 679854 827642 948304 850621 923409 950144 1044972 878691 1146037
16749 1146037 894405 911316 856891 1050792 943446 914438 954201 767922 848663 1214035
16739 1214035 1104340 1061055 975594 985498 1145528 1024499 1248335 978434 1228012 997528
16729I97528Q1790N0751k3274o8698J53617O1654l642L4083r4614K03850k20419
16718A172626Q9079p0376M7734J20213p8808k09868j8232J69994k53836M94635
16708A463161j18661m3226J70142K16195m9599K84350J7413r5980K79957j63138
16698A960614j08521J65629j47828J27250j72807K13086l83734L18697N0783R8280
16688B121449n89084M79669O066R376k54676J07817o1900j77342k8566p6496m2786
16677A493527P0564r5627k35895Q6874K7974J03624m14K45337P671k42649N21102
16666A982088R4428o4087J7701n6928k4649J05266l65027L09866j04495L074l4001
16655A863236k2023L1874J95886k82236Q9105q9603J64004k04626k42315q0349
$$ plain form
16729 997528 1079318 1130069 1106795 1038097 1191714 1253368 1249726 1283809 1189195 1393045 1172626
16718 1172626 1261705 1191329 1239063 1359276 1280468 1070600 1052368 1222362 968526 1463161
16708 1463161 1344500 1301274 1471416 1687611 1638012 1922362 1939775 1843795 2123752 1960614
16698 1960614 1852093 2017722 1869894 1997144 1824337 2037423 1653689 1972386 2023169 2121449
16688 2121449 1532365 2012034 2018100 2027476 1772800 1880617 1818717 1641375 1612809 1536313 1493527
16677 1493527 1564091 1468464 1232569 1319443 1347417 1451041 1450627 1695964 1703635 1460986 1982088
16666 1982088 2076516 2012429 2030130 1973202 1948553 2053819 1688792 1998658 1894163 1897237 1863236
16655 1863236 1841213 1873087 2068973 1786737 1875842 1786239 1950243 1745617 1503302 1422953
16645A422953j84478k7326j9083l58828K56628l37794L54487j55941j1693k1856
16635I17069m7498K30823j14950j96802j2081J70830j51237J75053l9035k38883
16625F93289L81170j53970J2646j06159J55777J31167q7287j12029L2005n7751
16615H88858J79363j97959M04118j46729j08555L42207k80756j29790K27347J99406
16605A377510k39197J23829J8084j94561J34464R3382R7954k23592J5632j7722
16595A185783L23398k39351J82421j14740j93061L02473p6941l5221k78191J39477
16585A196047O6821J26570k70898J55795L2627n22487L52239j17304j02905j75049
16575G41456K10848k08534K25167O378L3379j8586K3460j30831j81670L24695
$$ plain form
16645 1422953 1238475 1211149 1192066 833238 1089866 752072 1106559 950618 938925 917069
16635 917069 869571 1100394 985444 788642 776561 947391 796154 971207 932172 693289
16625 693289 1074459 920489 933135 826976 982753 1113920 1026633 914604 946609 888858
16615 888858 1068221 870262 1274380 1127651 1019096 1361303 1080547 950757 1178104 1377510
16605 1377510 1138313 1262142 1280226 1085665 1220129 1313511 1411465 1187873 1203505 1185783
16595 1185783 1509181 1269830 1452251 1337511 1144450 1446923 1369982 1334761 1056570 1196047
16585 1196047 1262868 1389438 1118540 1274335 1306962 784475 1136714 1019410 916505 741456
16575 741456 952304 743770 968937 975315 1008694 990108 1013568 882737 701067 1025762
16565A025762l98572J54742Q7316P4124J33458k19386M88n1867J35368J06593
16555A048026k72481P7326J61437K0862L00024k31777J92927j31861j12159J83964
16545A236288j24601J48113j43731j529l0838J37566o8153K19458k51203K04479
16535A325849r2745j89718J30014J37822J38590M0360l5022n38219M28031Q829
16525A353791j04427N0324L2699k04702K05522K5623j11422j40815J38904j97068
16515A048429K80610n3749K8783j39180L4810J57039j62212M87173j61577l2484
16505A487642o7528M97138l09379P0944j21192N49563j96946n3293L74598j62575
16495B068972o0168L02633l0092L55358k55165K55016n8594M1236K10922M50j0980
$$ plain form
16565 1025762 627190 781932 869248 943372 1076830 857444 857932 806065 941433 1048026
16555 1048026 775545 852871 1014308 1035170 1335194 1103417 1296344 1164483 1052324 1236288
16545 1236288 1111687 1259800 1116069 1114540 1083702 1221268 1153115 1372573 1121370 1325849
16535 1325849 1233104 1043386 1173400 1311222 1449812 1490172 1455150 916931 1344962 1353791
16525 1353791 1249364 1299688 1332387 1127685 1333207 1358830 1247408 1106593 1245497 1048429
16515 1048429 1329039 1275290 1304073 1164893 1199703 1356742 1194530 1681703 1520126 1487642
16505 1487642 1420114 1917252 1607873 1678817 1557625 2107188 1910242 1856949 2231547 2068972
16495 2068972 2008804 2311437 2281345 2636703 2381538 2636554 2577960 2619196 2830118 2830568 2819588
16484B819588N4875p269O0534K229J15487J14018k23784J33290J27692j99023
16474B997637J83765M92831j9705k35887O45044j21647J51314L57425K46469l33252
16464D363994J99484M04525j8538J80361L64L1445R6228o6680L66696Q3276K70689
16453E911844N3567J62474L65589J56860K54556K87500M28356M01119L47146N79470
16443H948481O00556P17250J187684Q55558J440833J221379J579697J468285J881285
16434A9901008J922898K314373K339245L279462L207493L623688M132218M848565
16426D5568950N520793O145745O905180P638932O603528O347763M747210M230469
16418I3708570M066840L789729L705354L922372L059701L262676J492221l92292
$$ plain form
16484 2819588 2874463 2867194 2927728 2929957 3045444 3159462 2935678 3068968 3196660 2997637
16474 2997637 3181402 3674233 3654528 3418641 4063685 3942038 4093352 4450777 4697246 4363994
16464 4363994 4563478 4968003 4949465 5129826 5130190 5161635 5257863 5191183 5557879 5641155 5911844
16453 5911844 5965411 6127885 6493474 6650334 6904890 7192390 7620746 8021865 8369011 8948481
16443 8948481 9549037 10266287 11453971 12309529 13750362 14971741 16551438 18019723 19901008
16434 19901008 21823906 24138279 26477524 29756986 32964479 36588167 40720385 45568950
16426 45568950 51089743 57235488 64140668 71779600 78383128 84730891 89478101 93708570
16418 93708570 97775410 101565139 105270493 109192865 112252566 115515242 117007463 116615171
16410A16615171j132191j939814k649644k621624l240138l824901m391447m671675
16402I2143737n173963n992921o108458o363330o517611o916431o146513n828742
16394D3095768m408552k614860L73924M946713R895361J2103822R419539M686466
16386G7498181N93537j291148l477174m458840n266870o449532o368239p820917
16378D2958998r526366j0667764q253792l483272O58808K261477K067279J041575
16370A7056943m26620o11998j246136j166512j381514j336714r55694j128807
16362H802948p21194n14990q78079p13792q32185n97861o69084o49227n99466
16353B627070m77231k61105k18696J93515j73457k32649P242M297j73760l59494
$$ plain form
16410 116615171 115482980 113543166 110893522 108271898 105031760 101206859 96815412 92143737
16402 92143737 86969774 80976853 74868395 68505065 61987454 55071023 48924510 43095768
16394 43095768 38687216 36072356 36446280 41392993 51288354 63392176 72811715 77498181
16386 77498181 78091718 76800570 73323396 68864556 63597686 57148154 50779915 42958998
16378 42958998 33432632 22764868 14511076 11027804 11686612 13948089 16015368 17056943
16370 17056943 16630323 16018325 14772189 13605677 12224163 10887449 9931755 8802948
16362 8802948 8081754 7566764 6688685 5974893 5142708 4544847 3875763 3226536 2627070
16353 2627070 2149839 1888734 1670038 1863553 1690096 1457447 1464689 1468986 1295226 935732
16343I35732L35550j40250L5612J51051J40039p6962J42635j19735J08461k65816
16333A246317k6598l51428j6593k9524l23932j11900A26722L9082J25508E5822
16322B32245J9042o3040L0838I4881j0220P0282R0785j05847P3716G8960J31138
16311B10098n9124K64168M0602q6135p6562L31438k88816M1094j62108L06574
16301E21229B01030N9496j05394K42398L12355j13158m6006J42196j45629K66665
16291H13953p7877r1365k4114j5204j29610K13399j28128p0800K30881N4896J80561
16280I56592J08123k37639R9954J41443m37369K06955k25151J79203j23637P8183
16270G46657K00862K174j32679J6729J70102j44549j95250j56243N3342o2665
$$ plain form
16343 935732 1271282 1131032 1166644 1317695 1457734 1380772 1523407 1403672 1512133 1246317
16333 1246317 1219719 868291 851698 822174 498242 386342 126722 165804 291312 55822
16322 232245 251287 188247 219085 94881 84661 154943 245728 139881 213597 78960 210098
16311 210098 150974 415142 455744 369609 293047 624485 335669 376763 214655 521229
16301 521229 201030 260526 155132 397530 709885 596727 550721 692917 547288 813953
16291 813953 736076 644711 620597 605393 475783 689182 561054 490254 721135 776031 956592
16280 956592 1064715 827076 927030 1068473 631104 838059 612908 792111 668474 746657
16270 746657 947519 949693 817014 833743 1003845 859296 664046 507803 561145 498480
16260D98480J46083j53223q5629J44432L9201j84741L99758j32036p6314J35516
16250G31527j90455R1918J53696P0971l08957K94883J02567j89191O1575J69229
16240I87763p6665R6174j01337K01240Q0550k50147j95484O7265J83642k47369
16230G45632J24752j33583p3723J2234r6710O3465j07190j12406J92856L32002
16220I47329m30311L33361p3922j28804O7302r698K27065J87439j33782j45588
16210H40391K24895n1285P2208j7747j19030j54420j19403J28489p9571J51639
16200H76166m9636K9006j26588J94628P9682m49892l8766K70251r4611p5259K90471
16189I05452k85699O3871j16606J81302l5931J78443j77749j38043J26614o7497
$$ plain form
16260 498480 644563 491340 405711 550143 589344 404603 804361 672325 596011 731527
16250 731527 541072 632990 786686 857657 548700 843583 946150 756959 818534 987763
16240 987763 911098 1007272 905935 1107175 1187725 937578 742094 809359 993001 745632
16230 745632 870384 736801 663078 675312 578602 642067 534877 422471 615327 947329
16220 947329 517018 850379 776457 647653 714955 705257 932322 1119761 985979 840391
16210 840391 1065286 1014001 1086209 1068462 949432 795012 675609 804098 724527 876166
16200 876166 826530 855536 728948 923576 1003258 553366 514600 784851 690240 614981 905452
16189 905452 619753 683624 567018 748320 712389 890832 713083 575040 701654 634157
16179F34157k2878m9878j51068J00048L05750n5072N8890l5485p3809K57823m6547
16168I21931l31227M10664q9378k17974K26332l50415J90977L9829N3054j77133
16158F76660j99163J58466p820N622K56700k64287K83250k91388P1699j52088
16148E37651K01768k4516j6063q109J91359K1934M6786k68978K65799k37454L27061
16137A037238k21994K3520L22089k98211j33190P6240J17960q4032K2049O87K59798
16126A122154l08461k5338L5228J63837j67924n314l2374L4805N9227J52138j62248
16115H65730p1934M3545R0660k29476K03860P3812q958J74591j98378J723N2574
16104I97749k58457J01021L56000m44994J56510J49108m03119J90089K06867K3603
$$ plain form
16179 634157 611279 561401 410333 510381 816131 761059 819949 784464 710655 968478 921931
16168 921931 590704 1001368 911990 694016 920348 569933 760910 800739 853793 676660
16158 676660 477497 635963 628143 633765 890465 626178 909428 618040 689739 537651
16148 537651 739419 714903 698840 690731 882090 904024 950810 681832 947631 710177 1037238
16137 1037238 815244 838764 1160853 862642 729452 805692 923652 839620 861669 862356 1122154
16126 1122154 813693 788355 823583 987420 819496 814182 781808 816613 875840 1027978 865730
16115 865730 793796 837341 928001 698525 902385 976197 967239 1141830 943452 945175 997749
16104 997749 739292 840313 1196313 751319 907829 1056937 653818 843907 1050774 1074377
16094A074377J8766J36507l27326J86133o6279K6960l8985J32944k03040J96120
16084A136177r9598K03313j36171O838L2705L4179J22206l94119K23379R1972
16074A220881R483p3945j58497J30896o8937K10199j35180K05605o4850K19450
16064A495105n8911M3402M0553q5865O4543R3190j94519q3984K6335J52947L4701
16053A527497J11740k99912K48127k80050L04843J48409J45965k59850J94430
16044A841199k60255Q5577L5645j43944j49410J12057N9899k9881N2150k2500
16034A580537L87876l08802R1406J62070j44965L17040k69899R3744l8523Q4533
16024A955017q5926R2008J3993P3916k634M7059j15301L39978l84032M20474l40926
$$ plain form
16094 1074377 1093143 1229650 902324 1088457 1022178 1049138 1010153 1143097 940057 1136177
16084 1136177 1036579 1239892 1103721 1110559 1143264 1177443 1299649 905530 1128909 1220881
16074 1220881 1230364 1156419 997922 1128818 1059881 1270080 1134900 1340505 1275655 1495105
16064 1495105 1436194 1479596 1520149 1434284 1498827 1592017 1397498 1313514 1339849 1492796 1527497
16053 1527497 1639237 1339325 1587452 1307402 1612245 1760654 1906619 1646769 1841199
16044 1841199 1580944 1666521 1702166 1558222 1408812 1520869 1580768 1550887 1603037 1580537
16034 1580537 1968413 1659611 1751017 1913087 1768122 2085162 1815263 1909007 1870484 1955017
16024 1955017 1869091 1961099 1975092 2049008 2046374 2093433 1978132 2318110 1934078 2354552 2013626
16013B013626L29539j63286l15429M42882L4496N0160p1973k92844K09782k7005
16003B209948j11252L2394m7811J34176K16804k86550J11384j35229J30718m08716
15993A845866K38347r4835J05393J37263m8386L6839p5537Q1141m5783K3554N3642
15982B257504J06275j41288j58930K95554J40457K5519k44218K47332j15211J86682
15972B599676q4732k71159p1085J72864j1003Q2027L758l77613J29642p2985p2093
15961B027297J96665k98956M38856j56204k9993J64626j7241k03778K5919J60985
15951B308176k4243m6188j43826J15979N6047P5146k9712j22485J75824J02133
15941B466851j93735J1708K50194k77540M3763J94365J8814R6888M0081J01838
$$ plain form
16013 2013626 2343165 2179879 1864450 2307332 2341828 2391988 2320015 2027171 2236953 2209948
16003 2209948 2098696 2131090 2083279 2217455 2434259 2147709 2259093 2123864 2254582 1845866
15993 1845866 2084213 1989378 2094771 2232034 2183648 2220487 2144950 2226091 2180308 2203862 2257504
15982 2257504 2363779 2222491 2063561 2359115 2499572 2525091 2280873 2528205 2412994 2599676
15972 2599676 2514944 2243785 2172700 2345564 2334561 2416588 2420346 2042733 2172375 2099390 2027297
15961 2027297 2223962 1925006 2363862 2207658 2177665 2342291 2325050 2121272 2147191 2308176
15951 2308176 2283933 2237745 2093919 2209898 2265945 2341091 2311379 2188894 2364718 2466851
15941 2466851 2273116 2284824 2535018 2257478 2301241 2495606 2514420 2611308 2651389 2753227
15931B753227j97142K06878J97005K625k759J56699q6399J31827j26742N7066
15921C092285M57861j17653K07602L04003M61448j46924O07829L94276K59369
15912E520096L04019J072472R87095J365213J780140L033431M027269N104871
15904B3194606O210574O951973P013354O097052N023857L567901J906127J28802
15896F0094246k069890m039696o050162p187429p960951p296718o318451m368980
15888A4801969l430850k046960j586121j109945o80907q94049m62005o78469l81711
15879C530952m0508L19647n75766P1205k82376j999j99208N6112N7913k9541l42201
15868B564230L16227l53121L13628l50615J85698k27254J7852o387k0381j91347
$$ plain form
15931 2753227 2556085 2762963 2959968 2962593 2959834 3116533 3030134 3161961 3035219 3092285
15921 3092285 3550146 3432493 3640095 3944098 4405546 4258622 4866451 5260727 5520096
15912 5520096 5824115 6896587 7883682 9248895 11029035 14062466 18089735 23194606
15904 23194606 29405180 36357153 43370507 49467559 54491416 58059317 59965444 60094246
15896 60094246 58024356 53984660 47934498 40747069 32786118 25489400 19170949 14801969
15888 14801969 11371119 9324159 7738038 6628093 5947186 5053137 4591132 3912663 3530952
15879 3530952 3490444 3810091 3234325 3305530 3023154 3021155 2821947 2878059 2935972 2906431 2564230
15868 2564230 2880457 2527336 2840964 2490349 2676047 2448793 2466645 2460258 2439877 2248530
15858B248530o3992P6304q8003J75324K7863R1532n8743n4185j44252K4930j86870
15847B048438l0310K77866L6221j79588J70225p9160J36512q4643R7208j74131
15837B218638K90820p7028k52315M38283R335M4986n8418R1899k25068o8347P5755
15826B488540j09688j20846K11621j8481j1525k76077J12144O1739k01933L0306
15816B165800J9057j9753K71080J990J37765j03898j0880L22545j82456R6358
15806B697608J02366n672m9522J16451k19542K99064k64812o4946M80003P919
15796C098917J29240Q2928M0823L99898k52546J56806K27529j19830q9484M7059
15786C721340R8897K66095P9705J26237O8956M3636L18593K9591L57951J81123
$$ plain form
15858 2248530 2184538 2260842 2172839 2348163 2376026 2467558 2408815 2354630 2210378 2235308 2048438
15847 2048438 2018128 2295994 2332215 2152627 2322852 2243692 2380204 2295561 2392769 2218638
15837 2218638 2509458 2432430 2180115 2618398 2627733 2672719 2614301 2706200 2481132 2412785 2488540
15826 2488540 2378852 2258006 2469627 2451146 2439621 2163544 2275688 2337427 2135494 2165800
15816 2165800 2184857 2165104 2436184 2438174 2575939 2472041 2461161 2783706 2601250 2697608
15806 2697608 2799974 2794302 2744780 2861231 2641689 2940753 2675941 2610995 3090998 3098917
15796 3098917 3228157 3311085 3351908 3751806 3499260 3656066 3883595 3763765 3674281 3721340
15786 3721340 3820237 4086332 4166037 4292274 4361230 4404866 4723459 4753050 5111001 5292124
15776E292124j92412J51329l56693J82072q3317J04564j47179K11067l31208J41456
15766D971803N2906L08107P7054p824J5844L1685P8910j70668o340l6995l36120
15755D978362R9055r7309P1242R7156J43818J4975P8109r2492Q5652J84838J78077
15744E741483m5042O49493r6260N06765j32433M52719P1976P7174k2293l6573
15734G167009j3938N28806j91802N3213K61685P4599j41332Q7396L1980n4633
15724G802983j81143j4563j24406k79148k89992q9255j66191k1695L78259j75844
15714F839005J42067k11272o0941o3854k431n816j77350k40092K17697K00982
15704F637995K01613K85795L04291l1051K74666J72667K5044J16403o9329N9157
$$ plain form
15776 5292124 5099712 5251041 4894348 5076420 4993103 5097667 4950488 5161555 4830347 4971803
15766 4971803 5024709 5332816 5409870 5402046 5417890 5449575 5528485 5357817 5351477 5314482 4978362
15755 4978362 5077417 4980108 5051350 5148506 5292324 5307299 5385408 5292916 5378568 5563406 5741483
15744 5741483 5696441 6345934 6249674 6756439 6624006 7076725 7148701 7225875 7203582 7167009
15734 7167009 7153071 7681877 7490075 7543288 7804973 7879572 7738240 7825636 7857616 7802983
15724 7802983 7621840 7607277 7482871 7203723 6913731 6824476 6658285 6636590 7014849 6839005
15714 6839005 6981072 6769800 6708859 6645005 6642574 6636758 6459408 6219316 6437013 6637995
15704 6637995 6839608 7125403 7429694 7398643 7673309 7845976 7871020 7987423 7918094 7977251
15694G977251j90757K66918K18106m04101l0923r4396j81855N6729k1769l74491
15684G220712J73565n6141o3716r6195j43076n5290R5413J0155j41111l73477
15674F570839O347O8169j05916l18056J29010K0478j07540L21325J18334K83234
15664F986224p4393P28151N1978N33096L22426N71166N44702M76964P07400K06260
15654A1053974P10646O94984Q60829O08829Q56563M35632P06679O56290L65409
15645A6949835K36622J054481N21540P94169P82334P13374J242313N08346P59897
15636B3562911L44998K52239K08278j52992p0351j85109m49625l0491k02010L1317
15626B3309165l63816j24030j33503j86126n32243q00860p52913p34994j291627
$$ plain form
15694 7977251 7786494 8053412 8271518 7867417 7836494 7742098 7560243 7616972 7595203 7220712
15684 7220712 7394277 7338136 7274420 7178225 7035149 6979859 7075272 7085427 6944316 6570839
15674 6570839 6577186 6645355 6539439 6221383 6350393 6370871 6263331 6584656 6702990 6986224
15664 6986224 6911831 7639982 7691960 8225056 8547482 9118648 9663350 10140314 10847714 11053974
15654 11053974 11764620 12459604 13320433 13929262 14785825 15221457 15928136 16584426 16949835
15645 16949835 17186457 18240938 18762478 19556647 20338981 21052355 22294668 22803014 23562911
15636 23562911 23907909 24160148 24368426 24215434 24145083 23959974 23510349 23479858 23277848 23309165
15626 23309165 22945349 22821319 22687816 22501690 21969447 21168587 20415674 19680680 18389053
15617A8389053r02655q90819j025167n29918o67184m58714q88030o8757l63616
15608A2594193n88789l22608l09687K7240n46878k64759j55177k68229l27928
15599I837378P3453J52609k45139L82354K34956L07354Q01626J264921L596739
15590A6406251P030422J0346520R552402P182361M590669L449356K042672N14103
15582F1114756o78974k204004o412811j1530173j2964604r250972m825362k573237
15574A0674619j122018n98832k84191o25722J47010j51279J88793R1320J95784
15565H515484k9302j2141N34733p822J90916K89211O01704J367238K462488N161061
15555A9073570J0784656J3942798J2035915Q164904N594274L803589K487639J83349
$$ plain form
15617 18389053 17486398 16595579 15570412 15040494 14373310 13914596 13026566 12957809 12594193
15608 12594193 12005404 11682796 11373109 11400349 10853471 10588712 10433535 10165306 9837378
15599 9837378 9910831 10063440 9818301 10200655 10435611 10742965 11544591 12809512 16406251
15590 16406251 23436673 33783193 43335595 50517956 55108625 58557981 60600653 61114756
15582 61114756 60435782 58231778 51818967 40288794 27324190 18073218 13247856 10674619
15574 10674619 9552601 8953769 8669578 8043856 8190866 8039587 8228380 8319700 8515484
15565 8515484 8486182 8474041 9008774 9000952 9191868 9481079 10082783 11450021 13912509 19073570
15555 19073570 29858226 43801024 55836939 64001843 69596117 73399706 75887345 76070694
15547G6070694j255519m341387r954626j6510021j5948688j0597667n210163k420103
15539I832520j272257j307542o09998l56153p4463j04285j04691M6882O8080k80065
15529E838028O1065l14682j58848k20438J67086l5088l69218j60512J10002o3945
15519D853450l70732K71239O9658p9389J72922j46598L29583j60177R8633L48454
15509E387043j75806L18158m191k09924k5264K04585r8086p3867k02229P812j32378
15498D995853r1004K49193k32071J39455J38377k5881J3994k02256N97431l0520
15488E552571k89855M07772R623J28179J62862L45904J79374J50328J29094Q3248
15478F859100k03445L88169k0614J03944p4084M05867K35537N43535P82316P11950
$$ plain form
15547 76070694 74815175 70473788 60519162 44009141 28060453 17462786 12252623 9832520
15539 9832520 8560263 7252721 6642723 6286570 6212107 6107822 6003131 6050013 6118093 5838028
15529 5838028 5899093 5584411 5425563 5205125 5372211 5337123 4967905 4807393 4917395 4853450
15519 4853450 4482718 4753957 4823615 4744226 4917148 4770550 5100133 4939956 5038589 5387043
15509 5387043 5211237 5529395 5525204 5315280 5290016 5494601 5396515 5322648 5120419 5128231 4995853
15498 4995853 4904849 5154042 4921971 5061426 5199803 5173922 5187916 4985660 5583091 5552571
15488 5552571 5262716 5670488 5680111 5808290 5971152 6317056 6496430 6646758 6775852 6859100
15478 6859100 6655655 7043824 7023210 7127154 7053070 7458937 7694474 8238009 9020325 9732275
15468I732275M56695L79593P06601J80063K98456j77099j76680m73277n16095
15459A0410532m82927L11409k955L57710K03206O91794L94911N62483L10567J7925
15449A2774655r3742J40751m18764l31768o81954l91276n8493k06633J15895J96414
15439A1045085J02308J70823J97956k5532l54069p8536k28904l82443l95810k04750
15429I846128l15181n05276j74209k63962k87109j25464k91743j61718j57557
15420G563909k04281m58648p6733l49413l3961o7167k12791l2222J43971j00581
15410F172083j36695J79062l8812Q7805r0778P6574J90381J8819M494N7354J22080
15399F642367M22923q0557J95050j25387K66436m4841j12321k94067N7156k6690
$$ plain form
15468 9732275 10188970 10568563 11275164 11455227 11753683 11576584 11399904 10926627 10410532
15459 10410532 9927605 10239014 10236059 10593769 10796975 11488769 11883680 12446163 12756730 12774655
15449 12774655 12680913 12821664 12402900 12071132 11389178 10997902 10939409 10732776 10848671 11045085
15439 11045085 11147393 11318216 11516172 11490640 11136571 11058035 10829131 10446688 10050878 9846128
15429 9846128 9530947 9025671 8851462 8587500 8300391 8174927 7883184 7721466 7563909
15420 7563909 7359628 6900980 6824247 6474834 6440873 6373706 6160915 6128693 6272664 6172083
15410 6172083 6035388 6214450 6175638 6263443 6172665 6249239 6439620 6458439 6462933 6520287 6642367
15399 6642367 7065290 6984733 7179783 7054396 7320832 7275991 7163670 6869603 6926759 6900069
15389F900069j98947j53611J12197m3293r8822K63487L7543j9220J87858j52142
15379F835119J11808l4049l06970J14216M2585j91439m8500K299J37262m0452
15369F621879j58124J90954K97324n9718K50643k260L60971J02542J1166R7255
15359G712632K81663j30475K46919J86842j1976K07548L17743K28659P33539J116532
15349A0889626J553068K755494N381619N559986M903319L967752K506248J947253
15341C9464365J180434L85303p25492j755026m501245n858538n982369l826684
15333A8380748j632297p72239m63601r1853j69530l92919o15747n65355m92500
15324A3184707k48392N1706J14711o5460L72324M74817P92573J030467J862813
$$ plain form
15389 6900069 6701122 6547511 6659708 6616415 6517593 6781080 6818623 6799403 6987261 6835119
15379 6835119 6946927 6912878 6605908 6720124 6762709 6571270 6522770 6525069 6662331 6621879
15369 6621879 6463755 6654709 6952033 6892315 7142958 7140698 7501669 7604211 7615377 7712632
15359 7712632 7994295 7863820 8110739 8297581 8285605 8493153 8810896 9039555 9773094 10889626
15349 10889626 12442694 15198188 20579807 26139793 31043112 35010864 37517112 39464365
15341 39464365 40644799 41030102 40304610 38549584 34048339 28189801 22207432 18380748
15333 18380748 16748451 15976212 15512611 15420758 15251228 14858309 14242562 13677207 13184707
15324 13184707 12936315 12988021 13102732 13037272 13409596 13884413 14676986 15707453 17570266
15315A7570266M008204O692514R214994R898146Q563567O199359M495417K505924
15307F9148391Q39660o00374k960953o976588j0637254j1701776j0419112p118840
15299A9573154l750109k098231j034974n44516m9521j77712K20280p3308J79710
15290A2244773r1335M80178r2567J4897J12459j3605o9679Q251P11833J475616
15280A4780821L012817M747460N520282M263915K879245K255925J350467P13556
15272C9524488q1132r33802k537117n099794o499259n447237l553271j867106
15264A3505770r81927q22131n46771l52457l91077l40337j74408k99243K16681
15255I814100l65537M10646Q5202M68035L82110K77871K61132J68790l85087L46971
$$ plain form
15315 17570266 21578470 28270984 37485978 47384124 55947691 62147050 66642467 69148391
15307 69148391 69988051 69387677 66426724 59450136 48812882 37111106 26691994 19573154
15299 19573154 15823045 13724814 12689840 12145324 12095803 11918091 12138371 12065063 12244773
15290 12244773 12153438 12633616 12541049 12555946 12668405 12654800 12585121 12593372 13305205 14780821
15280 14780821 17793638 22541098 28061380 32325295 35204540 37460465 38810932 39524488
15272 39524488 39443356 38509554 35972437 30872643 24373384 18926147 15372876 13505770
15264 13505770 12523843 11701712 11154941 10802484 10411407 10071070 9896662 9597419 9814100
15255 9814100 9448563 9859209 9944411 10412446 10794556 11072427 11333559 11502349 11117262 11464233
15245A1464233n49014M6174j22734j71346J89146l41981j50530J52767M94315
15236A1011030M57571M12065O76658M54725N37746K1759J54367P8995k73339l92403
15226A3139174l33549o71305m84159m54625k62627k16957O0953J39800L64452
15217A1281157m20089N73807K76414L68634k29582K77204j77069j63178k69273
15208A1518025p08548n42013l69811m29263o78404p49477k88104l22258l48540
15199G081607l38657m7120j71104p2949K10853j51376L01509K84484J45000M5433
15189G287680M67997J64714l4929j2334K92505o9829K26650j23762Q1595K91554
15179H571841k6004P5168J75307J96524L55256j96604J58896m5725m7638n6585
$$ plain form
15245 11464233 10915219 10961393 10838659 10667313 10856459 10514478 10363948 10516715 11011030
15236 11011030 11468601 11880666 12557324 13012049 13549795 13571554 13725921 13804916 13531577 13139174
15226 13139174 12805625 12134320 11650161 11195536 10932909 10715952 10776905 10916705 11281157
15217 11281157 10861068 11434875 11711289 12079923 11850341 12127545 11950476 11787298 11518025
15208 11518025 10809477 10267464 9897653 9468390 8789986 8040509 7752405 7430147 7081607
15199 7081607 6742950 6695830 6524726 6451777 6662630 6511254 6812763 7097247 7242247 7287680
15189 7287680 7755677 7920391 7885462 7873128 8165633 8095804 8322454 8198692 8280287 8571841
15179 8571841 8545837 8621005 8796312 8992836 9348092 9151488 9310384 9264659 9217021 9160436
15169I160436j12181l17257q4286N3455K71510j72582J93336L1299j76977J73741
15159I020494K59218j36081L22583j02136Q0445K23063k06977J71143k14445k03713
15149I213594j25259p5236P738l05661L48977q0576J98377j63566L04590k4272
15139I298706J16331m5643K7811M1529J17085j67131J86336J6106j17471J08393
15129I582052j44123k9427P9638k87650m9662M51909n30335J50888j37917l5974
15119I049399m86051J31565j5785j06287k6903J10133l37406p8283K84800l09685
15109H215497N2079j7359J85709j90959K49893Q5129K42577J67960J46344N92205
15099I729075O1249k1943M96789L69223M30441L82030Q23998O05772J493904J850011
$$ plain form
15169 9160436 9048255 8730998 8646712 8700167 8971677 8799095 8992431 9023730 8846753 9020494
15159 9020494 9279712 9143631 9466214 9364078 9444523 9667586 9460609 9631752 9417307 9213594
15149 9213594 9088335 9013099 9020837 8715176 9064153 8983577 9181954 9018388 9322978 9298706
15139 9298706 9415037 9369394 9397205 9438734 9555819 9388688 9575024 9591130 9473659 9582052
15129 9582052 9437929 9408502 9488140 9200490 9150828 9602737 9072402 9223290 9085373 9049399
15119 9049399 8563348 8694913 8679128 8572841 8545938 8656071 8318665 8240382 8525182 8215497
15109 8215497 8267576 8250217 8435926 8244967 8494860 8579989 8822566 8990526 9136870 9729075
15099 9729075 9790324 9768381 10265170 10634393 11064834 11446864 12270862 12876634 14370538 16220549
15089A6220549K193547K327811J660165J365825Q55328N42116L24750k25782m25246
15080B4839063j444345j307070j551130n38358R82754J704252K076290J868595
15072B6630051J517388Q26232O98739M47055J8497o4895n90229m77369Q18549
15063B9824018K019160K353751J894640J951505K062241K103729K074972J989331
15055D6273347J279696r60426k087604j985781J55887J936827K622770K357460
15047D9592176J043088N5162J63329L11310O06089P92306k33310j364548k818842
15038D8146760l049111k966010k038916j928230j612338k119901k128701o22268
15030C1681285Q90548J339564J056328R44279J051057R4747Q88937N28727O04566
$$ plain form
15089 16220549 18414096 20741907 22402072 23767897 24623225 25165341 25490091 25264309 24839063
15080 24839063 23394718 22087648 20536518 19998160 20980914 22685166 24761456 26630051
15072 26630051 28147439 28973671 29672410 30119465 30137962 30073067 29482838 29005469 29824018
15063 29824018 31843178 34196929 36091569 38043074 40105315 42209044 44284016 46273347
15055 46273347 47553043 46592617 44505013 42519232 42675119 44611946 47234716 49592176
15047 49592176 50635264 50690426 50853755 51165065 51771154 52563460 52330150 50965602 48146760
15038 48146760 45097649 42131639 40092723 38164493 36552155 34432254 32303553 31681285
15030 31681285 32571833 33911397 34967725 35912004 36963061 37057808 37946745 38475472 39080038
15021C9080038J28036p69818o07357J068726L284065M597354M741407M636828
15013E6159279L801532L786742L265264L164498K711887K494072K011884J551522
15005G8946680J444283K334798L288776M087561M591783M786753N200182N465760
14997A10146576M661026M365878M237240M235782L691751K229389J027349j031883
14989A33563108j980911l549044m973666n425026o776452p255584p298403o617498
14981H9686524o270734o131946n709536o046001o643375o080260m807314m080812
14973D3916546l406193k914719k487025j455960j187161o51066r3513l34207K4447
14964C1411149K9551M73136L42473O26028J139971K039087L131820M400231N895923
$$ plain form
15021 39080038 39208074 38438256 37830899 38899625 42183690 46781044 51522451 56159279
15013 56159279 59960811 63747553 67012817 70177315 72889202 75383274 77395158 78946680
15005 78946680 80390963 82725761 86014537 90102098 94693881 99480634 104680816 110146576
14997 110146576 114807602 119173480 123410720 127646502 131338253 133567642 134594991 133563108
14989 133563108 131582197 128033153 123059487 117634461 110858009 103602425 96304022 89686524
14981 89686524 83415790 77283844 71574308 65528307 58884932 52804672 47997358 43916546
14973 43916546 40510353 37595634 35108609 33652649 32465488 31814422 31720909 31386702 31411149
14964 31411149 31440700 31913836 32256309 32882337 34022308 36061395 39193215 43593446 49489369
14955D9489369R030004J2272121J5920397J8642191K1321371K4382606K5982226
14948A77040285K5907733K5455755K5393017K1161220J2735214K703898m420099
14941B85977023r265899j2988797j6481252j7902775j9574774k2698282k3420269
14934A63644975j8734081j2317844p017822n565632o229633q503910r399519r041963
14926H6834571p195393m954950k918517k076312k442487k693567k624327k880848
14918E9048170l174368l031985k769975m695810o015909p186976o409822m585097
14910B1178228k859931j476418q00721m84690m10388L37057J83423O51511O55906
14901A6973977J025221J243627J152149J634192K985329L684176M063703L558987
$$ plain form
14955 49489369 58519373 70791494 86711891 105354082 126675453 151058059 177040285
14948 177040285 202948018 228403773 253796790 274958010 287693224 290397122 285977023
14941 285977023 276711124 263722327 247241075 229338300 209763526 187065244 163644975
14934 163644975 144910894 132593050 125575228 120009596 113779963 105276053 95876534 86834571
14926 86834571 79639178 74684228 71765711 69689399 67246912 64553345 61929018 59048170
14918 59048170 55873802 52841817 50071842 45376032 39360123 32173147 25763325 21178228
14910 21178228 18318297 16841879 16041158 15556468 15146080 15483137 15666560 16318071 16973977
14901 16973977 17999198 19242825 20394974 22029166 25014495 28698671 32762374 36321361
14893C6321361K629417J870936N13020M33330J29348j150172k127281m432022
14885C4187937m441036m734163l141253j971640o26334n12999o32537l65633J43030
14876A7905372O50693J061054N22718M10496N51224L43102J6206O74198O45495
14867B2780558K94636R620m01682J74757L49797J768323L185863M297319N919423
14858C8378614O686517P317824P429555P305537N231513L260128J697351j179078
14850G6127961l610203o094083p402851q186594q265370q167364n936107m229561
14842B4235828k600735j293718p79921n43504n35083r40944l55379j09850m9118
14833A7027576j83674k88965j38056j56752Q7568M50004K81406L12345Q89751
$$ plain form
14893 36321361 38950778 40821714 41334734 41768064 41897412 40747240 38619959 34187937
14885 34187937 29746901 25012738 21871485 19899845 19273511 18760512 18127975 17762342 17905372
14876 17905372 18556065 19617119 20139837 20550333 21101557 21444659 21460865 22135063 22780558
14867 22780558 23075194 23084814 22683132 22857889 23207686 24976009 28161872 32459191 38378614
14858 38378614 45065131 52382955 59812510 67118047 72349560 75609688 77307039 76127961
14850 76127961 72517758 66423675 59020824 50834230 42568860 34401496 28465389 24235828
14842 24235828 21635093 20341375 19561454 19017950 18482867 17541923 17186544 17076694 17027576
14833 17027576 16843902 16554937 16416881 16260129 16347697 16797701 17079107 17391452 18281203
14824A8281203O58069J343975K448403M268525N437968O411074N564620L879940
14816D8293777K837457J693039O17491p14900k317778m070198o453140p938391
14808C1947357p572487n166045l197890j429614j302108j85832m64954j78953
14800A2449474k49114J99409j68335n1767j56563j33568J34018n77018k45385
14791A1201151k14615J1222j7253l91838n5884K5657Q134K05583j74187P69486
14781A1367456J44323M35364R55648N20966K28086N37048K12918j69472K62891
14772A4495228k87383m51141p56367r51658q21336l98161l80698l09938r3406
14763A0045140m9203P9344l1297Q8860K29318j26261N00042J85470K79460Q4841
$$ plain form
14824 18281203 18939272 20283247 22731650 27000175 32438143 38849217 44413837 48293777
14816 48293777 51131234 52824273 53441764 52726864 50409086 46338888 39885748 31947357
14808 31947357 24374870 19208825 16010935 14581321 13279213 13093381 12628427 12449474
14800 12449474 12200360 12399769 12231434 12179667 12023104 11889536 12023554 11446536 11201151
14791 11201151 10986536 10997758 10980505 10588667 10532783 10558440 10566574 10772157 10597970 11367456
14781 11367456 11511779 11947143 12902791 13423757 13651843 14188891 14401809 14232337 14495228
14772 14495228 14207845 13756704 13000337 12048679 11227343 10829182 10448484 10138546 10045140
14763 10045140 9995937 10075281 10043984 10132844 10362162 10235901 10735943 10921413 11200873 11285714
14753A1285714L23046K22689M57422L98588k9450K37343j5414J02216L4944L97101
14743A3414199J66541O6103J84294M90799Q89645Q02594J494214K097822K403701
14734B2009912L721840N269255Q385720J3117432J9180821K3664633K6093229
14727A21442842K5785709K3109739J7870595J1199023O148208j55341p848925
14720A97551850j6880003k4947512k8772026k9509096k6212662k0221832j3408929
14713C7599790p899865m684681l358522k433358j674638j166774r03021r22190
14705A4556741o23385l19844j113395r84022q51192p40019k91869l19274k57398
14696I056343m0521J23937R7034J8399L16250j94659K38147K3210K88680k24281
$$ plain form
14753 11285714 11608760 11831449 12288871 12687459 12658009 12895352 12879938 12982154 13017098 13414199
14743 13414199 13580740 13646843 13831137 14321936 15211581 16014175 17508389 19606211 22009912
14734 22009912 25731752 31001007 39386727 52504159 71684980 95349613 121442842
14727 121442842 147228551 170338290 188208885 199407908 205556116 205400775 197551850
14720 197551850 180671847 155724335 126952309 97443213 71230551 51008719 37599790
14713 37599790 29699925 25015244 21656722 19223364 17548726 16381952 15478931 14556741
14705 14556741 13933356 13613512 12500117 11516095 10664903 9924884 9633015 9313741 9056343
14696 9056343 9015822 9139759 9236793 9255192 9571442 9376783 9614930 9638140 9926820 9702539
14686I702539q6921k75274l31176r4456J49195N70911J50565P16271N12868J024056
14676A2038578N81035O29635K85974L13129l42743l39732j99640m28742p81310
14667A1756184n48127n40201j81519q4675P826O4984N3775Q7094j28218P1795
14657A0558918j82522r55431j165014q02948p41993J09108Q5825O9816P56028
14648G731787L89710Q00520P17746o719L86367L33724M06374M57302L21726j8926
14638A1519611N95161J80338L05319Q59937L99707k78729L67443o00193o26105
14629A2722489p83037j373865j358829j258417j173255r73266p32529j74489k99047
14620D595755J19433J29687n8882K6503n1168N6233L1538l29817j69404J47655
$$ plain form
14686 9702539 9615618 9340344 9009168 8914712 9063907 9634818 9785383 10501654 11014522 12038578
14676 12038578 12619613 13249248 13535222 13848351 13505608 13165876 12966236 12537494 11756184
14667 11756184 11208057 10667856 10486337 10401662 10409488 10474472 10528247 10615341 10487123 10558918
14657 10558918 10376396 9420965 8255951 7453003 6711010 6820118 6905943 6975759 7731787
14648 7731787 8121497 8922017 9639763 9633044 10019411 10353135 10759509 11216811 11538537 11519611
14638 11519611 12114772 12295110 12600429 13460366 13860073 13581344 13948787 13348594 12722489
14629 12722489 11939452 10565587 9206758 7948341 6775086 5801820 5069291 4894802 4595755
14620 4595755 4715188 4844875 4785993 4812496 4761328 4817561 4849099 4519282 4349878 4497533
14610D497533O8907j66908k51897J91667j29455J00545k76160P57998J08506P04680
14600E605416P81621J044412J411957O51000L89271M37798K54788l7946j09461
14591A0428856q45131o69604j231940j029222q90576o64857j76470J85922j66801
14582D940177j289j64880m3938j2503L4069j02220p136L74455k42329J04357K97319
14571E176082J13739K27696N06774N52988R97482J191316J208436M58718Q98231
14562A1331462J437465K312543M491636N901460N831953M038842K300388K107022
14554C9752771J241979M85930l793k051528l329598n951498p203728m938933j733484
14545A6268118J693815M923904O310916O215959N117928L314400K251515J343392
$$ plain form
14610 4497533 4566440 4399532 4147635 4339302 4209847 4310392 4034232 4792230 4900736 5605416
14600 5605416 6387037 7431449 8843406 9494406 9883677 10321475 10576263 10538317 10428856
14591 10428856 9583725 8914121 7682181 6652959 5762383 5097526 4921056 5106978 4940177
14582 4940177 4938888 4774008 4730070 4717567 4751636 4649416 4642280 5016735 4774406 4878763 5176082
14571 5176082 5289821 5517517 6024291 6577279 7574761 8766077 9974513 10433231 11331462
14562 11331462 12768927 15081470 19573106 25474566 31306519 35345361 37645749 39752771
14554 39752771 40994750 41480680 41476887 39425359 36095761 30144263 22940535 18001602 16268118
14545 16268118 17961933 22885837 29196753 35412712 40530640 43845040 46096555 47439947
14537D7439947M7791j020082l025115n616141p512529p570710m925292k971992
14529A4845877j242506n59946l76125J29720J57568j00425O8958L80345J569473
14520A4872939L052556M467232L742300L301214K367727J759031J539067L90923
14512C5492989L18641m42667k985001m031690m664518k416125N1383J663447L719339
14503B6705798M193900K986825J831072R71237P95607N43008p39499j127940j941544
14494C4218464l878412n276834m827461k563231k180937j830749j586255q98281
14486A1176304j227481j032855j416974j245032j087796l90372j54475m16083
14478D205236p3238J1601m217R1723J88573K18710N36204P20055P52110N21297
$$ plain form
14537 47439947 47487738 46467656 43442541 37826400 30313871 22743161 17817869 14845877
14529 14845877 13603371 13043425 12667300 12797020 12954588 12854163 12923121 13303466 14872939
14520 14872939 17925495 22392727 26135027 29436241 31803968 33562999 35102066 35492989
14512 35492989 35811630 35368963 32383962 28352272 23687754 21271629 21323012 22986459 26705798
14503 26705798 30899698 33886523 35717595 36688832 37484439 38027447 37287948 36160008 34218464
14494 34218464 30340052 25063218 20235757 17672526 15491589 13660840 12074585 11176304
14486 11176304 9948823 8915968 7498994 6253962 5166166 4775794 4621319 4205236
14478 4205236 4131998 4143599 4139382 4231105 4419678 4638388 5174592 5894647 6646757 7168054
14468G168054L17736K07133K0073K62627O7864r3053J32042k98614k260L92394
14458H173996M28040N82834O21488K44323J86230N0645k86158o21429n23197j378107
14448G478665o62125n83930j15858j27467O5455O28074K2669K36586L53954Q6136
14438G382159K75992L15647p3545O28841L17098K46811O15221J217173J885460
14429A2810857K795936M117689M869735M171807L476792K600260K320909J084023
14421C8248008J43171m87411k242973l909702m961074m988743m150332k597178
14413A5053766j855789j510522q92977j449974o90384o91421l65752k65003j42958
14404G188986j14537R047K12469J77322K80659J39736M37769M02615J244854J524520
$$ plain form
14468 7168054 7485790 7692923 7712996 7975623 8043487 7950434 8082476 7783862 7781602 8173996
14458 8173996 8602036 9184870 9806358 10050681 10236911 10287556 10001398 9379969 8856772 7478665
14448 7478665 6816540 6232610 6116752 5989285 6054740 6682814 6705483 6942069 7296023 7382159
14438 7382159 7658151 7973798 7900253 8529094 8846192 9093003 9708224 10925397 12810857
14429 12810857 15606793 19724482 24594217 28766024 32242816 34843076 37163985 38248008
14421 38248008 38391179 37903768 35660795 31751093 26790019 21801276 17650944 15053766
14413 15053766 13197977 11687455 10794478 9344504 8654120 7962699 7596947 7331944 7188986
14404 7188986 7074449 7083496 7295965 7473287 7753946 7893682 8331451 8734066 9978920 11503440
14394A1503440K493922L939546N855412P292576P941216O698388N947501M506557
14386E6178558K763399J341887o60192k778678m983942p731003q898003p918514
14378B7313512o456597m490337l264581j950864j654089n20324p91158j44985
14370H040577j95190j9969k47911k68838M7106k9544l57110K99485j89766L51895
14360G430735K60090P15438M38590J240089K097614K377761L107548K890715L185843
14351B3744423K361582J554262P45168N10727p33180j164426k491413l216981
14343B1310162l324854l352130k259607j971806k29520l7987J935181L242927
14335A5312366K447714K130989J090802Q14117Q60495M63221j18531K3834j404574
$$ plain form
14394 11503440 13997362 17936908 23792320 31084896 39026112 45724500 51672001 56178558
14386 56178558 58941957 60283844 59623652 56844974 51861032 44130029 35232026 27313512
14378 27313512 20856915 16366578 13101997 11151133 9497044 8976720 8185562 8040577
14370 8040577 7845387 7825418 7577507 7308669 7355775 7326231 6969121 7268606 7078840 7430735
14360 7430735 7690825 8406263 8844853 10084942 12182556 14560317 17667865 20558580 23744423
14351 23744423 26106005 27660267 28405435 28916162 28182982 27018556 24527143 21310162
14343 21310162 17985308 14633178 12373571 10401765 10172245 10134258 12069439 15312366
14335 15312366 17760080 19891069 20981871 21795988 22656483 23119704 23001173 23025007 21620433
14326B1620433l634235l039988j691696N9480L14591J048169J259739J788046
14318A7724539K466044K927129L802041N464424O631157R012551J0908127J3100498
14310G2036510J4320483J4163075J1857016R326162O397197K939202Q68l865477
14302A27175036q116344j1910179j4886656j5801701j4786941j2500181r681753
14295C9491281p091386n809889m180108l490540k452800j825555k122465q77773
14287A1640765j247519q69172o44352o61218o33523n53400k33072m95951j16534
14278F186024k15805o0015k59877k45805k06734k17224J7805k53319k28847N3541
14268D569744j65788m28408j37532l50453K42824j62076k16413J29664J16137
$$ plain form
14326 21620433 17986198 14946210 13254514 13313994 13628585 14676754 15936493 17724539
14318 17724539 20190583 23117712 26919753 32384177 39015334 48027885 58936012 72036510
14310 72036510 86356993 100520068 112377084 121703246 128100443 131039645 131040513 127175036
14302 127175036 119058692 107148513 92261857 76460156 61673215 49173034 39491281
14295 39491281 32399895 26590006 22409898 18919358 16466558 14641003 12518538 11640765
14287 11640765 10393246 9524074 8879722 8218504 7584981 7031581 6798509 6302558 6186024
14278 6186024 5970219 5910204 5650327 5404522 5197788 4980564 4998369 4745050 4516203 4569744
14268 4569744 4403956 3975548 3838016 3487563 3730387 3568311 3351898 3481562 3597699
14259C597699M7139l23745r7822K37373k02572j62255k89094K46568N5992M2038
14249C151321l17981O0589k46673r9969J76964m4542k60143K72J59596j69172
14239B410262K31291j50437J34204N9061Q6146m6936k4872j53963j68676J40288
14229B516368l95487K42384j20245j44952K9567Q3956J07578J77923k47562K10248
14219B459778K68920r8772q6382K53066j97710J5839J3715N7440j210M5441K99025
14208C029150Q47613O23970p1590L18383p6250K76123Q1671J87899m23938k81015
14198D512016j117791p54782l68351K53358l00564J7219K65425o2458J07343K45531
14188B796946k94760J14109r1160k67595K54036m86531M36622J16854k92476J05210
$$ plain form
14259 3597699 3644838 3321093 3223271 3460644 3258072 3095817 2806723 3053291 3109283 3151321
14249 3151321 2833340 2893929 2647256 2547287 2724251 2679709 2419566 2419838 2579434 2410262
14239 2410262 2641553 2491116 2625320 2684381 2770527 2723591 2698719 2544756 2376080 2516368
14229 2516368 2120881 2363265 2243020 2098068 2127635 2211591 2319169 2497092 2249530 2459778
14219 2459778 2728698 2629926 2543544 2796610 2598900 2614739 2628454 2685894 2684684 2730125 3029150
14208 3029150 3876763 4500733 4429143 4747526 4671276 4947399 5029070 5216969 4793031 4512016
14198 4512016 3394225 2639443 2271092 2524450 2223886 2241105 2506530 2444072 2551415 2796946
14188 2796946 2502186 2616295 2525135 2257540 2511576 2025045 2461667 2578521 2286045 2391255
14178B391255k12375L85782k447n4620J03099j7712M26319k49994K04965R7507
14168C071779l15651l6626Q1870Q2871k45561o7991R0943l64248P7741m26521
14158A948606L15737j99305L05783r8826q7465L32669M9716k11088l4568J71281
14148B492540j90302L22663k54932K62111J05365L28975P15392O60892J085889
14139E528593J008423P46291O86240N02842M07709K44055O4114l08223n46831
14130H333213q37136j447410q99694n45459p03893p1705p65960J60973J90325
14121C413254K38233N72097J17544r5920L45486R3393J76227k69015j68506m29373
14111C993420k59559l40220o59420J26269j93519J93801J8498n0079J54387L701
$$ plain form
14178 2391255 2178880 2564662 2562215 2507595 2610694 2592982 3019301 2769307 2974272 3071779
14168 3071779 2756128 2719502 2801372 2884243 2638682 2570691 2661634 2297386 2375127 1948606
14158 1948606 2264343 2065038 2370821 2271995 2184530 2517199 2566915 2355827 2321259 2492540
14148 2492540 2302238 2624901 2369969 2632080 2737445 3066420 3781812 4442704 5528593
14139 5528593 6537016 7283307 7969547 8472389 8880098 9124153 9188267 8880044 8333213
14130 8333213 7496077 6048667 5148973 4603514 3899621 3827916 3061956 3222929 3413254
14121 3413254 3651487 4223584 4341128 4245208 4590694 4684087 4860314 4591299 4422793 3993420
14111 3993420 3733861 3393641 2734221 2860490 2666971 2860772 2879270 2829191 2983578 2987279
14101B987279J33990M86124K32812N48402M39763L71511K06140L10723L0107K42678
14091E989529j00441k68293k32975o47721k68294l7259L94840N05016N48246J36245
14081F018893L83501K08922n9933K07860k85067r9226n65544r33925l73546l50795
14071D151140j58507j29631P3191n2637N0034L59194l5478J36853J82749Q04822
14061E381730M8419O67836M55666L91336N75509K97911M48780M69458K10209L26578
14051I273432L30926N06660O98866N31724J380024J390811K085086K057946K488545
14042B0744020L283813M074765M626907O533527Q464539J0392153J3121673J4743453
14034H5984850J4919100J2951095J0291887P027996L457392N77161l172787o962548
$$ plain form
14101 2987279 3121269 3607393 3840205 4388607 4828370 5199881 5406021 5716744 5746851 5989529
14091 5989529 5889088 5620795 5387820 4740099 4471805 4434546 4829386 5334402 5882648 6018893
14081 6018893 6402394 6611316 6551383 6759243 6474176 6374950 5809406 4875481 4501935 4151140
14071 4151140 3992633 3863002 3936193 3883556 3933590 4292784 4257306 4394159 4576908 5381730
14061 5381730 5430149 6097985 6553651 6944987 7520496 7818407 8267187 8736645 8946854 9273432
14051 9273432 9604358 10111018 10809884 11341608 12721632 14112443 16197529 18255475 20744020
14042 20744020 24027833 28102598 32729505 39263032 47727571 58119724 71241397 85984850
14034 85984850 100903950 113855045 124146932 131174928 134632320 135209481 132036694 125074146
14026A25074146j1867941j5339463j7177161j5787697j3408349j0138892p957719
14019C3396924n905585m358411l363993k805117k030230j762373j396536j218836
14011A0555843j044795r94469n51817o01137n57344l99002l16099l57960l47638
14002E385582l7532l03968p2586k73276j85892k50226j15437J4122J94780l93384
13992C962183K13126J34160J88242M64685K59844n79P81421P07208M90397M97525
13982G698212N13449K02579J93228k03583O0872j5007l31734p27278q48978o67389
13972E874371o97576m81972k71036o5095l50611k52053l52584M1077j15586j99545
13962C129390j13136K01189l90614q5813q9129M3831k53488J44511P4390j13258
$$ plain form
14026 125074146 113206205 97866742 80689581 64901884 51493535 41354643 33396924
14019 33396924 27491339 23132928 19768935 16963818 14933588 13171215 11774679 10555843
14011 10555843 9511048 8516579 7964762 7363625 6806281 6407279 6091180 5733220 5385582
14002 5385582 5348050 5044082 4971496 4698220 4512328 4262102 4146665 4160787 4355567 3962183
13992 3962183 4175309 4309469 4497711 4962396 5222240 5221661 6003082 6710290 7200687 7698212
13982 7698212 8211661 8414240 8607468 8403885 8464757 8449750 8118016 7390738 6541760 5874371
13972 5874371 5176795 4694823 4423787 4358692 4008081 3756028 3403444 3444521 3328935 3129390
13962 3129390 3016254 3217443 2826829 2741016 2651887 2695718 2442230 2586741 2661131 2547873
13952B547873R0292K05211J88808K12992N6569K09430K68093J44429L57187J01538
13942D382422L91401O85727J490787K141042K964974L100397L612862L213891
13934B1983503L196026K007717J456689L39516k49550j942631l206957l856437
13926A9727876l712612l761772l502106k199510k164833o01461p61331l07631
13918B716620n6234k87965j41093k2780m2435j24632P3289l5216k25903L16074
13908B169725j58253j08197J51228l02888m8583J91452O5071l48773J78861O9089
13898A858732J48852k07137O5206r5551L52165p6111l78276J48680R2471K6715
13888A935746k09910p9962M56663O624j73205l9042k53k42168J0812k4755n8551
$$ plain form
13952 2547873 2638165 2843376 3032184 3245176 3301745 3511175 3779268 3923697 4280884 4382422
13942 4382422 4773823 5459550 6950337 9091379 12056353 15156750 18769612 21983503
13934 21983503 25179529 27187246 28643935 28983451 28733901 26791270 23584313 19727876
13926 19727876 16015264 12253492 8751386 6551876 4387043 3785582 3024251 2716620
13918 2716620 2660386 2372421 2231328 2208548 2166113 2041481 2114770 2079554 1853651 2169725
13908 2169725 2011472 1903275 2054503 1751615 1703032 1894484 1959555 1610782 1789643 1858732
13898 1858732 2007584 1800447 1865653 1770102 2122267 2046156 1667880 1816560 1909031 1935746
13888 1935746 1725836 1645874 2102537 2109161 1935956 1896914 1896661 1654493 1665305 1640550 1581999
13877A581999K00902K9140k40504K1321J76750O3039L4991l33309J05210K31063
13867A870602j04654k68223L01458q5861L48697l12206J54724J55887j47638N3323
13857A966109J60130k05415l117j66380N9426K60460k88762L74679n9082k37517
13847A860531j6838J27917J04856m5517j95775p2470J61430M273p1097o1130p3251
13836A722929l4139p0946j17974J81897j78172J26775j19958Q5008l4001o6534
13826A494885J58919K58862j06012k97093m1872K46457R3036k26452l3638J99926
13816A747018l44601P5917j74977L43663J2524k22396K05186k83019n8559j8234
13806A282522J82566P6816o309O3697o9495J46154n1980j74869Q5980J96857p5852
$$ plain form
13877 1581999 1782901 1812041 1571537 1592858 1769608 1832647 1867638 1534329 1639539 1870602
13867 1870602 1765948 1497725 1799183 1713322 2062019 1749813 1904537 2060424 1912786 1966109
13857 1966109 2126239 1920824 1917707 1751327 1810753 2071213 1782451 2157130 2098048 1860531
13847 1860531 1843693 1971610 2076466 2030949 1835174 1762704 1924134 1928407 1857310 1796180 1722929
13836 1722929 1688790 1617844 1499870 1681767 1503595 1630370 1510412 1595420 1561419 1494885
13826 1494885 1653804 1912666 1806654 1509561 1467689 1714146 1807182 1580730 1547092 1747018
13816 1747018 1402417 1478334 1303357 1647020 1659544 1437148 1642334 1359315 1300756 1282522
13806 1282522 1465088 1541904 1535595 1599292 1529797 1675951 1623971 1449102 1535082 1731939 1656087
13795A656087J49707L989j4131k7834k06110l3964K53972p8449o0312j29648n8649
13784A454658k07l1089L0200k27242J63640L3874k03351J90753R7095r2326J50268
13773A566273k14158L28477j88485K10966j61052K62146k01135l2708K36238k8606
13763A777956j06583k87913K33859K5059j29263k6394J72950k63227K78652r4750
13753A580346o2119K98840M2573l34724K01745M3004P9070J23944P4578J20075
13743B167332J48514k98322J37694m1236j03861J0095j08864M0433j71264j00607
13733A679914J42850j20170K56123n1531p545m1715M8500k40204N593j8565M8514
13722A701764j00404P0588J25658j29879J02287J06662k4738P572j54886R1471
$$ plain form
13795 1656087 1805794 1809783 1795652 1767818 1561708 1527744 1781716 1703267 1642955 1513307 1454658
13784 1454658 1454451 1423362 1453562 1226320 1389960 1423834 1220483 1411236 1508331 1416005 1566273
13773 1566273 1352115 1680592 1492107 1703073 1542021 1804167 1603032 1570324 1806562 1777956
13763 1777956 1671373 1383460 1617319 1642378 1513115 1486721 1659671 1396444 1675096 1580346
13753 1580346 1518227 1817067 1859640 1524916 1726661 1769665 1848735 1972679 2047257 2167332
13743 2167332 2315846 2017524 2155218 2113982 2010121 2020216 1911352 1951785 1780521 1679914
13733 1679914 1822764 1702594 1958717 1907186 1899641 1857926 1906426 1666222 1671815 1653250 1701764
13722 1701764 1601360 1671948 1797606 1667727 1770014 1876676 1851938 1859510 1704624 1796095
13712A796095J8606J80007j22044J27528m3622M1505J52583k52307L1505J51146
13702B081002R840l00205K67670j40396K5606M43181J10419M23404j72970L55023
13692C102574J60331L79635k75240K99653n59253J74912m34680l47441k46000
13683B254491k50528l5268m8846J89518j9428O7902K39425k33724o340j22606
13673B034596L08188J71110k6418j5382K62575K33996J95872J53116M96166P5192
13663C889011K53527q8581L00453j19334q5028j4157m10572j07318m07019L6834
13653C247816n93021k62591J60200J9232j75672l6798j57898j05140M2618j5873
13643B122873K32473k13639J18697l13839P9618L43801L00883K82616j3639L96621
$$ plain form
13712 1796095 1814701 1994708 1872664 2000192 1956570 1998075 2150658 1898351 1929856 2081002
13702 2081002 2090842 1790637 2058307 1917911 1943517 2386698 2497117 2920521 2747551 3102574
13692 3102574 3262905 3642540 3367300 3666953 3107700 3282612 2847932 2500491 2254491
13683 2254491 2003963 1968695 1919849 2109367 2089939 2157841 2397266 2163542 2157202 2034596
13673 2034596 2342784 2513894 2487476 2472094 2734669 2968665 3164537 3317653 3813819 3889011
13663 3889011 4142538 4053957 4354410 4235076 4150048 4135891 3725319 3618001 3210982 3247816
13653 3247816 2654795 2392204 2552404 2571636 2395964 2359166 2201268 2096128 2138746 2122873
13643 2122873 2355346 2141707 2260404 1946565 2026183 2369984 2670867 2953483 2939844 3336465
13633C336465n1376L81419j72820J34003l2451j83902j25126l61206m56025k63506
13623B205475o1911q6041j91622o5517M8170r7739K77l7637K23282l31979N22937
13612B127695J4256k27548M28657P0273J9954J58198r304j08910p8086k782k05684
13601B186719k0700p1476j50057k09014K13530q109K82373N8299J27745k1911
13591B387399N5226J60615j28483n9865j56943j21189J43044m24058J12008j38335
13581A829419n0748j22383Q7966J17613k06594M5517k72458J73065J2801J57427
13571A771625j83079J45357j5515o7714r303j8517j6366K77885j18830j15890
13561A649653k007K59654k38833k671q6564N6645J01533q6712R8618j16350K22448
$$ plain form
13633 3336465 3285089 3666508 3493688 3627691 3595240 3411338 3286212 2925006 2468981 2205475
13623 2205475 2143564 2057523 1865901 1800384 1848554 1750815 1751092 1713455 1936737 1604758 2127695
13612 2127695 2141951 1914403 2343060 2413333 2433287 2591485 2582181 2473271 2395185 2392403 2186719
13601 2186719 2166019 2094543 1944486 1735472 1949002 1940893 2223266 2281565 2409310 2387399
13591 2387399 2442625 2603240 2474757 2414892 2257949 2136760 2279804 1855746 1967754 1829419
13581 1829419 1778671 1656288 1744254 1861867 1655273 1700790 1428332 1601397 1614198 1771625
13571 1771625 1588546 1733903 1718388 1650674 1641371 1622854 1606488 1884373 1765543 1649653
13561 1649653 1647646 1907300 1668467 1665796 1579232 1635877 1737410 1650698 1749316 1632966 1855414
13550A855414j44522k3289K4376J96157k26841N47404J52083L80160J21479L78330
13540C260751k91409J40012J78520k09646J60664k91232m20860k67009j02217
13531B157574l87485L32314l8402J21310K01382J54477K12612K00883p3055J75093
13521C056703J56299r6813l55786r4866k33445k63997k28456l29478J60038k98197
13511A472002j74624J49038o0463j603O153J87246j48940j32935j945J11238l621
13500A401546O0251M5448p2787l6562J97495k66679O5576j07153N6613q7982J96459
13489A452225N8171k6133p3760M5356j56682R9956j18633p0742m6236K68214j497
13478A430239j4860J92369O6796O9249k83396q7068J88101n7059j72934P7051
$$ plain form
13550 1855414 1710892 1687603 1711979 1908136 1681295 2228699 2380782 2760942 2882421 3260751
13540 3260751 2969342 3109354 3287874 3078228 3238892 2947660 2526800 2259791 2157574
13531 2157574 1770089 2102403 2064001 2185311 2386693 2541170 2753782 2954665 2881610 3056703
13521 3056703 3213002 3116189 2760403 2665537 2432092 2168095 1939639 1610161 1770199 1472002
13511 1472002 1297378 1446416 1385953 1384350 1390503 1577749 1428809 1295874 1293929 1405167 1401546
13500 1401546 1461797 1507245 1434458 1397896 1595391 1328712 1394288 1287135 1343748 1255766 1452225
13489 1452225 1510396 1484263 1410503 1455859 1299177 1399133 1280500 1209758 1163522 1431736 1430239
13478 1430239 1415379 1607748 1674544 1743793 1460397 1373329 1561430 1504371 1331437 1408488
13468A408488Q3486j55752J77469k18847J26241r160R8125j49866O8015m905K14503
13457A637797j23098J7735K30370N42527J7850L12369J76029R0045L37772k42761
13447B996635N0118p8338k6496k00763l27932k81074j36215k90075K98427k65791
13437A738496m8076j16694q8220Q0860l46133J65369O0878r5667J83825K58882
13427A793520o8006J41026J08229K80495K07474L13558r3089M32487j00373J12073
13417C127394j99038K40672k98562m34071J99999n63913k09625P9906k16569p805
13407A718388j22027j6228n8965o442M8941j94095J55003J61058o6724k7527J42876
13396A734258j45148J58169j31981J90843k08265L23974n3800J78462L3717K81816
$$ plain form
13468 1408488 1491974 1336222 1513691 1294844 1421085 1411925 1510050 1360184 1428199 1423294 1637797
13457 1637797 1514699 1532434 1762804 2305331 2323181 2635550 2811579 2901624 3239396 2996635
13447 2996635 3046753 2968415 2941919 2741156 2413224 2132150 1995935 1705860 2004287 1738496
13437 1738496 1690420 1573726 1485506 1566366 1220233 1385602 1446480 1350813 1534638 1793520
13427 1793520 1725514 1866540 1974769 2255264 2462738 2776296 2683207 3115694 3015321 3127394
13417 3127394 2928356 3169028 2870466 2436395 2636394 2072481 1862856 1942762 1726193 1718388
13407 1718388 1596361 1580133 1521168 1514726 1563667 1369572 1524575 1685633 1618909 1591382 1734258
13396 1734258 1589110 1747279 1615298 1806141 1597876 1921850 1868050 2046512 2080229 2362045
13386B362045P4556J96456J59321o8011L02292j97017j6029J68141j74177N8438
13376B866015m29880M0245l81260j98907J62189p8100j96697K31195K90946j76111
13366B129635j42436L27878j11641q3100N8412K01133k004l07667l5310K14157
13356B249057j25439K74489k83687M09867J41177P593P1068k19905J13074p0686
13346B566608q3185k13024k55356K04618r3171r1622K42663j88416Q5414J0929
13336B185458j49728N6211l446j4156J96413J75093m38306o678L97815l22447
13326B076229O3827j74297J13965K7955J92946j18766P5170O2604j19700L54680
13316B554613P3236J37841J65238J17563j20667M56376k74686L7327O1420N3565
$$ plain form
13386 2362045 2436601 2633057 2792378 2724367 3026659 2829642 2813613 2981754 2807577 2866015
13376 2866015 2436135 2476380 2095120 1896213 2058402 1980302 1783605 2014800 2305746 2129635
13366 2129635 1987199 2315077 2203436 2120336 2178748 2379881 2377877 2070210 2034900 2249057
13356 2249057 2123618 2398107 2114420 2524287 2665464 2673057 2744125 2524220 2637294 2566608
13346 2566608 2483423 2270399 2015043 2219661 2126490 2034868 2277531 2089115 2174529 2185458
13336 2185458 2035730 2091941 2088495 2074339 2270752 2445845 2007539 2000861 2398676 2076229
13326 2076229 2140056 1965759 2079724 2107679 2300625 2181859 2257029 2319633 2199933 2554613
13316 2554613 2627849 2765690 2930928 3048491 2927824 3384200 3109514 3146841 3208261 3261826
13306C261826l10001r746Q477j58219K65013k88209M41631J36807j15172J75525
13296C407932R7442l2088Q910J37335k35329J02856M0129m65645J11568r4896
13286C078214q7747J6951J47725L3544J48287j68549J57250N1864k3271k4869
13276C329399L22016l25865K64783N8864J17790J78279l30697J43931O0778K34667
13266D053945Q277K2543N3268J71507J06055j08152K32208N7550P9918J14916
13256D792035J99497K45235L19305K06404k15737M42342o6778K15080J52538j19225
13246F170696J47426L5226K68556k01295J4433K91764k82727L26722q1332l1090
13236F658379k200L41069J39398P2767L61836M24223J27566L10781R1075J94842
$$ plain form
13306 3261826 2951825 2942079 2950556 2792337 3057350 2769141 3210772 3347579 3232407 3407932
13296 3407932 3505374 3473286 3482196 3619531 3384202 3487058 3527187 3061542 3173110 3078214
13286 3078214 2990467 3007418 3155143 3188687 3336974 3168425 3325675 3377539 3354268 3329399
13276 3329399 3651415 3325550 3590333 3649197 3766987 3945266 3614569 3758500 3819278 4053945
13266 4053945 4062222 4084765 4138033 4309540 4415595 4307443 4539651 4597201 4677119 4792035
13256 4792035 4991532 5236767 5556072 5762476 5546739 5989081 5922303 6137383 6289921 6170696
13246 6170696 6318122 6353348 6621904 6420609 6435042 6726806 6444079 6770801 6689469 6658379
13236 6658379 6656179 6997248 7136646 7209413 7571249 7995472 8123038 8433819 8524894 8719736
13226H719736Q3846M56725M14702j93841K2227K81982l58786k976p0493L9273
13216I392395j5162l31969n0440k75753k09263n8626k2369k67181K47844k93008
13206H116468j6021R6327J55667P7620j13709j79611K51996j53955m2131j06136
13196H086515j11934k20754j08561k23390R6266m28130J76372o02211j17531j73279
13186F373363k93674L02119k79246k6836j12284j730l80544L4547m81253L14994
13176E449456J3995l10087n6236j24185n0068R0976p2593n7518N0906k27905K62309
13165D969050J39105J78036L4204K27026K72201M66059j88790N2310N18267L08024
13155F975492j58617Q7035j87265j59828J3724j17250o6473K08156k93663k783
$$ plain form
13226 8719736 8803582 9260307 9675009 9481168 9503395 9785377 9426591 9423615 9353122 9392395
13216 9392395 9377233 9045264 8994824 8719071 8509808 8451182 8428813 8161632 8409476 8116468
13206 8116468 8100447 8196774 8352441 8430061 8316352 8136741 8388737 8234782 8192651 8086515
13196 8086515 7974581 7753827 7645266 7421876 7518142 7090012 7266384 6664173 6546642 6373363
13186 6373363 6079689 6381808 6102562 6075726 5963442 5961712 5581168 5615715 5134462 5449456
13176 5449456 5463451 5153364 5097128 4972943 4922875 5013851 4941258 4883740 4934646 4706741 4969050
13165 4969050 5108155 5286191 5320395 5547421 5819622 6285681 6096891 6149201 6667468 6975492
13155 6975492 6816875 6903910 6716645 6556817 6570541 6453291 6386818 6594974 6301311 6298528
13145F298528j36990J75699l46412r2696p3777r2567k18833j28825n45695j90542
13135D647890j27840l91671k4511j75532k33785K99281Q750n0271J91910l1040
13125D113181n4069J74428l72444K26833o8531k21282n7680l86325o2132o6233
13115C225746J49735Q677j06094j4934k54346M6637K52457J47958m52022J86976
13105C190790J89863j03659K82896j10390J41581J48169K98632L20134K17935
13096D575951M93453L76863K99425P3304L66680j33783L05052k7398j31797j7141
13086F180609J59432j10784k36273j29808q5309m2608O7207l92972j48083j18972
13076E142439l78853l00914j60398l79721l81725j043j39041k00321j07381J40582
$$ plain form
13145 6298528 6161538 6337237 5990825 5898129 5824352 5731785 5512952 5384127 4838432 4647890
13135 4647890 4520050 4128379 4103868 3928336 3694551 3993832 4002582 3952311 4144221 4113181
13125 4113181 4059112 4233540 3861096 4087929 4019398 3798116 3740436 3354111 3291979 3225746
13115 3225746 3375481 3384158 3278064 3263130 3008784 3055421 3307878 3455836 3003814 3190790
13105 3190790 3380653 3276994 3559890 3449500 3591081 3739250 4037882 4358016 4575951
13096 4575951 5069404 5446267 5745692 5818996 6185676 6051893 6356945 6329547 6197750 6180609
13086 6180609 6340041 6229257 5992984 5863176 5777867 5735259 5802466 5409494 5261411 5142439
13076 5142439 4763586 4462672 4302274 3922553 3540828 3539785 3400744 3200423 3093042 3233624
13066C233624k05350q7893J03508J436Q0817j36285Q650K95941K34806l07661
13056C221593J15686J41283j05178q277J14318k06810l8363m7810p7787r3788
13046C014867O9433N775r8082J612Q2206R9230J84361r0378K81202j25554j77565
13035C247107L20643j65246J91068q1756M3457m0877K77224P448k3371K03557
13025C979254l32471L33824M2348K7622R0753j78374J16532L3178J59804j56846
13015D115624L24080R7950R2268k66380J00436J60682J15306r753O2727J50218
13005D943158O3620N9409K22454j45124K7560n2375J74409P4982J2276P2232M8605
12994E501206K85116Q0112O2341j07221l9947N0884J60706j21699K09557m75762
$$ plain form
13066 3233624 3028274 2940381 3043889 3045325 3126142 2989857 2998507 3294448 3529254 3221593
13056 3221593 3337279 3478562 3373384 3365107 3479425 3272615 3234252 3186442 3108655 3014867
13046 3014867 3084300 3090075 2991993 2993605 3075811 3175041 3359402 3269024 3550226 3424672 3247107
13035 3247107 3567750 3402504 3593572 3511816 3555273 3514396 3791620 3799068 3775697 3979254
13025 3979254 3646783 3980607 4022955 4050577 4141330 3962956 4079488 4112666 4272470 4115624
13015 4115624 4439704 4537654 4629922 4363542 4463978 4624660 4739966 4730213 4792940 4943158
13005 4943158 5006778 5066187 5288641 5143517 5171077 5118702 5293111 5368093 5380369 5452601 5501206
12994 5501206 5786322 5866434 5928775 5821554 5781607 5832491 5993197 5871498 6081055 5605293
12984E605293J55023o7925K42082k31890O8166j94105L3199r1914P8122J13668
12974E709719j89015j15281J21282j41299k49479R8640j06788j94452J48028n842
12964E075513j71075j82429L33462N7284j01014N0410r2116J7896L6087m3504
12954D980514j79722K51999k08642j05477K58251j20658L09433j89887J14999
12945E110810k7372q4890K9717j68926L89632j41843k99189K82123j22689l1446
12935D935927K05780k27119M48975j15282Q2182K34830N390k72358r3362m6897
12925E158066k45235J91615j88625k2011J33659q7120J8288j4516j83387J5512
12915D776246j13089o2679p1425l27150J09272r1887j1059j70378N8016j02007
$$ plain form
12984 5605293 5760316 5692391 5934473 5702583 5770749 5576644 5609843 5517929 5596051 5709719
12974 5709719 5520704 5405423 5526705 5385406 5135927 5234567 5127779 4933327 5081355 5075513
12964 5075513 4904438 4722009 5055471 5112755 5011741 5062151 4970035 4987931 5024018 4980514
12954 4980514 4800792 5052791 4844149 4738672 4996923 4876265 5185698 4995811 5110810
12945 5110810 5083438 4998548 5028265 4859339 5248971 5107128 4807939 5090062 4967373 4935927
12935 4935927 5141707 4914588 5363563 5248281 5330463 5565293 5570683 5298325 5204963 5158066
12925 5158066 4912831 5104446 4915821 4893810 5027469 4940349 4958637 4944121 4760734 4776246
12915 4776246 4663157 4600478 4529053 4201903 4311175 4219288 4208229 4037851 4095867 3993860
12905C993860k02926K21225n47353L30578j87844j1140j98480N7019o7790J25908
12895C513057j67989j81066J92359k00788Q9428L7174j27360J6910J45421k11932
12885C105214L6220K8998k06183K49508k02736o572Q4618K39771j36180k07263
12875B985395J90614m7104j06980j78595J50731j54108Q3209J22944l82060N9972
12865B724018J72237r5739O1552k82308J33205J12653k61268K41276P6522n34784
12855B347364K56961M01306k25656k22764J33208P5492j58449N1278P9203R7891
12845B835834k72881J32841O7003r6537L57612r7947j36198q3009K25324r4192
12835B837850n917R3916j28488P673n6093Q2807o0326K0550k1961J169J9497O9237
$$ plain form
12905 3993860 3790934 4012159 3464806 3795384 3607540 3596400 3397920 3454939 3387149 3513057
12895 3513057 3345068 3164002 3356361 3155573 3245001 3282175 3154815 3171725 3317146 3105214
12885 3105214 3141434 3170432 2964249 3213757 3011021 3004449 3089067 3328838 3192658 2985395
12875 2985395 3176009 3128905 3021925 2843330 2994061 2839953 2923162 3046106 2664046 2724018
12865 2724018 2896255 2800516 2862068 2579760 2712965 2825618 2564350 2805626 2882148 2347364
12855 2347364 2604325 3005631 2779975 2557211 2690419 2765911 2607462 2658740 2737943 2835834
12845 2835834 2562953 2695794 2762797 2666260 3023872 2925925 2789727 2706718 2932042 2837850
12835 2837850 2831933 2925849 2797361 2805034 2748941 2831748 2771422 2791972 2770011 2771180 2790677 2859914
12823B859914j96436Q4415J72673j91630P7795m9730M2328J9119k673j73636K18540
12812B860679r9063J1413Q8949j65255Q3188J99165j13302j14112K8489j5491
12802B764660J71068j65478j23066K66466M0662p4226J96164j62319N2819k5043
12792B941707N5545j34710L43964j58883M6989k7955L3219j77607J47375K9081
12782C098725O3650k02813L90496k99772k02647K82069q2092k09359K46724K1380
12772C106361k5334k94621K07088k5253K72842L4189q368j79864J88888J41936
12762C417864j37891j76428P7079n6578P2443N255M8312M5472k7533j10663K05795
12751C363127k07798r5687J07424p3412L07599l05857J5702j02957J90529j36093
$$ plain form
12823 2859914 2663478 2747893 2920566 2728936 2806731 2757001 2799329 2818448 2815775 2642139 2860679
12812 2860679 2761616 2773029 2861978 2696723 2779911 2979076 2865774 2751662 2780151 2764660
12802 2764660 2935728 2770250 2647184 2913650 2954312 2880086 3076250 2913931 2966750 2941707
12792 2941707 2997252 2862542 3206506 3047623 3094612 3066657 3099876 2922269 3069644 3098725
12782 3098725 3162375 2959562 3350058 3050286 2847639 3129708 3047616 2838257 3084981 3106361
12772 3106361 3081027 2786406 2993494 2968241 3241083 3275272 3266904 3087040 3275928 3417864
12762 3417864 3279973 3103545 3180624 3124046 3196489 3201744 3250056 3295528 3267995 3157332 3363127
12751 3363127 3155329 3059642 3167066 3093654 3401253 3095396 3111098 3008141 3198670 3062577
12741C062577J49200M0465j81559J34133L1065J08389n5590o3981K4637J87786
12731C437122o5073j08587N4699k19846O4164J85408j57069J09062J38468o3991
12721C374357k45677k9636K64384K5712l02777N29311m12313L57754O5764k98043
12711C328836J15301m0770J41076j41280Q3842K49955J58961J54142J69159j07473
12701D111749K21988j18226N8160K19922Q3398j5998j5435L21804J24596L65099
12691E357057L98122O28988Q05833N51910L22573Q1632L33273j77853k22980k70444
12681G808111k18274r06999o36186r08159k48625j13292m7906k5146m0581q3712
12671D579231J80075j6503K87457j48701J11296J70939K6612J59650K6426k00343
$$ plain form
12741 3062577 3211777 3252242 3070683 3204816 3235881 3344270 3288680 3224699 3249336 3437122
12731 3437122 3372049 3263462 3318161 3098315 3162479 3347887 3190818 3299880 3438348 3374357
12721 3374357 3128680 3099044 3363428 3389140 3086363 3615674 3203361 3561115 3626879 3328836
12711 3328836 3444137 3403367 3544443 3403163 3487005 3736960 3895921 4050063 4219222 4111749
12701 4111749 4333737 4215511 4273671 4493593 4576991 4560993 4545558 4867362 4991958 5357057
12691 5357057 5755179 6384167 7190000 7741910 8064483 8146115 8479388 8301535 8078555 7808111
12681 7808111 7589837 6682838 6046652 5138493 4889868 4776576 4728670 4703524 4662943 4579231
12671 4579231 4759306 4742803 5030260 4881559 4992855 5163794 5190406 5350056 5376482 5176139
12661E176139k15145K77541k97881J26227m2823P4882j18613J02109M51584l4917
12651E499103L07869J59894Q3737L06553J3413j25984J44051L20028j05388j8091
12641F585185r7900m7461J33467o615j6717L82800J03427J37159j73517k01075
12631F798753J59181J38694l9758J90811N1933j1312k96809n4365j59814j34069
12621F643245j99735k49101m55543m11270k510k00341J32587K01908L86667R5938
12611E941845K49145N95185M88005M18920M59795N71209L38016l18815J13168
12602H856473j03078l24533p23401q1971o48529m15079p23405k65044k44926J70803
12592E497310J0441L4258M55114k61146L28236r8919l9339K394M94988j85790
$$ plain form
12661 5176139 4960994 5238535 4940654 5066881 5024058 5098940 4980327 5082436 5534020 5499103
12651 5499103 5806972 5966866 6050603 6357156 6370569 6244585 6388636 6708664 6603276 6585185
12641 6585185 6487285 6439824 6573291 6566676 6549959 6932759 7036186 7173345 6999828 6798753
12631 6798753 6957934 7096628 7056870 7247681 7299614 7288302 6991493 6937128 6777314 6643245
12621 6643245 6443510 6194409 5738866 5327596 5325086 5124745 5257332 5459240 5845907 5941845
12611 5941845 6190990 6786175 7274180 7693100 8152895 8724104 9062120 8743305 8856473
12602 8856473 8753395 8428862 7705461 7623490 6974961 6559882 5836477 5571433 5326507 5497310
12592 5497310 5507751 5542009 5997123 5735977 6064213 5965294 5925955 5928349 6423337 6237547
12582F237547j04394J41024M7006O44909j33323K30596K66227L424K13867l59032
12572G187851q9550l19468m99221l88748n05890j73018l64377j00063L29884j68458
12562D908942P1999j15392o0963L27089j58741J58485r4158l7312N893J02015
12552E107857k97317L33611k42311J56684J26434Q9828l9203j57857J28194J61733
12542E367653O14301J20961K64814L46887L6711j24269P6369q8679J81385l54634
12532F441499o58285k70285o268m97030L5884k02756M07978j2039j15525j83284
12522D939889L35599J32195K1502j95118M13812j00185J64841L30772O9075Q47400
12512F959782M13779O10685L45876N02223j28698L29605K93l53612j73261l66605
$$ plain form
12582 6237547 6133153 6274177 6321183 6966092 6832769 7063365 7329592 7333016 7546883 7187851
12572 7187851 7098301 6778833 6279612 5890864 5384974 5211956 4847579 4747516 5077400 4908942
12562 4908942 4980941 4865549 4804586 5131675 4972934 5131419 5037261 4999949 5005842 5107857
12552 5107857 4810540 5144151 4901840 5058524 5184958 5274786 5235583 5077726 5205920 5367653
12542 5367653 5981954 6102915 6367729 6714616 6751327 6627058 6703427 6614748 6796133 6441499
12532 6441499 5783214 5512929 5506661 5009631 5045515 4842759 5250737 5238698 5123173 4939889
12522 4939889 5275488 5407683 5429185 5234067 5647879 5547694 5712535 6043307 6112382 6959782
12512 6959782 7373561 7984246 8330122 8832345 8703647 9033252 9033545 8679933 8506672 8140067
12502H140067q38710p93156k31414n10399J61709n1790j23584j38184l0899p4576
12492E509064J0837J93865j51270J29304N3003o4445J98769J50864L62729K65288
12482F658008L67216L05635L4377L56830J17859J40018j23306q5618m45567m51381
12472F874071l44753l04123L9997k99014J88288J60664l18274j07738J12416L73237
12462F374771R7907k39341L99616J71937J5508O771K62989m9145J13856K60014
12452G414883K89183J81220Q2295M38148K41315L35922K70571L1736M26828P821
12442I719922O24004j15507K12426j6558J00874n7921j03295M2955K12099m7816
12432A0571183n7212K33459j35159L64009N4584J48787L02378R4863K99369M72384
$$ plain form
12502 8140067 7301357 6508201 6276787 5766388 5928097 5876307 5752723 5614539 5583640 5509064
12492 5509064 5519901 5713766 5562496 5691800 5744803 5680358 5879127 6029991 6392720 6658008
12482 6658008 7025224 7330859 7365236 7722066 7839925 7979943 7856637 7771019 7325452 6874071
12472 6874071 6529318 6225195 6265192 5966178 6154466 6315130 5996856 5889118 6001534 6374771
12462 6374771 6472678 6233337 6632953 6804890 6820398 6827169 7090158 7041013 7154869 7414883
12452 7414883 7704066 7885286 7967581 8405729 8647044 8982966 9253537 9285273 9712101 9719922
12442 9719922 10343926 10228419 10440845 10424287 10525161 10467240 10363945 10406900 10618999 10571183
12432 10571183 10513971 10747430 10612271 10976280 11030864 11179651 11482029 11576892 11876261 12348645
12422A2348645K65802K10860M53270K10629M02647O10304M65368L08721M95230
12413A5771476L13386K79563K09108J01450l02431l4523k14993P887j41077n18923
12403A5470923k54197l74711j71644j44401j51889o6488N3154k25444J36747K64060
12393A4536110O8236L28774M68944J64618L30344O88334K15090M71935L22799
12384A7595184J57395J79319K29114N3133j2126L00769j568k18938j02818k77471
12374A7901993J67458l44874j30970R8800j23110M9946k37577J78911m46911J68770
12364A7282436k88142J53538l67518j10246K47533m32963K73505m58862q8296
12355A6210985L4349j85984j05294R2598l55422p0652l45098R6605j26262k62121
$$ plain form
12422 12348645 12614447 12825307 13278577 13489206 13891853 14502157 14967525 15276246 15771476
12413 15771476 16084862 16364425 16573533 16674983 16372552 16338029 16123036 16130923 15989846 15470923
12403 15470923 15216726 14842015 14670371 14525970 14374081 14307593 14360747 14135303 14272050 14536110
12393 14536110 14604346 14933120 15402064 15566682 15897026 16585360 16800450 17272385 17595184
12384 17595184 17752579 17931898 18161012 18214145 18202019 18502788 18501220 18282282 18179464 17901993
12374 17901993 18069451 17724577 17593607 17692407 17569297 17619243 17381666 17560577 17113666 17282436
12364 17282436 16994294 17147832 16780314 16670068 16917601 16484638 16758143 16299281 16210985
12355 16210985 16245334 16059350 15954056 16046654 15691232 15620580 15275482 15372087 15245825 14983704
12345A4983704p2125J79662p633K58471J30500K80458L68355M6230L61845L27758
12335A6857225O03564K72622J27484L85429L38981J02498O84996L3L50101O3756
12325A9786689K42904K1473K37014j14467O1506n467j4791J38416j1881K13110
12315B0554506k98071J06448q2628J41124K37732K02146K40576L44029K03292
12306B1649154L62142K30726M90084J80051J93813p6770k68719k82864l79340
12297B2098277m40378o71917m29396l74601l36049j47399n19159l52930m0631
12288A8785817k73929k00858m20586k45175p79254n25904o52621n74480l25840
12279A4787170k96157k21729l67507k00302j09861j14419R057p2693k93926J4883
$$ plain form
12345 14983704 14911579 15091241 15083608 15342079 15472579 15753037 16121392 16167622 16529467 16857225
12335 16857225 17460789 17733411 17860895 18246324 18585305 18687803 19372799 19372832 19722933 19786689
12325 19786689 20029593 20051066 20288080 20173613 20235119 20229652 20214861 20353277 20341396 20554506
12315 20554506 20256435 20362883 20280255 20421379 20659111 20861257 21101833 21445862 21649154
12306 21649154 22011296 22242022 22732106 22912157 23105970 23029200 22760481 22477617 22098277
12297 22098277 21657899 20985982 20556586 20181985 19845936 19698537 19179378 18826448 18785817
12288 18785817 18511888 18311030 17890444 17645269 16866015 16340111 15687490 15113010 14787170
12279 14787170 14491013 14269284 13901777 13701475 13591614 13477195 13486252 13413559 13119633 13134516
12269A3134516j05758J06178k84724P6424R4433k36873J17783k36194K22741P1700
12259A2960226K8124o3912J62626O08312L13902L33600N87790Q62167Q85596P03159
12249A7381590Q13377J162457J053326J082861Q48648J105286M40050Q05527L54554
12240B5047676K146M40766k22265Q9246k70813p14006k5695l16546k71272l14779
12230B3444458k02628p64722m40858j57118j301611q16293j410827q90065r74576
12221A6485760r40818j019464p80405n27756m87173n8745n03595l75671k42020
12212A1550113L8939j64387n51621Q870j79211m56058l4541j19449j80623j13056
12202I798976K96145P1847P1203k20078J95399j87538O1254L41681n2364K9636
$$ plain form
12269 13134516 13028758 13134936 12850212 12926636 13021069 12784196 12901979 12665785 12888526 12960226
12259 12960226 12988350 12924438 13087064 13695376 14009278 14342878 14930668 15792835 16678431 17381590
12249 17381590 18194967 19357424 20410750 21493611 22342259 23447545 23887595 24693122 25047676
12240 25047676 25049822 25490588 25268323 25357569 25086756 24372750 24347055 24030509 23759237 23444458
12230 23444458 23241830 22477108 22036250 21879132 20577521 19761228 18350401 17460336 16485760
12221 16485760 15544942 14525478 13745073 13217317 12730144 12671399 12167804 11792133 11550113
12212 11550113 11589052 11424665 10873044 10881914 10702703 10246645 10212104 10092655 9912032 9798976
12202 9798976 10095121 10166968 10238171 10018093 10213492 10025954 10087208 10428889 10376525 10406161
12192A0406161L46449Q9789L35998J29221K65316j49563L18573M30212k27732
12183A1944424L75734m2936J86968J60123k16306K8110L79588j31995m82841r3327
12173A2107542J7993P062j99083L52334j56693K1765J41722K45135L28027L18353
12163A3184157N52911L11967L77524L23065N72202K07158Q7593K08990J11711
12154A5937278J02686j39126l51645J4719l00950N46580K83375N15748M59374
12145A7068039O14063Q92624L01099O94603O12334O09600N03028M97416P98973
12136B2591779Q45514J106423P78755J671010J314040J576573J748575J586929
12128C3219598K234570J950185J398936J314375J365768P24260L58202M44184
$$ plain form
12192 10406161 10752610 10842399 11178397 11307618 11572934 11423371 11741944 12172156 11944424
12183 11944424 12320158 12277222 12464190 12624313 12408007 12436117 12815705 12683710 12200869 12107542
12173 12107542 12125535 12132597 11933514 12285848 12129155 12150920 12292642 12537777 12865804 13184157
12163 13184157 13737068 14049035 14426559 14749624 15321826 15528984 15616577 15825567 15937278
12154 15937278 16039964 15900838 15549193 15563912 15262962 15809542 16092917 16608665 17068039
12145 17068039 17682102 18574726 18875825 19570428 20182762 20792362 21295390 21792806 22591779
12136 22591779 23437293 24543716 25322471 26993481 28307521 29884094 31632669 33219598
12128 33219598 35454168 37404353 38803289 40117664 41483432 42207692 42565894 43010078
12120D3010078l45205m2040o62591l68793r15758m85523q65673p26547k67494
12111C8330454o22542m58468n92302j33575o60214k79748q3028o3373K37069Q4993
12101C5759266K54637N7581K66856k52612L5848l21025m37521m41046m87263o83549
12091C3751172l02426k88392J40435P90887L27232O76196R84254R60875P90449
12082C7830682P72044M60396J2758n04550N1856m76060q038Q4307m39434l08382
12072C7475579n56024m13282o98666r26832p52900j297478p58009q22281j296687
12063B9953420j002821q59473p91071o79554l05105k70000o26923l35569k86317
12054B4796587l01799n63397m85698l12687o19950k51375m38970l21013m66892
$$ plain form
12120 43010078 42664873 42622833 41960242 41591449 40675691 40190168 39324495 38597948 38330454
12111 38330454 37707912 37249444 36657142 36523567 35863353 35583605 35500577 35437204 35674273 35759266
12101 35759266 36013903 36071484 36338340 36085728 36121576 35800551 35363030 34921984 34434721 33751172
12091 33751172 33448746 33160354 33300789 34091676 34418908 35095104 36079358 37040233 37830682
12082 37830682 38602726 39063122 39075880 38571330 38623186 38147126 38139088 38223395 37783961 37475579
12072 37475579 36919555 36506273 35807607 34880775 34127875 32830397 32072388 31250107 29953420
12063 29953420 28950599 28091126 27300055 26620501 26315396 26045396 25418473 25082904 24796587
12054 24796587 24494788 23931391 23445693 23133006 22513056 22261681 21822711 21501698 21034806
12045B1034806r1335p38554j53326k54312m15298m67643n90680j74435p35952
12036A7413271l52429m2666j06663j97116M46995J77706L48791K71947K68348
12027A8228184M43128l78006j10390k75426k97237m13402r79931o06066n17093
12018A5093761p25314l57299j99587k43569m49656j09560k14480k23105k88854
12009A2282337l1681l75313k92916k3198j12405r364J1056Q4349N82433K77265
11999A2392563j53644j14259j77111k88616j52038L4977m67621m01516l4054k68483
11989A0370198j21476k62391J943l64349K802J6209k91865L5453o93831j80935
11979H511758O428k84245p6711l0814k41632J90878m16564J1124l10233k78068
$$ plain form
12045 21034806 20943471 20204917 20051591 19797279 19381981 18914338 18323658 18149223 17413271
12036 17413271 17060842 17018176 16911513 16714397 17161392 17339098 17687889 17959836 18228184
12027 18228184 18671312 18293306 18182916 17907490 17610253 17196851 16216920 15610854 15093761
12018 15093761 14368447 14011148 13811561 13567992 13118336 13008776 12794296 12571191 12282337
12009 12282337 12250656 11875343 11582427 11559229 11446824 11437460 11448516 11532865 12115298 12392563
11999 12392563 12238919 12124660 11947549 11658933 11506895 11541872 11074251 10672735 10638681 10370198
11989 10370198 10248722 9986331 9988274 9623925 9626727 9642936 9351071 9386524 8692693 8511758
11979 8511758 8518186 8233941 8157230 8126416 7884784 8075662 7659098 7670222 7359989 7081921
11969G081921j22489l86380j39579Q5364m58997K9660m3972j08952O9417n0098
11959E955895K25487j02478M42674P3093l4765J4357K12038K0807K33852l19438
11949F721522J36225o8482Q2042j41851K16499K38067L63877J78093M39984K1002
11939H186978R6186J13649J23122P4511K40406j98017J88170j07978j8133R41
11929H699835j39079r6053k30303r8824j29708j75014k59622j95785l32470j38790
11919F904187J04522k08300k42453j16784l9894j17794J3578K96541M42859J390626
11909H427088K138400K253319Q71912O76039R47786K5616J16682k50430n82980
11900A4623432r94636k819244k434672k114528k67157k11993j71642j18768J35053
$$ plain form
11969 7081921 6959432 6573052 6433473 6518837 6059840 6089500 6045528 5936576 6005993 5955895
11959 5955895 6181382 6078904 6521578 6594671 6559906 6574263 6786301 6807108 7040960 6721522
11949 6721522 6857747 6789265 6871307 6729456 6945955 7184022 7547899 7725992 8165976 8186978
11939 8186978 8283164 8396813 8519935 8594446 8834852 8636835 8825005 8717027 8698894 8699835
11929 8699835 8560756 8464703 8234400 8135576 8005868 7830854 7571232 7375447 7042977 6904187
11919 6904187 7008709 6800409 6557956 6441172 6401278 6283484 6297062 6593603 7036462 8427088
11909 8427088 10565488 12818807 13690719 14366758 15314544 15340160 15456842 15206412 14623432
11900 14623432 13628796 10809552 8374880 6260352 5993195 5781202 5609560 5490792 5625845
11891E625845N5480K73864O4883L12650O94086P86335L74219O87570N87248N60939
11881A0023119K69803L33038M46493j59999k26449k20484r63076o61110n28893
11872H312442l81027n83677l37516n95771m65737k77005k03966n3489l65292j01492
11862D947470n9016J95924j17489N326j73794K16786k4796J5184j39039N05073
11852E371629j9845P7777J63043J48375L11898J94095L16458M85150J57081N23750
11842G729411K85832L63587J85383K41383l33341k0688p4426j57113l18145j22365
11832G779518m02202k09834j00598J72386l01557r0756J12450m09218j61781l30464
11822F057944p10120j88309l34303k55173q7065j24686k77819J25883o7113N4733
$$ plain form
11891 5625845 5681325 5955189 6020072 6332722 7026808 7813143 8187362 8874932 9462180 10023119
11881 10023119 10292922 10625960 11072453 10912454 10686005 10465521 9502445 8841335 8312442
11872 8312442 7931415 7347738 7010222 6414451 5948714 5671709 5467743 5414254 5048962 4947470
11862 4947470 4888454 5084378 4966889 4972215 4798421 5015207 4990411 5005595 4866556 5371629
11852 5371629 5351784 5429561 5592604 5740979 6052877 6246972 6563430 7048580 7205661 7729411
11842 7729411 8015243 8378830 8564213 8805596 8472255 8451567 8377141 8220028 7901883 7779518
11832 7779518 7377316 7167482 7066884 7239270 6937713 6846957 6959407 6550189 6388408 6057944
11822 6057944 5347824 5159515 4825212 4570039 4482974 4358288 4080469 4206352 4139239 4193972
11812D193972l33474J21326k59337J02342n12309L13087q778J83869l39466N3900
11802C515132o1317n6194m5690L47214r8745n4140j26430o6225K61488J19877
11792C734970L48812K20971K21941P27081J769K49602M79924k43594M3870q8557
11782E696789M9713j27324n63098l70414n13225l03740m05021m1915j90205O7318
11772C298878J04181k36107j9867N5893j74630j77323j63944L00770n0200K3357
11762B961008m3908L0078O5689k42554M3542j72630L7411K20802j77943J18095
11752B839590k3122J60241l09009L28790j65268q4322P2414q0893J08374j66731
11742B680064K54183j78300l5317M1844N7308q4199M4400k53558q3696L83507
$$ plain form
11812 4193972 3860498 3981824 3722487 3824829 3312520 3625607 3616829 3800698 3461232 3515132
11802 3515132 3453815 3397621 3351931 3699145 3600400 3546260 3419830 3353605 3615093 3734970
11792 3734970 4083782 4304753 4526694 5253775 5255544 5505146 5985070 5741476 5785346 5696789
11782 5696789 5746502 5619178 5056080 4685666 4172441 3868701 3463680 3421765 3231560 3298878
11772 3298878 3403059 3166952 3147085 3202978 3028348 2851025 2687081 2987851 2937651 2961008
11762 2961008 2917100 2947178 3012867 2770313 2813855 2641225 2678636 2899438 2721495 2839590
11752 2839590 2816468 2976709 2667700 2996490 2831222 2746900 2819314 2738421 2846795 2680064
11742 2680064 2934247 2755947 2720630 2762474 2819782 2735583 2779983 2526425 2442729 2826236
11732B826236j37801J35590n1339o0906L40352l12781o1364l1919P4878j08475
11722B612471P2315j71874J23249j8357j27481L94873j66671k51871J45611R1537
11712B703802J11861k77991p8052N8446J37294l8680j76319J77986K25452J753
11702B845552j62627O3366k10789M09817p1484r4849j02624J37592k4162j75124
11692B614668J88189P9774l6442l3430O4096l7577j72015J25913J54268j76201
11682B771243L00057j24442k7551R9970K4182j46958K62223q1826N3340r8626
11672C031612R7692m3024J11223N3045k34663Q7321l4930k496q5985L00636o6803
11661C213628L3585k50281K34333j89059K10587j33283r9212L7632M7970K00639
$$ plain form
11732 2826236 2688435 2824025 2772686 2711780 3052132 2739351 2677987 2646068 2720946 2612471
11722 2612471 2684786 2512912 2636161 2617804 2490323 2885196 2718525 2466654 2612265 2703802
11712 2703802 2815663 2537672 2459620 2518066 2655360 2616680 2440361 2618347 2843799 2845552
11702 2845552 2682925 2746291 2535502 2945319 2873835 2778986 2676362 2813954 2789792 2614668
11692 2614668 2802857 2882631 2846189 2812759 2876855 2839278 2667263 2793176 2947444 2771243
11682 2771243 3071300 2946858 2919307 3019277 3043459 2896501 3158724 3076898 3130238 3031612
11672 3031612 3129304 3086280 3197503 3250548 3015885 3103206 3068276 3065780 2979795 3280431 3213628
11661 3213628 3247213 2996932 3231265 3042206 3252793 3119510 3020298 3057930 3105900 3306539
11651C306539k07831j72932J33215j71207K17478j17103J99247k09075L56806
11642C335137m20174J22402K7910k36370J51825p3186L74691l07611J30080J4476
11632C119180j14455J46017j08529L05367m26928K30373j20668j32073K75690
11623C173974p3865J84445k18853j63019l7640J85721O8783o6905j07969J08421
11613C053093O3463j12339L4731M1038K5270L7822j48961j5181J86563J13296
11603C278795j57297M2734K83110L8798r4609n2226J79226Q0999O0686k14213
11593C446003k70380K15837j46909K23043j10906j57021k7325K30555k82320K73017
11583C393594j94944M9373k4243J75156r2648o5236J47583j22569K15323J45892
$$ plain form
11651 3306539 3098708 2925776 3058991 2887784 3105262 2988159 3187406 2978331 3335137
11642 3335137 2914963 3037365 3065275 2828905 2980730 2907544 3282235 2974624 3104704 3119180
11632 3119180 3004725 3150742 3042213 3347580 2920652 3151025 3030357 2898284 3173974
11623 3173974 3100109 3284554 3065701 2902682 2865042 3050763 3119546 3052641 2944672 3053093
11613 3053093 3116556 3004217 3038948 3079986 3105256 3143078 2994117 2978936 3165499 3278795
11603 3278795 3121498 3164232 3447342 3486140 3391531 3339305 3518531 3599530 3660216 3446003
11593 3446003 3175623 3391460 3244551 3467594 3356688 3199667 3172342 3402897 3120577 3393594
11583 3393594 3198650 3248023 3223780 3398936 3306288 3241052 3388635 3266066 3481389 3627281
11573C627281J94765l48356p6528O544K84032j05205J02411j70674j10479j22443
11563C281348Q8511K41719k06028j30210J05648m5748K17800k24341q2527M14303
11553C660475k1286o2775L9745k31165l9389j38951L16926j41661j43258N0568
11543C289229K10028o5725j77527O2339k33931L72293k88729Q7949j02980K08005
11533C360951m6757k93953J88655j6906J91773j64247m885J30576j43187L07303
11523C509323l40218n3425J53404k0251R3606k19661J32269n2437Q8686m3585
11513C247711K2067j534J78629M2932K15201j86270j21691Q5862j01409J10354
11503C491852p5510K8432r5832R4553j41510j21973J65718J26292o2982j50961
$$ plain form
11573 3627281 3822046 3473690 3397162 3403706 3687738 3582533 3684944 3514270 3403791 3281348
11563 3281348 3369859 3611578 3405550 3275340 3380988 3335240 3553040 3328699 3246172 3660475
11553 3660475 3639189 3576414 3616159 3384994 3345605 3206654 3523580 3381919 3238661 3289229
11543 3289229 3499257 3433532 3256005 3318344 3084413 3456706 3167977 3255926 3152946 3360951
11533 3360951 3314194 3020241 3208896 3191990 3383763 3219516 3214631 3345207 3202020 3509323
11523 3509323 3169105 3115680 3269084 3248833 3342439 3122778 3255047 3202610 3291296 3247711
11513 3247711 3269778 3268244 3446873 3489805 3705006 3518736 3397045 3482907 3381498 3491852
11503 3491852 3416342 3444774 3348942 3443495 3301985 3180012 3345730 3472022 3409040 3258079
11493C258079K76999j27290l5999K35441J08931j6160j26546o9357N7286O8375
11483C629759j56496L77736o1510k52269J93598j6285J6318j12393m0633l0001
11473C547824K95849j55565J16960l09655L32818j45229j8066R6015k79035K48577
11463C730493k48516K4281q8595k4622J12375K7996M7673J36892l11994J56963
11453C562946J84175l32365J75574l8196K9431k2347k01982j5181M78092l06837
11443C513310J20476o8794L62290k16005J26301k07744j3733k3034K40947p8095
11433C755919K4589J3935J47109J82404p2493p6879K04519J36609Q2263k31441
11423D166534J61838L5639L20094m2006R7903K05674k7511l2953J40J13925J37579
$$ plain form
11493 3258079 3535078 3407788 3371789 3607230 3716161 3700001 3573455 3504098 3561384 3629759
11483 3629759 3473263 3850999 3789489 3537220 3730818 3714533 3730851 3618458 3577825 3547824
11473 3547824 3843673 3688108 3805068 3495413 3828231 3683002 3664936 3760951 3481916 3730493
11463 3730493 3481977 3506258 3417663 3393041 3505416 3533412 3581085 3717977 3405983 3562946
11453 3562946 3747121 3414756 3590330 3552134 3581565 3559218 3357236 3342055 3820147 3513310
11443 3513310 3633786 3564992 3927282 3711277 3837578 3629834 3616101 3593067 3834014 3755919
11433 3755919 3780508 3794443 3941552 4123956 4051463 3974584 4179103 4315712 4397975 4166534
11423 4166534 4328372 4364011 4684105 4642099 4740002 4945676 4918165 4885212 4885352 4999277 5136856
11412E136856J38348l60613M25597m7557k3338J20854Q2497N0803j72170L54290
11402E705567J98257m5820k3858M63086k47229J79110K18390J66283K3432J18327
11392F755545n1703j12090N41634r6126J9309L00717j49983L06687m7738J65593
11382G631845M0902J24180N6024J78541J23751J69141k31211K23702K27916J21332
11372H666123j03030p877K17781k2626O0982J05168n8243n646J38713L90750k91713
11361I090382j6547J21670m3923J62199P7990L6849j98385Q4434J48733o2236
11351I401166j33590L08125j65824m6785j272Q6517p9390k93100P0572O7707j21075
11340I093051q9609j04563M6440n2602j02638l38521K87493m40426O2593p7747
$$ plain form
11412 5136856 5275204 4914591 5340188 5292631 5269293 5390147 5472644 5523447 5351277 5705567
11402 5705567 5903824 5858004 5834146 6297232 6050003 6229113 6447503 6613786 6637218 6755545
11392 6755545 6703842 6591752 7133386 7037260 7056569 7357286 7207303 7513990 7466252 7631845
11382 7631845 7672747 7796927 7852951 8031492 8155243 8324384 8093173 8316875 8544791 8666123
11372 8666123 8563093 8555216 8772997 8750371 8811353 8916521 8858278 8852632 8991345 9382095 9090382
11361 9090382 9073835 9195505 9151582 9313781 9391771 9428620 9230235 9314669 9463402 9401166
11351 9401166 9267576 9575701 9409877 9363092 9361820 9448337 9368947 9075847 9146419 9214126 9093051
11340 9093051 9003442 8898879 8945319 8892717 8790079 8451558 8739051 8298625 8361218 8283471
11330H283471j55288K60283m80499J50945j63552m5440L2021m68919J88973J25282
11320G727277m90262n7544k00168k7173L5631l18749J42619l97010l9381m7001
11310F328239l9766j78835k06826j46390P2653l52693J28779K1910l42494k60634
11300E023943J20462p077k09704K6580l20930Q97k02295J93242j53592j1254j09814
11289D350458j21477r6186J2351K28329j81739k57721R1466l03719J39360k36023
11279C625099n9214j03335J78717k45249J74163l22131O2161p8202L2759j3283
11269C251485J13796k05722n9472J44958J25582j47137P6119j5927n5726k9960
11259C197996p7396r719j22079o0372J55710j85673K32982j76055K13368j36231
$$ plain form
11330 8283471 8128183 8388466 7907967 8058912 7895360 7849920 7881941 7413022 7601995 7727277
11320 7727277 7237015 7179471 6979303 6952130 6987761 6669012 6811631 6414621 6375240 6328239
11310 6328239 6288473 6109638 5902812 5756422 5829075 5476382 5605161 5627071 5284577 5023943
11300 5023943 5144405 5137328 4927624 4954204 4633274 4634171 4431876 4625118 4471526 4460272 4350458
11289 4350458 4228981 4132795 4145146 4373475 4191736 3934015 4025481 3721762 3861122 3625099
11279 3625099 3565885 3462550 3641267 3396018 3570181 3248050 3310211 3232009 3264768 3251485
11269 3251485 3365281 3159559 3100087 3245045 3370627 3223490 3299609 3283682 3227956 3197996
11259 3197996 3120600 3110881 2988802 2928430 3084140 2898467 3131449 2955394 3168762 3032531
11249C032531K5096m0506j2076R0518j66503J07081M867q1630M2810Q1055j56413
11238B926830j79052m2812L26879j01680J77515j04670L56543j12060j87592J37539
11228C197440K4260K98567K30049O70645Q94863O59685O76970N65055J99275M33800
11218G850609k48323k2355l4947p54533q47302j014012p05965n64169k20551k58813
11208C179639N9129j55143p5497j8769p6810L50711j03271j8622J21568L1038
11198C293973Q4927L06706P50773R49043J076957L12121L10242N29552J13746
11189G728040K5545k30057j31812p47110p54141j043156q95979l49373l15622
11180C286335k6886K1594k72245P1166j67631J51339J8817Q78M1569J65409j87012
$$ plain form
11249 3032531 3057627 3017121 3005045 3095563 2929060 3036141 3041008 2959378 3002188 3083243 2926830
11238 2926830 2747778 2704966 3031845 2930165 3107680 3003010 3359553 3247493 3059901 3197440
11228 3197440 3221700 3520267 3750316 4420961 5315824 5975509 6652479 7217534 7416809 7850609
11218 7850609 7602286 7579931 7544984 6790451 5943149 4929137 4223172 3659003 3438452 3179639
11208 3179639 3238768 3083625 3008128 2989359 2912549 3263260 3159989 3141367 3262935 3293973
11198 3293973 3378900 3685606 4436379 5385422 6462379 6774500 7084742 7614294 7728040
11189 7728040 7753585 7523528 7391716 6644606 5890465 4847309 3951330 3601957 3286335
11180 3286335 3259449 3281043 3008798 3079964 2912333 3063672 3082489 3083367 3124936 3290345 3103333
11169C103333Q1713J48106j97858J60498m2969p1251K29542j24452j70645L05224
11159C421241j71791M8838q1774L858P3563j9242P9892N3322l2061O5244P6903
11148C517993k68165J66637j00291q3743L33814k12592M1261J3453K36894r2647
11138C552614J08216j43102J00213J02132j34396R9150L4712K7410j8033m2337
11128C686579n2849l610Q3641L2492l80J8912M0156O5947j34406o9338J14677
11117C781821K22498m9949k1119j57078J79190n9977p5707K10957J935O0728M568
11106D097867n5451j49898P9580K76893k25327J3952j84106L05183k61454O9138
11096C966377O0256j77267K09253j98775j17534J12728K85588k07285q5229o542
$$ plain form
11169 3103333 3185046 3333152 3135294 3295792 3252823 3181572 3411114 3286662 3116017 3421241
11159 3421241 3249450 3298288 3216514 3220372 3293935 3274693 3354585 3407907 3375846 3441090 3517993
11148 3517993 3249828 3416465 3316174 3232431 3566245 3353653 3394914 3408367 3645261 3552614
11138 3552614 3660830 3517728 3617941 3720073 3585677 3684827 3719539 3746949 3728916 3686579
11128 3686579 3633730 3630120 3713761 3746253 3745873 3764785 3804941 3870888 3736482 3667144 3781821
11117 3781821 4004319 3954370 3933251 3776173 3955363 3895386 3819679 4030636 4032571 4093299 4097867
11106 4097867 4042416 3892518 3972098 4248991 4023664 4037616 3853510 4158693 3897239 3966377
11096 3966377 4026633 3849366 4058619 3859844 3742310 3855038 4140626 3933341 3848112 3841570
11086C841570J54524j97673J74148r8207j0935o7039l3797K63213k57344L3744
11076C802204N0523J45237j97350j3379P9616N29230m29878P5015l7969K13804
11066D217053K62622k23577K64093L3568j52144J14845M1618k7034L39998l0756
11056D840286J55510k23126M37205l99671K18049P5118j60646L37375j73645K00309
11046E306764j05353P2522k6699L3433P1170K30360K98138l78565L71914J32370
11036F006054q0017L97524M1171L45416k1404J31645O0939L77299K3059M4465
11026G326151K53886L60528j89359J98417K28606M9421K71245m6694K6145K77107
11016H755453j51527J24406J76946j48109L25412L24857j37926L49081J95662
$$ plain form
11086 3841570 3996094 3798421 3972569 3874362 3863427 3796388 3762591 4025804 3768460 3802204
11076 3802204 3852727 3997964 3800614 3787235 3866851 4396081 3966203 4041218 4003249 4217053
11066 4217053 4479675 4256098 4520191 4553759 4401615 4516460 4558078 4531044 4871042 4840286
11056 4840286 4995796 4772670 5209875 4810204 5028253 5103371 4942725 5280100 5106455 5306764
11046 5306764 5201411 5273933 5247234 5280667 5351837 5582197 5880335 5501770 5873684 6006054
11036 6006054 5926037 6323561 6364732 6710148 6688744 6820389 6881328 7258627 7281686 7326151
11026 7326151 7580037 7940565 7751206 7949623 8178229 8227650 8498895 8452201 8478346 8755453
11016 8755453 8603926 8728332 8905278 8757169 9082581 9407438 9269512 9618593 9814255
11007I814255K36480J69002K56634J32924N64220J02886Q0952K55001L18858p3813
10997A1857399M30886J46261O355K40414J0961M4098L27802m6722K85429j44193
10987A3158690L93041K684J91527L71863O7737O58334M75901J01193M44808N75227
10977A6441005L36404J54408L24311K19040j12319K7721M96294j88667K73840
10968A7972037L40878J85785O20172N99050J48302L33273O90903L54348P14351
10959B1959099K06284M95281N24467O39996P55386O87630M45053M34461O52826
10950B6800483M31996K21602M45495L26054L90948m2727O13612M25185M57442
10941C0070090M49125Q08934O05118P46002N21490O47220P20744N62007J120016
$$ plain form
11007 9814255 10050735 10219737 10476371 10609295 11173515 11276401 11357353 11612354 11931212 11857399
10997 11857399 12288285 12434546 12440901 12681315 12692276 12736374 13064176 13017454 13302883 13158690
10987 13158690 13551731 13554415 13745942 14117805 14185542 14843876 15319777 15420970 15865778 16441005
10977 16441005 16777409 16931817 17256128 17475168 17362849 17390570 17886864 17698197 17972037
10968 17972037 18312915 18498700 19118872 19717922 19866224 20199497 20890400 21244748 21959099
10959 21959099 22165383 22660664 23185131 23825127 24580513 25268143 25713196 26147657 26800483
10950 26800483 27232479 27454081 27899576 28225630 28616578 28573851 29187463 29612648 30070090
10941 30070090 30519215 31328149 31933267 32679269 33200759 33847979 34568723 35130730 36250746
10932C6250746M96341P47674M27311O69979Q04137M00081O83962O59337N90175
10923D1729743L38385P22916L72896K89712J50996L02256K70692k37908K1405
10914D3961093j36121o6680l00329q6068J06566k00984m62333L08226M373K6542
10904D3154285M28840Q8424J93133N7668J9515N19582N28203K82055K48861N73108
10894D6093674O78991Q02676P83736R25526J151376J192140J644199J912297J744084
10885E6928699K070538K634332K837621L206933L486848L560781M176550L934998
10877H2837300M459663L800274L687085L435502K452210K047177Q98124K16395
10869A03833730n65994j670730k192868k636444l054097l643703l639588l952355
$$ plain form
10932 36250746 36747087 37494761 37922072 38592051 39396188 39796269 40480231 41139568 41729743
10923 41729743 42068128 42791044 43163940 43453652 43604648 43906904 44177596 43939688 43961093
10914 43961093 43824972 43758292 43457963 43371895 43478461 43277477 42815144 43123370 43127743 43154285
10904 43154285 43583125 43671549 43864682 43922350 43941865 44461447 44989650 45271705 45520566 46093674
10894 46093674 46772665 47575341 48359077 49284603 50435979 51628119 53272318 55184615 56928699
10885 56928699 58999237 61633569 64471190 67678123 71164971 74725752 78902302 82837300
10877 82837300 87296963 91097237 94784322 98219824 100672034 102719211 103617335 103833730
10869 103833730 103267736 101597006 99404138 96767694 93713597 90069894 86430306 82477951
10861H2477951l981822m132296l642729l768615l743034l489765l481265l147132
10853E3091293l157605k650575k993618k278232k809702k035271k400118j804495
10845C2961677j970679j718007j727389j161342j657672j219247j215144j161284
10837B1130913j051983r11110j163952n49401q84158o41566p66969o08373m96594
10828A4056807m41187p60740m36058n21367m70380l28574n88483J04882p07800
10819I907100l66825k2539k57080k74234k84494l04942p7250l33408j31192k18171
10809G636965L7921l00354k23801j43178J44519j97985k34225k87360p6500R2188
10799F448190l34375m8319k74430l28959n9061M9561m22002L194R8818j97826
$$ plain form
10861 82477951 78496129 74363833 70721104 66952489 63209455 59719690 56238425 53091293
10853 53091293 49933688 47283113 44289495 42011263 39201561 37166290 34766172 32961677
10845 32961677 30990998 29272991 27545602 26384260 24726588 23507341 22292197 21130913
10837 21130913 20078930 19167820 18003868 17454467 16570309 15928743 15161774 14553401 14056807
10828 14056807 13615620 12854880 12418822 11897455 11427075 11098501 10510018 10614900 9907100
10819 9907100 9540275 9517736 9260656 8986422 8701928 8396986 8319736 7986328 7855136 7636965
10809 7636965 7674886 7374532 7150731 7007553 7152072 6954087 6719862 6432502 6356002 6448190
10799 6448190 6113815 6065496 5791066 5462107 5403046 5452607 5030605 5033799 5132617 4934791
10789D934791k22002L26510j42166k84641Q5026M456N4382K7881l67297o3536
10779D353404j70616K85684m06635L16592k98378K6863j87606R4087k77632O2980
10769C798743K446l8504P5836l24419J0617J32408k26200m7725J559K8972J53296
10758C567029m60067L47799j70769p9888j50955M12679P0653k2855k0806m9433
10748C443387Q4311j73735j46024K76745m6718l92003O7172q9420m1699M4915
10738C026931j56523J50416k33132K82285m29633K10847J1889J54115j49785J41148
10728C008558Q2945l708j8398m7520J67771m5523J577N2702j67598n7548m0194
10717B933064N1565J8191l06696M5439j2203Q0137K74037N5774l49433M6345j86907
$$ plain form
10789 4934791 4712789 5039299 4897133 4612492 4697518 4701974 4756356 4784237 4416940 4353404
10779 4353404 4182788 4468472 4061837 4378429 4080051 4106914 3919308 4013395 3735763 3798743
10769 3798743 3801189 3762685 3838521 3514102 3524719 3657127 3430927 3383202 3384761 3413733 3567029
10758 3567029 3106962 3454761 3283992 3204104 3053149 3465828 3536481 3513626 3492820 3443387
10748 3443387 3527698 3353963 3207939 3484684 3437966 3045963 3113135 3023715 2982016 3026931
10738 3026931 2870408 3020824 2787692 3069977 2640344 2851191 2863080 3017195 2867410 3008558
10728 3008558 3091503 3087795 3069397 3021877 3189648 3144125 3145702 3198404 3030806 2973258 2933064
10717 2933064 2984629 3002820 2696124 2741563 2729360 2809497 3083534 3139308 2789875 2836220 2649313
10706B649313O1903J0120j06690K46382K52071M0392j27208k05708j84896R0645
10696B726324L3112k04860J49672M3616N833j25470K67655l72024N74501m06812
10686B691547J61909K56090k98555j43856m4144J32436R1137K9932J81686q2297
10676B975885M3679O4426J76648R7869p1364K40413m36770l954R4178p1873j85388
10665B923749K3436l38094J10581M2675j69362J3689K1152j44559j48813M61290
10655B795744k41192J46596J0520K91351n2886M10645k86241o1827K947k06546
10645B809111J08963j6025m05444j2503k26796O005l03014r3490J0069J0177L04060
10634B191113q1972k64658l1136L81893j42365j68119P1980j6259j31543J2817
$$ plain form
10706 2649313 2711216 2721336 2614646 2861028 3113099 3153491 3026283 2820575 2635679 2726324
10696 2726324 2759436 2554576 2704248 2747864 2753697 2628227 2895882 2523858 3098359 2691547
10686 2691547 2853456 3109546 2810991 2667135 2622991 2755427 2846564 2876496 3058182 2975885
10676 2975885 3019564 3083990 3260638 3358507 3287143 3527556 3090786 3086832 3181010 3109137 2923749
10665 2923749 2947185 2609091 2719672 2762347 2592985 2606674 2627826 2483267 2334454 2795744
10655 2795744 2554552 2701148 2711668 3003019 2950133 3360778 3074537 3012710 3015657 2809111
10645 2809111 2918074 2902049 2496605 2484102 2257306 2263311 1960297 1866807 1876876 1887053 2191113
10634 2191113 2109141 1844483 1813347 2195240 2052875 1884756 1956736 1940477 1808934 1821751
10624A821751J95173j19097J4710J0758l28961L59019j00464P5979J44797l25756
10614A747909J88205L5527j98196l0991o160M22018k19878j19603K33198k04361
10604A847668K60477l58135M5731K19801k42526J76007o7508P0963R5544j62689
10594A885333k9115r1856N746J87983k19n0831j67944J02628k83836L62221n3694
10583A866416Q4573m0065j13693j8050o8866K1979K14556o2944P6812l0206L4193
10572A964705K6569j41019M4760J1635k22052J55119j33961J00436p7528j06300
10562A622364J62781k04504K2892j29089J8677l6212J44533k03938m2989J76005
10552A530520K2614k12970L34835j36823K3357M2393q6851J00311j76890J41911
$$ plain form
10624 1821751 2016924 1897827 1912537 1923295 1594334 1953353 1852889 1928868 2073665 1747909
10614 1747909 1936114 1971641 1773445 1742454 1736294 2158312 1938434 1818831 2052029 1847668
10604 1847668 2108145 1750010 1795741 2015542 1773016 1949023 1881515 1952478 2048022 1885333
10594 1885333 1856218 1764362 1770108 1958091 1957872 1907041 1739097 1841725 1557889 1920110 1866416
10583 1866416 1950989 1910924 1797231 1779181 1710315 1732294 1946850 1883906 1960718 1930512 1964705
10572 1964705 1991274 1850255 1895015 1906650 1684598 1839717 1705756 1806192 1728664 1622364
10562 1622364 1785145 1580641 1603533 1474444 1493121 1456909 1601442 1397504 1354515 1530520
10552 1530520 1553134 1340164 1674999 1538176 1561533 1603926 1517075 1617386 1440496 1582407
10542A582407l12033M97717j79071j93313K35087O0555k41397Q5270M80m9453
10532A486249o9467P1670P3561K41887j51352P5938n108j71529K7342J1694J78055
10521A768940P2881L26549M73770k16708K65038j5926K8304L51763k29100R4497
10511B920008j66907m66369k06019j87495J04126r6492j04516L2285P0381k77434
10501A621568M0851J89321Q6276M1394p6262J911m9363J20299R5531J25398M65397
10490B662321J93261O3633P098j91396L55220J58999j66058P6816o44895j3506
10480B501493l59321j90376K39172k40812P558K08318p7744J08590m2178R8546
10470B253246K06957k13662J82262N3604j49189P4654K62260j2404N8528J55337
$$ plain form
10542 1582407 1270374 1768091 1589020 1395707 1630794 1691349 1449952 1535222 1535702 1486249
10532 1486249 1416782 1488452 1562013 1803900 1652548 1728486 1723378 1551849 1579191 1590885 1768940
10521 1768940 1841821 2168370 2642140 2425432 2690470 2674544 2702848 3054611 2825511 2920008
10511 2920008 2753101 2286732 2080713 1893218 1997344 1900852 1796336 1828621 1899002 1621568
10501 1621568 1662419 1851740 1938016 1979410 1903148 1905059 1855696 1975995 2071526 2196924 2662321
10490 2662321 2855582 2919215 2926313 2734917 3090137 3249136 3083078 3159894 2514999 2501493
10480 2501493 2142172 1951796 2190968 1950156 1957714 2166032 2088288 2196878 2154700 2253246
10470 2253246 2460203 2246541 2428803 2482407 2333218 2407872 2670132 2657728 2716256 2871593
10460B871593J04813j81319j39002J73198k62182j27683p0476l4826r274j9964
10450B304878k2415N1053L6402M8898J31244n4281L28679l24617Q5470K91982
10440B877293L02208K07917L30167M23431j01290K18105J818j73950K50148k75198
10430D060649j90630m35389m91520j44659k41592k97346O7823q643R6252m445
10420B410500j74693o5660J11770L1991J00020k15086P7776K45340J38430L45691
10410C006079J95006K8680K82248K7940J60593Q9095J02252K07135k38273j93645
10400C667110k51581l9658J47384R9947J51925J39741M0262R3338M4047J60364
10390D252879L08768R2324K1609P5670j05575J75875J45093n8628O542J51818
$$ plain form
10460 2871593 2976406 2795087 2656085 2829283 2567101 2439418 2368942 2334116 2324842 2304878
10450 2304878 2282463 2333516 2369918 2418816 2550060 2495779 2824458 2499841 2585311 2877293
10440 2877293 3179501 3387418 3717585 4141016 4039726 4257831 4259649 4085699 4335847 4060649
10430 4060649 3870019 3434630 2943110 2798451 2556859 2259513 2327336 2318693 2414945 2410500
10420 2410500 2235807 2170147 2281917 2313908 2413928 2198842 2276618 2521958 2660388 3006079
10410 3006079 3201085 3229765 3512013 3539953 3700546 3789641 3891893 4099028 3860755 3667110
10400 3667110 3415529 3375871 3523255 3623202 3775127 3914868 3955130 4048468 4092515 4252879
10390 4252879 4561647 4653971 4675580 4751250 4645675 4821550 4966643 4908015 4914557 5066375
10380E066375L01304L2119m5289P3659J15402J04735M4720j04267K29133k1308
10370E796583K2470N0680l0456J767n7763J02787O6794P2006j15688m1156k67410
10359E600614l09982l6988l69898N2810o8335J81650j1744M03587j00555l63229
10349D977930J80236n7741k92799k056M6103j00852J01537k95996o2637j20210
10339D373515K06613J33857P4474J71550m5298J15552Q3717j26490m3825J47493
10329E091158l09722l530n8432r8026j71753J30924J00902k95815K55156j51935
$$ plain form
10380 5066375 5367679 5399798 5354509 5428168 5543570 5648305 5693025 5588758 5817891 5796583
10370 5796583 5819053 5869733 5839277 5841044 5783281 5886068 5952862 6024868 5909180 5868024 5600614
10359 5600614 5290632 5253644 4883746 4936556 4868221 5049871 5038127 5441714 5341159 4977930
10349 4977930 5158166 5100425 4807626 4805570 4851673 4750821 4852358 4556362 4493725 4373515
10339 4373515 4580128 4713985 4788459 4960009 4914711 5030263 5113980 4987490 4943665 5091158
10329 5091158 4781436 4777906 4719474 4621448 4449695 4580619 4681521 4385706 4640862 4488927
$$ [...]
##END NTUPLES=NMR SPECTRUM
##END=
