##TITLE=Coffee green (M5-ROVE80 + 1.5mL buffer 50/50,  450uL extracto + 50uL (D2O+TMS))
without heating, vortex and centrifuged, temperature 0oC.
##JCAMPDX= 6.0         $$ Bruker NMR JCAMP-DX V2.0
##DATA TYPE= NMR SPECTRUM
##DATA CLASS= NTUPLES
##ORIGIN= Bruker BioSpin GmbH
##OWNER= Administrator
$$ 1.72 TOPSPIN		Version 2.1
$$ 2012-05-22 16:16:32.637 -0700  Administrator@X
$$ Compression mode = diff/dup
##.OBSERVE FREQUENCY= 400.13188198
##.OBSERVE NUCLEUS= ^1H
##.ACQUISITION MODE= SIMULTANEOUS (DQD)
##.ACQUISITION SCHEME= undefined
##.AVERAGES= 64
##.DIGITISER RES= 22
##SPECTROMETER/DATA SYSTEM= spect
##.PULSE SEQUENCE= noesygppr1d
##.SOLVENT NAME= H2O+D2O
##.SHIFT REFERENCE= INTERNAL, H2O+D2O, 1, 14.97969
##AUDIT TRAIL= $$ (NUMBER, WHEN, WHO, WHERE, PROCESS, VERSION, WHAT)
$$ ##TITLE= Audit trail, TOPSPIN		Version 2.1
$$ ##JCAMPDX= 5.01
$$ ##ORIGIN= Bruker BioSpin GmbH
$$ ##OWNER= Administrator
$$ $$ C:\Bruker\TOPSPIN/data/jwist/nmr/11-coffee-green-quantification-2/301/pdata/1/auditp.txt
$$ ##AUDIT TRAIL=  $$ (NUMBER, WHEN, WHO, WHERE, PROCESS, VERSION, WHAT)
(   1,<2011-11-18 15:27:39.622 -0500>,<Administrator>,<TOPSPIN>,<go>,<TOPSPIN 2.1>,
      <created by zg
	started at 2011-11-18 15:18:45.091 -0500,
	POWCHK enabled, PULCHK disabled,
       configuration hash MD5:
       DA 63 81 1B EF 4C B5 72 B4 DF EA D9 B4 DB 4C 08
       data hash MD5: 64K
       86 AA 19 BE DC 0C 71 8D 1E 4B 24 0D 51 32 22 2C>)
(   2,<2011-11-18 15:28:54.013 -0500>,<Administrator>,<TOPSPIN>,<proc1d>,<TOPSPIN 2.1>,
      <Start of raw data processing
       efp LB = 0 FT_mod = 6 PKNL = 1 PHC0 = 0 PHC1 = 0 SI = 32K 
       data hash MD5: 32K
       A0 41 A1 A7 DC 35 27 C3 F7 78 AE 20 F8 6B BA A6>)
(   3,<2011-11-18 15:28:54.419 -0500>,<Administrator>,<TOPSPIN>,<proc1d>,<TOPSPIN 2.1>,
      <pk PHC0 = 23.04382 PHC1 = 0 
       data hash MD5: 32K
       FB DE ED 1B 19 AE 44 AA 69 50 D7 5A C8 B1 E5 2B>)
(   4,<2011-11-18 15:29:23.700 -0500>,<Administrator>,<TOPSPIN>,<audit>,<TOPSPIN 2.1>,
      <user comment:
       TITLE=Coffee green (M5-ROVE80 + 1.5mL buffer 50/50,  450uL extracto + 50uL (D2O+TMS))
       without heating, vortex and centrifuged, temperature 0oC.TITLE_END
       data hash MD5: 32K
       FB DE ED 1B 19 AE 44 AA 69 50 D7 5A C8 B1 E5 2B>)
$$ ##END=
$$ 
$$ $$ hash MD5
$$ $$ 5B 14 64 4F 38 FA E2 31 D0 03 34 61 CD 6E C3 D9
##$RELAX= 
##$RELAX= 
##$RELAX= 
##$RELAX= 
##$RELAX= 
##$RELAX= 
##$RELAX= 
$$ Bruker specific parameters
$$ --------------------------
##$DU= <Z:>
##$EXPNO= 301
##$NAME= <11-coffee-green-quantification-2>
##$PROCNO= 1
##$TYPE= <nmr>
##$USER= <jwist>
##$ACQT0= -8.18779609996853
##$AMP= (0..31)
100 100 100 100 100 100 100 100 100 100 100 100 100 100 100 100 100 100
100 100 100 100 100 100 100 100 100 100 100 100 100 100
##$ANAVPT= -1
##$AQSEQ= 0
##$AQ_mod= 3
##$AUNM= <au_prof>
##$AUTOPOS= <>
##$BF1= 400.13
##$BF2= 400.13
##$BF3= 400.13
##$BF4= 400.13
##$BF5= 400.13
##$BF6= 400.13
##$BF7= 400.13
##$BF8= 400.13
##$BYTORDA= 0
##$CFDGTYP= 0
$$ [...]
150 150 150 150 150 150 150 150
##$TP07= 0
##$TPNAME0= <>
##$TPNAME1= <>
##$TPNAME2= <>
##$TPNAME3= <>
##$TPNAME4= <>
##$TPNAME5= <>
##$TPNAME6= <>
##$TPNAME7= <>
##$TPOAL= (0..7)
0.5 0.5 0.5 0.5 0.5 0.5 0.5 0.5
##$TPOFFS= (0..7)
0 0 0 0 0 0 0 0
##$TUNHIN= 0
##$TUNHOUT= 0
##$TUNXOUT= 0
##$USERA1= <user>
##$USERA2= <user>
##$USERA3= <user>
##$USERA4= <user>
##$USERA5= <user>
##$V9= 5
##$VALIST= <valist>
##$VCLIST= <CCCCCCCCCCCCCCC>
##$VD= 0
##$VDLIST= <DDDDDDDDDDDDDDD>
##$VPLIST= <PPPPPPPPPPPPPPP>
##$VTLIST= <TTTTTTTTTTTTTTT>
##$WBST= 2048
##$WBSW= 25
##$XGAIN= (0..3)
0 0 0 0
##$XL= 0
##$YL= 0
##$YMAX_a= 5000893
##$YMIN_a= -1852787
##$ZGOPTNS= <>
##$ZL1= 120
##$ZL2= 120
##$ZL3= 120
##$ZL4= 120
##$ABSF1= 0
##$ABSF2= 0
##$ABSG= 0
##$ABSL= 0
##$ALPHA= 0
##$AQORDER= 0
##$ASSFAC= 0
##$ASSFACI= 0
##$ASSFACX= 0
##$ASSWID= 0
##$AUNMP= <proc_prof1d>
##$AXLEFT= 0
##$AXNAME= <>
##$AXNUC= <1H>
##$AXRIGHT= 0
##$AXTYPE= 0
##$AXUNIT= <>
##$AZFE= 0.1
##$AZFW= 0.1
##$BCFW= 0
##$BC_mod= 0
##$BYTORDP= 0
##$COROFFS= 0
##$CY= 15
##$DATMOD= 1
##$DC= 0
##$DFILT= <>
##$DTYPP= 0
##$F1P= 7.84969882702876
##$F2P= 6.13970219458474
##$FCOR= 0.5
##$FTSIZE= 32768
##$FT_mod= 6
##$GAMMA= 0
##$GB= 0
##$INTBC= 1
##$INTSCL= 1
##$ISEN= 128
##$LB= 0
##$LEV0= 0
##$LPBIN= 0
##$MAXI= 10000
##$MC2= 0
##$MEAN= 0
##$ME_mod= 0
##$MI= 0
##$NCOEF= 0
##$NC_proc= -7
##$NLEV= 6
##$NOISF1= 0
##$NOISF2= 0
##$NSP= 0
##$NTH_PI= 0
##$NZP= 0
##$OFFSET= 14.97969
##$PC= 1
##$PHC0= 23.04382
##$PHC1= 0
##$PH_mod= 1
##$PKNL= yes
##$PPARMOD= 0
##$PPDIAG= 0
##$PPIPTYP= 0
##$PPMPNUM= 2147483647
##$PPRESOL= 1
##$PSCAL= 0
##$PSIGN= 0
##$PYNMP= <proc.py>
##$REVERSE= no
##$SF= 400.13
##$SI= 32768
##$SIGF1= 0
##$SIGF2= 0
##$SINO= 400
##$SIOLD= 32768
##$SPECTYP= <>
##$SREGLST= <1H.CDCl3>
##$SSB= 0
##$STSI= 32768
##$STSR= 0
##$SW_p= 8223.68421052631
##$SYMM= 0
##$S_DEV= 0
##$TDeff= 65536
##$TDoff= 0
##$TI= <>
##$TILT= no
##$TM1= 0
##$TM2= 0
##$TOPLEV= 0
##$USERP1= <user>
##$USERP2= <user>
##$USERP3= <user>
##$USERP4= <user>
##$USERP5= <user>
##$WDW= 1
##$XDIM= 32768
##$YMAX_p= 467850021
##$YMIN_p= -37452744
##$CURPLOT= <Network HP LaserJet P1505>
##$CURPRIN= <$Network HP LaserJet P1505>
##$DFORMAT= <normdp>
##$LAYOUT= <+/1D_H.xwp>
##$LFORMAT= <normlp>
##$PFORMAT= <normpl>
##$SURQMSG= 1
$$ End of Bruker specific parameters
$$ ---------------------------------
##NTUPLES= NMR SPECTRUM
##VAR_NAME=  FREQUENCY,     SPECTRUM/REAL,   SPECTRUM/IMAG
##SYMBOL=    X,             R,               I
##VAR_TYPE=  INDEPENDENT,   DEPENDENT,       DEPENDENT
##VAR_FORM=  AFFN,          ASDF,            ASDF
##VAR_DIM=   32768,         32768,           32768
##UNITS=     HZ,            ARBITRARY UNITS, ARBITRARY UNITS
##FACTOR=    0.250966925370066, 1,           1
##FIRST=     8223.43324360094, 9112,         -387077
##LAST=      0,             -93142,          -327963
##MIN=       0,             -37452744,       0
##MAX=       8223.43324360094, 467850021,    0
$$ Real data points
##PAGE= N=1
##DATA TABLE= (X++(R..R)), XYDATA
$$ [...]
23004 562573 473285 592502 539030 578752 331541 148017 907906 777346 515114 656704
22994 656704 1122460 678605 828574 855877 825677 716660 348740 756564 842236 864581
22984 864581 871640 1101563 965383 772060 1287267 651180 1026045 909063 1336703 1010014
22974 1010014 1190273 994435 1224356 1161747 1107803 1068966 981559 1358381 1047863 852885
22964 852885 1765748 893447 1016703 929485 1440596 1655366 1166607 1259459 1124965 1753128
22954 1753128 1429737 1383625 2144420 2362140 2546560 3151390 4170915 5013354 5846234
22945 5846234 8055224 9553252 11656710 14133775 15703720 18100491 20219084 22005749
22937 22005749 23030113 24796409 24294153 24426832 24050821 21793271 20641614 18943155
22929 18943155 16778775 14708651 12733045 10981448 9407340 7603193 6685722 5532639
22921 5532639 4919543 4406473 4513362 5608245 5845130 6588639 8488373 9618905 11811162
22912 11811162 14240376 17506396 20370871 23995014 27426706 30831303 33602653 35934237
22904 35934237 38306305 39664566 41100443 40531841 40494851 38832160 36137121 33975550
22896 33975550 31046184 28526617 25383594 22494156 19672820 16918931 15212949 13986656
22888 13986656 12863259 12302305 12334457 13024664 12829848 13253132 14170271 14902470 15958552
22879 15958552 16644192 17671628 18488401 19000050 18302697 18158157 18131236 17367226 16638002
22870 16638002 15118130 14358174 12716436 11229176 10437301 8593855 7915995 6501306
22862 6501306 5740634 4754858 4601900 4272877 3718168 3306780 2481547 2179719 2395192
22853 2395192 1913242 1714856 1735193 1664512 1590947 1550805 1114515 1291679 1416800 632955
22842 1152822 1309292 1026810 1426811 1412451 1205657 789057 646511 820946 1172619 563946
22831 825226 678474 154573 678649 809450 843811 1376962 1112821 684643 1051760 1025638
22821 1025638 371891 889855 884840 545223 583425 1121389 750673 1136152 944195 710407
22811 710407 1093628 1024532 584973 846935 814526 498066 1015728 290907 512404 747940
22801 747940 697728 654325 591381 719740 832512 602133 937568 638772 342588 558900
22791 558900 602066 486961 832300 856204 963147 421139 802718 717864 612942 1045739
22781 1045739 923243 526968 216244 618532 260552 882137 139205 1073554 774712
22772 774712 738398 -46778 840291 -72624 646633 380515 909410 393826 722888 360720
22761 536225 790617 869099 597751 1123862 596930 378198 413333 657952 663240 1134431
22751 1134431 1227366 764674 245119 674694 333694 678922 565236 764234 422876 472104
22741 472104 938756 131955 289665 296956 381554 844294 581643 819773 450861 546881
22731 546881 560626 612898 364128 490243 530129 683755 -260072 293828 499967 567874
22721 567874 448832 797280 656500 375576 570589 324519 784027 415752 807512 743708
22711 743708 440828 159532 973343 359538 775105 333770 409537 1336910 967709 213095
22700 427651 609680 830011 637071 560779 936497 284443 485444 325572 271309 1120843
22690 1120843 1030934 573042 257090 443773 395605 298788 725428 998450 735823 694052
22680 694052 818641 501538 520608 786798 881933 388715 851010 987116 598882 767566
22670 767566 450242 622482 722850 381888 844278 658150 105638 416243 680453 1038186
22660 1038186 675848 471518 668696 717886 1051407 445217 460648 343463 397527 640775
22650 640775 611576 857848 673717 600948 327994 532103 815329 922259 839463 711899
22640 711899 966715 997668 548115 655280 629666 578342 638119 652560 1006669 673313
22630 673313 796914 1094685 1321363 498345 596515 621248 666201 435242 935938 492507
22620 492507 513246 814522 466678 315520 629857 722091 941384 732874 482288 933932
22610 933932 466406 659970 1294593 583237 918975 674692 943598 676697 881990 1014364
22600 1014364 1091858 895812 882640 547009 747784 1119499 585272 1080759 1053063 925312
22590 925312 953763 399474 1139635 1137646 805560 1027432 613832 1398310 963474 1178706
22580 1178706 946767 873674 643043 708240 364872 850525 1094046 770032 713082 538118
22570 538118 650900 735924 224562 1025093 655300 695959 963669 1253015 695945 914205
22560 914205 1229218 1065679 767444 892636 669215 1171754 1253126 1104175 531551 977351
22550 977351 996327 624374 581920 552871 826239 374369 1103431 789292 1008031 587019
22540 587019 1337101 748031 1122076 793430 1445898 404446 926444 987315 698528 1127343
22530 1127343 688033 534886 874468 941497 853036 1103641 686220 967727 634769 1270113
22520 1270113 617838 854777 271593 233450 1159509 804702 813685 1039609 1098154 830658
22510 830658 1066840 1230506 816965 775688 1058281 751232 878295 754234 839688 648192
22500 648192 849530 1172026 951858 1458901 1097834 889858 1155495 984240 913815 674571
22490 674571 577125 576450 716535 857130 857648 767137 753549 673094 1013256 1176161 1356935
22479 1356935 656318 880878 597605 1438219 1117196 1213207 926993 759709 728839 945150
22469 945150 1277907 1491081 856825 791214 386122 744931 791619 1001005 829423 1405641
22459 1405641 850829 578425 790528 735353 1240258 953685 1085684 807067 942150 798176
22449 798176 843557 950000 968337 791875 1008800 719687 751778 701635 886626 891765 737869
22438 737869 1140316 1195666 720520 824954 1199829 663414 1211437 733921 1319154 1194563
22428 1194563 1146065 991915 1241361 1029174 815597 1044928 1044451 1131235 901918 794874
22418 794874 850395 1224880 1004371 805802 655233 773967 909773 675949 549640 1370450
22408 1370450 936605 862067 959927 1228982 1154352 1267323 852179 786888 796346 1049685
22398 1049685 932217 470979 1337109 980136 810395 769005 1018426 926642 756209 1067131
22388 1067131 790913 944573 601504 1031533 1051008 792303 902746 692833 710668 836041
22378 836041 769319 937305 1037068 549883 674809 823816 643867 911723 753216 944829
22368 944829 914984 860506 1084829 947043 907093 934411 773272 883995 1004671 731346
22358 731346 1208840 900694 815767 1097178 1008129 726481 1383724 868951 842294 1268397
22348 1268397 595270 844494 845700 1289318 730991 1100584 797559 756379 952069 1444339
22338 1444339 740742 999286 1495462 1163472 1295136 1380949 1785741 1927075 1855789 2686064
22328 2686064 2365868 2253030 2462966 2124852 1868218 2292160 1395279 1492117 1075094 1270616
22318 1270616 1025374 1322236 1641683 1370006 1390781 1074617 1532579 1134172 919656 1254200
22308 1254200 1269456 1261312 1482754 1216746 1039764 1252628 1253239 1155423 1601386 1569108 1488845
22297 1488845 1402941 1285645 1230449 1672477 1276254 1344622 1435884 1138746 1415079 1257988
22287 1257988 1301284 1297600 1370176 1239230 1083562 1178437 1289315 1432944 1027645 1001171
22277 1001171 1450506 1531613 1114209 1612459 1545660 1512778 1284301 1446644 1504381 613029
22266 1370727 1374160 1637404 1523644 973303 1535840 1477112 1795506 1332910 1264473 1689049
22256 1689049 1454196 1361566 1501894 1470001 1255581 1649597 1319013 1764879 1842857 1516227
22246 1516227 1247276 1708566 1320733 1631588 1648240 1573937 1579335 1331475 1900970 1266933
22236 1266933 1174248 1501895 1454760 1474370 919670 1857492 1686772 1422696 1387656 1540929
22226 1540929 1265302 1213096 1360090 921905 1257528 1268978 1118679 1809332 1857016 1607804
22216 1607804 1083116 1218315 1447119 1318206 1385499 1447083 1957706 1469433 972990 1328906
22206 1328906 1491938 1205163 1233537 1318446 1051238 1707015 1360078 1208366 1430846 1120853
22196 1120853 1124064 1245188 1511951 1269317 1299342 1180312 1067224 1182622 1287109 1723452
22186 1723452 1419807 1820849 1171837 1247130 1539090 1110683 1374774 1073847 1226436 1484941
22176 1484941 1063493 1927979 1780368 1098221 1288271 1654872 1281853 918208 1373492
22167 1373492 1167173 1183480 905210 1452608 1358262 1530618 1501092 1115022 1040626 1175943
22157 1175943 930485 983254 1425155 782106 1313125 1435441 1474162 1380666 1681102 1223185
22147 1223185 1196313 1436396 1144931 1323879 1457243 1159533 1271958 1259147 1296211 1390369
22137 1390369 1580228 1043874 961444 865124 1293352 1067821 1109508 1400173 1096629 1287812
22127 1287812 1308830 1417166 839799 1277159 1417262 1452267 1325136 1168496 872794 1267501
22117 1267501 1280646 1342392 1441111 1353716 1292746 1174150 1077319 1285182 1220312 1017040 1327076
22106 1327076 1362069 1596122 1036175 1136700 1671576 860689 911421 1441969 1213287 1242992
22096 1242992 1321867 1110499 1123983 1323556 1575201 1253721 1386803 1469267 1348451 1248160
22086 1248160 1331854 1621233 1716547 1413799 1291727 1611850 1250348 1608013 1350169 914333
22076 914333 1176399 1984229 1404913 1728515 1556890 850977 1469538 1834742 1713502 1619454
22066 1619454 1820830 1211530 1626927 1440651 1825138 1565770 1888798 1726892 1444619
22057 1444619 1351091 1559133 1515668 1521790 1858091 1858261 1556734 1477589 1523358 1470079 1870552
22046 1870552 1316722 1787657 1821553 1257540 1658202 1766794 1717220 2060447 1667198 1382127
22036 1382127 1624872 1277166 1436946 1744402 1645686 1372423 1591064 1470573 1875207 1318360
22026 1318360 1380568 1428546 1811724 1224967 1449138 1851307 1339111 1288534 1541597 1536275
22016 1536275 2146643 1365574 1847258 1680363 1571476 1644461 1186384 1798184 2105008 1551078
22006 1551078 1655843 1790710 1524538 1479419 1537603 1859917 1995067 1671202 1484606 2186375
21996 2186375 1226987 1434749 1806717 1574652 1604000 2021797 1638417 1377118 2002399 1706205
21986 1706205 1937222 1385518 2242552 1541931 1717952 1647948 1271875 1883479 1879423 1928242
21976 1928242 1791302 1984992 1616538 1471046 1889893 1535808 1815989 1686662 1564272
21967 1564272 1008712 1002141 1512488 1803545 1523308 1496126 1858759 1774309 1622515 1829034
21957 1829034 1635481 1817863 2073120 1711114 1558936 2042596 1361695 1871874 1589382
21948 1589382 1819605 1734474 1906462 1651553 1758905 1758802 1892486 1180528 1593934 1632474
21938 1632474 1891183 2049103 1538068 1610780 1432209 1515057 2095167 1557463 1408988 1752349
21928 1752349 1620152 1790329 1390592 1947666 1266010 1871636 1699264 1746891 1896761 1771333
21918 1771333 1270675 1731737 1912553 1732145 1865753 2080130 1672754 1714925 1390546 1725300
21908 1725300 1773266 1751162 1710308 1747780 1759921 2116246 1857982 1290824 1739498 1578663
21898 1578663 1619284 1682138 1795567 1694821 1508356 1842748 1560363 1457438 1783571 1326709
21888 1326709 1922654 1978890 1587256 1618169 1800994 1804588 1965981 1543913 1942407 1978642
21878 1978642 1676833 1376604 2102872 1804005 1854306 1806958 2111007 1793295 1617324 2005744
21868 2005744 1903522 1483748 1607238 2533733 2381660 1670595 1938716 1238301 1721710
21859 1721710 1867629 1709774 1405475 1568359 1373308 1795402 1600883 2112448 1850291
21850 1850291 1901581 1672479 1411141 1107983 1867504 1835917 1595613 1437316 1225361 1888033
21840 1888033 1677396 1841057 1667745 1854211 1463943 1607010 1644269 1877580 1527068 1882068
21830 1882068 1433025 1165678 1783019 1415240 1799806 1740386 1165385 1296752 1999108 2008481
21820 2008481 1433535 1187456 1384051 1457776 1638022 1162274 1304844 1224658 1237523 1817613
21810 1817613 1591798 1692568 1494955 1078505 1177762 1343646 1380020 1438845 1656945 1869622
21800 1869622 1391734 1145535 1458455 1384666 1166811 2143111 2032936 1375676 1465751 1652641
21790 1652641 1967471 1533794 1473910 1292837 1901167 1643823 1542729 1415684 1551681 1510803
21780 1510803 1846975 1433100 1515214 2066568 1549887 970190 1452003 1742159 1757314 1683530
21770 1683530 1972403 1786314 1817469 1664962 1766383 1673903 2047009 1988412 2096083 2055586
21760 2055586 2097459 2064217 2161524 2385451 2493252 2429311 2540101 2192125 2476902 2934275
21750 2934275 3057194 3135340 3576265 3533698 3351328 4347494 4671706 4606397 6015146 6834464
21740 6834464 8062515 8929397 9834105 10957241 11550618 11855492 12518764 13114229 12685138
21731 12685138 12873052 12344487 11666608 10481829 9810647 8634485 8332685 7907629 7445155
21722 7445155 7541749 7105495 7704707 7618697 8370100 8513538 10324328 10831236 12576783
21713 12576783 13134807 14117293 15143241 16235254 16896062 18020052 18087980 18936889 19059791
21704 19059791 18567894 18188508 17914048 16921286 15973514 14759127 14279901 12835402 12152151
21695 12152151 10410245 9899921 9078021 8190055 7941966 7231928 7062228 7411721 7523525
21686 7523525 7406396 8283599 8743376 9550412 10425658 10946880 11297257 11713113 11829049
21677 11829049 11884325 12108640 11829007 11213168 10283979 9047276 7695707 7070398 6156880
21668 6156880 5619019 5032046 4762831 3666961 3388742 3350227 3675298 3124381 3447416
21659 3447416 2774760 2461462 2239150 2792039 2242544 2457814 2334247 2311018 2231821 2181936
21649 2181936 2123978 1901460 1980835 2009274 2150628 2001314 1964558 1827308 2089211 1827311
21639 1827311 1262974 2222284 1667345 1719911 1625246 1804716 1577352 1945486 1493148 1483729
21629 1483729 1885594 2313297 1734424 1303071 1372258 1767013 2085345 1891769 1710146 1857935
21619 1857935 1652167 1025825 1515838 1619315 1515183 1605898 1792735 1752831 1429579 1558837
21609 1558837 1212534 1317016 1864766 1939576 1399393 2012714 1767152 1597982 1605499 1480836
21599 1480836 1332322 1409801 1911810 1631411 1513812 1331261 1567792 1801266 1746785 1477271
21589 1477271 1796673 1633367 2032701 1390135 1696275 1431844 1870890 1836702 1872010 1754427
21579 1754427 1864377 1498705 1603539 1624110 1642178 1493985 2062947 1921179 2193926 1556085
21569 1556085 1384915 1762822 2051131 1446413 1244242 1441953 1627062 1191925 1417163
21560 1417163 1495370 1788257 1662794 1405331 1086301 1468948 1346166 1069742 1609226 1716673
21550 1716673 1123154 1179659 2014106 1980619 1533300 1523486 1617474 1938682 1551589 1506003
21540 1506003 1596022 1770422 2003287 1621976 1863365 1575352 1643518 1776689 1731237 2065334
21530 2065334 1731952 1845871 1866272 1642682 2080564 2033555 1729768 1829102 1741975 1889500
21520 1889500 1934694 1840843 1554934 2252112 1990587 1785569 1592862 2151100 1824604 1848951
21510 1848951 1414252 2024489 1899808 1776897 1924093 1898802 1995760 2080268 1827715 1536297
21500 1536297 1878994 1445229 2199386 1857355 1903512 2084553 2063729 1869750 1944715 1817350
21490 1817350 1992757 1809782 2134959 1835047 2116992 1674983 2087873 2170722 1630220 2044711
21480 2044711 1732319 1739887 2167578 1802326 1594330 2276912 1781070 1831009 2292038 1994730
21470 1994730 1792075 2464546 2200662 1985720 1612735 2026144 2096802 1811316 1883755 1877796
21460 1877796 2158166 1582847 1861019 2459632 2161427 1715552 1991180 1866506 2008935
21451 2008935 2129857 2079343 2321222 2054931 1822600 2249261 1570211 2016487 1811439 1935039
21441 1935039 1933459 1775467 1801654 1934330 1861596 1707616 1797462 2410480 2156006 2015273
21431 2015273 2295342 2041161 2000222 1776309 1968590 1899223 1994161 1545267 2328252 2012354
21421 2012354 2207264 1761345 1200785 1953919 2296355 1745435 1605318 2092054 1844534
21412 1844534 1749204 2038000 1270482 2009499 2038472 1801584 1727294 1413102 1880185 2112773
21402 2112773 2223814 1839622 2036896 2280628 2395135 1882548 1809093 2284524 2272409 1616750
21392 1616750 1960317 1844414 2345624 1339562 1953149 2394151 2513816 2400548 2187435
21383 2187435 2103508 1999786 1715437 2185046 1813465 2182395 2309778 2059828 1792656 2341296
21373 2341296 1871737 2384779 1978687 1962823 2064986 1996522 2486293 2173922 2589154 2246787
21363 2246787 1940945 1811696 2160694 2176137 2047200 1944294 2340171 2335664 2551647 1960789
21353 1960789 2182310 2301041 2652340 2317491 2006222 2534671 2456031 1999668 2497110 2683274
21343 2683274 2906811 3056369 2135452 2513455 2683367 2668989 2662805 2829451 2565305 2951467
21333 2951467 2532510 2225365 2647268 3020394 2768601 2284115 2510102 2719492 2689144 3074732
21323 3074732 3255560 3309596 3230104 3582414 3223052 2847491 3261495 3350134 3807703 3371622
21313 3371622 3921590 3571881 4097593 4034331 3680660 4324342 4127574 3640584 4914458
21304 4914458 4587320 4867826 4762788 5472538 4965594 5091604 5305679 5774228 6077617
21295 6077617 6102536 6533787 6862515 7284122 7271505 8301614 8543759 8357743 9429948
21286 9429948 10678619 11092357 11287891 12027520 13175763 14158453 15295142 17000300 18389107
21277 18389107 19876407 21707414 24207500 27017489 29086245 32455195 35110033 37959031
21269 37959031 40884219 43245097 46066926 48027126 49385739 50274817 50567324 49559623
21261 49559623 48445662 46762952 44641735 41839137 39298958 36179027 33033328 30393595
21253 30393595 27768642 24989743 21909012 20880073 18356869 17135492 15649377 14562581
21245 14562581 12809165 12452367 11888691 10469937 9926236 9518963 8965273 8168035 7678398
21236 7678398 7804004 7221989 6564354 6541955 6295702 5937407 5916789 5318716 4823263 5533738
21226 5533738 4852978 4554572 4438677 4497510 4155171 3929263 3723897 3732396 3577959 3598495
21216 3598495 3397971 3393314 3574940 3393602 3505199 2923686 3529066 2901679 3305757 2791908
21206 2791908 3125059 2545596 3294997 2632689 2846548 2261434 2689545 2887640 2840643 2271295
21196 2271295 2719359 2808859 2566871 2056523 2383249 2804755 2894367 2580395 2543049 2620003
21186 2620003 2211123 2786192 2287244 2534080 2318272 2328724 2476938 1925785 2158409 2013933
21176 2013933 2540107 2634644 2756318 1720370 2400111 2359551 2394035 3132652 2213371 2732766
21166 2732766 2763471 2255229 2675976 2619389 2582315 2694831 2337323 2080893 2168954 2337559
21156 2337559 2849348 2597937 2288922 2515533 2403125 2620510 2210151 2188055 2093508 1991111
21146 1991111 2282451 2022487 2309649 2214731 2216339 1970487 2347013 2345753 1920593 2043838
21136 2043838 2339495 3066686 2009684 2538821 2524716 2702640 2558713 2665399 2102273
21127 2102273 2121157 1877354 1877919 1918119 2065439 1787339 1993577 1826213 2086253 2227325
21117 2227325 2204149 2240401 2215237 2061305 2228348 2444100 2328926 2345081 2111836 2323773
21107 2323773 2032502 2081622 2299692 2180026 2278887 2433041 2574061 2408942 2794163 2527662
21097 2527662 3111119 2590993 2973880 2495864 2898910 2826627 2825214 2486163 2555224 2784776
21087 2784776 2917231 2587651 2897414 2264376 2588750 2623352 2980894 2920064 2594948 2717326
21077 2717326 2905938 3255520 3442733 3220508 3549527 3577686 3635988 4344812 3807406 4405032
21067 4405032 3958834 3811114 3692888 4036091 3878578 3686243 3668871 3456547 3780507 3312878
21057 3312878 3134037 3252032 3065620 3139739 3024916 2846723 2676079 2689837 2728384 2588564
21047 2588564 2708067 2813277 2553871 2733904 3143018 2388404 3195453 2529129 2712354
21038 2712354 2612768 2815793 2209208 2742546 3137766 3134273 2950823 3110962 2990884 3360717
21028 3360717 3319909 3051740 3130882 3343415 3649243 3857976 3835576 4454286 5045041 5189167
21018 5189167 6318452 7844395 8338228 9307916 9405901 9942824 10683521 10603739 10650446 9654212
21008 9654212 9330938 8352846 7573472 7196693 6480560 6306566 5862940 5537991 5404871
20999 5404871 5300467 5216127 4817722 5127849 4868580 4858915 4885032 4908168 4795566 4961684
20989 4961684 5669458 5770532 6860235 7136514 8339275 9835369 10727412 10993310 12383767
20980 12383767 12704366 13081236 12609641 12801439 12082473 10963660 10066337 8817412 7813313
20971 7813313 6677537 6109957 5588673 5829034 4566774 4773633 5019790 4650260 4855021
20962 4855021 4710242 5078362 5153814 5478473 5812589 6120618 7232747 7854411 8640078
20953 8640078 9755557 10697885 11112650 11916682 12251179 12325369 12844998 13302018 13652106
20944 13652106 13104199 13550815 13021464 13514037 13481488 13538695 13870193 14229016 14024477 14151561
20934 14151561 13920009 14648517 15711581 17405763 20473937 23971158 27601580 31245842
20926 31245842 35043057 39084718 41826996 43570900 45390138 45290823 44109130 41959239
20918 41959239 38643245 34745437 31258456 28098133 24891119 22280910 19213009 17157094
20910 17157094 14793595 12449884 11315354 9672860 8181577 8137991 6870700 7035413
20902 7035413 6683348 5921317 5923356 5394479 5130088 5376080 4777065 5175200 4712797 4561016
20892 4561016 5116324 4588896 5167266 4943087 4825553 5098149 5262425 5550877 6269199
20883 6269199 6808581 7252341 8480640 9562320 10495814 10963921 11696697 12049002 12686328
20874 12686328 12705585 13051638 12385384 13197872 13587317 14536187 16035019 18379886 21766817
20865 21766817 25294348 29657387 33289688 37219222 39822580 41798879 42051098 41221485
20857 41221485 39717152 36911872 33091847 28110819 23779682 19744206 16153592 13564726
20849 13564726 11238447 9966864 9065106 7995730 7187738 6623508 6285817 6184611 5487810
20840 5487810 5197697 5209476 4834254 4385185 4592944 4112070 4314481 3916545 3852334 3994439
20830 3994439 4166495 3550078 3329204 3151846 3549866 3372409 3663535 3177018 3364376
20821 3364376 3070785 3172880 3763323 3173013 3569309 3555471 3635199 3509817 3258619 3676083
20811 3676083 3486317 3392695 3550149 3109557 3681589 3427611 3910470 3428028 3308636 3691047
20801 3691047 3627968 3279266 3699466 3105898 3383858 3454532 3849635 4001872 3234275 3265145
20791 3265145 3915743 4106849 3355905 3473307 3670940 3200167 3677206 3470875 3455376 2808264
20781 2808264 3304430 3560458 2828492 3414149 3085243 2596764 3144125 2784779 3176188
20772 3176188 3001289 2906847 2954521 3413448 3209843 2716594 3365680 3205768 3491363 3201723
20762 3201723 3333270 2878543 3012363 3453569 3452246 3451784 3167382 3094419 3177448 3033206 2418347
20751 2418347 2994581 3275969 3008309 2820342 2836044 2614023 2572998 3086216 3070584 2593146
20741 2593146 2953110 2948015 2790557 2710130 2266977 2553999 2207799 2888829 2534976 3328138
20731 3328138 3031197 2468535 2605646 2744026 2581140 3021890 3222226 2938729 2648983
20722 2648983 2682166 2926696 2562736 2822018 2881718 3237165 2820931 2835545 2826653 2663034
20712 2663034 2809612 3080201 2957854 3107286 3535577 3055775 3184263 3180731 3068326 3472359
20702 3472359 3159599 3473967 3417771 3625310 3694345 3449543 3366586 3421450 3241642 3336100
20692 3336100 2951655 3491933 3405765 3283762 3217312 3390921 3604221 3783887 3296816 2817533
20682 2817533 3027940 3367544 3897058 3715075 3879223 4089689 3758157 3972086 4386110
20673 4386110 4351586 4195713 4328171 4276983 4304072 4578558 4419475 4431474 4124024 4475259
20663 4475259 3796949 4011843 3824897 3963750 3513353 3387614 3523506 2971397 2977196 3728157
20653 3728157 3195577 3379633 3493060 4050284 3577484 3861137 3670930 4298460 4318781 4180113
20643 4180113 4811343 4701994 4750678 4584192 4603192 4417162 4188329 3980898 3719518 3581281
20633 3581281 3612766 3789932 3220881 3231875 3453902 3665513 3047155 2985407 3104722 3123027
20623 3123027 2856490 3037766 3307829 3325432 3332340 3092754 3432660 2901318 3094798 3694898
20613 3694898 3662240 3824384 3924360 3837910 3549660 3996065 3766155 4155130 3152982 3630679
20603 3630679 3618831 3354997 3204282 3360470 3347398 3226670 2842057 3172186 3498550 2977929
20593 2977929 3354938 2617077 2984969 3085772 3300207 2885391 3416507 3123076 2952265
20584 2952265 3449592 3241137 3588017 3588759 3581468 3081331 2970126 3548055 3000279 3191123
20574 3191123 2606784 2753256 2849125 2521254 2926935 3137343 3151652 3070454 2696605 3204861
20564 3204861 3286048 2696476 3008393 3140509 2981653 2839494 3389756 3345425 3450698 3355837
20554 3355837 3275182 3284036 3463144 3409998 3642963 3507328 3620683 3631867 3642057 3426491
20544 3426491 3258529 3336360 3196919 2964645 3481680 3425090 3107140 3082181 3879696 3788764
20534 3788764 3422379 3880960 3928899 4236317 4879949 4570082 4753533 4984827 5146946 4739076
20524 4739076 4561688 3888571 4506768 3951567 4306805 3792490 3914623 3864758 3613884 3417560
20514 3417560 3196714 3109587 3252140 3029735 2870983 3439234 3045987 3426182 3411616 3580036
20504 3580036 3338780 3814983 3391141 3747306 4128144 3859717 4087604 3986153 4368695
20495 4368695 4322308 3835782 4197691 4158849 3748477 3594389 3654767 3883099 3598124 3499968
20485 3499968 2855914 2853535 2516676 2661796 2836994 3258769 3050601 3246301 3277185 3182754
20475 3182754 3106096 3569603 3543435 3399957 3853335 3601813 3439919 3828007 3891631 3689680
20465 3689680 4018241 4399750 4295232 3899403 3706947 4209931 4196766 4094369 3495260 3752133
20455 3752133 3420778 3570540 3955385 4363503 3623480 3946605 3745400 3842836 3633181 3959786
20445 3959786 3830257 4339263 3581936 3975542 3673997 3615351 3484145 3251163 3714419 3589841
20435 3589841 3856981 3548358 3548448 3126724 3192220 3014912 3218451 3166806 3639346 3487528
20425 3487528 3379675 3247760 2989984 3423524 3341959 3130979 3138605 3410455 3371337 3690157
20415 3690157 3672692 4098981 3300425 3886682 3781340 4021884 4078034 3877470 3402132 3565184
20405 3565184 3480472 3704692 3576415 3784528 3424265 3769688 3417929 3296804 3471876 3453591
20395 3453591 3091362 3568696 3588402 3270811 3879651 3647724 3405978 3809776 4078692 3594313
20385 3594313 4414703 3820163 3514037 3848100 3858598 4001835 3766160 3730356 4229483 3700651
20375 3700651 3609874 3474640 3584346 3703388 3993305 3618765 3460564 3606824 3731700 3299038
20365 3299038 3200680 2975941 2513986 3382001 3032396 3209791 3547323 3266647 3432923 3792703
20355 3792703 3350106 3300477 3961342 3449286 3669156 3617367 3864940 3578938 3425271 4092480
20345 4092480 3940148 4088237 4352875 3945050 3703794 3347354 4085091 3381142 4189079
20336 4189079 3960187 3795410 3630627 3691810 3570174 3164866 3565699 3681950 3562277 3526721
20326 3526721 3584279 3585202 3686143 4205890 3735411 4058111 4159802 3922800 3672136 3579408
20316 3579408 3539988 4124971 3557500 4349613 3793436 4549555 4055554 4718701 4637170 4679765
20306 4679765 5037184 5446014 5493967 5911170 6104835 6056871 6341778 6281791 6276525 6379182
20296 6379182 5982715 6306602 6150431 6368791 5986316 6165003 6089199 6121734 5577373 6169663
20286 6169663 6100971 5653799 5821455 5624229 5190684 5386841 5400438 5318041 4782682 5180438
20276 5180438 4971926 5167026 4768300 4864042 5516348 5218140 5087263 5456044 5555855 5178923
20266 5178923 5202754 5254646 5511524 5568063 5571203 5673708 5473524 5719419 5675486 6048264
20256 6048264 6378099 6551161 6413859 6830584 7538492 8969810 9105629 10367556 11563887
20247 11563887 13210508 14399331 15448654 16246190 17527733 17906912 19185581 19506158
20239 19506158 19501605 18965176 18652532 18302398 17347145 16123645 15504975 14540016 12968169
20230 12968169 11586351 10225701 9173577 8408845 7826191 7086504 7020919 6619065 6260841
20221 6260841 6328568 5890577 5464846 5939382 6291328 5173841 5600093 5962895 5924909 5189512
20211 5189512 5181684 5047680 5226466 5119025 5107937 5164255 5488725 5584244 5184093 4989030
20201 4989030 5166898 5223991 5085123 5366209 5370172 5659810 5606886 6193076 6621967 6855714
20191 6855714 7621754 8095178 9459213 10393791 11799451 13032746 14511107 16247340 17822421
20182 17822421 19000125 20551329 21275228 22668004 23166146 23174411 23666672 22671660 22657529
20173 22657529 22020350 21386421 20087508 18820275 17182566 15639281 13603785 12420217
20165 12420217 10513285 10193903 9231229 8888681 9051667 9175806 9173087 9260418 10148935 9502901
20155 9502901 10033102 10819003 11415680 11745333 13205061 13782851 15521754 16929683 18974169
20146 18974169 21256957 23779567 26793091 30194097 33678402 37930382 41443018 45177901
20138 45177901 48577836 52162091 54834205 57559628 59491949 60212943 60742704 60444550
20130 60444550 59793729 57985637 55854327 53035111 49195065 45472483 41248389 36952700
20122 36952700 32871592 28684282 25971766 22741322 20473253 18306642 16972181 15169890
20114 15169890 14052139 13246661 12526108 12091973 11756470 11958113 11554576 11771682 11969841
20105 11969841 12188205 12307344 13234937 13807525 14125528 15614285 15964316 16865354 17396610
20096 17396610 18702409 19114025 19691249 19978435 19661145 20709895 19829417 19215608 18642268
20087 18642268 18408982 17243474 16423157 15586817 14287756 13824973 13181696 12326229 11595134
20078 11595134 10964541 9600369 9784698 9455381 8822179 8708489 8411720 8695528 9348018
20069 9348018 9365302 9252450 10015169 10684675 11811627 12392918 13764901 14414897 16123944
20060 16123944 17261929 18659126 19252843 20859313 23178095 24499815 25509790 27286426
20052 27286426 28944614 30741225 31691149 32891146 33522737 33765071 34683745 33563409 32739968
20043 32739968 32079025 30931139 29392602 27862941 26578851 24893987 23739741 21783463
20035 21783463 20567156 18307679 16770183 15686222 14960881 14234448 13493375 13157606 13589939
20026 13589939 13878779 14418728 15538155 16721214 18293209 20245037 22482024 24928135
20018 24928135 27104300 29108434 30932690 33140145 34262415 35114412 35725701 35549047
20010 35549047 34996802 34286383 33195257 30992764 29478888 27728750 25603770 22659798
20002 22659798 20819147 17815749 16153584 13898447 12078883 10486257 9911378 8936536
19994 8936536 8187904 7440558 7423334 6710327 6394052 6276581 5938695 6426687 5827808 5555276
19984 5555276 5217502 5542790 5342170 4912206 5020238 4875084 4727193 4916827 4501950
19975 4501950 4958003 4676852 4691276 4878403 4380237 4912937 5016122 4754837 4392373 4535036
19965 4535036 4398583 4253576 4733845 4670224 4198875 4639363 4833179 4516508 4712417 4456304
19955 4456304 4891166 4260815 4178324 4330222 4340226 5078423 4779867 4459943 4015730 4715614
19945 4715614 4178286 4521282 4976381 4684759 4356970 5133992 4821828 4313812 4462520
19936 4462520 4984141 5212636 5205824 5337499 5425193 5357844 5530759 5096382 5153955 4764980
19926 4764980 5110494 4875465 4923808 4892834 4839023 4622125 5083582 4607747 4622467 4502453
19916 4502453 4566947 4185547 4077289 4485699 4281169 4257754 4356861 4089287 4280693 4941165
19906 4941165 4086880 4786979 4738025 4896717 4717169 4608444 5001297 5040750 5376619 5532835
19896 5532835 4918319 5274645 5135887 5335952 5047316 5269574 5115543 5197401 5134505 5046505
19886 5046505 5214599 5054663 5482472 5330108 5212453 5450648 5334821 5456351 5421431 5452769
19876 5452769 5772983 6558551 5690844 6207075 6107664 5980485 6418201 6909301 6878341 6726804
19866 6726804 6532841 6747673 6818320 6804508 6832614 6649135 6843868 6750538 7097757 6693042
19856 6693042 7268811 7086643 7069422 7257057 7288932 7341525 7329887 7397164 7375600 7802621
19846 7802621 8056991 7777343 8269933 8361371 8448911 8086679 8524039 8753658 9388360 9735019
19836 9735019 10181780 10910348 11069828 12306121 13154654 14099629 15761400 17214512 19123288
19827 19123288 20789656 21810385 23816643 25136542 26436932 26923626 27648373 28499041
19819 28499041 29288714 30406475 31730529 33220794 34935646 37156956 40015107 42357798
19811 42357798 44552353 46742975 48288835 49466081 49185384 48703493 47545925 44820331
19803 44820331 43364450 40160380 37704467 35413840 33584150 32348485 30738144 30111255
19795 30111255 28782288 28611439 28092802 28494113 28811062 28061582 28171050 27984865 27970577
19786 27970577 28132774 28258582 29064591 30126075 31267972 32362136 34108240 35738727
19778 35738727 37775453 38643511 39119335 39594495 39390724 38713906 37275891 34430677 32530834
19769 32530834 29714982 27603778 25228424 23212565 20902600 18684142 16908457 15715089
19761 15715089 14051847 13467176 11835081 11215995 10549541 10124813 9642618 9366497 9048435
19752 9048435 8570398 8669126 8402215 7598066 7438628 7910918 7311677 7442039 7051738 6944988
19742 6944988 6821915 6736005 6856357 6683587 6606742 6125830 6062121 6542751 6362072 6297650
19732 6297650 6288208 6450829 5928929 6111601 5862448 6341248 5796221 6197526 5816234 6438901
19722 6438901 5651830 5790214 6200411 5597163 6054871 6013018 6691538 6151538 5924581 5708459
19712 5708459 5861553 5499177 5853709 6135890 5814699 5953530 5604321 5550219 5531780 5112671
19702 5112671 5550895 5301966 5208947 5735713 5586943 5513348 5658637 5545954 5475084 5009988
19692 5009988 5241844 5365125 5295041 4991003 5652738 5396244 5687852 5405416 5318576 5471967
19682 5471967 5088927 5250568 5273129 5384577 4907024 4960068 4989718 4719584 4679186 5072038
19672 5072038 4939359 4974465 4480192 4925833 5069647 4692736 5077014 4945117 4787973 5008622
19662 5008622 4507112 4886319 4165782 4985373 4426019 4863452 4653583 4305904 4603033
19653 4603033 4739323 4599846 4406761 4251608 4691783 4734618 4187009 4411865 4530760 4523960
19643 4523960 4624881 4671104 4428091 4424256 4427026 4466289 4473983 4302695 4689562 4564906 4162088
19632 4162088 4964807 4691542 4533927 4238610 4140496 4479213 4871395 4495618 4352163 4262369
19622 4262369 4484202 4558141 4291135 4218900 4026257 3504318 4214824 4115574 4039745 4275880
19612 4275880 3812448 3940218 4033205 4215204 3882621 3428073 3535496 3687863 3793825 4004033
19602 4004033 3988685 4102423 3863476 3957368 3809642 3883328 3737968 3696991 3762388 3812650
19592 3812650 4127862 3472154 4007467 4217638 3648546 3637721 3796436 3896605 3745996 4184571
19582 4184571 4076936 3812835 3594017 3928547 3810468 3862415 3767812 4028995 3610582 3985670
19572 3985670 4206328 3422701 4124514 4030052 4334780 4443101 3674422 3897217 3490290 3959323
19562 3959323 4123938 4133854 3991061 4109655 4303478 4224282 3625786 4045706 3850174 4241283
19552 4241283 3534164 4230020 4303602 3910984 3701146 3250958 3616569 4041931 3839071 3859225
19542 3859225 3703294 3353725 3461715 3648820 3700778 3273354 3362363 3323973 3316451 3417509
19532 3417509 3661573 3437713 2971647 3305788 3406344 3321346 3595245 3545473 3055519 3696588
19522 3696588 3271261 2829002 3503163 3472566 3290772 3596719 3271246 3328205 3329320 3787320
19512 3787320 3378485 3718076 3925586 3349979 3428135 3649897 3328482 3502404 3524072 3369161
19502 3369161 3409346 3350913 3998905 3329334 3173698 2873435 3668256 3105128 3311416 3102107
19492 3102107 3485184 3371424 3142117 3227168 3298699 3674558 3447141 3705307 3538476 3096171
19482 3096171 3217894 3593201 3135379 3030021 3286728 2882832 2830910 2966965 2923160 3085455
19472 3085455 3028502 2892451 2914549 2673752 3297758 2807976 2949380 2271577 2983792 2144664
19462 2144664 2403972 2718444 2863517 2843072 2911536 2867259 2729640 2372082 2721023 2545168
19452 2545168 2366151 2899548 2697744 2670314 2892294 3156553 2556599 2684352 2809473 2556631
19442 2556631 2931964 2266791 2314613 2027309 2848297 2242669 2655384 2343386 2138044 2195181
19432 2195181 2116031 1995668 2071100 1779032 2274992 2169892 2274386 2117982 2204349 1887982
19422 1887982 1843825 2278553 2309844 2176857 2284327 2390666 2260604 2059132 2085288 2236290
19412 2236290 2165940 2172468 2089234 2201717 1970585 2447174 2360611 2221590 2070601 2516118
19402 2516118 2235767 2168300 2104212 2500996 2189414 2498640 2295275 2110597 2276980 2056187
19392 2056187 2033955 1901084 1814633 2130518 2076313 2057901 1983422 2434363 2141098 2135458 2322376
19381 2322376 2509072 2363130 1891980 2246663 2232790 1597389 1525980 1968755 1869396 1919628
19371 1919628 2342774 2295606 1964811 1829295 2196723 2348629 2016949 1843547 2173018 1863022
19361 1863022 2379682 1948752 1662141 2333154 1610613 1540583 2217842 1948819 2221628 2192782
19351 2192782 2154011 2037811 2140241 1807525 1967073 2133556 2226696 2119229 2373389 1930243
19341 1930243 1917946 1526783 1878558 2052534 1869057 2419329 2231263 2046889 2400131 1432818
19331 1432818 1791871 1769628 2360851 2290514 2124454 1857509 2136395 1785157 1741546 1825182
19321 1825182 2072575 1905662 1703899 1942404 1641201 1992227 1785324 1400140 2101424
19312 2101424 1869100 2230405 2255204 1943108 1506294 1660281 1944116 1628870 2006146 2061704
19302 2061704 2221311 2091586 2189923 1996561 1934691 1964946 2678065 2158533 1813080 2218983
19292 2218983 2342567 1496611 2028277 1709402 2270111 2143457 2027662 1862912 1815481 2102870
19282 2102870 1751717 1891816 2089667 1965756 2116717 1783709 1266650 1415186 2051477
19273 2051477 1948698 1913637 2034319 1953293 1925987 1862804 1887583 1726603 2194396 2363962
19263 2363962 1774766 2089274 1849551 1760567 2187024 1642677 1871734 1980381 1748260 1638243
19253 1638243 1651212 1479146 1715576 1754602 1836575 1206860 1382867 1699874 1782756 1873660
19243 1873660 2633815 3014166 2718008 3161453 3643817 2896766 3503844 3408983 3447313 2652989
19233 2652989 2572533 1869735 1726825 2083974 1908370 1756086 1270155 2102851 1728991 1749118
19223 1749118 1928977 1359271 1783396 1556663 1106519 1440998 2023642 1409035 1666438
19214 1666438 1903342 1629108 1379354 1511146 1823385 1839070 1624309 1534102 1482928 1818705
19204 1818705 2136776 1735600 1424049 1807072 1519470 1054955 1285297 1156237 1486393
19195 1486393 1630782 1746665 898728 1314739 1751539 2041699 1185251 1446075 1457942 1733685
19185 1733685 1504898 1638034 1328749 1428240 1539891 1723461 1267916 1379191 1681515 979110
19175 979110 2114373 1825081 1337720 1646642 1780582 1527318 2103088 1651787 1598408 1538784
19165 1538784 1872601 1711825 1552848 2191858 1521172 1605650 1758634 1864770 1632073 2062215
19155 2062215 1598930 1752389 1631489 1868610 1623180 2039066 1657085 1808536 1604785
19146 1604785 1984627 1646311 1806641 1377753 2026864 2492660 2659550 2606040 2685578 2975858
19136 2975858 3221578 3135764 3244044 3793608 3539753 3313349 3124635 3651763 2951330 3235864
19126 3235864 3043421 3090839 3050036 2743705 2548315 3148107 3057332 2571879 2602027 2603995
19116 2603995 2643020 2139277 2540264 2337187 2123043 2051411 2396070 2029177 2017854 2509353
19106 2509353 2455249 1973072 2551600 2293261 2223477 2577554 2720337 1976130 2669751 2817113
19096 2817113 2386079 2399839 2940286 2801539 2368062 2793034 2705319 2889594 2233450 2467939
19086 2467939 2531160 2480196 2773999 2884605 2945480 2747761 3117275 2893396 2969966 4171217
19076 4171217 3722911 4232089 4450844 5091302 5386580 6351525 7902442 8185420 9370389
19067 9370389 9965568 10673635 11155557 11224678 11025520 10874040 10200742 8923986 8018116
19058 8018116 6421348 5402086 5395162 4609328 4359073 4325631 4502972 4971249 5209055 5889984
19048 5889984 7341324 7741415 8374532 8659792 9038827 8944104 9185502 8751836 8111495
19039 8111495 7073446 6714803 5522208 5177505 4733277 4449186 4513069 4913702 4632160
19030 4632160 4969087 5304192 6177749 6978274 8175131 8888030 10129489 11345120 11797320
19021 11797320 12668621 13073124 13228312 12820716 12229668 10893623 10129782 8149263 6952803
19012 6952803 6326241 6154249 5845215 5785815 5797216 6142706 7053543 8240074 8654971 9163160
19002 9163160 9938044 10325270 9985096 9748726 9346798 8990545 7627468 6570104 5896219
18993 5896219 4745219 4615256 4532341 4574027 4666308 4733896 4642579 5790065 6828628 7762794
18983 7762794 8309929 8855538 9542139 9787000 9760543 9638883 9316525 8421330 7818095 7023958
18973 7023958 6230412 5914325 6202342 5951010 5921529 6667587 6825470 7606593 8325745 9263419
18963 9263419 10784980 12772104 15262392 17105887 19367644 22508384 25654953 29206413
18955 29206413 32635270 36767054 40088611 42106342 43651034 44195444 44285544 43091770
18947 43091770 40795880 37609448 33264698 28826581 24494210 19592979 16237744 13176782
18939 13176782 11636201 10142774 8467999 7865689 6322160 6594017 5938540 5157796 5023283
18930 5023283 4729351 4651917 4069395 3800356 4415555 3666887 3688312 3574272 3882602 3598009
18920 3598009 3791839 3498044 3787601 3756215 4151509 3584459 3596311 4043692 4170019 3842454
18910 3842454 3783384 3773713 4291113 3981319 3784954 4608399 4832102 4985542 5875436 5992320
18900 5992320 6712413 6968603 7793655 8680316 10263557 11862245 13785907 16318180 19676978
18891 19676978 23733867 27370717 30576460 33935842 36170903 37315034 37884085 37120131
18883 37120131 34769659 32063560 27945779 24107685 19273274 15693337 12996450 11084198
18875 11084198 9164876 8038744 6471742 5973430 5378470 4864432 4433580 3672474 3443371
18866 3443371 3521429 3810844 3062144 2815763 3234590 2706498 2449146 2333169 2307111 1727619
18856 1727619 2109530 2073748 2478276 2263415 1873510 2330800 1777320 1567217 1951940 2122281
18846 2122281 1663728 1472061 1849078 1947182 1565383 1598818 1491317 1945753 1984252 1695753
18836 1695753 1839654 1932614 1918244 1589872 2050382 1643340 1938737 1795731 1345747 1468330
18826 1468330 1517766 1286844 1507842 1416246 1741992 1854059 2067289 1967871 1971477 1824652
18816 1824652 1086589 1444067 1604308 1802899 2011844 1442274 1321023 1456823 1633796
18807 1633796 1475543 1531070 1378129 1465125 1512090 1453930 1475421 1458187 1534711 1584329 1298921
18796 1298921 2083904 1574478 1532284 1853552 1799863 1838826 1697385 1955915 1470107 1498320
18786 1498320 1961532 1492743 1628663 1299747 1392696 1962756 2101174 1844417 1263994 1650016
18776 1650016 1840400 1821949 1882005 1866613 1683099 1511638 1734090 1888955 2186804 1626257
18766 1626257 1903075 1348807 1873289 1542399 1849234 1392618 1601448 1720690 1634772 1535750
18756 1535750 1948045 1690067 1305712 1289005 1404835 1822247 1511537 1352411 1304757 1377919
18746 1377919 1049903 1436686 1235300 1468297 1687123 848080 1521246 1509637 1714968 1198235
18736 1198235 1637558 1531416 1290955 1212176 1273318 1291876 1429579 1403962 1485553 1241870
18726 1241870 1390450 1631899 1144359 1465650 1598384 1658677 1746903 1453001 1530660 1800789
18716 1800789 1439959 1299610 1857836 1166500 1466097 1319219 1842246 1725554 1431079
18707 1431079 1555013 1809440 2124366 1454734 1691332 1888206 1539597 1703715 1640642 1649703
18697 1649703 2119394 1583759 1608243 1267841 1632000 1324534 1773792 1599563 1654284 1545489
18687 1545489 1778486 1331896 1182007 1052434 1361988 1069251 1493769 1545382 1161711 1556651
18677 1556651 1306967 1444591 1094492 1286997 1207916 1305801 1382402 1063561 1317626 1078239
18667 1078239 1265445 1446664 1111306 956513 1039790 1156365 1079037 1193613 1567626 1247939
18657 1247939 1046983 1141400 809763 1252737 1379633 1061655 1591924 1617927 726774 901214
18647 901214 1543592 1036145 810146 1410135 1257883 1122046 1354847 1244829 1307009 1556962
18637 1556962 1423454 985685 1569228 1608797 1244555 1616688 1434521 1191532 1447702 1458133
18627 1458133 1076474 1707575 1534582 1403826 1252535 1118876 1719238 918645 1415208
18618 1415208 1225361 1364531 952234 1959384 1555123 1355259 1366399 1230156 1693001
18609 1693001 1503957 1637413 1357649 977439 1299462 1315263 1634387 1628551 2031024 1676063
18599 1676063 1810329 1448691 1937917 1698178 1521704 1896437 1836236 1502972 1494525 1266952
18589 1266952 1056892 1479595 1454942 1230822 1297900 1844779 1368265 1313497 1409971 1321512
18579 1321512 1348120 1413521 1532530 1811539 1710163 1354159 1650817 1674609 1330233 1658812
18569 1658812 1170604 1555941 1620975 1667142 1476533 1179524 1492657 1577240 1482271 1701051
18559 1701051 1518492 2045197 1607724 1536866 1782270 1312590 926170 1316228 1145987 1409899
18549 1409899 1378006 1231609 866418 1006508 1857924 1129868 1242835 1612175 1290544 1033017
18539 1033017 1363361 917565 1094116 1294328 1095147 1036031 1547178 749377 1210783 1126400
18529 1126400 1065147 1178139 896701 1140975 1190828 898117 1148417 997032 1350877 1458734
18519 1458734 1091611 1513272 1272534 1421235 842000 790219 1361096 1115669 1864466 1120317
18509 1120317 1178496 1408759 1485633 1163258 1206145 1302086 1005178 966054 1487909 1103837
18499 1103837 1070868 1129543 1228178 1401598 1161251 1175557 1662101 931670 1509950 996291
18489 996291 1307780 1240904 1166764 1337841 1251070 1311954 1008902 1203857 1076651 1264712
18479 1264712 1141507 870235 1606393 1005701 1235069 1234955 994130 741315 580516 1005395
18469 1005395 1259223 936024 1268792 1152113 1051470 1045318 1550462 865762 1398098 1385117
18459 1385117 1364975 1426731 1206353 864823 1242810 1584345 1193954 1708161 1079377 1575820
18449 1575820 1023228 1457889 946546 1181224 1362522 1330561 1046046 1133741 1436107 1565937
18439 1565937 1278632 1029570 1297431 1055354 1487604 1131431 1449006 1174216 1599872
18430 1599872 1441455 1848218 1267224 1876073 1823332 1495742 1619991 1490422 1526104 1561698
18420 1561698 1332993 1112831 1006859 1364912 1544121 1395193 1192198 1433019 1173499
18411 1173499 1293161 1010012 1082868 1105629 976370 1066938 1427001 1225159 1080647 1508043
18401 1508043 1339362 1496607 949218 1323959 1378762 876566 1507802 1164279 1407848 1361371
18391 1361371 997232 1095933 1125477 936061 816393 1074192 1044675 813964 1153910 818304
18381 818304 467985 1048533 1137198 645912 1149673 1038459 982491 1154944 813004 888654
18371 888654 918366 1136035 1151735 1292408 1092266 1085703 1154908 549703 1231077 1152856 918295
18360 918295 1300146 1035642 881751 992088 943526 1363798 986907 1376017 1045339 1217251
18350 1217251 812698 1106180 1467840 991121 969059 632405 1128105 1189146 1675577 1235398
18340 1235398 841182 1223209 1164799 1455569 1403005 835624 1070738 1172463 1187662 1166528
18330 1166528 777255 748952 663541 1298476 1094743 1169395 1376096 1319285 1220184 1099115
18320 1099115 784701 1146929 849429 1074793 1304237 1009607 1131663 1556022 1517002 1051042
18310 1051042 765439 1028701 871113 1264178 1154357 927505 970962 958318 1445236 1033581
18300 1033581 1317951 1378287 1219138 1262473 1006239 1033371 1275996 766755 1350469 1375403
18290 1375403 1758832 1463246 1140174 1270681 1132977 1310707 1461147 1292277 905740
18281 905740 1075498 1180191 1077822 789745 825475 903830 993972 1345542 1179677 1289536
18271 1289536 926597 1221098 1323033 956313 1234946 666675 1070671 1321467 1259528 1199036
18261 1199036 1145902 1110820 994814 860240 1457754 1209711 1121508 954171 1038004 1020814
18251 1020814 757541 1541615 1221963 1420387 1106450 1582478 1109621 1009812 1430110 1193048
18241 1193048 1751700 1338794 862122 1491648 1096018 1425953 1127819 999835 1723022
18232 1723022 746246 1521775 1057930 1115036 950530 1153973 728872 518967 1027689 957883
18222 957883 1124157 702951 1002289 1565988 966761 1195988 1143830 1158525 863172 1099400
18212 1099400 1230390 1165748 1234569 1288021 1254984 1379239 674878 853306 994674 1224584
18202 1224584 882892 940413 1262936 1298692 1519999 1271887 872792 1123527 1163239 1252959
18192 1252959 1003256 1145316 1116707 1118419 1453376 1235156 1739988 749496 931632 1412156
18182 1412156 1277438 910623 1018991 1117459 1206990 1004338 719199 868222 1103148 1088719
18172 1088719 914839 1712519 1352476 1272745 773154 1145206 565878 994870 1358093 1226404
18162 1226404 957286 1144803 1084769 926283 1105529 884718 1080653 1126988 1146186 1103634
18152 1103634 1056062 1275489 837680 1194119 1221052 1351175 1154993 1035998 954658 640971
18142 640971 1463929 1421623 997029 895946 939335 1038003 1324519 857131 1300804 863558
18132 863558 1347933 586242 1515802 1077726 1007894 1119350 645983 921901 1133599 1265346
18122 1265346 1080725 1052322 646796 467148 1219237 1442521 958190 830455 986116 1456330
18112 1456330 913162 964761 1308534 776981 768001 1079661 1260700 1064104 1229976 895273
18102 895273 716208 1584223 932390 1274210 1438215 1062951 978548 1202683 871874 1226128
18092 1226128 1350404 1163650 561151 1335245 745790 1102720 1206092 944204 969167 703445
18082 703445 959467 1022735 645601 687677 942782 1156311 645734 697387 1095478 853042
18072 853042 1228405 706473 836947 1144025 1257767 1112825 1215860 877056 1215797 1140629
18062 1140629 1062342 813834 935353 940883 1112610 789548 1331309 769287 1402116 822261
18052 822261 973450 1540597 1349405 897769 887355 1096251 942696 727574 774650 873487
18042 873487 1150261 1125933 1229960 1041238 459054 846239 1496181 1248389 1059388 1152369
18032 1152369 835498 884261 1155645 1306223 690621 1072109 1051394 619410 1601225 964394
18022 964394 1151501 999118 1136007 1143831 956822 771546 1024847 982746 742200 225474
18011 1173505 937197 962997 987567 845177 1344845 1233871 1112655 1364765 974092 1241174
18001 1241174 1246841 1069860 1096321 642814 1536404 1007355 1087299 1113597 958962 1082988
17991 1082988 1143008 1227490 718087 963162 856922 1041953 1087964 1083609 1249850 1171226
17981 1171226 925653 1410794 1076256 1283482 644525 918221 1045805 916250 1409324
17972 1409324 1313487 1190001 1215069 940687 1045942 1065943 708692 721204 940329 1063457
17962 1063457 993764 809092 1329272 612390 1706274 1178463 879497 1155961 1193093 1614846
17952 1614846 1057645 942259 1360154 1035601 1303435 1102258 965689 1194295 1213062 1145912
17942 1145912 825800 1423706 1560484 1281146 1262151 1136427 1196089 1193466 1257535 1079949
17932 1079949 1383550 1143462 1264550 1207116 1188359 946738 744296 1477621 1307656 1427877
17922 1427877 1146866 1383824 1741459 1093530 1210684 1308729 1174110 1414294 1691265 1373861
17912 1373861 1279685 1101564 1186153 1349386 1753223 1664413 1289295 1356948 1084942 1804102
17902 1804102 1523463 1688791 1999934 1433577 1485227 1391830 1567612 1368725 1535690 1486580
17892 1486580 1460734 1477708 1759604 1738443 1550651 1518112 1430645 1472620 1607534 1629757 1671852
17881 1671852 1440358 1354231 1941269 1657511 1731662 1612373 1855253 1807969 1692705 1449776
17871 1449776 1955627 1761877 1731643 1576077 1944691 1132014 1171553 1448590 1465059 1777313
17861 1777313 1270573 1283110 1974937 1422554 1722126 1101377 1995657 1314607 1543940 961606
17851 961606 1508810 1145433 1359934 1298217 1347227 1059835 1387701 1091105 1747984 1078183
17841 1078183 1181017 1431843 1188839 1355213 1714895 1543663 1249322 1794007 1136734
17832 1136734 1688927 1227352 1129865 1626881 1471504 1483313 1507971 941740 1445423 1625884
17822 1625884 1747205 1187005 1432987 1514732 2210561 2161643 1854296 1626027 1674683 2146062
17812 2146062 1580310 1679983 1873046 1790663 1716447 1719542 1798356 1702147 1630411 1502816 808226
17801 808226 1620121 2059776 1659541 1698808 1757522 1691806 1612492 1739537 1681133 1741109 1351912
17790 1351912 1372070 1216089 1139525 1270472 1209473 1024084 1071990 1117866 1434700 1611582
17780 1611582 1113462 1005625 1142802 1200998 1238606 1577772 1517670 1570776 1406181 1892369
17770 1892369 1031558 1198406 1562433 1120576 1551233 1284922 996608 1557303 1203663
17761 1203663 1303198 1336202 1614827 1440835 1322295 1110448 1628076 1209978 1687164 1540868
17751 1540868 1358748 1269763 1063695 1178539 928008 1661842 1411429 1380223 1365684 1737959
17741 1737959 1221031 1273920 1442097 1218500 1247821 1198391 1383177 2121666 1477202 1232115
17731 1232115 1246718 1420450 1361909 1453554 830285 1240553 1415633 1450403 1603486 1443886
17721 1443886 1367226 1169370 1946868 1082371 893357 1442036 1135732 1542470 1028437 1635565
17711 1635565 1180988 1358737 1018755 1439403 1116236 1355044 1295026 1436482 1015610 1490469
17701 1490469 1639834 1558080 1532065 1617513 1070257 1481464 2023273 1282189 1293162 1322057
17691 1322057 1388834 1598223 849218 1412777 1470196 1897027 1418808 1256640 1763291 1361670
17681 1361670 1494999 1440145 1777127 1324832 1472989 1177243 1338977 1177034 1348005 1335350
17671 1335350 1894917 1351593 1364751 1100944 1107968 1555439 1593479 1735046 2284935 1525671
17661 1525671 1518680 1310798 1611718 2128330 1672152 1504725 1297457 1344273 1543970 1485775
17651 1485775 1311475 1755940 1673311 1972447 1985458 1591890 1388821 2048262 1602429 2174054
17641 2174054 2117195 1792125 2123306 1625210 2264900 1558813 2411606 1769497 2159196 2212561
17631 2212561 1998308 1766600 2302371 1817706 2053860 1906903 2477443 2162068 2572803
17622 2572803 2183711 2024967 2368139 2216187 2161150 2341775 2487252 2090140 2411736 2529229
17612 2529229 2266431 2408844 2942901 3086742 2867622 2729322 2863880 2501036 3050292
17603 3050292 2472716 2761043 2735854 2586369 2769636 2640826 2581567 2750745 2342810 2407138
17593 2407138 2649446 2471208 2655249 2466413 2342082 2954829 3196098 2561717 2977029
17584 2977029 2600039 2739377 2290042 2827699 2360024 2638189 2624885 2697242 2353902 2291625
17574 2291625 2489378 2267092 2441881 2299214 2304413 2415272 2334349 2426794 2653991 2503453
17564 2503453 2172589 2171225 2057161 2412545 2374972 2562914 2194164 2700962 2223965 2027481
17554 2027481 2734716 2496425 2131452 2279915 2523293 2728112 1981159 2246841 2676194
17545 2676194 2645224 2235323 2370493 2649374 2313710 2226672 2506347 2650843 2690093 2593225
17535 2593225 2403052 2263697 2661170 2879108 2501700 2827101 2513454 2756679 2310205
17526 2310205 2470762 2081088 2699978 2755859 2765915 2757075 2416071 2696611 2792113 3130601
17516 3130601 2758088 3015581 2733998 2820511 3312793 3231147 3629012 3927376 3588171 3714133
17506 3714133 4144921 3859350 3859172 4236196 3999865 4264232 4280790 4419472 4168814 4122060
17496 4122060 4640695 5105099 5639645 6111562 6507285 7510194 8587447 9796725 11347334
17487 11347334 14441129 19797559 28864940 40750388 55091673 68007972 79100464
17480 79100464 87801383 92637967 95293067 95136820 90812658 82679750 69639834 55377430
17472 55377430 43798445 37843528 39081733 45914618 56920932 69300519 80270511
17465 80270511 88615889 94275924 96377709 95831087 92486996 84730412 71940327 56387161
17457 56387161 40253863 27741324 19087416 14679900 11508240 9767908 9030291 8301925
17449 8301925 7655391 7030622 7399372 7258879 7554954 7366464 8426915 7847652 8027200
17440 8027200 7908612 8094639 8026365 7550392 7154502 6765104 5999808 6457996 6643066 6766346
17430 6766346 6828550 6954245 6920463 7277101 7347700 7260321 6726796 6644974 6596910 5747545
17420 5747545 5463890 5244612 4965710 4908806 5074567 4498870 4654034 4357711 4615067 4923395
17410 4923395 4667689 4627701 4599536 4975253 4836837 5063250 5555635 5457090 6414047 6581225
17400 6581225 6700514 6390949 6602340 7472698 7622319 7913077 8773271 8766415 9239127 9920451
17390 9920451 10935723 11625914 12701963 13679438 14097968 14599087 14846037 14814498 14511447
17381 14511447 13780647 14158445 13733659 13315431 12220248 12299235 12307599 11990668 12389187 13478855
17371 13478855 13611200 14729599 15589189 16083992 17237316 16955569 18039452 17890228 18396152
17362 18396152 18426749 18106719 18345910 17506602 17033243 17751911 17221626 17497093 17551355 18208995
17352 18208995 19242688 19487702 20538331 21732107 22731110 24507562 25642500 27016780
17344 27016780 27705920 28547149 28651355 29218813 28608534 28650714 27869655 26875990 26320182
17335 26320182 25220510 24558187 24517842 24465073 24795643 25662660 26144013 27351928 28688373
17326 28688373 29878450 31065618 32126828 32908772 33313829 33190463 33492390 33346088 33081193
17317 33081193 31846121 30564585 30372154 29638975 28543253 27713902 27015711 26717439 26581163
17308 26581163 26747502 26686235 27167143 27986405 28686861 29139104 29427472 30019525 30974538
17299 30974538 31177242 31265632 30641809 30391294 29669953 29502075 29270848 27845118 27290063
17290 27290063 27168291 26364635 26099451 25772829 25135205 25376007 24839829 23950265 22750705
17281 22750705 22536615 21391521 20454040 19100657 17802204 17161824 15122367 14787273 13881785
17272 13881785 12668184 12309505 12085642 11439780 11660337 11097271 10928474 11068301 10630367
17263 10630367 10434493 10031062 9723574 9612141 9206417 8991677 9315373 8684797 8332479
17254 8332479 9024369 8418191 8577871 8370008 7946270 7428458 7670102 7837407 7811775 8058166
17244 8058166 7189927 7515523 7407405 7641374 7159445 7118218 7328988 6108789 6760312
17235 6760312 6479762 5938170 5705024 5860864 5821059 6224838 6190107 6270049 6073564 6501559
17225 6501559 6795519 6867292 6643501 6482519 6843966 6317141 6729903 6866916 6586589 6346373
17215 6346373 6583078 6696527 6733500 6854302 6810775 6866780 6723057 7242027 6733467 7174048
17205 7174048 7216043 7258571 7428659 7698720 7708969 7615165 7530009 7105595 7051465 6414755
17195 6414755 5807037 5584754 5473451 5240226 5138270 5116477 5490830 5211628 4951547 4595958
17185 4595958 4809464 5006932 5217975 5068274 4735979 5001052 4252530 3954625 4082017
17176 4082017 3971020 4183950 3861077 4509861 4069479 4574391 4727827 4644146 4566659 4124861
17166 4124861 4754643 4936143 4331711 4589187 4765808 4798022 5312497 4384203 4637835 4828025
17156 4828025 4614322 4865331 4927777 5130169 5058782 5284798 5496302 5031677 5045988 5065872
17146 5065872 4804223 4485881 4157257 4815815 4569503 5199424 5071356 4967417 5161391
17137 5161391 4687398 4885147 4985719 5179791 4738175 4770555 4943515 4855646 4691788 5289558
17127 5289558 5351986 5171628 5668560 5589524 5229312 5443631 6057557 5441983 5779438 5476961
17117 5476961 5512611 5728112 5162987 5108251 4407344 4808980 3635399 3866976 3987406 4296237
17107 4296237 3775446 3897478 3343057 3333014 2875852 3636079 3146023 3283294 3065902 3160882
17097 3160882 3031052 3056900 3036358 2769539 2499446 2700154 2722625 3026169 2901288 2372841
17087 2372841 2481008 2328905 2361579 2309695 2770243 2526543 1997629 2155706 2175128 2218796
17077 2218796 2485925 1916506 2273477 2259036 2233493 2366082 1869144 2231711 2411474 2079847
17067 2079847 2028691 2316118 2451038 2655440 2026489 2445493 2004418 1848842 1952612 2190269
17057 2190269 2486877 2306749 2601360 2364621 2862739 2320320 2550047 3294952 2501892
17048 2501892 2947778 2733153 2791408 2779731 3162948 3060217 3199757 3525822 3640821 3629516
17038 3629516 3530507 3675272 3521970 3504375 3477511 3231520 3482317 3084372 3008945 3099105
17028 3099105 2251016 2644531 2478831 3103330 2560092 2526570 2447790 2651134 2630783 2493723
17018 2493723 2295338 2100052 2560959 2374792 2245669 2303061 2694321 2419919 1950455 2024284
17008 2024284 2710705 2420596 2046992 2161947 2263609 2372371 1993571 2335425 2231913
16999 2231913 2386966 2383016 2489998 2298218 2771152 2294080 2574504 2723243 1959873 1853480
16989 1853480 2354925 2385210 2417234 2725248 2378398 3054419 2654443 2667821 2041278 2517400
16979 2517400 2744875 2218413 2587940 2482813 2576016 2694356 2610865 3292675 3163314 2919526
16969 2919526 3829670 3540236 3834521 4235171 3722630 4755872 4930441 4718549 5354267
16960 5354267 5403037 5484408 5247157 5528162 5997398 5793085 6042791 5911027 5662151 5149904
16950 5149904 5376199 5124725 5108758 4681551 4635103 4836669 4423042 4135232 3735071 3882819
16940 3882819 3304540 3416479 3506290 3234062 2795831 2857929 2383938 2945274 2821479 2629278
16930 2629278 2080162 2518097 2606385 2853521 1896561 2077277 2541415 1988632 2082686 2556953
16920 2556953 1980634 2015438 1514700 2624349 2146475 2054567 1966273 2504527 1970145 1960841
16910 1960841 1852395 1979349 1540683 1981832 1800042 1546497 1773589 1623867 2098859
16901 2098859 1755937 1918046 2200607 1331073 1764342 1758089 1709127 1790493 1512259 1863382
16891 1863382 1154383 1442095 1319072 1948944 1540783 1581877 989195 1528146 1780140 1634239
16881 1634239 1561781 1715460 1842931 1889278 873081 1591834 1915075 2345435 1632531 1767008
16871 1767008 2060827 1993177 1560110 1958709 1518707 1870419 1951022 1794168 1897805 1756937
16861 1756937 1876354 1887632 1332014 2332861 1901258 1897693 1410267 2358485 1501293 1535965
16851 1535965 1748126 2019707 1730172 1841890 1330252 1709311 860429 1536458 1928314
16842 1928314 1786674 1490237 1311089 1583815 1614229 1496083 1823977 1682759 2077181 1682995
16832 1682995 1611840 1545972 1633490 1567839 1832119 1969007 2139219 1624459 2321577 1541789
16822 1541789 2184870 2125033 2051296 2634939 2632166 2310489 2678150 2944724 2472916 2810237
16812 2810237 2555583 2107337 2714912 2485940 2954846 2328529 2457339 2301823 3023090
16803 3023090 2656346 2251371 2516994 2525166 2547718 2565812 2363905 2569178 2030787 2088823
16793 2088823 1913559 1670752 2116351 1509216 1676459 1310293 1683810 1873213 1070806
16784 1070806 1080837 1688127 1778051 1505465 1282677 1217171 1441389 1404382 1107769 1889823
16774 1889823 1558597 1636966 1177038 1142500 1314321 1022373 1102839 1634721 1739779 686067
16763 1114381 1267390 1980816 1521531 1076874 1265599 1486465 917150 1479622 1335618
16754 1335618 1454391 1756978 1013669 1814121 889045 1648613 1439277 1751323 1137730
16745 1137730 1327549 1869618 1275838 1476655 1256370 1418327 1099120 1545508 1205025
16736 1205025 1687359 1518889 1273854 1652418 1346107 1451135 1891248 1516832 1232259
16727 1232259 1749177 1612096 2211851 1896193 1902000 2473454 2038702 2666999 2007563 2091524
16717 2091524 2053570 2211625 2253042 2284136 2301599 1977271 1950125 2137757 2294703 2523789
16707 2523789 2384743 2676104 2629007 2780574 3278683 3197379 3352166 3518319 3288877 3260280
16697 3260280 3360822 2932306 2826911 3070388 3313409 3485626 3152053 3083434 3470745 3300801
16687 3300801 3313453 3739736 4321844 3582804 3183581 3417825 3359893 3305225 2687740 2565290
16677 2565290 3313693 2465154 2388614 1997993 2330913 2567096 2555724 2484012 2678838 3037054
16667 3037054 3250471 3053407 3568921 3598390 3488194 3545806 3063861 3078121 3091284 3028108
16657 3028108 2956284 3123788 3668336 2982593 3452579 3212254 3397524 3315741 2855987 2599779
16647 2599779 2590998 2213169 2258806 1834877 1373057 1190810 1528966 1178162 1320936 1603670
16637 1603670 1763833 1318702 1323030 1046260 1593180 1249537 1618573 763281 937883 955569
16627 955569 1158133 1326790 576945 682734 1096659 1330649 787950 1199800 1336526 1351923
16617 1351923 1140134 1422910 1038097 1166171 1290296 1617566 1683655 1655363 1143851 765203
16607 765203 1021523 1530441 1821037 1641104 1286608 1409414 1407729 1967037 1535604 1905162
16597 1905162 1739869 1897759 1600306 1969391 1664714 2006930 1510258 1742103 1731204 2027238
16587 2027238 1899253 1554242 1998615 2044050 1697355 1355476 1643299 917426 1157578 1182671
16577 1182671 1037268 261069 1260908 1469112 924838 1172966 986147 1017551 803101 1063576
16567 1063576 1084833 961681 596640 680276 509718 1072527 296219 952216 835351 1299776
16557 1299776 1107983 729314 1090032 1141293 940016 786181 1071512 999123 1910364 999932
16547 999932 1194671 821269 1348485 852197 1097056 974729 1393069 1055422 587367 949222
16537 949222 694160 648684 1067932 587156 713921 928169 1149977 1043773 1064814 1568024
16527 1568024 1072450 1299261 824729 1114793 1322572 894225 1165756 790043 806771 505809
16517 505809 1174382 569273 1294147 833459 569692 593380 851778 1146214 1186211 998864
16507 998864 1085044 1231734 1237117 1109092 1210289 1182704 966006 1289809 1249987 835803
16497 835803 611653 1133084 404364 720011 321723 631127 646039 270270 415084 659529
16487 659529 914726 1056583 333463 734832 718507 876315 637532 1288368 713073 1457527
16477 1457527 1364460 1193919 1195368 1352862 1047571 1443658 1269475 1331808 1551225 1176520
16467 1176520 1748708 1502909 1477735 1252607 1268077 1266717 1706672 1574836 1806019 2190724
16457 2190724 1888136 1953895 2134238 2008813 1980064 2828280 2472439 2182238 2637906 2711371
16447 2711371 3175181 3014256 3462184 3240297 4131578 3765092 4010855 4474104 4459207 4667960
16437 4667960 5507917 5351720 5852130 6532429 7427365 7745431 8401112 9646055 10577277
16428 10577277 11865518 13649065 15343126 16880067 19061414 21939821 24341448 26814220
16420 26814220 29476724 33289433 36459844 40858880 44978450 50189267 55406964 60436995
16412 60436995 66077802 71815176 78054307 84478780 92158565 98636401 103193151 106683189
16404 106683189 107235151 107134603 106605763 105631113 104976162 103727652 102690441 100578829 97752394
16395 97752394 95240612 92644394 89243555 85842192 85524254 91914750 107098427 128596867
16387 128596867 150000580 164707079 171774029 170944332 163363140 145312264 116624892
16380 116624892 82227497 44737916 7671157 -22348585 -37452744 -37215214 -27498306
16373 -27498306 -13748458 -2786733 5159741 10463127 12372549 13494880 13641900 13103596
16365 13103596 12436952 12080111 11285637 10618595 10046748 9231249 9655029 9224329 9122155
16356 9122155 8706416 8218220 7805907 7216956 6522090 6253075 5333951 5904862 5345684
16347 5345684 4712055 4614726 3995510 4133750 4152374 4194075 3256259 2874620 3144353 3115634
16337 3115634 3101221 3619366 3346698 3434990 3309938 3432525 3253595 2669668 2474611 2344294
16327 2344294 2704977 2509491 2595405 2002802 1929915 1849215 2368341 2226979 2210707 2091394
16317 2091394 1823670 2058213 2249828 2188309 2223337 2448761 2495405 2640867 2385534 2756252
16307 2756252 2688566 2775800 2971455 2818555 2874664 3177119 2798986 2489519 2476341 2727028
16297 2727028 2139302 2688377 1914877 2231903 1859149 2159313 2576687 2175320 2449419
16288 2449419 2580614 2524300 2167173 2505078 3007196 2563026 2858753 2538891 2969255 2771610
16278 2771610 2470617 2581088 2727371 2548190 2599979 2548101 2647262 2803471 3152917 3162488
16268 3162488 3126102 3311481 3217025 2612597 2579163 2465343 2715157 2295565 2196929 1826925
16258 1826925 2439197 2071789 2059854 2107909 2396411 1770491 2131659 1595529 1579740 1356210
16248 1356210 2302525 2017316 2059045 1878237 1915336 2191137 1905686 2584717 2475621 2720039
16238 2720039 3059167 3524249 3142266 3670242 2852026 3135793 2885955 2934300 2412135 2238013
16228 2238013 2306142 2180011 1853091 2202982 2080356 2277271 1810974 1809343 2420127 1800755
16218 1800755 2132607 2508113 1664699 1700198 1585123 1752214 1854483 2116307 2346405 2598485
16208 2598485 2109724 2387701 2138083 2569294 2829856 2324429 2490810 2328573 2340406 2322187
16198 2322187 2742482 2279040 1901997 1828774 2228618 2243924 1888344 2121665 2074686 2097768
16188 2097768 2072213 1987261 2290049 2197224 2243305 2396355 2323182 2190411 2070822 2004938
16178 2004938 2221842 2357998 2009668 2220475 2709110 2859684 1887564 1861576 2330231 2179145
16168 2179145 2489659 1921703 2159102 2315118 2079686 1897247 2223943 2048722 2113295 2416880
16158 2416880 2652417 2081260 1885338 2170646 2397077 2102254 2066285 2074560 2224674 1868994
16148 1868994 2248792 1857656 1955152 2161862 2095396 2414466 2353463 1987339 2398940 2301731
16138 2301731 2551287 2052739 2133892 2102940 1383609 2007790 2125451 2303423 1974487 1539131
16128 1539131 1858308 1827648 2315930 2374136 2354326 1899762 2013514 2113969 2394261 1831235
16118 1831235 2048599 2374532 2417988 2299183 2113249 2260925 2311852 1661302 2301515 1962767
16108 1962767 2399741 2472202 2173180 2475412 2085061 2106583 2139506 2039083 2321191 1762510
16098 1762510 1993924 2199162 2178974 2417062 2099725 2553144 2458563 2075884 2708894 2558001
16088 2558001 2117942 2383041 2902780 2406793 2695839 2471854 2326601 2341112 2718418 2840806
16078 2840806 2429759 2495050 2977486 2726537 2653429 2987255 2730240 3028259 3025243 3134087
16068 3134087 3174051 2627972 3141539 3133347 3955892 3017984 3132026 3330163 3091249 3247929
16058 3247929 3203533 3182759 3652122 2921889 3161105 3268729 3161332 3488444 3308171 3437715
16048 3437715 3964399 3729964 3509340 3684984 3511548 3600175 3562852 3685881 3626575 3942462
16038 3942462 3699512 3498121 4326086 4375544 3727142 3824317 4227039 3988214 3759557 3916110
16028 3916110 4109979 3664328 4293062 4227437 4320539 4209945 4471258 4733336 4302410 4222338
16018 4222338 4130217 4371941 4862154 4357400 4714146 4338570 5065750 4858265 4717702 4550035
16008 4550035 4728487 4526314 4649489 4696679 5043985 4835846 4811676 4519957 4906229 4548421
15998 4548421 4931779 4891598 4811066 4823247 4347804 4952592 4886473 4593127 4905944 4456954
15988 4456954 4766425 4413449 4581860 4691664 4697762 4863408 4799085 4511369 4538232 4989471
15978 4989471 5655215 5099060 5067213 4874284 4976829 5083053 4965142 5090311 4683512 5406694
15968 5406694 5015479 5025606 4465301 4787232 4440813 4465745 4424642 4538539 4512580 4246664
15958 4246664 4541480 4204036 4219988 4575011 4647365 4358993 4695440 4613052 4928179 5198925
15948 5198925 5075142 4670308 4828586 4771908 5151138 5224433 5192019 4814411 4482372 5189475
15938 5189475 4984594 5047650 5451651 4928583 4971762 5735261 5220660 5625718 5963097 5477715
15928 5477715 5695167 5684774 6068079 6054897 6597266 6816449 6754806 6908500 7085709 7337860
15918 7337860 7826096 8452512 8478874 9071479 9429945 10550550 11717904 13262693 14984842
15909 14984842 17288215 20579059 25477190 32662113 41582092 52711191 65711691 79023625
15901 79023625 91969308 102466727 110719917 114844264 115225100 111874010 103760161 92714764
15893 92714764 79028898 63978442 50544178 38783045 29751741 23919711 19288270
15886 19288270 15625924 13546383 11914493 10134894 9432885 8563967 7651358 7598945 6528159
15877 6528159 6356382 6526789 6277346 6097908 5781430 5980324 5628971 5475592 5643115
15868 5643115 5556382 5908063 5457448 5378607 5052745 5124603 4338477 5137626 4687901 4993884
15858 4993884 4669294 4633679 4607524 4833606 4531862 4420320 4457720 4547102 4883423 4471930
15848 4471930 4694565 4471009 4478868 4574357 4736569 4301442 4147366 4287839 4639000 4663267
15838 4663267 4587794 4707711 4691985 4989346 5158269 5117657 5391471 4911585 4622170 5393294
15828 5393294 4826405 5276066 5176069 4912594 4648620 5183128 4627241 4696142 4829831 4778518
15818 4778518 4689769 4865883 5070856 5117633 4618762 5130695 5131729 5366531 5231204 5983534
15808 5983534 6025934 5569808 5496684 5593022 5547355 5606871 5549815 5766238 5697334 6379573 6374365
15797 6374365 6628107 7063736 7191305 6892281 7743230 8001431 7318778 7630241 8176650
15788 8176650 7980842 7940260 7618848 8509460 8244768 8522723 9229176 9158683 9861182 10172557
15778 10172557 9999159 10268996 10541122 10710742 10631720 10229102 10238656 10419613 10062015 10133626
15768 10133626 10349781 10267984 10255917 10159607 10492616 10556898 11022930 11346624 10889788 10780982
15758 10780982 11194460 10615017 10414164 10226571 10078101 10034979 10133672 10283485 9686719 10332863
15748 10332863 10219929 10505519 10624518 10574826 10880008 11844529 12095767 12638906 12975277
15739 12975277 13636691 14200029 14090668 14218632 13567908 14141438 13871721 14283534 14328855
15730 14328855 14812749 14982603 15563147 15612728 15763675 16202615 15348158 15507278 14644835
15721 14644835 14855242 13525362 13461195 13367562 13688237 13752102 13265824 13184894 13323027 13702273
15711 13702273 12827507 12613334 11937559 11713417 12276292 11916064 12264240 12916046 13676816
15702 13676816 13461017 14777874 14471880 15250107 15587424 15902001 15597255 15687430 15589350
15693 15589350 15478944 15475530 15134890 15035569 14882464 14607905 14623956 14847665 14333360 14781171
15683 14781171 14668081 13943553 14457881 14177555 13659587 14095877 13605889 13249737 13192503
15674 13192503 13460836 12629558 12711584 12322650 12582319 12164104 12408451 13050514 12874733
15665 12874733 13275982 14266978 14339729 15547138 16240893 17705955 18021594 19198024 20037954
15656 20037954 21379927 22384513 24159866 25491267 26567978 27938204 29686358 30876714
15648 30876714 32547369 33008321 34381564 35076960 35855535 37291798 39013100 40091306
15640 40091306 41795247 43142496 44994093 45969653 47139185 47842660 47826759 48103598 47564229
15631 47564229 46657735 45784961 45893300 44949693 45045831 44340924 44864651 44478805 43720029
15622 43720029 42982778 41777772 39601557 37673379 35575325 33774063 31864410 30072278
15614 30072278 28307789 27627816 26148122 25784726 24774480 23847898 23446469 22707246 22082314
15605 22082314 21548237 20826854 19851004 19453567 18820021 18703758 18778290 19006593 18484518
15596 18484518 18366650 19251962 19863786 21345298 24173309 30514236 42023415 57590206
15588 57590206 73471536 84634302 93011793 98452428 101361655 101739313 99636205 93946538
15580 93946538 80513672 59144546 39865402 29590914 24004959 20048900 18544219
15573 18544219 16619380 16260713 15901941 15773850 15528134 15294480 15253040 15568381 15642449
15564 15642449 16012034 16501086 16433000 17079838 17447180 18651985 20768429 25213347 34607492
15555 34607492 51688454 73255449 92569747 106579292 116151297 122634358 125853319
15548 125853319 125315273 120990250 110936100 89833199 61301831 39535783 27875777
15541 27875777 21158062 17928633 15725665 14113617 13308594 12520176 12186264 12099297 11605130
15532 11605130 11342462 11656238 11473985 11472080 11192578 11044902 10465911 10338260 10902997 10009259
15522 10009259 10367701 9705461 9993066 9657657 9326822 9587822 9966733 9994051 10157037
15513 10157037 10334436 10400020 10477552 10973734 10830997 10933829 10628720 10982553 11139466 11373387
15503 11373387 11149970 11140919 10829184 10518200 10497958 10372726 10270481 9770213 10504455 10447752
15493 10447752 10954479 10773833 10572750 10971695 11122984 11147526 10988526 11464351 12083138
15484 12083138 12342504 12748308 12916158 13086238 13362500 13733283 13173934 13838457 14230384
15475 14230384 13831205 14172299 14944769 15577345 16554850 17628412 19389761 20083249 21179288
15466 21179288 21996728 22393619 22345543 21896870 22038612 20854666 20167972 19624605 19411970
15457 19411970 19520464 20655575 22036044 22687943 23610302 24777284 25165796 25402407 25288756
15448 25288756 25008126 24211443 23635181 23382750 22493254 22036061 22047798 21958133 22537030 23378001
15438 23378001 23122777 23381448 23651503 23306574 23409988 22472519 21989443 21183522 19986691
15429 19986691 19407013 19446523 18077428 17448033 17319538 16825118 16328512 15655509 15168122
15420 15168122 14989343 14270684 14125487 13758901 13372931 13103383 12759360 13244028 12745946
15411 12745946 12862243 13062703 12308560 12325446 12666589 13236825 12826790 13061258 13330990
15402 13330990 13439231 13853405 14106316 14035683 14811985 14686379 15089901 15086139 14753571 15107220
15392 15107220 14738456 14227644 13851784 13729525 13927832 13802619 13867334 13562265 14275182
15383 14275182 13984297 14161351 13674844 14189219 14735499 13812548 14529141 13718557 13956171
15374 13956171 13626413 13530026 13473646 13526039 13745200 13979666 14158621 14157701 14481630 14734362
15364 14734362 14962682 15256014 15454457 15972183 15704256 15967909 16221260 16787687 16204631
15355 16204631 16954618 17015398 17636439 18762120 19777234 21391826 24088928 29825344 38277663
15346 38277663 47339117 55966863 61755369 65974959 69197968 70628088 70450076 68569085
15338 68569085 64214795 55551942 45147892 38262608 34472092 33013511 31652175 30902932
15330 30902932 30944082 30026635 28930504 27717938 26556021 25970057 25525100 24720583 25249350
15321 25249350 25576979 25650154 26650306 28119864 29694056 33319046 39946830 51128849
15313 51128849 66193548 81323394 94705031 104670784 112078408 115834840 116870641 114328610
15305 114328610 107070341 93632502 74102026 55989565 41881416 32661579 27872870
15298 27872870 25476058 23581634 23155793 22502091 22138940 22631171 22610115 23122843 23471102
15289 23471102 23493922 23445650 23950638 23688029 23358721 23572079 24235035 25214765 27054047
15280 27054047 32997507 40301060 48788948 55190328 60364598 63686000 65930300 67044627
15272 67044627 66281521 63715550 57832855 48502405 37622028 31544848 27687910 24980594
15264 24980594 23642075 22891878 21714164 20636900 19900187 19509684 19212884 19309517 18668476
15255 18668476 19307768 19292454 19906346 20529779 21113260 21677402 21725303 22195499 21826069 22371876
15245 22371876 21629934 22040670 21657880 21411598 21366597 20950767 20951639 21605978 22403193 23155059
15235 23155059 24786720 25628708 26925580 28205507 27805292 27906622 27552832 27189948 26563398
15226 26563398 25454550 24592541 23312497 22838432 22065615 22008266 21941320 22258938 22684375
15217 22684375 22751275 23013129 23255831 24062125 24080655 24162707 23393487 23339453 22247217 21649559
15207 21649559 20463471 19038818 17762057 16344062 15306342 14904479 14460728 14352072
15199 14352072 13848744 12902268 12738534 13205661 12958050 13210852 13516244 14146430 14252485
15190 14252485 14808091 15433138 15338490 15570434 16225238 16068203 16305218 16288481 16123746 16668011
15180 16668011 17164713 17534734 17345018 18190412 17849460 18250483 18704863 18386477 18555327
15171 18555327 18156442 18038870 17870214 18097002 17430915 17648997 17609409 17616847 17637903 17819197
15161 17819197 18097990 17466616 17874978 18358142 18536025 18421056 19024027 18832494 18440245
15152 18440245 18655705 19017154 18450219 18025642 18025590 17778810 17711796 17672419 18114011 17656862
15142 17656862 18503604 17987206 18419999 18844909 18948918 19346624 19192461 19944145 19662092
15133 19662092 19736746 19707565 19477803 19346377 19204732 19309430 19408052 19453865 19087872 18985889
15123 18985889 18703091 18226056 18254297 17828327 17308391 17034373 17159620 17348729 16546570
15114 16546570 16687359 17053196 16262453 15939877 16170618 16339867 16707474 16484926 16375270
15105 16375270 16736526 16773599 16847552 17626261 17954250 18106570 18946489 19572023 20634183
15096 20634183 21283102 21653268 22486294 24176078 25490668 27967216 31107800 35242447
15088 35242447 38951357 41283191 43399261 44990002 45346577 46262006 45588195 43962757
15080 43962757 41358789 38760592 36493786 36829867 38012977 41379347 45164771 47989150
15072 47989150 50895551 52467865 53305056 53753254 53459898 52761611 51714917 51019136 52279110
15063 52279110 56427816 59849507 63633257 67808581 71570070 75010245 78534780 81644230
15055 81644230 83123489 81188496 78174926 76589126 77639782 80657750 84334577 87697011
15047 87697011 88912831 89394554 89495528 90002202 91697818 91797283 91533406 88503919 83823866
15038 83823866 79088171 75012020 71799394 69263734 66150701 61820000 58237377 57149901
15030 57149901 58630705 60498257 62068759 63870544 65172970 65941269 67041268 68373831
15022 68373831 67764339 67121648 65161711 65132265 68774345 75219829 83208886 91737059 99008640
15013 99008640 106427393 112343281 117780824 121945465 125055601 126133694 127497250 128823786
15005 128823786 131807007 137446511 144997539 153274943 161649730 170916054 180171748 190219188
14997 190219188 198625308 205748563 211720358 218053207 223990219 230116267 236063721 242565825
14989 242565825 247970073 252028304 254672050 255035164 251552317 244593222 234381920 222320300
14981 222320300 208138876 192242965 175558597 158190882 141055045 125938851 113314559
14974 113314559 102393471 92550936 84664367 78381125 74305806 70654808 67771928 66725479
14966 66725479 64390464 63975569 62879993 62630536 62360109 63029503 65050063 67693078 72535971
14957 72535971 79092446 89864570 104248194 124494095 150300776 180356418 215355864
14950 215355864 254261281 295967964 336958780 378562627 416944887 448067247 465886024
14943 465886024 467850021 458503515 442540717 418672600 390771273 361557457 328394824
14936 328394824 291468090 256859231 231548872 216591142 206622762 197143937 185558177
14929 185558177 171466611 156290848 142978053 132592854 125264849 119823009 116300071
14922 116300071 112195100 108226171 103114954 97950777 93557342 88628934 82694189 74609927
14914 74609927 62705702 51655330 43142227 37450139 33827052 31250125 29881855 29102293
14906 29102293 29395601 29490932 29940718 31213295 32806456 34153393 35898946 38450006 41663595
14897 41663595 46243203 51580014 58066856 63892529 68146613 71031215 72505111 73341568
14889 73341568 73049963 71383702 66834278 59229839 51303169 44864741 41905136 39489832
14881 39489832 38505337 36821299 36045993 35561156 35550004 36587449 38056303 38555099 40213467
14872 40213467 40627860 40747311 41691253 42313764 43432247 44616633 43830736 43688935 43755308
14863 43755308 46109482 47779461 52821929 60247059 69812815 80574962 92402637 104285899
14855 104285899 114902311 123499534 127879300 129470698 127169694 119469722 108471646 96245856
14847 96245856 83364892 69900157 58045079 49849019 44329547 41436783 38933465 37756425
14839 37756425 36662966 36144530 35198745 34164295 33612443 32837006 32645471 32228377 31481940
14830 31481940 31378263 30872011 31845428 32723061 33471860 34007034 36085948 38501021 42407460
14821 42407460 48959788 58278559 68175252 76895869 83995878 88230695 90484431 90871410
14813 90871410 89120930 84478449 76163774 64747883 51947093 40614899 34109994 29755390
14805 29755390 27625442 25956351 25154864 24466807 24316913 24157526 24393307 24484677 24675392
14796 24675392 23861376 23984408 23775566 23428740 23489878 22953550 22729666 22355163 21875641
14787 21875641 21450617 21543235 22105591 22614672 22035506 22536042 23560045 23966810 25756272
14778 25756272 26281195 27033832 27679554 27813312 28270532 28240728 27739962 26754756 25456811
14769 25456811 24130847 22085778 21403500 20360924 20150950 20143797 19470105 19407457 19932489
14760 19932489 19854587 20077635 20374015 21340461 21168269 21702666 22098804 22157640 23472290
14751 23472290 24144594 24939223 25309625 25496474 25517298 26341034 26226995 26395121 25916980
14742 25916980 25637480 25346824 26116287 27670784 29669894 32370297 35204805 40097513
14734 40097513 46385902 55285910 69449946 91972756 122588818 160465425 202799550
14727 202799550 243990096 279951306 307649086 325377164 333165818 329070052 311803919
14720 311803919 279693261 236978242 191467020 146168280 106866684 79509346 61600892
14713 61600892 49946486 43371484 38639802 34905387 32391374 30653273 28910546 27939771
14705 27939771 26694079 25622567 23938181 21609440 20228118 19122090 18306680 18203707
14697 18203707 17967642 18102945 18696238 18676272 19028232 19580693 19501891 19467713 19570666 19746268
14687 19746268 20008682 18818126 18365308 17812122 17952837 18563945 18935279 20144279 20440197
14678 20440197 21728146 23759139 25024435 26456449 26908176 27105339 26760198 26654580 25321730
14669 25321730 24491726 23259998 21986513 21224147 21450644 21653788 22387214 22732683 22744417
14660 22744417 23083376 23250165 22698133 21144554 18932215 15875464 14351813 13403032 13598069
14651 13598069 13741235 14089310 15979650 17112402 19377936 20264827 21230340 21997898 22424462
14642 22424462 23617141 23897023 24572284 25307524 24895715 25727586 26990597 27953931 29217637
14633 29217637 29300745 29099514 28426186 27096458 24304593 22012166 18737202 15922153 13331887
14624 13331887 11500961 9905022 9277794 9302638 9283373 9677536 9562402 9680138 9793782
14615 9793782 9409364 9586264 9093429 9408814 9084262 9049644 8728381 8420530 7942831 7912990
14605 7912990 7836671 8367246 9000181 10217714 11595558 13568979 16083865 18455227 20199855
14596 20199855 21621845 22246407 22689481 22405084 21540770 20045847 17723327 14921464 12586348
14587 12586348 11324039 10347938 10143468 10215710 10003918 10032896 9894069 9853806 9573131 9211024
14577 9211024 9616527 9161817 9477370 9475807 9626875 10206746 10837960 11177990 12162342 14040539
14567 14040539 16858679 18588403 20471333 22372649 24274566 26868234 31208477 38386975
14559 38386975 47663983 55538109 60936322 64992356 67238024 69492902 69989162 68588360
14551 68588360 64994078 57144413 45434839 34900407 28750732 28150552 31903915 39563964
14543 39563964 50515605 61436899 69890632 76200374 79928525 81939141 81699916 79222735
14535 79222735 72947972 62645160 49103981 38088120 30544572 26831076 25224026 24161873
14527 24161873 24119898 23973777 24708105 24232947 24426332 24502138 26718431 32289852 39420696
14518 39420696 46286510 51756626 56060370 58758268 61005545 62497585 62539319 60061918
14510 60061918 55052546 47296755 40905667 38780618 39733085 43503118 49002428 54665038
14502 54665038 59028559 62131978 63049718 65006236 65776044 63984486 62313482 58038485
14494 58038485 51024399 43484191 37503192 33840898 29884188 26166563 23826003 21951927
14486 21951927 20046436 16872056 13464417 11247842 9889466 9353856 8117093 8177477
14478 8177477 8054470 7728151 7729380 7972285 8553150 9294281 10319282 11983252 13268987
14469 13268987 14869490 15090351 15615676 15947209 16277311 16052085 15928679 15978533 15466175
14460 15466175 15249150 16344068 17988067 19252838 20691287 21460952 21379563 21659932 21220772
14451 21220772 19434971 17367834 14855897 12651441 12230319 11442407 11250895 11837030 12019143
14442 12019143 12127673 12690666 12963639 13494814 13998711 14815155 15006765 15253814 15909699
14433 15909699 16847497 18161459 19521840 23243247 28121894 34696751 42283392 49099000
14425 49099000 55028054 60046265 63299159 64221162 64307916 62520495 58155118 51180942
14417 51180942 43038189 35545591 30632616 26563434 23803851 21665104 19320535 17625451
14409 17625451 15793714 14682740 13827980 13505311 13341627 12508942 12855526 12696971 13297032
14400 13297032 13215499 14083654 15059024 16155347 17514503 20442398 24385426 31225693 40606652
14391 40606652 52655852 65233343 76767718 86105725 92966573 97216770 98904046 96876251
14383 96876251 91499610 81339377 68120442 54142198 42184447 33634220 26743540
14376 26743540 22392168 19053775 17314179 15928695 14819944 14685759 14495953 13852156
14368 13852156 13911139 14387723 13484394 13330079 13500463 13264126 13408161 13798581 14378611
14359 14378611 14963745 16603113 18334320 21812711 25820970 30727914 35944515 40222682
14351 40222682 43789814 46744041 47834484 47655993 46546212 43366523 39764956 33847286
14343 33847286 28694404 23983739 20997411 18966264 17585779 19155774 24232116 29963054
14335 29963054 36331978 40264688 43113765 44957390 46520452 46835363 46742937 44765746
14327 44765746 39595465 31156685 25580750 23186953 22789756 23390081 24385033 25753413
14319 25753413 27752171 30416211 34289196 38266939 44452603 51417303 60972956 72699287
14311 72699287 87454199 106849121 130678778 158343289 187272058 214217825 237541633
14304 237541633 254240147 265304879 268665408 264816716 252689279 231924234 204286008
14297 204286008 173112349 142120553 115126535 93841796 76695665 63657130 53110608
14290 53110608 45085600 38950196 33994761 29284657 26137653 23442806 21631134 19341869
14282 19341869 17802560 16562059 15843148 14302811 13775342 13543533 13113802 12499716 11993940
14273 11993940 11873735 11059312 10819208 10414236 9709388 9140096 8824320 8697238 7693776
14264 7693776 7208927 7763651 7833893 7518112 7199120 7463772 7485611 6530783 7471047 6821409
14254 6821409 6774045 6029450 6440680 6501832 6164797 6574094 6598594 6066764 5407935 5307929
14244 5307929 5275788 5410644 5172923 5086889 4998091 5139948 5198617 5387199 4776010 5002146
14234 5002146 4707288 4721602 4770174 4996913 4578062 4214721 4420850 4607900 4664332 4937707
14224 4937707 4942497 4449555 4916055 4234447 4979906 5248496 5336894 5435738 5527805 4863947
14214 4863947 5614717 5047835 4573048 5465397 5005670 6412588 7179702 8332126 8978303
14205 8978303 8844953 8982885 9502382 9287912 9069375 8767509 7801408 5741573 4578960
14196 4578960 4610272 4995752 4678572 4705942 4277299 4840684 4987013 5195853 4981082 5534061
14186 5534061 4766462 5028810 4513080 4314621 4544706 4656301 4184214 4601961 4563337 4860382
14176 4860382 4296662 4903099 4555787 5130553 5204333 5496639 5791869 5584294 5268685 5280840
14166 5280840 5313432 5489026 5130644 5112846 4591111 4682577 4230783 4348739 4709700 4310623
14156 4310623 4552992 4591245 4397535 4722068 4317549 4292197 4965303 5032064 5030648 4213968
14146 4213968 5197227 5087325 5537034 5711642 6988199 8154070 10396566 12283777 14275195
14137 14275195 15549823 17298621 17674945 18110003 18264977 18371857 16819419 14884354 12290782
14128 12290782 10297226 8629898 7585815 6541548 6191317 6713791 6918118 7827490 8640428
14119 8640428 9427476 9572039 9299069 9937827 9870422 9388194 9316502 8056535 7368885 6711694
14109 6711694 6169861 5779096 5992633 5043481 5941270 5603742 6167219 5944343 5921493 6585197
14099 6585197 8124124 8777349 9694452 10677265 11209131 11566618 12332330 12545655 11938520
14090 11938520 11619970 10774392 10111536 9267501 9241555 10201754 11223790 12217052 12719625
14081 12719625 13943484 13909671 14288230 14138834 14034884 12448511 11462453 9902155 8922267
14072 8922267 8293935 7759400 7914555 7644773 7785896 7960852 7982740 8256988 8516423 9170696
14062 9170696 9811726 10575949 11464074 12455014 13439988 14319718 15287466 15979784 16164211
14053 16164211 17188559 16534966 17603870 17721825 18780856 19950726 21991066 24109306
14045 24109306 27360208 29878880 34109856 38137105 42388632 47939962 54804582 62745624
14037 62745624 73163373 87366348 105800453 129339478 157516450 187763256 217287195
14030 217287195 243220438 262314520 274529235 279034135 275638515 263562919 242385414
14023 242385414 212832245 179848760 147052994 118264054 95522498 77438327 64123914
14016 64123914 53317197 45935574 38598710 33310360 28999358 26506429 23567888 20861042
14008 20861042 19013910 17640878 15995745 14977114 13774521 13025876 12595695 11663019
14000 11663019 11184804 10809540 10306864 10001307 9897481 8621923 8936855 8849581 9023185
13991 9023185 8968937 9939959 10219425 11016185 11928465 12038964 13521922 14530840 15083901
13982 15083901 14749702 15552638 15260940 15166456 15171882 14595581 14344094 13347289 11909057 10584118
13972 10584118 10453647 9231866 8639002 8176605 7498598 7044980 6689630 6704934 6048245
13963 6048245 6472940 5340020 5720775 5449752 4820904 5025854 4917813 5227734 5233377 5049870
13953 5049870 5023786 4835891 5479172 5928137 6685281 7062042 7570328 7570815 7642651 8670123
13943 8670123 8931907 9721877 10992762 13662804 18036020 23569556 30833153 37800294
13935 37800294 45378232 51992227 57964386 61379569 62114649 60482160 56374450 49341746
13927 49341746 41750758 33681244 25298122 18180837 13373912 9902134 8240029 6758290
13919 6758290 6179980 5337449 5104702 4439665 4529189 4445656 4177641 4005708 4182145 3408722
13909 3408722 3821765 3948148 3836765 4068512 3756668 3964315 3478785 3675860 3578133 3135158
13899 3135158 3396982 3992940 3813918 3556984 3937595 3587993 3534678 3680105 3681507 3548919
13889 3548919 4291220 3944548 3955114 4017033 4326555 3341087 3518054 3953165 3380597 3574336
13879 3574336 3099913 3486584 3368834 3329500 3265042 3968034 3230823 3160123 3924066 3775072
13869 3775072 3752349 3085009 3271314 3542061 3930597 3845968 3810353 3749355 3853650 4064208
13859 4064208 3420165 3983785 3994132 3766680 3748896 3687670 3527231 3657533 3761810 3850470
13849 3850470 3947175 3800022 4264907 3984771 3720217 4022132 3816740 3742177 4007754 3734949
13839 3734949 3540559 3736822 3453031 3460101 3253414 3089969 3450132 3332203 2978183 3368814
13829 3368814 3046885 3098574 3404520 3510315 3260518 3816964 3201917 3291841 3832126 3384340
13819 3384340 3249135 3264344 3086103 3176093 2900639 2708514 2884485 2988316 2771437 3097000
13809 3097000 3037368 3181551 2724976 3331873 2853391 2701569 3176972 3344134 2907368 3228369
13799 3228369 3264525 3250208 3282290 3331335 3925985 3280881 3614831 3356204 3277431 3192069
13789 3192069 3300007 3232025 3226159 3547932 2633365 2786247 3099394 2660605 2780575 2882946
13779 2882946 2927123 2646033 3272095 2795485 3424581 3186271 3404007 3269722 3066456 3348127
13769 3348127 3450019 3407326 3355151 3749928 3439582 4019833 3269287 3201031 3913765 3707860
13759 3707860 3350387 3842819 3223885 3545515 3288824 3050669 3335429 3274711 3004492 3282243
13749 3282243 2536945 3175778 3278076 3561076 3711966 4087525 3842636 4021943 4104156 4378463
13739 4378463 4087766 4748830 4023473 3922175 3920176 3696838 3375077 3423020 3740741 3703569
13729 3703569 3617130 3471466 3284879 3247470 3509825 3307755 3022774 3045878 2760322 3512744
13719 3512744 3464766 3626351 3053615 3599271 3162844 3777886 3026598 3414018 3213200 3193423
13709 3193423 3616577 3691098 3592907 3682851 4056652 3851476 3828675 3628779 4076554 3551795
13699 3551795 3950743 4122389 4417318 5322899 5894595 6265040 6512714 6695836 7165905
13690 7165905 6872509 7261213 6456509 5870463 5446459 4805159 4572708 4024015 4061885 3651314
13680 3651314 3851661 3992292 3726612 4029213 4600449 5000073 4612654 4785447 4386242
13671 4386242 4457380 5266344 5318637 5755093 6448477 6798989 7390095 8328779 8479034 8582051
13661 8582051 8769156 8443328 8603674 7782797 8374476 7303505 6387887 6158070 5396397
13652 5396397 5240441 4783662 4965278 4586206 4399987 3897915 4286448 4131809 4311212
13643 4311212 4489985 4342448 3826340 4082622 4170038 4467997 4845048 5866791 6118418
13634 6118418 6687733 6719904 6965630 6916067 7635493 7143859 6911535 6568179 5032262 5160147
13624 5160147 4015969 3779623 3487378 3547880 3347036 3946737 3174368 3548248 3611032 3553297
13614 3553297 3510213 4016645 4434820 4318706 4195723 4894751 4375244 4474790 5135260 4636263
13604 4636263 4740984 4545395 4308096 4077993 4095650 4249658 3713687 4001177 3809317 3566179
13594 3566179 4526066 4284817 4741725 4603095 4637518 4629380 4629353 4809646 4555230 4108861 4193903
13583 4193903 3749477 3285739 3744301 3164010 3536549 3253844 3525212 3288508 3322786 3186509
13573 3186509 3601825 3323870 3211933 3331769 2542020 3427393 3466077 3235257 3080562 3616048
13563 3616048 3084840 3495609 3114905 3195672 3402252 2951725 3262591 3034326 3321713 3281514
13553 3281514 3594029 2954983 2970769 3440755 3216320 3326654 3646825 3657894 4107733 4905788
13543 4905788 5817982 5420089 6201969 6155075 6517641 6385463 6501775 6546813 6210101 4932530
13533 4932530 4349142 4110738 3615757 3955571 4122437 4517059 4606952 5056391 5622642 5722400
13523 5722400 6331809 5926218 6412240 6136427 5782069 5463703 4447855 4529506 3845488
13514 3845488 3254011 2881905 2583806 2951312 3485690 3075093 2897998 2987316 2895717 2669055
13504 2669055 2899978 2559118 2536802 3019492 2893007 2873150 2475540 2613274 2686622 3029705
13494 3029705 2542090 2736699 3233790 2650173 3085904 2820893 2767716 2927895 2265273 2477158
13484 2477158 2475156 2841362 2740434 2820690 2730138 3053098 2420364 2705912 2872732 2969597
13474 2969597 2799429 2714881 3181287 2565917 2291374 2547733 2554327 2870109 2542888 3123711
13464 3123711 2902187 3330791 3022518 2808240 3024016 2976318 3076724 3092896 3256331 3910994
13454 3910994 4012548 5008549 5448390 5503791 6175937 6435007 6534201 6747767 5725530 5247521
13444 5247521 5108214 4168816 4129659 3582960 3403615 2778360 3313369 3037908 3387196 2857293
13434 2857293 3280209 2891010 2900199 3304182 2996503 3110137 3280339 3262204 3536088 3984653
13424 3984653 3941964 4938440 5097675 5406740 5933851 6163924 6948387 6334354 6059394 5796947
13414 5796947 5375279 4683157 4172231 4208287 3549616 3438709 3587952 3294234 3004889 2975373
13404 2975373 3509310 3392244 2832394 2536968 3186770 2983559 3330157 3417715 3570932 2707738
13394 2707738 3252558 3333961 3140359 3820533 3419425 3697923 3548857 3772835 4616157 5248756
13384 5248756 5887671 5657838 6065689 5585145 5774572 5801476 5702549 5549810 4567301 4167232
13374 4167232 4284300 3685194 3496202 3797927 3705765 4191915 4162255 4438550 4231427 4518947
13364 4518947 4288000 4327478 4684657 4213425 4036491 3697993 4182499 3959341 3893924 4707035
13354 4707035 5168120 5093514 4724978 4526061 5027052 5195716 4970138 5184546 4393032 4518565
13344 4518565 3742476 3529967 4484205 3901171 3707258 3779487 4130382 3877170 3701660 3534700
13334 3534700 3692585 3841200 4252513 3933987 3549945 3963171 4303107 4089858 4059463 4057481
13324 4057481 3983022 4000167 4106908 3691157 4545449 3974373 4574009 4859210 4965452 4928141
13314 4928141 5718154 5170316 5493538 6145076 6009428 6285604 5954243 6007279 5992358 5438379
13304 5438379 5156881 4949780 5316751 5558316 6132501 6173255 6454932 6013096 6522013 6587549
13294 6587549 6062626 6791631 6245988 6701019 6131586 5756195 6298638 6055712 5939734
13285 5939734 5932455 6203339 6188359 5961224 6456327 5914706 6206641 6177544 6476343 6827608
13275 6827608 6585772 6853320 6884196 6931340 7383715 7262781 7157159 7475342 7478224 7638595
13265 7638595 7428162 7841384 7639752 8562402 8226169 8768231 8573786 9332473 9201576
13256 9201576 10053649 10770799 10725256 10838845 11513438 11903205 12028645 12249391 12638088 12645898
13246 12645898 12962591 13179848 12856146 13355850 13200233 13353746 13308552 13790455 13547955
13237 13547955 13698569 14056355 14196009 14451149 15178237 16234845 16217164 16712368 17675588
13228 17675588 17594220 18549141 19247041 19705965 19558796 20157009 20403592 19626372 19617306 19522908
13218 19522908 19220814 18803693 18547114 17875818 17671399 16726916 16787387 16542361 16687653
13209 16687653 16518480 16561236 16362133 16111652 16408678 16387079 16385768 16208960 16892621 16450208
13199 16450208 16470514 16356274 16607378 15667734 15672354 14672738 14823003 15016966 13974500 14343255
13189 14343255 13631736 12952405 12978003 12772150 12347735 12489942 11544860 11438186 11653773
13180 11653773 11218644 11081352 11029472 10546484 10792712 9854824 10414975 9815277 10016196
13171 10016196 9805206 9701900 10042095 9981090 9953685 10425395 9837276 10321258 10574115 11228662
13161 11228662 11436295 11845405 11935352 12496292 12831933 13096464 13001595 13286851 12980701 12746891
13151 12746891 12323909 12121539 12350922 12003087 11987453 11576344 11727249 12099332 12303758
13142 12303758 11510753 11887912 11001701 11274220 10448580 9782338 9588260 9105571 8448169
13133 8448169 8008698 8336255 7642768 7634600 7876203 7785055 8232087 7934169 8140610 8029508
13123 8029508 8166705 8215321 8544612 7693939 7202999 6829616 6602329 6040987 5926429 6284016
13113 6284016 6451317 6440270 6184020 5974595 6179270 6119055 5918795 6126481 5854510 6290457
13103 6290457 6471098 6258289 6394005 6717287 6857360 7638687 7720920 8658484 9869492
13094 9869492 10232433 10830099 10821961 11074998 11486231 11453645 11792322 11295990 11011341 11041605
13084 11041605 10496346 10237537 10726412 10680267 10251725 10084083 10405883 9550991 9044807
13075 9044807 9111725 8304276 7464687 6891072 6449901 5936243 6002684 5591563 5562537 5251067
13065 5251067 5243820 5237880 5716570 5834713 5506099 5770065 5819860 5958978 5692298 5708369
13055 5708369 6115762 6625989 6430546 6705188 6056545 6040886 5876864 5614652 5388061 5524735
13045 5524735 5464863 5913997 5630599 5803113 5711673 5467815 5570093 5653203 5711594 5863234
13035 5863234 6171933 6001074 6481521 6093153 6488338 6856341 7368111 6528206 6827773
13026 6827773 6467152 6614516 6768573 7060941 7032933 7594178 7193620 7241662 7569285 7979083
13016 7979083 7904741 8123666 7945043 7862739 8203117 8562411 8450190 8941075 9079996 8782149
13006 8782149 8972676 9706207 9122814 9478183 10025374 9606028 10097436 10344121 10311977 10366250
12996 10366250 10837862 10881977 10940867 11028883 11451679 12294083 11384135 11908135 12173269 12169622
12986 12169622 12071129 11546017 11494458 11684405 11463751 11342763 11508380 11848145 11362056 11557559
12976 11557559 11457479 11397782 11261144 11108586 10918640 10512159 10317749 10362937 10117006 10004445
12966 10004445 10093974 9695601 9933306 9790513 9962908 9989516 9483857 9412595 9924359 9793390
12956 9793390 9421350 9648660 9874157 9613499 9574623 9255448 9935619 9317312 10046972 9405355
12946 9405355 9903393 9622973 9585218 9545910 9961230 9463469 10019733 9529312 9713591 9659723
12936 9659723 9977277 10103132 9732094 10652084 10665378 10222105 10798083 10784571 10758595 10352062
12926 10352062 10417290 10050371 10089503 9905706 10018868 10120115 10238564 10158914 10270307 9585202
12916 9585202 9919452 9326778 9166491 9308932 9173324 8527114 8516222 8202386 8245554 7908991
12906 7908991 8294470 7751819 7683713 7448844 7019324 7370707 7390968 7313247 6369405 7206387
12896 7206387 7027443 6528375 6538288 6086817 6641517 6327893 6307345 6206981 5617004 6789906
12886 6789906 6183145 6295017 5962717 6165939 6315936 5766033 6451778 5728265 5540627
12877 5540627 5967293 6233330 5615155 5684879 5762721 5490879 5425073 5871429 5309270 5541234
12867 5541234 5337526 5658622 5308812 5335552 5177309 5106976 5357477 5240516 5166206 5446995
12857 5446995 5103321 5148247 5282865 5485850 5244222 5401194 4606289 5294499 5335419 5448811
12847 5448811 5143881 5499118 5537781 5770908 5326623 5529716 5626080 5181395 5088591 5964971
12837 5964971 5479140 5506089 5756290 6062963 4964785 5876771 5514914 5070078 5795840
12828 5795840 5285015 5549934 5262515 5538596 5223631 5345422 5689675 5377458 5374042 5257093
12818 5257093 5528052 5053039 5908049 5792370 5348623 5250442 5073507 5508118 5397599 5402773
12808 5402773 5524744 5196834 5061483 5311969 5720227 5261384 5512144 5535959 5445802 5385627
12798 5385627 5799017 5353750 5113437 5487861 5772929 5442057 5782221 5710530 6323111 6171908
12788 6171908 5885382 5811727 6090888 5418190 6126171 6050085 6335200 6037412 5924259 5705981
12778 5705981 5243950 5703996 6017811 5403991 6008999 5937590 5658598 5767467 6381403 5553567
12768 5553567 6074333 6327669 5784685 5975392 6137907 5899132 6637466 6606852 5649142 6430392
12758 6430392 6588670 6324997 6229872 6043439 6168233 6026707 5631499 5954723 6104512 6285554
12748 6285554 6370509 6436103 6014864 6044116 5744610 5866681 6084284 5859623 6463172 6666454
12738 6666454 6049359 6348720 6310259 6273389 6630711 6056644 6684524 6478468 6778318 6482841
12728 6482841 6239472 5913102 6151029 6600934 6111128 5945129 6073963 6431910 6221105
12719 6221105 6083762 6263127 6150062 6118410 6556529 6343507 6549550 6749376 6712313 6350567
12709 6350567 6409813 6617568 6674346 6915532 7273283 7637802 7625018 7933195 7692491 8064365
12699 8064365 8096390 8523036 8273755 8513104 8445012 9086633 8642651 9170599 10145926 11268270
12689 11268270 13053440 14523479 15746197 16244710 16949785 16853306 16114267 15998076 15238781
12680 15238781 13885946 11892081 10396162 9900113 9267450 8975491 9049832 9057338 8962758
12671 8962758 8964836 9351016 9435970 9114753 9256476 9617607 9822722 10021948 10082444 10292087
12661 10292087 9842094 9780090 9467259 9265029 9749422 8930441 9287656 8841222 9737744
12652 9737744 9399278 9780604 10674741 11059294 11281604 11932933 12372938 11982946 12368300
12643 12368300 13257330 12747089 12294931 12834064 12397121 12155171 12765499 12848812 13095913
12634 13095913 12752091 12676960 12204880 12695544 12500282 12283513 12986546 13312622 13510963
12625 13510963 13267763 13336426 13257086 13023120 12869720 12096385 11590611 10568577 11377137
12616 11377137 10191102 10091700 10123895 10332594 11272182 12017842 12471712 13401943 14279198
12607 14279198 15433361 16253197 16639815 16722855 16707382 16624696 15096927 14732230 13475723
12598 13475723 12624472 11653548 10800616 10613677 9865252 10061478 9242721 9959221 10066875
12589 10066875 10940346 10730899 11503194 11828025 11437088 11734189 12415113 12006825 12174329
12580 12174329 13019686 13468564 13594342 13559143 14217409 14788130 14404531 14250296 13340558
12571 13340558 12470982 11741143 11142734 10871897 9901986 9289142 9691993 9604643 8964345
12562 8964345 9207279 9878299 10083415 10262955 10080059 9477437 9725215 9823781 9929676 9411857
12552 9411857 9816327 9525881 9870917 9767830 10066919 10107745 10107673 10349938 10543583 10676193
12542 10676193 11385854 12501318 12634741 12758618 13127490 13241248 13510780 13229274 12737495
12533 12737495 12468597 12052786 11064470 10197431 9813914 10305984 10437712 9917610 10301402
12524 10301402 9639872 10213789 9986325 10282139 10706073 10840859 10636575 10719799 10881928
12515 10881928 11502299 11947612 13709364 14536456 15868420 17075098 17568990 18529440 18188865
12506 18188865 18328642 18148549 17077220 15521760 14834528 13110992 12338980 11547714 11867732
12497 11867732 11284875 11021761 11006771 11244657 11163324 11413803 11337386 11266337 11245857 11575721
12487 11575721 11972069 11564111 12589016 12464314 13569464 14223031 15283824 15215869 15270721
12478 15270721 15571742 15801166 15875140 15725651 14951468 14030855 12628437 12273676 12181027
12469 12181027 12301234 12034767 12329092 12411463 12755101 13104207 12580407 12750967 13023424
12460 13023424 13551082 13765192 13961895 14018671 13971882 14529085 15115629 15774527 15786731 16486026
12450 16486026 17594446 17218033 18463954 19435229 19139212 20059718 20871175 20993978 21430640
12441 21430640 21384203 22191837 21909897 21903006 22154685 21954455 21804631 21849463 21502909 21549878
12431 21549878 22018788 22247558 22842096 23067766 23689838 24214717 24480459 25280555 25648717
12422 25648717 26617327 27666979 28555728 28716010 30252531 31084260 31930977 32646999 33311580
12413 33311580 34197475 34554543 34543262 34464079 34366999 34438677 33283857 33093543 31695468 31543116
12403 31543116 30421720 30585913 29296016 29223187 29446558 28805161 29154782 28805803 29171125
12394 29171125 29602692 30181248 31004261 31569826 32025440 32482216 33363319 34110263 35089156
12385 35089156 36003661 35990700 36600187 36926456 36569343 37216192 37366019 36942348 36409664
12376 36409664 36410227 36273427 36252171 35766037 35028824 35307836 34744085 34240381 34322566 34241674
12366 34241674 34163043 34486682 33981881 33427699 33159419 33309907 33197688 33085409 32704781
12357 32704781 32864706 32075574 32351746 32174019 32312491 31425974 31579646 31125077 30502135
12348 30502135 30428203 30252996 29672351 29923691 29873882 30552117 30615817 30447464 31454507 32243271
12338 32243271 32805081 33508137 34141272 35011334 35473924 35639911 36475240 37245487 37539542
12329 37539542 38042354 38501382 38989733 38689014 39739270 39950401 39076891 39878399 40159196
12320 40159196 39694953 39770422 39898261 39901478 39703895 39930405 40216207 39718451 40251863 40485432
12310 40485432 41327962 41479705 41989252 42467042 43354035 43954049 44502316 45017229 45179706
12301 45179706 45273534 44442429 43609611 42953293 41982066 41534723 40145409 39339840 38409282
12292 38409282 37948571 37722895 36996605 37031377 35942210 35043255 34728020 33600918 32456936
12283 32456936 31956064 30551859 29318921 28799831 28393470 27847542 27269067 26847612 26206003
12274 26206003 26496782 26202238 25768012 26052785 25766554 25267476 26030482 24964215 25908059
12265 25908059 25573801 25249836 24869762 25196915 24987900 25079848 25361498 25581186 25854293
12256 25854293 26680375 27466622 28507610 29877990 31360701 33232211 35175257 36648639
12248 36648639 38588652 40798067 42567585 44630435 45788633 47287462 48703337 49322487
12240 49322487 49863870 50215811 49687872 48960861 48418043 48056670 47916334 46994282 46754539
12231 46754539 45899725 45115470 44369581 42937762 41794114 40282769 37769059 35220542
12223 35220542 33815638 31405120 29644843 27687292 26803849 25423027 24629921 24404177
12215 24404177 23651752 22938071 22859273 22196702 22218492 21010522 21101333 20878310 20446642 19483911
12205 19483911 19687653 19507176 19956989 19355605 19631635 19842249 19915819 19989068 20164888 19896837
12195 19896837 19800661 20699720 20494050 21237420 21808782 21864375 21966095 22354587 22921399 23746747
12185 23746747 23608336 24244407 24100560 24601678 24491406 24668989 24178793 24584277 24852908
12176 24852908 24095831 23515283 23589766 23829508 23850476 23563947 23755910 24003997 24105769 24576356
12166 24576356 24779197 25320992 25330324 26106354 27291034 28032217 28822756 29791772 30089591
12157 30089591 30989958 30598706 30767530 30769453 30462053 29607565 29501524 30280658 30420302 31095246
12147 31095246 32342921 33275186 35163969 36485246 37669006 39024691 40080621 41887878
12139 41887878 43061734 44706820 45331375 47058620 48612968 51418297 53129115 56462170
12131 56462170 59585811 62919981 66829928 70431076 73797339 77117320 79918003 82195401
12123 82195401 83835603 84616464 84767266 84982302 83876190 83140256 81668942 80452810 79134191
12114 79134191 77432583 76781083 75767949 74447078 73635751 72682209 71718476 71024476 69970407
12105 69970407 69811420 69475835 69776993 70030897 70541380 70645556 70424592 70482571 70298079
12096 70298079 69705697 69550146 68621322 67880373 67057331 65656564 65721956 66798325 67367853
12087 67367853 68562719 70761755 72680800 73724338 76072435 76982498 78047975 77846597
12079 77846597 77573766 76799920 76506501 76034872 75705033 75340297 74190140 73366294 72927605
12070 72927605 70678321 69241779 67179200 65727473 62852943 60734095 58915493 56737076
12062 56737076 55609105 54292937 53338047 52289491 51497501 50743326 50123948 49697327 49003286
12053 49003286 47434984 46617787 45854677 45176004 44537627 43005880 43165734 41979428 41185028
12044 41185028 41121115 40073939 38988847 38301171 37036032 37011766 35112869 34731162 34238936
12035 34238936 33601516 33333109 33608465 33691813 34122525 35155614 35492368 36363382 36773705
12026 36773705 36218154 36791903 35535017 34379435 33313190 31745020 30278449 28889722
12018 28889722 27938271 27749219 26850278 26030168 25910391 25560632 24959318 24291300 23737166
12009 23737166 23203851 22790387 22562705 22084753 21839104 21460677 22397582 22577296 23369624
12000 23369624 23629024 23705151 23432651 23437003 22895824 22087792 21152924 21391709 20791641 20020367
11990 20020367 20045842 19649158 19303469 19281262 19418720 19080086 18550191 18662115 17953865 17418107
11980 17418107 16835201 16360214 15630140 15950858 15809447 15575062 15088819 15478425 15028226
11971 15028226 14906574 13573078 13674687 13313979 12953938 12143687 12084008 12138708 11631595
11962 11631595 11532818 11599916 12156438 11886193 12587882 12550921 12751231 13270490 13671822 13500045
11952 13500045 14012193 13708044 13196258 13444731 13372743 13374793 13742890 14428991 14411315 14597305
11942 14597305 15082793 15395974 15910986 16437613 16880028 16853131 17524217 17667434 17378618
11933 17378618 17036650 17232961 16675806 16907955 16605952 16626219 16206138 15564076 15613750 14917416
11923 14917416 14814832 14130581 13470559 13814033 13619013 13289638 12718749 12718778 12693370 12223426
11913 12223426 12232265 13114447 13812127 16765510 20797360 25389493 27828254 29851531 30497208
11904 30497208 31898406 31798177 30902366 30114636 26630772 19726634 14964254 12563438
11896 12563438 11798032 11207513 11319971 10915613 11159143 11143436 11531308 11381326 12405964
11887 12405964 13842055 14841261 16140567 17529147 18284416 19479386 20764633 21142725
11879 21142725 21139334 21213958 20988677 19856701 18683537 17278110 16759940 15484183 14968434
11870 14968434 13793581 12709668 11820637 10630794 10365348 10093104 10142744 9918171 9623697
11861 9623697 9344068 9066203 9147485 9455301 9576995 8817640 9422853 9442714 9708949 10479336
11851 10479336 10762319 10937749 11191088 11782311 11976970 13246119 13464424 14342748 15369251
11842 15369251 15822442 16414683 16370304 16372186 16108892 15818066 15408500 15127630 14870062 14411043
11832 14411043 13540311 13262455 13677259 13073327 13362130 13339955 12980141 12639054 12000718
11823 12000718 11100865 10552471 9660479 9136446 8337011 8146154 7994709 8275033 7734920
11814 7734920 7963995 8194314 8041438 7510935 7618102 7366006 7042575 6883894 6890447 6982705
11804 6982705 6491892 6593743 6552149 6564143 6373780 6603291 6854226 6394565 6577628 6756122
11794 6756122 6750347 7373320 7305208 8162696 8830938 9239771 9993491 10510874 10616123 11095314
11784 11095314 11099488 10788673 10490935 10326245 9285202 8153675 7910928 7409572 6975316
11775 6975316 6473057 6338124 6460042 5899190 6038050 6068695 5798589 6119595 5680161 5995113
11765 5995113 5551999 5917691 5880347 5878039 5438041 5312852 5558271 5559828 5198606 5422108
11755 5422108 5536066 5500055 5249896 5660047 5633452 5393012 5294394 5381028 5715664 5249043
11745 5249043 5303237 5571356 5538285 5339926 5108090 5861881 5188221 4819119 5282425 5301702
11735 5301702 5536628 4799930 5322738 5134601 4986383 5024134 5021305 4920504 4461975 5025807
11725 5025807 4819909 4989481 4765351 5060108 4992340 5063415 5343692 5376095 5541313 4974114
11715 4974114 4836259 4919358 5036263 5260762 4979897 4571844 5474305 5012053 5185443 4960875
11705 4960875 5150334 5358153 4915187 5046789 5324900 5528566 5018372 5064496 4967955 5149908
11695 5149908 5334994 5776778 4987809 5575838 5674958 5346915 5164068 5229823 5392661 5062182
11685 5062182 5553164 5457016 5565141 5686515 5461387 5678825 5907452 5610689 6188067 5670235
11675 5670235 5733782 5575570 5886694 5831618 5503118 5804513 6053373 5887978 5475069 5621611
11665 5621611 6014677 5743392 5995646 5755967 6064097 5876106 5797383 5968653 6100087 5879254
11655 5879254 5779913 6160217 5462276 6164250 5669887 5982931 5448620 6011306 5898385 6072628
11645 6072628 5685716 5680400 5955649 5699247 5623785 5986147 6130384 5758325 6013431 6030353
11635 6030353 5797363 5901459 6396975 5789532 6098836 6655192 5552308 5833621 5973226
11626 5973226 6170354 5909509 6074448 5873983 6255005 6225937 5598625 5466501 6205375 5758820
11616 5758820 5826849 5691308 5598524 5702555 5443919 5575236 5641551 6451096 6097569 5955893
11606 5955893 5840142 6208399 6295763 6340050 6948501 6422617 6789728 6629837 6841781 6924386
11596 6924386 6699818 7222104 6596595 6775387 6625338 7121449 7055470 6346884 6606872 6519056
11586 6519056 6790783 6707739 6400141 6642071 6634027 5876759 6648195 6637377 6741357 5946387
11576 5946387 6538030 6889577 6986392 6933031 7047327 6985138 6307932 6599921 6834740 7033152
11566 7033152 6913454 6628991 6704143 6827968 7086597 6423639 6507672 6729605 7199112 6516333
11556 6516333 6439446 6617588 6535591 6405178 6774852 6553158 6685404 6392355 6796051 6828130
11546 6828130 6488108 6302454 6547168 6666481 6503274 6576408 6265770 5758951 6405384 6143426
11536 6143426 6517972 6491120 6418701 6223031 6623622 6569503 6221737 6227196 5776169 6385901
11526 6385901 6146289 6338932 6506706 5975782 6351854 6077410 6162914 6477954 6372455 6822791
11516 6822791 6150163 6430523 6678411 6416626 6269329 6642345 6862262 6792258 6737801 6704906
11506 6704906 6221704 6705092 6133197 6203849 6593285 6256185 6537814 6374654 6433171 6777865
11496 6777865 6441399 6316902 6691010 6259573 6708382 6823054 6623173 6891046 6884592 7013538
11486 7013538 6840329 7279750 6506828 6944356 7695587 7069646 7186817 7027656 6760170
11477 6760170 6949085 6905211 7402388 6900741 7107634 7528791 7101425 7241047 6686098 6536020
11467 6536020 6701901 7012706 7099793 7121586 6876288 6643149 6717698 6911883 6792997 6555064
11457 6555064 6511334 6580884 6865411 7042811 6659905 6719371 6599708 6798443 6886550 6907465
11447 6907465 6889711 7109325 6804505 7052349 6739743 6952159 7234065 6915807 7008508 7634740
11437 7634740 7528940 7524039 7129746 7621697 7748246 7780049 7667427 7736291 7667582 8398789
11427 8398789 8251712 8451945 8428025 8437542 8524762 8955431 8493457 9207762 9080731 9196921
11417 9196921 8995564 9712445 10364612 9874842 9697212 10589858 10024739 10558452 10417003
11408 10417003 10837243 10877653 10918046 11279824 11258381 12025319 12033065 11985633 12314037 12399343
11398 12399343 12130449 12764371 13178875 13302985 13675173 13123262 13992473 13980704 14093293
11389 14093293 14401581 14665896 14492167 15102561 15506384 15734615 15954643 15442124 16491457
11380 16491457 16545404 16279109 16827324 17109023 17406065 17377011 17888340 17906119 17997874 17947853
11370 17947853 17910715 18550320 18533199 18725317 19091169 18998095 18922207 19118429 19536024 19380003
11360 19380003 19291202 19501191 19713132 19586653 19928116 19922540 19388234 19897148 19480060 19746011
11350 19746011 19735561 19363627 19737343 19082724 19235503 19515663 19086690 18890189 19038190
11341 19038190 18757190 18552094 18650214 18474267 18083795 17726739 17825626 17502374 17357734 16864358
11331 16864358 16773634 16764949 16744297 16659858 16455016 16110073 16018448 15923195 15763547 15425857
11321 15425857 15078024 14846576 14672037 14677413 13951660 14414437 13402409 13746016 13446985
11312 13446985 12694358 12657012 11998384 12567681 12348135 11969112 11677332 11384776 11293661 10997627
11302 10997627 10365913 10578847 10750671 10091750 9983718 9826316 9297100 9491329 9073813
11293 9073813 9068766 9707067 9090363 9141829 8572700 9118296 8696284 8125326 7651583 8007417
11283 8007417 8035370 7680316 7316251 7145818 7683788 7548502 7157330 7223893 6942568 6663735
11273 6663735 7088410 7242876 6643048 6796632 7084532 6519735 6983318 6635763 6246595
11264 6246595 6447411 6541169 6410897 6480847 6465497 6825266 6495152 6219138 5996970 6701727
11254 6701727 5852827 5856041 6153687 6054956 6026312 6239374 6437667 6159075 6432426 6013445
11244 6013445 5771985 5733068 6029465 5888627 6001572 6008718 6088402 5885922 6149314 6133610
11234 6133610 6243725 6491368 6172292 6143612 6612833 6455552 6198003 6771715 7823385
11225 7823385 9213985 10947688 12244693 14016542 14765217 15563257 15515656 15799940 15345352
11216 15345352 14618271 13628721 11165659 9284271 7872934 7035090 6839270 6173488 6338990
11207 6338990 6114495 6131971 6268528 6059146 6217503 6772036 6424163 7068490 6908869 6747407
11197 6747407 8128020 9541928 11028325 13128998 14151062 14904503 15955433 16138180
11189 16138180 15838105 15193748 14593698 13064247 10658148 9103386 8071007 7157772 6413200
11180 6413200 6472342 6487309 6762034 6252589 5770202 6370510 6079580 6068724 6306933 6171608
11170 6171608 6098980 6374807 6069018 5945417 6240508 6268062 6537389 6203197 6329058 6523513
11160 6523513 6574092 6451571 6779628 6485229 6724089 6625399 6738980 6824732 6616458 6906042
11150 6906042 6716278 6369526 6646879 6589653 6476977 6776519 6901564 6515441 6978024 7461585
11140 7461585 6931097 7136960 6789419 7375716 7239635 7374830 7233097 6846015 7181267
11131 7181267 7395365 7461998 7431547 6940957 6725874 7463227 7942511 7707634 7244825 7460700
11121 7460700 7114017 7636215 7362988 7706088 7216451 7622384 7886339 8057623 7897325
11112 7897325 7794752 8015808 7980716 7621887 8423762 7920836 7944637 8082271 7889680 7582230
11102 7582230 7940719 7944706 7913843 7620722 8305786 7795956 8136025 7626856 7986573 7422419
11092 7422419 7564551 8189153 8007354 7811673 7888269 7805305 7666937 7767967 7879146 7761735
11082 7761735 7834638 7708192 7836355 8311782 7753573 7843616 7675934 7780207 8167194 7978928
11072 7978928 8062174 8336647 8440263 8388470 8939467 8603212 8333773 8338181 9323801 9271144
11062 9271144 9575614 9363475 9892300 9440650 9993194 10194585 10371858 10228008 10385436
11053 10385436 10244712 10977041 10396040 10680013 10467209 10725813 11168998 10940612 11008805
11044 11008805 11219473 11534134 11652240 11561999 11822814 12535961 12529303 12930787 13223825 13107960
11034 13107960 13982400 13550166 14466763 15107379 15472564 15958443 15882473 16438936 16690019
11025 16690019 17060756 17493015 17325049 17525522 17878910 18199684 17894534 18156211 18343514
11016 18343514 18869220 18870652 19063837 19521703 19204347 19644331 20364938 20652466 21273530 21616235
11006 21616235 22433688 22535298 23445635 23923130 24412246 24833280 25274867 25762403 25585083
10997 25585083 26232592 26508909 26881697 27369324 27317740 28050841 27750717 28364691 28210090
10988 28210090 28317758 28612705 29411159 29545766 29665804 30782754 31797730 32941008 33982026
10979 33982026 34979667 35428592 36037881 36610741 37236426 37558000 37826435 37490706 37886336
10970 37886336 38365607 39032507 39650717 40518781 41162127 42614672 42820294 43887010 45153456
10961 45153456 45742561 47204501 48280169 49366916 49936044 51931715 53478787 54520242
10953 54520242 55554610 56854617 57938097 58821825 59633031 60352188 61338127 61655503 62230772
10944 62230772 63351522 64009404 65199980 66872341 67917525 69388419 70523895 72136788
10936 72136788 73840651 75912405 76938698 78847683 80996511 81893230 83688284 84740481
10928 84740481 86024236 86953792 88265952 89727861 90868828 91574000 92414032 93146926 93039573
10919 93039573 94244537 94027953 94136901 94039125 93885510 93584710 92946736 92666029 92168697
10910 92168697 92280801 91893739 91801242 91581165 91333262 92441760 92757492 93115293 93341097
10901 93341097 93942555 94707537 95248377 96298121 97522529 98700448 100274238 101552486
10893 101552486 103747204 105448956 107727082 110558171 113994339 117371724 121949630 126113196
10885 126113196 131800442 138605100 145538145 153757768 162031466 171069547 180375378 189724560
10877 189724560 199226110 208206197 214672111 220267311 223902042 226126483 225700630 222929090
10869 222929090 218454269 212861893 205783707 198304619 189674384 180903088 171619579 163071473
10861 163071473 154734463 146035700 138069932 130205157 122024496 114953017 108406427 102567486
10853 102567486 96118240 90521449 84816210 80341862 75502621 71484431 67284141 63733701
10845 63733701 60183854 56944402 53712971 50629178 47895381 45816337 43853368 41932755
10837 41932755 39888111 37736421 35954191 34398858 32536548 31591174 30250296 28952782
10829 28952782 27562316 26862660 25799444 24495274 23552044 22876076 22608219 21688626 20730341
10820 20730341 20098345 19587701 19092974 18594746 18082796 17712191 17014204 16935529 16443365
10811 16443365 15990196 15299485 15385645 14714240 14692574 14387480 13906241 13493933 13332722 13234573
10801 13234573 13019969 12841270 12307425 11951425 11630630 11719283 11760347 11244980 10936188 10863882
10791 10863882 10363747 10490197 10117123 9630862 9438485 9862444 9727700 9371257 9526025
10782 9526025 9293038 9015740 9412518 8692550 8568812 8749810 8567077 8308109 8074125
10773 8074125 7835966 8196534 7656514 7882925 7542869 7468088 7309698 7001933 7400703 7237102
10763 7237102 7042005 7130546 7220732 6878164 6740089 7031214 6428453 6904151 7140816 7001097
10753 7001097 7073002 6717871 6666211 7054834 7115079 6672667 6779466 7029938 6389720 6343904
10743 6343904 6224259 6254755 6555133 5738838 6220785 6121171 5542945 5840670 5208740 5738233
10733 5738233 5656323 6079738 5910765 5870969 6245946 6264110 6724669 6373764 6537940 6216324
10723 6216324 6182229 6115243 6502697 5515311 5766071 5864022 5650681 5675359 5694051 5379165
10713 5379165 5608447 5863926 5455151 5543688 5690567 5564016 5599604 5909210 5896978 5779200
10703 5779200 5733991 5579653 6169152 5536276 5550350 6072599 5599998 5512016 5248041 5541975
10693 5541975 5243111 5181144 5438744 5212823 5256185 5705458 5523945 5180209 5480128 5578043
10683 5578043 5586983 5292462 5278923 5687738 5934573 6023427 5856504 5907076 6497883 6506312 7454170
10672 7454170 6954406 7220565 7257887 6413759 6565836 6124618 6144285 6076815 5557010 5245327
10662 5245327 5079129 4971630 5689539 4681432 4990663 4821502 5254477 5666606 5594550
10653 5594550 5901002 5638727 6337741 6520566 6072510 6220951 6462572 6391706 5656465 5413862
10643 5413862 5097373 4987217 4829564 4193632 3915232 3884463 3734099 3517822 4235874 4325109
10633 4325109 3911079 4490907 4093417 4092828 3822632 3837948 4146112 3886263 3452237 3797927
10623 3797927 4043785 4038899 3475520 3660296 3641504 3636369 3750589 4007150 3559076 3865231
10613 3865231 3954520 3762266 3485324 3438396 3473378 3903168 3636272 4111682 3644164 4082538
10603 4082538 3816011 3732007 3502687 3686544 3773487 3694818 3884472 3572130 3511511 3689123
10593 3689123 3869285 3552304 3666045 3619227 3868033 3628243 3584649 3512738 3712840 3576052
10583 3576052 3691341 4142669 3697102 3867271 3653890 3676339 4105236 3569038 3725395 3915276
10573 3915276 3734541 3753275 4055892 3745861 3626608 3846070 4068361 3810412 3342007 3603244
10563 3603244 3479709 3135831 3077667 3320651 3371307 2955260 3068475 2775459 3409541 2738116
10553 2738116 2942144 3274888 2799485 3252491 3206612 2806399 3608927 3003547 2894217 3223309
10543 3223309 3118326 2870027 2983831 2888251 2637012 2745780 2565091 2867797 2990978 3039815
10533 3039815 3016631 3089508 3014971 3192310 3082347 3149841 3083616 3272692 3253748 3234251 3273237
10522 3273237 3730675 3519539 4510721 5014233 4816115 5917178 5837966 6300082 6292538 5504059
10512 5504059 6167315 5549951 4149967 4343028 4291004 3241547 3627814 3907642 3514387
10503 3514387 3231297 3211701 2890521 3442353 3665074 3839729 4008750 3965839 3796917 4138139
10493 4138139 4882452 4760019 5198858 5317763 5939610 6307109 6583431 6530277 6406386 5941872
10483 5941872 6263993 5636009 4956636 4527528 4101651 4259961 4670929 4420992 4386579 4095375
10473 4095375 4053223 4349996 4358235 4513455 4423621 4466621 4434034 5593231 5574318 5696248
10463 5696248 5689037 5526985 5404533 5956646 5688277 5397776 5208492 4895392 4925164 4029744
10453 4029744 4569367 4943112 5044765 4863200 4834484 4848428 5008961 4466047 4400806 5108673
10443 5108673 4814402 4795166 5433297 5793930 6826122 7935065 7981707 8080244 8239923 8076345
10433 8076345 8931209 8632647 8117809 7424733 6480111 5447397 5186819 4859553 4793264
10424 4793264 4529049 4317966 4122504 4483257 4583341 4608542 4342993 4241412 4205805 4295956
10414 4295956 4907310 5032264 5201241 5667625 6266893 6963939 6720346 7146135 7465726
10405 7465726 7639855 7734789 7727551 7441411 7073875 6203080 6454383 6430942 6723291 7276762
10395 7276762 7329227 7523720 7589189 7931857 8064263 7736808 8742177 8661973 8768591 8171882
10385 8171882 8340313 8017934 8720038 8896999 8555701 8865332 9279924 9749846 9626556
10376 9626556 9773215 10220621 10421414 10304863 10169144 10342776 11403168 10881819 11194995
10367 11194995 10473227 10809353 11368276 11496724 11731963 10818118 10578690 10417078 9227213
10358 9227213 9508851 9188835 8788319 9010284 9099348 9595077 9560786 9568504 9887293 9589490
10348 9589490 9655138 9214058 9230152 9184295 8685819 8911549 8380132 8061624 8498512 8966239
10338 8966239 8888718 9346395 9587559 9308924 10126919 10119870 10188746 9716213 9852608 9592943
10328 9592943 9211165 9106344 9086153 8982652 9055368 9192342 9346647 9042262 9196068 8956159
10318 8956159 9157192 9062658 9247020 8885469 9163629 9608441 9227435 9439115 10149162 10311073
10308 10311073 10432436 10717426 11160588 10826984 11266364 11554565 11265269 11804324 11307651
10299 11307651 10924285 11547284 11228678 11420857 11381332 11742042 12466508 12772238 13456473
10290 13456473 14021897 14562465 15678648 16357177 17265456 18077434 19588738 20096285 20713531
10281 20713531 21674910 22371238 23237571 23426991 24294410 24781529 25539488 26388179 27026242
10272 27026242 27696893 28200273 29102585 29744770 30556946 31786969 32468255 33757595 34922002
10263 34922002 35971240 37252714 38883045 39987670 41445906 41917774 42700299 42994556
10255 42994556 42884141 42810701 43222393 42811655 43183087 43872127 44121442 44810566 45388925
10246 45388925 45674065 46018437 46349601 46352911 45172863 44561239 43261018 42237328 41057711
10237 41057711 39696130 38214346 37059610 36768015 35565036 34644718 34313662 33860358 33083935
10228 33083935 32160123 31754110 30723105 30156097 29732460 29370221 28798908 28550156 28325884
10219 28325884 28211676 27675485 27457484 26734922 26448319 25631217 25052580 24158655 23531890
10210 23531890 22030169 21322335 20094685 19150648 17920849 17070998 16114903 16014502 15001179
10201 15001179 14312089 14044544 13188823 12945256 12363579 11521968 11180056 11098659 11008095 10690197
10191 10690197 10260314 9857405 9606782 9605752 9674000 8910682 9000865 8849517 8603230 8705110
10181 8705110 8457814 8111849 8118828 8036488 8564039 8035224 7723956 7707965 7575029 8059405
10171 8059405 7300268 6781231 7255579 7234076 6743079 6678651 6551597 6675720 6861347 6549201
10161 6549201 6467187 6440475 6518200 6304295 6383845 6237079 6205225 6467019 6191368 6582401
10151 6582401 6498376 5901548 6187742 6063568 5975116 6133047 6058039 6368371 6000134 6379534
10141 6379534 6058861 5977849 6178769 5911952 5824157 5821436 5357175 5697506 5859885 5408836
10131 5408836 5812479 5271825 5646023 5917118 5070540 5288302 5089403 5309372 5127169
10122 5127169 5085914 5185176 4743565 4729768 4893723 4623019 4740198 4763424 4619023 4457537
10112 4457537 4130407 4697518 4848402 4602463 4557685 4551769 4647354 4290208 4130724 4442520
10102 4442520 4044563 4375223 4267936 4107755 4789716 4120217 4552561 4400383 4009068
10093 4009068 4109927 4030629 4198213 4480129 4459050 4151558 3989501 4425626 4298749 4089828
10083 4089828 4494820 4713876 3898687 4213946 4514796 4330527 4431180 4177051 4234619 4101318
10073 4101318 4526756 4233111 4813108 4540734 4525288 4415025 4209653 4658429 4232872 4556829
10063 4556829 5221717 4184201 4744323 4861247 5117364 4860839 4683569 4865147 4859268 4978858
10053 4978858 4414739 4852548 4813163 4981783 4758057 4477616 4698017 4767714 4481498 4269236
10043 4269236 4105075 4682069 4740121 4280361 4973633 5163283 4612995 4951570 4953277 5001100
10033 5001100 4760890 4993003 4903470 5011703 4486734 4306055 4433056 4683899 4811733 4662009
10023 4662009 4306751 4573032 4323046 4390949 4147221 4215761 4280865 4540475 3937983 4295949
10013 4295949 4246907 4026646 4476760 4245749 4093155 4723089 4024755 4240137 4235325 4270872
10003 4270872 4045422 4321541 4099925 3965424 3843615 3830560 4289167 4078456 3756465 3779591
9993 3779591 3697192 3892033 3505586 3902054 4011345 3797003 3571894 3472500 3712040 3325281
9983 3325281 3326025 3260914 3287146 2888903 3528922 3311262 3274084 2915394 3286725 3151665 3020400
9972 3020400 2551874 2512681 2865308 2824384 2704213 2728466 2726117 2967241 2846180 2456932
9962 2456932 2952251 2757968 2163705 2749783 2243078 2497929 2750005 2313266 2310606 2027453
9952 2027453 2613081 2317554 2633325 2500537 2213307 1985954 2328415 2217079 2157229 2362386
9942 2362386 2108933 2139804 1686457 2046805 2074362 2090014 1954994 1674683 2285489 1851085
9932 1851085 1776758 1832555 1885979 1989920 1984004 1688427 2017639 1403903 2318308 1753456
9922 1753456 1752836 1388835 1614613 2374225 2050747 2035783 1735755 1757122 1936346 1457770
9912 1457770 1755329 1959539 1784567 1719606 1531057 2031003 1405071 1588426 1979270 1815703
9902 1815703 1634572 1891791 1565677 1404200 1618228 1732032 1983583 1623328 1721325 1779413
9892 1779413 1703973 1492615 1329272 1991625 1455215 2224456 1920945 1544321 1022640 1898205
9882 1898205 1579730 1510897 1352419 1654984 1719354 1481921 1695536 1919415 1517305 1333206
9872 1333206 1500224 1398549 1558561 1233797 1885753 1668408 1507055 1458859 1743121 1762095
9862 1762095 1214385 1566565 1765547 1694262 1888761 1865271 1221413 782851 1974322 1238230
9852 1238230 1702389 1351352 1572042 1592971 1616926 1620290 1927225 1293190 1778676 1493213
9842 1493213 1484642 1366375 1755761 1576282 1303339 1998051 1545130 1474322 1494727 1456559
9832 1456559 1670186 2163011 1867292 1805235 1348703 1692455 1655855 1571987 1799718 1885038
9822 1885038 2074419 1713583 1143921 1396118 1961406 1430689 1473105 1713351 1626373 1486930
9812 1486930 1124559 1401994 1568626 1163114 1121243 1195366 1722177 1315638 1384196 1581887
9802 1581887 1482014 1299511 1719312 1565193 1687585 1682023 1350452 1479919 1844159 1632760
9792 1632760 1460565 1560521 1263927 1326209 1752689 1894067 1352158 1541424 1125548 1790324
9782 1790324 1390043 1698407 1490048 1243366 1189299 1796894 1663205 820397 1240912 1338240
9772 1338240 1518113 1413221 1253707 1660388 1182588 1531884 1430109 1343240 1228869 1154981
9762 1154981 1386754 1541411 1694966 1167803 1313076 959598 1694350 1259789 1238327 1625700
9752 1625700 792360 1471763 1081389 927561 1171315 814468 1460739 1226796 1601163 1296058
9742 1296058 971945 1116842 1112796 932649 1032070 1132601 948146 1123649 898183 1208304
9732 1208304 1230997 1322915 1432697 1166571 1002081 971745 939055 904005 1292849 992567
9722 992567 1153338 460676 1061996 607577 1209092 743514 898056 639098 1260793 763895
9712 763895 1277801 824722 1213274 1113689 1342422 745106 126558 703305 971683 1027233
9702 1027233 844019 926392 455089 1315912 759354 1091289 1021042 1026595 1194223 546120
9691 700801 876406 822788 669762 1066426 981852 1196199 1193856 621961 708817 639445 552291
9680 552291 274045 1003904 251166 347159 666361 818008 690175 522355 416364 1217730
9670 1217730 796810 566755 665437 930023 989962 730846 429256 235397 1366973 543019
9659 1073090 772364 1143577 844100 1035152 562541 911783 888349 745762 580085 1138537
9649 1138537 272340 1128035 1093784 673787 702205 658632 836634 1022466 782480 1179462
9639 1179462 1195840 648125 1100211 508454 1005253 485783 1195330 819219 467817 964141
9629 964141 1068980 595726 612339 1176804 1122268 497276 786208 341592 1293701 686091
9619 686091 871864 844587 547037 560040 1019271 1025252 916282 694733 890152 1048860
9609 1048860 259893 631139 692758 789343 857620 643954 881723 717454 887000 687979
9599 687979 762080 188953 835444 767805 1321423 983649 1149847 427461 401671 1144625
9589 1144625 698914 122425 726799 833606 705441 588805 897219 1017399 896776 1126260
9579 1126260 759684 403395 339413 917073 739187 1044261 854219 1139828 799580 656692
9569 656692 369378 893085 430936 871026 1195375 399871 1047029 1259524 745093 1160760
9559 1160760 800382 597477 446320 672118 623192 831569 832153 971299 717743 1032345
9549 1032345 162488 930790 984652 392346 951245 822754 805483 750254 633727 687861
9539 687861 755538 1177573 645564 243225 727138 417634 645085 728487 402437 793264
9529 793264 621790 811394 622276 802830 1163376 466436 456548 390533 962777 643839
9519 643839 767920 590405 489521 682560 706857 1098456 753946 922414 510770 359796
9509 359796 615864 413722 526875 460834 298882 957913 402110 394352 828790 937164
9499 937164 507067 769984 385152 473267 301974 331927 688186 413274 350567 850818
9489 850818 347704 434685 253761 462871 237959 -215897 897652 788042 46618 424246
9479 424246 684749 662644 161131 171315 439822 370353 652271 490401 368260 692327
9469 692327 640317 99198 370102 762908 330312 359230 1069450 651816 766543 305706
9458 531539 494780 644604 716168 583944 1107758 123008 803488 539986 520467 188639
9447 438934 418175 413692 826224 229237 546739 417173 658719 821889 436064 562379
9437 562379 578592 202042 725757 283727 625727 527181 462156 572631 429074 799613
9427 799613 158972 683707 532143 887323 96129 413702 742944 552269 6206 267543
9417 267543 496831 480843 506607 600306 274920 558460 234885 570609 565779 144441 838974
9406 838974 607349 190560 690862 306255 680050 361842 659528 268742 387478 530888
9396 530888 1044670 143884 652317 318644 651470 -1338 645366 754737 473638 552867
9386 552867 362847 282323 560206 20452 752781 242882 36766 470310 259924 297316
9376 297316 601553 578450 109021 304593 592980 360805 449265 620292 415731 -64498
9365 583554 803500 535149 18521 496077 203239 579353 246034 10502 838415 205453
9354 407882 204145 248480 366278 238879 234860 643748 366231 375197 -20338 346399 46217
9342 207566 300686 545462 664850 149046 287936 188656 89718 637822 420892 264638
9332 264638 690964 41513 633927 27171 257950 483640 834961 339207 179080 -193020
9321 638101 177827 606155 297976 432367 658644 737094 598282 777332 285639 519514
9311 519514 347982 468271 187255 763209 250059 243120 473335 428188 -346551 288448
9300 269065 188862 346088 -44223 323889 583488 -47403 66241 471348 362547 347205 406021
9289 406021 462446 479099 308179 186547 627666 245698 451758 479036 212302 338143
9279 338143 321168 236850 83751 482771 579788 380007 80237 239005 587490 360162 632488
9268 632488 637256 450613 351994 535324 443656 146809 533764 678735 97388 326094 337745
9257 337745 427173 480350 213486 488975 302022 368963 1104714 521418 1046159 452746
9246 343988 451183 535875 220665 266568 428622 505615 422033 373225 325845 543082 103150
9234 -60449 464146 702290 -284072 220054 749974 299837 659618 596744 379144 428348
9224 428348 77985 273371 -350304 469772 193868 216474 258361 506227 264447 447199
9214 447199 255246 712769 238929 838134 58960 -54218 2491 271127 63483 30927 259334
9203 259334 290660 1033191 556972 851370 674303 632358 -169395 472503 368943 125352
9192 477242 563985 314794 204466 353047 356252 134800 422964 722257 37886 226865
9182 226865 798014 134025 211608 479007 440638 155536 909370 325726 117392 390537
9172 390537 505540 -6408 435315 541995 163672 40246 216011 540067 547485 728614 403772
9161 403772 740088 381767 495694 156972 644840 198548 462277 512569 487225 38144
9150 451627 -14416 334638 375981 184956 458871 290154 846749 -233968 629352 290215
9139 648509 160309 275320 791141 12608 726334 875806 379438 372234 403786 456042 370290
9128 370290 342394 311899 354592 508283 730191 323979 172651 240109 652138 280016
9117 702568 95612 281809 376321 -204144 744612 109968 25198 504259 308780 490560
9107 490560 386187 302487 814351 258373 500544 -134005 69620 260815 487099 781231
9097 781231 1002753 205451 525866 156429 419404 421910 461196 387115 332092 532197 631673
9086 631673 510786 9137 327694 516842 331396 229814 230285 342738 430583 447713 525762
9075 525762 655479 233164 346927 959083 429372 871174 565752 738111 428541 299814
9065 299814 503288 427393 262438 409389 746706 97844 453435 230475 448306 588324
9055 588324 701141 -142414 316256 41557 162608 285760 -15077 548495 558005 686913
9045 686913 537641 69521 561853 410896 224885 559295 365222 52996 506411 665845
9035 665845 133030 463339 454679 285311 -44767 333680 651735 294103 12538 394954
9025 394954 220830 197898 396808 250890 -211942 53325 687154 153877 200979 423560
9015 423560 354303 230454 270396 405499 472507 -141743 467902 209467 283647 404141
9005 404141 475818 365942 -324806 313654 105758 112037 177758 36778 185815 545871 363673
8994 363673 -77346 448761 -65238 283085 145427 -161548 484227 405311 592067 585508 685175
8983 685175 511015 296528 937032 322116 456757 58490 346188 494017 242339 706001
8973 706001 273517 171809 179731 846097 159353 445344 -162029 465922 -230632 125378
8962 161654 253929 364859 264843 1050660 178678 410606 508960 50792 875376 416889
8951 -189151 219818 349690 798777 377547 689072 418822 414512 633068 724033 263209
8940 461791 499499 398458 378864 312387 447489 358895 628067 262662 608272 761001
8930 761001 111627 576186 689296 323083 579087 298981 426887 949927 447945 -104927
8919 -314495 61364 191866 447828 457722 577306 656016 309980 44071 566641 404574 589296
8908 589296 852339 768815 811541 488850 587127 447226 1115220 547279 950730 981340
8898 981340 864182 1007635 685236 749683 744046 828287 585874 1040952 1025979 870351 800518
8887 800518 780459 783201 852651 839665 1101109 1057168 908292 782199 1288140 140658 1040440
8876 1040440 1093988 632130 1115527 688711 850892 702664 1302402 702651 1087055 1130150
8866 1130150 818783 1086873 1041051 729389 960609 734746 958497 520372 927258 1006458
8856 1006458 820845 501564 621187 755099 1036014 948231 656258 686877 391158 1093685
8846 1093685 739177 903520 887635 663989 778669 659283 493123 676408 682612 692086
8836 692086 360006 785440 533260 766164 525713 541397 404415 431625 299703 568103
8826 568103 666406 680102 340808 137841 318019 758310 820596 418870 193668 419642
8816 419642 519171 272380 308385 496602 610346 366627 286505 342645 186321 408504
8806 408504 816594 383598 99308 439458 399779 647091 460459 6800 366296 405509 39030
8794 -69708 67826 107893 166173 553379 189170 495411 487351 446443 610887 108233 892704
8783 892704 -70754 271971 33053 424159 627736 719421 622652 227111 234483 38755 383147
8772 383147 250750 297271 408645 294935 412997 273633 739524 118734 25635 -343255
8761 555590 214653 75480 809109 316745 279827 -240593 53530 301409 31992 652945
8751 652945 379185 317516 244931 830737 587680 136139 448437 535138 282090 510331
8741 510331 285067 -43504 781121 233279 -52542 557284 179010 278113 -4169 488704 117309
8729 216163 289260 587873 247341 -180565 724320 -50797 473563 445210 60188 291411
8719 291411 490996 62128 62902 -109899 -110521 343844 332351 77811 -85455 56721 316073 85936
8706 147603 644318 429534 266819 -424574 -209841 -51489 79467 329350 -46744 367900
8695 601011 278119 249221 390562 482423 397138 8874 134435 186698 285996 360831 177991
8683 436267 350018 1078118 -210165 -62430 533498 94857 222430 537408 339717 217120
8673 217120 363194 238946 494904 -377156 -125518 322043 399793 8341 200112 440723
8663 440723 -27904 9888 505832 800356 101910 486497 117842 263710 -107127 311858
8652 213440 70631 -271722 390604 58541 195315 113064 431997 559893 574667 522918 180406
8640 597260 351109 247239 94574 362156 231604 121744 294977 254680 556464 226078
8629 360997 384174 275944 176882 480657 164463 285634 168041 377301 774739 -75801
8618 734621 -93382 449184 -251630 410328 242037 547992 -281511 328285 335498 753112
8608 753112 206801 313664 190521 55931 163703 -26950 114252 149552 -21673 421231
8597 369264 333225 234256 -26387 31090 302026 412396 16977 -47013 253592 175627 255025
8586 255025 326122 139716 466932 283441 272310 274807 178626 -203999 17472 284324 338682
8575 338682 194535 -12560 87935 237307 293653 90374 37196 229597 152133 252830 -66219
8563 425325 564884 -27763 241684 98139 121883 81982 440605 -30898 -175231 35480 360699
8552 360699 281834 169083 245426 189795 133404 210272 639578 444050 77448 314051 417603
8541 417603 208841 480369 511155 -99122 -264662 81554 -312327 156959 215804 494908
8531 494908 462895 487894 -53864 111016 322136 -256128 554217 683815 349811 138739
8520 580440 56837 217706 769614 24342 464906 635174 505929 -99452 241645 552935
8510 552935 266298 -70794 345558 314200 -34119 50157 424027 233622 583754 68449 146466
8499 146466 267829 741656 435103 191355 194640 1011367 424161 270023 150921 93806
8489 93806 -102314 240073 358461 273318 88745 103266 275223 72717 41084 -33148 136773
8477 -44422 228438 196472 430671 676935 262982 189339 359912 196392 81477 -336800
8466 205915 291766 863490 -36896 268095 508707 38199 86315 86246 293097 -212866 608218
8454 487517 82241 885688 420782 -318465 233347 11460 158770 400093 278372 262647
8444 262647 -65870 -157645 273177 103996 435424 568593 -195677 498660 336914 -143493
8433 455548 611496 498582 642199 233449 388122 23195 -375307 -29241 544818 483513
8423 483513 533854 308828 -1356 -49420 110677 218121 164162 76847 -30354 449021 366583
8412 366583 123975 134863 147610 86340 465243 438748 674585 48775 605270 397276 27879
8400 76359 250091 55588 357620 828940 343870 453403 380371 107355 43412 195482
8390 195482 56494 -159113 -130645 207202 331975 89647 300189 -174030 245039 13005
8379 -118624 299352 308441 245587 533935 -227248 340488 123407 328825 679994 405050
8369 405050 144097 251631 361492 -233152 80580 164242 134424 17431 -28755 98873 276802
8358 276802 -175715 326859 872668 20496 -67302 395355 -461852 -27318 797039 641075
8348 641075 261209 232445 322834 163620 -184595 -46004 89460 425106 263204 189055 307573
8337 307573 -393236 310637 275471 469171 319877 533488 425311 266397 177805 127636
8327 127636 179898 -76060 83493 269857 10988 684300 171231 389599 -169572 -123948 506438
8315 -31278 65210 163939 -352254 426113 439301 368327 635538 658453 372172 548083 182387
8303 601237 669979 -17947 135533 366044 -9198 535833 -26485 163155 190327 32541 -289916
8291 390628 504234 190713 240848 126950 324896 131298 -130268 39164 -557536 -224947
8280 113517 342873 277172 78240 380885 186084 526283 337315 178833 435508 138286
8269 351806 -106306 38525 234681 289307 210318 59792 -157497 358287 750345 247192
8258 -168307 238360 345132 -66368 324479 -69746 451479 754525 283130 735359 197616
8247 59144 182914 132574 375803 199922 312311 425250 265418 146006 78437 13858
8236 20581 205505 297716 99159 482264 478701 213828 237183 204131 -21425 177149 324134
8225 324134 404101 -11593 462165 126179 -70019 -57547 345645 -240729 455782 591528
8215 591528 310047 782 160409 282861 355426 -89671 27515 83775 272428 288596 318113
8204 318113 -46688 438078 129467 169009 430470 61368 20409 319280 -232731 737610
8193 19511 143641 195665 363704 -163061 100333 424332 253986 -202365 375885 307764
8183 307764 411032 -144145 105014 837512 -57476 -227782 183225 304533 -12771 -69724
8173 -69724 489631 197606 220334 142500 145708 -235540 100979 67783 491709 129880 58404
8161 43323 301790 2988 62553 306624 437909 369473 -10109 330243 -2575 615251 12060
8149 96269 479254 65396 -233533 365366 325716 -60137 457243 -239954 464184 525339 447150
8138 447150 354776 -58730 16944 326755 -173202 -281617 -514513 -143806 -61197 613239
8127 394277 391661 313028 -146709 -188128 -6711 399935 186293 873149 173272 245831 -6977
8115 115261 174464 -144972 351769 510395 545882 204052 -18138 357123 20659 303256
8105 303256 94129 667734 298354 89367 204525 402121 117551 57915 784008 -212600
8094 -109086 -484532 402012 504999 397949 167678 301219 354266 492557 120847 205176
8084 205176 -184406 236247 183019 -10861 416142 -120242 368245 -101077 -94028 -3428 -267174
8073 -267174 245908 404256 8540 407945 217232 446160 428270 281325 131932 443011
8063 443011 106531 152043 -71863 -69305 242493 39885 333498 -105901 -9822 246580 -98841
8051 379722 94917 382147 567716 509883 305134 308659 201174 -156398 117418 219369
8041 219369 94896 213928 -93572 227206 476451 321735 314371 8799 128793 332407 583441
8030 583441 131471 -13842 213899 -477024 438802 391492 83589 84334 293396 -69914 575154
8018 -251118 299845 -170357 84753 365524 -50759 240411 -12506 -107548 -113284 477694 167417
8006 696533 153582 148254 418016 -247097 -55497 133151 637490 203647 34030 103707 352093
7995 352093 66022 417707 398290 -53257 391768 357116 32321 659198 29677 391739 73173
7983 134665 299147 -147875 389907 -78229 89058 -228706 386541 259325 360822 -19803
7972 -80503 121515 19557 -42333 290514 183159 754283 483325 195930 234828 45404 31925
7961 31925 269840 -127900 278165 -264196 735450 -112825 42888 -2319 381940 160653
7950 -106305 -66424 662224 -18864 -31086 280742 40146 228350 361590 83668 382497 78111
7938 -29421 388196 476017 178540 63059 421230 424817 -196606 99676 379010 -182758 238953
7926 366269 359782 132545 -98866 534253 -115577 420672 277776 105879 87477 -202580
7915 53144 192891 238650 266803 138647 66202 298600 -360194 70399 128452 -185786 323685
7903 197655 510545 46832 302243 100987 178756 247930 661093 -32307 265606 -224576
7892 389948 180520 86550 428053 525064 237110 205582 105211 106219 -51690 -224303 -23682
7880 265644 110594 474541 292050 210424 28007 -497671 523227 528263 262325 429097
7870 429097 -407462 352221 162579 330682 373287 51251 -122928 6633 25910 90366 -19283
7858 304306 139539 392894 332562 230844 341748 209108 -202183 414500 -111505 54345
7847 189448 87780 123839 296648 153607 264064 -140338 507297 710587 429556 260753
7837 260753 -250985 347690 61341 -188476 -8707 -568412 449190 263296 194389 -249981
7826 -70430 317447 116613 455575 339490 299942 21280 574063 194004 200053 425817 227408
7815 227408 318624 102305 -98569 183299 182774 -6458 248586 67939 323605 -339789 324121
7803 -35776 320535 54241 -344986 -240209 -8472 -48810 516025 517971 368315 24730 336438
7792 336438 349128 -50937 -171725 -121717 225921 -49605 38966 146045 -87470 -459674 -88342
7780 308898 137466 319772 -248415 3157 171969 -408096 483899 -123806 65735 301196
7770 301196 438658 50803 -49549 -155064 -96106 89179 55800 296719 46228 340180 107946
7758 375029 -75283 398660 481245 384308 680546 -35160 304610 250482 205996 470724 -318710
7746 -211511 -304341 -108436 485624 230524 315993 192534 -4670 182340 84532 -107019 -14449
7734 401802 111324 390959 -104514 630214 380546 172102 490036 540312 -136359 94626
7723 124542 166954 299686 242825 -188553 452193 173052 -15515 293971 347031 39813 -54872
7711 275593 424678 255106 551016 360096 133222 478103 -168276 495582 341577 189029
7701 189029 25997 577325 330281 168735 8875 60857 164492 537487 83522 303241 152840
7690 152840 189725 114015 -214153 63132 -336739 139053 303581 121600 273835 167978
7680 167978 128844 -48843 225306 372216 422747 275974 379132 -247308 404387 455148
7670 455148 117609 71900 -100436 103790 344248 -39353 262585 449005 79249 263649
7660 263649 136939 254038 -179745 450623 -93673 3016 -54641 313028 -119232 569165
7649 -183814 447886 122209 710320 -322296 182645 347608 -50778 116293 -186981 457900
7638 -31804 102364 280642 531269 455432 19019 259698 314150 -146555 46179 -207246 222136
7626 -230814 59722 363359 336947 20921 222896 152177 -51236 313486 141318 160177 311120
7615 311120 366383 85667 120557 -435651 -5707 200270 68906 -177519 108023 -539639 24441
7603 496922 -153039 138413 421544 -114812 412587 194851 140129 -158571 -128981 -137579
7593 -137579 226902 67809 201541 256293 383325 -29728 234210 195440 49912 576694 654589
7582 654589 -694234 657051 118679 147732 -200562 175506 66495 96630 -190161 269279
7571 114021 266365 305699 167234 -350986 469371 102096 346771 147578 231715 -318651
7560 326426 -145220 744101 473644 -302605 -51569 678063 74751 446835 368839 166366
7549 373754 427047 206991 151723 523344 531525 67897 -209344 193790 112254 -314865 -104147
7537 23572 -379214 -303311 -48114 -292253 305867 69263 260118 153916 191742 -238236 -72806
7525 247348 137736 339344 273880 267405 41300 228154 120359 413349 -4311 -132723 162783
7513 42024 172475 55880 481006 -293854 483051 403 -220295 724758 -73762 171891 415793
7502 415793 -85150 33924 -412639 248130 -6831 -38230 360989 -5879 262606 82375 346089
7491 346089 77468 -368116 442415 -16195 461098 157179 285381 511595 -212760 -161397
7481 -161397 -193541 -310375 141294 -275368 -244645 495186 168673 -63027 119292 580624
7471 580624 158613 59714 40325 -49694 -170347 246622 86619 132459 398934 -84179 356518
7459 267169 -15575 75403 -288420 86240 -350643 261728 372268 550028 227797 406543
7449 406543 -33651 209075 71078 52065 261631 120851 -156400 422568 280610 226939
7439 226939 278773 -434676 331440 272754 508730 -314163 97458 420288 303546 1079 -139310
7427 97361 70735 183707 358245 539282 293333 -144725 495702 -81395 3579 15843 568233
7416 568233 532197 203273 318647 286811 -122115 219866 -11661 334381 283224 452228
7406 452228 426206 -185558 481238 306293 -125617 129239 19500 203722 -150698 413949
7395 115338 129383 211464 -18792 195335 361715 -294778 317762 133656 587 464873 -250406
7383 128093 291272 335498 583202 -270411 88657 240142 332051 506757 -49216 549670
7372 39575 -89357 349756 -54854 253902 215528 86526 32158 165177 147989 -189049 -187463
7361 -187463 -428848 -58228 61323 15869 -50585 -36392 627641 -148093 366103 -41066 6889
7349 -452890 90118 16862 228674 232826 358499 177476 447881 200317 -57686 595959 229830
7337 283618 271907 280969 134927 42787 372308 -149269 -63936 -170169 176435 -339441 479094
7325 168131 51363 266992 251655 -239925 104985 -38431 -287647 68588 -27197 -120726 336630
7313 121123 28803 273358 -144889 90508 146063 280721 108051 -368797 -32732 370757
7302 286824 -162687 143569 224856 -18058 284647 252632 254358 91476 112773 -81146 231065
7290 20659 510351 237448 251292 241779 128369 54566 59716 288784 158135 350581 29340
7278 479863 117857 252100 -331751 -201962 -167062 -100021 241412 718648 600999 -325970
7267 -16743 313260 -119660 100185 552838 288026 282095 616025 101443 -189585 9946 150335
7256 150335 213526 141293 -229638 91962 -77114 309688 73107 432969 9865 45463 361230
7245 361230 200525 381312 508080 355632 -135258 60016 529575 -2663 157135 -34623
7234 58252 168368 422421 130354 560552 146934 299925 419578 401563 212077 -114772
7223 204556 91888 56556 205030 -171767 27987 -94805 167966 170232 -180230 143788 73686
7212 73686 -102064 -3283 215583 210822 -185897 -84349 -198956 -8108 -172876 49627 254939
7201 254939 -91041 213110 -30908 -296916 10658 227530 272454 -444497 278486 55755 298917
7190 298917 -118236 355035 126451 170700 18753 76637 42199 121591 -6973 135506 -37068
7178 380003 211275 -161724 -120644 27198 -361938 960402 51728 113206 320753 101970
7167 48376 323700 505744 -196029 182731 325630 99030 -58579 521521 -84873 -153282 314558
7155 -127335 109140 1363 148389 790388 -23586 374005 25684 194051 -84998 58879 -348346
7143 270386 34225 -10971 -86956 381363 -461716 233432 483098 345911 372363 308371 590498
7132 590498 -363524 117957 -21107 451044 395106 263121 435339 187920 473244 -142442
7121 -53813 70444 -184615 160422 -189755 -182527 -208226 -119322 383808 66317 366365 20022
7109 202698 796462 -9601 224325 402779 -429278 39453 245666 220356 -316452 -193229
7099 -193229 -271646 390289 127191 335298 -171419 304511 204781 -75677 334249 86054
7088 241490 -174376 -155074 21593 40300 -191667 389385 53010 163704 271557 -131870
7077 95959 -284378 422294 320364 545408 -20737 235730 -57574 143244 -33034 203400
7066 424918 410647 -493909 -461136 716395 429334 189886 250606 259841 -38041 321867 -342047
7054 438733 76072 227651 -27102 287888 14364 123323 347902 -286173 180339 -81816
7043 63048 588027 340720 -99319 -80724 -255595 -159507 110680 320192 -146596 148804
7032 343191 138898 79493 -404100 -14400 235015 69682 95456 473863 316169 517269
7022 517269 83125 -95543 419001 211504 130290 -11634 310219 -66537 -64242 130643 460955
7011 460955 -6578 116701 192560 213646 167312 8767 -17649 293871 47757 564469 28106
6999 509548 -344225 -187972 -205853 114222 88750 -284601 -326879 256738 -32258 -154952
6989 -154952 100528 -180418 190179 214799 155125 -89301 478814 -121826 190000 502120
6979 502120 -56970 548941 -269 227433 -20768 474668 414761 21583 260294 496272 516886
6968 516886 22044 112803 32177 -568808 -252686 -403707 -10657 83506 -234768 -23702 -146690
6957 -146690 301898 163348 -76720 177643 -41355 352285 240272 112005 37432 -259250
6946 -374542 788636 217187 -185942 57244 -168847 318979 331868 490063 -79750 -81203 -172481
6935 -172481 214609 238282 259261 -365893 270515 281027 -123840 577951 661021 -579896
6924 195196 292532 317119 222707 481917 176189 -175592 252004 -278133 279685 46547
6913 95031 59292 221822 311025 512219 -193821 321 -74385 291952 281817 -168943 -98130
6902 -98130 38349 -35825 397490 325832 273542 44953 -330526 313563 359701 -447715 -341175
6891 -341175 -205298 208250 102731 129561 62961 10315 588777 71263 -16477 -340316 -181163
6880 -181163 -290859 60015 94157 -120271 24019 496303 49030 189403 -12775 49904 -78233
6868 -4997 351262 -208225 34375 299709 -395472 234532 401297 -279677 -114902 650874
6857 -139219 263989 17341 219964 157874 268397 344034 -110996 157581 -104388 233230
6846 69481 68103 58469 47295 472603 188623 241012 -182310 -426730 81296 200389 182145
6835 182145 -143985 -1011 -302675 -18892 -19291 -147494 -41792 -143244 328473 -413254 192877
6823 373758 -188251 160454 308377 -39374 -108795 211065 -58058 -291819 296699 237432
6813 237432 341665 119414 208765 -10106 -58569 -97101 346947 310504 140354 35158 150338
6802 150338 218427 -51150 -122561 -179392 -51008 207788 -267888 101056 -346531 171269 127923
6791 127923 223516 42872 77201 110117 165099 320529 333481 -108393 237793 -359456 -32307
6779 -219965 272872 615941 -69508 -70607 27701 -78680 103635 4515 321164 -92987 215613
6767 189195 211210 -73356 530934 346074 397633 154614 -160782 307055 345496 -93551 93342
6755 97332 330281 125818 186001 -66645 478847 -175225 405953 231845 13666 -157690
6744 102899 191083 -200952 66361 169250 -42891 331318 112578 334444 -370896 95667
6733 -622211 34465 234691 -147235 255202 -322594 158026 217548 -64714 -344981 54423
6722 513264 291243 -353923 100085 383426 298198 -159251 -496480 37356 -236957 -213731
6712 -213731 261211 70413 16103 -79177 70298 538881 355567 148231 290319 67717 187955
6701 187955 337268 315853 102244 -182869 185847 290558 94668 296831 -370778 87944
6690 511112 -61411 309755 254620 263135 169396 208942 155788 117212 77152 39451 245026
6679 245026 186525 44812 -53422 50394 137493 337978 -104671 192734 -34970 -290643 -25113
6667 -56157 4280 174530 101574 129267 548117 -380718 -253149 124373 644441 122579 208377
6656 208377 -121202 342077 -132312 176307 -87450 325153 -216114 445202 -472311 413102
6645 317228 258339 25811 469898 -35373 27768 -306461 28788 270669 -34946 -127713 112001
6633 -209041 112150 590518 -75639 204515 223346 145294 43120 -105075 179541 243265 225040
6622 225040 -180623 286340 360392 -159695 -66704 363144 95618 274254 157022 248090
$$ [...]
##END NTUPLES=NMR SPECTRUM
##END=
