##TITLE=Coffee green (M5-ROVE90 + 1.5mL buffer 50/50,  450uL extracto + 50uL (D2O+TMS))
without heating, vortex and centrifuged, temperature 0oC.
##JCAMPDX= 6.0         $$ Bruker NMR JCAMP-DX V2.0
##DATA TYPE= NMR SPECTRUM
##DATA CLASS= NTUPLES
##ORIGIN= Bruker BioSpin GmbH
##OWNER= Administrator
$$ 1.72 TOPSPIN		Version 2.1
$$ 2012-05-22 16:17:20.497 -0700  Administrator@X
$$ Compression mode = diff/dup
##.OBSERVE FREQUENCY= 400.13188198
##.OBSERVE NUCLEUS= ^1H
##.ACQUISITION MODE= SIMULTANEOUS (DQD)
##.ACQUISITION SCHEME= undefined
##.AVERAGES= 64
##.DIGITISER RES= 22
##SPECTROMETER/DATA SYSTEM= spect
##.PULSE SEQUENCE= noesygppr1d
##.SOLVENT NAME= H2O+D2O
##.SHIFT REFERENCE= INTERNAL, H2O+D2O, 1, 14.97969
##AUDIT TRAIL= $$ (NUMBER, WHEN, WHO, WHERE, PROCESS, VERSION, WHAT)
$$ ##TITLE= Audit trail, TOPSPIN		Version 2.1
$$ ##JCAMPDX= 5.01
$$ ##ORIGIN= Bruker BioSpin GmbH
$$ ##OWNER= Administrator
$$ $$ C:\Bruker\TOPSPIN/data/jwist/nmr/11-coffee-green-quantification-2/361/pdata/1/auditp.txt
$$ ##AUDIT TRAIL=  $$ (NUMBER, WHEN, WHO, WHERE, PROCESS, VERSION, WHAT)
(   1,<2011-11-18 17:04:53.669 -0500>,<Administrator>,<TOPSPIN>,<go>,<TOPSPIN 2.1>,
      <created by zg
	started at 2011-11-18 16:55:58.919 -0500,
	POWCHK enabled, PULCHK disabled,
       configuration hash MD5:
       DA 63 81 1B EF 4C B5 72 B4 DF EA D9 B4 DB 4C 08
       data hash MD5: 64K
       86 3D 23 68 2D 5E 74 36 72 00 33 BD 7C CF DD 6A>)
(   2,<2011-11-18 17:05:42.716 -0500>,<Administrator>,<TOPSPIN>,<proc1d>,<TOPSPIN 2.1>,
      <Start of raw data processing
       efp LB = 0 FT_mod = 6 PKNL = 1 PHC0 = 0 PHC1 = 0 SI = 32K 
       data hash MD5: 32K
       32 B4 AF 55 5D A5 0B 0E 19 E4 8B 64 11 3F B7 20>)
(   3,<2011-11-18 17:05:43.091 -0500>,<Administrator>,<TOPSPIN>,<proc1d>,<TOPSPIN 2.1>,
      <pk PHC0 = 22.52747 PHC1 = 0 
       data hash MD5: 32K
       7C C0 51 4E 43 91 C9 DF BC B7 6B FB 8C E5 B9 38>)
$$ ##END=
$$ 
$$ $$ hash MD5
$$ $$ 86 4A 1E 17 0F 55 83 C0 59 28 0D 46 85 5B A6 CE
##$RELAX= 
##$RELAX= 
##$RELAX= 
##$RELAX= 
##$RELAX= 
$$ Bruker specific parameters
$$ --------------------------
##$DU= <Z:>
##$EXPNO= 361
##$NAME= <11-coffee-green-quantification-2>
##$PROCNO= 1
##$TYPE= <nmr>
##$USER= <jwist>
##$ACQT0= -8.16505617666767
##$AMP= (0..31)
100 100 100 100 100 100 100 100 100 100 100 100 100 100 100 100 100 100
100 100 100 100 100 100 100 100 100 100 100 100 100 100
##$ANAVPT= -1
##$AQSEQ= 0
##$AQ_mod= 3
##$AUNM= <au_prof>
##$AUTOPOS= <>
##$BF1= 400.13
##$BF2= 400.13
##$BF3= 400.13
##$BF4= 400.13
##$BF5= 400.13
##$BF6= 400.13
##$BF7= 400.13
##$BF8= 400.13
##$BYTORDA= 0
##$CFDGTYP= 0
##$CFRGTYP= 9
##$CHEMSTR= <none>
##$CNST= (0..63)
1 1 145 1 1 1 1 1 1 1 1 1 1 1 1 1 1 1 1 1 1 1 1 1 1 1 1 1 1 1 1 1 1 1 1
1 1 1 1 1 1 1 1 1 1 1 1 1 1 1 1 1 1 1 1 1 1 1 1 1 1 1 1 1
##$CPDPRG= <>
##$CPDPRG1= <>
##$CPDPRG2= <>
##$CPDPRG3= <>
##$CPDPRG4= <mlev>
##$CPDPRG5= <mlev>
##$CPDPRG6= <mlev>
##$CPDPRG7= <mlev>
##$CPDPRG8= <mlev>
##$CPDPRGB= <>
##$CPDPRGT= <>
##$D= (0..63)
$$ [...]
##$TP= (0..7)
150 150 150 150 150 150 150 150
##$TP07= 0
##$TPNAME0= <>
##$TPNAME1= <>
##$TPNAME2= <>
##$TPNAME3= <>
##$TPNAME4= <>
##$TPNAME5= <>
##$TPNAME6= <>
##$TPNAME7= <>
##$TPOAL= (0..7)
0.5 0.5 0.5 0.5 0.5 0.5 0.5 0.5
##$TPOFFS= (0..7)
0 0 0 0 0 0 0 0
##$TUNHIN= 0
##$TUNHOUT= 0
##$TUNXOUT= 0
##$USERA1= <user>
##$USERA2= <user>
##$USERA3= <user>
##$USERA4= <user>
##$USERA5= <user>
##$V9= 5
##$VALIST= <valist>
##$VCLIST= <CCCCCCCCCCCCCCC>
##$VD= 0
##$VDLIST= <DDDDDDDDDDDDDDD>
##$VPLIST= <PPPPPPPPPPPPPPP>
##$VTLIST= <TTTTTTTTTTTTTTT>
##$WBST= 2048
##$WBSW= 25
##$XGAIN= (0..3)
0 0 0 0
##$XL= 0
##$YL= 0
##$YMAX_a= 5317801
##$YMIN_a= -1855034
##$ZGOPTNS= <>
##$ZL1= 120
##$ZL2= 120
##$ZL3= 120
##$ZL4= 120
##$ABSF1= 0
##$ABSF2= 0
##$ABSG= 0
##$ABSL= 0
##$ALPHA= 0
##$AQORDER= 0
##$ASSFAC= 0
##$ASSFACI= 0
##$ASSFACX= 0
##$ASSWID= 0
##$AUNMP= <proc_prof1d>
##$AXLEFT= 0
##$AXNAME= <>
##$AXNUC= <1H>
##$AXRIGHT= 0
##$AXTYPE= 0
##$AXUNIT= <>
##$AZFE= 0.1
##$AZFW= 0.1
##$BCFW= 0
##$BC_mod= 0
##$BYTORDP= 0
##$COROFFS= 0
##$CY= 15
##$DATMOD= 1
##$DC= 0
##$DFILT= <>
##$DTYPP= 0
##$F1P= 0
##$F2P= 0
##$FCOR= 0.5
##$FTSIZE= 32768
##$FT_mod= 6
##$GAMMA= 0
##$GB= 0
##$INTBC= 1
##$INTSCL= 1
##$ISEN= 128
##$LB= 0
##$LEV0= 0
##$LPBIN= 0
##$MAXI= 10000
##$MC2= 0
##$MEAN= 0
##$ME_mod= 0
##$MI= 0
##$NCOEF= 0
##$NC_proc= -7
##$NLEV= 6
##$NOISF1= 0
##$NOISF2= 0
##$NSP= 0
##$NTH_PI= 0
##$NZP= 0
##$OFFSET= 14.97969
##$PC= 1
##$PHC0= 22.52747
##$PHC1= 0
##$PH_mod= 1
##$PKNL= yes
##$PPARMOD= 0
##$PPDIAG= 0
##$PPIPTYP= 0
##$PPMPNUM= 2147483647
##$PPRESOL= 1
##$PSCAL= 4
##$PSIGN= 0
##$PYNMP= <proc.py>
##$REVERSE= no
##$SF= 400.13
##$SI= 32768
##$SIGF1= 0
##$SIGF2= 0
##$SINO= 400
##$SIOLD= 32768
##$SPECTYP= <>
##$SREGLST= <1H.CDCl3>
##$SSB= 0
##$STSI= 32768
##$STSR= 0
##$SW_p= 8223.68421052631
##$SYMM= 0
##$S_DEV= 0
##$TDeff= 65536
##$TDoff= 0
##$TI= <>
##$TILT= no
##$TM1= 0
##$TM2= 0
##$TOPLEV= 0
##$USERP1= <user>
##$USERP2= <user>
##$USERP3= <user>
##$USERP4= <user>
##$USERP5= <user>
##$WDW= 1
##$XDIM= 32768
##$YMAX_p= 449130408
##$YMIN_p= -40920645
##$CURPLOT= <Network HP LaserJet P1505>
##$CURPRIN= <$Network HP LaserJet P1505>
##$DFORMAT= <normdp>
##$LAYOUT= <+/1D_H.xwp>
##$LFORMAT= <normlp>
##$PFORMAT= <normpl>
##$SURQMSG= 1
$$ End of Bruker specific parameters
$$ ---------------------------------
##NTUPLES= NMR SPECTRUM
##VAR_NAME=  FREQUENCY,     SPECTRUM/REAL,   SPECTRUM/IMAG
##SYMBOL=    X,             R,               I
##VAR_TYPE=  INDEPENDENT,   DEPENDENT,       DEPENDENT
##VAR_FORM=  AFFN,          ASDF,            ASDF
##VAR_DIM=   32768,         32768,           32768
##UNITS=     HZ,            ARBITRARY UNITS, ARBITRARY UNITS
##FACTOR=    0.250966925370066, 1,           1
##FIRST=     8223.43324360094, 288175,       -196500
##LAST=      0,             73898,           -232285
##MIN=       0,             -40920645,       0
##MAX=       8223.43324360094, 449130408,    0
$$ Real data points
##PAGE= N=1
##DATA TABLE= (X++(R..R)), XYDATA
$$ [...]
22986 404313 710502 660509 747728 754037 616182 883775 530528 1055034 915712 705826
22976 705826 885479 773014 890334 1030638 1163086 1108777 896871 1183397 1067459 1204747
22966 1204747 973333 1437244 1326488 1120078 1098053 934544 1295169 855151 1050113 1186028
22956 1186028 1269023 1421393 1599199 1488946 1134542 1629888 2234157 1938763 2060198 2310032
22946 2310032 3291874 4320039 5228507 6826838 8052729 10327861 12519434 14989933
22938 14989933 17689133 20027519 21983828 23143110 25017669 25200352 25363469 25548590
22930 25548590 24825526 23469642 21068745 19141467 17053175 15048086 12929187 11074469
22922 11074469 9048771 7771449 6286567 5380396 5479021 5233277 4797547 5967106 6574290
22913 6574290 7381537 8599763 10699914 12395996 15255329 18380901 21835924 25426239
22905 25426239 28772875 31949728 35280573 37257439 39432431 41001098 41881018 42162456
22897 42162456 40712203 38742189 36712716 34373575 31982193 28517437 25829302 22587183
22889 22587183 19970559 17831103 15856956 14356044 13729231 13119247 13242085 13208156 12865814
22880 12865814 13882942 14167050 15061013 16341991 17137774 18050463 18540938 19206179 18937683
22871 18937683 18505968 18567617 17465535 17605964 16023748 14996027 13659888 12122520 11070750
22862 11070750 9836568 8335109 7493496 6687380 5696006 5207582 4336086 3335749 3108904
22853 3108904 2767153 2587083 2795092 2705350 2203821 2142282 1984989 1994981 1787560 1491284
22843 1491284 1683582 1212320 1945493 1262498 1533697 1354823 1287958 1105154 1048375 1465897
22833 1465897 1437554 1369503 553695 1431329 788250 1003529 809322 1412253 1079721 1158450
22823 1158450 610140 981688 1311980 1168340 774350 935989 1312934 857434 1011664
22814 1011664 830304 831336 1043466 1085790 917361 666517 905697 1060721 1100819 853045
22804 853045 1050267 1006947 1145793 831847 1257286 433619 1029972 791749 823796 668711
22794 668711 1011253 1300527 789235 1011441 610917 709588 1052845 865210 416654 1364272
22784 1364272 681508 948558 429352 797404 1038303 941670 809302 868551 772886 609794
22774 609794 607234 964603 819557 909094 785546 674661 711502 725667 -4312 1053502 825052
22763 825052 804360 1175187 20910 713017 860181 352311 926151 779756 600844 518087
22753 518087 500527 747318 922107 522366 352646 441444 302205 953536 32379 935987
22743 935987 454548 695841 741985 522643 644342 526670 744565 987002 437470 728782
22733 728782 473123 704891 312767 425746 659997 646125 889388 885624 949156 668481
22723 668481 669483 492393 652264 915310 547656 767924 661431 903520 573987 744897
22713 744897 517252 712854 520098 387230 832465 859855 1000738 103486 989162 481750
22702 358564 214708 737614 341451 1157423 518800 706589 228705 750220 377264 547489
22692 547489 815032 564757 562550 375710 296594 544878 482287 101712 1021202 571886
22682 571886 1041761 543015 451043 798849 373535 858581 1076533 668251 48097 627939
22672 627939 546762 1185777 890851 527829 599682 841818 270553 794194 828522 657478
22662 657478 650960 975603 803257 1039264 852561 533138 194886 797126 673682 882970
22652 882970 535840 761826 490115 893084 376941 734684 596812 757175 611963 739093
22642 739093 372333 709413 700390 288202 1058356 616863 836882 564652 207419 622821
22632 622821 560771 962927 1296101 726701 544833 532903 621450 1603279 1123907 607419
22622 607419 565859 801671 825727 971592 722174 633741 803250 937120 806750 728797
22612 728797 863369 858940 835535 1169396 838400 554716 858752 974906 921757 841571
22602 841571 774408 1045190 902316 926949 418438 997352 1166267 934722 1212445 645652
22592 645652 451399 1376894 991400 1291474 962921 763588 1447976 804366 1310856 1159607
22582 1159607 1319652 1062238 1299359 645124 1154527 1189484 1044062 937838 1189558 998737
22572 998737 1016164 779171 578966 580321 573854 1109145 1091664 911540 980666 1140145 1018121
22561 1018121 994512 1201637 928385 1523560 1209862 1439892 1368528 1107951 872397 982909
22551 982909 696889 1447762 765732 881522 1422656 735464 987319 874635 1224667 640559
22541 640559 1108104 869733 881708 1188189 703931 905882 1218905 750037 504329 996726
22531 996726 538253 1252454 939425 713849 1209152 852769 1018899 746219 794209 957214
22521 957214 963876 932483 1053503 986949 917178 766347 809779 548412 836154 1427295 1037527
22510 1037527 1221303 518655 1005455 859118 588965 960471 830464 822327 818192 980890
22500 980890 476441 855999 1050636 95934 1183442 999645 539739 655075 1272105 1152511
22490 1152511 1334058 732795 894897 1132963 776644 1123854 1018651 975257 1081325 715022
22480 715022 1293429 1722978 1327171 431408 762886 569333 1146412 966486 1111152 840484
22470 840484 1023222 873793 973818 677651 1068680 1178654 1018480 757389 1086460 613387
22460 613387 710130 733765 755177 745966 1180646 622695 795345 628110 587169 897212 867642
22449 867642 758235 848336 842620 814904 1008349 1254689 1306233 1296236 260428 1091370 811492
22438 811492 831285 1224829 1054499 751549 971004 1124630 1050003 1469747 569445 391406
22428 391406 902748 1103475 808248 635234 1054281 915021 992916 1219815 728976 913722
22418 913722 1042123 523071 1153964 1180793 858479 1007357 1229191 1214130 1250091 1181321
22408 1181321 823954 1358451 797452 1133344 952672 965977 769600 744967 1154535 1324326
22398 1324326 1424276 1101474 1169274 1137694 805632 976385 1156588 1118793 569135 1435742
22388 1435742 879991 1104493 1810508 637560 1069624 1111317 1002890 750464 1207770 864417
22378 864417 708072 1134886 855172 604719 895432 824863 809998 733019 1051222 459998
22367 876984 1067108 955692 797341 940956 1305854 1337853 965286 714849 731576 745034
22357 745034 586743 785792 1377307 1006218 1513427 797393 1307955 1302251 821123 866310
22347 866310 1063507 667053 1405735 1303187 1254791 866405 783697 1113671 1031406 861380
22337 861380 1248453 1305566 870282 1457374 1684566 1487081 1766993 2011851 2410582 2404424
22327 2404424 2488970 2679391 2335678 2522303 1991197 1814442 976357 1206972 1426613 1182078
22317 1182078 1268619 1098842 1204918 1225246 1245939 1342379 1149335 1276826 964907 1593143
22307 1593143 1481682 1118615 1339087 1248997 1458245 897385 978591 1105914 1447007 1069460
22297 1069460 1719490 1004733 1566168 1342598 1332083 1466091 1454969 1470361 1354297 1055760
22287 1055760 1639874 1009815 981342 1436836 1252367 1651772 1418036 1140300 1313591 1689292
22277 1689292 1213478 1771690 1754026 1524584 1345501 1571559 1296440 1376962 1431728 1697058
22267 1697058 1320547 1397801 1517346 1673779 1885842 1693635 1947855 1480309 1409345 1198647
22257 1198647 1763328 1535568 1738493 1645522 1338459 1633760 1488011 1553085 1573416 1619340
22247 1619340 1594124 1656477 1372129 1498922 1824894 1693285 1266404 1429879 1769526 1055316
22237 1055316 1573265 1551385 1586167 1819272 1568719 1683172 1491306 1333921 1121985 1640369
22227 1640369 1503103 1279180 1585087 1432383 1527964 1325967 1268932 1484953 1724976 1470816
22217 1470816 1602738 1632844 1526974 1247973 1656788 1431196 1388372 1455095 1813581 1400429
22207 1400429 1166352 1354436 1413129 1090989 1692315 1475920 1208252 1597688 1452306 1502649
22197 1502649 1405822 1659208 1297661 1785695 1067399 1522447 1969119 1508263 1264290 1573214
22187 1573214 1454648 1665777 1245437 1722366 1353272 1676933 1482968 1440165 1750642 1726097
22177 1726097 1665317 1572060 1797448 1616114 1113385 1237065 1478111 1153253 914982 1151486
22167 1151486 1207462 1449108 1501535 1103226 985307 1406421 1811073 1382203 1465063 1466294
22157 1466294 1508006 1192139 1291927 1428990 1240638 1559771 1426289 1166709 1190646 1424129
22147 1424129 1627366 1117810 1472797 1543062 836007 1614651 1229361 1637719 1514223 1188050
22137 1188050 1681569 1244266 1555100 1035931 1340039 1425335 1728146 1251676 1236631 1092329
22127 1092329 1145458 1324453 1227395 1166070 1591029 999063 1371458 1137957 1451697 1445229
22117 1445229 1482418 1571569 1171236 1309830 1308618 1461629 1123659 1232913 1189664 1202164
22107 1202164 1439334 1878848 1175127 1563807 1145923 1580034 977095 1144831 1394663
22098 1394663 1338110 1298922 1414401 1171535 1553873 1371341 1464187 1130073 1237061 1795245
22088 1795245 1550799 1627021 1558893 1545848 2064823 1261682 1335137 1518824 1264130 1260149
22078 1260149 1361887 1450925 1376353 1041023 1758094 1506967 1899928 1562046 1257458 1551962
22068 1551962 1399069 1665612 1588856 1948162 1519939 1534594 1550232 1386896 1607082 1420149
22058 1420149 1276927 1979738 2020588 1667680 1872090 1735097 2245060 1598994 2086007 1895867
22048 1895867 1603446 2141189 2270690 2043025 1391115 1767869 1932678 1757202 2012332
22039 2012332 1480311 1776948 1306030 1402184 1413480 1516414 1045085 1965982 1693131 1727498
22029 1727498 1561634 1487252 1453798 1701262 1327812 1571631 1460341 2094347 2200957 1629795
22019 1629795 2011587 1828141 1507425 1726570 1580347 1792020 1699517 1475761 1031118 1364540
22009 1364540 1765957 1462568 1527344 1534520 2197447 2188607 1803611 1657551 1438244 1468957
21999 1468957 1567295 1562926 1653575 1605507 1563914 1544514 1700722 1737052 1672009 1616476 1593000
21988 1593000 1608399 1921416 1553335 1882963 1695150 1363715 1511997 1807733 1612223 1652529
21978 1652529 1899449 1658978 1475142 1910810 2538533 1749722 1653405 1610384 1387989 1874541
21968 1874541 1869501 1666730 1929362 1499263 1789503 1590497 2043191 2089184 1614344 1766645
21958 1766645 2013271 1813452 2222871 1686986 2091481 1652828 1805791 1644475 1403996
21949 1403996 1608239 1941419 1960378 1821521 1871573 1773701 1846759 1193795 2041887 1916147
21939 1916147 1693971 1628572 2043865 1750467 1404617 1525211 1833145 1666083 1955274 1908602
21929 1908602 1829165 1877926 1831843 1629189 1683075 1582936 1869082 2226352 1799068 1699493
21919 1699493 1977213 1942808 2031372 1821055 1836200 2134439 1600298 2279070 1951575 2025236
21909 2025236 1574407 2064770 1486443 1620142 2033526 1450968 1987975 1739257 1846753
21900 1846753 2228646 1795044 1410891 1949831 1708485 1765080 1819448 2153596 1756671 1864708
21890 1864708 1586441 1741123 1980720 1807659 1620909 1608986 1643102 1626399 1255075 1622635
21880 1622635 1469441 1778141 1682746 1308614 1831745 1678472 1698522 1364107 1667345 2135150
21870 2135150 1874930 1673411 1630084 1915031 1852577 1636175 1961746 1757018 1976898 1533180
21860 1533180 1687715 2123376 1868932 1857044 1965911 1747949 1343353 1490544 1725068 1796159
21850 1796159 1493491 1807144 1600775 2002477 1616748 1667684 1759652 1992489 2205667 1901270
21840 1901270 1962571 1570670 1698785 1727960 1556531 1353905 1423985 1915782 1399509 1235140
21830 1235140 1955577 1626605 1338017 1555676 1827499 1607249 1798517 1507254 2141798
21821 2141798 1668330 1811177 1565749 1871492 1699270 1554782 1759658 1221943 1586425
21812 1586425 1730085 1769976 1833575 1694279 1421861 1345761 1437207 1644548 1750009 1636618
21802 1636618 1630139 1660958 1436277 1505528 1366571 1483115 1485988 1281835 1623902 1615167 1916613
21791 1916613 1394700 1545926 1589774 1866714 1697900 2099586 1804119 1761203 1692881 1459757
21781 1459757 1456555 2017709 2086722 1412470 1253047 1543248 1843380 1479604 1582303 1542894
21771 1542894 1461955 1770170 1810614 1902604 1785271 1912046 1943438 1882431 1642982 2119382
21761 2119382 1681456 1671393 1984757 1920473 2493013 2154550 2090742 2498456 1934077 2264806
21751 2264806 2595082 2465644 2805560 2695218 3114238 3234398 3329919 3689454 3981077 4037944
21741 4037944 4770035 5643836 6147843 6741880 8026939 9105448 10277304 11318727 12075911
21732 12075911 12224689 13472488 13101085 13530730 12927860 12218852 11718737 11139698 10174676
21723 10174676 9134288 9042019 8285358 7730631 7664637 7663378 8375768 8114312 8670967 9494492
21713 9494492 10284502 10917169 12848574 13862428 15205983 16144767 17409409 17540416 18398690
21704 18398690 19087091 19457023 19011915 19388337 19237281 18388863 17746436 16732242 15546075
21695 15546075 14904707 13340078 12267521 10959311 10343662 9322492 8949253 8437118 8183267
21686 8183267 7788619 7971410 7413877 8007747 8340005 9044074 10141452 10778851 11412889
21677 11412889 11273213 13179714 12578096 12605917 12880989 12537445 11633414 10844052 9530333
21668 9530333 8271997 7445648 6567609 6076578 5254768 5029569 4523288 4443539 3860459
21659 3860459 3646786 3305046 3146942 3217554 2764997 2777787 2938554 2544092 2492955 2697694
21649 2697694 2489099 2455883 2369211 2498213 2305450 2316512 2240764 2680091 1598561 1977453
21639 1977453 2336404 2242146 1929403 2002557 2052404 1688848 2216390 1756003 2413901 1542960
21629 1542960 1830054 2155466 1702441 2035316 1796315 1781811 1444131 1561645 1690620 1869038
21619 1869038 1613047 1212146 1844042 2052755 1828951 1849763 1681404 1914212 1593386 1846137
21609 1846137 1605817 1485661 1461584 1681383 1526689 1652433 1341105 1457709 1566616 1576168
21599 1576168 1522637 1692289 1901527 1715788 1567413 1517552 2120145 2212608 1385529 1467058
21589 1467058 1764182 1696229 1828667 2223579 1554239 1542691 1379870 1877303 1820883 1965522
21579 1965522 2033835 1809847 2045121 1490600 1482397 1731987 1775960 1535863 1922512 1815061
21569 1815061 1695131 1836432 1622215 1823891 1753479 1750261 1202622 1854621 1781516 1600221
21559 1600221 2058143 1109255 1438816 1688474 1715269 1360412 2004450 1505352 1369073 1618294
21549 1618294 1657528 1626692 1206997 1429174 1626676 1530833 1640118 1586190 1797379 1743683
21539 1743683 1234897 1163324 1805064 1882019 2038383 1923155 2229951 1931901 1333726 2088915
21529 2088915 1605714 1822889 2218290 2121350 1875936 1669447 2257272 1960745 1844747 1905762
21519 1905762 2323705 2322697 2262380 2051876 1921741 2149531 2008195 2120675 1851301 2308087
21509 2308087 2256587 1684280 1957106 1782547 2219183 1975334 2105845 2351761 1791713 1961184
21499 1961184 1693533 2105765 2058996 1911756 1920118 1768477 2031169 2407291 2396422 1833206
21489 1833206 1651615 2156215 1936231 1717474 1739015 2266500 2173472 1653895 2237648 1685958
21479 1685958 2043193 2208949 1911090 1924579 2274595 2313746 2351991 2032759 1975329 2014864
21469 2014864 2372245 2223833 2278451 1818294 2224149 2141479 1593242 2107814 2265614 2343371
21459 2343371 2108691 2661671 2053977 1333238 1937693 2543688 2290717 2042025 2119465 1458579
21449 1458579 2128724 1667580 2108634 2123203 2044767 2112251 2119798 1887943 2201986 2134143
21439 2134143 1919298 1809936 2036887 2110008 2205804 2355887 1529196 2130192 1952803 2314632
21429 2314632 1741177 2185373 2181944 2144484 1977069 2248585 2111119 2204376 2126906 2002642
21419 2002642 2109360 1837426 1438940 1904442 1864675 1650281 1770560 1940440 1871832 2004506
21409 2004506 1823621 2214418 1858111 1816035 2319455 1826103 1841570 1725146 1735372 2262833
21399 2262833 1622088 2300606 2280766 1887719 1740681 1752544 1555031 1975586 2142175 2100401
21389 2100401 2042331 2077556 2094248 1707330 2363788 2178608 1733556 2041967 2067245 2036490
21379 2036490 2102938 1929826 1969081 1658446 2348008 1738954 2212633 2424237 2433233 2277961
21369 2277961 1821962 2802439 1863173 2452950 2277743 2634025 2129636 2123577 2164572 1822480
21359 1822480 2054832 2497996 2074618 2430894 2253867 1917182 2065249 2399454 2129792
21350 2129792 2525824 2027696 2279580 2446522 2289767 1801989 2244016 2441574 1946233
21341 1946233 2369325 2414722 2711117 2421702 1674797 2591882 2703957 2493861 2364082 2791443
21331 2791443 2169298 2384557 2778815 2704768 2354012 2827609 3198314 2618137 2808839 3189712
21321 3189712 2741713 2454363 2461442 2707472 3081062 2950590 3340297 2798839 3335069 3161739
21311 3161739 3517859 2588364 3749180 3361266 3743043 3489674 3937836 3554992 4000414
21302 4000414 3512773 3573454 3421584 4141084 4059274 3888586 4132531 3999537 4352941 4544404
21292 4544404 4600616 4845428 4761687 5523765 4807375 5467275 5041361 6255893 5729299 6053722
21282 6053722 6676709 6457081 6411502 7501114 7436546 8183961 8201017 8814265 9528550 9977417
21272 9977417 10194602 10783660 11486624 12764841 13893437 14354509 15678812 17640779 18508857
21263 18508857 20369987 22312467 24119228 26612748 29106781 32090178 34467526 37948629
21255 37948629 41034106 44459113 47623777 49910528 52447946 54256661 55328515 55785665
21247 55785665 55246043 53642169 52026593 49731296 46871771 43467616 40346558 36944773
21239 36944773 34259075 30742178 27810109 25743741 23006649 21182708 19478907 17943655
21231 17943655 16715127 14713312 13631419 12862797 11956831 11301009 10646608 10063680 9074119
21222 9074119 8778996 8621723 8137866 7509673 7499963 7091215 6344573 6707507 5728658 5991318
21212 5991318 5557741 5858145 5260449 5412047 5167881 4760792 4811895 4545879 4615142 4368222
21202 4368222 4325572 4215457 3816039 3960085 4250589 3712352 3643227 3494633 3429293 3792723
21192 3792723 3620933 3343079 3316256 3228631 3231643 2968329 3196753 2869049 2984167 3077762
21182 3077762 2833498 2542066 2585472 3345374 3127107 2789465 2591427 3031383 2569014 2574694
21172 2574694 2590550 2752509 2799153 2272536 2715918 2705730 2520676 2345987 2318643 2455266
21162 2455266 2657672 3035566 3077807 2556082 2173403 2814764 2464095 2741381 2745484 3115041
21152 3115041 2586540 2553196 2440844 3023474 2749158 2833425 2601621 2541005 2654409 2903577
21142 2903577 2518446 2553215 2902034 2740015 2651393 2761030 2786258 2937109 2799170 2449394
21132 2449394 2547601 2783142 2537844 2365768 2442955 2562076 2779468 2072077 2667869 2654504
21122 2654504 2616890 2422959 2272406 2790002 2452428 2340763 2173368 1781969 2211395 2296056
21112 2296056 2015326 2161722 1916871 2214234 2343755 2264334 2259672 2071236 1822674 2420649
21102 2420649 2243051 2167462 2391043 2503282 2859319 2543931 2450187 2133698 2608431 2578248
21092 2578248 1885959 2771486 2866785 3084770 2742197 2720072 2941619 2761653 2609456 3138137
21082 3138137 2641770 3175104 3130447 3296961 2991254 2824383 2970371 2898886 2334238 2768904
21072 2768904 3101425 2785051 2657559 3069577 2794193 3151025 2619574 3105824 3179603 3424939
21062 3424939 3364364 3314357 3083417 3850341 3780623 3547787 4120003 4540508 4594668 4595938
21052 4595938 4916941 4523910 4660359 4789406 4449989 4112184 3849610 3817016 3616238 3591165
21042 3591165 3074353 3094738 3340551 3286493 3128389 2942022 3375921 2719577 3007941 2759396
21032 2759396 3107047 2939817 2829465 3083444 2978347 3232756 2785846 3060716 3300301
21023 3300301 2804117 2869293 2952299 3283981 3024011 3483790 2782187 3252549 2665191 3036238
21013 3036238 3263993 3416973 3812941 3600659 3584850 3349115 3674498 3812546 3909708 4864279
21003 4864279 5261610 5933273 6691442 8219321 8884821 9895131 10873368 11062075 12081888
20994 12081888 11319805 10673155 10919867 9500273 9432196 8551120 7892271 7325554 6476535
20985 6476535 7165525 6510614 6215175 5782256 5830814 4949400 5321484 5003233 5018098 5133602
20975 5133602 4853944 5014067 5138790 4763947 4995052 5734693 6282046 6873490 7588788
20966 7588788 8367890 9681650 11193617 12748814 12948680 14483473 15512191 15565272 15178738
20957 15178738 14379736 13249947 11772951 10035958 9286734 7800221 6791038 6604564
20949 6604564 5939394 5868475 5640129 5814488 5524511 5733376 5959657 5784209 6773864 7281902
20939 7281902 7693031 8274222 9711200 10867057 11974992 12807486 14288277 14900159 15662999
20930 15662999 16384508 16349901 16397753 15609179 15343635 15316351 15434738 14431794 14074347 13115303
20920 13115303 13033492 12693794 12277421 12960721 13417150 14312955 16449918 19209269 22962104
20911 22962104 26605541 30694787 35118186 39905082 43254164 45586677 47583801 47816544
20903 47816544 46554037 44222016 41544204 38309533 34648770 31363190 28886955 26893926
20895 26893926 24937898 22891477 19959082 18238709 15686532 13786112 11623242 10431357
20887 10431357 9069710 8376874 7326815 7205481 6523964 6343417 5717174 6185402 5675457
20878 5675457 5894307 5739485 5749267 5373893 5533066 5383145 5712511 5724278 6208141 6989585
20868 6989585 7156140 8515852 8817495 9784386 11144000 11886616 12666176 12712306 12560880
20859 12560880 12618808 11962452 11914750 11473539 11211228 11784584 11905736 12973302 15067278
20850 15067278 17537947 20475253 24167196 29010648 33682736 38303497 41802407 44601956
20842 44601956 46304209 46444174 45316839 42003492 38192093 33000501 27492546 23248433
20834 23248433 19313651 15978587 13293049 11734373 9938201 9281492 8511653 7771804
20826 7771804 7124014 6636181 6360140 6297434 5842643 5217103 5462972 4570743 5170828 4720142
20816 4720142 4450814 4768816 4819841 4484948 4417748 4111776 4302935 3524415 4138227 3734247
20806 3734247 3371872 3778934 4238246 3448864 3630916 3942316 3666087 3493056 3827865
20797 3827865 3772704 3940915 3623952 3801649 3845376 3364516 3624576 3758591 3763807 3661729
20787 3661729 3872002 3655163 4007944 3726622 3912065 3979062 4161338 3745177 4231409 4375616
20777 4375616 4267544 4349005 3620767 3663166 3953304 3567405 3636153 3389606 3336605 2858983
20767 2858983 3265691 3154863 3477061 3037603 3385735 3089128 3139503 3199110 3082437 2822624
20757 2822624 3131727 3078654 3536849 3353995 3286312 3138022 3455985 3476122 3911146 3439799
20747 3439799 4063632 3151916 4904982 3960652 3921647 3432986 3498393 3690573 3137238 3641207
20737 3641207 2477059 3406645 3112782 3355050 2952064 3155287 2594871 3029981 2879108
20728 2879108 2974396 3335788 3098441 2669884 2580128 2931106 2786581 2791621 2872938 2729593
20718 2729593 3135092 2897716 2932760 2922987 3201646 3141414 3018906 2768212 3106998 3116946
20708 3116946 2788166 2981190 3171803 3216219 3328786 3158420 3355883 3336850 3276081 3361499
20698 3361499 3774240 3803494 3912215 3654977 3759715 4180305 3721638 3779732 3742169 3826687
20688 3826687 3772129 3834894 4145786 4080749 3915100 4027461 3400046 3919582 4154429 3755497
20678 3755497 4078129 4030691 3761810 4648284 4751830 4714824 4985201 4717933 4932178 5086308
20668 5086308 5069756 5550695 5438149 5195079 4993309 4655943 4511947 4596916 4519396 4471029
20658 4471029 3946691 3606429 3971013 4123573 3848863 3742601 3595851 3908072 3843437 3553279
20648 3553279 3904296 3817933 4562518 4504732 4446072 4954994 4665695 4985813 4897377 4588120
20638 4588120 5268998 4770053 4967984 4730905 4461598 4070525 3905011 4270152 3522453
20629 3522453 3293260 4067836 3819336 3607168 3613532 3880651 3712045 4108532 4038015 3951251
20619 3951251 3559864 3391816 3510023 3244214 3876196 3878638 3900108 3957547 3959362 4845723
20609 4845723 4009028 3931553 4078216 4131452 4035456 4322551 3858409 3850564 3803849 3749045 3817317
20598 3817317 3987394 4113584 3865306 3327677 3355168 3583633 3119812 3391590 3785125 3492198
20588 3492198 3675464 3743909 3400499 3849138 3695431 3806854 3780145 4417352 4044882 3966814
20578 3966814 3784138 3848194 4209561 3592326 3885883 3606040 3672363 3342134 3255685 3399432
20568 3399432 3561211 3673290 3514746 3023794 3001301 3358887 2858036 3493531 3887986 2616069
20558 2616069 3032455 3159353 3399771 2784329 3235290 3213717 3284896 3082617 3387694 3948785
20548 3948785 3753247 3751248 3730141 4192976 3287329 3752902 3456942 3379046 3009664 3541473
20538 3541473 3309100 3612428 3611016 3897292 3831558 3892401 4447348 4368222 4911562 4776634
20528 4776634 4817060 5004315 5074504 5241535 5506367 5534660 5319637 4988652 4816069 5069761
20518 5069761 4800394 4611278 4680089 3805662 4168592 3953740 4014228 3286620 3633983 3627987
20508 3627987 3598980 3410511 3910939 3783024 3434787 3805891 3922566 3578651 4511838 3831548
20498 3831548 4831772 4756475 4590098 4692387 4636008 5001979 4608819 4215359 4772380 4345991
20488 4345991 4200936 4020185 3922867 3605815 3653018 3135459 3083516 3550984 3407515 3173501
20478 3173501 3287514 3642922 3234406 3683890 3636798 3885293 3930833 3454463 3383193 3761505
20468 3761505 3359794 3747672 3926439 3892913 3809062 3918977 4461287 4178248 4130062 4128919
20458 4128919 4185617 4344782 4310436 4544871 4140135 3993482 4086595 4179754 3777436 4076458
20448 4076458 3961780 3918812 3890308 3725326 3895677 3813887 3367831 4145399 4247217 4254602
20438 4254602 3682877 4028881 4258050 4214821 3778022 3476156 3948266 3905315 3845720 3897987
20428 3897987 3143452 3987254 3687818 4150728 3605206 3979268 3679090 3792933 3592739
20419 3592739 3731914 4237812 4045719 3575146 4171586 3918732 4029834 3978830 3399552 4084581
20409 4084581 3959522 3901477 4049625 4043753 3864196 3882367 3980938 3848803 3939007 3692763
20399 3692763 4117507 3696586 3962091 3780273 4120832 3447456 3741870 3674426 3482901 4030367
20389 4030367 3197708 3917370 3252047 3757123 3945364 3440848 3383164 3480475 3639168 3780528
20379 3780528 3469913 3799974 3569384 4008544 3442723 3948232 4115954 4429162 4259500
20370 4259500 4711580 4029609 3845818 3683897 3949965 4140890 4110770 4077384 4282086 3587409
20360 3587409 3864754 3646430 3706722 3777555 3878499 3481956 3873043 3888195 3185465 3198764
20350 3198764 3573125 3623780 3406918 3973368 4036195 4083980 4601044 4095611 4146560 3950154
20340 3950154 4284838 4247924 4366020 4025796 4191812 4261914 4125818 4067700 4475051 4312420
20330 4312420 4007864 4317453 3570226 4156529 4369706 4093470 3364011 3796876 3698241 3308846
20320 3308846 3836114 3705194 3855389 3796685 3642885 3807733 3802098 4071195 4037376 3965405
20310 3965405 3724997 3717172 3756366 3986003 3997410 4342974 4129687 4486185 4390371 4755192
20300 4755192 4290041 4543557 4788789 4901688 5023170 4696981 4726560 4932048 4794699 4761342
20290 4761342 4781947 4581031 4729286 4993621 5025415 4874380 5384516 4837626 5683016 5578662
20280 5578662 5669607 5837485 5990947 5278018 5787409 6108416 6626606 6830042 6243068 6946036
20270 6946036 7049824 6723616 7157923 7453497 7491925 7622378 7727181 7571837 7651323 7326881
20260 7326881 7546419 6854008 6397710 6354304 5930972 5969798 5510602 5559356 5303912 5392629
20250 5392629 4985404 4895016 5574957 4810854 5836498 5212496 5682672 6174732 5870769
20241 5870769 6111657 5566917 6460604 6368108 6235604 6610290 6916044 6633289 7348761 6769305
20231 6769305 7598434 7022882 7972524 8293367 9014919 10075821 11144001 12171372 12937725
20222 12937725 14574721 16017162 16442239 18036622 19795592 21101925 21073208 21215697 21392924
20213 21392924 21465394 20650736 20533275 19355092 18441790 17943110 15233161 14031569 12199408
20204 12199408 10866381 9575313 8491768 7864989 7432077 7121298 6614202 6371622 6524378
20195 6524378 5715035 5625199 5820958 5646351 5419237 5524733 5185817 5488435 5613130 5558833
20185 5558833 5327896 5191600 5902523 5293431 5630518 5878577 5912659 5865784 5792223 6517069
20175 6517069 6733365 7183364 7916993 8072134 8950888 10285943 10955364 13613660 14904191
20166 14904191 16583832 18144289 19990023 21574734 23082638 24114238 24992328 25611931
20158 25611931 25600944 25821138 25096590 24971435 24665055 24033481 22129499 20577891 18702839
20149 18702839 16191735 14574861 13333386 12092625 11496372 11083938 10230751 9671622 9664886
20140 9664886 9848450 9657862 10182008 10330042 10482765 11059325 11764061 12063650 13485972
20131 13485972 14051364 15275526 16562662 18426581 20343114 22769805 25924288 28495746
20123 28495746 31951413 35841606 39973414 44010473 48046532 52351138 55293009 58487689
20115 58487689 61087474 62821507 63738152 64745231 64070392 63608499 62629816 59897551 57404935
20106 57404935 53627798 49764797 45488002 40705556 36317572 32827278 29609067 26706162
20098 26706162 23878832 21559746 19493248 18016954 16841460 15649245 14397171 14029232
20090 14029232 13497968 13118000 13309288 13058470 12903547 13839046 13569529 14426508 15636347
20081 15636347 16254885 17368316 18663137 19434564 21092749 22037276 22610476 22995685 23484242
20072 23484242 23383754 23291119 22996654 22572293 22083921 20862341 20312912 18839143 17824428
20063 17824428 15929928 15476407 14348453 12982155 12144093 11211362 10926536 10115538 10317367
20054 10317367 10505871 9535422 10115099 10267815 10667123 11013116 11778560 12935033 13155443
20045 13155443 14465653 15783143 16812570 17785246 19000260 19961101 20966310 22223232
20037 22223232 23891838 25235222 26548001 27976501 29672058 30775012 32465257 33784388
20029 33784388 34882598 35156841 35651929 35350806 34660612 33522318 32733899 31064634 30697007
20020 30697007 28870647 27366179 25330584 24019112 21832146 20187243 17979050 17178337
20012 17178337 15700890 14683303 14870194 14426068 14397464 14532746 14635893 15969918 17216037
20003 17216037 18644088 21019670 23158828 25468367 27979974 30812125 32733353 35158374
19995 35158374 36743323 37650223 38894305 38764461 37901801 37393804 35916417 34414832 32867390
19986 32867390 31384265 28830857 26305940 23135874 20759905 18341361 15773953 13754595
19978 13754595 12572291 11111239 10413957 9711294 9282798 8488814 8626929 7564361 7145205
19969 7145205 7085694 6905378 6966186 5935552 6521154 5923627 6157676 5921078 5712115 6189638
19959 6189638 5425838 6262280 5726282 5584902 5141226 5680513 5536245 5610718 5164053 5308185
19949 5308185 5446368 5124879 5869459 5502856 5607922 5137291 5476704 5013517 5321272
19940 5321272 5571284 5236208 5829062 5733610 5505283 5612838 5959349 5227983 4858171 5123880
19930 5123880 5683524 5650662 5560687 5496370 5469771 5488841 5507101 5125531 5382224 5131425
19920 5131425 5517792 4827750 5109756 4958002 4956991 5059956 4626332 4602783 4541684 4643051
19910 4643051 4784506 4917899 4480593 4847438 4535228 5033419 5167010 4754047 4734994 4980872
19900 4980872 4985127 4646846 4679284 5679345 4971733 5182406 5057164 5576110 5223720 5264937
19890 5264937 5507321 5463315 5548816 5654882 6037029 5769483 5869955 5701457 5689920 6039514
19880 6039514 5419949 5980117 5709698 6031978 5765346 5740002 5736398 5697949 5899812 6343063
19870 6343063 5990071 6131931 6294078 6444238 6458553 6437232 6881998 6848533 6860049 6807245
19860 6807245 6884423 6832885 6492238 6780206 6935859 6702382 7362413 7146173 7316512 6690874
19850 6690874 7479854 7507767 7320878 7570425 7881511 7233941 7458252 7736383 7891402 7755084
19840 7755084 7908055 8102558 8422217 8417756 8512646 8547344 7982975 8499167 8959729 8658300
19830 8658300 8775724 9493667 9809624 10242552 9969499 10475271 11173738 11337983 12312943
19821 12312943 12762913 13431257 13987047 15201715 16695706 18096607 19941194 21402402
19813 21402402 23253537 24625114 25956786 27390556 27865758 29175729 29991421 30662166
19805 30662166 31247700 32732776 34402687 36262674 39375251 41735931 44483877 47203798
19797 47203798 49151018 51469925 52738178 52724767 52580774 51393584 49051116 47102277
19789 47102277 44606635 42287945 40400126 38814291 37632685 36665660 36162774 35068125
19781 35068125 33967708 33597040 33378038 32459653 31305820 31356786 30783157 30103094 30256037
19772 30256037 31016505 30920327 31470075 33178643 34410200 36102973 37793322 39320542 41104915
19763 41104915 42017200 42431494 41834782 41109557 39721318 37741389 34874572 32752367 30358718
19754 30358718 29071121 27379323 25507428 24220478 22566838 20544142 18749772 17367785
19746 17367785 15470951 14506145 13629289 12789007 11995071 11449641 10431522 10405699 10026714
19737 10026714 9452288 9431570 9119242 8548125 8333995 8528143 7610540 7937109 7713557
19728 7713557 7847393 7647818 7466933 6865294 7604124 7094875 7203930 7029263 6862327
19719 6862327 6825734 6667664 6801930 7109417 6807590 6517399 7019767 6514399 6871558 6582210
19709 6582210 6779086 6783559 5999934 6552708 6773964 6464188 6757277 6532176 6181839 6418394
19699 6418394 6361045 6078758 6356417 6132859 6445696 6849325 6586348 6455873 6203199 5828125
19689 5828125 6059521 6131147 6234631 5956542 5943971 5985989 6189611 6190460 6127371 5742913 6079325
19678 6079325 6069323 5719762 5798059 5666605 5560100 5547434 5676577 5702707 5625786 5939593
19668 5939593 5665727 5583447 5387487 6197425 5564222 5250082 5760154 5511460 5711675 5891280
19658 5891280 5567182 5317707 5596519 5111435 5591441 5338335 4987774 5028917 5237217 5353625
19648 5353625 5093707 5207181 5153366 5388356 5253457 5202715 5099642 5062414 5500261 5163105
19638 5163105 5225031 4931020 5462452 5316049 5202247 4701397 4715234 4875864 5025989 5200639
19628 5200639 4674304 4960659 5332521 5072253 4971586 4820301 5137589 5255110 4764092
19619 4764092 4930748 4586837 4712742 4712110 4774920 5053753 4341667 4936843 4773857 4370591
19609 4370591 4473799 4517165 4468566 4657406 4456708 4289353 3986554 4462954 3861494 4385379
19599 4385379 4134471 4182504 3807852 4437902 4101280 4446741 3492932 3942327 4401027 4409216
19589 4409216 4078468 3628457 3894849 4159853 4254411 4868080 4410280 3983881 4629515 4792058
19579 4792058 4051511 4798490 4182453 4644929 4356935 4459776 4172213 4794176 4343464
19570 4343464 4057798 4060727 4519962 4183065 4195324 4273758 4398012 3863162 4038527 4199992
19560 4199992 4703415 4847956 4195324 4115354 4604154 4482481 4203995 4302870 4907682 4302569
19550 4302569 4672406 4853823 4161824 4117655 4293704 4409087 4344669 4411410 4562382 4271511
19540 4271511 3860556 4276159 4483839 4194874 4367541 4316519 4154127 4029036 4195731 3890606
19530 3890606 4094929 4033450 3511697 4556591 4334342 3822974 4353474 3616277 3847437
19521 3847437 4835806 3711299 4247836 4032309 3930069 4002482 3938977 4152162 4051186 3729550
19511 3729550 3991327 3833580 3922707 3685574 3762942 3519297 3922669 3854372 3697964 3707376
19501 3707376 3540668 3771614 3350139 4041670 3933007 3386839 3680117 4438394 3927697
19492 3927697 3587191 3607661 3652660 3405556 3807330 3742015 3618101 3484346 3555489 3552520
19482 3552520 3762958 4061331 3979780 3851268 3532242 4056363 3381584 3811186 3208169 3611065
19472 3611065 3451816 3517201 3709627 3429040 3115817 3155627 3238493 3341589 3084244 3133912
19462 3133912 3271121 3106072 2960817 3197142 3342399 3120896 2879499 3248942 3068932
19453 3068932 2904340 3070344 3077271 3049062 2716462 3007297 2754870 2808761 2990154 3148209
19443 3148209 3142681 3134654 2961753 2669359 2905824 3263100 2828172 2487973 2989816 3312923
19433 3312923 2840810 2655158 3137337 2435592 2892531 3013643 3297187 2649881 3066588
19424 3066588 2598164 3122932 2333347 2670167 2743517 2442773 2595081 3083297 2907666 2686355
19414 2686355 2843347 2415156 2606454 2349451 2764109 2593057 2664193 2462274 2355582 2328566
19404 2328566 2181761 2376259 2138791 2515828 2282256 2473529 1993305 2359900 2657014
19395 2657014 2442169 2923119 2046690 2075988 2151547 2485901 2504498 2021061 2423990 2221781
19385 2221781 2173155 2256985 2025837 1975008 2189193 2109807 2444333 2139756 2294883 2344686
19375 2344686 2297181 1990730 2337032 2344713 2214380 2227341 2166860 1840039 2096721 2140517
19365 2140517 2288180 2346104 1741046 2202947 2217638 2267293 2097340 2846928 2338406 2190373
19355 2190373 2267754 2394720 2473547 1743561 2224714 2430210 1783202 2692400 1946622 1554521
19345 1554521 2124643 2428132 1904102 1765174 1908588 1986939 2009907 2081917 1829800 1775024
19335 1775024 1564056 2033416 2403522 2363497 1813470 2216133 2069225 2248433 2394333 1861330
19325 1861330 2306138 2048802 2095873 2339326 2213295 2621948 2282542 2514068 2060538 2047118
19315 2047118 2487547 2203938 1873678 1828949 1983677 1936522 1504448 1958382 1993385 2395457
19305 2395457 2080194 2133168 2024757 2091546 1575099 2083134 2059614 2428300 1992975 2120955
19295 2120955 1966821 2171575 2501010 2284589 2330768 2524320 2562893 2216316 2102968 2211756
19285 2211756 2040733 2109273 2525792 2016725 1652188 1923534 2487211 2082562 1848318 1914459
19275 1914459 2289323 1798226 1874493 2163794 1972712 2121541 2095413 2323894 2176564 2444952
19265 2444952 1911684 1935562 2133802 1974366 1781631 2352531 2182362 2403778 2377656 2200064
19255 2200064 1800946 1813233 2346643 2343940 2044194 1771832 2106673 1834651 2325762 1916959
19245 1916959 1880786 2325150 2464348 3200956 3893428 3781508 3574827 4031903 3831015 3987445
19235 3987445 3384738 3292986 2528781 2510881 1848511 1872524 2045715 1842884 1402026 1858301
19225 1858301 1515413 2064125 1150035 2223865 1837598 1861191 1790811 1595619 1998024 1507896
19215 1507896 1700923 2214312 1852852 1909149 1136177 1876212 1915221 1561236 1762530 1411187
19205 1411187 1466681 1982988 1491041 1907932 1958045 1870769 1862266 2096925 2108450 1669333
19195 1669333 1726355 1435904 1834754 1786063 1557698 1778590 2715280 2073644 1280345 1506212
19185 1506212 1762553 2123987 1730076 1611687 1891882 2095435 1875113 1430637 1703873
19176 1703873 1598170 1633109 1765339 1774659 2171903 1779044 1623309 1829113 1714381 1855390
19166 1855390 2117710 1513220 1844456 1375384 2114329 1774389 1719147 1406070 1565437 1480245
19156 1480245 1862623 1459143 1654531 2096567 2037213 1620530 1680458 1966767 2178805 1559882
19146 1559882 1984414 1660248 1960993 1776233 2085257 1767765 1824151 1486431 1967832 1656524
19136 1656524 2556192 2257235 1862123 1859995 1885451 2644824 1789766 2039348 2402384 2571495
19126 2571495 2646671 2506644 3064251 3519194 3628987 3597312 4328813 4312464 4240285 4281059
19116 4281059 4184110 4408697 3631104 4012557 3607847 3880170 3149626 3315990 3349030 2785240
19106 2785240 2400155 2813438 2385846 2596072 2626393 2047471 2740844 2223758 2605317 2522882
19096 2522882 2472224 2549605 2390834 2749891 2659660 2675855 2654653 2275839 2945453 2335655
19086 2335655 2878399 2603871 2481205 2888699 2743246 2971734 2922805 2841483 2910202 3028118
19076 3028118 3220507 2598388 3038560 2934472 3036666 3270905 2867832 3334017 3004257
19067 3004257 3632813 3148233 3190125 3824057 3689359 3953162 4638258 5139813 5996572 6502792
19057 6502792 7818403 8519826 10281264 11369244 12314267 12791511 12617054 12826173 13030703
19048 13030703 11441199 10288140 8544070 7768218 6557750 5905494 5525725 5091453 5344358
19039 5344358 6479448 6248894 7836437 9027776 9501794 9817615 10198300 10399362 10748227
19030 10748227 9586350 8625030 7256751 6262418 5642598 5547672 4827031 4696151 4553061
19021 4553061 4212610 4470522 4261087 4119671 4760589 4949968 5443441 5750353 5973870
19012 5973870 6748446 7520405 8609957 9782256 11829163 12732362 13714221 14437957 15413741
19003 15413741 15564816 14887733 14084221 12497777 10768792 9731338 8986989 7844403 7834383
18994 7834383 8083566 8399202 9505519 9948655 10820076 10761285 11565251 11566188 11406419 10958744
18984 10958744 9500367 8227003 7333764 6113738 5586976 4993120 5373615 5401172 5830946
18975 5830946 6391675 7383694 8309316 9174864 10500614 10446330 10930185 10583599 10663516 10177576
18965 10177576 8685476 8097553 6417181 6303781 5854860 5765727 5467176 5430929 5330372
18956 5330372 5937983 6119880 6236085 6675696 7044217 8347215 9086287 9985146 11011232
18947 11011232 13033222 15331420 17986982 22102356 24948387 29510733 33573135 38824094
18939 38824094 43114808 47140213 49284110 50629232 50395904 49241371 46591573 43599089
18931 43599089 38875461 32985750 27584266 23320322 19334064 16121281 14026642 11907734
18923 11907734 10892038 9245780 8188488 7339623 6503134 5906490 6007091 5329224 5016169
18914 5016169 5217321 4547901 4479412 4230431 3946488 4149569 4206978 4253527 3874026 4000984
18904 4000984 3898136 4203581 3891549 3789758 3773515 4103415 3644608 4043796 3693626 4889531
18894 4889531 4464009 4805592 5009752 5195954 4922138 5120678 5887419 6495823 6282676
18885 6282676 7203715 7677772 8878384 9518089 11517439 13446768 16309224 19370106 23051360
18876 23051360 27077753 31575380 35543571 38544789 41034176 41686707 41309900 39345473
18868 39345473 35743310 31543071 27020995 22238233 18271487 15099992 12374159 10776551
18860 10776551 9298030 7351199 6773016 6468438 5712750 4512118 4585169 3971328 4128860
18851 4128860 3358817 3659963 3229170 3794263 3538877 3518929 2680255 2893596 2931388 2186101
18841 2186101 2439978 2740642 2135214 2498389 2399789 2178399 1884005 2423536 2364121 2044785
18831 2044785 2179041 2188494 2015678 2352972 2426161 2326543 1889743 2258076 1675225 2166396
18821 2166396 2158194 1954888 2249841 1851618 2377570 1692230 1508927 1953374 2052679 1963846
18811 1963846 1957652 1596713 1745797 1707204 2323521 1722162 2319717 1499417 1491272 1706651
18801 1706651 1883714 2174341 1993029 2092651 1838485 1640366 1649769 1850225 1571535 1692323
18791 1692323 2019164 1381280 1703672 1613723 1771854 1691996 1236241 2133625 1921835 2054417
18781 2054417 1624111 1721745 1968688 1873358 1786142 1561134 1823395 1765728 1395966 1950797
18771 1950797 1723652 1922139 1843364 1896470 2049044 2266646 1775003 2089832 1810632 2112803
18761 2112803 1981097 1254787 2003518 1739786 1545735 1558954 2180103 1636568 1975763 1860347
18751 1860347 2059259 1667828 1548612 1854259 1944187 2100287 1794091 1625403 1623810 2002371
18741 2002371 1662053 1858700 1557279 1592628 1495386 1882614 1481413 1639244 1990027 1932795
18731 1932795 1745741 1926618 1570034 1930015 1371400 1888599 2066880 1714365 1677900 1723767
18721 1723767 1603317 1612872 1576477 1596282 1845998 1811879 1485660 1647535 1668844 1818512
18711 1818512 1591744 1634080 1714874 1807689 1920561 1447102 1552552 1743008 1652617 1714921
18701 1714921 1930169 1821617 2098589 1829994 2086117 1820272 1845171 1424338 1785254 1669171
18691 1669171 1641213 2239817 2246190 1630755 1772675 1790134 1676878 2021900 1735265 1461987
18681 1461987 2079065 1998994 1342651 1849008 1804355 1949750 1519361 1734627 1528222 1619694
18671 1619694 1720485 2017139 1533572 1396667 1591955 1225387 1850516 1710535 1328172
18662 1328172 1235342 1116173 1447014 1540592 1577338 1370822 1286721 965763 1259249 1594838
18652 1594838 1140684 1122764 1365925 1921291 1117026 1997099 1714028 1876252 1813252 1329445
18642 1329445 1459412 929430 1478469 1618907 1697957 1499030 1452931 1353610 1623141 1398526
18632 1398526 1802117 1544034 1360909 1564291 1223081 1397816 1520630 1402641 1695994
18623 1695994 1297242 1162257 1557506 1502059 1256566 1510959 1630956 1626920 1366944 1743892
18613 1743892 1719473 1889827 1752183 1664753 1582272 1710526 1873922 1652595 1574495 1713213
18603 1713213 2064624 1718792 1829411 1822428 1853858 2223964 2167921 1318601 1808970 1642497
18593 1642497 1634319 1689489 1761216 1960120 2121821 1753748 1470662 2234862 1643167 1750211
18583 1750211 2147034 1564285 1731313 1811613 1469242 1253682 1503141 1590874 1824469 2098096
18573 2098096 1345895 1493896 1560419 1385629 1905387 1517968 1697535 1776365 1434911 2050660
18563 2050660 1615729 1847773 1097961 1316750 1697613 1882934 1506546 1504992 1589073 1263675
18553 1263675 1786889 1741046 1416399 1208422 1688986 1792468 1611499 1577148 1814863 1225317
18543 1225317 1459247 1516231 1458161 1549720 1400799 1491354 1525222 1461575 1096451 1177790 1005363
18532 1005363 1690352 1336138 1432155 1388674 1389578 1162501 1079631 1220454 1339054 1232000
18522 1232000 1152580 1172508 1003846 1269060 1357271 1147616 1541512 1035484 1650383 1167787
18512 1167787 1760668 1425396 1095876 1421098 1444179 1164852 1249374 1320608 1319459 1115227
18502 1115227 1526380 1360836 1107568 1187550 1331123 1071707 1372138 1141145 1450007 1610426
18492 1610426 1033473 1496362 1367632 1369528 1462911 1535230 1208131 1205620 1373318 1281259 1514793
18481 1514793 1348947 1468671 1692639 1184425 1290235 1598727 1682660 1226294 1001521 1565402
18471 1565402 1246702 1173740 1225116 1047394 1658211 1502589 1353276 1367334 1231972 1241207
18461 1241207 1583187 1374227 1256330 1168562 1578498 1417779 811054 1137320 1517056 1582451
18451 1582451 1452544 1583236 1247570 1426127 1283581 1245238 1276385 1873171 1482668 1390468
18441 1390468 1299622 1281312 1388403 1413596 1961615 1752424 1435564 771335 1562211 1328393
18431 1328393 1996032 1347186 1229596 1201398 926091 1196710 979665 1519709 1146386 1836009
18421 1836009 1604086 1362225 1638085 1715561 1547070 1799132 1688628 1833655 1747137 1401899
18411 1401899 1797869 1432832 1312050 1884921 1455128 1317043 1174510 1563932 1335758
18402 1335758 1230430 1546136 1577189 1298940 939435 1161879 897329 1606780 1394603 1696751
18392 1696751 1215756 1637573 1720715 1534140 1671503 1588277 1586633 1307725 1407896 1506261
18382 1506261 1538475 1563957 1211138 1534000 1655283 1152578 1447844 1629052 1218737 1138411
18372 1138411 1152443 1410953 1294372 1027545 1335502 1042829 1381147 860662 995464 1669133
18362 1669133 1377055 1484162 1347079 1271746 1287916 961963 1272483 1141680 903516 1426548
18352 1426548 1214175 1308726 949123 1330255 1574009 1065477 1408324 1725745 1575073 952959
18342 952959 1374665 1389091 872803 1362230 1324243 1635671 910812 1125489 1283847 1330580
18332 1330580 1057452 1328771 1654460 998106 1032117 731327 1118029 1148286 1552257 1216365
18322 1216365 883780 1074682 1649580 1144699 1280991 1133041 1697422 1142824 1718937
18313 1718937 1241331 1322537 1338266 1749722 1111214 1182495 1493731 1360444 1334517 1177996
18303 1177996 1341191 1533404 1617461 1725558 1464042 1032608 1143105 1680111 1437445 1427684
18293 1427684 1034673 1244691 1327141 1255060 1323545 1467210 1506024 1889685 923687 1177133
18283 1177133 1272875 1412324 1516645 1060508 1516006 1814328 1310184 944306 1242946 1682425
18273 1682425 1382530 1607754 1746198 997181 1420424 949884 957423 1255795 1524657 1271221
18263 1271221 1279730 1324987 1136732 977441 1095528 1678358 919688 806748 1003818 1144352
18253 1144352 1773073 1373191 1235974 1418465 1473374 1058470 1736184 1492331 1689371 1270075
18243 1270075 1303906 1461707 1457973 1539351 1271690 1686854 1152253 1385691 1401491 1469210
18233 1469210 1611531 1552430 1541211 1117132 1597812 1234597 1383550 1323924 1178531 1280556
18223 1280556 1239003 1303133 1507529 1186312 672846 1075328 1085324 1253340 1151121 1341639
18213 1341639 1045019 1409863 1472455 1240959 1426019 1405342 1193610 1255441 940677 973821
18203 973821 1112985 1461160 1392939 1206044 1837635 1261199 1236228 1307689 1245896 1142231
18193 1142231 1444368 1215424 1579051 1067822 1642962 1435509 1443374 1477813 1128506 1198056
18183 1198056 1051155 1020881 935841 1197313 1484343 1370559 1152447 1587747 1569209 1299110
18173 1299110 1316113 1054594 1366187 1145246 803896 1043863 1251882 1451487 1178839 1515206
18163 1515206 1271878 1336851 1154343 976848 1557063 788082 931121 1372295 1234279 1002726
18153 1002726 1087471 1470221 876467 956661 1081464 1424069 1128483 967925 1417123 1230621
18143 1230621 1237967 1739743 793119 1462119 1470551 1054546 1462068 1089938 1238394 1125287
18133 1125287 1187800 1481915 1246206 602318 1295094 1182411 1312711 1382078 1534358 1000607
18123 1000607 1742032 1375036 1560305 1125128 1447721 1107221 857217 1484295 1552783 808192
18113 808192 1070215 1001966 1145905 875855 1611154 1259424 985636 1497584 1110418 1119142
18103 1119142 1376591 1119406 956164 862012 657920 1043585 1397348 1417913 1381634 1194337
18093 1194337 1112071 1352881 1359094 1324723 1062800 1031956 1407936 1425601 1077864 1583473
18083 1583473 1001683 1264181 1617304 1354547 670692 1507868 1204215 1359646 1007689
18074 1007689 572673 1089732 1226068 1227151 1154861 1352389 1275874 958382 1227109 1091081
18064 1091081 1221585 1035886 1076164 1387031 1155967 974951 1040643 1279892 1199683 839021
18054 839021 1619557 1183339 1243792 908901 1230794 1253907 1454536 981651 1251395 961806
18044 961806 1073038 930425 1549454 931497 1051171 704788 1073428 925744 1169985 1362689
18034 1362689 938549 1164831 1282168 1361795 1028410 1313246 1274667 933908 935251 1750024
18024 1750024 1472506 786717 1072633 1021166 1163158 1354898 889462 1200035 891105 1254487
18014 1254487 1098099 1139069 1255389 1238234 1119710 807612 1215929 1330072 1409229 1326198
18004 1326198 1262586 1277158 1293602 1077301 777901 743197 1382419 1373585 961843 744392
17994 744392 1203460 1185167 1306186 1390635 1064288 1133800 1270009 1710214 951064 1388483
17984 1388483 1290557 990173 1203994 1275857 1143968 876012 836685 862150 979100 1391710
17974 1391710 1361938 1066979 1138747 802978 1421106 687325 1262410 1170935 1293395 1142571
17964 1142571 945694 1607162 1035439 1260816 1689839 1067897 913763 1702863 1273919
17955 1273919 1335572 885662 1040836 1251464 1302565 1033936 1554539 1283367 982175 1507466
17945 1507466 1315579 1105933 1369866 657117 1680590 1391383 1254217 1923967 1170213
17936 1170213 1205904 1066521 1702685 1131808 1222924 1561316 1228645 1376645 1803827 1584201
17926 1584201 1256483 1225353 1623712 1739398 1446695 1180482 1460329 1874562 1581976 1610523
17916 1610523 1122145 1726644 1319131 1946364 1286680 1608081 1677399 1194830 1669406 1588035
17906 1588035 1462443 1504384 1418581 1535725 1677222 1975581 1792487 1904789 1918584 1626773
17896 1626773 1785418 2109182 1593566 1606337 1643492 1439033 915513 1402947 1772135 1680962
17886 1680962 1567242 1883641 1910173 1694420 1458638 2068335 1872453 1420665 2233541 1893485
17876 1893485 1749889 1725759 1473369 1708911 2274602 2010174 1647616 1906109 1958049 1733422
17866 1733422 1636179 2057566 1918740 1988522 1575486 1627270 1926238 1917473 1884887 1574631
17856 1574631 1961223 1985429 1768780 1689185 1455019 1462429 1848671 1740393 1893801 1857504
17846 1857504 1815197 1829386 1452354 1781784 1607891 2040993 1738774 1455066 1862300 1631438
17836 1631438 1947936 1562300 2001656 1658594 1544299 1662464 2019300 1812273 1521326
17827 1521326 1980961 1449619 2148363 1757873 1485643 1688955 1440310 2038712 1791986
17818 1791986 1891521 1939296 2132571 1962802 1953984 1766248 2244132 2425898 2492854 1928017
17808 1928017 1977208 2056864 1744944 1557364 1778960 1426944 1771715 1894279 1969667 2239787
17798 2239787 1790924 1782151 2142691 2220123 1843754 1975911 1732014 1748100 1813198 1385533
17788 1385533 1516639 2036888 1613360 1636644 1842333 1530441 1645272 1610311 1332062 1099370
17778 1099370 1317369 1604937 1228742 1531745 1420917 1508328 1332908 951282 1733493 1405198
17768 1405198 1563376 1617504 1973879 1439738 1640756 1585683 1747086 1654045 1330901 1444509
17758 1444509 1792216 2167299 1650984 1335065 1489348 1487442 1291551 1297090 1428596 1295410
17748 1295410 1469539 1657059 978401 1546896 1489336 1600998 1660871 1488316 1708595 1948331
17738 1948331 1848161 1632084 1576153 1216378 1844834 1379276 1429473 1559515 1668597 1710402
17728 1710402 1721133 1504261 1640331 1499890 1712034 1364546 1502089 1644622 1469143 1300828
17718 1300828 1386052 1232749 1761348 1354605 947209 1576630 1211664 1297003 1368505 1208485
17708 1208485 1869231 1726475 1239577 1099906 1504538 1739867 1613813 1417331 1111994
17699 1111994 1276583 1429164 1253492 1545298 1092718 1687433 1239545 1442584 1616837
17690 1616837 1940410 1701493 1932688 1757822 1269411 2226609 1581153 1617520 1305332 1219447
17680 1219447 1981082 1690641 1620184 1818393 1521769 1442992 1639299 2045230 1912791 1450435
17670 1450435 1124054 1199475 1487932 1376736 1477199 1711491 1890126 1498106 1822920 1924121
17660 1924121 1930660 1687467 1380658 1904176 1536247 1446053 1994952 1792604 1725665 1704839
17650 1704839 1501267 1962141 1957223 1950848 2246099 1965324 2153123 2131544 2218797 2263071 2055505
17639 2055505 1837641 1994451 2043140 2422571 2108645 2359206 2143276 2422376 2207314 2011831
17629 2011831 2130522 2565207 2726644 2422209 2167698 2379485 2789623 3191118 2445973
17620 2445973 2738501 2835940 2723539 2838052 2691437 2353120 3374886 2835325 3178038
17611 3178038 2881089 3203851 3164619 2713511 3337885 2602477 3025946 3049788 2888541 3011874
17601 3011874 2720727 3456911 3493237 3051072 3005934 2792022 3073650 2989458 3126585 2779219
17591 2779219 3027440 2881849 3472212 2788058 2883091 2719868 2671911 2992111 2787509 2664235
17581 2664235 2913039 2551959 2654147 2928109 2847673 2699066 2676430 2701498 2452088 2943672
17571 2943672 2616650 2898880 2604130 2589656 2969314 2640424 2666426 2770321 2328532 2416606
17561 2416606 2922821 2461453 2168334 2961882 2468563 2571795 2447554 2374017 2322681 2377836
17551 2377836 2480151 2382677 2303113 2634485 2776401 2477115 2141261 2411362 2502521 2388927
17541 2388927 3007674 2685431 2688740 2868959 2866504 2706116 2852884 2758144 2881031 2717377
17531 2717377 2590729 2564641 2677631 2705222 3185193 2944232 3195106 3046741 2955523 2453305
17521 2453305 3286266 3036373 2242185 2734985 2643266 2772987 3369126 3228978 3364852 3220269
17511 3220269 3482542 3236566 3773371 3652181 3874465 4410744 4578016 4433672 4164301
17502 4164301 4207297 4193535 4825542 4476659 4580423 4515390 5055888 5352686 5508974 5913879
17492 5913879 6250019 6642036 7634557 8044895 9449130 11766546 14686225 20434053 30405918
17483 30405918 42783882 56483813 68759085 79017854 86738770 90269810 91088417 88212578
17475 88212578 80795287 68758988 55118332 43116818 34980029 33137725 37370842 46139551
17467 46139551 58250584 70569751 80656634 87907745 91884637 93024112 90369480 83974406
17459 83974406 72317368 57560717 42846199 30539533 22373510 17006234 13398706
17452 13398706 11405052 10097200 8919635 8538660 7342494 7471368 7854779 7952603 8022800
17443 8022800 8688333 8790686 9507966 9443762 8851376 9200740 8971179 8278316 8304209 7723659
17433 7723659 7000617 7563131 7329966 7485218 7858823 8095811 7987017 8341362 8027110
17424 8027110 8042744 7650628 7599180 6722749 6506315 6020390 5519650 5506178 5636922 5528506
17414 5528506 5416518 5429919 5394448 5616547 5819139 5256248 5881871 5583907 5558530 5734385
17404 5734385 5878967 6465617 6328256 6943885 7564701 7342475 7489280 8286855 8707666
17395 8707666 8213377 8599672 8904943 9261914 10209325 10726399 11801713 12598204 13404053
17386 13404053 14173062 14789582 15966521 15781175 16279201 16292682 16062071 15351952 14969604
17377 14969604 13928015 14127439 13542282 13062408 13543029 13813122 14026753 14921208 15652462
17368 15652462 16391300 17759560 18180120 18738319 19902019 19902571 20190540 20209666 19765375 19705180
17358 19705180 19931957 19727128 18968991 19019624 18877035 19489941 20212608 20755467 21518374
17349 21518374 22370941 23610123 24696070 25946835 28111393 28630731 30387950 30254897
17341 30254897 31560479 31257725 31078590 30988359 29892164 29882451 28034532 27821150 26803145
17332 26803145 26928134 27113213 27274778 28452003 29248957 30799333 31760019 33523138 34741531
17323 34741531 36141121 36649654 37647746 37485834 37415850 36845562 36341404 35419262 34323313
17314 34323313 33615243 31567694 31222104 30296187 29473363 28677623 28086351 28698061 29037165
17305 29037165 29316656 29695126 30675989 31856176 32291537 33375294 33801778 34271140 34260244
17296 34260244 34359193 33207750 31982197 32103724 31155481 30514553 29635905 29110002 28421833
17287 28421833 27280107 26964243 25653256 26067940 25595717 24664076 24028130 23118484 22131759
17278 22131759 20997099 20010157 18790398 17355769 16765201 15440814 14541958 13876310 13776821
17269 13776821 12919154 12449276 12501568 11774802 12254372 11454770 11215477 10791013 10706119 10213346
17259 10213346 10274763 9874028 9680176 10202716 9373240 9632239 9592980 9577111 9248825 9167048
17249 9167048 8687698 8845779 8115511 8482503 8006156 8236057 8361858 7773847 7924308
17240 7924308 7784051 7441561 8002669 7144316 7149676 7195484 6793244 6219533 6934237 6816739
17230 6816739 6676031 6838929 6249610 7095272 6437801 7000230 7121127 7020970 7006404 7377167
17220 7377167 7509182 7392762 7178751 7668328 7371608 7432699 7594815 7229160 7957252 7149982
17210 7149982 7618725 7161531 7638263 7688265 7864137 8308982 8266800 8723930 8390884 8587807
17200 8587807 8752047 7880080 8137968 7567476 7571439 6766191 6732178 5971910 5679928 5823221
17190 5823221 6396407 6300421 6005619 5890404 6417558 5606882 6420620 5886546 5379904 5284529
17180 5284529 5315137 5123363 4787610 4769294 4448512 4436285 5199463 4732025 5038042 5217644
17170 5217644 5009379 4682943 5031527 4689023 4674125 5216111 4798373 4792419 4512891 5644635
17160 5644635 5266484 5763654 5280745 5830009 5830302 5684218 5622324 5777827 5377058 5900601
17150 5900601 5444391 5731079 5670221 5724410 5306449 5762029 5319280 5387739 5336214 5474146
17140 5474146 5243519 5740492 5664565 5217856 5261286 5298297 5645674 5590079 5822232 5537023
17130 5537023 5348975 5797490 5278348 6005774 6329117 5611573 6472299 6901581 7019743
17121 7019743 7205563 7177821 7409525 6475416 5994426 6268538 6023336 5704566 5172493 5052036
17111 5052036 4811670 4517701 5124253 4617594 3476177 3949150 3236338 3855418 3688923
17102 3688923 3861134 3663571 3673024 4034772 3254618 3798784 3360667 2823986 3172715 3017391
17092 3017391 2908319 2917752 3213430 3161030 2648170 2631991 2815957 2651410 3191560 3233336
17082 3233336 2928147 3117039 2672182 3098440 2591261 2333294 2757584 3167388 2985058
17073 2985058 2605095 2860858 2949155 3066901 2429952 2648390 2597426 2518006 2627469 2707578
17063 2707578 2633445 2599011 2663906 2771326 3143248 2950894 3118106 3147048 2680657 2830476
17053 2830476 3010155 2456900 2843698 3442554 2884217 3226870 2561597 3455806 3110538
17044 3110538 3261882 3339641 3502957 3360184 3216686 3763538 3493257 3348335 3527554 3181882
17034 3181882 3202287 3092295 2659143 2989762 3217515 2935578 3081874 2914943 2766300 2947046
17024 2947046 2812254 2611710 2852191 2638749 3036744 2774137 2687366 2879502 2684394 3108278
17014 3108278 3123250 2431737 3040995 2893204 2175196 2563407 2666312 2428414 2774112 3004620
17004 3004620 2837443 2800135 2768073 2967981 2576984 2837292 2618496 2839602 2625737 3011963
16994 3011963 2713197 2849597 2449682 2580632 2481716 2732350 2754919 2785896 2889794 2837945
16984 2837945 3108962 2735070 2651818 3023292 2752323 2854128 2737656 3051657 3410123 3126144
16974 3126144 3089594 3763378 3729836 3316490 3486263 3801945 4085037 4080959 4811892 4881023
16964 4881023 4974117 5722110 5465671 5647005 5813226 5935777 6341747 6331307 6566130 6326528
16954 6326528 6779411 6527416 5790571 6633649 6189637 5997943 5794793 5679490 5553455
16945 5553455 5106311 5114927 4698881 4859509 4333792 3958353 4200357 3945150 3324179 3582455
16935 3582455 3500586 3393746 3548646 3064217 3123813 3626012 3536723 3018383 2914535 2942554
16925 2942554 3245142 3438397 3041387 2953214 2268117 2884628 2225369 2576336 2962443 2105208
16915 2105208 2308085 2626278 2507458 2818165 2433035 2366440 2465663 2450389 2141369 2461989
16905 2461989 1533745 2118279 2406913 2315182 2187034 2538721 2295973 2568072 2017033 2099212
16895 2099212 2636402 2173123 1828416 2084990 2275035 2358604 1959734 1796421 2107430 2157780
16885 2157780 1748242 2417896 2256242 2157790 2201305 2283030 2099242 2117178 1888675 2204379
16875 2204379 2076130 2300520 2485273 2636412 2587791 3047883 2256016 2379409 2494675 2407893
16865 2407893 2263615 1831126 2090849 2119542 2686589 1979981 2326892 2594670 2570458 2557869
16855 2557869 2552081 2694850 2514487 2218305 2365867 2575081 2684428 2438850 1788216 2552414
16845 2552414 2317939 2429822 2158039 2125864 2006827 1958826 2115206 2207955 2381518 1804819
16835 1804819 2075180 2301136 1798993 2029921 1982887 2893186 2172245 1895244 2038946 2107214
16825 2107214 1912291 2464220 2470131 2852437 2774030 2772142 2623134 2895527 2958943 3232723
16815 3232723 2792901 2885916 3150230 3037271 3052373 2970427 3162141 2782581 2713345 2703147
16805 2703147 2781234 2795862 2693203 3022392 2878027 2660514 2826978 2753728 2832615 3061269
16795 3061269 2653124 2443419 2930171 2417725 2071057 2341745 1929945 1713894 2135724
16786 2135724 1955584 1809739 2014245 2273951 1565683 1662691 2060925 1758501 1921619 1608544
16776 1608544 1987947 1331215 1970244 1920904 2248482 1475240 1930961 1902029 2414443 1597392
16766 1597392 2303422 2029500 1507765 1973273 1644745 2050641 2182589 2158693 1818939 2078760
16756 2078760 1708982 1857897 1790386 2175977 1984583 2092637 2472889 2228324 2108363 2368818
16746 2368818 2084837 2219747 2355381 1717154 2383071 2180597 2325311 2255465 2100363 1798436
16736 1798436 2405224 2415491 2004047 2389758 2339071 1998289 2204091 2401181 1725841 2292213
16726 2292213 2453273 1964544 1787435 2533556 2413296 2184252 2617264 2419145 2247767
16717 2247767 2711535 2200973 2542236 2423612 2351783 2389408 2316054 2540816 2558953 2871245
16707 2871245 2786370 3124782 3685054 4047211 4058939 3761860 4273677 4343046 4382577 4274178
16697 4274178 4751436 3805009 4339612 4004106 4320104 3654915 4015214 4424719 4719877
16688 4719877 4566132 4599463 4980411 4684488 4459733 4897019 4569270 4620371 4215615 4323498
16678 4323498 3474929 3504022 3475914 3365536 3458253 3314780 3103308 3554874 3622342 3365589
16668 3365589 3847618 4107491 4019377 4159109 4637817 4405853 4189441 4289042 4180684 4533553
16658 4533553 4676519 4036855 4060721 4346701 4545811 4748401 4488840 4373027 4139696 4394095
16648 4394095 3889612 3487412 3285016 3015443 2975197 2899391 2017141 1955715 2552424 2274753
16638 2274753 2422998 2021876 1729611 1877838 2306100 1751681 2204573 1685000 2315702
16629 2315702 1923214 2276992 2029708 1930934 1981002 2121305 2542869 2318891 2243633 2420831
16619 2420831 2656997 1971131 1905466 2309998 2021941 1940340 2301313 2460445 2660414 2225264
16609 2225264 2606229 2166896 2372283 2028668 2326965 2618128 2544835 3065958 2493734 2921907
16599 2921907 3152193 2893549 3023215 2956526 3073121 2939946 2969919 2608554 3184804 2420621
16589 2420621 2914300 3094042 2660348 3398606 3194731 2583399 2712681 2819622 2429495
16580 2429495 2607204 2753131 2216090 2837471 2260857 2340367 2108633 2486589 2160286 1749027
16570 1749027 1932706 2079789 2422373 2066550 2291251 1738184 1714328 1976026 2138664 2461228
16560 2461228 2183762 2232826 2027230 2087575 2091213 1811111 1961978 2392803 2267591 2196726
16550 2196726 2679524 2554748 2350093 2460316 2440710 2382579 2096751 2325336 2496523 2220564
16540 2220564 2176025 2305264 1833640 2167944 2255982 2046789 2217273 2061311 2095830 1941801
16530 1941801 2540306 2273724 2000968 2368450 2267984 1952383 1841751 2353702 2053538
16521 2053538 2284967 2452970 1832770 2817921 2214754 2727448 3090186 3121516 3269560 3221387
16511 3221387 3362781 2725070 3081838 2790416 2602970 3049007 2419134 2218354 2295746 1704443
16501 1704443 2126765 1671144 1731456 2048629 2032506 1895283 2078047 1814146 2255212 2403461
16491 2403461 2674791 2614596 3184046 2991627 3868894 4193636 3494533 3685239 3942601 4194794
16481 4194794 4049594 3696876 3704788 3587799 3683963 3191948 3574112 3791630 3309054 3603798
16471 3603798 3282481 3801301 3385263 3385299 3460994 3289345 3181065 3138616 3020716 3040284 3144392
16460 3144392 2907179 3052784 2603340 3107593 2944415 3953046 3579713 3574661 4581453
16451 4581453 4179783 4588661 4987973 6158037 6899435 7531278 8752436 10080462 10860800
16442 10860800 11081793 12338070 13153831 13560742 13932696 14003206 15645790 15578058 16787497
16433 16787497 17857915 18986672 21261571 22893264 25139020 26924871 28950724 30964187
16425 30964187 33632596 35687259 38929177 42942917 46462823 50610453 55507253 61229098
16417 61229098 66950953 73833930 81438769 89464252 98014624 107931449 117032132 125424498
16409 125424498 130995454 134839139 137685367 140149107 141961848 142768115 143598395 142211239
16401 142211239 138081121 132714038 125286014 117827632 110002187 101845680 95557367 90015643
16393 90015643 88487569 94410907 110617403 136848657 165241195 182370548 184988178
16386 184988178 176509504 162582717 145039373 128971771 112142355 92003103 61207449
16379 61207449 20336042 -18859575 -40920645 -36378945 -12479919 17873513 47052286
16372 47052286 70714056 89549635 102390364 108934604 111083329 108893951 105442700 100436940
16364 100436940 94459616 88889187 83156163 77650535 71699593 65845079 59416019 53901014
16356 53901014 48582935 43709346 39078697 34691321 30294730 25873581 22179578 18528226
16348 18528226 15417933 12483312 10494000 8849313 6355600 5088000 3860808 1972141
16340 1972141 1239298 191430 -33244 -259052 -797760 -614487 -833383 -689749 -312996 -21482
16329 -296279 50129 434621 311946 854524 800745 1155049 1644760 1690246 1697058 1887077
16319 1887077 2489211 2581984 2563392 2392337 2297185 1796340 1865452 1583669 1527692 1468029
16309 1468029 1521060 997468 526327 518095 512227 170504 445424 -112523 343432 -206683
16298 -114656 -493209 -694268 -929859 -1235591 -1128494 -1729906 -1378367 -1704802 -1518718 -1787862
16288 -1787862 -1574868 -1289947 -1158498 -975540 -544655 -298232 -406585 -84684 -432240 597407
16277 743561 652958 1086429 1430014 1348694 1869163 2297369 2141028 2205342 1686139 2161190
16267 2161190 1839116 1974052 1829447 1401747 1838986 986684 674410 774488 673215
16258 673215 877129 513890 551079 565405 309809 1071817 800696 935235 810934 801792
16248 801792 1065700 1196077 987453 1111885 1325330 1398873 1438153 1667639 1469395 1637161
16238 1637161 2520856 2070120 2156127 2438973 2207379 1366805 1557862 1230248 1060342 1569559
16228 1569559 929507 677666 773563 997202 676412 459736 769595 1138739 750236 629768
16218 629768 651517 727808 1007696 757472 576305 711315 683165 524297 1411698 775400
16208 775400 587038 1230046 466009 593294 1250854 834577 1157883 1009028 917320 983845
16198 983845 586776 891235 1120179 596879 1043929 921177 770768 536289 824359 858943
16188 858943 321052 733777 1085171 1187735 1300494 1148976 1311758 1141161 877223 1465035
16178 1465035 1549371 1543128 1675115 1672331 1429030 1186669 1650297 1398781 1930307 1657982
16168 1657982 1662908 1628478 800035 1480191 1262906 947623 1159367 1667629 1580055 1090569
16158 1090569 1362407 1138575 886961 773603 467533 970488 960557 1094395 962689 903648
16148 903648 1443811 1218410 1231570 1698309 1593434 1576700 1433633 1893579 1714067 1739018
16138 1739018 1152191 1865578 1447466 1184473 1800471 1495070 1186880 1785612 1264429
16129 1264429 1680570 1019118 1592378 1174418 1274841 998953 1319016 1456823 834021
16120 834021 1231536 954037 1265036 868128 1173465 1482969 1419186 1085144 1381534 1236812
16110 1236812 1025608 1567898 1525907 1464012 1706947 1760312 1650485 1973546 1548129 1864434
16100 1864434 1967199 1771958 1307327 1455716 1709983 1768435 2227112 2306740 1981711 1317260
16090 1317260 1646813 2059793 2021098 1796220 2400172 1984522 1819692 2132821 2308527 1790946
16080 1790946 2200849 1955044 2117664 2143269 2023883 2120067 1858544 2462055 2252666 2408664
16070 2408664 2487714 2234716 2240474 2438722 2460221 2655991 3117533 2771201 2920025 3187283
16060 3187283 2608658 2762777 2575840 3113854 2869278 2970743 3195055 3109437 2758535 2555075
16050 2555075 3219353 2997951 3368409 3434105 3163517 3475670 3340660 4060173 3149564 3246135
16040 3246135 3099008 3697208 3794760 3006115 3487623 3564210 3425651 3779769 3592440 3587459
16030 3587459 3436136 3464063 3282443 3511967 3508248 4377802 3630205 3431644 3712669 3820434
16020 3820434 3967630 3953761 3731143 3871755 4197610 4609970 4593948 4281356 4874158 4511512
16010 4511512 4447852 3984879 4307217 4275553 4924506 4306665 4269666 4165823 4193776 4469592
16000 4469592 4669733 4342246 4262835 4395395 4157113 4323186 4350718 4676642 4694949 4785649
15990 4785649 4642153 4663399 4024944 4454454 4555834 4297295 4483160 4506135 4772166 4541662
15980 4541662 4517887 4151445 4889127 5059268 4574996 4541754 4957575 5214545 4472491 5064026
15970 5064026 4728373 4708886 4850134 4360805 4706568 4142481 4574316 4338866 4656359 4476378
15960 4476378 4329473 4519279 4513043 4449257 4428534 4409420 4326124 4558442 4907208 4490288
15950 4490288 4554437 4236877 4317519 4577123 3861641 4973931 4711447 4137235 4484823 4299711
15940 4299711 4726425 4328089 4704111 5009151 5176510 5029503 5084319 4822781 4748043 5288123
15930 5288123 5433963 5373165 5417537 5367511 5852709 5443470 6047610 5817766 6273755 6083156
15920 6083156 6719027 6786967 6791520 7482903 7994516 7894950 7882214 8617483 9301999 9819466
15910 9819466 10861671 12436294 13887103 15887382 18480000 23083514 28299813 36713436
15902 36713436 47206187 59935981 74997570 88870593 101265665 111446683 118206615
15895 118206615 120662534 118579137 112266695 101605556 87452386 72430769 57959664
15888 57959664 45590196 35260867 28356874 22589753 18735567 16104068 13618670 12036948
15880 12036948 10546201 9473532 8977832 8202431 7650822 7050785 7497627 6955989 6679566
15871 6679566 6212135 6077007 6115529 5808957 5679379 5955171 5377473 5887216 5165108 5046478
15861 5046478 5162114 4777360 5142253 5128986 4582701 4824135 4951198 4887592 4953885 4803264
15851 4803264 4500846 4545569 4709287 4435610 4667852 4920774 4237246 4540207 3950862 4561010
15841 4561010 4286620 4935883 4826029 4594030 4899669 4732953 4984967 4658617 5081344
15832 5081344 5298108 4542213 4677418 5203893 5038149 4611065 5028992 5291259 5077967
15823 5077967 4841956 4291021 4879857 4611796 5163746 4492606 4663254 4850876 4857212 4961195
15813 4961195 4689017 5162825 5417235 5348689 5586703 5163677 5866969 5626047 5538367 5738799
15803 5738799 5633998 5779616 6127413 5479696 6403872 6564028 6508116 7035328 6840078 7397877
15793 7397877 7095360 7799414 7636055 8019544 7794803 7768153 7741670 7768582 8511955 8184286
15783 8184286 8957527 8971610 9613370 10131038 10110102 11042850 10589435 10714258 10945402 10710347
15773 10710347 10370130 10440724 10436071 10450519 10443853 10319640 10441237 11018398 11047121 11106197 11581942
15762 11581942 11239425 11339396 11846214 11343210 11136056 11329898 10970967 11007520 10549219 10328830
15752 10328830 10066538 10484779 10402005 10590981 10594425 11188138 10615440 10715766 11583095 11619199
15742 11619199 12498005 12654304 13461036 13635570 14185099 14085090 14154484 14205452 14439135 14528991
15732 14528991 14710456 14234934 15103092 15420998 15697188 16274666 16773129 15991313 16078080
15723 16078080 15987227 15338797 14761400 13939767 13887784 13566216 13839920 13883400 14540485 14091907
15713 14091907 14623815 14262069 13397109 13197003 12741223 12674494 12329890 12422207 12560369 13218794
15703 13218794 13907468 14420608 14619754 15391999 15334437 15362633 15875900 16175263 15804698 16083990
15693 16083990 15893627 15814910 15671055 15211220 14997544 15124826 14973056 14744290 15006879
15684 15006879 14552591 14570159 14357481 14353332 14348921 14339430 14101959 14051403 13862463 13543556 12916232
15673 12916232 12732734 12534713 12476769 13063736 12467051 12845084 12578091 13289360 13884844
15664 13884844 14553095 15234168 16133110 16826098 18432582 18900255 19963227 21328851 22392321
15655 22392321 23776008 25449960 27043739 28524297 30113975 31871873 33461721 34351670
15647 34351670 34787563 36658098 37567428 38604347 39543663 41492336 42563894 44764051
15639 44764051 46244611 48029264 49806367 50411705 51504524 51368973 50621551 50027557 49589161
15630 49589161 48503650 48190900 48356111 47963529 47313010 47825058 47205874 46658251 45982735
15621 45982735 43686591 42008763 39684386 37423988 35069877 32938763 31299882 29875935
15613 29875935 28558397 27880208 26586132 25864846 25033021 24032841 23823027 22526710 21611523
15604 21611523 21171931 20464530 20033795 19798278 19725378 19482780 19525809 18886945 19226675 19900940
15594 19900940 19637798 20830500 22475219 26732309 34822644 49164811 65744996 79226784
15586 79226784 87838010 94514215 98079404 99542486 97038119 90222494 75157375 55704086
15578 55704086 39147717 29929604 24928838 21455543 19293497 18154825 16740509 16241721
15570 16241721 16079504 15569373 15875298 15717481 15999854 15698745 15664430 15987019 16210454
15561 16210454 16365106 16170360 17285070 18242115 21857577 27443446 41192509 61085515
15553 61085515 82928959 98217855 109508441 116932377 121499650 121953149 118178188 106092540
15545 106092540 84209370 58486455 39416095 29539556 23148596 19091931 16993013
15538 16993013 14856024 13790383 13022975 12748647 12709151 12492706 12664066 12684114 12148585
15529 12148585 12158188 11861826 11566169 11616772 11005322 11033198 10638855 10503246 10482023 10657989
15519 10657989 10409850 9711661 9886295 10201081 10193567 10395616 10160463 10746370 10914723 11084666
15509 11084666 11706340 11439064 11517227 11970121 12048352 11569248 11604927 11554223 11485967 10861849
15499 10861849 10892573 10989605 10407339 10894865 10661603 10884441 11470717 11159874 12118021 11771634
15489 11771634 11995818 12465306 12238932 12498755 12483793 12557886 12847165 13852437 13681480
15480 13681480 13827840 13804525 14393941 14237542 14547357 14381054 14572518 14909182 15297688
15471 15297688 16855415 18358988 19922147 21372522 22162922 23338172 23976041 23437440
15463 23437440 23656675 23019573 22529345 21094647 20560906 20081598 20736826 21289012 22604589
15454 22604589 23306081 24604556 25391036 26412967 27054822 27327637 26404161 25865588 25314419
15445 25314419 24476268 23693402 22984439 23496445 23271250 24464446 24861265 24602023 24865128
15436 24865128 25047957 24657066 24422745 23958826 23062671 22083098 20644421 19896107 19307896
15427 19307896 19372685 18400554 18161211 17689800 17242186 16312500 16280431 16004273 14818028
15418 14818028 15073743 14297563 14125054 13926127 13589505 13269775 13391058 13465825 13257588
15409 13257588 13442534 13315266 13758919 13189494 13394271 13309351 14081782 13930990 14452638
15400 14452638 15027197 15483723 15636479 15504926 16253337 16488948 16242805 16173892 15224354
15391 15224354 15324848 14865779 14295157 14161634 14848534 15097027 15100003 14945440 15317571 14828990
15381 14828990 14969270 15006847 14933025 14448453 14751933 14283027 14542795 14845724 14481585 14179822
15371 14179822 14058338 13868241 14955330 14435463 14996086 15150352 15489509 15772453 15884257
15362 15884257 16395484 16509277 16823950 16539835 16846485 16597508 17091558 17595456 17659757
15353 17659757 17970956 19122802 19535788 20890662 23783626 27897523 34989117 44872792
15345 44872792 53683660 60183016 65451303 68448396 70411614 69947765 68101879 62196412
15337 62196412 53470136 44708243 39357128 36634779 35326585 34037723 34063082 32849246
15329 32849246 32311996 30823307 29319677 27854307 26869714 26431129 26268425 26732110 26442293
15320 26442293 26909176 27552267 28434147 29216325 31731985 36609219 45420937 58618593
15312 58618593 74523039 88636133 100498620 108621013 112922220 114486040 111259899 103031654
15304 103031654 88119498 69672069 53151146 40864892 33067242 28711552 26244315
15297 26244315 24808824 23856964 23442675 23481308 23380797 23462014 23861321 24111075 24675321
15288 24675321 24483589 24346830 24474090 24602329 24366207 24353311 24610584 26304993 30441689
15279 30441689 36409359 45442130 52138186 57347767 61632768 63701217 65094154 64141500
15271 64141500 61303560 54989589 45332611 36547019 30811511 27414975 25791231 24870784
15263 24870784 23276738 22620334 22479141 21403445 20793257 20678173 20558553 20669910 20884484
15254 20884484 20868104 21628992 22504273 22680181 23027489 23865346 24281588 23931630 24015978 23914399
15244 23914399 24251239 23560779 23265296 23169128 22602948 22503624 22981025 24056477 25258697
15235 25258697 27438304 28695158 29958521 31035868 31162594 31465092 31021904 30463202 29020257
15226 29020257 27749144 27294716 26090967 25164099 24337590 24557644 24605744 24818457 24599123
15217 24599123 25231734 24971834 25426453 25463564 26408955 26332206 25901171 25174583 24207172 22930508
15207 22930508 21845159 20631548 18731271 17159425 16424019 15748256 15474041 14746052 13989251
15198 13989251 14021395 13650826 13538984 13317319 13667073 13894215 14401172 14812481 15486964
15189 15486964 15875250 16190677 16769750 17069002 16867889 17068978 16807144 17720984 17563626
15180 17563626 18087612 18861356 18700952 19071706 19481959 19852600 19809248 19947806 19568232
15171 19568232 19362780 19207816 18848722 19140809 18336476 18476143 18700398 18578980 18943020
15162 18943020 18426487 18437076 18996312 18793685 19121119 19402104 19438135 19205481 19342485 19330610
15152 19330610 19204761 19370809 19478971 18714176 18340947 18637998 18408297 18792066 18496278
15143 18496278 18602655 18854292 18978383 19151619 19669695 20057701 20088526 20432113 20736528
15134 20736528 20691910 20803170 20751087 21007318 20534468 20494442 20227135 20440803 20366182 20326035
15124 20326035 19765392 19340969 19036054 19149526 18263948 18138809 17450840 17689030 17230460
15115 17230460 17387712 17593357 17209592 16884241 17232010 17027953 17378015 16336694 16946853
15106 16946853 16832628 16599664 17050434 16977271 17631340 17864247 18171973 19230768 19811994
15097 19811994 20079515 20641298 21623718 22869240 23522698 25060240 26972783 29895753 33705902
15088 33705902 37611639 40747892 42914712 45274418 45681257 45982998 45818890 44168692
15080 44168692 41415297 38303005 36066594 36313506 37293371 39925773 43896794 47519907
15072 47519907 49437909 51824582 53182797 53604688 53484217 53401117 50888506 49355050 49477255
15063 49477255 52690890 58123458 61665974 64936264 68319147 72153504 75715865 78610659
15055 78610659 80404707 78793269 76481693 75936682 77880617 80232632 83723721 87086536
15047 87086536 88900575 89369481 88631794 89408396 90077929 90738258 89628813 87692467 84128545
15038 84128545 79903947 77363638 74287498 71228427 67196040 62925629 59046891 56435173
15030 56435173 56390950 58381082 60106160 61433222 62562242 63009037 63643503 63690064 62973264
15021 62973264 61216716 57787938 56323551 57622555 62240777 68380515 75100242 82218493
15013 82218493 86967875 92235589 96454616 99963021 101969640 102312253 100668358 98049922
15005 98049922 97783729 98197220 99523332 101885054 104045454 107803445 112432604 119124069
14997 119124069 126562588 134457830 142033811 149309673 155574099 159794603 163389502 165304647
14989 165304647 166423825 166030175 165470964 164103218 162277823 163424870 166449550 173212569
14981 173212569 182012848 192026713 202607909 212163299 221723570 230590118 238621488 244992344
14973 244992344 248236684 247536555 245198084 238394479 228565442 215718300 201246798 185856182
14965 185856182 170877461 156178193 143617512 132242626 123078514 116126067 110446025
14958 110446025 108127561 108163728 112162417 119845240 133250267 152694302 177258120 206344501
14950 206344501 239775566 277622092 315950955 352754281 389174174 421963106 442755980
14943 442755980 449130408 443278076 427998522 405279762 379152105 351766569 320236817
14936 320236817 284814394 252345419 229935668 216004985 206675653 197601026 186263019
14929 186263019 172669438 158847530 145607129 135550630 126360200 120292512 116297080
14922 116297080 113233646 109273515 105463623 100418291 95937011 91623012 85244229 76429821
14914 76429821 66265722 54980904 46919397 40963587 37690656 34891242 33146937 32581924
14906 32581924 32074489 32310023 33263053 34186979 35417744 36767503 38717738 40891164 42824579
14897 42824579 46957311 52315930 58426469 64371626 68932766 72449283 73968989 75366509
14889 75366509 74846489 72953961 68238217 60950564 53599297 48546383 45769558 43965767
14881 43965767 42660549 41295246 39328326 38649303 38594169 39307850 40267347 41743488 42317096
14872 42317096 42765741 42997602 44407571 45564570 46444366 46784352 46822771 46004549 46316562
14863 46316562 47576636 49384669 53044359 59361874 68048714 78214561 89214058 101101188
14855 101101188 112457353 120386813 125467501 127136234 123733899 115806788 105400578 94210511
14847 94210511 81100625 69032480 59194985 51886962 47282038 44636364 42547907 40923672
14839 40923672 39601875 38973269 38119629 36909532 35730829 35544543 34950403 34261579 33719768
14830 33719768 33141130 33167169 33531479 34001985 34936994 35444968 36338598 38272710 41444303
14821 41444303 47015683 55422149 65239253 74415558 81269541 86426404 88909124 90190610
14813 90190610 88087807 82637157 73736196 61467812 49717886 40482596 34729973 31053695
14805 31053695 28705502 27690027 26872731 26277462 25478909 25676596 25980501 26167486 26830552
14796 26830552 26610127 26732544 25853414 26098075 25612523 25139829 25125765 24295730 23434124
14787 23434124 23715535 23593269 23977534 24239664 24534154 24458693 24950587 25357665 26438824
14778 26438824 28008551 28628178 29431837 30237373 30655141 30297530 29728653 28754154 27493376
14769 27493376 25791623 23934656 23077312 21632300 21384576 21571015 21743380 20926261 21228166
14760 21228166 21353637 21640643 21138822 21531944 22006963 22224948 22570082 23640195 24608948
14751 24608948 25579694 26882812 27216543 27737717 27933068 27838047 27702119 27657077 27316854
14742 27316854 25843892 26181846 26579287 27671114 29112289 30890756 33898581 37359542
14734 37359542 41986454 48889029 58898116 75207839 99706989 133017060 172181521
14727 172181521 213018807 251954155 284333728 306008390 317793648 317643862 303102587
14720 303102587 273197097 233296261 189634500 146691920 110142536 83681777 65352391
14713 65352391 53940070 47062547 41969728 38471957 35892558 33567502 32251797 30826114
14705 30826114 29845446 28067031 26049669 23164134 21786413 20492214 19479841 19402499
14697 19402499 18923910 18903733 19617324 20151276 21024299 21344821 21825080 22400976 22715403
14688 22715403 22801083 22652261 21597326 20101736 19979694 20202955 21219582 21566686 22493398
14679 22493398 23344899 24739585 26087078 28208450 29600351 30180118 30392018 29776645 29244992
14670 29244992 28314853 26999496 25166105 22902626 21889257 23054273 24847064 25535417
14662 25535417 26549749 26841989 26863854 26610859 26097644 24751056 21304034 18045665 15936856
14653 15936856 14797824 14884516 14385891 14425351 15820634 17902938 20129876 22111652 23344427
14644 23344427 24591484 25463061 26645856 27409182 27837661 28047501 27958241 28386690 30445936
14635 30445936 32049669 32915083 34127945 33857758 32571290 30576899 27428623 24395434
14627 24395434 20151219 16889030 14968850 12467623 11370106 10748692 10132175 9959136
14619 9959136 10393571 9893187 9911681 10253362 10278068 9915129 10238131 10362704 10205853 9677121
14609 9677121 9210246 8985655 8981068 8991416 8910575 9002247 9914305 10743778 12420187 14338796
14599 14338796 17510757 20303690 23064413 24633616 25170241 26090056 25392017 23783603
14591 23783603 21610915 18463554 15368012 12945925 10714502 10248793 9842810 9269294
14583 9269294 8940568 9586462 9786282 9274253 9188816 9615692 9238567 10199338 10002635 10317943
14573 10317943 10930944 11755733 12168565 12667087 13736362 15128971 18355510 21324966 24205522
14564 24205522 25127877 27365285 29242608 32662272 37982135 45721754 52826684 59002971
14556 59002971 63394475 66682496 68965395 69549359 68273998 63963332 55937549 44718243
14548 44718243 34989172 28397261 26578775 27402962 34164462 43897358 55524486 65530354
14540 65530354 73782910 79262598 82433551 83201171 81338747 74526845 63757755 51245699
14532 51245699 40088061 32780193 28635010 26562852 25793671 25771694 25635428 25654074 24887089
14523 24887089 24033043 23667144 24882117 28655949 35685046 42236421 49218726 54239635
14515 54239635 57728931 60432528 62633298 62383375 59514815 54431884 48103288 43134873
14507 43134873 40389853 40906891 42347142 46334323 52006117 57377422 59853420 61724393
14499 61724393 64202484 65522810 64809201 62918256 58862392 52845294 45853653 41151689
14491 41151689 37095035 33647092 30048239 26884036 25002915 22118968 18576117 15176553
14483 15176553 12297814 10203662 9799922 8462122 8691601 8322541 8614040 8543021 8770756
14474 8770756 8902245 8794695 10133324 12101157 13901874 15541576 16482712 17351889 17755396
14465 17755396 18305921 18323197 17318597 16928931 15811250 15257363 16390006 18841177 20553861
14456 20553861 21699334 23113313 23954073 24124181 23046709 22114079 19738287 16264233
14448 16264233 14262243 12792368 12161868 11696520 11837455 11810373 12263946 12295823 13302925
14439 13302925 13445500 14256478 13785978 14841816 15067633 15909581 15814051 17061446 18583531
14430 18583531 21680147 25032753 30961942 38760943 45499324 52262898 57069259 60601645
14422 60601645 62582689 63038783 61257318 56734199 50334838 42916689 37019774 32003871
14414 32003871 28681904 25542180 23410802 21792116 18947559 17240204 15499462 14810892
14406 14810892 14264686 12927788 12958401 12954150 12766219 12637687 13187991 13193319 13747121 14479793
14396 14479793 15171989 17860555 20614058 25606799 33175789 43995566 56115132 67688599
14388 67688599 78252270 86366029 91747049 94986748 93588957 88688321 78635439 66663736
14380 66663736 54104421 42874273 35060673 28536439 23955045 20870123 18548961 17006998
14372 17006998 16200233 15667465 15074188 14904739 14509526 14739879 14016862 13733436 13905299
14363 13905299 13943396 13911279 13737520 13462183 14346217 15966964 17492961 19948694 23438600
14354 23438600 27439325 32188844 36996826 40686776 43548978 45210583 44787894 43775033
14346 43775033 41594357 38280167 32497530 27313733 22945196 19207235 17790677 16200143
14338 16200143 16845321 19940390 26346004 33898550 40069083 43413999 45827938 47964547
14330 47964547 49357650 48608298 46182691 39127144 28751159 21382870 17665603 15936486
14322 15936486 14973975 14246179 13495770 14025774 13750760 13775114 13975408 15237381 15954817
14313 15954817 17227432 18519429 19450537 20657989 22191704 23633061 25067750 26749267
14305 26749267 28296744 30500500 32589806 36613262 40627993 46051607 52447099 61338677
14297 61338677 72858287 86914976 105896090 129247745 158359080 190815408 223916077
14290 223916077 253960476 277067791 292421074 299345354 297976864 287590312 268440320
14283 268440320 240715980 207040896 172997844 141674108 116395055 95364886 79442216
14276 79442216 66555584 56540195 48401144 42436366 36854730 33158786 29357130 25971500
14268 25971500 23648487 21221700 19370373 17631990 16319835 15338118 14324668 13137309
14260 13137309 12059713 11799065 11343917 10704542 10839775 10320914 10125557 9919081 9594126
14251 9594126 9105937 9391016 9200521 8935671 8528446 7822151 8128846 7468871 7834090
14242 7834090 7627112 7052978 7219499 7209692 6975050 7129700 7270147 6915254 6490943 6464990
14232 6464990 6468469 5923354 5870400 5130543 5494754 5462454 5835562 5525261 5288051 5037186
14222 5037186 5331199 5181941 5331448 5122298 5541352 5895870 5819283 5667011 6117610 6216052
14212 6216052 6294302 5975216 5851177 6207331 7668458 8900486 9372316 10077835 10477508
14203 10477508 10463247 10840106 10639729 9975975 8573310 6698463 5619059 5049254 4916136
14194 4916136 5358805 5548737 5375025 6019713 5595731 5778502 6455210 5806961 5538527
14185 5538527 5442144 4912670 5477316 5091990 4665413 4658254 4822516 4520823 4742667 4465208
14175 4465208 4757911 5196857 5647640 5731046 6332344 6259777 6161194 5887125 6048160 6515509
14165 6515509 6228910 6008046 5336251 4886947 4757727 4642087 5116767 4890278 4779321
14156 4779321 5007378 5188896 4828506 4661577 5085566 5125333 4541244 4776045 5266449 5317489
14146 5317489 5658392 5376793 5539456 6413246 6793136 8271193 10384115 13237789 15234348
14137 15234348 16883323 18748546 19759649 20638624 20554950 19702530 17830850 15568793 12989516
14128 12989516 11249669 9326116 8226223 7274488 6470890 6288190 7346253 7668527 8834455
14119 8834455 9979900 9698508 10269832 10410929 10308428 10413143 8729194 8166906 7246180
14110 7246180 6719153 6627501 6106090 5431373 6257163 6349721 6379378 5827703 5926723 5955499
14100 5955499 6587001 7263229 8384707 9721831 10391990 11682592 11733357 12104411 12039965
14091 12039965 11717139 11522919 10377990 9780900 9454796 9185906 10692285 12299783 13447188
14082 13447188 15303902 15567677 16184149 15783137 16089102 15480655 13623356 12457302 10104356
14073 10104356 8834472 7459092 7314495 7233221 6895365 7415395 6953875 7264372 7306720
14064 7306720 6948790 7396051 8029458 8568064 10280282 10569892 11533342 11820695 12546266
14055 12546266 12631813 13019991 12818083 12466768 12162601 11542748 11980386 12827928 13083016
14046 13083016 14704038 14917885 17248641 18453829 19100661 21288908 22049831 22566607 22643235
14037 22643235 22830378 22775075 23410436 23772603 24131665 24886439 25894305 28306260 31181433
14028 31181433 34604476 38985343 44042663 50897441 59759190 70546808 84414294 103122479
14020 103122479 127072358 157276808 191787903 227506333 260384175 285687744 302533824
14013 302533824 309397717 308206010 297630070 277885385 248167538 212954857 176046390
14006 176046390 143304604 115899487 94453422 77838835 64932923 54910371 46787356
13999 46787356 41039129 35735191 32002087 28373369 25958375 23368861 21652195 20135096
13991 20135096 19191332 18578322 17964500 17775328 17900649 17422591 17667126 18325655 18809377
13982 18809377 18271498 18503862 18253733 17773312 17323523 17148444 16933397 16243936 14337721
13973 14337721 13363788 12585873 11801682 11194103 10137146 9694384 9392362 8771016 8254533
13964 8254533 8208131 7172460 7526591 6957044 6438379 6239777 6531763 5868832 6170335
13955 6170335 6064837 5852480 6307765 6546390 6434264 7046278 7233920 8128628 8295831
13946 8295831 8671920 8961003 9146584 9547053 10266192 10538938 12210607 14690036 18871738
13937 18871738 25246828 32234861 40690541 49215657 56987241 64237295 69564608 71420556
13929 71420556 69735862 64455284 57371668 47686186 38370007 29286652 21727813 15273099
13921 15273099 12563725 9688562 8239736 7163175 6644622 6096570 5617923 5339595 5262685
13912 5262685 4454540 4767491 4712073 4868300 4913572 4513627 4467251 4185736 4259036 4371605
13902 4371605 4511873 4161679 4127232 4250328 4375979 4824028 3910558 3690864 4371206 3881473
13892 3881473 3361280 4016324 3949585 4565075 4691126 4509085 4595638 4535492 4435892 4042220
13882 4042220 4518387 4513461 4172275 3720647 4030218 3949013 3629906 3774687 3971942 3589220
13872 3589220 3212368 3827450 4126974 4280188 4205814 4199673 4277118 3866112 4340016 3872871
13862 3872871 4094855 4847423 3900396 4278215 4583251 4374999 4690264 4106608 4419608
13853 4419608 3964495 4500748 4228256 4596105 4502251 4611552 4646714 4197411 5023624 4630438
13843 4630438 4314433 3886941 4852557 4253082 3996490 3792022 3335790 3543576 3292765
13834 3292765 3441670 2843251 3459242 3568832 3427939 3332040 3729822 3669356 3558820 3727736
13824 3727736 3724868 3574899 3635959 3421952 3862336 3587916 3617020 3545947 3623578 3881266
13814 3881266 3115262 3264791 3393963 3802035 2914716 3299869 3116620 3316077 3211031
13805 3211031 3123470 3350204 2726756 3374432 3341344 3420497 2733727 3467962 3568026 3948941
13795 3948941 3987530 3555328 3583942 3983022 3688051 3913679 4033064 3515984 4006072 3507035
13785 3507035 3022029 3451078 3597981 2982574 3251252 3050690 2981030 2780479 2852038 3342822
13775 3342822 3204541 3804180 3038237 3202462 3651007 4370880 3672245 3567645 3924493
13766 3924493 3448597 3645682 3948986 3757301 3681299 3640362 4067207 3583843 3477832 3741752
13756 3741752 3493367 3414203 3267000 3324422 3117234 2742435 3056744 3089914 2825224 2915001
13746 2915001 3496906 3056496 3180686 2988857 2920283 3034325 3469494 3003080 3420846 3389453
13736 3389453 3691407 3459502 3284001 3670374 3876765 4070593 3923493 4078837 4634694
13727 4634694 4736083 4944175 4441888 4437189 4691769 4673404 3986778 4011389 4102729 3462323
13717 3462323 3334403 3782004 3366800 2989439 3515526 2953233 3404940 3465722 3736604 4088798
13707 4088798 3478728 3674058 3884992 3754524 3565728 3591950 3809136 3837450 3842567 4202630
13697 4202630 4448057 5103727 6011107 6611216 6591842 7357924 7164412 7697328 7908802 7254363
13687 7254363 6779810 5796734 4887043 4996754 4131449 4351652 4048383 3888879 4423681
13678 4423681 4023375 4436049 4283577 4566085 4990967 4710469 5373652 5514403 5549063 5847760
13668 5847760 6244235 7031060 7487986 8494055 9122002 9573562 9618977 10324595 9642236
13659 9642236 9639028 9401276 9241015 8189587 6717564 6440860 6035342 5902460 5230783
13650 5230783 5271662 4831804 4616355 4531053 4384639 4367158 4501314 4555833 4311274 4721232
13640 4721232 4097921 4769779 5119925 5022345 5568001 6361962 7339962 7927422 8311415 8224347
13630 8224347 8405650 8259678 8257109 7243021 6440931 5155820 4562334 3725201 4263681
13621 4263681 3966157 3949776 4062075 4149870 3539636 3794256 3718904 4239535 3960670 4246372
13611 4246372 4813338 4543029 4804000 4989458 4948496 4913141 5080707 5033145 4853178 4147787
13601 4147787 4457284 4415167 4012157 4143308 3802973 4321589 3737983 4534655 4516585 5281870
13591 5281870 4875643 4815540 5131642 5053112 4802445 4810239 4117002 3655380 3904104 4072379
13581 4072379 3634126 3159306 3896080 3641779 3559279 2688406 3695485 3543034 3053136
13572 3053136 3572953 3058913 3088266 3612658 3720555 3351516 2943432 3273174 3774116 3618421
13562 3618421 3604133 2804282 3141434 3138228 3865741 3283744 3122192 3452867 3440204 3462631
13552 3462631 3482453 3320001 3316800 3636160 3521151 3109984 4240136 4532150 5143851 5270331
13542 5270331 6532142 6285062 6911741 7329485 6764216 7106992 6010601 6368957 5032052
13533 5032052 4719775 4207549 3941814 4156269 3836847 4621060 5069734 5369693 6665371
13524 6665371 6468972 6634185 6885867 6736673 7224792 6783583 5396591 5150432 4614670
13515 4614670 3941791 3506044 3895214 3330947 3167324 2418144 2774923 3021291 3221836
13506 3221836 3401187 2950242 3095639 2519003 3067740 2976214 3030388 2802163 2903906 2903257
13496 2903257 2996273 2390339 2615812 2986219 3002860 3185100 2508805 3278797 2852615 3123776
13486 3123776 2231511 3074536 3113258 2719592 2140094 3093948 3103580 2953087 3264649 3072708
13476 3072708 2990582 2830629 2393239 2763394 3032387 2982755 2994233 3157861 3286630 2903566
13466 2903566 2647207 3061157 2866837 2947607 2609522 3138515 3458347 2866068 3548347 3337620
13456 3337620 4223843 3700030 4520668 4843502 5671101 6643554 6477562 6649397 7317102
13447 7317102 6766634 6552032 6278183 5441455 4360991 4256408 3954172 3366438 3474795
13438 3474795 3220776 2732435 2984883 3013358 3052844 3459832 3472537 3271311 3169462 3550357
13428 3550357 3250194 3945651 3554755 3846442 4759633 5311430 6067041 6775093 6914950
13419 6914950 6862178 6920486 7036838 6843047 6300595 5616212 4593621 4016128 4284875 3741266
13409 3741266 3439544 3279952 3265783 3400063 3455358 3264342 3073043 2997302 3108956 3075367
13399 3075367 2978281 3307029 3307710 2935430 3132960 3310664 3726220 3323122 4258448 3672446
13389 3672446 3721947 3999769 4871944 5468094 5294963 6005690 5897606 6394725 6186053 6306311
13379 6306311 6147192 6136709 5632853 5242395 4544487 4549991 4449378 4010802 4337076 4455512
13369 4455512 3808297 4706685 4480779 4907943 4428066 4445154 4750850 4627938 4556561 4266597
13359 4266597 3780514 3700086 3994233 4212894 4378748 4993240 5013890 5440547 5215380 4957389
13349 4957389 5507869 5523894 5110417 4516602 4247887 4275096 4202662 3805201 3951378 4273510
13339 4273510 3684856 4024353 3775051 3722703 3983361 4100485 4242765 4381323 3830581 4198536
13329 4198536 4022983 4364041 4232215 3827477 4237705 4195392 4156917 3781356 4556684 4457223
13319 4457223 4518873 4520124 4616016 5105659 5632719 5430276 6502863 6231566 6379056 6196667
13309 6196667 6414912 6708651 6461812 5772299 5953573 5984056 5000818 5753177 5513108 6415250
13299 6415250 6607441 6256253 6912855 6962973 7136477 7103587 7249682 6913290 6570082 6413488
13289 6413488 6315453 5930769 6207092 5838426 5755064 6525051 6083152 6299030 6027077 6230786
13279 6230786 6608956 6429059 6803049 7037426 7041264 6821136 7567144 7069882 7280658 7458851
13269 7458851 7376078 7331852 7682318 8188941 8192318 8707336 8650989 8638843 8668333 9215971 9650412
13258 9650412 9918201 10110319 10570230 11068031 11507863 11891952 11711428 13085482 13345169
13249 13345169 13258096 13758666 13628120 13769677 13549015 13733674 13605850 13678881 14311860 14151679
13239 14151679 14137696 14229495 14701471 14851231 15419160 15795414 16086175 16815135 17266197 18173852
13229 18173852 18806703 19365614 20370879 20500976 20707339 20991326 21070459 21469176 21112253
13220 21112253 21058323 20694774 20012114 19292877 18878745 18654241 18788443 17764072 17571251
13211 17571251 17028033 17143849 16937757 17147140 16798119 16908303 17236816 17233919 17405018 17601274
13201 17601274 17453685 17291519 16790723 17392749 16741185 16437150 16677737 16001919 15125983
13192 15125983 15332283 14474030 13897928 13762367 13975597 13166790 13300258 13015526 12525275
13183 12525275 12290257 12247030 12349412 12001921 11727134 11993181 11100109 11487581 11233306
13174 11233306 10902213 10813876 10769098 10305934 10693585 11031441 11049894 10801664 10763461 10566769
13164 10566769 11216126 11765882 11782955 12128670 12656630 13096446 13596222 14047393 13995834 13678813
13154 13678813 13951889 13564293 13477173 12930317 13085213 12461526 12185438 11763737 12042405
13145 12042405 12112962 12184691 12288358 11803464 12342386 11533240 11156457 11048186 10140628 10094681
13135 10094681 9382243 9001700 8167324 8014207 8165011 7989157 8569194 8414428 8890518
13126 8890518 9124006 9161101 8362262 8580946 8705650 8608233 7961603 7185056 7114782 7411426
13116 7411426 6750503 6467970 6320719 6355368 6374081 6663264 6195483 5973394 6443365 6106927
13106 6106927 5997518 6263945 6129511 6462695 6269916 6928547 6883237 6703262 8009059
13097 8009059 8421128 8930486 9633071 10158361 11239525 11871700 11550327 11979279 11821843
13088 11821843 11605777 11192394 11113279 11001223 10687588 10778194 10755294 10917237 10374339 10566333
13078 10566333 9619309 9356420 9406171 8770400 7812166 6932099 6712833 6836918 6079908
13069 6079908 6079773 5754929 5791349 5890373 5524039 5607646 5168967 5820428 5503551 5819792
13059 5819792 6084343 6125160 6293694 6511323 6579922 6196068 6374977 6641298 6132502 5956858
13049 5956858 5438992 5629916 6168155 5917877 5491380 5732259 5619044 5686194 4956579 5950830
13039 5950830 5748525 5788257 5882572 5912627 5844531 6214588 6562664 6341542 6630124 7222084
13029 7222084 6848632 6975618 6827314 7118050 7083090 6792573 7011930 7173956 7030252 6873325
13019 6873325 7543267 7773100 7502279 8170733 8019105 7953039 8329602 8314296 8480434 8839421
13009 8839421 9191266 9259072 9268998 9732852 9990426 9851437 10123194 10022300 10186431 10788953
12999 10788953 10513932 10739791 10979739 10901872 11397372 11650097 12011381 11890572 11985585 12125822
12989 12125822 11872450 12656171 12418220 12196988 12494799 12447619 12396387 11960893 12390658 11931579
12979 11931579 12789518 12429617 12483104 11969664 12076995 12209271 11222948 11354340 11056857
12970 11056857 11092793 10834989 10673745 11192888 10651021 10783869 10411956 9933258 10430447
12961 10430447 10575048 10285448 10212897 10142100 10043485 10221688 9765545 10051022 10157917 9881435
12951 9881435 9864315 9937696 10786233 10536123 10148301 9654439 9976394 10035275 9831418 10076738
12941 10076738 10246458 9733764 10089960 9876014 9910350 10243703 10245483 10298385 10976546 11201670
12931 11201670 11448226 11461829 10994881 11190152 11199085 10913020 11063329 11065431 10355400 10697694
12921 10697694 10791388 11059974 10784207 10789485 10911705 10604268 10564531 10150925 9983251 9469851
12911 9469851 8915992 8919345 9070388 8538651 8427128 8565746 8197782 8186319 8164051 8439999
12901 8439999 8199858 7963312 7329645 7381590 7072680 6770184 7644112 7019251 7190931 7178514
12891 7178514 6462723 6567297 6576060 6710624 6332475 6750657 6142979 6537131 6345413 6350942
12881 6350942 6295371 6222103 6120758 6279200 6400524 6226759 6342574 6026779 6347869 5640135
12871 5640135 5927695 5837052 6218462 5982472 5880413 5743425 5711615 6101328 4883370 5578518
12861 5578518 5496256 5105178 5740214 5335597 5591881 5170246 5973150 5136112 5399059 5006227
12851 5006227 5606205 5882675 5579534 5701250 5278214 6025202 5479010 5560550 5460580 5333011
12841 5333011 5766013 5652309 5470193 5244984 5534047 5852105 6140779 5618810 5685137 6505348
12831 6505348 5987732 5573016 5886388 5493811 5705423 5930268 5976252 5698803 5768179 5639430
12821 5639430 5406288 5529184 5586179 5605912 5425217 5542750 5872731 5875167 5928272 5620962
12811 5620962 5746414 6007455 5942025 6462746 5978451 5620102 5284769 5945322 5968175 5972378
12801 5972378 5890693 6026646 6154451 5833887 5874301 6182960 5883091 6418361 6275611 6225474
12791 6225474 6503259 6040324 6018450 6294274 6284938 6332218 6550381 6060232 6685656 6422452
12781 6422452 6429878 6091697 6715906 5780117 5967617 6289719 6003837 5740557 6219348 6356988
12771 6356988 6070464 6147840 6138924 6664705 6289290 6423919 6277909 6622593 6455831 6158714
12761 6158714 7096800 6827227 6666818 6421809 6511939 6704337 6617371 6330810 7002026 6290225
12751 6290225 6859471 6886406 6488429 6157184 6149399 6379618 6286116 6303807 6187379 5933503
12741 5933503 6573630 6303269 6180180 6807883 6488138 6406704 6496593 6262134 6591427 6700777
12731 6700777 6591786 6231440 6759722 6745857 6662756 6412322 6833806 6378088 7024015 6678196
12721 6678196 6601812 6467423 6734959 6608015 6366792 6263713 6836375 6775580 6474358 6774095
12711 6774095 6830750 6774786 6946320 6720262 7172910 7665374 7586861 7893512 8158125 7999169
12701 7999169 7852107 8865639 8610437 8962442 8622017 8868885 9111175 8918452 9178199
12692 9178199 10191483 10621263 12311357 14076554 15694546 16744801 17304180 18539929
12684 18539929 18086575 17739532 16985808 15317348 13655097 12142485 10416075 9636901 9779127
12675 9779127 9970226 9660373 9223641 9475724 9679250 9382293 9681995 9717283 10381650 10222315
12665 10222315 10748642 10628649 10702958 10668805 10427672 10097897 10234360 9212009 9852027
12656 9852027 9730867 9560857 9911099 9699113 10281385 10430749 10981680 11665401 12035207
12647 12035207 12205347 12590835 13073691 12367865 12607165 13118796 12911967 12626347 12682144
12638 12682144 12676239 12487743 13253311 12934019 12920720 13248278 12689085 13322484 13599665 13502398
12628 13502398 13891521 14327678 14255906 14077144 13866098 13318198 13035782 13108797 12675985 11973987
12618 11973987 11245313 10903707 10478876 10235916 10401950 10675846 11349483 12059921 13315238
12609 13315238 13868405 14828686 15944127 16909272 17295860 17508117 17334467 16768875 16108310
12600 16108310 15456292 14578018 12782043 12338586 11491554 10480799 10809953 10265825 10221771
12591 10221771 10282912 11065181 11128487 11500433 11328139 11931771 12471883 12331410 12271471 12395370
12581 12395370 12678234 12800616 13358046 13889738 14587064 14411733 14641432 14395943 14522835
12572 14522835 14200771 12892169 11837191 11587722 11077974 10717681 10421895 9858388 10279985
12563 10279985 10624740 10175296 10334509 9804821 10027738 9953137 10472824 10441588 10105655 9715936
12553 9715936 10082291 10019516 9902817 9766520 10224792 10534612 10279142 10125920 10573518 10801868
12543 10801868 10829435 12293958 12839601 12839015 14193925 14026219 14251632 14622074 14341007 14133427
12533 14133427 13516677 12823762 11787415 11193838 10907928 10360832 10238372 10445383 10225142
12524 10225142 10420454 10480044 10823888 11054813 10798859 11026300 11094169 11772896 11582224 11850006
12514 11850006 13063104 14263623 15399266 17155692 17916706 19296163 19621503 20615641
12506 20615641 20383312 19756728 18621265 17316044 15096595 14204177 12938586 12340707 11920217
12497 11920217 12066405 12053461 11815253 11754193 11752968 12045946 11830786 11984642 12199828 11791711
12487 11791711 12472692 12212640 12632327 13421218 14308651 14966845 15904102 16695608 16617267
12478 16617267 17243699 17160940 17212371 17297674 15972643 14876449 13877054 13285580 13528410
12469 13528410 13144191 13355073 13134908 13398916 12884692 13489020 13862870 13578137 14085982
12460 14085982 14488346 14607825 14790028 15390425 15884725 16460204 16217788 17251873 18123735
12451 18123735 17888225 18796260 19194322 20221777 20693951 21353881 22187031 22499534 22683489
12442 22683489 23051666 23143549 23401206 23912472 22796710 23300534 22777790 23180332 23301242
12433 23301242 22929565 23202628 23767696 23611985 24637735 24778762 25461829 25912788 26979063
12424 26979063 27554255 28754674 29329984 30110868 31035095 32268829 33046458 34165518 34929466
12415 34929466 35904143 36541912 36784100 36859024 37068021 36684569 35852133 35982317 35351337
12406 35351337 34150069 33696763 33559295 32029576 31627981 31074504 31210455 30223206 30451819
12397 30451819 30417720 31025711 31543668 31214485 32044637 32562205 33427087 34280972 35077171
12388 35077171 36647835 36605755 37837660 37955396 38760770 39104985 39393504 39478080 39160590
12379 39160590 38665006 38710242 38541768 38340580 37827126 37631086 37700458 37453252 36947035 37160676
12369 37160676 36656422 36577104 36087416 35670541 35826236 35767626 35830798 35435678 35382671 34850456
12359 34850456 34615741 34802017 34249072 34559935 34600383 34519347 34201333 34211018 33957781 33074805
12349 33074805 33090735 32472998 31798887 31861466 32149670 32568475 32663735 32463973 33785770 34518629
12339 34518629 34600663 35368132 36213005 36955665 37517154 38152247 38975521 39315527 40343619
12330 40343619 40775543 41133808 41244099 41667604 42275012 42682274 42923809 42474695 43163706
12321 43163706 43013653 43003135 43354898 43170712 42787617 42776092 42679029 43074329 42735293 43530878
12311 43530878 43647823 43858606 44757095 45033740 45340934 46807970 47441244 47944046 48978664
12302 48978664 48726277 48651098 48027533 47123122 46259826 45271532 44532846 42915793 42320454
12293 42320454 42000495 40626001 40226330 40242467 39214768 38508272 38415316 37825345 36327078
12284 36327078 34934485 33894577 32766568 31869130 31155874 30621419 29897314 29276399 28923146
12275 28923146 28640207 28763689 27976670 28043312 27726757 27746241 27498836 27245862 27324544 27022100
12265 27022100 27357937 27202132 27582505 27078460 26891949 27122856 27654856 27575132 28220972
12256 28220972 28873161 29530292 31261775 32542840 33982348 35803019 38056720 40044109
12248 40044109 41556045 44065845 46493118 48939352 50392408 51439843 53315433 53633772
12240 53633772 54086956 54445772 53789184 52648438 52136592 51616133 50716870 50555057 49696936
12231 49696936 49299397 48282034 47651676 46246513 45053108 42821739 40326675 38061479
12223 38061479 35535120 33663342 31555162 29868324 28481104 27328448 26657365 26068487
12215 26068487 25306744 24443070 24331627 23603209 23698477 23161497 22746559 22230015 21316004
12206 21316004 20943685 21162319 21060032 20867972 20842525 20955952 21496690 21472528 21448326 21299318
12196 21299318 21719694 21927047 21444014 22482041 22877541 22743980 22999070 24038493 24559993
12187 24559993 24728747 25499811 25674541 25944961 25619710 26146397 26631732 26415023 25940609
12178 25940609 26576794 25949771 26142195 25487769 25338837 25449408 24928140 25058437 24998969
12169 24998969 25501426 25783687 25573454 26153310 26562359 26859832 27353669 28445470 28755832
12160 28755832 30209805 30848408 31240386 32162363 32327283 32540229 32288543 32252903 31256548
12151 31256548 31149666 31234373 32601750 33427847 34699793 36294481 38030323 39476665 40256080
12142 40256080 42164207 44028949 45059968 46467400 47811571 49100478 51077898 52927295
12134 52927295 55125626 57485758 60935358 64343363 67325454 70758857 75101105 79035652
12126 79035652 82578373 85861002 88493357 89895571 91641249 91873272 91346322 90459131
12118 90459131 89508496 87839469 86184411 85341486 83733647 82553536 80560105 80007700
12110 80007700 78559363 77763282 77150829 75648029 74965697 74004488 73560693 73865276 74187861
12101 74187861 74394062 73903711 74733278 75089008 75168362 74419192 74326212 72806809 72027168
12092 72027168 71280943 70019817 69411966 70305135 71681598 74106611 75148578 77380679
12084 77380679 79868261 80686025 82812178 83399535 83230575 82662899 82448846 82263803 81611048
12075 81611048 81188297 81020896 80658332 79645403 78370992 77263260 75673166 73676079
12067 73676079 71206212 68837156 65813265 63573672 61630656 59896386 58450531 57501142
12059 57501142 56658654 55916328 54917373 54624012 53834663 52580898 51430783 50489387 49584337
12050 49584337 48461338 47616872 46446376 45729001 45182459 45059473 43644864 43501540 42163130
12041 42163130 41672828 40500926 39574057 37910343 37554449 36053930 35633158 35156007 35651322
12032 35651322 35829310 36257007 37215323 38109273 38264856 39065385 39104701 39085986 38386166 37456759
12022 37456759 36062878 34344359 32734725 31172474 30122252 29033394 28441901 27867392
12014 27867392 27187864 27195070 26482320 26388069 25494350 24899997 24067455 23711874 23059693 23036731
12004 23036731 23076838 23472995 24206046 24200850 24847333 25075953 24994677 24494594 24269184 23418368
11994 23418368 23517065 22483965 21368181 21574536 21268697 21527334 21212942 21050263 20312239
11985 20312239 21060466 20711311 20299332 19610419 19574483 18275755 17720313 17762289 17455221
11976 17455221 17302647 17056080 16382240 15951245 15370606 15593353 14871180 14371870 13993437
11967 13993437 13807540 13415088 13279114 12585120 12704546 12787743 12463943 12338451 12751005
11958 12751005 13313651 13193917 13688496 13913780 14703754 13895517 14043823 14051583 13785220 13959267
11948 13959267 14391363 14799885 14837918 14785528 15188495 15827645 15836374 17024603 17259989 18000496
11938 18000496 17630983 18438719 18988076 19151344 18951053 18762941 18298403 18854908 18641459
11929 18641459 17756686 17339001 17258048 16705686 16436749 16121341 15637281 15205040 14904308
11920 14904308 14578313 14054906 13798351 13551316 13107477 13193155 12864387 12861592 13693420 14570913
11910 14570913 16417156 21803271 27491762 30278275 32826074 34561503 35344064 35867394
11902 35867394 34891302 32858035 27193593 20588818 15602475 14088771 12636194 12285917
11894 12285917 11815029 11891922 11540955 12304296 12033349 12573575 13204475 14034543 15032451
11885 15032451 16738600 17827195 19436051 20270681 21550135 22739316 23026538 22917205
11877 22917205 22064063 21137959 20279838 19286437 17479261 16843166 15707293 14074427 13921892
11868 13921892 12830860 12066387 11236575 10768743 10567916 10020914 10371948 10290772 9798619
11859 9798619 9958416 10070125 10364731 10160081 10262578 10336668 10160517 11100347 11042996 11540134
11849 11540134 12185294 12773115 12618305 13409644 14095716 14602090 15911720 16639395 17179278
11840 17179278 17334627 17408007 17063806 16445905 16419766 16113753 15159264 14183455 14083236 14424609
11830 14424609 13806810 13874242 13636889 14416916 14044089 13539936 12983703 12020648 10903577
11821 10903577 10529274 9396804 9592445 8621993 8896800 9008159 8166385 8914825 8739565
11812 8739565 8341727 7981681 8002469 7618240 7415952 7798550 7330392 7170425 7307948 7061242
11802 7061242 7150307 6762716 7045687 7098550 6518692 6799728 6642200 7033993 6906786 7211198
11792 7211198 7277779 7783385 8808088 9286695 10352228 10691602 10630116 11562679 11974702
11783 11974702 11741177 11051139 10607293 9633761 8674678 8463409 7287425 6952181 7197338
11774 7197338 7035621 7066969 6430965 6574673 6320431 6090070 6001670 6253086 5891832 5656321
11764 5656321 6230255 6166412 5634000 5773104 6307470 6051358 5503826 6023625 5872284 5979269
11754 5979269 6043070 5982905 5467369 5310086 5886913 5694508 5697001 5615485 5621955 5943836 5616275
11743 5616275 5884716 5608883 6068794 5967271 5504086 5105794 5746142 5934120 5351977
11734 5351977 5459509 5956536 5260440 5520291 5376094 5138168 5574396 5740269 5436898
11725 5436898 4915842 5498248 5537211 5479413 4948246 5076815 5043439 5012216 5725455 5638632
11715 5638632 5352681 5080863 4830017 5216778 5652778 4981599 5046504 5040169 5252864 5405724
11705 5405724 5500329 5563779 5445401 5641057 5503750 4831226 5662513 5871343 5707417 5280925
11695 5280925 5626409 5590079 5309964 5002387 5347232 5069501 5503541 5509208 5258247 5490568
11685 5490568 5742813 5590523 5575473 5923301 5797948 5371260 5622255 6160867 5890055 5399025
11675 5399025 5962310 5746372 5938065 6339708 5774601 5948603 5864633 5701371 6147467 5855567
11665 5855567 6063501 5910029 6164653 5797855 6118411 5870380 5969479 5896052 6178644 6165130
11655 6165130 5852388 5807233 6010823 5935655 6410080 6144965 5812530 6308144 6062286 5856598
11645 5856598 6348057 6013891 5832081 6285279 6259635 6163921 6374695 6144631 6117227 6108657
11635 6108657 6532726 5643989 6366164 6274621 6374083 6079329 6569196 6136747 6428616 5990318
11625 5990318 6218435 6349438 6467686 6005823 6257683 6568095 6107301 6279988 6408472
11616 6408472 5941363 6151051 6045401 6245388 6226694 6178596 6080522 6585292 6585793 6343141
11606 6343141 6326851 6493832 6712168 6613226 6928153 7068557 7004227 7339379 7124315 7317162
11596 7317162 7088329 7403986 7111793 7032123 7084785 7550174 6792292 6907803 6658808 6530540
11586 6530540 6433178 6282701 6512543 6611237 5657233 6673190 6816938 6629796 6638671 6699513
11576 6699513 6949685 7307518 7461981 6796981 7061317 7397633 7086133 7282671 7193665 7265213
11566 7265213 7326746 6990792 7048528 7857696 6910095 7029889 6996202 6684632 6970878 6390654
11556 6390654 6988111 6845175 7289453 6793637 7092617 6911346 6717075 6732992 7014779 6593580
11546 6593580 6731494 6818190 6526246 6683767 6615884 6288512 6688405 6746054 6455728 6745396
11536 6745396 6901093 6649227 6808393 6938271 6704946 6694535 7077028 6772797 6664129 6735407
11526 6735407 6603483 6575127 6518335 6142337 6488379 6311197 6599647 6774326 6821703 6664637
11516 6664637 6521569 6085844 6464342 7050139 6790997 6778610 6875523 6510154 7118132 6536307
11506 6536307 6726848 6601928 6794418 6544478 6767160 6700752 6797715 6636863 6656658 6669597
11496 6669597 7045185 6999832 6643288 6827819 6688753 7109172 6784665 6880917 7413306 7708781
11486 7708781 7535345 7367221 7214423 7623093 7690296 7381013 7774670 7474040 7501625 7415998
11476 7415998 7332098 7709955 7329170 7437780 7525191 7628303 7584146 7622727 7258789 7400062
11466 7400062 7194433 7151201 6880129 7272588 7085992 7103432 6838639 6860829 6872596 7018117
11456 7018117 6833900 6737067 6887426 7079626 6410528 6990679 7348760 7409377 6963644 7243189
11446 7243189 6960194 6986588 7328787 7132492 7547273 7036147 7204260 7436041 6991334 8178208
11436 8178208 7327129 7301291 7759012 7917408 7568229 7921417 7830544 7680949 8558374 8004591
11426 8004591 8201538 8339375 8761906 8919361 8936967 9226731 8790582 9366145 9747642 9672741
11416 9672741 9779506 10016799 10324146 10129539 10309929 10738361 10782709 10888835 11212396 10694464
11406 10694464 11030031 11908651 11890993 11837484 12383970 12707834 12798931 12721739 13110158 13142960
11396 13142960 13948230 13877167 13560552 14726878 14758591 15082487 14965847 15293571 15540422
11387 15540422 15645294 15815535 16574244 16736339 16684273 17046399 17570284 18097828 17917105
11378 17917105 18015928 18289973 18682115 18617279 18146559 18400426 18807494 19025810 19069964 19505638
11368 19505638 19832543 19836093 19717640 20421919 20660139 19844867 20570235 20569220 20653044 20627339
11358 20627339 20763001 20811107 21379736 20654475 20880984 20330243 21299516 21028133 20730084
11349 20730084 20623579 20800930 20356780 20370322 20425492 20201497 19598850 19873545 20102258 19787174
11339 19787174 19928365 19399734 18834342 19067204 18562168 18874674 18434124 17997894 18273355
11330 18273355 17429469 17258378 17350844 17387053 17121038 16832848 16644570 16728113 16041197 15808503
11320 15808503 15525816 15488411 15054158 15010247 15024896 14491852 14311376 13680002 13319013 13561749
11310 13561749 13023570 12829214 12554632 12339184 12160758 11774930 11762841 11575723 11454862
11301 11454862 11220450 11012743 10848843 10316131 10032317 10176676 9918454 9827854 9927056 9740255
11291 9740255 9570170 9363944 9424387 8580098 8977140 8717202 8573446 8219533 8466282 8274230
11281 8274230 8221106 7660409 7621770 7468552 7474880 7380209 7508521 6945617 7380792 7367517
11271 7367517 7229147 7323959 6890789 7127228 7052905 7065900 6835626 6895596 6839497 6778363
11261 6778363 6694010 6786289 6505486 7278809 6726456 6240141 6436312 7159396 6338540 6577663
11251 6577663 6093350 6604628 6071650 6421255 6802941 6513412 6429786 6469353 6428763 6227130
11241 6227130 6316005 6659305 6596061 6685394 6232643 5913362 6435273 6187462 6416172 6718115
11231 6718115 6562290 6921343 6770669 7234728 7291750 7715069 9102436 10963812 13181349
11222 13181349 14707457 16157375 17131680 17680786 18244320 17889664 16414984 14448836 12318178
11213 12318178 9811873 8338955 7666083 7584839 7155890 7066588 7043122 7144570 6651349
11204 6651349 6869618 6882344 7150319 6827063 6998609 7033271 7001137 8390416 9464611 11772155
11194 11772155 13294865 15466972 16253235 17373620 17986723 17916420 17562415 16058596 14079113
11185 14079113 11904371 9529909 8731882 7587357 7640177 7219011 6975517 6708986 6677953
11176 6677953 6671021 7030270 6887743 6482216 7010678 6330874 6743400 6841802 6693318 6272470
11166 6272470 6809067 6555378 7010304 7078405 6848050 7063593 6842867 6849927 6710545 6585629
11156 6585629 6893213 7072544 6846604 6703974 6686285 6800535 7160638 6404097 7149279 7207473
11146 7207473 6898121 7083016 7120171 6867110 7356296 7622333 7509633 7878827 7459116 7396987
11136 7396987 7416965 7232446 7227688 7655056 7465402 7672357 7441339 7464322 8053681 8210887
11126 8210887 8022032 7605957 7625253 8103422 8215973 8148314 7787448 8114250 7785966 7620766
11116 7620766 7983514 8213738 8057154 8103867 8054229 8379629 8153959 8397855 8124952 8125557
11106 8125557 8060818 8598812 7949564 8392717 8497531 8267682 7785657 8267067 8154535 8141733
11096 8141733 8308303 8537780 8580327 8223163 8106563 8589152 8378978 8200038 8142361 8289557
11086 8289557 7917502 8263048 7710002 8072565 8089145 8230245 8517138 8424828 8540704 8243113
11076 8243113 8374699 8440069 8200605 8101576 8422765 8941968 8828123 8807040 8919529 9542859
11066 9542859 9108004 9439219 9505279 10050534 9395647 10032118 9952992 9837722 10429259 10292522
11056 10292522 10622646 10619850 11079260 11433370 11535603 11579339 11387710 11570170 12204550 11940813
11046 11940813 11717037 12134822 12358026 12393658 12165367 12457522 13103762 13188843 14101606 13706354
11036 13706354 14460768 14610760 14549372 15688418 15702326 16245495 16750532 17600958 16990263
11027 16990263 17589441 17835697 17941709 18635136 18650564 18514235 18841072 19122507 19691067
11018 19691067 19698743 19947209 19920118 20540198 20591646 21315772 21305357 21008512 22096600 22502854
11008 22502854 23013366 23400810 24409002 24732782 25302845 26119030 26282046 27238381 27058789
10999 27058789 28111036 28282551 28664400 28962045 29132707 29299612 29531683 29130473 29506519
10990 29506519 29720353 30143048 30471477 31011374 31203568 31784923 32393107 33068451 34372672
10981 34372672 35678698 36531105 37476202 38448025 39267580 39787415 40545240 40729048 40670314
10972 40670314 40580250 40878654 41030383 42408639 42613578 43573778 44150620 45551788 46834830
10963 46834830 47670664 48371585 49544185 50864323 52324271 53426413 54904195 56278237
10955 56278237 57934958 59970561 61183006 62153050 63165029 64399140 65739221 66389941
10947 66389941 66707677 67448477 67985431 68380943 69848928 71237537 72399925 73923073 75473044
10938 75473044 76959535 79128902 80760025 82561824 84718843 86083931 88113555 89666200
10930 89666200 91345676 93132392 94186874 95164686 96429610 97546318 98038131 99319172
10922 99319172 100037184 100582830 101373068 101198791 101308260 101417115 100866905 100731266 100157534
10913 100157534 99629985 99171971 99162601 98653932 98170997 98063438 98216233 98851026 98916852 98743824
10903 98743824 99052881 99825934 100574598 101178639 102144178 103289838 104553273 105719555 107032260
10894 107032260 109139546 111604469 114259738 117190277 120229480 124696506 129133215 133464566
10886 133464566 139840098 146072595 153608163 162124411 171157169 181227462 192226372 203369492
10878 203369492 213835833 224018395 232339492 239112576 243923912 246702810 246690937 243721312
10870 243721312 238830645 232252646 224110742 214633370 204873021 194683191 184143382 173608627
10862 173608627 163621372 154160275 144758521 136113318 127388140 119693049 111852845 105139832
10854 105139832 98132837 92970889 87366316 81958811 77347436 72427214 68333311 64940387
10846 64940387 61466227 57576936 54944471 51858602 49185080 46940670 44372974 42211474
10838 42211474 40162549 38920752 36866101 35931393 34216909 32348307 31463854 30463197
10830 30463197 29287678 28124616 26803796 26361444 25057597 24284843 23940568 22965714 22040814
10821 22040814 21311057 20534852 20899460 19835429 19364015 18428130 18130459 17849162 17664788
10812 17664788 16689085 16792492 16227323 16030156 15366021 15197541 15405515 14151682 14446006
10803 14446006 13906549 13258383 13342592 13556615 12970185 12743335 12505985 11946646 12069281
10794 12069281 11773811 11700897 11140865 10930349 11307144 10869733 10670741 10199212 10343715
10785 10343715 10470443 10246972 10069908 10187574 9776179 9387631 9876238 9194770 9539636
10776 9539636 8990033 8424858 8826539 8255447 8048957 8299716 8122554 8397440 8269467
10767 8269467 8342522 7668551 7943964 7630157 7927772 7401982 7697851 7271762 7346747 7110063
10757 7110063 7353659 7316371 7421575 7234720 7867810 7813912 7800447 7650760 7480788 8033252
10747 8033252 8077853 7693464 6941990 7135151 6474524 6726563 6780504 6313415 6280839 6308696
10737 6308696 5911058 6288304 6221882 6219494 6004586 6626690 6728096 6547663 6651117 6530550
10727 6530550 6554637 6864431 7311511 7114473 6419252 6698993 6813846 6435117 6606389 5973219
10717 5973219 6450648 5831067 6027639 6092479 5864970 5520555 6346469 5993117 5367504 6061622
10707 6061622 5896067 5837317 5899347 6096556 5929872 5985131 5762351 5845740 6105457 6027516
10697 6027516 5867708 6053627 5038035 5848450 5363621 5529509 5534051 5722421 5384776 5818714
10687 5818714 5750890 5933644 5068670 6208590 5863818 5842851 5417614 5834977 5782989 6482044
10677 6482044 6700337 7151364 7063530 7549043 8165890 7885063 7728509 7534704 7495992 7140333
10667 7140333 7189191 6398554 6489808 6425380 5698538 5636502 5570053 5320782 5308042 6099112
10657 6099112 5764302 5094707 5890014 6288591 6492305 6765080 6772647 6888900 7493648 7520514
10647 7520514 7392789 7126595 6868866 6700846 6013720 5371819 5076732 5094430 4531050 4624975
10637 4624975 4504256 3911195 4251160 4405446 4458806 4006429 4197833 3965301 4253893 4201229
10627 4201229 4094444 4439243 3955588 3567342 4185757 4367998 3928836 3789872 4268356
10618 4268356 3895748 3803651 4172959 4384010 4154285 4296645 4448293 3814718 4135587 4056288
10608 4056288 3761732 4257586 3710040 3857418 3799016 4045145 3713344 3971810 4084270 4102035
10598 4102035 4217433 4320670 4044736 3730849 4029638 4124311 4137440 3836832 3997261 3736440
10588 3736440 3738120 3914080 4018071 4040870 3647398 3801749 3646244 3406972 3830185 4100944
10578 4100944 3967664 3697503 3691995 3831233 4052396 3564450 3667545 4098721 4139225 4254868
10568 4254868 3927327 4463118 3609412 4186006 4284531 4221849 3718258 3470502 3438122 3294851
10558 3294851 3305384 2908041 3199173 3323227 3625226 3292844 3339696 3095613 3102722 3293198
10548 3293198 3649161 3008802 3430973 3690556 3000575 2862741 2983428 2648929 3116316
10539 3116316 2851343 2859981 3605292 3205505 3510465 2984207 3475734 3420859 2830442 3283871
10529 3283871 3252756 3375907 3403964 3064971 3608438 3522991 3751791 3979015 3919879 4187194
10519 4187194 4905783 5096430 6067925 6371346 6250232 6275948 6625615 6580724 5852447 5519000
10509 5519000 4335752 3950908 4175683 3531862 3512788 4068597 4173555 3812821 3522385
10500 3522385 3763594 3687942 4147305 4192100 3923303 4046271 3998004 5002652 4628605 5858431
10490 5858431 5853610 6724969 6589433 7421893 7007258 6809135 7055534 6801480 5843347 5326585
10480 5326585 4940172 4637691 4170173 4412052 4265383 4189752 4227887 4574776 4297847 4334681
10470 4334681 4464459 4703057 4565382 5438273 5639369 6044350 6209167 6273940 6178670 6734819
10460 6734819 6332472 6502327 6216259 5837960 5427787 5273824 5053156 5258113 5059418
10451 5059418 5227805 4595190 5011085 4873287 5060104 5521086 5388782 5246330 4790857
10442 4790857 5411618 5575845 5975228 6536186 7499120 8328907 8457058 9009649 9801066
10433 9801066 9256416 9451755 9215870 8192759 7239274 6366913 5640860 4905450 5107455
10424 5107455 5309231 5010391 4833204 5070236 4735241 4677211 5387070 4988905 4705965 4654997
10414 4654997 5407699 5310877 5444855 6115306 6902213 6875062 7716391 7547378 7865220 8377756
10404 8377756 8805918 7754337 7658812 7189084 6961465 6600197 6592985 6440057 6801024 6644408
10394 6644408 7456783 7638661 7973519 8235256 8086582 8390267 8669285 7960334 8093564
10385 8093564 8202381 7710466 7690302 7842225 8312894 8564281 8761951 8789194 9167010 9637304
10375 9637304 9834605 10220284 10499778 10607844 11329904 11046348 11264228 11493843 11482938 11934229
10365 11934229 11974150 11760446 11992401 11508757 11386332 11088787 10760413 9914108 9103620
10356 9103620 9223235 9143806 9591677 9361643 9758486 9744425 9890649 9474089 9809184 10036143
10346 10036143 9837221 9598430 9749019 9631968 9449386 8864394 9120915 8461159 9128277
10337 9128277 10110882 10390356 10567572 10465245 10721401 10671996 11223047 10517256 10461334 9829524
10327 9829524 9873483 9591618 9630195 9539677 9485697 9794452 9771018 9584925 9676618 9761298 9594794
10316 9594794 9380530 9948331 9948539 9507170 9852960 10257906 10349707 10896778 11351209 11831311
10306 11831311 11806606 12224782 11732995 12569636 12749386 12579297 12627187 12110570 12055670 11977379
10296 11977379 12609917 12624399 13299544 13293785 14147695 14683491 15783212 16227885 16921620 17808295
10286 17808295 19212907 19803175 20799945 21955284 22814364 23331259 24199194 24686636 25989917
10277 25989917 26323507 26797100 28469891 28754511 29152554 29879625 30478129 31651680 32438026
10268 32438026 33844759 34163232 35688290 36392827 37957368 38928548 40720122 42597311
10260 42597311 44071427 44464819 45628236 45763426 46515973 46759802 46107884 46413311 46040758
10251 46040758 46393061 46715925 47038310 48278606 48495318 49179113 49875098 49555456 49145436
10242 49145436 48139885 46989728 45265658 43757157 42662533 40489507 39605562 38940269
10234 38940269 38038184 37085590 36786119 35699472 35288967 34444500 34037875 32709707 32082908
10225 32082908 31744606 31047807 30058712 30304359 29943861 29675579 29546673 29144578 28739359
10216 28739359 28436032 27768991 26768072 26310208 25122577 23971116 22717501 21937286 20789854
10207 20789854 20316458 19094533 17650163 17375562 16168608 15130476 15019974 13932330
10199 13932330 13796492 13195440 12468259 11985700 12205913 11400307 10772916 10488260 10643515
10190 10643515 10525989 10283488 10056614 9377085 9548512 9185911 9492215 9832948 9150016
10181 9150016 9424563 8624018 8693794 8781329 8629225 8158984 8631048 8722535 8121542 8200335
10171 8200335 7379988 7751550 7615046 7457380 7621325 7516450 7197548 7446177 7478894 6573387
10161 6573387 6939831 7041568 6918944 7198425 7211503 7157455 6724477 6725799 7187903 6381086
10151 6381086 7145269 6572206 6492294 6976049 6444553 6775783 6910799 6823110 6375441 6644315
10141 6644315 6617343 6435668 5851220 6587799 6206766 5802152 6765494 6052636 5912992 6325251
10131 6325251 5595400 5979823 6368579 5826498 5334189 5694711 5554382 5324107 5324831 5843210
10121 5843210 5337550 5103050 5193640 4798959 5564373 5290141 5447337 5025058 4802466 5185413
10111 5185413 4808085 4925730 4986062 4503328 4934424 4787471 4663356 4590537 4413242 4631644
10101 4631644 4479706 4837479 4900128 4613648 4199368 4245373 4725333 4605912 4926389 4573446
10091 4573446 4229471 4837990 4201204 4296163 4534577 4690919 4601869 4586181 4213675 4842310
10081 4842310 4520023 4337842 4390125 4384682 4580088 4503506 4692573 4684016 4668916 4471111 4390118
10070 4390118 4738306 4397139 4789796 4789934 4594450 4716106 4589100 5105316 4562569 4940418
10060 4940418 4575649 4859101 4882956 5249890 4823069 5116369 5116055 5294226 4887094 5018097
10050 5018097 5162255 5179329 4732769 4763329 4850381 4695041 5080627 4844510 4770053 5148069
10040 5148069 4865783 4918438 5093633 4877186 4966537 5279445 4833813 5189758 4823395 5339664
10030 5339664 5113258 5178699 5015082 4871275 4608515 4851301 5194205 4819925 4990715 4835135
10020 4835135 4825778 4692536 4369025 4748488 4206649 4642405 4501792 4700820 4427292 4451070
10010 4451070 4554853 4298171 4406113 4499896 4477511 4377744 4418444 4497505 4169677 4459936
10000 4459936 4312849 4250795 4268488 3916623 4142795 4278201 4051489 4266645 3705811 4575016
9990 4575016 4054681 3742847 4002351 3829504 3272720 3826977 3684207 3411811 4144740 3402356
9980 3402356 3325559 3428003 3227496 3216539 3073507 2931561 3224451 3236151 3406072 2924048
9970 2924048 3272254 3119761 2965885 2910904 3195664 3465486 2929147 3104965 2857778 3039804
9960 3039804 2781319 2902631 2701487 2274515 2439682 2560339 2911411 2932541 2782583 2631238
9950 2631238 2562606 2637033 2631969 2459683 2242334 2468863 2234610 1945084 2291362 2512408
9940 2512408 2501156 2124127 2209483 2308492 1755016 1771870 1994102 2164537 2122932 2248359
9930 2248359 2241101 1476848 1709118 2023253 2070461 1521923 1877381 2176202 1976821 1917234
9920 1917234 2149030 1931200 2545042 1968998 1932595 1699858 2116882 2062891 2058720 1771143
9910 1771143 2010278 1860145 1776673 2122335 2056054 1817874 1779145 1593840 1258458 2174825
9900 2174825 1419364 1998170 1568114 2136909 2060052 1022060 2012929 1568271 1856253 2112080
9890 2112080 1637693 1905050 1624646 1682201 1832705 1775203 1873879 1227530 1369763 1430048
9880 1430048 1759472 1904873 1326339 1245089 1943566 1836182 1391150 2003197 1580519 1908806
9870 1908806 1811541 1693471 1719280 1563642 1388921 1611456 1308039 1670557 1057366 1965115
9860 1965115 1432288 1786740 2138661 1891923 1818239 1733424 1794051 1793884 2191098 1959098 1773066
9849 1773066 1813779 1677190 1630914 1739167 1862347 1798839 1339290 1536647 1688483 1499637
9839 1499637 1929105 1622343 1681200 1589181 1532742 1645255 1438193 2027158 1787207 2119419
9829 2119419 1209007 1552377 1414884 1649350 2086795 1998747 2134657 1254115 2096909 1863875
9819 1863875 1445431 1434780 1640622 1581529 1468754 1463966 1538707 1766293 2060529 1501645
9809 1501645 1424965 1732261 1319377 1694520 1481496 2130190 1436982 1953706 1286037 1641627
9799 1641627 1435816 1830938 1368009 1279231 1638705 1777583 1613927 1620256 1081911 1292216
9789 1292216 1617039 1726167 1739424 1256823 1310813 1567751 1197148 1371676 1441500 1512120
9779 1512120 1984432 1700147 1642075 1505660 1512122 2260879 1980510 1561211 1571161 1182426
9769 1182426 1606268 1694205 1586757 2011545 1707413 1669987 1743139 1460909 1494030 1760178
9759 1760178 1135316 1559101 1457800 1366200 1199414 1638508 1259734 1530064 857975 1784159
9749 1784159 1268446 1394313 1518129 1313605 1345694 1161322 1110210 1597379 1408294 1316275
9739 1316275 1819307 1184600 973668 1669786 773430 1083862 1313028 972832 1238935 994869
9729 994869 1302884 960006 1293373 699090 933124 1110079 718102 1014485 969207 1430847
9719 1430847 954490 1067079 641556 1166266 714477 894136 1082817 791762 752523 970483
9709 970483 753879 1218238 835963 1120427 1016657 954706 1347815 783068 1110242 960307
9699 960307 1219317 859096 915017 819342 856617 1034040 754093 1007294 1055040 825841
9689 825841 459302 779917 699620 596181 828786 888771 1222721 971567 882655 908257
9679 908257 769951 1229441 767190 986262 987447 891959 1048138 673665 784677 1333620
9669 1333620 1198435 649192 473042 1138641 897969 688950 1034062 551395 1179908 534941
9658 780317 1098892 895939 659890 797189 357175 724996 1129530 581927 949900 759016
9648 759016 1086679 911306 542082 587033 808759 967331 1166035 801379 1135673 755984
9638 755984 872408 756496 1239433 1130734 1128657 845472 1037392 731070 817315 1135305
9628 1135305 1302830 1057002 831444 700844 886673 855376 1007502 896879 885598 724821
9618 724821 903633 700491 924523 189402 1143934 1463119 813813 1193940 1105837 577201
9608 577201 783402 657100 426369 763226 974353 845813 559802 895585 858262 1074709
9598 1074709 882067 1151735 809378 909944 1364901 892100 761015 750413 672907 553437
9588 553437 1154373 1019452 754029 888065 907339 723236 699793 1260184 460900 611785
9578 611785 588462 625615 1108672 974973 593774 948541 975192 1241238 1136425 712200
9568 712200 750442 829515 1136803 485067 734404 991787 489109 527945 642793 460908
9558 460908 1226865 479854 933470 1558911 1129961 1000693 650045 859611 543478 914046
9548 914046 411899 875400 304244 969602 550411 200674 287910 964486 707054 672449
9538 672449 993561 470353 780561 727075 242551 915236 993030 266685 668799 1020912
9528 1020912 644306 752616 660997 678404 613601 892078 905575 816843 229687 897107
9518 897107 857446 990645 436812 785193 706155 635470 440735 629743 765360 1012725
9508 1012725 624532 500344 607575 857230 714339 934036 675689 554742 569531 308341
9498 308341 946039 699936 1285445 188314 793526 759163 829087 251855 584402 1045919
9488 1045919 693148 924839 707680 423467 625211 234302 547753 144508 640450 633123
9478 633123 528278 136893 362538 479394 332561 250318 621811 663668 544732 317760
9468 317760 663684 945793 721971 293737 508435 858857 722409 517888 487679 460246
9458 460246 232600 217316 454875 820541 571978 621226 348826 312388 399186 617576
9448 617576 693419 616320 147386 390214 578035 841629 114514 265249 442733 714902
9438 714902 723597 236506 660944 724863 379510 452799 415494 526483 764457 486542 615721
9427 615721 472788 537679 328795 589594 337577 358219 345778 368500 256947 851609
9417 851609 79038 915025 528192 114177 475612 565541 850685 705630 413083 579898
9407 579898 466683 344579 465832 465840 627760 515714 761174 993657 392072 100813 248352
9396 248352 256034 736359 119382 551447 358628 50937 -170862 461352 189088 150404
9386 150404 350401 268484 886227 255701 799446 593949 452026 258307 368893 371068
9376 371068 579565 264796 395678 451141 189160 191858 376258 66805 597586 434671
9366 434671 274248 437322 -17760 628978 617738 479581 535756 348862 272305 480318
9356 480318 88027 -135526 422622 435628 145109 396478 37287 25564 1002643 190895
9345 423220 421523 -11313 356383 1098028 304821 338571 491006 284637 140962 397294
9335 397294 870722 435199 430492 396283 223885 477027 565276 211499 480004 336243
9325 336243 445496 279080 326023 -11482 110544 683934 337934 408345 399662 726454 546726
9314 546726 286789 456799 487734 91466 690818 389915 483254 344180 548875 867826
9304 867826 748865 779423 359598 863576 529739 566696 307095 68115 91830 709681
9294 709681 624576 589309 687974 663424 309034 594762 510020 358798 249722 718856 318366
9282 -128818 870564 261431 422780 411986 361551 212467 -61172 240793 449633 617149
9272 617149 417131 546625 214360 402529 597660 549332 781663 141233 469040 324961
9262 324961 128657 89005 299650 112208 272792 408470 418631 550063 247923 721711
9252 721711 286697 286453 788631 371368 904426 -410060 307531 321319 531892 248477
9241 488604 334063 17278 234778 432632 580334 466963 216315 529360 309285 771745
9231 771745 597900 -160021 829082 481095 280605 199835 284817 280650 -96291 425722 397280
9220 397280 591150 533131 941093 612311 407491 532790 276323 212837 61552 588702
9210 588702 741953 451031 454690 97471 223425 415676 153353 383202 -161311 905678
9199 512795 193363 671734 310923 578225 37807 520047 507210 608549 954565 507528
9189 507528 168919 679333 -88718 600074 817849 369134 443956 736844 612166 194881
9178 182883 216709 504764 532638 387741 524236 249653 154048 509778 279269 669931
9168 669931 232143 594736 148278 215759 203331 446922 567157 125593 447828 349341
9158 349341 416376 115568 593081 555322 187851 373475 417430 500405 631031 237816
9147 216966 334816 145559 502415 430881 394366 652081 83858 71471 611202 333143
9137 333143 633958 257534 527239 760176 309315 401685 6642 105333 560740 -48953 115572
9125 -337001 369901 685407 549522 233583 656885 -148200 559921 493642 495802 454738
9115 454738 210652 307552 284726 328898 200463 412328 470462 -192997 32443 413467 332337
9104 332337 192658 477944 276202 818883 542557 569370 770022 870089 473684 157113
9093 605256 465205 143455 223920 504408 466714 662694 296058 661846 363909 191881
9083 191881 200369 642861 461256 282647 389180 444194 192585 494930 216446 70676
9072 239291 599912 186380 356238 397896 441172 334208 960517 352478 635782 16764
9061 351477 551529 277028 194238 328022 362334 346700 739915 318428 -3552 553824 516522
9050 516522 528051 1018162 497203 474437 599838 -26687 484020 320191 344924 548627
9040 548627 489784 211353 285878 -95246 179412 327446 627569 331879 221960 39221
9029 617726 81896 596951 176060 302495 491961 138855 242361 623677 731701 14686
9018 808487 661817 401040 101266 443903 402576 -101358 828099 276940 11575 258316
9008 258316 126479 340433 272998 52385 209885 167899 -43715 295889 132457 -225937
8997 107881 587547 224619 301255 467719 286101 140748 197791 534608 555959 109671
8986 695610 541301 312487 176638 443025 481057 -66298 336136 618938 311160 181656
8976 181656 96996 566574 305109 363243 490483 399417 735802 430450 343849 130246
8965 378241 468513 398335 141350 -37131 -19975 205592 -28661 481430 205928 437174 644807
8954 644807 413679 651568 225368 478853 123009 740464 357252 422650 -12998 580141
8943 515789 450103 396121 520391 488778 47647 686541 330058 446466 612205 159772
8932 318011 585117 413846 515131 158104 552521 619841 179382 270158 447862 681242
8922 681242 570772 784522 880907 348232 681032 640245 709056 530235 539148 719642 888495
8911 888495 672673 352452 491869 424549 385840 618824 909504 882576 545009 840944
8901 840944 660288 562623 515065 159969 631961 1113763 333635 1147907 1207041 767353
8891 767353 712290 1176647 902668 791549 1318045 897405 776874 1133909 1003319 922110
8881 922110 794431 1351804 1460409 647824 944309 1159360 1075837 943447 998531 1482403
8871 1482403 1178002 968605 1190108 631806 1125088 837647 746106 956475 983795 715974
8861 715974 1311203 1368058 889210 881639 740942 1100483 998880 849234 961274 964740 738286
8850 738286 1071102 699059 754709 1214022 1144106 812434 583829 992517 488673 1242158
8840 1242158 412442 706817 464864 704321 570036 762922 839578 792390 338944 676089
8830 676089 -510229 578360 424203 876388 614889 566643 906070 722592 482580 510584
8820 510584 716349 113695 139787 545237 603119 166071 344392 596480 420331 587852
8810 587852 259727 328072 503490 909868 731896 168370 450223 560449 367959 730903
8800 730903 168411 486054 73868 206256 280839 236691 523489 -132491 349893 9558 448647
8789 448647 315988 574344 -43333 451899 311012 120457 616866 -93213 250065 472620
8779 472620 334185 384705 418901 314406 708752 161548 226738 -12210 499690 338541
8769 338541 395356 489734 151346 271813 305897 273820 185780 151364 302086 213328 450967
8758 450967 361834 284115 514457 647084 735747 480957 114019 442549 237943 406079
8748 406079 471691 -79164 357172 213068 278196 31759 598680 -161513 141495 497788
8738 497788 -122616 692220 451385 189224 384946 107756 281379 383922 469138 375176
8728 375176 788514 161216 414360 530044 330494 194105 600200 512965 322060 365520
8718 365520 390247 296940 -172762 416505 269359 620453 455066 431396 423906 419465 368981
8707 368981 200431 -144227 24107 298120 131190 369251 319662 52602 -37295 127495
8696 236031 108175 312909 421154 393894 137036 469599 187620 256849 -19243 419353
8685 -246172 442968 145346 268581 407171 88200 857903 318583 367154 517239 231360
8674 367442 414606 183128 189459 766291 158009 219233 360724 32096 183956 227958 435550
8663 435550 141289 429911 -237323 186000 447128 -26164 91069 -149393 -41674 141232
8652 289094 506303 938797 215944 -1186 342925 161646 393100 78310 351217 239157
8642 239157 256152 -92817 460469 270747 709923 149028 147276 874561 125586 499542
8632 499542 307983 121787 356350 290202 362459 -110635 -44211 371233 -113267 439402
8621 539650 199739 278351 238538 368690 475415 417726 459898 368106 275350 -100444 274736
8609 70474 264323 298107 534026 428270 228662 352796 344117 320742 321770 -196864 439734
8597 59177 718975 -10586 181613 264516 265107 304071 158622 25495 479844 391821 37747
8585 -124311 427424 -159589 299198 234902 213118 622889 175455 478887 -22985 300500
8574 492068 -1651 111216 265313 -124598 378879 328704 -30768 211477 274410 142121 31659
8562 551437 550628 328459 -190347 655622 230817 505885 237345 517526 485069 292761
8552 292761 648984 62174 234020 473867 492881 908746 -326600 317386 3212 392964
8542 392964 452009 389910 187601 528680 106016 74056 316049 806692 100596 144486
8532 144486 206742 563936 291791 241617 346275 337478 341732 920620 177533 205430 448947
8521 448947 171022 29011 -171296 456133 -280397 61868 821770 470775 529977 -88126
8510 482853 -50364 221960 376584 620865 141977 346081 587596 -42324 -58021 206812
8499 237591 147406 193950 269358 500813 107244 236588 513465 619931 -199969 39322
8488 -267316 145301 341442 439986 286642 168016 595994 44710 540399 317444 259507
8478 259507 270300 183799 479940 91143 617476 353694 506621 172580 74473 336779
8468 336779 428529 13771 568045 448729 34122 195661 85618 249602 -214457 368805
8457 415634 345304 -83561 2125 192158 207639 449974 239913 682107 150463 220903 236298
8446 236298 164335 79065 209767 -102982 484531 270036 237404 493401 51564 397710
8436 397710 107015 349807 284086 412914 426276 381215 656774 -74362 329804 178814
8426 178814 454747 483420 270610 -161016 95429 429870 197119 495419 232669 306895
8416 306895 550860 42062 132056 400817 466076 476681 651572 122749 141998 158197 122632
8405 122632 310357 542858 -61069 240741 449318 73264 136978 -193859 168082 99496
8395 99496 -463922 80806 88823 5275 296975 556019 113045 562643 235218 517222 655187
8384 655187 144289 314905 492357 -193399 43985 98372 807361 454727 88310 382330
8374 382330 596422 313836 76359 380567 114228 360395 428659 271078 460742 99922
8363 280014 448703 33909 100246 -123976 56355 296006 471289 243258 96184 279413
8353 279413 474901 738486 185118 93514 543773 68701 630741 76908 293177 -263189
8342 257372 119053 -247364 182795 -129929 46679 157826 324119 369291 -147461 96446
8331 313120 185671 -36871 485952 -127737 213066 151405 40853 246809 534884 524762
8321 524762 177556 30088 319140 98357 460097 478512 117145 433849 -248378 -94268
8310 188555 421317 -19886 495593 49054 -73203 -4966 156432 -121939 219382 38217 248250
8299 248250 514459 -176779 194978 -61555 403685 797840 680943 -7588 692482 118180
8288 22466 -278019 65577 -203898 312025 555680 214478 -351253 246499 302470 269787
8278 269787 515510 65174 79740 728602 302325 -124360 163123 371670 224888 98038
8267 327109 321706 799632 557389 438630 525325 232846 440567 326197 236110 512354
8257 512354 307922 251549 636871 237974 211958 304713 347687 389271 -38407 -175828 193811
8245 323060 160162 445063 -262676 -9634 420144 321940 366927 -42079 396469 268146 484997
8234 484997 -83734 126913 50473 29695 421407 588961 330953 170276 486400 449354
8224 449354 196153 332607 -112134 -31337 177223 -91211 671373 30279 -380072 -4641 -151388
8213 -151388 187008 429117 -225800 101121 61669 318464 24522 305133 401899 202938
8203 202938 303585 -296095 -285777 633397 786492 532097 27318 88902 -199066 -410181
8193 -410181 212858 259847 437644 523026 532717 -299960 547659 -229079 -70112 -220 482440
8181 355567 489824 331900 156887 75950 -82832 330152 447978 177514 411997 430222
8171 430222 334712 191365 -40745 575026 -9009 392528 171293 116698 244847 202054 464238
8160 464238 384703 158580 167536 -64539 713585 101577 485764 164620 1102224 35578 -17283
8148 400104 314256 -43847 513617 152147 89108 -70981 112402 55935 177750 421729 342493
8137 342493 139503 239363 -298500 -49642 96432 87669 136424 -77071 118466 322921 298288
8126 298288 178768 67576 285255 317836 -219224 179560 387259 -37677 344799 277742
8116 277742 -139999 -58081 166738 281277 46583 366519 435462 310016 195980 479058
8106 479058 266176 197611 -282515 185331 452442 259723 135352 233359 -28979 417412
8095 360383 43863 118683 403239 158287 -110333 222377 -333214 112664 -199240 705128
8084 -113745 353506 152933 602557 435636 -31020 449113 -221212 77232 198911 -108136
8073 400649 -75281 172297 443367 94655 122606 220460 449496 572872 82693 276156 -57114
8061 127776 427670 219653 152674 357983 321055 44856 374599 257435 153784 -98646
8050 546183 79372 565310 365472 232923 456215 568737 -56143 471302 158047 298190
8040 298190 155905 40018 157633 391693 61541 238923 241615 184826 280658 86215 304594
8029 304594 144429 422705 62178 565857 130113 360954 7856 128386 396148 -417601
8018 469036 266844 134716 398919 27157 293400 169085 66557 712432 51325 269034
8008 269034 295956 206462 520601 140647 60062 407248 679244 426836 313461 387364
7998 387364 521624 -108016 535060 109081 165949 367885 144601 -172050 6942 293497
7988 293497 595364 488945 -68212 412662 -134451 139447 364081 124623 244579 -81989
7977 198738 416395 226834 327850 523266 -123608 229025 124828 -23924 -31282 198204
7966 333550 238391 112707 129643 -32168 220844 -56261 230009 385746 239462 154104 -217259
7954 25255 -107983 562248 200168 255987 493503 241222 383023 615084 205967 338634
7944 338634 96729 382467 180130 -1293 -258930 322801 232567 282055 202578 296421 624477
7933 624477 254932 429631 205809 269051 -119159 -349719 146992 41925 113811 225482
7923 225482 -31380 235194 495840 243719 345400 282432 153395 61721 256752 285121
7913 285121 1244 98052 265658 142663 -319682 -123625 157096 94301 161371 -55989 19351
7901 194924 370434 102902 -55210 81066 158132 -186528 277970 -55765 273364 -255439
7890 441034 426583 390924 -85411 687840 171165 446690 -42576 59708 -383679 156946 317063
7879 317063 -168840 -207099 285747 312607 163722 181820 594571 66743 137324 437137 229349
7868 229349 203052 228600 638289 572863 228443 -64803 383615 -155740 -44709 116842 244181
7857 244181 120921 -53928 438866 -64293 416168 297308 124780 -87188 117394 37163
7846 590804 112608 -132070 684804 24914 198493 62847 399507 317935 -151786 391513
7835 374525 455454 220809 216478 104688 -253198 243936 -122441 270814 36965 406871
7825 406871 452573 511273 -687235 180572 391356 253562 621713 -9731 261148 191128 10063
7813 -319316 338334 5932 249907 -161438 146073 220293 -19005 666475 -383278 75638 164400
7802 164400 261503 296114 395019 -270209 19108 266726 197415 245577 464645 712933 192579
7790 118029 513621 708485 66545 452371 -185892 360870 -167174 577014 -67181 182525
7779 186858 159383 103002 306603 -265153 265312 226397 119048 152702 16667 -67998 274649
7767 171739 210366 -60733 292978 267195 124207 264180 213575 48121 109247 -65617 -177424
7756 -177424 343887 219259 175038 189646 341696 -122220 394740 605404 497790 510356
7746 510356 -86263 300634 331299 155989 -237136 444436 130688 258002 23308 14954 -56432
7734 125831 390040 231273 353175 182272 466086 12120 296059 -120943 323533 74464
7723 328108 586500 96570 -36206 -44614 259901 -107887 190155 564541 -18937 761406 -129915
7711 190612 371354 421971 278234 292471 134192 328414 504589 -91657 331108 710632
7701 710632 367373 182021 220156 279608 276247 617906 191218 108142 52967 347400 296290
7690 296290 706520 212624 28226 282596 -43249 466337 415959 283971 27197 488708
7680 488708 115484 265478 36011 -167906 291302 92386 119445 227173 255592 -26473 -73097
7669 -73097 -112666 112682 215510 281308 88745 314170 288925 86403 213447 -83555 635370
7657 176162 158844 272743 -413831 -90530 268029 525927 199549 456554 -283081 -98450
7646 352307 -91452 402086 574262 -156100 319230 431354 406708 298271 -219864 121688
7635 377372 -22250 11890 469970 221669 -147202 93430 -13976 303826 180620 354748
7625 354748 -163782 361134 256418 -63350 14451 -76393 98100 335494 -84596 142822 -343511
7613 -7942 469007 161262 214819 162199 288875 -35854 -37103 38622 -10961 -156986 572792
7601 166317 89823 318650 244195 -110721 64874 529647 81128 872195 -393185 -79341 382832
7589 500153 33090 15368 332102 74840 378587 -93958 492452 65188 -310680 -117532 30643
7577 151155 26587 290276 -291407 -113324 67113 9880 75814 -131004 388388 -2247 345758
7565 187661 -68015 -100130 -310061 177753 -146568 -128290 311978 -302779 453215 585747
7555 585747 35570 382158 -100536 179881 247155 -324878 -450295 207202 -19399 -187042
7545 -187042 81839 372918 279293 217041 -272611 -21598 -33244 -231672 -266219 -245825 9422
7533 -118883 35463 -23617 400253 137253 169931 224868 212755 -152986 106093 161571 10711
7521 219442 189634 83143 470118 144584 -27931 -129063 341517 -171217 84990 445737
7511 445737 359513 756322 -134012 444786 336128 346241 26197 155591 -329183 -68133
7500 430277 -22233 367268 -254618 -24429 -88291 -159417 -108837 131591 -107614 -281066 56141
7488 224689 228271 157005 602672 426653 213254 411070 204477 112482 293078 366153 -106243
7476 -44471 343403 58550 201593 -167772 -56237 200190 -516427 275624 112600 -614780
7465 130657 -24221 -354594 143767 63554 -87889 76607 -99931 254308 -22970 108345 22147
7453 -54126 469709 609210 79537 474084 -262119 167116 212512 1582 67978 -95125 333033
7441 266771 453268 408145 -458758 -214017 216517 226672 71394 163251 338844 165823
7430 251402 183484 -12830 10547 283301 276680 535254 -540520 371318 -3336 169395 73389
7418 8048 161191 359093 416841 469608 71581 278968 35370 155198 260271 115007 71025
7407 71025 407439 407679 178522 20920 -63997 96411 66362 -52232 44019 -19162 89993 -197206
7394 -267330 234131 395703 294324 182771 65066 -14905 24176 349045 569885 -162696
7383 -104752 330378 -262926 75101 -91951 366107 91747 267570 489396 -206589 11635
7372 616988 345158 125500 -156637 375420 -868690 341151 536941 471305 112961 51156
7361 -69145 239012 -44421 432258 36648 300135 176404 -87511 52607 -104187 174228 357251
7350 357251 -489921 11686 313939 130819 293104 130022 436507 35883 -79886 -15438
7339 -160086 -13856 -23242 -129855 131013 11662 135140 175349 351618 15315 343523 -65672
7327 148121 644396 217648 -237446 167006 134317 568800 -15578 145969 477782 247238
7317 247238 713334 1321 186457 222270 109283 457063 55167 43271 162397 312598 196526
7306 196526 300507 670553 -15791 202412 323831 167365 37082 -236401 710020 262343
7295 197119 283461 361327 -215601 270140 204213 538798 181438 232760 -54421 -98961 643480
7283 465198 205286 107250 4739 -234472 -196280 152882 146330 -382610 476073 97173 191819
7272 191819 154274 -749 -225812 336175 8443 185402 -40506 -239953 -170287 556708 27754
7260 -142677 -11178 -67504 -272495 215691 138033 195107 -27261 -267914 259792 -367970 315824
7248 -543129 237313 504400 480833 -34060 340185 -245579 -503834 365582 -134159 -88905
7238 -88905 -44538 48188 516252 642667 -56147 65032 424051 -126088 174173 415077 484846
7227 484846 506849 -164365 -27135 63939 -25453 -206107 152824 -131239 288613 293534 110177
7215 -59667 186723 3508 636021 -193246 261398 -31806 -204439 189413 60971 542828 321300
7204 321300 120808 470361 -374385 195394 247257 -23818 -64419 604745 640672 -80868 -67936
7193 -67936 194080 190526 33079 211602 217458 592671 52682 -106734 -112070 127750 67436
7182 67436 63424 -140388 -85501 349706 -13539 -153478 601856 281841 232145 647828 75597
7170 87787 52202 74121 -74276 -417180 261548 182286 86697 340589 -228911 -103927 101529
7158 -91005 43692 -206505 112332 66175 -76038 -40340 589291 584172 404358 378940 196964
7147 196964 537511 531857 88460 84984 197964 187350 203098 -618554 330822 207640 208362
7136 208362 510821 -269746 395877 -140273 246748 -174036 -61187 232830 -197359 42899
7125 243751 -24432 -83710 606025 188334 208134 126105 249951 -60586 84178 254859 -185336
7113 600556 -127692 -247141 -197930 109896 209022 160399 492802 207503 -323955 185576
7102 659371 -79705 -246319 -15301 -224759 15750 -3836 -336733 328536 -371118 -244012 209016
7090 49475 396070 376622 359602 138913 287787 346283 387082 340048 215759 393017 279503
7079 279503 391726 -18812 64939 501265 -34007 86873 -152090 71242 -212634 15599 71789
7068 71789 -33380 66711 207986 86134 305824 134837 246874 114753 -270547 277289
7057 53079 345611 4903 291953 -128799 -81974 -252013 187759 -209227 -162722 393547 -194977
7045 456243 407235 276385 -21847 277462 75370 309352 329254 2162 288824 49912 176373
7034 176373 426539 -96561 -185702 -193166 -98236 75806 116729 51614 247171 411224 423479
7023 423479 123118 591803 -53714 546724 111051 -216433 -290814 102272 -14987 -112458
7013 -112458 96071 -256102 25720 -342079 512575 9529 417066 23288 -67081 -507214 353435
7001 98524 160539 12403 221053 -91993 521020 173679 335610 273582 269763 469546 -89072
6989 -164216 188772 276845 124083 601961 1261 147273 -164917 113157 450512 297338
6979 297338 455950 105942 -57181 171556 279130 -47120 243682 57545 -42801 171719
6968 -218014 150302 16517 -92236 442119 301421 -142431 -6541 229191 -97938 420585 654927
6957 654927 174567 305164 -89631 68894 -158651 -137016 130033 23523 185103 -8025 141133
6945 -450 167593 426200 313945 300852 337066 111716 -64887 -67651 442404 398967 135210
6933 402192 89635 -136555 134037 -186958 139307 -122127 -17218 140664 58254 82838
6923 82838 373394 174587 29222 221379 190928 165184 127893 -79089 151884 39124 -163348
6911 -19624 -79570 -83056 337549 51190 24005 426756 221680 432220 147802 -58753 52286
6899 48892 240630 324761 42370 47473 -120485 -436615 -429402 76522 419165 273912 345953
6888 345953 253206 -183525 159431 157273 -249722 284291 -155627 90114 72179 769937 -23065
6876 -92849 412986 591957 169086 166834 -152202 -68461 -121964 -66631 384530 229706 43617
6864 20692 277981 -141300 279234 -96416 531409 323660 37292 246906 28955 188450
6854 188450 235993 44390 429503 -100855 -47682 157811 406838 -241265 -197062 -288541 508260
6842 107034 351428 34180 -70064 -49397 477546 730487 314624 60206 -7470 319402 -82308
6830 -13041 -45882 361355 49170 497660 506048 -650748 -75231 58339 373779 -458222 -118269
6818 468059 177880 180871 -51684 -116087 49665 -91369 151111 356139 -82736 -25236 284606
6806 331099 -386407 426493 43154 -112868 308531 382039 -43057 225552 -6263 -104653 9871
6794 101702 93679 12527 140099 -486995 106607 170177 147128 805686 -10276 -117473 217683
6782 453621 391296 47010 179208 -149313 139652 -28109 -5192 483499 -43362 -100561 311688
6770 -152881 141118 -1901 476550 188033 35246 146415 133541 23562 172567 101696 -344906
6758 426852 -65518 218693 229080 -80616 389955 92909 156230 -152926 -65695 216678 499217
6747 499217 249761 266655 -4884 -141133 -271572 -191313 -149384 -346098 274240 122879 221822
6736 221822 493065 -113433 382500 -92828 244836 399827 29783 -150840 -355929 50974
6725 227677 446580 -316444 31066 273832 -248604 -100252 24323 323483 195383 213595
6715 213595 748302 45056 233122 -58309 81772 -500181 79559 231975 652261 -204928
6704 -187704 -94919 293147 146378 -119841 87121 19373 273816 110210 -214961 -165303
6694 -165303 75530 279071 -238119 156969 -316208 19273 312026 -36999 -112689 -547077
6684 -547077 631672 398062 34145 328084 140567 149992 422690 79871 429075 -20069 -291253
$$ [...]
##END NTUPLES=NMR SPECTRUM
##END=
