##TITLE=coffee_type ROVE100-14-0203
COFFEE_meoh_noesyp64 COFFEE_meoh {C:\Bruker\TOPSPIN} Administrator 2
##JCAMPDX= 6.0         $$ Bruker NMR JCAMP-DX V2.0
##DATA TYPE= NMR SPECTRUM
##DATA CLASS= NTUPLES
##ORIGIN= Bruker BioSpin GmbH
##OWNER= Administrator
$$ 1.72 TOPSPIN		Version 2.1
$$ 2012-05-29 13:25:45.814 -0700  Administrator@X
$$ Compression mode = diff/dup
##.OBSERVE FREQUENCY= 400.13188235
##.OBSERVE NUCLEUS= ^1H
##.ACQUISITION MODE= SIMULTANEOUS (DQD)
##.ACQUISITION SCHEME= undefined
##.AVERAGES= 64
##.DIGITISER RES= 22
##SPECTROMETER/DATA SYSTEM= spect
##.PULSE SEQUENCE= noesygpps1d.comp
##.SOLVENT NAME= COFFEE_meoh
##.SHIFT REFERENCE= INTERNAL, COFFEE_meoh, 1, 14.98061
##AUDIT TRAIL= $$ (NUMBER, WHEN, WHO, WHERE, PROCESS, VERSION, WHAT)
$$ ##TITLE= Audit trail, TOPSPIN		Version 2.1
$$ ##JCAMPDX= 5.01
$$ ##ORIGIN= Bruker BioSpin GmbH
$$ ##OWNER= Administrator
$$ $$ Z:/data/jwist/nmr/12-COFFEE-0203/42/pdata/1/auditp.txt
$$ ##AUDIT TRAIL=  $$ (NUMBER, WHEN, WHO, WHERE, PROCESS, VERSION, WHAT)
(   1,<2012-03-02 20:37:26.006 -0500>,<Administrator>,<TOPSPIN>,<go>,<TOPSPIN 2.1>,
      <created by zg
	started at 2012-03-02 20:25:55.740 -0500,
	POWCHK enabled, PULCHK disabled,
       configuration hash MD5:
       1A 1E CE 29 27 FD 77 03 67 4E F0 E3 C4 B2 CB 90
       data hash MD5: 64K
       9B CA F5 CF 44 AC 56 36 49 10 CB 44 09 A8 88 7A>)
(   2,<2012-03-02 20:37:31.162 -0500>,<Administrator>,<TOPSPIN>,<audit>,<TOPSPIN 2.1>,
      <user comment:
       ICON-NMR User ID: Administrator
       data hash MD5: 64K
       9B CA F5 CF 44 AC 56 36 49 10 CB 44 09 A8 88 7A>)
(   3,<2012-05-29 09:23:53.284 -0700>,<Administrator>,<X>,<proc1d>,<TOPSPIN 2.1>,
      <Start of raw data processing
       efp LB = 0.3 FT_mod = 6 PKNL = 1 PHC0 = 0 PHC1 = 0 SI = 128K 
       data hash MD5: 128K
       08 A1 51 13 19 15 3D 8B 26 F9 A3 AD 65 97 60 D8>)
(   4,<2012-05-29 09:23:53.831 -0700>,<Administrator>,<X>,<proc1d>,<TOPSPIN 2.1>,
      <pk PHC0 = 39.11682 PHC1 = 0 
       data hash MD5: 128K
       8A 86 5C 3C 9C BF 4F 1D 82 3D A3 FA 5F AF BA A1>)
(   5,<2012-05-29 09:23:55.644 -0700>,<Administrator>,<X>,<proc1d>,<TOPSPIN 2.1>,
      <abs ABSG = 1 
       data hash MD5: 128K
       5E 06 83 98 0E 0A 84 72 C1 DF 67 04 64 0D 35 51>)
(   6,<2012-05-29 09:23:55.722 -0700>,<Administrator>,<X>,<proc1d>,<TOPSPIN 2.1>,
      <abs ABSG = 2 
       data hash MD5: 128K
       6A 9D B3 79 4D 64 F3 38 C1 64 A4 CA EB F6 26 6B>)
(   7,<2012-05-29 09:23:55.815 -0700>,<Administrator>,<X>,<proc1d>,<TOPSPIN 2.1>,
      <abs ABSG = 3 
       data hash MD5: 128K
       A4 88 AC 36 2E C0 A5 5C 28 13 CB EC 20 F8 21 B2>)
(   8,<2012-05-29 09:23:55.894 -0700>,<Administrator>,<X>,<proc1d>,<TOPSPIN 2.1>,
      <abs ABSG = 4 
       data hash MD5: 128K
       1C 4A 7E E9 7B D9 5F 7B 24 D4 CF BF 36 57 B3 8C>)
(   9,<2012-05-29 09:23:55.972 -0700>,<Administrator>,<X>,<proc1d>,<TOPSPIN 2.1>,
      <abs ABSG = 5 
       data hash MD5: 128K
$$ [...]
150 150 150 150 150 150 150 150
##$TP07= 0
##$TPNAME0= <>
##$TPNAME1= <>
##$TPNAME2= <>
##$TPNAME3= <>
##$TPNAME4= <>
##$TPNAME5= <>
##$TPNAME6= <>
##$TPNAME7= <>
##$TPOAL= (0..7)
0.5 0.5 0.5 0.5 0.5 0.5 0.5 0.5
##$TPOFFS= (0..7)
0 0 0 0 0 0 0 0
##$TUNHIN= 0
##$TUNHOUT= 0
##$TUNXOUT= 0
##$USERA1= <user>
##$USERA2= <user>
##$USERA3= <user>
##$USERA4= <user>
##$USERA5= <user>
##$V9= 5
##$VALIST= <valist>
##$VCLIST= <CCCCCCCCCCCCCCC>
##$VD= 0
##$VDLIST= <DDDDDDDDDDDDDDD>
##$VPLIST= <PPPPPPPPPPPPPPP>
##$VTLIST= <TTTTTTTTTTTTTTT>
##$WBST= 1024
##$WBSW= 4
##$XGAIN= (0..3)
0 0 0 0
##$XL= 0
##$YL= 0
##$YMAX_a= 12180556
##$YMIN_a= -5349745
##$ZGOPTNS= <>
##$ZL1= 120
##$ZL2= 120
##$ZL3= 120
##$ZL4= 120
##$ABSF1= 14.98061
##$ABSF2= -5.57192
##$ABSG= 5
##$ABSL= 3
##$ALPHA= 0
##$AQORDER= 0
##$ASSFAC= 0
##$ASSFACI= 0
##$ASSFACX= 0
##$ASSWID= 0
##$AUNMP= <proc_prof1d_extract>
##$AXLEFT= 0
##$AXNAME= <>
##$AXNUC= <1H>
##$AXRIGHT= 0
##$AXTYPE= 0
##$AXUNIT= <>
##$AZFE= 0.1
##$AZFW= 0.1
##$BCFW= 0
##$BC_mod= 0
##$BYTORDP= 0
##$COROFFS= 0
##$CY= 15
##$DATMOD= 1
##$DC= 0
##$DFILT= <>
##$DTYPP= 0
##$F1P= 0
##$F2P= 0
##$FCOR= 0.5
##$FTSIZE= 131072
##$FT_mod= 6
##$GAMMA= 0
##$GB= 0
##$INTBC= 1
##$INTSCL= 1
##$ISEN= 128
##$LB= 0.3
##$LEV0= 0
##$LPBIN= 0
##$MAXI= 10000
##$MC2= 0
##$MEAN= 0
##$ME_mod= 0
##$MI= 0
##$NCOEF= 0
##$NC_proc= -3
##$NLEV= 6
##$NOISF1= 0
##$NOISF2= 0
##$NSP= 0
##$NTH_PI= 0
##$NZP= 0
##$OFFSET= 14.98061
##$PC= 1
##$PHC0= 39.11682
##$PHC1= 0
##$PH_mod= 1
##$PKNL= yes
##$PPARMOD= 0
##$PPDIAG= 0
##$PPIPTYP= 0
##$PPMPNUM= 2147483647
##$PPRESOL= 1
##$PSCAL= 4
##$PSIGN= 0
##$PYNMP= <proc.py>
##$REVERSE= no
##$SF= 400.13
##$SI= 131072
##$SIGF1= 0
##$SIGF2= 0
##$SINO= 400
##$SIOLD= 131072
##$SPECTYP= <>
##$SREGLST= <1H.CDCl3>
##$SSB= 0
##$STSI= 131072
##$STSR= 0
##$SW_p= 8223.68421052632
##$SYMM= 0
##$S_DEV= 0
##$TDeff= 65536
##$TDoff= 0
##$TI= <>
##$TILT= no
##$TM1= 0
##$TM2= 0
##$TOPLEV= 0
##$USERP1= <user>
##$USERP2= <user>
##$USERP3= <user>
##$USERP4= <user>
##$USERP5= <user>
##$WDW= 1
##$XDIM= 131072
##$YMAX_p= 526365724
##$YMIN_p= -160478311
##$CURPLOT= <Network HP LaserJet P1505>
##$CURPRIN= <$Network HP LaserJet P1505>
##$DFORMAT= <normdp>
##$LAYOUT= <+/1D_H.xwp>
##$LFORMAT= <normlp>
##$PFORMAT= <normpl>
##$SURQMSG= 1
$$ End of Bruker specific parameters
$$ ---------------------------------
##NTUPLES= NMR SPECTRUM
##VAR_NAME=  FREQUENCY,     SPECTRUM/REAL,   SPECTRUM/IMAG
##SYMBOL=    X,             R,               I
##VAR_TYPE=  INDEPENDENT,   DEPENDENT,       DEPENDENT
##VAR_FORM=  AFFN,          ASDF,            ASDF
##VAR_DIM=   131072,        131072,          131072
##UNITS=     HZ,            ARBITRARY UNITS, ARBITRARY UNITS
##FACTOR=    0.0627417313425165, 1,          1
##FIRST=     8223.62146879498, 3196,         -62925
##LAST=      0,             2385,            -64022
##MIN=       0,             -160478311,      0
##MAX=       8223.62146879498, 526365724,    0
$$ Real data points
##PAGE= N=1
##DATA TABLE= (X++(R..R)), XYDATA
$$ [...]
66960 1308688 1318278 1329580 1343257 1358425 1373403 1387125 1399769 1412303 1425740 1440622 1456686
66949 1456686 1472959 1488463 1502956 1516904 1530955 1545697 1561596 1578692 1596380 1613844 1630713
66938 1630713 1647054 1663041 1679034 1695781 1713854 1732880 1751821 1770117 1788084 1806150 1824247
66927 1824247 1842204 1860304 1879091 1898816 1919281 1940088 1960909 1981727 2002991 2025399 2049298
66916 2049298 2074213 2099008 2122513 2144175 2164296 2183690 2203082 2222935 2243776 2266250 2290462
66905 2290462 2315468 2339934 2363413 2386729 2411029 2436622 2462801 2488702 2514209 2539906 2566040
66894 2566040 2591850 2616490 2640624 2666371 2695224 2726561 2758554 2789850 2819685 2847281 2872572
66883 2872572 2897307 2923993 2953382 2983999 3014410 3044723 3075347 3105549 3134365 3162207 3190435
66872 3190435 3219679 3249557 3279657 3309699 3338786 3365716 3390464 3414606 3439824 3466504 3493978
66861 3493978 3521473 3548282 3573634 3597255 3619996 3643301 3667823 3692846 3717174 3740324 3762683
66850 3762683 3784691 3806175 3826658 3846197 3865577 3885372 3904939 3922720 3937769 3950820 3963619
66839 3963619 3977314 3991535 4004946 4016525 4026429 4035781 4045617 4055992 4066170 4075529 4083860 4090740
66827 4090740 4095336 4097436 4098177 4098935 4099649 4099223 4097593 4096271 4096255 4096322 4094294 4089441 4082677 4074679 4064895 4052553
66811 4052553 4037811 4021641 4005220 3989578 3975096 3960929 3945558 3928467 3910841 3893959 3877252
66800 3877252 3858812 3837828 3815689 3794287 3773809 3752797 3730089 3705907 3680988 3655466 3629110
66789 3629110 3602093 3574757 3546832 3517775 3487937 3458603 3430623 3403708 3377320 3351459 3326036
66778 3326036 3300280 3273476 3245697 3217075 3187210 3156351 3126414 3099173 3073535 3046239 3015653
66767 3015653 2983591 2952940 2924651 2897708 2870833 2843252 2814578 2785007 2755278 2725859 2696614
66756 2696614 2667682 2639814 2613022 2585607 2555751 2523874 2492412 2463306 2436495 2410768 2385162
66745 2385162 2359315 2333208 2307049 2281167 2255859 2231396 2208053 2185895 2164637 2143911 2123345
66734 2123345 2102059 2078681 2052604 2025155 1998783 1974952 1953240 1932471 1912061 1892014 1872031
66723 1872031 1851145 1828398 1803959 1779500 1757026 1736964 1717710 1697527 1676662 1656948 1639421
66712 1639421 1623045 1606066 1588039 1570030 1553075 1536954 1520568 1503280 1485698 1469134 1454298
66701 1454298 1440506 1426183 1410288 1393413 1377431 1363741 1351743 1339401 1325497 1310846 1296865
66690 1296865 1283603 1270094 1256302 1243422 1232130 1221739 1211461 1201274 1190958 1179513 1166648
66679 1166648 1153925 1143111 1133791 1123831 1112002 1099008 1085967 1073074 1060145 1047551 1036036 1025917
66667 1025917 1016810 1008004 998999 989741 980299 970339 959314 947358 935542 924898 915643 907645 900978
66654 900978 895380 889790 883269 876100 869206 862749 856137 849204 842452 836091 829482 821765 812652 802668
66640 802668 792938 784514 777543 771333 765443 760086 755111 749495 742703 735745 729818 724521 718664 712344
66626 712344 706739 702079 697252 691564 685484 679385 672834 665652 658765 653479 650386 648960 647531 643844
66612 643844 636849 628114 620513 615294 611325 607282 603337 600243 597727 594476 589254 581885 573623 566490
66598 566490 561499 557594 553102 547910 543170 539192 535117 530640 526585 523486 521023 519162 518444 518685 518728
66583 518728 517859 516222 513647 509596 504614 500102 496149 491398 485716 480994 478334 476454 474116 472133
66569 472133 471364 470591 468247 464630 460456 454910 447487 440376 436191 434150 431293 427025 423566 421851 419939
66554 419939 416264 412034 409190 407793 406661 405284 403880 402347 400172 397029 393018 388763 385340 383535
66540 383535 383019 382759 382043 380552 377940 374372 371157 369631 369562 369686 369432 368833 367137 363334 358121 353664
66524 353664 351033 349384 347994 347405 347870 348161 346810 343572 339144 334587 331434 330907 332291 333201 332160
66509 332160 329738 326739 323024 319027 316591 316683 317592 317124 315540 314469 313779 311701 307908 304424 302969
66494 302969 302853 302114 299813 296726 294415 293909 294750 295162 293590 290131 286167 282847 280419 278672 277286
66479 277286 275878 274421 273479 273291 272764 270295 265776 261111 258566 259065 261913 265352 267230 266128 262546
66464 262546 258598 256050 254748 253214 250545 247410 245266 244868 245671 246529 246758 246352 245535 244595 244065 244286
66448 244286 244545 243397 240380 236802 234267 233031 232378 231843 231045 229100 225660 222240 220872 221286 220954 218389
66432 218389 214953 212650 211650 211143 211338 212835 214536 214139 211053 207428 205598 205453 205027 203073 200221
66417 200221 197852 196619 196221 196164 196389 197202 198709 200487 201901 202763 203518 204681 206150 207162 206840 204749
66401 204749 201109 196786 193083 191174 191427 193241 195674 198100 200157 201373 201322 200180 198632 197082 195369
66386 195369 193483 192054 191657 191980 192131 191576 190365 188775 187256 186363 185966 184797 181741 177575 174399 173186
66370 173186 172995 172927 173502 175110 176284 175015 171386 167540 165140 164158 164169 165360 167636 169826 170685 170155
66354 170155 168986 167561 165790 163855 162252 161121 159965 158187 155680 152901 150581 149319 149347 150661 153249
66339 153249 156871 160617 163170 163824 163094 162114 161644 161702 161787 161216 159577 157117 154377 151324 147373 142631
66323 142631 138589 136932 137950 140638 144040 147709 151024 152950 152903 151398 149537 147975 146505 144517 141914
66308 141914 139668 139236 141114 144210 146991 148966 150585 152009 152765 152578 151825 150944 149922 148503 146550
66293 146550 144216 142174 141496 142533 143966 143879 142019 140145 139735 140166 139793 138172 136448 135876 136635 137926
66277 137926 138697 138446 137776 137993 139689 141872 142860 141865 139342 136074 132544 129115 126274 124353 123226 122383
66261 122383 121348 120144 119470 120172 122341 125090 127366 128714 129102 128406 126504 123680 120618 118092 116864
66246 116864 117463 119533 121630 122311 121510 120427 120018 120013 119564 118563 118032 119207 122290 126033 128555 128654 126462
66229 126462 123143 120183 118761 119221 120837 122366 123014 122832 122219 121393 120326 118795 116530 113837 112041
66214 112041 112466 114627 116187 115293 112473 109684 107986 106787 105060 102679 100648 100403 102699 106959 111927
66199 111927 116875 121510 124775 125130 122709 119948 118932 119046 118488 117171 116470 116699 116732 116058 115417 115167 114663
66182 114663 113675 112913 112587 111886 110633 110065 110987 112306 112562 112021 111981 112598 112761 111970 111220 111815 113927 116486
66164 116486 118075 117923 116395 114482 112676 110549 107575 104106 101256 100052 100727 102483 103870 103952 103291
66149 103291 103181 103781 103826 102657 101722 103172 107314 112206 115556 116450 115493 113923 112643 111709 110725 109768 109491
66132 109491 110154 111202 112228 113621 115623 117437 118201 118319 118729 119199 118665 117269 116734 118243 120967 123243
66116 123243 124353 124482 123766 122333 120870 120169 120118 119831 118840 117616 116896 117105 118506 121160 124345 126606
66100 126606 127126 126798 127241 128849 130564 131669 132901 135317 138767 142259 145311 148044 150279 151642 152595
66085 152595 154323 157229 160416 163120 165803 169200 172969 176150 178543 180736 182930 184620 185573 186405 187877
66070 187877 190008 192084 193381 193801 194101 195531 198877 203635 208366 212135 215640 220719 228581 238430 247883
66055 247883 254844 259036 261746 264241 266611 268000 267663 265732 263140 260813 258830 256509 253544 250819
66041 250819 249611 250052 250904 250769 248929 245075 239130 231848 224871 219502 215568 211937 208008 204412 202354
66026 202354 202345 203411 203744 202651 201654 202869 206245 209463 210716 210427 209737 208847 207947 208465 211564 215944 218939
66009 218939 219772 220270 222242 225604 229538 234165 240168 247420 254720 260707 264851 267853 271133 275573 280854
65994 280854 286341 292156 298635 305157 310653 315146 319630 324519 329573 335379 343260 353175 363275 372405
65980 372405 381552 391706 401655 409414 414898 419611 424378 428985 433612 438860 444336 448745 451601 453603
65966 453603 455240 456305 456962 457854 458712 458175 455714 452665 450631 449765 449299 448919 448872 449564 451713 455959 461435
65949 461435 465671 467076 466793 466827 467054 465591 461787 457142 453249 450379 448503 448166 449527 451404 451957 449907
65933 449907 445055 438612 433151 430954 431727 432877 432521 431167 429960 428725 426736 424089 420907 416224 409274
65918 409274 401236 394128 388504 383784 380283 378879 378865 378210 376376 374959 374930 375094 374292 373460 374094 375873
65902 375873 377360 378401 380316 383867 388129 391465 392988 393183 393513 395194 397979 400490 401986 403166 404884
65887 404884 406983 409070 411658 415506 420313 424972 428814 431795 433944 435674 438382 443581 451223 459562
65873 459562 466742 471994 475434 477554 479074 480766 483057 485918 488974 491681 493807 495967 498951 502150
65859 502150 503480 501725 498240 495291 493317 491055 487902 484674 482057 479691 477071 474208 471150 467855
65845 467855 464818 462790 461579 459997 457322 453960 450372 446227 440965 434489 427140 419807 414004 410616
65831 410616 408322 404651 399173 394281 392021 391440 390203 387685 385088 383314 382235 381651 381438 380815 378746
65816 378746 375228 371231 367294 363085 358382 353546 348784 343758 338175 332102 325523 318291 310820 304152
65802 304152 298920 294719 290856 287278 284347 282022 279788 277245 274398 271413 268384 265461 263013 261486
65788 261486 260942 260791 260206 258923 257446 256331 255499 254537 253348 251947 249799 246066 240797 235360 231247
65773 231247 228647 226467 223602 219946 216375 214129 214138 216430 219822 222335 222406 220126 217371 216411 218125 221535
65757 221535 225160 228584 232463 237104 241694 245212 247718 250200 253299 256742 260102 263460 266908 269804
65743 269804 271202 271012 270200 269762 269865 270077 269900 268803 266225 262064 257011 251863 246615 240626 233811 227295
65727 227295 222696 220753 220538 219963 217320 212656 207499 203023 198897 194360 189939 187156 186534 186896 186966 186771
65711 186771 186927 187332 187450 187367 187483 187229 185171 180764 175297 170598 167302 164881 162898 161363 159924 157636
65695 157636 154043 149938 146407 143317 139518 134531 129317 125020 121694 118883 116861 116290 116738 116609 114929
65680 114929 112463 110541 109352 108093 106380 104673 103369 102333 101525 101353 101810 101755 99902 96548 93588
65665 93588 92517 92926 93409 93439 93586 94153 94542 94194 93301 92150 90490 88234 86192 85227 84968 84233 82675
65648 82675 81150 80352 79884 79026 77832 77146 77856 80246 83574 86183 86681 85326 83798 83323 83602 83757 83570
65631 83570 83129 81977 79550 76324 73716 72840 73833 76161 78933 81079 82085 82611 83615 84762 84672 83143
65615 83143 82001 82857 84887 86205 86962 89296 93854 98106 99310 98019 97099 97855 98928 99100 99396 101497
65599 101497 105208 108607 110139 109650 107756 105131 102305 99508 96694 93989 91783 90095 88482 87121
65585 87121 87182 89205 91728 92735 92139 91595 92089 93198 94796 97738 102086 106036 107789 107703 107453 107603 107196
65568 107196 105698 104289 104771 107642 111651 115171 117663 119535 120719 120094 116811 111621 106083 100784 95382
65553 95382 90256 86830 85843 86330 86868 86994 86873 86456 85796 85580 86460 88110 89449 89561 88121 85499 82803
65536 82803 81199 80703 80286 79563 79529 80923 82748 83411 82708 81604 80513 79087 77517 76830 77641 79375 80883
65519 80883 81279 80235 78229 76517 76122 76682 76769 75424 72942 70247 68078 66824 66528 66848 67331 67785 68164
65502 68164 68322 68250 68325 68795 69199 68831 67678 66365 65361 64813 64955 65999 67659 69376 70968 72467 73442
65485 73442 73283 72161 70962 70056 68809 66546 63528 60712 58936 58420 58696 58979 58915 58854 58993 58575 56701
65468 56701 53852 51631 50905 51046 51277 51799 53107 54942 56675 58254 60038 61933 63354 63998 64224 64523
65452 64523 64846 64597 63348 61518 60100 59526 59158 58284 57256 56980 57500 57997 58187 58861 60739 63597 66769
65435 66769 69645 71353 71026 69261 68462 70560 74637 77730 77805 75198 71468 68021 65944 65836 67038 67699
65419 67699 66531 64362 63321 64490 66802 68316 68188 67188 66619 67084 68282 69599 70611 71130 71174 71068
65403 71068 71359 72340 73577 74065 72945 70122 66370 62991 61199 61380 62698 63754 64027 64557 66703 70231
65387 70231 73214 74103 73426 73001 73884 75715 77785 79932 82178 84110 84948 84064 81450 77986 75027 73178
65371 73178 71608 69327 66961 66298 67913 70364 72138 73337 74716 76092 76707 76500 75926 74948 73260 71243
65355 71243 69863 69764 71068 73598 76508 78294 78235 77416 77280 77607 77268 76624 77492 80614 84688 88268 91238
65338 91238 93865 95788 96705 96972 96788 95801 94207 93140 93077 92989 92117 91483 92203 93201 92456 90263 89362 91511
65320 91511 95567 99602 103497 108329 114144 119779 124700 129730 135627 141782 146901 150609 153792 157508
65306 157508 161997 166772 171343 175748 180672 187092 195530 205458 215535 224418 231146 235023 235876 234542
65292 234542 232301 229405 224821 217882 209494 201038 192793 184371 176068 168520 161312 153306 144407 135853
65278 135853 128589 122456 117203 113125 110293 108171 106456 105406 104887 104059 102580 101190 100455 99830 98736
65263 98736 97658 97256 97085 96227 94668 93049 91517 89840 88336 87613 87484 87088 86041 84627 82947 80860
65247 80860 78839 77810 77795 77618 76445 74913 74084 73873 73277 71852 70187 68936 68174 67971 68903 71336 74392
65230 74392 76268 75722 72946 69066 65294 62619 61610 62063 63339 65447 69144 74327 78969 80734 79471
65215 79471 77153 75450 74354 73147 71599 69874 68236 67311 67786 69350 70620 70587 69627 68744 68476 68871
65199 68871 69777 70670 70755 69695 67839 65545 62994 60760 59605 59326 58779 57504 56340 55907 55676 55256 55375
65182 55375 56453 57280 56467 54472 52905 52485 53018 54665 57609 60835 62883 63731 64397 64758 63545 60873
65166 60873 59107 60315 63870 67333 68892 68287 66153 63312 60420 57714 55212 53305 52688 53480 54840
65151 54840 55774 56093 56417 57458 59316 61267 62314 62262 62030 62529 63556 64434 65328 67055 69652 72123 73668
65134 73668 74232 73651 71301 67196 62698 59453 57948 57515 57411 57522 58211 59733 61701 63237 64037 65027
65118 65027 67262 70224 72119 72061 71006 70157 69402 68091 66617 66188 67297 69325 71580 73948 76391 78430
65102 78430 79462 79206 77579 74511 70405 66672 65122 66325 68787 70359 70430 70119 70293 70323 69359 67939
65086 67939 67257 67312 67004 66013 65380 65937 67157 68016 68179 67876 67285 66637 66450 67112 68525 70451 72719 74759
65068 74759 75533 74490 72242 69738 67120 64045 60858 58720 58432 59623 61312 62980 64839 67131 69384
65053 69384 70630 70420 69447 68849 68979 69168 68661 67434 66035 65032 64657 64572 63927 62087 59473 57296 56340
65036 56340 56465 57419 59463 62688 66210 68626 69113 67805 65416 62932 61427 61591 63378 66340 70056
65021 70056 73932 76989 78523 78921 79149 79339 78594 76496 74041 72471 71676 70741 69819 70269 72591 75386
65005 75386 77268 78908 81930 86317 90463 93805 97705 103237 109562 115333 120372 124926 128584 131385
64991 131385 134879 140179 145696 148830 149728 151202 154734 158648 160910 161837 162880 164243 165065 164999 164320 163095
64975 163095 161295 159247 157043 153941 149205 143240 137245 132057 127707 123653 119043 113480 107976 104274
64961 104274 102572 100954 97999 94918 93792 94458 94770 93577 91810 90548 89543 88030 85845 83212 80363
64946 80363 77835 76399 76190 76485 76685 76985 77730 78687 79397 79886 80530 81334 81672 80767 78434 75357 72580
64929 72580 70749 70057 70730 72815 75288 76372 75591 74679 75393 77069 77652 76684 75548 74813 73374 70947
64913 70947 69651 71653 76203 80357 82154 81944 80995 80042 79173 78172 76762 75057 73774 73444 73511 72917
64897 72917 71667 71096 72253 74416 75636 74690 72356 70760 71397 73767 75986 76719 76282 75876 76233 77172
64881 77172 77919 77485 75334 72279 70215 70160 70884 70364 68342 66369 65466 64924 63786 62250 61013 60217 59919
64864 59919 60822 63453 67024 70070 71933 72741 72269 70061 66811 64554 64922 67672 71149 73771 74900
64849 74900 74865 74423 73906 72803 70610 68046 66783 67747 70163 72352 72918 71175 67388 62986 59690 57832
64833 57832 56091 53419 50555 49054 49512 51551 54923 59538 64607 68730 71016 71631 71353 71019 71082 71183
64817 71183 70490 68994 67870 67763 67364 64945 60999 58070 57919 60135 63591 67726 71828 74449 74716 73645
64801 73645 73354 75196 79034 83685 87575 89466 89272 87982 86496 84896 83049 81351 80433 80509 81357 82516
64785 82516 83232 82695 80792 78381 76646 76412 77910 80424 82123 81291 78228 75158 73744 73450 72774 71215
64769 71215 69411 68292 68885 71975 76855 81147 83141 83789 85141 87248 88066 86315 82963 79650 76975
64754 76975 74878 73628 73608 74692 76397 78303 79940 80667 80109 78588 76866 75549 74723 73997 72935 71582
64738 71582 70343 69160 67315 64623 62362 62081 63569 64950 64939 64143 63818 64217 64734 64998 65094 65066 64987 65468
64720 65468 67350 70607 73908 75657 75562 75071 76181 79797 85055 89937 92416 91501 87978 84203 82429
64705 82429 82792 83210 81637 78115 74371 72017 71655 73230 76336 80165 83763 86489 88007 88111 87006
64690 87006 85459 84096 82684 80634 77987 75343 73087 71286 70209 70248 71499 74021 78162 83680 88749
64675 88749 90963 89680 86620 84096 83250 83931 85221 85912 85476 84947 85999 88857 91978 94010 94978 95159
64659 95159 94093 91587 88693 86622 85358 84263 83356 82981 82788 82238 81681 81753 81993 81386 80213 80010 81356
64642 81356 82884 82987 81632 79922 78712 78323 78993 80845 83588 86660 89287 90160 87886 82634 76963
64627 76963 73981 74629 77384 80422 83085 85194 86276 86243 86006 86371 86819 86337 85212 84867 85929 87556
64611 87556 88966 90512 92574 94265 94243 92422 90061 88380 87744 87974 88688 89341 89533 89383 89138 88567 87274
64594 87274 85512 84121 83659 84042 84835 85318 84555 82419 80538 81124 84435 88209 90054 89701 88508 87596
64578 87596 87220 87324 87784 88297 88746 89521 90996 92832 94332 95319 96129 96892 97292 97005 95996 94485 92949
64561 92949 91917 91392 90714 89477 88254 87825 87950 87753 87148 86845 86744 85530 82500 78937 76646 75738 74980
64544 74980 74114 74509 77166 81202 84995 88053 90847 93307 94655 94772 94732 95567 97131 98642 99804 100830
64528 100830 101753 102335 102606 102941 103495 103938 103863 103215 102276 101417 100934 100960 101406 101959 102158 101595 100320 98990 98313
64509 98313 98187 97798 96729 95611 95311 95786 96080 95263 93111 90205 87772 87091 88546 91304 94182 96570
64493 96570 98378 99619 100562 101677 102806 102827 101062 98558 97026 96717 96408 95348 94097 93359 93135 93336
64477 93336 94156 95354 95966 95264 93461 91242 89240 88084 88126 88914 89757 90923 93246 96331 98509 99101
64461 99101 99398 100574 101971 102598 103115 104740 106999 108232 107937 107030 105922 104011 101250 98727 97128 95755
64445 95755 93812 91847 91157 92197 94056 95320 95230 94294 93837 94662 96148 97039 96963 96533 96003 94784 92647
64428 92647 90678 90390 92117 94774 96973 98028 98120 97851 97623 97231 96178 94545 93227 92904 92927 91833 89205
64411 89205 86518 85699 87122 89545 91868 94098 96411 98235 99061 99536 100696 102373 103379 103187 102395 101544
64395 101544 100706 100447 101816 104723 107513 108929 109412 109633 109033 107167 105400 105515 107181 108517 108858 109236
64379 109236 110178 110833 110683 110446 110674 110855 110612 110519 110814 110477 108718 106600 106020 107584 110450 113808 117417
64362 117417 120850 123298 124354 124366 123919 123494 123659 124887 126878 128566 129310 129968 132278 137002 142953 148128
64346 148128 151659 154262 156830 159366 161615 164016 167307 171663 176997 183713 192074 201139 209544 217408
64332 217408 226075 235628 244001 249363 252268 254515 256813 258688 259991 261193 262445 263419 264002 264254 263774
64317 263774 261930 258743 254737 249967 243943 236578 228546 220669 213551 207710 203199 198979 193549 186613
64303 186613 179616 174342 171359 169920 168793 166969 164193 161130 158645 156730 154686 152417 150730 149943
64289 149943 149080 147183 144811 143414 143636 145086 147455 150756 154433 157152 157885 156717 154530 152428 151533
64274 151533 152514 154935 157723 160605 164368 169204 173651 176209 177582 180163 185301 192154 199445 207280
64260 207280 216534 227195 238161 248372 257355 264820 270434 274013 275364 273921 269250 262165 254686
64247 254686 248313 242543 235581 226443 216063 206420 198877 193338 188597 183388 177380 171410 166698 163694
64233 163694 161688 159579 156922 154184 152104 151016 150763 151107 152062 153834 156414 159253 161430 162255 161720
64218 161720 160292 158427 156549 155412 155923 158178 160950 162651 162900 162785 163562 165472 167972 170676 173687
64203 173687 177160 180884 184263 186538 187180 186294 184585 182727 180821 178644 176318 174379 173152 172287 171115
64188 171115 169403 167653 166658 166786 167730 168855 169676 169930 169507 168721 168562 170124 173482 177516 181155 184456
64172 184456 188067 191936 195179 197218 198547 200196 202755 206073 209705 213520 217879 223129 228873 234014
64158 234014 237886 241085 244760 249207 253656 257366 260347 262973 265521 268393 272287 277744 284753 292932
64144 292932 301815 310925 320109 329981 341488 354654 368352 381771 395526 410653 427068 443976
64132 443976 461406 479940 498689 514729 525461 530955 533329 534276 533981 532111 528803 524323 518411
64119 518411 510427 499906 486791 471468 454901 438480 423252 409292 396008 382987 370195 357503
64107 357503 344493 331019 317645 305335 294838 286446 279941 274505 269021 262963 256939 251921 247987
64094 247987 244307 240333 236462 233293 230776 228515 226563 225370 225043 225095 224995 224686 224495 224738 225404 226071
64078 226071 226205 225750 225402 226074 228013 230569 232672 233357 232042 228884 225004 221934 220491 220280 220330 219929
64062 219929 218802 216977 214788 212643 210439 207605 204228 201719 201630 203847 206627 208445 209111 209024 208175 206427
64046 206427 204183 202145 200688 199856 199637 199713 199216 197412 194724 192692 192800 195397 199474 203274 205441 206024
64030 206024 206207 206837 207653 208336 209673 212765 217430 222364 226780 230908 234862 238158 240652 243007 245770
64015 245770 248897 252573 257413 263100 267815 270031 270255 269947 269274 267165 263333 259017 255581 253425 252488
64000 252488 252835 254204 255654 256283 256115 255905 256248 257127 258254 259638 261594 263944 265411 264507 261400 258247
63984 258247 257034 257660 258923 260783 264270 269275 273947 276861 278727 281260 285228 290372 296523 303798
63970 303798 311903 319990 327163 332737 336299 338102 339304 341297 344747 349380 354392 358737 361420 362143
63956 362143 361698 361286 361502 362207 363054 363684 363746 363456 364076 367056 372456 378810 384735 390132 395506 400812 405593
63939 405593 409871 414097 418297 421945 424947 428377 433825 442000 451898 461297 468357 473228 478073 484993
63925 484993 493795 502270 508839 514287 520494 528101 536233 544135 552038 560398 569311 579095 590577 604171
63911 604171 619248 635053 651790 670091 689717 709632 729382 749641 771276 794509 819430
63900 819430 846845 877929 912898 950420 988782 1027780 1069177 1115048 1165792 1220205 1277283
63889 1277283 1337183 1400263 1466137 1534534 1606572 1684233 1768542 1858890 1954165 2053984 2158791
63878 2158791 2269353 2386453 2510843 2643361 2785141 2937538 3101694 3278671 3470434
63869 3470434 3680273 3911515 4166164 4445685 4752973 5092654 5469530 5887924 6352786
63860 6352786 6870120 7445305 8081460 8779928 9541452 10365503 11248388 12182724 13159075
63851 13159075 14167748 15198988 16241524 17280736 18297796 19270567 20175837 20991538
63843 20991538 21698200 22280035 22725787 23028497 23183729 23187776 23037809 22733945 22281182 21689733
63833 21689733 20974194 20152779 19246584 18277899 17267557 16233105 15189466 14151046 13132435
63824 13132435 12146815 11204374 10312779 9478457 8706346 7998448 7353433 6767918 6237885
63815 6237885 5759225 5327880 4939748 4590264 4274457 3988108 3728625 3493857 3280274
63806 3280274 3083545 2901068 2732656 2578221 2436026 2303940 2181286 2068297 1964376
63797 1964376 1868016 1778029 1693816 1614639 1539603 1468267 1400407 1335246 1271892 1210819 1154104
63786 1154104 1103630 1059279 1019063 980750 943248 906801 872247 840028 809776 780769 752701
63775 752701 725915 700915 677804 656228 635906 617152 600649 586437 573345 559795 545190
63764 545190 530175 515584 501686 488516 476387 465775 457015 450192 444813 439587 433241 425819 418502
63751 418502 411857 405196 398222 392276 388798 387052 384652 380254 374686 369350 364618 360251 356468 353806
63737 353806 352146 350481 347719 343680 339349 336021 333784 330925 325454 317528 309857 305155 303389 302061
63723 302061 299068 294605 290144 286367 282787 278895 274702 270204 265323 260719 257758 256963 257096 256506 254910
63708 254910 253122 251489 249548 246934 243691 239753 235143 230732 227935 227471 228927 231358 233524 233964 232064
63693 232064 229118 227195 226977 227758 229242 231721 234492 236072 236404 236924 237817 237414 235370 234225 236068 239574
63677 239574 242436 245106 249679 256203 262814 268911 275557 282979 290215 297473 306332 317133 328379 339438
63663 339438 351701 366079 381308 395984 410579 425849 440518 452319 460671 466702 470841 471778
63651 471778 468000 459560 448157 436042 424865 415063 406084 397265 388470 379898 371604 363468 355584
63638 355584 348521 343033 339259 336175 332321 327383 322519 318688 315294 311290 307004 303800 302260 301969
63624 301969 302964 306001 311097 317053 322921 328908 335323 341625 347299 352968 359833 368293 377608 386620
63610 386620 394552 401528 408632 417045 426865 437065 446625 455201 462659 468606 472566 474118 472750 468161
63596 468161 460750 451311 440338 428246 415973 404365 393205 382050 371944 364645 359834 354831
63584 354831 348058 341325 337455 336831 337676 338807 340435 342585 344404 345379 346235 348257 352281 358415 366203
63569 366203 374898 383879 392923 402072 411544 421891 433763 447164 461342 475736 490628 506619
63557 506619 524066 543403 565340 590127 617031 645048 673727 703024 733108 764810 799251
63546 799251 835962 871973 903929 930845 953762 973177 988231 998536 1005313 1010053 1012989 1013665
63534 1013665 1012297 1009612 1005547 999064 989583 978078 966242 954725 942622 928739 912838 895431
63522 895431 876974 857908 839099 821419 804956 789390 775112 763138 753882 746842 741584 738105
63510 738105 736049 734675 734028 735095 738283 742794 748129 755028 764073 774516 785681 798493 814137
63497 814137 831835 849635 867088 885617 906202 928169 950511 973118 996253 1019843 1043880
63486 1043880 1068768 1094736 1121213 1146980 1170535 1190331 1205389 1215925 1222953 1227173 1228711 1227937
63474 1227937 1225838 1223400 1221139 1219413 1218614 1218649 1218457 1216319 1210664 1200743 1186768 1169287 1148188 1122643
63460 1122643 1092508 1059442 1025936 993268 961087 928993 897757 868606 841818 816603 792477
63449 792477 770522 752866 740424 731239 721844 710552 698739 688516 680173 672742 666079 660941 657466
63436 657466 655048 653587 653406 653821 653231 650990 648099 645754 644404 644486 646589 650150 653362 655426 657956
63421 657956 663036 670733 679614 688982 699178 710017 720338 729285 736958 743566 748739 751915 752780 751104
63407 751104 746719 739880 731135 720684 708314 694192 679301 664880 651747 640243 630339 621502
63395 621502 612902 604278 596393 590280 586122 583131 580407 577568 574764 572570 571926 573607 577468 582532
63381 582532 588084 594415 602186 611430 621603 632462 644400 657974 673532 691237 710928 731893
63369 731893 753373 775518 799396 825788 854444 884828 917117 951941 989425 1029065 1070434
63358 1070434 1113527 1158359 1204469 1250784 1295709 1337421 1374442 1405990 1431690 1451054 1463566
63347 1463566 1469367 1469711 1466512 1461313 1454642 1446529 1437570 1428890 1420661 1411219 1398483 1382044 1363006
63334 1363006 1342077 1319251 1295528 1273361 1254366 1237661 1221564 1206115 1192749 1182131 1173762
63323 1173762 1167454 1163825 1163154 1164740 1167698 1171790 1177449 1185502 1196742 1211132 1227541 1244767 1262584
63310 1262584 1281285 1300690 1320483 1341111 1363386 1387414 1412787 1439413 1467149 1495153 1523088
63299 1523088 1552611 1585824 1622127 1658392 1692637 1725629 1757992 1787671 1811877 1830305 1844688
63288 1844688 1855843 1862843 1864940 1862763 1857369 1849240 1838695 1826562 1813837 1800792 1786597 1769843
63276 1769843 1749613 1726265 1701124 1675420 1649653 1623767 1597553 1570952 1544572 1519772 1497374
63265 1497374 1476201 1453907 1429676 1405295 1383092 1363796 1347080 1333081 1322111 1313370 1305258 1296903
63253 1296903 1288478 1280070 1271217 1261701 1252083 1243179 1235385 1228450 1221584 1213902 1205171 1195868 1186101 1174946
63239 1174946 1161639 1147097 1133254 1120972 1109575 1098486 1088201 1079208 1071014 1062955 1055235 1048292
63227 1048292 1041680 1034509 1026692 1018862 1011140 1002988 994387 986202 978924 971935 964707 958019 952912 948814
63213 948814 943894 937397 930469 924281 918344 911384 903070 894070 884989 876240 868431 861765 855238 847508
63199 847508 838577 829694 821669 814362 807837 802678 798688 794469 789063 783122 777695 772586 766753 759721
63185 759721 751821 743590 735837 729894 726767 725983 726000 725690 724905 723747 722002 719386 715874 711801 707981
63170 707981 705545 705123 706191 707645 708923 710111 711182 711831 712220 713183 715272 717889 719783 720348 720134 720016
63154 720016 720071 719488 717595 714712 711919 710198 710022 711372 713689 716151 718693 722571 729032 737411 745564
63139 745564 752332 758533 765133 771665 777172 781628 785413 788416 790847 794207 799934 807474 815064 822168
63125 822168 829632 837590 844940 851317 857975 865888 874212 881684 888615 896340 905214 914341 923191 932481
63111 932481 943155 955148 967500 979386 990743 1001990 1013399 1024855 1036098 1046965 1057288
63100 1057288 1066919 1076141 1085844 1096785 1108594 1119836 1129119 1135929 1140581 1143840 1146571 1149225 1151363
63087 1151363 1152047 1150889 1148440 1145411 1141822 1137277 1131889 1126581 1122239 1118552 1113937 1107037 1098443 1090453
63073 1090453 1084795 1080960 1077289 1073233 1069719 1067472 1065950 1064087 1061245 1057124 1051613 1045362 1039906 1036428
63059 1036428 1034465 1032249 1028319 1022616 1016237 1010388 1005510 1001315 997665 995082 993924 993320 991813 989262
63045 989262 987235 987110 988471 989987 991158 992541 994752 998081 1002646 1008075 1013288 1017475 1021167 1025527
63031 1025527 1030700 1035783 1040424 1045526 1052115 1060358 1069815 1079707 1088601 1094992 1099032 1102809 1107949 1113536
63017 1113536 1117559 1119914 1122580 1126891 1132064 1136929 1141815 1147727 1154392 1160268 1164367 1167302 1170449 1174602
63003 1174602 1179487 1184194 1188125 1191782 1196416 1202461 1208601 1213059 1215681 1217915 1220651 1222952 1223356 1221746
62989 1221746 1219367 1217497 1216633 1216525 1216290 1214798 1211685 1207952 1205053 1203539 1203098 1203504 1204604 1205472 1204841 1202855
62973 1202855 1201458 1202315 1204969 1207681 1209516 1210709 1211354 1210934 1209292 1207203 1205446 1203768 1201162 1196952 1191437
62958 1191437 1185741 1181194 1178506 1177112 1175419 1171887 1165932 1157913 1148628 1138965 1129628 1120928 1112959 1106088
62944 1106088 1100923 1097614 1095601 1094349 1093858 1093972 1093756 1092546 1091479 1092957 1098292 1106594 1116298 1126962
62930 1126962 1139069 1152805 1167874 1184094 1201254 1218431 1234290 1248332 1261415 1274795 1288882
62919 1288882 1302986 1316056 1327601 1338090 1348390 1358600 1367458 1373070 1374244 1370990 1363941 1353616
62907 1353616 1340161 1323458 1303362 1279876 1253050 1222817 1189392 1154010 1118679 1084616 1051293
62896 1051293 1017621 983786 951163 920605 891644 863480 836011 809657 784690 761018 738336
62885 738336 716508 696166 678628 664510 652552 640629 627964 615541 604347 594342 585377 577904
62873 577904 572016 566660 560594 553516 545718 537378 529010 521871 516874 513417 510157 506637 503377 500664
62859 500664 498178 495610 492728 488863 483271 476330 469737 465124 462655 461076 458964 455998 453201 451700
62845 451700 451189 450104 447670 445101 444116 444838 446053 447139 448608 450809 453177 454993 455977 455813 453938
62830 453938 450299 445855 441866 438981 437165 436049 435122 433993 432731 431699 430938 430156 429423 429472 431003 433968
62814 433968 437664 441288 444309 446705 449049 452124 456290 461342 467020 473379 480637 488934 498259 508384
62800 508384 518886 529459 540016 550108 558482 563927 566574 567766 568460 568371 566804 563749 559821 555712
62786 555712 552098 549532 547794 545583 541434 535047 527505 520391 514907 511527 509857 508692 506620 503048
62772 503048 498704 495005 492780 491601 490399 488626 486596 484735 482984 481199 479665 478707 478032 477033 475713
62757 475713 474824 475060 476434 478319 479606 479027 476044 471568 467257 463974 461369 458898 456500 454058 451117
62742 451117 447700 444830 443529 443591 443858 443458 442268 440425 438048 435485 433279 431653 430187 428097 424780
62727 424780 420272 415453 411699 409884 409443 408626 406090 402391 399716 399795 402021 403994 404042 402838 402233 403065
62711 403065 404685 406286 407729 409016 409914 410586 411834 414180 417211 420432 424318 429711 436289 442400 446607
62696 446607 448960 450601 452481 454783 457329 460147 463497 467439 471548 475168 477943 480027 481781 483351
62682 483351 484624 485516 486220 487145 488582 490481 492595 494796 496989 498745 499413 498910 498148 498255 499414 500697
62666 500697 500897 499283 495800 491094 486268 482081 478277 474086 469471 465385 462653 461017 459577 457904
62652 457904 456385 455526 455083 453959 451145 446916 442979 441112 441684 443704 446163 448975 452733 457959 464609
62637 464609 471957 479049 485620 492580 501288 512532 526441 542902 561340 580367 598723 616734
62625 616734 636141 658341 683450 710968 740281 770297 799782 828808 858893 890767 922640
62614 922640 951634 976571 998391 1018040 1034869 1047198 1053708 1054033 1048502 1037679 1022075 1002148
62602 1002148 978492 951851 922973 892765 862570 833729 806580 780308 754209 728647 704354
62591 704354 681222 658519 636149 614969 595746 578285 561885 546345 532241 520200 510082
62580 510082 500974 492045 483204 474789 466894 459399 452516 446728 442142 438416 435357 433024 431182 429345
62566 429345 427550 426352 425689 424514 422031 418719 415647 413458 412486 412971 414300 414756 413236 410871 409818
62551 409818 410576 411620 411612 410876 410470 410926 412370 414903 418174 421194 423351 425287 428102 431802 435133 437004
62535 437004 437763 438990 442243 447938 455036 461648 466259 468976 471747 476902 484903 493715 500875 506123
62521 506123 511249 517341 523173 526959 528880 530875 534207 538229 541513 543288 543615 542954 542003 541412 541245
62506 541245 540949 540036 538481 536311 533296 529386 525145 521345 518199 515225 511751 507421 502373 497171 492491
62491 492491 488730 485991 484335 483734 483523 482269 478764 473197 467005 461444 456589 451842 446978 442298 438046
62476 438046 434230 431001 428696 427275 426182 425026 424127 424095 425122 426876 428759 430044 430296 430065 430734 433036
62460 433036 436100 438660 440761 443355 446492 449221 451473 454875 461004 469548 478767 487312 495134 503076
62446 503076 512022 522187 532997 543962 555668 569327 585300 602697 620463 638032 654935 670928
62434 670928 686850 704025 722117 738829 752656 764733 776757 788155 796939 802650 806643 809561
62422 809561 810180 807046 800012 789962 778149 766135 755214 745292 735007 723384 710901 698757
62410 698757 687632 677310 666998 656037 644775 634570 626237 618812 610826 602535 595525 590105 584731
62397 584731 578656 573556 571264 571006 570422 568821 567900 569219 572273 575272 576742 575913 572579 567561 562882
62382 562882 560479 560580 561719 562351 561905 560349 557646 554200 551145 549245 547793 545560 542781 541064 541087
62367 541087 541536 541027 540076 540134 541351 542588 543380 544657 547292 550875 554380 557559 561321 566957 575010 584726
62351 584726 594710 604389 614508 625980 638687 651963 665677 680076 694939 709789 724680 739942
62339 739942 755281 770085 784455 798969 813473 827125 839636 851366 862158 871286 878927 886436
62327 886436 894555 902322 908445 913015 917263 922366 929028 937399 946725 955754 964311 973930 986356 1002130
62313 1002130 1021316 1044697 1072895 1104736 1137933 1171698 1207723 1248211 1293604 1342661 1394288
62302 1394288 1448867 1507890 1572539 1642662 1717123 1794967 1875898 1959578 2044890 2130084 2213047
62291 2213047 2290982 2360453 2418658 2464722 2499204 2522505 2534423 2535087 2525334 2505757 2476178 2436698
62279 2436698 2388819 2334802 2276078 2213000 2146195 2077466 2008980 1942053 1877226 1815227 1757205
62268 1757205 1704035 1655859 1612361 1573006 1536983 1503616 1473111 1446281 1423116 1402192 1382095
62257 1382095 1362966 1345955 1331504 1318996 1307855 1298086 1289773 1282991 1278327 1276480 1276830 1277147 1275401
62244 1275401 1271598 1267455 1264586 1263330 1262951 1262400 1260927 1258401 1255299 1252480 1250935 1251463 1254155 1258213 1262629
62229 1262629 1267068 1271952 1277892 1285507 1295560 1308471 1323598 1339637 1356003 1373252 1391912 1411499
62217 1411499 1431157 1450838 1471390 1493725 1518283 1545123 1574168 1605343 1638604 1673826 1710829
62206 1710829 1749771 1791454 1836855 1886321 1939531 1996176 2056282 2119943 2187264 2258571 2334155
62195 2334155 2413682 2496194 2580443 2664519 2745328 2819595 2885766 2944105 2994539 3035291 3064313
62184 3064313 3081312 3087572 3084273 3071833 3050705 3022046 2987456 2948352 2905603 2859708 2811633 2763505
62172 2763505 2717895 2676016 2637077 2599838 2564424 2532244 2504591 2481746 2462990 2446992 2432643
62161 2432643 2420205 2411223 2406596 2405014 2404122 2403056 2402948 2404873 2408384 2412542 2417656 2425060 2435342 2447532
62147 2447532 2460317 2473601 2488436 2505559 2524496 2544293 2564905 2587583 2613978 2644899 2679704
62136 2679704 2716820 2755174 2795336 2838942 2886897 2938750 2994093 3053495 3117083 3183082 3249333
62125 3249333 3315918 3384565 3455292 3525471 3593020 3658902 3725293 3792375 3858311 3921693 3982600
62114 3982600 4041745 4100120 4159675 4222961 4291350 4364056 4439474 4517445 4599896 4688984 4784476
62103 4784476 4883204 4981639 5078807 5175897 5272943 5366917 5453656 5530774 5598112 5656301 5706086
62092 5706086 5748641 5785378 5817263 5844855 5868763 5889415 5906554 5919684 5929028 5935666 5940943 5946233
62080 5946233 5952963 5962204 5974387 5989899 6009637 6034210 6062716 6093059 6123689 6154634 6186991 6221913
62068 6221913 6259977 6300864 6343473 6386796 6430876 6476703 6525146 6576159 6628874 6682227 6735582
62057 6735582 6788948 6842590 6896494 6950567 7005207 7060893 7116995 7171939 7225185 7278163 7332248
62046 7332248 7386357 7437688 7484585 7527660 7568213 7606759 7643332 7678262 7712082 7745075 7777193
62035 7777193 7808112 7837327 7864571 7890183 7914637 7937791 7959162 7978927 7998164 8017978 8038849
62024 8038849 8060815 8083751 8107329 8131240 8155727 8181590 8209414 8238923 8269172 8299164 8328239
62013 8328239 8355991 8381976 8405678 8427061 8447052 8466885 8486686 8505285 8521827 8537022 8552131
62002 8552131 8567086 8580305 8589964 8594640 8592990 8583901 8567178 8543338 8512551 8474406 8428894 8376928
61990 8376928 8319569 8257259 8190169 8118903 8044529 7968213 7891183 7814799 7740351 7668607 7599335
61979 7599335 7530728 7459249 7380820 7293273 7198131 7099794 7002599 6908464 6817137 6727944 6640282
61968 6640282 6552307 6460412 6361336 6254751 6143092 6029244 5915432 5803899 5696727 5594191
61958 5594191 5494623 5396871 5301948 5211359 5124939 5041665 4961862 4887116 4818191 4754351 4694644
61947 4694644 4638575 4585306 4533348 4481739 4430997 4382442 4336769 4293552 4252011 4211996 4173744
61936 4173744 4136403 4097420 4054453 4007700 3958874 3907689 3851124 3787113 3717323 3644964 3571310
61925 3571310 3496117 3420258 3345633 3272889 3201339 3130988 3062790 2996973 2932945 2870952 2812021
61914 2812021 2756024 2701563 2648187 2597082 2549115 2503713 2460250 2419073 2380583 2344718 2311870
61903 2311870 2282821 2257080 2232749 2208881 2186618 2167148 2149980 2134298 2120704 2110294 2103070
61892 2103070 2098452 2096417 2096791 2098371 2100282 2103685 2110656 2121728 2135820 2152380 2172272 2196537 2225458
61879 2225458 2258816 2295940 2335255 2374858 2414124 2454200 2496560 2541465 2588153 2636094 2685639
61868 2685639 2737444 2791524 2847104 2903568 2961472 3022355 3087541 3157526 3232666 3314002 3403154
61857 3403154 3501713 3611111 3732917 3869017 4021466 4192050 4381806 4591136 4820796 5072643
61847 5072643 5348931 5651157 5980134 6336738 6721382 7132563 7566901 8020587 8489197
61838 8489197 8964941 9434553 9880162 10281390 10616463 10863705 11005245 11031216 10941281 10743371
61828 10743371 10451719 10084821 9662718 9204258 8725813 8241199 7761421 7294275 6844915
61819 6844915 6417226 6014604 5639709 5293973 4977466 4688968 4426238 4186600 3967731
61810 3967731 3768231 3587668 3425848 3281627 3152619 3036597 2933022 2842372 2764021 2695799
61800 2695799 2636045 2585007 2543434 2510542 2484358 2463824 2449664 2443124 2444261 2451497 2462519 2475620
61788 2475620 2490215 2506094 2522529 2538592 2553972 2568531 2581193 2590372 2595646 2597775 2596847 2591991
61776 2591991 2583782 2575453 2570213 2568119 2566958 2565621 2565281 2567605 2573130 2581287 2590861 2600410 2609157 2617443
61762 2617443 2625433 2631567 2633315 2629561 2621461 2610941 2599256 2587059 2574970 2563764 2554461 2548315 2546185
61749 2546185 2547988 2553335 2562546 2576407 2595218 2619008 2648590 2685432 2730346 2783109 2843346 2910823
61737 2910823 2984862 3064762 3151312 3246743 3352434 3467622 3591368 3725143 3872363 4035643
61727 4035643 4215552 4412058 4626316 4860779 5118261 5401349 5712400 6053744 6428029
61718 6428029 6838620 7289666 7785562 8330035 8925387 9572250 10269903 11016641 11809341
61709 11809341 12641809 13502749 14374648 15233778 16050351 16788472 17407455 17866584 18132882
61700 18132882 18188322 18032761 17681872 17162413 16507475 15752554 14932122 14076682 13211144
61691 13211144 12355072 11523991 10730057 9981470 9282060 8632547 8032679 7481983 6978757
61682 6978757 6519422 6099637 5715883 5365852 5047779 4759654 4498420 4259683 4039204
61673 4039204 3835473 3649905 3483425 3333493 3195753 3068015 2951048 2845681 2750796 2664360
61663 2664360 2584687 2509985 2438017 2367236 2297570 2229536 2163367 2099453 2038597 1980996 1925609
61652 1925609 1871229 1817738 1765841 1716162 1669134 1625227 1584694 1547381 1512998 1481140 1450988
61641 1450988 1421740 1393534 1367187 1342850 1319760 1297424 1275985 1255117 1233797 1211687 1189736
61630 1189736 1168836 1148915 1129846 1112039 1095485 1079382 1063480 1048616 1035237 1022624 1010364
61619 1010364 999141 989162 979463 970032 962777 958514 954631 948161 940187 934679 933572 935452 938706 943229
61605 943229 948808 954495 960475 968417 978746 989090 996482 999927 999908 996545 989478 979066 966844 955022
61591 955022 945718 939978 937148 935653 934604 934150 934440 935102 935857 936752 937607 938099 938632 940277 943508 947607
61575 947607 951487 954450 956165 956774 957224 958614 960972 963529 966362 970702 977098 984189 989952 993582 995467
61560 995467 995775 993774 988503 979785 968594 956391 943945 930905 916687 901529 886319 871811
61548 871811 858534 846998 837220 828444 820146 812937 807537 803289 798901 794353 790811 788845 788244 789548
61534 789548 793959 801208 809126 816181 823248 832035 842878 854977 867806 881310 895482 910650 927510
61521 927510 945948 964481 981739 998090 1015021 1033413 1053299 1074844 1098557 1124565 1152323
61510 1152323 1180942 1209346 1236518 1262324 1287887 1314372 1341452 1367659 1392305 1416410 1441512
61499 1441512 1468094 1495548 1523233 1550912 1578033 1603090 1624211 1640368 1651728 1658934 1662606 1663574
61487 1663574 1662809 1660662 1656789 1651382 1645744 1640829 1635859 1629478 1621795 1614007 1606261 1597435 1587233 1577121
61473 1577121 1568748 1562584 1558558 1556894 1557665 1560585 1566001 1575234 1589140 1607118 1628290 1652972 1682099
61460 1682099 1715816 1753654 1795808 1843310 1897030 1957228 2024058 2097993 2179758 2270258 2370454
61449 2370454 2481004 2602072 2733620 2875629 3027839 3189698 3360828 3540960 3728720
61440 3728720 3920593 4111595 4296951 4472678 4634552 4777031 4893822 4979927 5033404 5055162
61430 5055162 5047147 5011146 4949518 4866419 4767417 4657892 4542271 4424441 4307849 4194997
61420 4194997 4087643 3987730 3897329 3817300 3746730 3684203 3629206 3582050 3542966 3511707 3487507
61409 3487507 3468999 3454621 3443601 3436407 3433996 3436854 3444846 3457499 3474065 3493614 3515460 3539455
61397 3539455 3565851 3595018 3627154 3661853 3697948 3734192 3770212 3806731 3845163 3887203 3934081
61386 3934081 3985215 4037922 4089440 4139146 4187840 4235115 4278834 4317321 4350643 4379168 4402146
61375 4402146 4418580 4428617 4433210 4433083 4428655 4420337 4408156 4391656 4370922 4347382 4322947 4298696
61363 4298696 4274819 4251422 4228752 4206821 4185222 4163284 4140373 4116428 4092264 4068910 4046595
61352 4046595 4025040 4004806 3987530 3974386 3964820 3957018 3949059 3939508 3927722 3914083 3899536 3884744
61340 3884744 3870227 3857199 3847403 3841942 3841256 3846401 3859155 3880425 3909676 3946716 3993129 4051252
61328 4051252 4122516 4207490 4306731 4420637 4548972 4691291 4847436 5016949 5198216 5388535
61318 5388535 5584572 5782452 5977744 6165413 6339290 6491951 6616555 6709361 6769601 6796989
61308 6796989 6790970 6752882 6686845 6596929 6484534 6350006 6195985 6027652 5850020 5666180
61298 5666180 5477947 5287264 5097038 4911128 4733097 4564417 4404377 4252157 4108334
61289 4108334 3974153 3850494 3738164 3637844 3548698 3468299 3395241 3330863 3277083 3233487
61279 3233487 3198087 3170180 3150742 3140485 3139122 3146197 3160999 3181820 3206834 3235811 3269645 3308074
61267 3308074 3348960 3389762 3428512 3463464 3493175 3517328 3536576 3551428 3562157 3569729 3575598 3580270
61255 3580270 3582959 3583049 3581214 3578815 3576766 3575061 3572859 3568910 3562443 3553867 3544417 3535217 3526782 3518776
61241 3518776 3509739 3497604 3481237 3461142 3438238 3412698 3384851 3356406 3329523 3304936 3282131
61230 3282131 3261049 3242556 3227455 3216137 3209026 3206214 3206588 3208263 3209860 3210586 3209291 3204518 3195399
61217 3195399 3181571 3162394 3137539 3108564 3078852 3051536 3027916 3007784 2990550 2976055 2964994
61206 2964994 2958680 2957928 2962471 2972032 2987441 3009810 3039125 3074698 3116612 3165438 3220880 3282175
61194 3282175 3349859 3425688 3510472 3603110 3701945 3805759 3912904 4020481 4124947 4222830
61184 4222830 4310502 4384063 4439914 4475020 4486696 4473182 4434794 4373859 4293287 4195886 4085091
61173 4085091 3965192 3840155 3712759 3585348 3460831 3342418 3232628 3132838 3043426 2964021
61163 2964021 2893791 2831686 2776450 2726577 2680572 2637324 2596332 2557915 2523154 2492837 2466208
61152 2466208 2441660 2419128 2400672 2387752 2378947 2371679 2365313 2360967 2358766 2357096 2354505 2350731 2345617
61139 2345617 2338512 2329188 2318177 2305827 2292069 2277502 2263677 2251697 2241086 2230269 2217668 2202367
61127 2202367 2184573 2165665 2147248 2130073 2114107 2099181 2084960 2070906 2057291 2045789 2038038
61116 2038038 2033953 2032424 2033006 2035543 2038698 2040509 2040098 2037190 2030262 2017099 1997312 1972520 1943955
61103 1943955 1911830 1877332 1843009 1810237 1778015 1745207 1712373 1680470 1649312 1618618 1589406
61092 1589406 1563048 1539729 1518794 1499859 1482763 1467344 1454175 1444714 1439746 1438244 1438597 1440467
61080 1440467 1444722 1452064 1462374 1475079 1489673 1506201 1525387 1547722 1572292 1597267 1621668 1645765
61068 1645765 1669418 1691130 1709132 1722457 1730376 1731716 1725522 1711923 1691929 1666953 1638859 1609772
61056 1609772 1581383 1554660 1530060 1507289 1485169 1462965 1441740 1423090 1406521 1389604 1370996
61045 1370996 1351746 1333317 1316158 1300861 1288626 1279220 1270075 1259128 1247461 1237577 1230017 1223461
61033 1223461 1217570 1213863 1213538 1215812 1218875 1221789 1225141 1230208 1237697 1247187 1257804 1269053 1280370
61020 1280370 1289947 1294979 1293608 1286202 1274722 1261577 1249049 1238597 1229937 1221387 1211650 1200938 1190370
61007 1190370 1180960 1173223 1166890 1160791 1153885 1146670 1140883 1137767 1137360 1139140 1142243 1145248 1147216 1149047
60993 1149047 1152372 1157116 1161828 1166593 1173566 1183953 1196190 1208099 1219314 1230621 1242281 1254097
60981 1254097 1266004 1277612 1288087 1297242 1305875 1314519 1322989 1331535 1341059 1351621 1362055 1371625 1380739
60968 1380739 1389653 1398113 1406643 1416192 1425732 1432204 1433894 1432066 1428483 1423483 1417766 1413606 1412291 1412130
60954 1412130 1410833 1408426 1406205 1404661 1404328 1406892 1413155 1421304 1429563 1439399 1453678 1472529 1493403
60941 1493403 1514709 1537158 1561838 1588980 1618531 1650371 1684088 1719800 1758767 1802095 1849531
60930 1849531 1900678 1956319 2017008 2081261 2146927 2213768 2283116 2355453 2429761 2504779 2579671
60919 2579671 2653908 2727590 2801391 2875494 2949491 3023898 3100397 3179806 3261437 3345428 3433912
60908 3433912 3528879 3631011 3741838 3864507 4000517 4148089 4305926 4476204 4661483 4861130
60898 4861130 5073658 5300435 5544157 5805923 6087136 6392167 6725254 7085984 7471011
60889 7471011 7878715 8309285 8762882 9242169 9755078 10310954 10915438 11572885 12291128
60880 12291128 13078640 13939024 14874153 15891826 17006156 18234573 19602926 21151463
60872 21151463 22925821 24960885 27280803 29912957 32891243 36247889 40019742 44268685
60864 44268685 49081261 54542159 60721816 67676346 75375630 83525647 91440581 98192401
60856 98192401 103037244 105802384 106909445 107057689 106891577 106880957 107314533 108200569 109110227
60847 109110227 109223456 107695892 104109239 98647006 91900811 84534984 77071100 69847412
60839 69847412 63055082 56777702 51033059 45817555 41128017 36954414 33270084 30037136
60831 30037136 27215013 24759628 22620675 20746484 19091319 17617868 16297000 15107736
60823 15107736 14034926 13064921 12184572 11383926 10656394 9995239 9392560 8842293 8341032
60814 8341032 7884588 7466091 7078433 6716309 6375255 6051540 5744362 5455805 5187131
60805 5187131 4936705 4702320 4483336 4279355 4088801 3910317 3744052 3590280 3447963
60796 3447963 3315695 3192839 3078928 2973133 2875031 2784602 2700789 2621512 2545909 2475197
60786 2475197 2410428 2350689 2294382 2240972 2190398 2142010 2095257 2050518 2008062 1966926 1925935
60775 1925935 1885292 1846197 1809223 1773886 1739435 1705468 1672051 1639903 1610273 1584066 1561011
60764 1561011 1539882 1519572 1500085 1482595 1468270 1456982 1447657 1440087 1435284 1433276 1431761 1428552
60752 1428552 1424659 1423171 1425412 1430063 1435950 1443488 1452833 1462650 1471842 1481039 1491250 1502089 1512274
60739 1512274 1520954 1527590 1531384 1531800 1529123 1523835 1515972 1505736 1494045 1481785 1469015 1455468 1441308
60726 1441308 1426825 1411881 1396254 1380232 1364465 1349520 1335793 1323411 1312079 1301514 1292077
60715 1292077 1284328 1277911 1271742 1265513 1260118 1256223 1253201 1249800 1245139 1238911 1231661 1225285 1222059 1222341
60701 1222341 1224034 1225141 1226173 1229272 1235579 1244232 1253418 1261710 1268778 1275442 1282730 1290558 1297923 1304685
60687 1304685 1312205 1321484 1331490 1340210 1346545 1350176 1350368 1346358 1338592 1328165 1315021 1298120 1277639
60674 1277639 1255655 1234001 1212406 1189638 1165764 1142188 1119622 1097106 1073484 1049163 1025693
60663 1025693 1003899 983393 964204 947900 935990 927541 919561 910045 899709 890275 882051 874048
60651 874048 865819 857958 850852 843914 836399 828393 820584 813339 806291 798804 790712 782546 775016 768419
60637 768419 762689 757842 753949 750717 747739 745349 744573 745728 747568 748453 748138 747895 749049 752038 756773
60622 756773 763157 770942 779461 787915 795841 803257 810445 817695 825174 833065 841782 851852 863420 876016
60608 876016 889041 902401 916481 931633 947866 964925 982440 1000140 1018175 1037206 1057906
60597 1057906 1080260 1103474 1126599 1149256 1171871 1195206 1219465 1243816 1266972 1288296 1308073
60586 1308073 1326708 1344109 1359959 1373842 1384573 1390099 1389100 1382581 1372962 1361603 1348028 1331692
60574 1331692 1313426 1294616 1275794 1256861 1238168 1220544 1204464 1189818 1176285 1163266 1149838
60563 1149838 1135737 1122377 1111842 1104550 1098706 1092428 1085666 1079583 1074960 1071962 1070795 1071494 1073339
60550 1073339 1075548 1078579 1083813 1091769 1101415 1111546 1122173 1134271 1148753 1166045 1186064 1208042
60538 1208042 1230738 1253336 1276027 1299433 1323767 1348857 1374702 1401526 1429352 1457742 1485882
60527 1485882 1512814 1537816 1560704 1581482 1599528 1613547 1622543 1626475 1625591 1619537 1607587 1589561
60515 1589561 1566181 1538729 1508604 1476844 1443713 1409104 1373743 1339531 1308095 1279414 1252552
60504 1252552 1227347 1204462 1183936 1164838 1146647 1130167 1116531 1105793 1096829 1088267 1079322 1070304
60492 1070304 1062647 1057991 1056775 1057925 1060162 1063233 1067588 1073299 1079927 1087253 1095512 1104719 1114283 1123553
60478 1123553 1132635 1142416 1153771 1166877 1181349 1196920 1213817 1232430 1252885 1275246 1300137 1328831
60466 1328831 1362436 1401052 1444000 1491079 1543428 1602861 1670269 1745052 1826420 1914975 2012410
60455 2012410 2119792 2236867 2363237 2499268 2644889 2797707 2952841 3104391 3246549
60446 3246549 3373844 3481906 3568897 3635839 3685105 3719034 3740487 3754064 3765252 3777453 3790048
60435 3790048 3799669 3803073 3798376 3784218 3759327 3723802 3680138 3632047 3582487 3533614 3488310 3450457
60423 3450457 3423365 3408819 3408026 3422574 3453820 3502077 3567100 3648751 3746599 3859530 3986489
60412 3986489 4126819 4278722 4437831 4598625 4757420 4913310 5066753 5218846 5372447
60403 5372447 5532878 5706874 5901515 6124535 6384634 6690287 7048052 7462304 7936410
60394 7936410 8473727 9077155 9747608 10482704 11276696 12120547 12999598 13888645 14748689
60385 14748689 15529923 16179993 16652247 16911062 16935695 16723810 16292537 15675075 14914289
60376 14914289 14056250 13144836 12217594 11303629 10423820 9592054 8816278 8099839 7443485
60367 7443485 6846856 6308401 5824778 5391284 5003102 4656016 4346170 4069572 3821900
60358 3821900 3598991 3397880 3217273 3056301 2912623 2782481 2662875 2552890 2452470
60349 2452470 2360876 2277110 2200852 2131661 2067785 2007254 1950201 1898797 1854486 1816213 1781707
60338 1781707 1749614 1719862 1692696 1668126 1645996 1625964 1607400 1589568 1571909 1554237 1536897
60327 1536897 1520588 1505506 1490675 1474814 1458047 1441956 1427477 1413393 1397670 1379805 1361042
60316 1361042 1342518 1324123 1305335 1286277 1267560 1249568 1232462 1216600 1202477 1190206 1179358
60305 1179358 1169497 1160769 1153813 1149007 1145961 1143973 1142893 1143131 1144717 1146829 1148576 1149837 1150740 1150693 1148725
60290 1148725 1144800 1140022 1135280 1130228 1123912 1115910 1106593 1096665 1086848 1077656 1069131 1060976 1053171 1046282
60276 1046282 1041059 1038042 1037522 1039304 1042347 1045349 1048122 1051854 1057581 1064840 1072274 1079034 1085190 1091350
60262 1091350 1098343 1106604 1115282 1122787 1128935 1135712 1144808 1155244 1164803 1173234 1182456 1193866 1207112
60249 1207112 1221445 1236444 1250830 1262150 1268506 1269892 1267552 1263008 1257778 1252624 1246594 1238061 1227293
60236 1227293 1216794 1208707 1203325 1200728 1202197 1208800 1219917 1234425 1252223 1273350 1296752 1321362
60224 1321362 1347411 1374991 1402037 1425561 1444640 1460642 1474646 1486015 1493495 1496492 1495225 1490637
60212 1490637 1484152 1476663 1468012 1458349 1449500 1443750 1441538 1441626 1443365 1447436 1454373 1463769 1475194 1488767
60198 1488767 1504664 1523164 1545374 1572749 1605571 1642843 1683964 1729518 1780160 1835751 1896003
60187 1896003 1961073 2031047 2105539 2184226 2267190 2354429 2445557 2540086 2637348 2736058 2834659
60176 2834659 2932218 3028232 3121491 3209844 3291219 3364194 3427741 3481435 3526033 3562733 3591521
60165 3591521 3611082 3620633 3621030 3613975 3601205 3584780 3567015 3549428 3532409 3516294 3502071 3490930
60153 3490930 3484131 3483711 3492121 3510478 3538058 3574156 3619545 3675322 3741059 3814902 3894945 3979861
60141 3979861 4068761 4161026 4255610 4349881 4439907 4522657 4597264 4663373 4719135 4762013 4791058
60130 4791058 4807040 4810443 4800647 4777461 4742551 4698800 4648678 4593554 4534392 4472860 4411717 4353962
60118 4353962 4301551 4255265 4216040 4185904 4167004 4159991 4164108 4178871 4204953 4243064 4292528 4351390
60106 4351390 4417670 4489897 4566453 4645050 4723350 4799856 4873698 4943829 5009289 5070463 5129295
60095 5129295 5187628 5245694 5302613 5357875 5411900 5465795 5521326 5580440 5643667 5708986 5773109
60084 5773109 5833931 5891264 5945716 5998112 6050182 6104871 6165712 6236313 6320310 6420874 6540113
60073 6540113 6679395 6839839 7021551 7222595 7439891 7671279 7915798 8171994 8436985
60064 8436985 8707027 8977520 9242131 9493369 9724910 9932724 10113646 10263926 10379813
60055 10379813 10458773 10499549 10501618 10465039 10390474 10279346 10134612 9961243 9765045 9551080
60045 9551080 9324231 9090868 8858178 8631466 8413527 8206922 8015113 7840725 7684397
60036 7684397 7546430 7428326 7331733 7257120 7204491 7174239 7166144 7178400 7208441 7253656 7310452
60025 7310452 7373842 7439076 7502656 7560924 7609264 7644203 7665140 7672581 7665882 7644439 7609898 7564900
60013 7564900 7510131 7444607 7368662 7284780 7195644 7103338 7010552 6920630 6835874 6757327 6686759
60002 6686759 6627436 6582191 6551775 6535712 6533516 6544036 6564274 6590177 6618721 6648793 6680124
59991 6680124 6711939 6742988 6772788 6802417 6833749 6867964 6905052 6944433 6985168 7025333 7061884
59980 7061884 7091657 7112138 7121222 7117037 7098440 7065120 7016941 6953846 6876673 6787095 6686339
59969 6686339 6574960 6454494 6328309 6200101 6072369 5946972 5826046 5711429 5604173
59960 5604173 5505558 5417549 5341212 5275885 5221289 5179383 5152382 5139705 5138875 5149103 5172124 5209443
59948 5209443 5260518 5324014 5399436 5486745 5585156 5692782 5807056 5925303 6044999 6163128
59938 6163128 6275114 6375298 6459321 6525458 6573061 6600772 6607373 6593485 6560941 6511037 6444734
59927 6444734 6363995 6271559 6169841 6061548 5950942 5842916 5740993 5647392 5564492 5494554
59917 5494554 5438270 5395338 5366415 5352974 5355319 5372363 5403310 5447875 5504711 5571398 5646257
59906 5646257 5728618 5817000 5908606 6001180 6093998 6186552 6277420 6364723 6446469 6520247 6584070
59895 6584070 6637932 6683346 6721201 6751565 6775816 6797218 6818796 6842174 6869151 6902714 6945588
59884 6945588 6999304 7065829 7148885 7252385 7378497 7528216 7702913 7904034 8131728 8384602
59874 8384602 8660355 8955876 9266982 9588383 9913386 10233488 10538947 10819842 11065791
59865 11065791 11265117 11406629 11483619 11495381 11444468 11333992 11168505 10955727 10705503 10427405
59855 10427405 10130264 9822926 9513744 9209439 8915443 8636917 8378373 8142626 7931068
59846 7931068 7744702 7584142 7449183 7339666 7256637 7201635 7174784 7174323 7197870 7243227 7307996
59835 7307996 7389361 7484533 7590596 7703471 7817431 7925986 8022990 8102660 8158987 8185886
59825 8185886 8178516 8134743 8055359 7943048 7801323 7634234 7446255 7241693 7024306 6797890
59815 6797890 6566853 6335451 6106587 5882112 5664322 5456437 5261505 5081422 4916941
59806 4916941 4767846 4633048 4511551 4403786 4311357 4234980 4173168 4123213 4083042 4051678
59796 4051678 4028234 4010828 3996637 3983318 3970683 3960668 3955177 3954347 3957419 3964594 3976833 3994126
59784 3994126 4015235 4039098 4065120 4091709 4115535 4132671 4139807 4134430 4115051 4081828 4036409 3980904
59772 3980904 3917340 3847557 3772504 3692027 3606726 3519817 3435582 3356061 3281050 3211378 3149832
59761 3149832 3098046 3054633 3017782 2988057 2967185 2955532 2952418 2957773 2971666 2992945 3020131 3053342
59749 3053342 3093691 3140741 3191791 3243957 3296040 3348067 3399522 3448456 3492450 3530699 3564971
59738 3564971 3597828 3629946 3660013 3687320 3713308 3740243 3769568 3802241 3839616 3883220 3934440
59727 3934440 3995007 4066929 4151467 4249191 4361521 4490903 4638763 4804583 4988056 5190867
59717 5190867 5415204 5661528 5928844 6215772 6519493 6833791 7148627 7450151 7719912
59708 7719912 7936277 8080633 8144352 8130321 8049159 7915205 7744448 7552591 7352737 7154223
59698 7154223 6962602 6779734 6605018 6438582 6283538 6144299 6023392 5921439 5839579 5779793
59688 5779793 5742644 5726590 5730104 5753083 5795715 5857342 5937128 6034802 6150014 6281799 6429375
59677 6429375 6592927 6773231 6970988 7186844 7421636 7676414 7952674 8252594 8578494
59668 8578494 8931873 9313246 9722785 10160608 10626554 11120029 11639600 12181912 12741212
59659 12741212 13310712 13884224 14455791 15018406 15564746 16089790 16592164 17073182 17535868
59650 17535868 17985259 18428443 18873130 19325980 19791863 20273392 20770070 21277821 21789598
59641 21789598 22296454 22788267 23254098 23682347 24061044 24379039 24628201 24805104 24910750
59632 24910750 24949383 24928221 24857767 24750966 24621258 24481474 24344055 24221149 24123951 24062272
59622 24062272 24044706 24078599 24169692 24322318 24540113 24826093 25181764 25606378 26097001 26648896
59612 26648896 27255512 27907868 28592998 29292026 29979655 30626283 31201128 31673768 32014312
59603 32014312 32195116 32195412 32006379 31633069 31092108 30407373 29606714 28720657 27781171 26818553
59593 26818553 25857760 24917379 24011497 23150899 22341281 21580916 20860973 20167983 19486162
59584 19486162 18799585 18095510 17367823 16617998 15853333 15084342 14322547 13578625 12861339
59575 12861339 12177573 11532471 10928843 10367029 9846208 9365660 8924219 8519316 8147924
59566 8147924 7808455 7500643 7223457 6973923 6748116 6542674 6355410 6185241 6031641
59557 6031641 5893636 5769265 5656344 5553426 5459511 5373270 5293275 5218389 5146897 5075636
59547 5075636 5001332 4922845 4841023 4756370 4668243 4576634 4483388 4390781 4299666 4209899 4122091
59536 4122091 4038007 3959246 3886102 3818049 3755093 3698207 3648078 3603746 3563325 3526242 3493944
59525 3493944 3467907 3447890 3432981 3423371 3419792 3421656 3427295 3435976 3448405 3465098 3485543 3509225
59513 3509225 3536236 3566388 3598706 3632456 3667846 3705162 3744038 3784410 3827691 3875998 3930336
59502 3930336 3990265 4055507 4127294 4207833 4298717 4400265 4512289 4634861 4768107 4911956
59492 4911956 5066855 5234299 5415561 5610020 5815886 6032513 6260449 6498775 6744178
59483 6744178 6993686 7246715 7502827 7758633 8008807 8249449 8478743 8694966 8896064
59474 8896064 9081265 9251176 9406021 9545584 9671419 9787255 9895794 9995725 10082783 10153710
59464 10153710 10209383 10255166 10298679 10346466 10401873 10465581 10537121 10614806 10694443 10769380 10832130
59453 10832130 10875491 10892488 10876657 10822851 10727289 10587086 10401050 10171338 9903476 9604283
59443 9604283 9280169 8937260 8582159 8222265 7865653 7520271 7192075 6883573 6594763
59434 6594763 6325439 6076137 5847475 5639820 5453592 5288761 5144061 5017665 4908718
59425 4908718 4817289 4743004 4684756 4641687 4613347 4599126 4598797 4613351 4643739 4688702 4745562 4813503
59413 4813503 4894524 4990700 5102082 5227826 5367652 5521058 5686328 5861403 6044718 6234027
59403 6234027 6425146 6612851 6792494 6959987 7110738 7239308 7339640 7405374 7431059 7414354
59393 7414354 7356980 7263000 7136372 6980414 6798958 6597176 6381166 6156822 5928817 5700608
59383 5700608 5475461 5257041 5048372 4850656 4664032 4489247 4327564 4179212 4043204
59374 4043204 3918792 3805929 3704218 3612626 3530535 3457904 3394151 3338078 3289232 3248183 3215075
59363 3215075 3188944 3168736 3153872 3143671 3137603 3136399 3141443 3152533 3167666 3185516 3206728 3232411
59351 3232411 3263094 3299778 3343947 3395501 3452554 3514585 3583687 3660666 3741459 3819870 3893292
59340 3893292 3963955 4035538 4110944 4193115 4285416 4390278 4508787 4641986 4791096 4955602
59330 4955602 5132074 5316006 5505043 5700510 5906437 6127538 6367990 6631417 6920922
59321 6920922 7238288 7583391 7955375 8354409 8781324 9235347 9713152 10210072 10720659
59312 10720659 11237434 11750730 12251203 12731943 13187677 13613467 14005734 14363827 14689115
59303 14689115 14982825 15245614 15478489 15682734 15859081 16007685 16128333 16219696 16278959 16303351
59293 16303351 16291838 16244791 16163062 16048945 15907559 15745571 15568416 15379718 15183089 14982686
59283 14982686 14781341 14579191 14374788 14167094 13956140 13742399 13526106 13307148 13085478
59274 13085478 12861555 12635993 12408621 12178492 11945322 11710321 11474855 11238600 10999951
59265 10999951 10758225 10514681 10271331 10029411 9789362 9551983 9319226 9093608 8876682
59256 8876682 8668378 8468426 8278378 8101313 7939241 7791548 7656539 7533735 7423958
59247 7423958 7327817 7245098 7175445 7118732 7074554 7041770 7018807 7004525 6998893 7002709 7016277 7038581
59235 7038581 7068294 7105266 7150161 7202929 7262970 7330769 7407865 7494725 7589958 7692090 7800668
59224 7800668 7914936 8032923 8152769 8273473 8393105 8507735 8613788 8710518 8798609 8877153
59214 8877153 8943561 8995768 9032817 9053695 9057195 9042766 9009909 8956748 8880632 8780513 8657840
59203 8657840 8515081 8354224 8176724 7984193 7779204 7565900 7349291 7133242 6919669
59194 6919669 6710420 6509023 6319265 6142709 5979079 5828639 5692545 5571018 5463037
59185 5463037 5368207 5287450 5221231 5168343 5127252 5097909 5081612 5079577 5092135 5118996 5160045
59174 5160045 5216099 5288984 5380718 5492687 5625718 5780508 5957681 6157940 6382570 6633087
59164 6633087 6909730 7210965 7535104 7881360 8247817 8628980 9016880 9404151 9783906
59155 9783906 10145762 10473446 10747656 10951750 11075774 11117410 11080793 10974280 10808283 10594334
59145 10594334 10344935 10072562 9787739 9498256 9210555 8931288 8666663 8420191 8191867
59136 8191867 7980345 7786016 7611499 7459080 7328492 7217713 7125137 7049883 6990652 6945947
59126 6945947 6915557 6900311 6899933 6912430 6935923 6969427 7011118 7057548 7105849 7155344 7205548 7253631
59114 7253631 7295360 7327752 7349414 7359202 7356242 7340723 7312977 7271977 7216198 7145958 7063791 6972592
59102 6972592 6874374 6770575 6662577 6552116 6441963 6335702 6235952 6143257 6057503 5979551
59092 5979551 5910396 5849782 5797358 5754540 5723308 5703328 5691908 5686898 5688246 5696812 5713190 5737920
59080 5737920 5771456 5813499 5863167 5919957 5983826 6054514 6131572 6214738 6303451 6396462 6492861
59069 6492861 6592724 6695494 6798406 6898066 6993154 7084096 7170451 7250265 7321650 7383380 7434228
59058 7434228 7473576 7502614 7523258 7536011 7540688 7539021 7534437 7529067 7523196 7518037 7516708 7521290 7530710
59045 7530710 7542638 7555955 7570143 7583432 7592756 7594713 7585686 7561809 7519673 7456530 7369480 7255558
59033 7255558 7113443 6944569 6752186 6539975 6311741 6071435 5822887 5570123 5317935
59024 5317935 5070974 4831877 4601265 4379942 4169953 3973082 3789507 3618712 3460768
59015 3460768 3315844 3183142 3061173 2948779 2845401 2750611 2663692 2583451 2508494 2438063
59005 2438063 2372343 2311432 2254446 2200532 2150242 2104641 2063361 2024957 1989090 1956696 1927944
58994 1927944 1901758 1877712 1856546 1838036 1820156 1801599 1783803 1769038 1757371 1746867 1736260
58983 1736260 1726202 1718220 1713523 1712870 1716767 1725430 1738679 1755853 1775890 1797832 1821306 1846276
58971 1846276 1872582 1900237 1930067 1963288 2000292 2040178 2081244 2121376 2158312 2190363 2216770
58960 2216770 2236779 2248895 2251987 2246741 2234999 2218222 2197906 2176968 2158797 2144683 2133678 2125079
58948 2125079 2119579 2117747 2119096 2123246 2130463 2140238 2150506 2159024 2164588 2166307 2162852 2153340 2138223
58935 2138223 2118604 2095108 2067927 2037506 2004879 1971638 1939500 1909446 1881547 1856179 1834700
58924 1834700 1817845 1804165 1791662 1780657 1773340 1770670 1771604 1775460 1783034 1794893 1810352 1828705
58912 1828705 1849808 1872887 1896603 1921111 1948404 1979671 2013856 2049771 2087925 2128910 2171295
58901 2171295 2212768 2252600 2291670 2330683 2369691 2409166 2450376 2494426 2541244 2589677 2638758
58890 2638758 2689209 2743404 2803326 2868982 2939429 3014507 3094319 3177815 3263782 3352975 3447468
58879 3447468 3548078 3654343 3766821 3887163 4015809 4152069 4297067 4454054 4624927
58870 4624927 4808592 5003877 5211858 5434046 5670355 5920446 6185450 6466930 6765715
58861 6765715 7083261 7422661 7786638 8175706 8589714 9030043 9498740 9996267 10521183
58852 10521183 11070930 11641555 12227386 12821769 13416972 14002391 14564196 15087979 15560797
58843 15560797 15969827 16301023 16541259 16681464 16716852 16645802 16470755 16199766 15845276 15420907
58833 15420907 14939757 14414728 13858837 13284822 12704620 12128577 11564473 11017717 10492549
58824 10492549 9992280 9518298 9070300 8648065 8252066 7882086 7536606 7213943 6912655
58815 6912655 6630610 6365446 6116504 5884584 5669248 5468378 5281168 5109401 4954507
58806 4954507 4815060 4688244 4571940 4464432 4364235 4271645 4188336 4113830 4044318 3976675
58796 3976675 3911668 3851486 3796294 3745590 3701151 3665845 3640401 3623444 3613666 3609956 3610589 3614643
58784 3614643 3623707 3640399 3665845 3700006 3743301 3796166 3858088 3928913 4010075 4102786 4206025
58773 4206025 4318049 4438914 4569889 4711657 4864969 5031887 5214305 5412088 5624333
58764 5624333 5851355 6093785 6351153 6623297 6911784 7217969 7541233 7881464 8241765
58755 8241765 8626022 9035042 9467557 9923567 10403676 10906166 11427724 11965794 12516514
58746 12516514 13070637 13614840 14136890 14626318 15070215 15452165 15756481 15971258 16087513
58737 16087513 16099054 16004979 15810422 15524048 15156371 14720231 14229970 13698907 13139008 12562714
58727 12562714 11982368 11407107 10842592 10294300 9768612 9269705 8797668 8351028 7929460
58718 7929460 7533197 7161793 6814798 6492298 6193717 5917207 5660965 5423832 5204040
58709 5204040 4998911 4806696 4627376 4460708 4304727 4157239 4017770 3886951 3764558
58700 3764558 3649153 3539448 3435533 3338904 3251296 3173042 3102549 3037805 2978171 2924241 2876393
58689 2876393 2834255 2797258 2764912 2736935 2713791 2696568 2685457 2678986 2675550 2674914 2677189 2681294
58677 2681294 2685635 2689490 2692440 2693419 2691743 2687941 2681779 2670422 2650640 2622199 2587145 2546473 2499767
58664 2499767 2447607 2391886 2333615 2272432 2208363 2142282 2074754 2006299 1938755 1874562 1814648
58653 1814648 1758575 1706413 1658724 1615055 1574515 1537694 1506012 1479263 1455772 1434911 1417457
58642 1417457 1403454 1391735 1381550 1372737 1364250 1354524 1343398 1331800 1319648 1306119 1292030 1279742
58630 1279742 1270390 1263150 1257343 1253223 1250449 1247976 1245833 1245074 1245467 1245009 1242098 1236488 1228023 1216403
58616 1216403 1202643 1188932 1176581 1165565 1156129 1149003 1143869 1139257 1134237 1128816 1122996 1117176 1113009
58603 1113009 1111753 1112089 1111801 1111172 1112079 1113979 1113805 1110217 1105090 1100292 1095865 1092150 1090765 1092113 1094312
58588 1094312 1096020 1098478 1103645 1112056 1123426 1137514 1153510 1170307 1188366 1209724 1235399 1264266
58576 1264266 1294894 1326766 1359287 1391587 1424086 1458617 1496344 1537015 1580539 1627589 1678417
58565 1678417 1733007 1792754 1860071 1935872 2019078 2108698 2204666 2306931 2415983 2534197 2664120
58554 2664120 2805301 2955240 3113298 3280506 3454994 3630650 3801054 3961846 4108236
58545 4108236 4233333 4330694 4396739 4429844 4429435 4397022 4336073 4250032 4142355 4018567 3885495
58534 3885495 3747807 3607751 3468481 3334466 3207903 3088014 2974818 2870430 2775705 2689049
58524 2689049 2609904 2540008 2479758 2426737 2379399 2338599 2303576 2270239 2235982 2202693 2172178
58513 2172178 2141940 2108897 2074399 2041819 2011278 1980421 1948818 1918027 1888225 1857972 1826671
58502 1826671 1794626 1761094 1724528 1684391 1641092 1594927 1546662 1498325 1451747 1407011 1363488
58491 1363488 1321424 1281479 1243979 1209656 1179717 1154001 1130467 1107545 1085647 1065577 1047184
58480 1047184 1030330 1015191 1000741 985252 969411 956482 947961 941371 933926 926036 919590 915038
58468 915038 911970 910417 909738 908245 905628 903778 903696 903837 903019 902522 903453 904500 904320 903778 903769 903126 900909
58451 900909 898612 897884 898089 898068 898124 898219 896656 892838 889094 887395 886545 884949 883689 884170 885075 884829 885150
58434 885150 889021 896533 905496 914827 924720 934625 943442 950635 955407 956292 953505 949952 947965 946676
58420 946676 944212 940307 934964 927087 916776 906618 898391 890725 882256 874445 868758 863773 857976 852862
58406 852862 850201 848576 845883 843015 841855 841774 841456 842085 845313 849816 853190 855634 858635 861801 864203
58391 864203 866965 871226 875220 876724 876868 878341 881256 883857 885843 888134 890992 895071 902371 913280
58377 913280 924733 934065 942301 950779 957402 959875 959933 960339 960147 957037 952018 947497 942819 936187 929057
58362 929057 924190 921198 918447 917442 920622 926505 931881 937297 945476 955638 964517 972020 980888 991469
58348 991469 1001711 1011760 1023789 1037542 1050356 1061225 1070754 1077899 1081113 1082100 1084116 1087136 1088787
58335 1088787 1089029 1089400 1088580 1083688 1075728 1069173 1066355 1066399 1069127 1075381 1083861 1092203 1101217 1113928 1130637
58320 1130637 1148756 1166747 1184116 1198476 1207406 1212850 1219131 1226839 1232893 1236048 1238017 1239758 1241167
58307 1241167 1243779 1249214 1255520 1259593 1262582 1268259 1276782 1285025 1292393 1301334 1312455 1324229 1337247
58294 1337247 1353763 1373006 1391648 1408785 1426075 1443464 1459294 1474012 1489155 1503342 1513838
58283 1513838 1521141 1527469 1532189 1533771 1534680 1538848 1545730 1552330 1559343 1569295 1580524 1589706 1598769 1612282
58269 1612282 1629356 1645381 1660567 1678971 1699973 1718917 1735897 1755666 1778687 1800651 1821388
58258 1821388 1845868 1875255 1905111 1933816 1964827 1999006 2032428 2063558 2095210 2127752 2157587
58247 2157587 2183961 2210117 2236304 2258900 2277916 2298065 2320989 2343610 2365332 2389460 2416445
58236 2416445 2443388 2471251 2504594 2543076 2581332 2618351 2658649 2703093 2747385 2790832 2837549
58225 2837549 2887499 2935761 2982468 3034020 3092482 3153245 3215135 3282965 3357879 3435154 3513981
58214 3513981 3599203 3691020 3783502 3875936 3974688 4080885 4187404 4291289 4397704 4508034
58204 4508034 4615963 4719720 4826649 4941069 5058990 5179282 5308289 5448696 5595631
58195 5595631 5748640 5915578 6099827 6295850 6502105 6725658 6969333 7227786 7501342
58186 7501342 7799515 8125136 8469423 8828539 9209756 9615062 10035010 10466228 10918659
58177 10918659 11397549 11895223 12409466 12952857 13534591 14150654 14801858 15503373 16265263
58168 16265263 17081120 17946324 18868656 19850063 20878573 21951134 23084627 24292462 25572226
58159 25572226 26928760 28384553 29951828 31619431 33384391 35271788 37307898 39502728
58151 39502728 41877208 44475290 47326317 50427883 53791111 57470414 61524448 65987205
58143 65987205 70909866 76394876 82561407 89526314 97456689 106587543 117140659 129279680
58135 129279680 143190476 159130008 177322249 197872988 220864495 246476533 275007028
58128 275007028 306985488 343314945 384664546 429687321 473407156 508012617 526365724
58121 526365724 525601540 507911497 478403808 442383458 403945238 365817588 329575717
58114 329575717 295902121 264979370 236857818 211556468 188998084 169022051 151459801
58107 151459801 136126301 122769551 111106061 100896637 91943816 84049342 77034688
58100 77034688 70785724 65227180 60267846 55811021 51796983 48189290 44933643 41971103
58092 41971103 39278153 36853896 34678020 32716105 30953287 29385264 27984868 26712290
58084 26712290 25550931 24500993 23545854 22657822 21831008 21076508 20389840 19753866 19169495
58075 19169495 18652589 18203070 17806330 17462541 17185044 16971229 16804349 16683775 16625133
58066 16625133 16631154 16691682 16812684 17014822 17300765 17653082 18066545 18552167 19107393 19716698
58056 19716698 20389086 21163943 22074996 23143736 24414627 25955958 27813071 30001553
58048 30001553 32561342 35571890 39091937 43128772 47687052 52798023 58499358 64901090
58040 64901090 72319678 81132940 91171254 101154825 108958501 112726210 111894232 107255107
58032 107255107 100206920 92008384 83526550 75303605 67631094 60598135 54193244 48406006
58024 48406006 43238385 38666763 34643803 31128520 28084295 25456846 23181458 21207455
58016 21207455 19495975 18001078 16674128 15483697 14414121 13447471 12562102 11745625
58008 11745625 10994037 10299525 9652309 9052818 8509105 8022623 7587122 7198959 6855736
57999 6855736 6545413 6249309 5957675 5672797 5396958 5128066 4867717 4622472 4394320
57990 4394320 4178572 3973018 3780642 3601699 3431856 3270358 3121737 2986920 2860523
57981 2860523 2739456 2626470 2522499 2423203 2326455 2236122 2154747 2079009 2005993 1937630 1875047
57970 1875047 1814364 1752294 1690896 1633039 1577957 1524848 1476076 1433033 1393020 1353676 1316476
57959 1316476 1282670 1249947 1216516 1184601 1156547 1131054 1106370 1083606 1063814 1045335 1027188
57948 1027188 1011653 1000303 990589 979427 967474 957149 949239 943857 941670 941709 940873 937925 934919
57935 934919 932534 927413 916485 900593 881486 858905 833550 809645 791303 778825 770793 766658
57923 766658 764847 761725 755463 748198 741955 735636 728434 722550 719421 716627 711860 706821 703928 702243
57909 702243 700198 699331 701506 704973 707056 708667 712637 719517 728323 739372 753059 767690 781614
57896 781614 795580 810025 822147 828879 830778 829822 825447 816087 802828 788206 772975 757110 742267
57883 742267 730127 719933 710627 703654 700612 699961 699223 698676 699664 700927 699915 696152 690104 680444 665912
57868 665912 648481 631234 614344 596329 577866 560954 545625 530912 517851 508074 500615 493678
57856 493678 488465 487555 490250 493270 495617 499224 505036 511823 518840 526636 535066 543048 550158 556281
57842 556281 560277 561281 560434 558991 555810 549276 540318 530545 518777 502955 484600 467700 453579
57829 453579 440264 426604 413608 401821 390623 380252 371585 363909 355691 347547 341659 338378 336156
57816 336156 334628 334854 336468 337393 336619 334898 332833 330714 329849 331468 334588 337552 341108 347132 354880
57801 354880 361680 366949 372219 377383 380462 381264 381790 382517 381614 378485 374935 372031 368744 364494 360186
57786 360186 355952 350751 345081 341282 340139 339888 339585 340882 345247 351994 360293 370725 383307 396100
57772 396100 407401 417784 428671 440204 451506 461790 470452 477199 482565 487146 490236 490535 488034
57759 488034 483628 477196 468027 456879 445453 433981 421603 408905 397456 386856 375198 362777
57747 362777 352442 345586 340594 336063 332788 331585 331695 332568 334897 338750 342823 346461 350256 353898
57733 353898 355857 356105 356595 358018 358771 358467 359713 364666 372238 380533 389662 399930 409328 415395 418290
57718 418290 419881 420861 420616 418876 415588 409924 401183 390236 378869 368110 358072 348720 340019 332057
57704 332057 325676 322210 322257 325659 332631 343288 355924 367898 378955 391582 407238 424378 441362
57691 441362 458924 477831 496013 510270 519722 525607 528621 528411 525206 520222 514536 508555 502198
57678 502198 494639 484416 470857 455255 440107 427409 417813 410649 404508 398480 393044 389176 386903
57665 386903 385701 385754 387254 389041 390044 391820 397179 406157 415955 425308 435961 448965 462512 475089
57651 475089 488135 503536 520660 537891 555312 573887 593629 614515 637851 664802 694724
57640 694724 726506 760299 796493 834445 873888 916296 963277 1014846 1070615 1131049 1195942
57629 1195942 1263280 1331505 1401503 1474581 1550118 1627446 1708745 1797665 1895738 2002055 2115658
57618 2115658 2236373 2363956 2497979 2637630 2780008 2919531 3050496 3169138 3271864
57609 3271864 3353385 3409074 3438435 3444597 3431827 3405381 3371870 3336684 3301806 3268353 3239540
57598 3239540 3217242 3195747 3162359 3105437 3020709 2910977 2782968 2644920 2504167 2365206
57588 2365206 2230592 2103296 1986628 1882256 1790290 1711080 1644859 1589784 1542670 1502031
57578 1502031 1468563 1442580 1423139 1410026 1404498 1407224 1417095 1432716 1453754 1480379 1512665 1551021
57566 1551021 1596257 1649009 1709861 1779567 1857969 1943229 2033660 2129776 2232836 2341886 2454244
57555 2454244 2568424 2684089 2798932 2907627 3004131 3083120 3139463 3169106 3171310 3147960 3100146
57544 3100146 3027684 2932784 2821698 2701329 2575819 2447476 2318939 2192738 2070013 1951316
57534 1951316 1837858 1730969 1631054 1537864 1450930 1369313 1292188 1220228 1155000 1096336 1041865
57523 1041865 990010 941774 898400 858927 821732 787144 756533 729550 704245 679719 656900
57512 656900 636486 617538 598734 580256 563747 550483 539847 529798 518999 508271 499499 493420
57500 493420 489274 486484 485483 486514 488652 490729 492639 495240 499436 505698 513976 523752 534577 546714
57486 546714 560710 576475 593512 612020 632779 655893 680745 707414 736990 769982 805558
57475 805558 842962 882787 926094 973069 1023182 1076000 1131262 1188888 1249635 1315150 1386678
57464 1386678 1463983 1545869 1631187 1718910 1807739 1896139 1982337 2063759 2136699 2196810 2239853
57453 2239853 2262374 2262725 2241824 2202461 2147590 2079659 2001311 1915755 1826097 1735002 1645095 1558806
57441 1558806 1477418 1400860 1328757 1261260 1198895 1142269 1091920 1047661 1008123 971835 938827
57430 938827 910246 886411 866248 848799 834272 823249 815609 810375 805969 800801 794610 789071 786087
57417 786087 785727 786999 790152 796475 806054 817771 831827 850389 875317 907046 946146 993923 1050600
57404 1050600 1114681 1184957 1261310 1342614 1425819 1508255 1589031 1666791 1737861 1798089 1844769
57393 1844769 1875246 1885649 1873449 1840186 1789590 1724005 1644761 1555058 1459878 1363106 1266607
57382 1266607 1171879 1080627 993551 910287 830931 756513 687913 625357 568847 518031 471816
57371 471816 429166 390107 354971 322976 292664 263583 236502 212054 190065 170014 151335
57360 151335 133498 116494 100860 86551 72462 57953 44133 32525 23067 14560 6505 -802
57347 -7533 -14303 -21075 -27207 -32342 -36294 -38448 -38397 -36789 -34548 -31728 -28202 -24854 -22761 -21623 -20349
57332 -20349 -18693 -16931 -14346 -9620 -2507 6256 16332 27511 38391 47251 54468 62405 72555
57319 72555 84041 95136 104824 112573 118008 121424 123738 125590 127190 128832 130449 130766 128332 123543
57305 123543 118528 114838 112300 109976 106916 102064 95128 87861 82897 80816 79788 78536 78046 79595
57291 79595 82619 85760 88978 93385 99573 107092 115278 123859 132822 141997 150583 157293 161702 165469
57277 165469 171242 180014 190323 200368 210091 220727 233028 246534 260220 273505 286862 301511
57265 301511 318142 335990 353597 370307 386525 402726 418928 434932 450326 464428 476919
57254 476919 488398 499701 511135 523132 536881 552914 569517 584177 596677 609316 623885
57243 623885 639766 655337 670000 684351 699269 715332 732607 750830 770215 791641 815356
57232 815356 840095 864620 889411 915502 942286 968266 993570 1019764 1047266 1075019 1102869
57221 1102869 1132221 1163816 1196483 1228459 1258271 1284083 1304173 1318753 1329695 1337946 1342891 1344725
57209 1344725 1345479 1346828 1348596 1350316 1352628 1356095 1360130 1364146 1368629 1374336 1381610 1390997 1403027 1416716
57195 1416716 1429656 1440180 1448081 1452966 1454000 1452112 1450439 1451397 1454890 1460394 1469048 1482416 1500648
57182 1500648 1523120 1549574 1579604 1612290 1647277 1684950 1724905 1765690 1806504 1847261 1886531
57171 1886531 1921826 1952935 1982491 2012080 2040371 2066810 2094621 2127958 2168164 2214769 2267941
57160 2267941 2327523 2391646 2458984 2530938 2609237 2692897 2779873 2870039 2963804 3059163 3152939
57149 3152939 3243993 3332783 3418945 3501962 3583051 3663419 3741532 3815065 3884818 3953529 4021152
57138 4021152 4084576 4142426 4197401 4253266 4311693 4372458 4434690 4497353 4560044 4623658 4689154
57127 4689154 4756025 4823383 4891887 4962676 5034712 5104968 5170923 5231199 5284284 5328784 5364956
57116 5364956 5394372 5418212 5437306 5453305 5468100 5482417 5496493 5511433 5528140 5545593 5562135
57105 5562135 5578073 5595281 5614785 5636469 5660476 5686967 5714921 5742840 5770027 5795690 5817815
57094 5817815 5834779 5847140 5856078 5861246 5862150 5860305 5857883 5855541 5853864 5855285 5861670 5871098 5879734 5885662
57080 5885662 5888078 5884196 5870309 5844976 5807986 5757088 5688861 5601887 5495927 5369196 5219893
57069 5219893 5049260 4859441 4649062 4414357 4153406 3865201 3545323 3186299 2781509
57060 2781509 2325284 1810930 1233442 593522 -105377 -863578 -1685552 -2576154 -3540971
57051 -3540971 -4588044 -5723676 -6948299 -8262126 -9673030 -11192788 -12827365 -14576929
57043 -14576929 -16442242 -18422581 -20508649 -22685741 -24943043 -27272521 -29661509 -32097390
57035 -32097390 -34582781 -37144442 -39834720 -42732012 -45931539 -49526938 -53609245 -58272571
57027 -58272571 -63550546 -69285172 -75130769 -80885038 -86948104 -94366594 -104183393 -116524326
57019 -116524326 -130197067 -143128404 -153245369 -159175453 -160478311 -157513803 -151159282
57012 -151159282 -142518045 -132692336 -122639735 -113079358 -104422338 -96758744 -89935855 -83690186
57004 -83690186 -77757437 -71932017 -66096703 -60230726 -54385937 -48644506 -43090897 -37804310
56996 -37804310 -32850552 -28268538 -24068739 -20246666 -16793120 -13693621 -10928450 -8477710
56988 -8477710 -6321627 -4434535 -2783861 -1336839 -64551 1060365 2064219 2968310 3787747
56979 3787747 4534517 5218166 5843291 6410411 6920122 7373569 7769665 8106449 8386293
56970 8386293 8616777 8806296 8961844 9090396 9197892 9285779 9351776 9394805 9416397 9417535
56960 9417535 9398151 9360768 9311171 9254088 9190801 9121760 9048385 8970971 8887562 8796632 8699013
56949 8699013 8596100 8488318 8376836 8265132 8157321 8055480 7958817 7864071 7766391 7661508
56939 7661508 7547962 7426496 7297444 7160025 7013947 6859816 6697543 6525787 6343305
56930 6343305 6149756 5945346 5731016 5508894 5281266 5049505 4815616 4584286 4361297
56921 4361297 4149767 3949574 3760166 3581917 3414948 3259048 3115314 2986005 2872384
56912 2872384 2774385 2692538 2628163 2581213 2549851 2532959 2531408 2546133 2576489 2621556 2682350
56901 2682350 2762261 2865785 2996663 3156641 3346588 3569192 3828909 4127750 4463088 4832358
56891 4832358 5239546 5696543 6221144 6833491 7541399 8310197 9041847 9598670 9867913
56882 9867913 9815999 9489301 8972989 8351361 7691814 7042620 6432687 5874614 5372242 4926285
56872 4926285 4535002 4194646 3901948 3654236 3445913 3267076 3107316 2959752 2820782
56863 2820782 2687999 2560012 2437158 2320639 2211012 2108007 2011243 1920572 1836111 1758201
56853 1758201 1686940 1621811 1562358 1508865 1461436 1418735 1378925 1341794 1308556 1279376 1252625
56842 1252625 1227055 1203349 1182758 1165359 1150469 1137780 1127240 1118638 1112135 1108540 1108230 1110365
56830 1110365 1113933 1119107 1126917 1138097 1152764 1170529 1190103 1209291 1226200 1240067 1250279 1255332
56818 1255332 1253865 1246482 1235538 1223237 1210761 1198977 1188821 1180727 1174585 1170676 1170072 1173846 1182307
56805 1182307 1195075 1211386 1230296 1251382 1275687 1305484 1342334 1384898 1428190 1464897 1488274
56794 1488274 1495056 1486251 1465176 1435222 1399834 1363556 1331109 1304826 1284086 1267723 1255940 1249417
56782 1249417 1247828 1250471 1257758 1271100 1291813 1321051 1360285 1410468 1470572 1537630 1607864 1676586
56770 1676586 1736884 1779983 1798519 1790163 1758454 1710566 1654066 1594690 1535949 1480030 1428582
56759 1428582 1382617 1342267 1307383 1278474 1256741 1243204 1238063 1240813 1250645 1266858 1289197 1317693
56747 1317693 1351767 1389369 1426976 1460154 1483987 1493828 1486928 1463940 1428659 1386047 1340272 1293982
56735 1293982 1248777 1206160 1168000 1135795 1109524 1087875 1069972 1056197 1046950 1041545 1039240 1040570
56723 1040570 1046350 1055763 1066791 1078431 1091015 1103912 1113923 1116455 1107997 1087775 1058200 1023839
56711 1023839 988779 954391 920104 886159 854347 825916 800213 776189 754111 734795 717923
56700 717923 702203 686802 671807 657638 644799 634133 626534 622084 619594 617090 613008 607378 601946
56687 601946 598711 598152 599036 599720 599222 597432 595195 594075 594898 596413 596364 594173 591547 590168 589945 589960 589851
56670 589851 589367 587643 584078 579358 574660 570266 565665 560524 554849 548749 542840 538274 535470 533220
56656 533220 529908 525217 519895 514353 508527 502710 497430 492635 487987 483832 480838 478615 475721 471284
56642 471284 465759 459865 453673 447232 441253 436346 431923 426619 419726 411618 402835 393494 384053 376037
56628 376037 371075 369104 368220 366662 364434 362623 361889 362381 364667 369625 377396 387169 398016 409210
56614 409210 419953 429814 439602 450784 463734 477151 489296 499016 505742 509746 512647 516357 520929
56601 520929 524448 525566 525153 524976 525870 527712 529815 530608 528354 523402 518590 516155 515259 513849 511816
56586 511816 510508 509879 508252 504804 500508 496349 492116 487308 481947 476154 470107 464927 462339 462584 463330
56571 463330 461547 456381 449796 444613 442259 442268 443482 445324 447715 450203 451945 452742 453422 454854 457145
56556 457145 460137 463912 468185 471893 474239 475612 476757 477604 477859 478280 480166 483660 487498 490398 491883
56541 491883 491914 490704 489059 488098 488427 490017 492667 495879 498459 499327 498912 498912 500386 502717 504690 505890
56525 505890 506644 507264 507914 508909 510599 512979 515759 518860 522668 527611 533571 539846 545773 551199 556134
56510 556134 560241 563226 565515 567880 570387 572583 574839 578497 584112 590410 595722 599849 603819 608433
56496 608433 613938 620661 629015 638989 650317 662938 676709 690905 704717 718049 731303 744637
56484 744637 758125 772391 788268 805757 823908 841771 858963 875260 890164 903183 914425
56473 914425 924817 935511 946787 957487 965882 971144 973612 973725 971356 966379 959250 950715 941326
56460 941326 931269 920157 907124 891860 875431 859092 842496 824417 805274 787284 771623
56449 771623 757040 742096 727161 713130 699642 685989 672691 660716 649875 639177 628221
56438 628221 617356 607259 599067 593616 589559 583708 574774 565529 559503 556596 553870 549824 545710 543016
56424 543016 541739 541167 540707 539744 538089 536637 536493 537651 539461 541845 544763 547197 548308 549069 551068
56409 551068 553985 556080 556943 557906 559703 561631 563389 566000 570315 575859 581652 587132 592055 596491 601087
56394 601087 606414 612062 617277 622288 627950 634378 641163 648462 656414 663945 669923 675413 682899 693106
56380 693106 704294 715005 725782 737775 751251 766009 781763 797478 811647 823857 835010
56369 835010 845727 855754 865119 874307 882806 889148 893179 896740 901134 905220 907170 906873 905177 901609
56355 901609 894592 883915 871644 860075 849416 838055 824884 810706 796991 783764 769720 754459
56343 754459 739402 725843 713272 700677 688513 677917 668572 658916 648310 637654 628062 620038
56331 620038 613673 608394 602778 595971 589087 583909 580467 577311 573843 570741 568146 565193 561585 558055
56317 558055 554931 551747 548621 546582 545948 545628 544529 542646 540372 537799 535160 533058 531883 531616 532292
56302 532292 533909 535886 537482 538854 540848 543665 546338 547557 546653 544207 542127 542357 544882 547941 550850
56287 550850 555157 561844 568987 574025 576961 579314 581239 582322 584192 589292 597236 605070 611167 616365
56273 616365 621267 625089 627655 630104 632994 635673 637961 640604 643773 646944 650434 655253 661405 668149
56259 668149 675825 685362 696197 706802 717076 727968 739176 749781 760678 773329 786476 797552
56247 797552 807423 819873 835797 851754 865360 878197 891719 904048 913203 920352 927313 933370
56235 933370 937129 939299 941197 942332 941758 940140 938276 935161 929655 922735 916130 909947 903405 896707
56221 896707 890364 883795 876343 868771 862135 855876 848367 838925 828474 818841 811785 807622 804521 800349
56207 800349 795354 791534 789555 788455 788312 790329 793800 796017 796323 797396 801103 806028 810765 816733 825492
56192 825492 835740 845400 854656 864742 875632 887236 900997 917869 936284 954453 973268 994631
56180 994631 1018234 1042316 1066508 1091534 1116911 1141134 1163789 1185797 1207922 1230243 1252356
56169 1252356 1272991 1290396 1304317 1316670 1329248 1341773 1352993 1362363 1369766 1375210 1380024 1386725
56157 1386725 1396237 1406481 1415062 1422192 1429830 1439114 1449666 1460298 1469532 1476635 1482753 1489607 1496725
56144 1496725 1501690 1503464 1503215 1501300 1496027 1486509 1474436 1461793 1448974 1436135 1424085 1412661 1400517
56131 1400517 1387663 1375863 1365486 1354574 1342107 1329454 1317320 1304265 1289785 1275963 1264305
56120 1264305 1253701 1243224 1234119 1227201 1221097 1214908 1209775 1205955 1201370 1195012 1188803 1184188 1180172
56107 1180172 1176744 1176417 1179629 1182245 1180910 1177717 1176344 1176672 1176786 1177269 1179518 1182088 1182654 1181791 1181408 1181314
56091 1181314 1180643 1180822 1183734 1188510 1193295 1198671 1206479 1216905 1229463 1245207 1265211 1288423 1313259
56078 1313259 1339369 1365710 1389448 1409427 1428404 1449351 1471929 1494946 1519309 1545671 1572129
56067 1572129 1597418 1623714 1653225 1684800 1716993 1751524 1790486 1833072 1878446 1928705 1985459
56056 1985459 2046559 2110124 2178900 2256843 2344241 2440028 2545842 2663645 2792390 2931575
56046 2931575 3085593 3260294 3457550 3677015 3920237 4188395 4478152 4783351 5097848
56037 5097848 5412655 5713820 5988531 6231952 6445253 6630618 6791987 6935815 7064702
56028 7064702 7172365 7249526 7292230 7300897 7276147 7221581 7146915 7061569 6966707 6857673 6730427
56017 6730427 6580513 6400541 6186269 5943093 5681266 5408085 5130222 4858858 4604602
56008 4604602 4369892 4152996 3956222 3783350 3632438 3498802 3382250 3284117 3200270 3124969
55998 3124969 3059047 3006528 2965642 2930900 2901609 2880568 2866721 2856818 2851865 2854134 2860446 2866324
55986 2866324 2873971 2887883 2905478 2920876 2935334 2954953 2980496 3008573 3040441 3080140 3125847
55975 3125847 3172512 3221263 3277153 3339720 3405080 3475050 3554499 3641746 3731156 3822999 3921054
55964 3921054 4023220 4124798 4228400 4339994 4457768 4575852 4696389 4826588 4966508
55955 4966508 5111355 5263152 5428199 5605711 5791264 5988551 6205005 6438859 6683797
55946 6683797 6942987 7224421 7525759 7838885 8166340 8517208 8889271 9271843 9664482
55937 9664482 10076405 10509453 10958911 11429723 11934405 12476118 13050971 13664936 14330368
55928 14330368 15047936 15810321 16620367 17485721 18399749 19350446 20345622 21406625 22540794
55919 22540794 23744350 25027823 26410529 27892466 29461055 31124861 32912205 34839939
55911 34839939 36915661 39167069 41632738 44325471 47243534 50418630 53914248 57779623
55903 57779623 62051344 66802321 72145304 78193461 85072178 92965240 102084218 112591809
55895 112591809 124626618 138405996 154230396 172400623 193239818 217191201 244752788
55888 244752788 276296693 312055922 352056844 395307711 438411357 475219276 498853153
55881 498853153 505040987 494049833 469787770 437329557 401018823 363914928 327945730
55874 327945730 294148626 262961344 234561132 209042319 186385304 166430211 148957207
55867 148957207 133744427 120538991 109049834 99009371 90206888 82455020 75575099
55860 75575099 69431860 63940016 59020907 54586022 50569052 46934833 43644589 40644742
55852 40644742 37898737 35397779 33129946 31066591 29186266 27482997 25941452 24529540
55844 24529540 23224132 22020500 20909343 19867989 18882064 17954070 17083243 16257445 15471571
55835 15471571 14733824 14046584 13399269 12786015 12212262 11677997 11172006 10688581 10233322
55826 10233322 9807127 9400983 9011890 8647842 8311634 7994991 7693522 7411931 7149397
55817 7149397 6895379 6646013 6410446 6195149 5995450 5807660 5635723 5480041 5332815
55808 5332815 5190481 5058727 4940080 4828659 4722561 4629450 4554341 4493050 4442673 4406967
55798 4406967 4385656 4368989 4348261 4321621 4285019 4228508 4147579 4048725 3938700 3817396 3685655
55787 3685655 3550157 3415440 3280262 3146560 3022616 2912238 2809667 2710106 2616738 2532656
55777 2532656 2454653 2380158 2312115 2252012 2195735 2140816 2090154 2044382 1998426 1949797 1902432
55766 1902432 1858311 1813551 1767072 1724610 1689144 1655459 1619549 1585713 1558852 1536930 1516581
55755 1516581 1499459 1487553 1478490 1470695 1467379 1470730 1477950 1487286 1501812 1523001 1546896 1570925
55743 1570925 1597784 1627573 1652349 1663760 1660728 1645346 1617504 1578675 1535027 1491122 1445316
55732 1445316 1396088 1347753 1305082 1267215 1231698 1199610 1171977 1145951 1119425 1095163 1075954
55721 1075954 1060037 1045401 1033872 1026606 1020227 1011910 1003914 998779 994564 989179 984840 983499 982017
55708 982017 976482 967466 956668 942393 922784 899870 876315 851839 826629 804120 786177 769558
55696 769558 751383 734067 720485 708156 692820 674246 654245 632698 610217 591298 579895
55685 579895 574464 571414 570560 573166 577618 581194 583615 585281 584909 582249 579939 579203 577103 571519 565232
55670 565232 561319 558203 553400 548549 546273 545161 542204 537398 531903 524674 515040 505704 499043 493221
55656 493221 485835 478335 472857 467993 462182 458099 458810 462189 463983 464095 465258 467724 469986 472795 477813
55641 477813 483809 488340 491636 495089 497778 498385 498654 501094 505079 508717 512390 516713 519457 518710 516852
55626 516852 517085 518054 516367 512566 509945 508802 506435 501828 496248 490042 482620 474779 467642 460315 451661
55611 451661 442889 435242 427023 416379 405221 396652 390301 383974 378108 374511 372257 368964 364995 362490
55597 362490 361500 360844 361407 364588 368673 370633 370443 369863 368314 364088 358549 354902 353503 352209 350556
55582 350556 349717 349153 347283 344790 343429 342271 339080 334780 332521 332643 332469 330880 329234 327743 324664
55567 324664 319413 313333 307258 301132 295809 292325 289730 286423 283049 281198 279999 277183 272860 269134
55553 269134 266633 264583 263411 263813 263971 261324 256820 253919 253661 253963 253313 251739 248628 243362 238064
55538 238064 236110 237555 239121 238740 237132 235225 233326 232779 235019 238743 241010 241255 241455 242545 243803
55523 243803 245497 248874 253497 257774 262082 268164 275436 281217 284868 288637 294213 301492 310773 322934
55509 322934 337161 351676 367096 386034 409073 434106 459916 487359 516682 546701 577015
55498 577015 607882 637399 661747 678870 689286 693075 689037 677248 659458 636502 608260 576542
55486 576542 544913 514923 485451 456347 429701 406640 385802 365977 347671 331255 316216
55475 316216 302975 292836 285264 277837 269802 263156 259308 256993 254394 251098 247292 243286 240482 240552
55461 240552 242995 245609 247645 250109 252787 253799 252739 251479 251061 250321 248342 245786 243154 240140 237268
55446 237268 235516 233838 229880 223773 218330 214789 211513 207868 205863 206232 205976 201962 194731 186962 180364
55431 180364 175682 173475 172916 171636 168543 165270 163458 162401 160781 158958 157877 157102 155548 153178 150908
55416 150908 149742 150458 152818 154743 153988 151048 148488 147123 145199 141980 139443 139139 139859 139946 139719 139961
55400 139961 139966 138959 137907 138148 139417 140745 142118 143886 145504 146136 145693 144468 142737 141356 141474 142875
55384 142875 143683 142402 139255 135352 131877 130203 131025 133005 134048 134305 136016 140054 144729 148581 152023
55369 152023 155363 157549 158124 158402 159342 160018 159512 158707 158893 160030 161525 163342 165310 166636 166952 166671
55353 166671 165864 164315 163023 163665 165949 167529 167296 166671 166810 166827 165908 165015 165091 165517 165796 166985 170042
55336 170042 174257 178483 182321 185177 186096 185702 186339 188923 191393 191598 189911 187720 185300 182676 180625
55321 180625 179081 176240 171116 165606 162342 161665 162046 162104 160964 158189 154828 153099 153664 154599 154221 153220
55305 153220 152700 152068 150589 149217 148903 148534 146518 143253 140273 138115 136673 136467 137820 139766 141266
55290 141266 142408 143228 142767 140701 138498 137423 136832 135960 135749 137086 138776 139292 139218 139893 140843 140713 139756
55273 139756 139254 139222 138658 137534 136753 136668 137042 137747 138162 136934 133828 130745 129417 129295 129204 129582 131118 132644
55255 132644 132742 132324 133153 134620 134567 132846 131521 131690 132434 133007 133902 135344 136496 136668 136103 135350 134808 134857
55237 134857 135522 136202 136504 136834 137429 137635 137057 136439 136304 135904 134781 134144 135020 136208 135957 134690 134100 134370
55219 134370 134390 134108 134428 135169 135286 134919 135230 136272 136947 137046 137438 138169 138284 137719 137552 138008 137902 136605 135175
55200 135175 134913 135862 137154 137976 137958 137427 137442 138804 140933 142336 142107 140521 138607 137778 139130 142069 144238
55183 144238 143905 141927 140276 139354 138192 136644 135637 135290 134422 132266 129521 127429 126617 126848 127226 126695
55167 126695 124954 122633 120148 117106 113560 111020 111017 113205 115880 117845 118830 118919 118872 120334 124176 128936
55151 128936 132171 133045 132401 130818 128151 124879 122394 121625 122320 123813 125800 128337 131606 135533 139434
55136 139434 142578 145282 148414 151428 152281 150198 147137 145386 144936 144527 143846 143113 141673 138857 135495
55121 135495 132987 131700 131680 133716 137864 142022 144082 144707 145947 147909 148951 148414 146849 144127 139853
55106 139853 135389 132981 132792 133016 132893 133274 134068 133546 130834 127282 124807 124397 126253 129499 131625 130358
55090 130358 126625 123912 124128 125835 127031 127775 129144 131177 132974 133998 134472 135004 135960 136711 135919 133489
55074 133489 131512 131861 133451 133707 132273 131270 132163 134530 137838 142035 146070 148205 148492 148906 150411
55059 150411 151854 152392 152975 154575 156916 159911 164382 170117 174974 177409 178640 180871 184397 187642 189216
55044 189216 188900 187248 185005 182376 178626 173296 167825 164527 163637 163005 161365 160123 160864 162673 163362
55029 163362 162297 160706 159893 160200 161050 161252 159993 158191 157921 159830 162232 163520 164254 165751 167835 169543
55013 169543 171159 173721 176710 177981 176420 173546 171839 172109 173081 173317 172968 173403 175337 177836 179392
54998 179392 179502 178775 177903 177095 176281 175263 173883 172552 172227 173285 174971 176562 178359 180620 182473 183204
54982 183204 183789 185388 186954 186396 183876 181853 181765 182793 184162 186436 189742 192758 194597 196081 198124
54967 198124 200243 201772 203197 205212 207556 209721 211821 213841 215123 215494 215919 217132 218612 219802 221323
54952 221323 223973 227362 230543 233250 235606 237301 237947 237660 236534 234224 230752 227038 223886 221056 218046
54937 218046 215113 212731 210552 207698 203780 199130 194414 190386 187559 185764 184356 182943 181439 179503
54923 179503 176777 173684 171047 168923 166797 164919 164207 164676 165349 165890 166927 168411 169247 169131 169255 170556
54907 170556 172638 175018 177780 180215 180726 179289 178490 180667 185265 190290 194995 199590 203653 206824 210297
54892 210297 215701 222785 229722 235526 240934 247272 255653 266928 281152 297132 313414 329461 345180
54879 345180 359995 373442 386021 398140 408638 415719 419184 420343 419675 415828 407393 394874 380526
54866 380526 366750 354717 344059 333681 323080 312896 304078 296871 290770 285101 279444 273901 269071
54853 269071 265172 261161 255619 248801 242786 239043 236884 235000 233628 234213 237575 243319 250482 257994
54839 257994 265021 271680 279124 288404 299586 312125 325209 337249 346132 350901 352515 352274 350362
54826 350362 346507 340926 333644 323965 311882 299096 287415 276903 266813 257585 250437 245530 241891
54813 241891 238758 235745 232211 227967 224197 222254 221726 221077 219906 219040 218541 217329 215049 212782 211409
54798 211409 210500 209276 207564 205304 202260 198973 197075 197668 199714 200767 199307 196080 193254 192396 193244
54783 193244 194315 194577 194190 193632 192875 191894 191290 191496 191771 190886 188659 186035 183796 182010 180618 179520
54767 179520 177903 174442 168755 162231 157011 154354 154082 155208 156733 158040 158828 158854 157887 156029 153906
54752 153906 152420 152180 153089 154378 155283 155929 157259 159742 162605 165083 167928 172412 178056 182943 186609
54737 186609 190955 197518 205359 212790 219890 227807 236571 245273 253876 263248 273681 284867 297211
54724 297211 311639 327872 344118 358834 371876 383577 393459 400236 402668 400370 394296 386403 378312
54711 378312 370325 362115 353947 346464 339525 332276 324388 316458 309080 302361 296521 292315 290537 291497
54697 291497 295064 300642 307048 313197 319335 327191 338292 352135 366381 378987 389960 400832 412529
54684 412529 424217 434359 442312 448323 452481 454630 455138 454636 452841 448686 441933 433594 424330 413452
54670 413452 400147 384818 368565 352143 336119 321218 307711 295092 283114 272524 264078 257436
54658 257436 251671 246243 240891 235389 230096 225862 222605 218866 213718 208191 203792 200500 197465 194807
54644 194807 193222 192357 191214 189973 189948 191671 194124 196028 196987 197364 197833 199006 200806 202343 203035 203530
54628 203530 204853 207045 209345 211176 212294 212551 212404 212945 214479 215769 215818 215705 217339 220957 225314 229884
54612 229884 235301 241727 248291 254256 259574 264378 269107 275003 283064 292329 300318 305448 308179 309905
54598 309905 311710 314139 317188 320473 324150 329335 336606 344534 350964 355653 360519 367520 377408 390148
54584 390148 405088 420908 436866 453975 473495 494467 514306 531733 547228 560558 569957 574328
54572 574328 574348 570611 562417 549429 533020 514842 495380 475060 455545 438434 423354 408629
54560 408629 393511 378777 365496 354074 344397 336172 329038 322667 316747 311023 305757 301979 300546
54547 300546 300796 300869 299455 296605 292807 288275 283378 278796 274796 271085 267721 265294 263793 262059 258943
54532 258943 254457 249340 244164 239288 235103 231665 228451 224958 221449 218896 218365 220289 223863 227093
54518 227093 228056 226424 223568 221302 220752 222051 224496 227047 229154 230861 231912 231522 229839 228725 229745
54503 229745 231885 232622 230986 228215 225635 223586 222395 222785 224856 227908 231429 235034 237600 238231 238248
54488 238248 240327 245125 250519 254815 258822 263779 269231 274363 279764 286087 292134 296295 299249 303421
54474 303421 309970 317799 325502 332882 340297 347583 354152 359748 364765 369892 375356 380441 383930 385084
54460 385084 383828 380164 374105 366243 357524 348288 338357 328315 319625 312895 306894 300066 292447 285485
54446 285485 280405 277284 275281 273280 270645 267692 265172 263335 262030 261564 262469 264229 265229 264482 262722
54431 262722 261481 261797 263798 266668 268808 269143 268564 269070 271261 273849 275942 278344 281994 286504 291125
54416 291125 295862 300637 304454 306485 307101 306910 305747 303691 302116 302540 304950 308142 311065 313058 313781
54401 313781 313915 315053 317653 319865 319631 317392 315510 315586 317457 320228 322945 324597 324787 324325 324151 323902
54385 323902 322541 320086 317687 316083 314968 313750 312069 309814 307346 305386 303800 301040 295933 289753
54371 289753 285254 283660 283712 283657 283014 282173 281402 280794 280538 280705 281096 281475 281728 281810 281809 281850 281611 280321 277853
54352 277853 275514 275012 276774 279882 283437 287258 291357 295545 299699 303855 307893 311613 315138 318808
54338 318808 322710 326805 331481 337438 344710 352019 357391 359559 358956 357357 356261 355656 354599 352749 350615
54323 350615 348311 345050 340300 334698 329322 324690 320807 317464 313974 309438 303981 299049 295866 294171
54309 294171 293007 291883 290478 288241 285415 283637 284251 286434 288162 288656 288738 289184 290037 291386 293547 296377
54293 296377 299376 302498 305882 308869 310354 310400 310633 312676 316654 321243 324683 325877 325242 324513 325219 327439
54277 327439 330381 333606 336828 339083 339312 337755 335599 333206 329749 324759 318910 312933 306763 300279
54263 300279 294068 288705 283773 278239 271625 264466 257771 252231 247826 244066 240652 237716 235293 232946
54249 232946 230323 227774 225752 223783 220742 216187 210808 205556 200914 197091 194214 192004 189792 187279
54235 187279 185094 184246 184953 186088 185856 183212 178699 173708 169043 164675 160784 158142 156952 156089 154315
54220 154315 151852 150072 149974 151503 153891 155900 156286 154968 153453 153172 153642 153259 151614 149870 148902 148377
54204 148377 147819 147339 146833 145700 144134 143750 145898 149829 153467 155688 156948 157784 157751 156342 154330 153487
54188 153487 154912 158058 161497 164279 166305 167621 167915 166882 164864 162919 162241 163352 165634 167763 168943
54173 168943 169607 170579 171754 172158 171230 169391 167353 165508 164107 163316 162905 162480 162186 162455 162890 162183 159475
54156 159475 155254 150830 147596 146721 148365 150893 151998 151045 149292 147547 145139 141827 139040 137980 137757
54141 137757 136897 135719 135714 137282 139541 141881 144254 146234 147006 146224 143997 140492 136463 133565 132923 133723
54125 133723 134234 133838 133136 132567 132057 131637 131424 131215 130781 129998 128107 124133 119035 115979 116773 119195 119836
54108 119836 118569 117922 118903 120242 121603 124492 129194 133283 134448 133131 131330 130152 129512 129088 128636
54093 128636 128110 127971 128673 129775 130488 131051 132252 133675 134002 133322 133431 135201 137118 137169 134981 131551 128108
54076 128108 125825 125329 125767 125546 124660 124967 127422 130330 131492 131048 130998 132588 135214 137508 138686 139100
54060 139100 139898 141871 144460 146474 147766 149298 151377 152940 152991 151826 150395 149357 149073 149569 150162 150127
54044 150127 150030 151244 153783 155894 156388 156130 156485 157424 157971 157578 156383 155027 154723 156333 158769 159622 158150
54027 158150 156321 155928 156122 155062 152759 150653 149289 148072 146889 146430 146977 147971 148609 148244 146763 145361
54011 145361 146116 149616 153665 155547 155080 154192 154031 154069 153812 153674 153788 153393 152063 150678 150522 151909 154119
53994 154119 156252 157769 158474 158368 157682 156968 157007 158248 160320 162525 164851 167844 171220 173448 173477 172488
53978 172488 173019 176372 181306 185333 187012 187055 187351 188960 191245 193154 194901 197586 201443 205580 209458
53963 209458 213378 217253 220337 222870 226564 232341 238691 243723 248043 254082 262912 273230 283304 292429
53949 292429 300205 305808 308948 310914 313761 318349 323590 327675 329835 330694 331109 331305 331421 332141 333817
53934 333817 335348 335078 332817 329870 327036 323867 320133 316473 312986 308654 303181 298079 294742 292489
53920 292489 289827 286667 283713 280413 275435 269080 263605 260755 259999 259456 257755 254849 251815 250026 249873
53905 249873 250033 248413 243940 237360 230567 225344 222264 220359 218312 216239 215606 216910 218537 218819 218313
53890 218313 218849 220942 223585 226032 228223 229570 229073 227089 225678 226550 229397 232676 235295 237232 239302
53875 239302 242706 248116 254704 260607 264724 267689 270793 274474 278263 281788 285229 288878 292759 296867
53861 296867 301563 307407 314425 321759 328409 334246 339862 345409 350208 353790 356669 359534 362129 363731
53847 363731 364612 366272 369991 375432 380918 385064 388065 391323 395812 401190 406785 412882 420178 428334
53833 428334 436230 443674 451590 460159 468090 474383 479598 484388 487883 488790 487442 485500 483949 482524
53819 482524 480826 478920 476842 474419 471714 469066 466567 463779 459871 454034 446330 438197 431272 425327
53805 425327 418343 409235 399420 390889 383868 377559 372114 368182 365039 360849 354790 347661 340437 333371
53791 333371 326501 320014 314015 308681 304390 300843 296541 290301 283017 276718 272006 267685 262859 258092
53777 258092 254267 251422 249043 246677 244008 241048 238323 236262 234591 233122 232725 234303 236934 238409
53763 238409 237812 236386 235523 235063 234080 232351 230393 228706 227464 226599 225917 225458 225645 226636 227843 228708 229532
53746 229532 230562 230709 228662 225305 223558 225360 229852 234815 238745 241144 242198 243012 245127 248807 252442
53731 252442 254343 254622 254744 255904 258495 262524 267726 273642 280195 287830 296568 305337 312990 319642 326222
53716 326222 332772 338002 340788 341598 342060 343390 345692 348786 353070 358970 365766 371712 375549 377324 377521
53701 377521 376280 374031 372052 371335 371254 370304 367922 364730 361278 357648 354187 351396 348834 345170 339894
53686 339894 334324 330414 328915 328917 328778 327374 324820 322120 319949 317932 315455 312800 310768 309232 306851
53671 306851 302375 295856 288645 282505 278502 276222 274266 271825 269420 267718 266335 264581 262751 261603
53657 261603 260976 260012 258449 256709 255013 253518 252934 253723 254829 254539 252637 250548 249374 248952 248807 248780
53641 248780 248714 248736 249765 252384 255312 256602 256402 256771 258415 259496 258436 256248 255018 255434 256856 258701
53625 258701 260552 261713 261715 260925 260183 260271 261744 264268 266127 265836 264560 265294 268998 273368 276327 278837
53609 278837 282764 287597 291287 293263 294569 295668 296132 296282 297245 299232 301218 302542 303506 304192 303941 302461
53593 302461 300484 298838 297589 296475 295665 295599 296336 297286 297482 296278 294058 292136 291673 292876 295401 299115
53577 299115 303880 308902 312974 315407 316340 316255 315527 314320 312538 310086 307605 306698 308707 313096 317578
53562 317578 320081 320451 320105 320337 321259 322237 322841 323096 323171 323319 324094 325994 328687 331188 333095 334991 337265
53545 337265 339309 340584 341658 343253 345014 346480 348645 353020 359337 365684 370972 375796 380793 385729
53531 385729 390589 396042 402188 408115 413261 418034 422566 426190 428809 431516 435094 439048 442825 446685
53517 446685 450568 453493 455265 457511 461606 466553 470268 472158 473023 473240 472702 472154 472870 474903 476981
53502 476981 478270 479179 480220 481099 481314 480971 480588 480502 480800 481647 483379 486018 488629 489679 488616 486759
53486 486759 485748 485402 484287 482339 481318 482276 484227 486178 488980 493863 500278 506602 512213 517606 523103
53471 523103 528681 534583 540901 546973 552212 557162 562783 569108 575550 582065 589091 596729 604860 613649
53457 613649 623166 633071 643451 655225 668759 682902 696584 710684 726920 745356 764384 782902
53445 782902 801190 819770 838660 857800 877208 896828 917029 938952 963438 989939 1017436
53434 1017436 1045920 1075875 1106877 1138119 1169861 1202822 1236359 1268866 1299939 1330545 1360962
53423 1360962 1390277 1418344 1446562 1476010 1506124 1536103 1566456 1598136 1630948 1663801 1696124
53412 1696124 1728209 1760459 1792941 1825465 1857548 1888290 1916668 1942106 1964747 1985163 2003691
53401 2003691 2020085 2034040 2046093 2057488 2068955 2080123 2090363 2099424 2106714 2110892 2111242 2109021
53389 2109021 2106414 2104274 2101631 2097114 2089972 2079908 2066856 2051094 2033078 2013193 1991818 1969056
53377 1969056 1944122 1915892 1884774 1853099 1822657 1792850 1762518 1732552 1704840 1679155 1653136
53366 1653136 1625355 1596616 1567959 1539298 1510747 1483838 1460372 1440800 1424302 1409793 1396351
53355 1396351 1383448 1371340 1360961 1353169 1348369 1346717 1348123 1352106 1358147 1366107 1375953 1387663 1402032
53342 1402032 1420797 1444783 1472338 1500810 1529277 1558775 1590326 1624249 1661125 1701724 1745796
53331 1745796 1792265 1840745 1891478 1943816 1996422 2049415 2104769 2163914 2226177 2290241 2355936
53320 2355936 2423838 2494088 2566366 2640469 2716339 2793914 2873037 2953048 3032643 3111030 3189015
53309 3189015 3267822 3346937 3424154 3497682 3567037 3632107 3692860 3749969 3804113 3854516 3899676
53298 3899676 3939649 3975792 4007997 4034085 4052625 4064492 4070953 4072113 4068261 4060841 4050647 4036334
53286 4036334 4016031 3989316 3956634 3918083 3873940 3825018 3771214 3710952 3643500 3570824 3495743
53275 3495743 3419140 3340361 3259397 3177164 3094349 3011489 2929558 2849113 2769431 2689858 2611448
53264 2611448 2535827 2462847 2390940 2319543 2249776 2182748 2118439 2056287 1995877 1937033 1880157
53253 1880157 1826373 1776579 1730567 1687876 1649090 1615178 1585831 1559699 1536340 1516702 1501305
53242 1501305 1488885 1477410 1466075 1455859 1448344 1444259 1443220 1444719 1448867 1455657 1463969 1472391 1481089
53229 1481089 1491683 1505086 1520745 1538463 1559330 1583750 1609931 1635854 1661813 1689641 1720147
53218 1720147 1752767 1787034 1822778 1859272 1895758 1932651 1970790 2009591 2047311 2083045 2117205
53207 2117205 2150094 2181449 2211523 2241141 2270120 2296613 2318604 2335600 2348809 2360197 2371084
53196 2371084 2380900 2387534 2389717 2388702 2386644 2383789 2378562 2370120 2359264 2346813 2332560 2316036 2296883
53183 2296883 2274133 2246568 2214295 2178790 2140992 2100600 2057637 2013225 1968084 1921589 1873257
53172 1873257 1823983 1774841 1725706 1676248 1627355 1580301 1535118 1490989 1447793 1406053 1365630
53161 1365630 1325661 1285721 1246132 1207277 1169433 1133071 1098293 1064016 1028863 993100 958806
53150 958806 927665 899317 872234 845508 819174 793457 768638 745557 725372 708278 692763
53139 692763 676644 659047 641232 625315 612227 601039 590136 578603 566382 553604 540332
53128 540332 526785 513364 500364 488008 476664 466563 457230 447763 437914 428552 420699 414435 409102
53115 409102 404288 400069 396366 392501 387509 380734 372312 363348 355371 349106 343967 339214 335264 332963
53101 332963 331689 329359 324744 318808 313268 308786 305264 302870 301611 300582 298878 296848 295259 293546
53087 293546 290234 285018 279203 274065 269978 267226 266149 266028 265120 262647 259897 258695 259545 261770 264578
53072 264578 267233 268861 268987 268059 267043 266752 267596 269329 270912 271501 271785 273429 276975 281309 285490 289840
53056 289840 294702 299481 303728 307872 312022 315348 317752 320780 325522 330784 334823 337629 339880 340818
53042 340818 339499 337332 336892 338366 339343 338075 334836 330094 323800 316948 311446 307410 302603 295630 287853
53027 287853 280941 274304 266573 258225 250960 245342 240734 236902 234148 232152 230025 227345 224180 220501
53013 220501 216599 213643 212537 212494 211898 210422 209155 208747 208712 208578 208355 207535 204980 200541 195821 192566
52997 192566 190990 190353 190425 191380 192647 192909 191350 188279 184666 181672 180455 181446 183535 184702 183957 182191
52981 182191 180738 179731 178528 177290 177057 178114 179224 178925 177151 175137 174041 173990 174214 173704 171939 169335
52965 169335 166966 165682 165555 166128 166802 166872 165817 164115 163293 164422 166646 167861 166769 163739 159872 156120
52949 156120 153382 152357 152641 152646 151240 149152 148068 148607 149878 150870 151359 151411 150982 150507 151028 152918 154940
52932 154940 155577 155063 155064 156228 157254 157018 156628 158292 162540 167687 171960 175141 177840 180077 181298 181481
52916 181481 181621 182973 185854 189191 191419 192033 192104 193094 195521 199113 203754 209400 215303 220340 224332
52901 224332 228239 232879 238125 243467 248445 252219 253685 252608 250044 247208 244534 242221 240765 240197
52887 240197 239496 237655 234880 232016 229091 225189 219562 212356 204451 197122 191533 188006 185871 184267
52873 184267 182726 180819 177969 174292 171056 169488 169357 169334 168482 166845 164887 162958 161160 159298 157131
52858 157131 154920 153384 152763 152344 151188 148956 145891 142650 140289 139597 140199 141199 142817 145988 149983
52843 149983 152237 151594 149980 149389 148788 146006 141476 137758 136056 135521 135649 136908 138906 140209 140520 141196
52827 141196 143077 145412 147353 148874 149697 148909 146393 143356 140856 139022 138092 138719 140569 142032 142177
52812 142177 141886 142318 143357 144247 144597 144065 142200 139516 137697 137905 139707 142262 145477 149239 152691 155225
52796 155225 157285 159293 160730 161144 161046 160832 159926 158166 157082 158344 161704 165797 170276 175610 181281
52781 181281 185963 189540 193442 198633 204353 209211 212649 215055 217062 219014 220677 221399 220925 219873 218916
52766 218916 217767 215684 212830 210384 209227 209113 209222 209025 208512 207944 207435 206563 204575 201302 197522 193995
52750 193995 190468 186304 181780 177957 175269 173002 170360 167394 164714 162868 162299 163330 165581 167624
52736 167624 167783 165503 161730 157892 154660 151854 149343 147513 146711 146655 146849 147252 147928 148284 147477 145783
52720 145783 144761 145584 147650 149295 149582 149020 148686 148989 149210 148240 145960 143858 143815 146139 149116 150710
52704 150710 150407 149313 148848 149575 151019 152396 153430 154313 154868 154358 152579 150542 149351 148973 149107 150640
52688 150640 154737 160596 165616 167955 167647 165144 160633 155262 151262 149672 149197 148170 146414 144311 141590
52673 141590 138294 135681 134766 134909 135087 135504 136584 137512 137385 136839 136803 136539 134898 132836 132529 134286 136403
52656 136403 137936 139431 140837 140969 139670 138487 138413 138624 138410 138785 141045 144868 148882 152230 154752 156555
52640 156555 158243 160848 164755 169396 174484 180542 187522 193936 198309 200768 202366 203620 204606 205627
52626 205627 206706 207102 206459 205815 206245 206999 206381 204175 201801 200097 198488 196493 194567 192856 190447 186778
52610 186778 182806 179697 177033 173450 168627 163535 158865 154364 149912 146201 143821 142366 141045 139717
52596 139717 138688 137843 136674 135166 133975 133584 133648 133372 132286 130558 128782 127608 127385 127995 129014 129864
52580 129864 129789 128047 124610 120637 117806 117082 118326 120882 124008 126856 128783 129911 130885 131873 132373 132216
52564 132216 132075 132537 133252 133546 133412 133262 133058 132421 131460 130871 131056 131546 131365 129789 126907 123684 121355
52547 121355 120452 120483 120770 121303 122469 124184 125710 126407 126425 126600 127690 129560 131168 131591 131042 130519 130552 130843
52529 130843 131077 131227 130857 129028 125541 121650 118954 118144 119262 122295 126535 130047 131045 129833 128428
52514 128428 128211 128626 128204 126271 123581 121739 121933 123762 125453 125636 124624 123649 123409 124105 126265 130261
52498 130261 135039 138411 138933 136956 133881 131153 129910 130607 132579 134569 135938 136862 137428 137360 136837 136707
52482 136707 137379 138178 138376 138385 139293 141381 143651 144857 144696 143880 143275 143252 143912 145532 148216 151166 153021
52465 153021 153259 152646 152018 151394 150881 151583 154396 158321 161146 161827 161192 160319 159310 157895 156299 155061
52449 155061 154631 155412 157619 160830 164217 167386 170465 173222 174745 174339 172296 169574 167034 165088 163624
52434 163624 162127 160262 158446 157545 158046 159823 162466 165283 167227 167525 166402 164575 162240 159255 156213
52419 156213 154408 154596 156382 158781 160720 161278 160491 159825 160746 162687 163563 162482 160741 159773 159429 158968
52403 158968 158514 158582 158937 158952 158535 157890 156850 155233 153518 152478 152330 152668 152958 152761 151907 150817 150238 150397
52385 150397 150906 151663 153105 155213 157051 157765 157433 156428 154769 152746 151408 151633 153203 155376 157705
52370 157705 159665 160232 158880 156473 154342 152935 152146 152329 153868 156192 158382 160509 163217 166173 168069
52355 168069 168183 166921 164833 162299 160307 160257 162406 165301 167268 167794 167229 166079 165148 165414 166854 167951
52339 167951 167332 165684 165174 166989 170224 173228 175332 176793 177663 177474 176108 174392 173459 173606 174036 173722
52323 173722 172404 170811 170127 171136 173632 176527 178695 179786 180217 180552 181217 182592 184746 186935 187986
52308 187986 187549 186579 186162 186265 186135 185608 185395 186104 187529 189037 190194 190812 190712 189840 188671 188314 189892
52291 189892 193547 198097 201960 204485 206144 207449 208198 208134 207842 208385 210031 211748 212152 210839 208737 207214
52275 207214 206861 207302 208262 210363 214182 218651 221423 221302 219619 218545 218658 218972 218833 218642 218775 218888 218637
52258 218637 218327 218440 219017 219867 220911 222030 222999 223831 224735 225434 225209 224157 223775 225378 228263 230437 231121
52241 231121 231419 232378 233601 234462 235561 237739 240371 242046 242770 244059 246674 249626 251896 253827 256039
52226 256039 258179 259888 262082 265758 270002 272817 273943 275459 279201 284693 290180 294758 298787 302931
52212 302931 307571 312867 318677 324287 328587 330800 331240 331415 332946 335933 338646 339367 338371 337432 337588 338298
52196 338298 338813 339407 340836 343226 345895 347852 348309 347263 345853 345668 347495 351098 356012 361710 367030
52181 367030 370518 371887 372384 373346 375102 377575 381094 385924 391592 397247 402256 406294 409599 413334 418644
52166 418644 424837 429641 432078 433938 437354 442030 446317 450170 455138 461617 467935 472615 476089 479541
52152 479541 483070 485828 487385 488259 489364 491447 494833 499267 503933 507819 510268 511447 512449 514703
52138 514703 518881 524267 529301 532847 535084 537336 540959 546133 551802 557076 562346 568418 574818 580026
52124 580026 583528 586597 590617 595641 601180 607354 614331 621408 627693 633318 639111 645397 651739 657419
52110 657419 661677 664171 665867 668676 673286 678130 681489 683825 686831 690966 695442 699898 704242 707183
52096 707183 707042 704307 701498 699948 698388 695448 691928 689539 688614 688328 688211 688169 687561 685562 682331 678972
52080 678972 676321 674323 672437 670153 667213 663811 660518 657788 655582 653593 651534 649173 646529 644217
52066 644217 643065 643064 643140 642320 640703 639002 637674 636836 636434 635738 633215 627913 620965 614889 611216 609367
52050 609367 607967 606418 604711 602503 599366 595835 593269 592341 592239 591650 590023 587444 583895 579426 574739
52035 574739 570768 567705 565181 563238 562171 561493 560299 558926 558907 560542 561815 560853 558456 556905 556972 557560
52019 557560 557907 558646 560778 564843 570970 578380 584895 588555 590185 593042 599201 607256 614230 618767 621735
52004 621735 624576 628020 631985 635867 639039 641462 643608 645666 647367 648807 650704 653276 655529 656376
51990 656376 656105 656123 657518 660494 664869 670338 676257 681806 686561 690562 693836 696322 698328 700629 703733
51975 703733 707202 709960 711406 712052 713044 715065 717847 720691 723161 725127 726471 727145 727379 727408 726999 725703
51959 725703 723656 721706 720407 719169 716794 712866 708243 703933 699814 694966 689330 684240 680741 677986
51945 677986 674344 669789 665901 663230 660056 654541 647161 640122 635170 632695 632059 631681 629634 625459 620933
51930 620933 617889 615836 613085 609639 607171 606273 605512 603554 600753 598160 596292 595363 595474 595906 595174 592383
51914 592383 587805 581876 574596 566244 557637 549185 540621 531954 523700 515797 507405 498177 488505 478046
51900 478046 465511 450824 436165 423694 413181 403070 392930 383541 375272 367819 361173 355611
51888 355611 350790 345940 340841 335875 331143 326262 320910 315147 309340 304036 299389 294488 288180 280997
51874 280997 275232 272206 270565 268374 265740 263825 262203 259334 255344 252146 250612 249626 248560 248750 251264
51859 251264 254560 255877 254332 251436 248874 246958 245177 243352 241916 241510 242538 244801 247448 249492
51845 249492 250516 250849 251071 251479 252098 252975 254114 254987 254491 251918 248032 244784 243711 244802 246965 249264
51829 249264 251480 253803 256243 258250 258977 258239 257160 257174 258261 258875 258009 256582 256235 257373 259064 260253
51813 260253 260297 258791 256028 253460 252787 254466 257670 261509 265449 268726 270484 270879 271258 272746 275176
51798 275176 277685 279795 281498 282729 283339 283443 283486 283937 285080 286833 288622 289616 289420 288560 288067 288474 289318
51781 289318 289845 290163 291281 293696 296311 297450 296903 296121 296229 296708 296614 296318 297171 299782 303437 307094 310246
51764 310246 312883 315240 317568 319681 320832 320521 319325 318372 318119 318172 318173 318303 318883 320033 321685 323449 324650
51747 324650 325094 325540 326715 328003 328169 327465 327890 330843 335466 339986 343910 347957 352348 356352 359611
51732 359611 362910 367199 372472 378148 384152 390831 397752 403333 406260 406910 406699 406143 404368 400776 396326
51717 396326 392500 389405 385668 380066 372669 364526 356825 350394 345420 341469 338043 335025 332376 329689
51703 329689 326653 323683 321328 319153 316102 312109 308443 306033 304252 302060 299648 298091 297635 297258 296076
51688 296076 294466 293419 293178 293020 292235 290807 288929 286333 282782 279157 277208 277583 278602 277845 274809
51673 274809 271213 268657 266990 265283 263359 261536 259589 257127 254760 253745 254319 255397 256271 257681 260347
51658 260347 263147 263955 262285 260075 259402 260152 260524 259342 257101 254953 253486 252734 252678 253207 253881 254350 254991
51641 254991 256670 259585 262613 264215 263983 262949 262236 261819 260970 259576 258333 257657 257106 256064 254362 251981
51625 251981 248877 245484 242613 240295 237502 233843 230699 229470 229267 227804 224445 220927 219092 219391 221767
51610 221767 226272 232005 236896 239598 240713 241347 241469 240629 239217 237801 235937 232960 229535 227247 226779
51595 226779 227474 228524 229774 231442 233682 236194 237786 236911 233515 229876 228621 230104 232608 234706 236335
51580 236335 237806 239050 240061 241016 241704 241658 241148 241347 243184 246514 250540 254437 257457 259086 259477 259437
51564 259437 259769 260755 262169 263532 264474 265180 266292 268168 270621 273682 277935 283398 288700 292404 294831
51549 294831 297498 300918 304147 306568 308966 312249 315910 318346 318448 316612 314449 313598 314545 316551 318715
51534 318715 320769 322644 323937 324489 325025 326411 328538 330614 332228 333479 334525 335799 338131 341660 345114
51519 345114 347261 348608 350442 352632 353839 353583 352509 350779 347987 344824 343003 343067 343791 344176 344411 344378
51503 344378 343061 340401 338106 337406 337266 336039 333692 331245 329116 327391 326689 327233 327728 326715 324664
51488 324664 323363 323501 324130 324344 324236 324106 323855 323368 322705 321720 320110 317980 315954 314697 314589 315545 316813
51471 316813 317388 317148 317112 317933 318688 318082 316518 315973 317806 321557 325935 330099 333714 336526 338371 339264
51455 339264 339147 337767 335076 331667 328660 327053 327035 327917 328933 330028 331591 333419 334551 334391 333464 332736
51439 332736 332645 333161 334183 335338 335799 335051 333659 332768 332966 334081 335814 337893 339795 340939 341382 341895
51423 341895 343186 345105 346550 346118 343232 338792 334333 330283 325621 319713 313823 309862 307884 305814
51409 305814 301837 296345 291197 287663 285556 283974 282266 280220 277805 275095 272443 270456 269654 270164 271726
51394 271726 273780 275514 276258 276057 275518 274725 272833 269317 265158 261855 259519 256992 253800 250821 248774
51379 248774 247090 244769 241398 236884 231276 225611 222002 221819 224168 226836 228140 227270 223788 218084 212060
51364 212060 208162 207474 209160 211539 213153 213273 212362 212034 213681 216817 219208 218890 215932 212323 210311
51349 210311 210693 212438 213968 214754 215366 216174 216744 216681 216256 215782 215157 214467 214271 214642 214685 213814 212825 212843 213756
51330 213756 214623 215131 215661 216231 216437 216305 216363 216932 218079 220062 223044 226412 229092 230486 230634 229750 228238
51313 228238 226943 226648 227352 228522 229735 230645 230766 230026 229186 229055 229640 230644 232206 234243 235663 235352
51297 235352 233684 232006 230858 229602 227589 224648 220732 216130 211887 208974 207212 205931 205268 205512 205477
51282 205477 203193 198419 193093 188895 185537 181816 177276 172478 168515 166410 166112 166126 165173 164110 164839
51267 164839 167357 169629 170562 171202 172375 173174 172954 172977 174410 176150 176513 176158 177214 179943 182281 182805
51251 182805 182500 183075 184832 186767 187865 187633 186050 183696 181664 180778 180860 181001 180527 179470 178074 176177
51235 176177 173569 171045 170428 172884 177434 181849 184925 187104 188938 190016 189861 188937 187972 186738 184279
51220 184279 180196 175297 171087 168786 168471 168971 168945 168275 168070 169189 171274 173302 174389 173927 171855 169277
51204 169277 168002 168855 170930 172897 174235 174673 173515 170638 167569 166343 167309 168900 169453 168638 167401
51189 167401 167255 169282 172924 175893 176122 173850 171125 169487 168965 169115 169761 170366 169787 167478 164516 162894
51173 162894 163858 167109 171243 174710 176650 177166 176839 176108 175282 174908 175472 176624 177253 176771 176093 176919 179982
51156 179982 184130 187171 187675 186083 184147 183314 183654 184255 184303 183676 182790 182207 182236 182623 182767 182393 181819 181390
51138 181390 181056 180884 181480 183301 185810 188025 189702 191283 192765 193556 193565 193496 193700 193546 192505 191211 190772
51121 190772 191472 192843 194611 196801 199128 200987 201985 201841 199996 196208 191674 188519 187615 187581 186555 184389
51105 184389 182325 180925 179367 176870 173907 171536 170109 169145 168203 167324 166760 166738 167617 169849 173424 177295
51089 177295 179626 179071 176097 172932 171719 172613 174003 174575 174716 175637 177735 180391 182956 185119 186386
51074 186386 186089 184397 182668 182084 182135 181165 178597 176030 175655 177802 180707 182792 184471 187086 190564 193140
51058 193140 193598 192864 192832 194104 195619 196210 195795 194956 193964 192604 190785 189099 188610 189929 192529 195298
51042 195298 197798 200505 203564 206016 206902 206779 207315 209353 212019 213770 213899 212899 211816 211373 211433 211254
51026 211254 210399 209225 208128 206695 204256 201200 199040 198917 200467 202305 203304 203333 203107 203421 204276 204749
51010 204749 203977 202268 200884 200708 201352 201578 200505 198596 197578 198846 201624 203208 201642 197643 193291
50995 193291 189575 186313 183918 183629 185907 189887 194738 200241 205624 209138 209698 208204 206448 205274 204400
50980 204400 203428 202296 201028 199591 197888 195798 193565 192146 192477 194281 196381 198365 200988 204511 207697
50965 207697 209207 209210 208773 208249 207215 205603 204186 204062 206057 210153 215019 218620 219953 219893 220005 221005
50949 221005 222806 225267 228073 230414 231682 232192 232537 232573 231846 230709 230239 231110 233125 235550 237355 237505
50933 237505 235965 234319 234576 237151 240519 242942 244114 245100 247036 249941 252659 254022 254066 253824 254075 254974
50917 254974 256860 260425 265551 270935 275547 279779 284558 290056 295971 302179 308187 312940 316345 320274
50903 320274 326596 334771 342714 349521 355766 361460 365619 368162 370663 374722 380701 388303 397106 406178
50889 406178 414489 422401 431736 443750 457862 472810 488102 503714 519347 534719 550031 565511
50877 565511 581027 596532 612286 628261 644045 659728 676100 693385 710531 726321 740591
50866 740591 753846 766363 778147 788885 797242 801080 799441 793919 787187 780434 772884 763179 750313
50853 750313 733729 713828 692487 672049 653530 636221 618999 601423 583886 567511 553803
50842 553803 543428 535240 527306 519006 511416 505608 501564 498933 497723 497656 497838 497930 498824 501208 504012
50827 504012 505471 505446 505535 506882 508986 510944 512808 515096 517759 520324 522613 524653 526167 526780 526598 526107
50811 526107 525611 525070 524343 523273 521836 520468 519757 519408 518155 515576 513417 513928 517106 520781 523401 525381
50795 525381 527501 529591 531640 534853 540254 546950 553076 558142 563340 569781 577580 586639 597240 609510
50781 609510 622996 637119 651661 666632 682000 697710 713848 730771 749107 769260 790762
50770 790762 812648 834877 858857 885909 915656 946556 977655 1009118 1041509 1075584 1112631
50759 1112631 1153873 1199241 1247389 1297020 1347628 1399032 1450948 1503000 1554336 1603151 1647444
50748 1647444 1686507 1720937 1750983 1775593 1793314 1803524 1806617 1803721 1796402 1785875 1772068 1754055
50736 1754055 1731666 1706026 1678326 1648938 1618215 1587372 1557853 1530379 1505188 1482696 1463267
50725 1463267 1446851 1433523 1424012 1418903 1417513 1418353 1420826 1425984 1435445 1449786 1467964 1488065 1508635
50712 1508635 1529403 1550656 1571954 1591865 1609123 1623710 1636460 1647818 1657251 1663653 1666066 1664241
50700 1664241 1658735 1650317 1639077 1624384 1605901 1584249 1560329 1534252 1505437 1473653 1439550 1404194
50688 1404194 1368455 1333027 1298809 1266952 1238323 1212936 1190135 1169508 1151454 1136612 1124974
50677 1124974 1116003 1109533 1105959 1105444 1107540 1111913 1119025 1129750 1144488 1162737 1183356 1205134 1227489
50664 1227489 1250704 1275247 1300885 1326697 1351786 1375351 1396158 1412852 1425149 1434118 1441034 1446538
50652 1446538 1451115 1455424 1459657 1463336 1466465 1470140 1475353 1482020 1490283 1501956 1519097 1541290 1565886
50639 1565886 1591203 1618156 1648210 1680976 1714641 1747836 1779999 1810546 1838782 1864469 1887504
50628 1887504 1907044 1921854 1931637 1937372 1940172 1940589 1939250 1937373 1936175 1936297 1938236 1942553 1948914 1955579
50614 1955579 1960963 1965509 1970991 1978139 1986133 1994513 2004164 2015923 2029486 2044639 2062689 2085760 2115383
50601 2115383 2152508 2197918 2251244 2310202 2372172 2436212 2502368 2569469 2635345 2699178 2761954
50590 2761954 2824282 2885281 2944186 3001543 3057943 3112693 3164644 3213390 3258735 3299893 3336244
50579 3336244 3368361 3397388 3423965 3448578 3472423 3496965 3522965 3550775 3581253 3615363 3652937
50568 3652937 3692525 3732403 3771177 3807757 3841567 3872672 3901023 3925612 3945064 3958930 3967659
50557 3967659 3971251 3968728 3959209 3942997 3921403 3896080 3868870 3841770 3816435 3793783 3774430 3759433
50545 3759433 3750055 3746421 3746598 3747501 3746890 3744217 3739382 3731212 3717626 3696923 3668150 3630522 3583496
50532 3583496 3527672 3464735 3396086 3322182 3243549 3161625 3077971 2993178 2907243 2820680 2734703
50521 2734703 2650570 2569179 2491054 2416293 2344600 2275621 2209131 2145096 2084225 2028527 1980368
50510 1980368 1940386 1906975 1878225 1853697 1833903 1819021 1808934 1803703 1802916 1805097 1808855 1814324
50498 1814324 1822477 1833202 1844922 1855994 1865789 1874833 1884783 1897973 1915907 1938211 1963725 1992371
50486 1992371 2025098 2062427 2104257 2150908 2203136 2261055 2324267 2393133 2468615 2550465 2636784
50475 2636784 2725937 2817846 2912812 3010188 3109144 3209976 3313653 3420685 3531391 3646942
50465 3646942 3768973 3898015 4032999 4172476 4315874 4463344 4614774 4769310 4925818
50456 4925818 5083733 5243241 5404561 5567092 5729324 5889283 6044626 6192444 6329576
50447 6329576 6453340 6561670 6652425 6723011 6770948 6794575 6793101 6766413 6715193 6641101 6546608
50436 6546608 6434777 6309241 6174128 6033784 5892580 5754960 5625221 5506881 5402136
50427 5402136 5311918 5236311 5174773 5126066 5088090 5057925 5032235 5007746 4981191 4948773 4906178
50416 4906178 4849687 4777364 4688947 4584892 4466125 4334823 4194794 4050397 3904848 3759441
50406 3759441 3614266 3469643 3326944 3188019 3054045 2925269 2801897 2684728 2574573
50397 2574573 2471533 2375338 2286135 2204399 2130229 2063208 2002798 1948255 1898308 1851567 1807512
50386 1807512 1766781 1730375 1698759 1671611 1648158 1627902 1611157 1598502 1589465 1582309 1575796 1570698
50374 1570698 1568713 1570182 1573846 1578756 1585358 1594552 1606673 1621793 1640246 1662385 1688382 1718572
50362 1718572 1753408 1792719 1835621 1881621 1931348 1985775 2045049 2108564 2175939 2247510 2323900
50351 2323900 2405351 2491557 2582143 2677161 2776782 2880357 2986424 3094278 3205027 3320190
50341 3320190 3439443 3560640 3681733 3801412 3917833 4028303 4130946 4225636 4312474 4390277
50331 4390277 4457427 4513350 4558063 4590721 4609665 4613667 4602159 4574392 4529495 4467752 4391242
50320 4391242 4302840 4204859 4098963 3987293 3873418 3761839 3656224 3558071 3467281 3383874
50310 3383874 3308706 3242633 3185686 3137293 3096645 3062571 3033607 3008506 2986016 2963743 2937962
50299 2937962 2905474 2865435 2818931 2767083 2710123 2648032 2581360 2511502 2440507 2370416 2302324
50288 2302324 2236175 2171729 2109450 2050243 1994756 1943281 1895768 1851492 1809293 1768845 1731206
50277 1731206 1697335 1666602 1637671 1610427 1585896 1564531 1545867 1529897 1517388 1508214 1500558 1492599
50265 1492599 1484309 1476740 1470090 1463401 1455898 1447710 1439245 1430653 1422235 1414828 1409238 1405289 1401735 1397249
50251 1397249 1391604 1385929 1381779 1379893 1379844 1380908 1383051 1386867 1392563 1399372 1406209 1412701 1419287 1426507
50237 1426507 1434684 1444326 1456237 1470838 1487671 1505925 1525017 1544141 1561704 1576191 1587648 1597494
50225 1597494 1606622 1614381 1619691 1622431 1623137 1621848 1617862 1610381 1598907 1583208 1563433 1540248 1514679
50212 1514679 1487974 1461575 1436680 1413442 1391041 1368881 1347330 1327025 1308060 1290374 1274160
50201 1274160 1259118 1243908 1227448 1210443 1194571 1180326 1166852 1153870 1142418 1133200 1125367 1117647
50189 1117647 1109779 1101996 1093908 1084944 1075502 1066473 1057766 1048394 1038398 1029711 1024301 1021746 1019396 1015034
50175 1015034 1008903 1002911 998214 994085 989145 983114 977010 971935 968141 965224 962699 960235 957686 955161
50161 955161 952956 951256 950045 949289 948940 948606 947583 945547 943163 941672 941797 943138 944611 945370 945383 945211
50145 945211 945287 945431 945247 944991 945765 948530 953042 958082 962650 966651 970376 973867 977051 980144 983398 986572
50129 986572 989228 991672 995100 1000422 1007084 1013453 1018378 1022265 1026642 1032791 1040713 1049267 1057367 1065063
50115 1065063 1073298 1082582 1092334 1101758 1110877 1120134 1129339 1137923 1146241 1155595 1166543 1177975 1188576
50102 1188576 1198596 1209298 1221054 1233038 1244859 1257471 1271980 1288273 1305381 1322668 1339968
50091 1339968 1356875 1372864 1388213 1404106 1421346 1439358 1456824 1473014 1488145 1502743 1517255
50080 1517255 1532128 1547559 1562962 1577232 1589880 1601452 1612493 1622652 1631489 1639824 1649345 1660701
50068 1660701 1672716 1683981 1694790 1706986 1722049 1739825 1759246 1779919 1802684 1828776 1858864
50057 1858864 1893182 1932215 1976653 2026520 2080893 2138901 2200766 2267501 2339687 2416723 2496849
50046 2496849 2577419 2655422 2728510 2795850 2857870 2915204 2968024 3016088 3059070 3096935 3130282
50035 3130282 3159926 3185612 3205377 3216658 3217770 3207721 3185171 3148856 3099193 3038551 2969661
50024 2969661 2894538 2815111 2733760 2652591 2572797 2495253 2421203 2351878 2287916 2229627 2177325
50013 2177325 2130939 2089531 2051564 2015523 1980484 1946719 1915677 1888405 1863864 1839879 1816163
50002 1816163 1795092 1778676 1765885 1754111 1742385 1731826 1723423 1716727 1710448 1703244 1694080 1683041
49990 1683041 1671792 1662186 1654299 1646684 1638619 1631085 1625417 1621863 1619803 1618604 1617909 1617685 1618275 1620027
49976 1620027 1622806 1626332 1630854 1636793 1643681 1650298 1656139 1662151 1669732 1679531 1691301 1704269 1717390
49963 1717390 1729890 1741976 1754643 1768609 1783914 1800725 1819774 1841515 1865346 1890182 1915551
49952 1915551 1941794 1969454 1998871 2030079 2062774 2096566 2131637 2169026 2209993 2255154 2304422
49941 2304422 2357665 2415327 2478489 2548421 2625930 2711167 2804218 2905667 3016043 3134539 3258645
49930 3258645 3385213 3511640 3635919 3756105 3870278 3977062 4076012 4167586 4252738 4332211
49920 4332211 4405871 4472664 4531090 4579415 4615341 4635878 4637956 4619336 4579136 4517895 4437395
49909 4437395 4340187 4228867 4105675 3972836 3833147 3689957 3546328 3404143 3264108 3126720
49899 3126720 2993196 2865333 2744577 2631494 2526085 2428139 2337180 2252628 2174416 2102990
49889 2102990 2038174 1978325 1921284 1866220 1814180 1766876 1725137 1688310 1654683 1622698 1592169
49878 1592169 1564143 1539128 1515823 1492261 1468042 1444699 1423870 1405768 1389437 1373725 1357857
49867 1357857 1341746 1326155 1312139 1300135 1289854 1280895 1272880 1265111 1257000 1249050 1242713 1238915 1237293
49854 1237293 1236937 1237159 1237394 1237315 1237538 1239335 1243028 1247320 1250877 1254003 1258029 1263611 1270354 1277681 1285172
49839 1285172 1292256 1298327 1303165 1306830 1309494 1311881 1315484 1321605 1330465 1341859 1356172 1373669 1393088
49826 1393088 1412265 1430518 1449511 1471529 1497837 1528977 1565412 1606895 1651911 1699034 1748937
49815 1748937 1804393 1868236 1941401 2022525 2108824 2197594 2287572 2378852 2471071 2561814 2647345
49804 2647345 2724766 2792961 2851879 2902170 2945750 2985413 3022836 3057388 3087360 3111410 3127814
49793 3127814 3133087 3123080 3095789 3052104 2993795 2922092 2838870 2748000 2654248 2560959 2469464
49782 2469464 2380421 2294958 2214463 2139791 2070930 2007469 1949513 1897986 1853508 1814952 1779905
49771 1779905 1746921 1716664 1690273 1667314 1646231 1626417 1608831 1594486 1583019 1572899 1562689
49760 1562689 1552078 1541786 1532416 1523521 1514391 1505694 1499188 1495262 1491926 1487296 1482089 1478261 1475922
49747 1475922 1473330 1469647 1465922 1463160 1461066 1459166 1457809 1457375 1457532 1457918 1458657 1459789 1461035 1462512 1464746
49732 1464746 1467606 1470192 1472253 1474568 1477418 1479843 1481227 1482386 1484004 1485050 1484106 1481662 1479578 1478474
49718 1478474 1476984 1473833 1469668 1466444 1465523 1466613 1468265 1469268 1469649 1470215 1471317 1472605 1474007 1476084 1478964
49703 1478964 1481697 1483348 1484140 1484908 1486030 1487598 1489983 1493275 1496624 1499143 1501182 1503712 1506640 1508794
49689 1508794 1509644 1510086 1511320 1513677 1516751 1520017 1523033 1525600 1527978 1530546 1533143 1535184 1536558 1537948
49675 1537948 1540068 1542911 1545885 1548342 1549774 1549784 1548289 1545811 1543453 1542318 1542781 1544260 1545813 1546871 1547164
49660 1547164 1546217 1543526 1539252 1534008 1527833 1520196 1511446 1503356 1497388 1492917 1488042 1481903 1475405 1469782
49646 1469782 1465313 1461532 1458004 1454549 1451009 1447043 1442307 1437001 1432137 1428684 1426333 1423726 1420216 1416740
49632 1416740 1414541 1413757 1413869 1414670 1415967 1416956 1416951 1416307 1415618 1414540 1412559 1410604 1410463 1412476 1414910 1415972
49616 1415972 1415583 1414943 1415096 1416123 1417124 1416858 1414970 1412588 1411229 1411378 1412813 1415780 1420638 1426504 1431600
49601 1431600 1435081 1437371 1438692 1438714 1438131 1439062 1442988 1449304 1456612 1464305 1472044 1478794 1483783 1487905 1492962
49586 1492962 1499770 1507731 1515878 1523478 1530021 1535651 1541478 1548567 1556758 1565303 1574490 1585585 1599078
49573 1599078 1614027 1629480 1645706 1663416 1682434 1701830 1720999 1739815 1757934 1774874 1791169
49562 1791169 1808684 1828991 1851539 1874089 1895137 1915442 1936904 1960380 1984937 2008886 2031141
49551 2031141 2051896 2072497 2094465 2118162 2142486 2166186 2189105 2211645 2233569 2254294 2274206
49540 2274206 2294703 2316805 2340537 2365649 2391990 2419101 2446599 2475231 2506333 2539754 2573641
49529 2573641 2607217 2642566 2682200 2725616 2769844 2813231 2857252 2904389 2955505 3009658 3065575
49518 3065575 3122647 3181081 3241637 3304974 3370940 3438663 3507301 3576340 3645294 3713876 3782842
49507 3782842 3853916 3928115 4004328 4080216 4154671 4228909 4304871 4382749 4460432 4535298 4606228
49496 4606228 4673751 4738746 4801492 4861759 4919016 4972262 5020232 5062383 5099493 5132933 5163431
49485 5163431 5190759 5214217 5232937 5246007 5253024 5254745 5252774 5248416 5242048 5233487 5222521 5209107
49473 5209107 5193593 5176994 5160621 5145184 5130681 5117371 5106252 5097936 5091529 5085595 5080284 5077594
49461 5077594 5079176 5084555 5092101 5101078 5111802 5124151 5137089 5149910 5163026 5177075 5191968 5207359
49449 5207359 5223210 5239082 5253492 5265162 5274709 5283764 5292221 5297479 5296953 5290403 5279058 5263216 5241764
49436 5241764 5213779 5179712 5140949 5098850 5054216 5007100 4956950 4903370 4846915 4788832 4729905
49425 4729905 4669857 4607942 4543840 4477862 4410686 4343172 4276283 4210908 4147629 4086660 4027928
49414 4027928 3971329 3917020 3865424 3816721 3770349 3725417 3681747 3640290 3602258 3568058 3537193
49403 3537193 3508910 3482536 3457415 3433114 3409861 3388303 3368645 3350496 3333857 3319791 3309449
49392 3309449 3302547 3297229 3291468 3284291 3276016 3267925 3261618 3257841 3255768 3254036 3252504 3252075 3252642 3252546 3250891
49377 3250891 3249376 3250535 3254725 3260068 3264972 3269325 3273415 3277304 3281586 3287394 3294966 3303317 3311961 3321909
49363 3321909 3334118 3347844 3361603 3375154 3389414 3404865 3421108 3437830 3455066 3472534 3489851
49352 3489851 3507787 3528331 3552682 3579462 3605497 3628359 3647907 3665573 3682636 3699475 3716240
49341 3716240 3733705 3753000 3774524 3797555 3821010 3844324 3867446 3890511 3913829 3937907 3962936
49330 3962936 3988410 4013655 4038611 4063740 4089268 4114981 4140737 4166670 4192750 4218501 4243375
49319 4243375 4267281 4290587 4313777 4337235 4361349 4386727 4414135 4443931 4475449 4507285 4538601
49308 4538601 4570075 4603218 4638737 4675883 4713455 4751156 4789835 4830584 4873858 4919454 4967152
49297 4967152 5017151 5069754 5124762 5181564 5239906 5300128 5362271 5425365 5488236 5551122 5616003
49286 5616003 5685150 5759515 5838424 5920257 6003283 6086522 6170514 6257124 6347944 6442609 6538989
49275 6538989 6635276 6731664 6829737 6930292 7032062 7132775 7231254 7328224 7425095 7522210 7618422
49264 7618422 7712141 7802482 7889504 7973675 8055221 8133671 8207859 8276622 8339755 8397989 8451607
49253 8451607 8499264 8538884 8569838 8593608 8611959 8625125 8632389 8633833 8630539 8623323 8612499 8599039
49241 8599039 8584752 8570680 8556241 8540818 8525468 8512081 8501305 8492377 8484750 8478860 8475294 8474316
49229 8474316 8476459 8482612 8493041 8507032 8523803 8543227 8565199 8588985 8613755 8639424 8666480 8695234
49217 8695234 8725472 8756394 8786532 8814289 8839126 8861871 8883328 8902848 8918772 8929922 8935899
49206 8935899 8936107 8929405 8915031 8893198 8864370 8828392 8784909 8734589 8679392 8621329 8560993 8497468
49194 8497468 8429690 8357774 8282940 8206367 8128442 8049136 7968758 7888099 7808016 7729123 7651830
49183 7651830 7576545 7503783 7434162 7368139 7305537 7245301 7185966 7126666 7067857 7010959 6957169
49172 6957169 6906650 6858865 6813445 6770422 6729796 6691310 6654601 6619100 6583850 6548184 6512689
49161 6512689 6478640 6446145 6413724 6380293 6346616 6314004 6282483 6251343 6220632 6190806 6161553
49150 6161553 6132477 6104431 6078370 6053200 6026731 5998902 5971972 5947105 5922797 5897473 5871570
49139 5871570 5845911 5819960 5793296 5767268 5743319 5720761 5697970 5674968 5653065 5632719 5613500
49128 5613500 5595601 5579541 5564663 5549655 5534414 5519771 5505691 5491502 5477773 5465906 5455700
49117 5455700 5445300 5434153 5424014 5415993 5408346 5398655 5387110 5376124 5367344 5360320 5353752 5346873 5339621
49104 5339621 5332320 5325417 5319142 5313446 5308502 5304941 5303122 5302312 5300995 5298080 5293707 5288966 5284912 5281793
49090 5281793 5279163 5276743 5274859 5273787 5273025 5271710 5269632 5267380 5265673 5264983 5265539 5266968 5268212 5268660 5269323
49075 5269323 5271926 5276784 5282438 5287638 5292756 5298844 5306047 5313323 5319187 5322516 5323427 5323763 5325894 5330510
49061 5330510 5336092 5340856 5344537 5347918 5351500 5355321 5359398 5363380 5366141 5366534 5364673 5362079 5360565 5360954
49047 5360954 5362355 5362592 5359964 5354938 5349560 5344981 5340383 5334696 5328278 5321979 5315450 5307522 5297846 5287089
49033 5287089 5275835 5264325 5252948 5241853 5230103 5216314 5200165 5182343 5163032 5141653 5118353
49022 5118353 5094463 5070809 5046570 5020656 4993516 4966698 4941125 4916742 4893522 4871792 4851522
49011 4851522 4832279 4814066 4797444 4782473 4768303 4754386 4741519 4730812 4721888 4713013 4703102 4692731
48999 4692731 4682821 4673102 4662564 4650915 4638774 4626554 4613887 4600224 4585386 4569447 4552653 4535647
48987 4535647 4519151 4503106 4486489 4468329 4448619 4427976 4406824 4385235 4363274 4341058 4318747
48976 4318747 4296938 4276927 4259932 4245795 4232643 4218142 4201223 4182681 4164171 4146669 4130012
48965 4130012 4113864 4098746 4085693 4075056 4066174 4058270 4051210 4045299 4040843 4038149 4037460 4038532 4040617
48952 4040617 4043273 4046944 4052418 4059921 4069027 4079202 4090210 4102254 4116049 4132480 4151851 4173662
48940 4173662 4197356 4222940 4250475 4279507 4309664 4341546 4376094 4413052 4450928 4488826 4527594
48929 4527594 4568666 4612234 4657217 4702731 4748856 4795907 4843655 4891599 4939662 4988187 5037388
48918 5037388 5087062 5136807 5186269 5235209 5283470 5330694 5375818 5417231 5454054 5487307 5519083
48907 5519083 5550330 5579973 5606440 5629273 5648859 5665468 5679467 5691796 5702972 5711867 5716799 5717945
48895 5717945 5717451 5716835 5715424 5712089 5707480 5703454 5700637 5697515 5692081 5683938 5674683 5666432 5659989 5654459
48881 5654459 5648660 5642585 5637070 5632330 5627706 5623010 5619360 5618417 5621303 5628278 5638709 5651098 5664035
48868 5664035 5677628 5693235 5711442 5731166 5751428 5773093 5797861 5826044 5856212 5886848 5917720
48857 5917720 5949963 5985339 6024916 6067860 6111992 6156213 6201867 6251009 6303846 6358708 6413951
48846 6413951 6469031 6524291 6580885 6640547 6704132 6770440 6837520 6905001 6973984 7044753 7116041
$$ [...]
##END NTUPLES=NMR SPECTRUM
##END=
