##TITLE=coffee_type ROVE100-15-0203
COFFEE_meoh_noesyp64 COFFEE_meoh {C:\Bruker\TOPSPIN} Administrator 3
##JCAMPDX= 6.0         $$ Bruker NMR JCAMP-DX V2.0
##DATA TYPE= NMR SPECTRUM
##DATA CLASS= NTUPLES
##ORIGIN= Bruker BioSpin GmbH
##OWNER= Administrator
$$ 1.72 TOPSPIN		Version 2.1
$$ 2012-05-29 13:25:53.954 -0700  Administrator@X
$$ Compression mode = diff/dup
##.OBSERVE FREQUENCY= 400.13188235
##.OBSERVE NUCLEUS= ^1H
##.ACQUISITION MODE= SIMULTANEOUS (DQD)
##.ACQUISITION SCHEME= undefined
##.AVERAGES= 64
##.DIGITISER RES= 22
##SPECTROMETER/DATA SYSTEM= spect
##.PULSE SEQUENCE= noesygpps1d.comp
##.SOLVENT NAME= COFFEE_meoh
##.SHIFT REFERENCE= INTERNAL, COFFEE_meoh, 1, 14.98061
##AUDIT TRAIL= $$ (NUMBER, WHEN, WHO, WHERE, PROCESS, VERSION, WHAT)
$$ ##TITLE= Audit trail, TOPSPIN		Version 2.1
$$ ##JCAMPDX= 5.01
$$ ##ORIGIN= Bruker BioSpin GmbH
$$ ##OWNER= Administrator
$$ $$ Z:/data/jwist/nmr/12-COFFEE-0203/52/pdata/1/auditp.txt
$$ ##AUDIT TRAIL=  $$ (NUMBER, WHEN, WHO, WHERE, PROCESS, VERSION, WHAT)
(   1,<2012-03-02 21:01:56.740 -0500>,<Administrator>,<TOPSPIN>,<go>,<TOPSPIN 2.1>,
      <created by zg
	started at 2012-03-02 20:50:26.521 -0500,
	POWCHK enabled, PULCHK disabled,
       configuration hash MD5:
       1A 1E CE 29 27 FD 77 03 67 4E F0 E3 C4 B2 CB 90
       data hash MD5: 64K
       6A A7 CA 97 D8 21 F2 CA 55 E5 62 A8 F3 78 02 39>)
(   2,<2012-03-02 21:02:03.303 -0500>,<Administrator>,<TOPSPIN>,<audit>,<TOPSPIN 2.1>,
      <user comment:
       ICON-NMR User ID: Administrator
       data hash MD5: 64K
       6A A7 CA 97 D8 21 F2 CA 55 E5 62 A8 F3 78 02 39>)
(   3,<2012-05-29 09:23:59.628 -0700>,<Administrator>,<X>,<proc1d>,<TOPSPIN 2.1>,
      <Start of raw data processing
       efp LB = 0.3 FT_mod = 6 PKNL = 1 PHC0 = 0 PHC1 = 0 SI = 128K 
       data hash MD5: 128K
       38 C4 7C 02 8B 70 5E 55 A8 78 4E 12 F1 F9 19 00>)
(   4,<2012-05-29 09:24:00.159 -0700>,<Administrator>,<X>,<proc1d>,<TOPSPIN 2.1>,
      <pk PHC0 = 37.97974 PHC1 = 0 
       data hash MD5: 128K
       38 19 14 B6 74 3E 0E 52 81 70 C3 C4 FF E8 89 30>)
(   5,<2012-05-29 09:24:02.378 -0700>,<Administrator>,<X>,<proc1d>,<TOPSPIN 2.1>,
      <abs ABSG = 1 
       data hash MD5: 128K
       D9 BE D0 74 14 7C 72 20 CE 89 4C 3A DF 3C 2F 68>)
(   6,<2012-05-29 09:24:02.472 -0700>,<Administrator>,<X>,<proc1d>,<TOPSPIN 2.1>,
      <abs ABSG = 2 
       data hash MD5: 128K
       9A 98 03 F6 5D E9 61 E9 35 59 3B 51 C3 E3 AD 2D>)
(   7,<2012-05-29 09:24:02.565 -0700>,<Administrator>,<X>,<proc1d>,<TOPSPIN 2.1>,
      <abs ABSG = 3 
       data hash MD5: 128K
       A1 8A 1F AB E2 88 16 68 E8 7A 74 1B B8 28 DC AB>)
(   8,<2012-05-29 09:24:02.644 -0700>,<Administrator>,<X>,<proc1d>,<TOPSPIN 2.1>,
      <abs ABSG = 4 
       data hash MD5: 128K
       47 3E 5C E6 75 AF 71 D3 82 34 01 9C 89 66 02 3B>)
(   9,<2012-05-29 09:24:02.722 -0700>,<Administrator>,<X>,<proc1d>,<TOPSPIN 2.1>,
      <abs ABSG = 5 
       data hash MD5: 128K
$$ [...]
150 150 150 150 150 150 150 150
##$TP07= 0
##$TPNAME0= <>
##$TPNAME1= <>
##$TPNAME2= <>
##$TPNAME3= <>
##$TPNAME4= <>
##$TPNAME5= <>
##$TPNAME6= <>
##$TPNAME7= <>
##$TPOAL= (0..7)
0.5 0.5 0.5 0.5 0.5 0.5 0.5 0.5
##$TPOFFS= (0..7)
0 0 0 0 0 0 0 0
##$TUNHIN= 0
##$TUNHOUT= 0
##$TUNXOUT= 0
##$USERA1= <user>
##$USERA2= <user>
##$USERA3= <user>
##$USERA4= <user>
##$USERA5= <user>
##$V9= 5
##$VALIST= <valist>
##$VCLIST= <CCCCCCCCCCCCCCC>
##$VD= 0
##$VDLIST= <DDDDDDDDDDDDDDD>
##$VPLIST= <PPPPPPPPPPPPPPP>
##$VTLIST= <TTTTTTTTTTTTTTT>
##$WBST= 1024
##$WBSW= 4
##$XGAIN= (0..3)
0 0 0 0
##$XL= 0
##$YL= 0
##$YMAX_a= 11471068
##$YMIN_a= -4973537
##$ZGOPTNS= <>
##$ZL1= 120
##$ZL2= 120
##$ZL3= 120
##$ZL4= 120
##$ABSF1= 14.98061
##$ABSF2= -5.57192
##$ABSG= 5
##$ABSL= 3
##$ALPHA= 0
##$AQORDER= 0
##$ASSFAC= 0
##$ASSFACI= 0
##$ASSFACX= 0
##$ASSWID= 0
##$AUNMP= <proc_prof1d_extract>
##$AXLEFT= 0
##$AXNAME= <>
##$AXNUC= <1H>
##$AXRIGHT= 0
##$AXTYPE= 0
##$AXUNIT= <>
##$AZFE= 0.1
##$AZFW= 0.1
##$BCFW= 0
##$BC_mod= 0
##$BYTORDP= 0
##$COROFFS= 0
##$CY= 15
##$DATMOD= 1
##$DC= 0
##$DFILT= <>
##$DTYPP= 0
##$F1P= 0
##$F2P= 0
##$FCOR= 0.5
##$FTSIZE= 131072
##$FT_mod= 6
##$GAMMA= 0
##$GB= 0
##$INTBC= 1
##$INTSCL= 1
##$ISEN= 128
##$LB= 0.3
##$LEV0= 0
##$LPBIN= 0
##$MAXI= 10000
##$MC2= 0
##$MEAN= 0
##$ME_mod= 0
##$MI= 0
##$NCOEF= 0
##$NC_proc= -3
##$NLEV= 6
##$NOISF1= 0
##$NOISF2= 0
##$NSP= 0
##$NTH_PI= 0
##$NZP= 0
##$OFFSET= 14.98061
##$PC= 1
##$PHC0= 37.97974
##$PHC1= 0
##$PH_mod= 1
##$PKNL= yes
##$PPARMOD= 0
##$PPDIAG= 0
##$PPIPTYP= 0
##$PPMPNUM= 2147483647
##$PPRESOL= 1
##$PSCAL= 4
##$PSIGN= 0
##$PYNMP= <proc.py>
##$REVERSE= no
##$SF= 400.13
##$SI= 131072
##$SIGF1= 0
##$SIGF2= 0
##$SINO= 400
##$SIOLD= 131072
##$SPECTYP= <>
##$SREGLST= <1H.CDCl3>
##$SSB= 0
##$STSI= 131072
##$STSR= 0
##$SW_p= 8223.68421052632
##$SYMM= 0
##$S_DEV= 0
##$TDeff= 65536
##$TDoff= 0
##$TI= <>
##$TILT= no
##$TM1= 0
##$TM2= 0
##$TOPLEV= 0
##$USERP1= <user>
##$USERP2= <user>
##$USERP3= <user>
##$USERP4= <user>
##$USERP5= <user>
##$WDW= 1
##$XDIM= 131072
##$YMAX_p= 477878200
##$YMIN_p= -262414392
##$CURPLOT= <Network HP LaserJet P1505>
##$CURPRIN= <$Network HP LaserJet P1505>
##$DFORMAT= <normdp>
##$LAYOUT= <+/1D_H.xwp>
##$LFORMAT= <normlp>
##$PFORMAT= <normpl>
##$SURQMSG= 1
$$ End of Bruker specific parameters
$$ ---------------------------------
##NTUPLES= NMR SPECTRUM
##VAR_NAME=  FREQUENCY,     SPECTRUM/REAL,   SPECTRUM/IMAG
##SYMBOL=    X,             R,               I
##VAR_TYPE=  INDEPENDENT,   DEPENDENT,       DEPENDENT
##VAR_FORM=  AFFN,          ASDF,            ASDF
##VAR_DIM=   131072,        131072,          131072
##UNITS=     HZ,            ARBITRARY UNITS, ARBITRARY UNITS
##FACTOR=    0.0627417313425165, 1,          1
##FIRST=     8223.62146879498, 3885,         -68310
##LAST=      0,             4046,            -67856
##MIN=       0,             -262414392,      0
##MAX=       8223.62146879498, 477878200,    0
$$ Real data points
##PAGE= N=1
##DATA TABLE= (X++(R..R)), XYDATA
$$ [...]
63151G22236L607K902K087K399L738M543L839K545K091K630L417M203N056N381
63137G70674M528L267L250M821O528P127O828O159M888K941J415J539L077M612
63123H31654N133M713L928L365L530M592O153P538Q266Q125P192O048N576O226
63109I12039P676R309J0616J1080J0514R707R793J0591J0517Q886P203P060P728
63096A032719P261N480M236M680N749N763M393K630J524J353J482R42l95j367
63082A076450j064m00r97k481k585m08J844J591p48k464k167j188j332k507l202
63067A058342k695j925k085k905k995j863r30j794l908m943l602j148K34j76j475
63052A026132k606l164l063k279r62N63K075L419M377M755M542L894L211L208
$$ plain form
63151 722236 725843 728745 730832 733231 736969 741512 745351 747896 749987 752617 756034 760237 765293 770674
63137 770674 775202 778469 781719 786540 793068 800195 807023 813182 818070 821011 822426 823965 827042 831654
63123 831654 836787 841500 845428 848793 852323 856915 863068 870606 878872 886997 894189 900237 905813 912039
63109 912039 919715 929024 939640 950720 961234 970941 980734 991325 1001842 1010728 1017931 1024991 1032719
63096 1032719 1039980 1045460 1049696 1054376 1060125 1065888 1070281 1072911 1074435 1075788 1077270 1078212 1077817 1076450
63082 1076450 1075386 1074986 1073989 1071508 1068923 1068515 1070359 1071950 1071202 1068738 1066571 1065383 1064051 1061544 1058342
63067 1058342 1055647 1053722 1051637 1048732 1045737 1043874 1042944 1041150 1037242 1032299 1028697 1027549 1027783 1027607 1026132
63052 1026132 1023526 1020362 1017299 1015020 1014058 1014621 1016696 1020115 1024492 1029247 1033789 1037683 1040894 1044102
63038A044102M379O194P355P254O667O562O772O464N433M294L641L735M722O295
63024A123869P344O828N125L681L182K778J441m87j616j105L40R66l78k846m059
63009A145063k573L47K171K198K131L327M736M396K008r94l284m357l888j884
62995A149397L82R81n21k369k698j538j43Q93J888K797K920K009Q80M92R99K031
62979A158400L357M679N163L998J708K70J314M244O645O735N127L824L685L488
62965A212637J713j354l904m766m621m764n340n368m365l214l221m614o412p586
62951A154821q022q263q653q952q663p434n278k737p82j59o15j081q54k99l9J46
62935A093136J015K627M055M512M140L514K901K371K178K418K629K254J450R10
$$ plain form
63038 1044102 1048481 1054675 1062030 1069284 1075951 1082513 1089285 1095749 1101182 1105476 1109117 1112852 1117574 1123869
63024 1123869 1131213 1138041 1143166 1146847 1150029 1152807 1154248 1153761 1152145 1151040 1151380 1152346 1151968 1149122 1145063
63009 1145063 1142490 1142837 1145008 1147206 1149337 1152664 1157400 1161796 1163804 1162810 1159526 1155169 1151281 1149397
62995 1149397 1149779 1150760 1150239 1147870 1145172 1143634 1143491 1144384 1146272 1149069 1151989 1153998 1154878 1155370 1156369 1158400
62979 1158400 1161757 1166436 1171599 1175597 1177305 1177575 1178889 1183133 1189778 1196513 1201640 1205464 1209149 1212637
62965 1212637 1214350 1212996 1209092 1204326 1199705 1194941 1189601 1184233 1179868 1176654 1173433 1168819 1162407 1154821
62951 1154821 1146799 1138536 1129883 1120931 1112268 1104834 1099556 1096819 1096037 1095878 1095263 1094182 1093328 1093029 1092990 1093136
62935 1093136 1094151 1096778 1100833 1105345 1109485 1112999 1115900 1118271 1120449 1122867 1125496 1127750 1129200 1130110
62921A130110Q72P41q5j358k220k233k052k950n595r267j2457j4354j5533j6986
62907A046633j8723j9806j9716j9182j9371k0499k1710k2144k1740k0862j9580
62896H23300j7837j6073j5048j4770j4225j2667j0771r816r956j0078r367q252
62884F74440p459o942o131m831l387k316k097k806l618l194j092J453K714K058
62870F36792J03k186l932m433l726k844k877l754m527m662m485m540n018n694
62856E84217n977n315m003l188l455l930l551k641k279k556k751k861l528m443
62842E33739m402l186k029j722j513m75J117K351K639J723k21j986k049n21O86
62827E24151L09p86j269j214j306j429j227j055j069l03J909M355N302M832M445
$$ plain form
62921 1130110 1130982 1131723 1131638 1130280 1128060 1125827 1123775 1120825 1115230 1105963 1093506 1079152 1063619 1046633
62907 1046633 1027910 1008104 988388 969206 949835 929336 907626 885482 863742 842880 823300
62896 823300 805463 789390 774342 759572 745347 732680 721909 712093 702137 692059 682692 674440
62884 674440 666981 660039 653908 649077 645690 643374 641277 638471 634853 631659 630567 632020 634734 636792
62870 636792 636895 634709 630777 626344 622618 619774 616897 613143 608616 603954 599469 594929 589911 584217
62856 584217 578240 572925 568922 565734 562279 558349 554798 552157 549878 547322 544571 541710 538182 533739
62842 533739 529337 526151 524122 522400 520887 520412 521529 523880 526519 528242 528021 526035 523986 523465 524151
62827 524151 524460 523674 522405 521191 519885 518456 517229 516174 515105 514802 516711 521066 526368 531200 535645
62812E35645M834N605O681Q361J0181J1200J1363J1122J0076P608M737L357L536
62799F34306L410K224J500K360L554L377K189J690K601M238N616O043N302M149
62785F82559L944M907N544M775L673L929N282N945N208M164L929M422M975N080
62771G48336M374K862J479J454K822M245M686M499M583N131N669N793N339M149
62757H05421K185k53k683m753o175o622n958m595l493l735n851r244j2284j3425
62743G28535j2460j0582r155q663q712q699q302p639p167p152p148o388m902l820
62729F17746m091n215n841n435m700m429m736n511o799q144q385o882m577k964
62715E40037k330j966j778k413l617l856k282J7J536K194K734L130K885K284J944
$$ plain form
62812 535645 540479 546084 552765 561126 571307 582507 593870 604992 615068 622676 627413 630770 634306
62799 634306 637716 639940 641440 643800 647354 650731 652920 654610 657211 661449 667065 673108 678410 682559
62785 682559 686503 691410 696954 701729 705402 709331 714613 720558 725766 729930 733859 738281 743256 748336
62771 748336 752710 755572 757051 758505 761327 765572 770258 774757 779340 784471 790140 795933 801272 805421
62757 805421 807606 807353 804670 799917 793742 787120 781162 776567 773074 769339 763488 754244 741960 728535
62743 728535 716075 705493 696338 687675 678963 670264 661962 654323 647156 640004 632856 626468 621566 617746
62729 617746 613655 608440 602599 597164 592464 588035 583299 577788 570989 562845 554460 547578 543001 540037
62715 540037 537707 535741 533963 531550 527933 524077 521795 521812 523348 525542 528276 531406 534291 536575 538519
62700E38519J526L59q12l63J801L920M831N178N603N496M542L920M488N011L933
62685E87952K086J705L192M696M876M220L427K294Q87J89N39O09q92l354n196
62670F07230o012o620p318p375o353n012m486n098o192o906o999p003p436p770
62656E16650o783m424k690l510o006p141n388k514j006r71q16j95m41j959l001
62641D69805j876P29K733L349L588M441N718O809P687Q706R874J0728J0767J0032
62627E53090R426J0094J2043J3779J4044J3569J4007J5351J5866J4801J3516J3064
62615G12650J2233R389N191J729l51k161m375o518q533j1156j4150j5784j5020
62602F63144j3074j1922j2067j2726j3292j3485j2704j0598q145p079p983r626
$$ plain form
62700 538519 540045 540404 539592 539229 541030 544950 549781 554959 560562 566058 570600 574520 579008 584019 587952
62685 587952 590038 591743 594935 599631 604507 608727 612154 614448 615335 615524 616063 616672 615780 612426 607230
62670 607230 601218 594598 587280 579905 573552 568540 564054 558956 552764 545858 538859 531856 524420 516650
62656 516650 509867 505443 502753 499243 493237 486096 480708 478194 477188 476217 475401 475206 474765 472806 469805
62641 469805 467929 468658 471391 474740 478328 482769 488487 495296 502983 511689 521563 532291 543058 553090
62627 553090 562516 572610 584653 598432 612476 626045 640052 655403 671269 686070 699586 712650
62615 712650 724883 734272 739463 741192 740841 738680 734305 727787 719254 708098 693948 678164 663144
62602 663144 650070 638148 626081 613355 600063 586578 573874 563276 555131 548052 540069 530443
62590E30443j0282r239p046m926l955m332n208n487m866l837k916k196j583r89
62576D63581l34K52L19k99p90K7K139M068M550M007L662L619K748P04r71n07J778
62559D88553L745M011L403L419M152M519M063L442L120K727K082J979L084M620
62545E36919N079M117L005L106M491O282P860R341J1015J2679J3706J3732J3020
62532F44352J2045J0882R433Q201Q138R469J1127J1833J1349J0236Q895P488O420
62519G69868N996N700M714L209K236K176K178J477M13m48j359k797m381n389n935
62504G77658o665p377p090n636m244m043m802n690o561p626q419q200p403p595
62490F86307r544j2007j3027j2066j0374r465r781j0632j0966j0168q603p427
$$ plain form
62590 530443 520161 510922 503876 498950 494995 490663 485455 479968 475102 471265 468349 466153 464570 463581
62576 463581 463247 463499 463818 463519 462729 462756 464895 468963 473513 477520 481182 484801 487549 488253 487282 486775 488553
62559 488553 492298 496309 499712 503131 507283 511802 515865 519307 522427 525154 527236 529215 532299 536919
62545 536919 541998 546115 549120 552226 556717 562999 570859 580200 591215 603894 617600 631332 644352
62532 644352 656397 667279 676712 684913 693051 702520 713647 725480 736829 747065 755960 763448 769868
62519 769868 775864 781564 786278 789487 791723 793899 796077 797554 797967 797519 796160 793363 788982 783593 777658
62504 777658 770993 763616 756526 750890 746646 742603 737801 732111 725550 717924 709505 701305 693902 686307
62490 686307 676763 664756 651729 639663 629289 619824 610043 599411 588445 578277 569674 562247
62478E62247p459q127p970o369m384l494l914m522m356l693l580m552n906o239
62464D87682m815k496j108j611l035l510k290l52R54J378J656K296K981L217L131
62449D84078L340M154N236O188P092Q175R166R460R009Q618R108J0391J1583J1837
62435E97435J0992R680Q885R063R512Q945P032N000M230M482M039J589k340n755
62421F72789o707m796j658J65n15k355l029j929p34j330l769o533q081p759n829
62406F17930l326j642j532k395k943k625j985j610j193o7J566K601K363J517J145
62391F07804J272J037L54M18K033M171N050M367L513L706M712N495N318L987J747
62376F54984o39k275k928l098l007k183n08R12P48p56j749q46J227K470K060J437
$$ plain form
62478 562247 554788 546661 538691 532322 527938 524444 520530 516008 511652 507959 504379 499827 493921 487682
62464 487682 482867 480371 479263 477652 474617 471107 468817 468465 469419 470797 472453 474749 477730 480947 484078
62449 484078 487418 491572 496808 502996 510088 518263 527429 536889 545898 554516 563624 574015 585598 597435
62435 597435 608427 618107 626992 636055 645567 654512 661544 666544 670774 675256 679295 680884 678544 672789
62421 672789 666082 661286 659628 659793 659278 656923 653894 651965 651231 649901 646132 639599 631518 623759 617930
62406 617930 614604 612962 611430 609035 606092 603467 601482 599872 598679 598612 600178 602779 605142 606659 607804
62391 607804 609076 610113 610467 610885 612918 617089 622139 626506 630019 633725 638437 643932 649250 653237 654984
62376 654984 654345 652070 649142 646044 643037 640854 640346 641258 642006 641250 639501 638655 639882 642352 644412 645849
62360F45849K548N272P264O632M219K692L719O656R636J1363J1943J2625J4533
62347G44951J7206J8738J8083J6655J6646J8195J9579J9832J9514J8990J7955
62336I46344J7031J7606J9181J8952J5690J2106J1392J2804J2999J0849Q377P268
62324A110599O940O387N733N287M755M213M403N422O355O884Q036J0518J3525
62311A199057J6174J9133K3620K9429L5049L9497M3095M6544N0059N3570N7219
62300A612446O1468O6752P2925P8983Q3463Q5352Q4540Q1457P6461O9498O0218
62289B433563M8621L5770K3381J2290J738r218k0186l0162l9068m7221n3730n7224
62277B298554n8371n9797o2713o5168o4681o1402n7512n4425n1940m9402m6389
$$ plain form
62360 645849 648397 653669 660933 667565 671784 674476 678195 684851 694487 705850 717793 730418 744951
62347 744951 762157 780895 798978 815633 832279 850474 870053 889885 909399 928389 946344
62336 946344 963375 980981 1000162 1019114 1034804 1046910 1058302 1071106 1084105 1094954 1103331 1110599
62324 1110599 1117539 1123926 1129659 1134946 1139701 1143914 1148317 1153739 1160094 1166978 1175014 1185532 1199057
62311 1199057 1215231 1234364 1257984 1287413 1322462 1361959 1405054 1451598 1501657 1555227 1612446
62300 1612446 1673914 1740666 1813591 1892574 1976037 2061389 2145929 2227386 2303847 2373345 2433563
62289 2433563 2482184 2517954 2541335 2553625 2555363 2546145 2525959 2495797 2456729 2409508 2355778 2298554
62277 2298554 2240183 2180386 2117673 2052505 1987824 1926422 1868910 1814485 1762545 1713143 1666754
62266A666754m2588l8274l4707l2912l2091l0268k6615k2254j8581j5736j3057
62255A359671j0306p786n584l294o48J861L233K929J483J07l20K43J216J869J775
62240A346449J200Q79R95P32n61k077k352j326n21r57j922k159j332K14K298M831
62224A344391P479R943J2056J3361J3309J2216J1304J1458J2681J4913J8228K1895
62212A503234K4638K6469K8955L2787L6560L9031M1208M4735M9438N4119N8720
62201A939894O3833O8888P2692P5395P8038Q0633Q2356Q3193Q3471Q2097P7396
62190B787886O9603O0473N0482L8706K5732J4115N154k620j0595j7810k2944k6811
62178B971371l1143l6020m0064m2341m2722m1159l7939l4169l0879k7909k4520
$$ plain form
62266 1666754 1624166 1585892 1551185 1518273 1486182 1455914 1429299 1407045 1388464 1372728 1359671
62255 1359671 1349365 1341579 1335995 1332701 1332053 1333914 1337147 1340076 1341559 1341666 1341346 1341589 1342805 1344674 1346449
62240 1346449 1347649 1348528 1349523 1350255 1349694 1347617 1345265 1343939 1343418 1342461 1340539 1338380 1337048 1337262 1339560 1344391
62224 1344391 1351870 1361813 1373869 1387230 1400539 1412755 1424059 1435517 1448198 1463111 1481339 1503234
62212 1503234 1527872 1554341 1583296 1616083 1652643 1691674 1732882 1777617 1827055 1881174 1939894
62201 1939894 2003727 2072615 2145307 2220702 2298740 2379373 2461729 2544922 2628393 2710490 2787886
62190 2787886 2857489 2917962 2968444 3007150 3032882 3046997 3052151 3049531 3038936 3021126 2998182 2971371
62178 2971371 2940228 2904208 2864144 2821803 2779081 2737922 2699983 2665814 2634935 2607026 2582506
62167B582506k0553j6390j2385r025o939n976m887k681M38L937P705J1157J2843
62154B539750J2216J1041J1651J4398J7821K0618K2292K2665K2260K2660K4926
62143B742298K7985K9926L0527L1120L2291L3469L4623L6705M0108M4172M8361
62132C131585N2582N6260N8761O0933O4409O8834P1723P1876P1061P1084P0956
62121C850064O8780O5027O1762N9423N6667N3272N1131N1945N5444O0337O5661
62110D499513P0715P4941P8609Q2729Q7606R2276R5761R7857R8184R5656R0043
62099E463890Q3146P7067P1810O5939N9198N2813M7148M0929L3507K6509K1964
62088F043920J9658J7710J5302J3565J3698J5258J6742J7199J6984J7237J8771
$$ plain form
62167 2582506 2561953 2545563 2533178 2524153 2517214 2511238 2506351 2503670 2504108 2508045 2515750 2526907 2539750
62154 2539750 2551966 2563007 2574658 2589056 2606877 2627495 2649787 2672452 2694712 2717372 2742298
62143 2742298 2770283 2800209 2830736 2861856 2894147 2927616 2962239 2998944 3039052 3083224 3131585
62132 3131585 3184167 3240427 3299188 3360121 3424530 3493364 3565087 3636963 3708024 3779108 3850064
62121 3850064 3918844 3983871 4045633 4105056 4161723 4214995 4266126 4318071 4373515 4433852 4499513
62110 4499513 4570228 4645169 4723778 4806507 4894113 4986389 5082150 5180007 5278191 5373847 5463890
62099 5463890 5547036 5624103 5695913 5761852 5821050 5873863 5921011 5961940 5995447 6021956 6043920
62088 6043920 6063578 6081288 6096590 6110155 6123853 6139111 6155853 6173052 6190036 6207273 6226044
62077F226044K1230K3370K4429K5082K6580K9116L1615L3054L3395L3259L3331
62066F540505L4167L5801L7303L7488L6469L5801L6617L8137L8667L7644L6050
62055F944649L4939L4248L3144L1225K9242K8402K8716K8280K5074J9702J5369
62044G252990J4366J5403J5463J3739J2305J2850J4263J4224J2267J0181R674
62033G397725J0533J1322J1298J1198J2152J4289J6667J8545K0280K2751K6145
62022G572905K9655L2308L3777L4465L5010L5673L6038L5342L3252L0144K6587
62011G935156K2934J9735J7976J8137J9230J9579J8691J7542J6811J5691J2999
62000H134481Q802M076r79p408j6254k7454m0177n3591o6882p8815q8027r3934
$$ plain form
62077 6226044 6247274 6270644 6295073 6320155 6346735 6375851 6407466 6440520 6473915 6507174 6540505
62066 6540505 6574672 6610473 6647776 6685264 6721733 6757534 6794151 6832288 6870955 6908599 6944649
62055 6944649 6979588 7013836 7046980 7078205 7107447 7135849 7164565 7192845 7217919 7237621 7252990
62044 7252990 7267356 7282759 7298222 7311961 7324266 7337116 7351379 7365603 7377870 7388051 7397725
62033 7397725 7408258 7419580 7430878 7442076 7454228 7468517 7485184 7503729 7524009 7546760 7572905
62022 7572905 7602560 7634868 7668645 7703110 7738120 7773793 7809831 7845173 7878425 7908569 7935156
62011 7935156 7958090 7977825 7995801 8013938 8033168 8052747 8071438 8088980 8105791 8121482 8134481
62000 8134481 8143283 8147359 8146380 8138972 8122718 8095264 8055087 8001496 7934614 7855799 7767772 7673838
61988G673838r7339r9998j03608j08940j15630j22646j28951j33849j36774j37147
61978F488956j34810j30585j25887j21458j16795j11197j05123r9882r6020r2591
61968E354608q8414q3517p9009p5789p3880p2852p2335p1987p1363p0015o7669
61957D527778o4351o0578n7386n5661n5216n4750n3045n0055m6662m3680m1382
61946C945012l9882l9202l8807l7552l4608l0349k6094k3161k2280k3536k6325
61935C603216k9695l3238l7504m2946m8810n3922n8425o3394o8524p1637p1375
61924C023746o9158o7311o6101o4135o1007n7860n5435n3230n0846m8666m6749
61913B383248m4406m1462l8750l6733l4775l2572l1017l0587k9916k7472k4001
$$ plain form
61988 7673838 7576499 7476501 7372893 7263953 7148323 7025677 6896726 6762877 6626103 6488956
61978 6488956 6354146 6223561 6097674 5976216 5859421 5748224 5643101 5543219 5447199 5354608
61968 5354608 5266194 5182677 5103668 5027879 4953999 4881147 4808812 4736825 4665462 4595447 4527778
61957 4527778 4463427 4402849 4345463 4289802 4234586 4179836 4126791 4076736 4030074 3986394 3945012
61946 3945012 3905130 3865928 3827121 3789569 3754961 3724612 3698518 3675357 3653077 3629541 3603216
61935 3603216 3573521 3540283 3502779 3459833 3411023 3357101 3298676 3235282 3166758 3095121 3023746
61924 3023746 2954588 2887277 2821176 2757041 2696034 2638174 2582739 2529509 2478663 2429997 2383248
61913 2383248 2338842 2297380 2258630 2221897 2187122 2154550 2123533 2092946 2063030 2035558 2011557
61902B011557k1621k0779j9746j7401j5000j4251j4671j4063j1297p598m890l538
61890A846702k200M53M341Q220J0950J2463J3828J6322J9959K3023K3869K3346
61878B001276K4321K8061L2278L4026L3620L3881L6014L8422L9739M0791M2616
61867B385045M4445M4966M4344M3732M3790M4808M7290N1285N6068O1503O8730
61856B936006P8266Q8616R8303J08281J20445J34441J48154J61173J75670J93512
61846D242867K14151K35890K57712K79393L01094L23370L46517L69229L88696
61837F958919M02288M08128M03700L85115L48747K93299K20269J33476L8886n5931
61827I536896j43547k18671k79051l24966l57808l78687l88352l88541l82476
$$ plain form
61902 2011557 1989936 1969157 1949411 1932010 1917010 1902759 1888088 1874025 1862728 1855130 1850240 1846702
61890 1846702 1844502 1844955 1849296 1857516 1868466 1880929 1894757 1911079 1931038 1954061 1977930 2001276
61878 2001276 2025597 2053658 2085936 2119962 2153582 2187463 2223477 2261899 2301638 2342429 2385045
61867 2385045 2429490 2474456 2518800 2562532 2606322 2651130 2698420 2749705 2805773 2867276 2936006
61856 2936006 3014272 3102888 3201191 3309472 3429917 3564358 3712512 3873685 4049355 4242867
61846 4242867 4457018 4692908 4950620 5230013 5531107 5854477 6200994 6570223 6958919
61837 6958919 7361207 7769335 8173035 8558150 8906897 9200196 9420465 9553941 9592827 9536896
61827 9536896 9393349 9174678 8895627 8570661 8212853 7834166 7445814 7057273 6674797
61818F674797l72961l60366l43675l23383l01989k81531k61926k42204k22166
61809C964596k02328j83268j65607j49794j35320j20904j06054r1875p9794o9996
61799B659656o1384n2600m2966l3079k4539j8353j3558q334k465K512N832Q674
61787B419396J2100J5124J5979J4451J1890R418P095M532J531j710m525o133o301
61774B492847n376l598j024J802M042N595P106Q659R587R839J0240J0699R562
61761B559980N731L37m697q622j1439j2798j2814j3015j4671j6691j6773j4313
61749B440215j0639o759k498K152O577J0728J5413K0907K6439L1518L6734M2730
61737B613517M9215N5566O1736O8138P5003Q2320R0080R8378J07424J17516J28729
$$ plain form
61818 6674797 6301836 5941470 5597795 5274412 4972423 4690892 4428966 4186762 3964596
61809 3964596 3762268 3579000 3413393 3263599 3128279 3007375 2901321 2809446 2729652 2659656
61799 2659656 2598272 2545672 2502706 2469627 2445088 2426735 2413177 2404843 2402378 2404890 2410722 2419396
61787 2419396 2431496 2446620 2462599 2477050 2488940 2498358 2505453 2509985 2511516 2509806 2505281 2499148 2492847
61774 2492847 2487471 2483873 2482849 2484651 2488693 2494288 2501394 2510053 2519640 2529479 2539719 2550418 2559980
61761 2559980 2565711 2566048 2561351 2552729 2541290 2528492 2515678 2502663 2487992 2471301 2454528 2440215
61749 2440215 2429576 2422817 2420319 2422471 2429048 2439776 2455189 2476096 2502535 2534053 2570787 2613517
61737 2613517 2662732 2718298 2780034 2848172 2923175 3005495 3095575 3193953 3301377 3418893 3547622
61726C547622J40863J53914J68251J83882K00200K17288K36901K61037K89555
61717E399513L20302L51767L84683M20798M60915N04321N49338N94056O37042
61708I622735O77343P13018P39496P49957P37519O96646O23369N16372L79203
61699A5455658K20617N1885j15917k72218m07018n13374n90302o41875o72974
61690A2514482o86545o84761o71012o49197o21739n89834n55531n21818m89842
61681G044203m57612m23038l87457l54396l25210k98206k72224k48537k28021
61672D049502k08766j88678j68953j52454j39504j27858j16383j06130r7585q9620
61662B653571q1959p6269p3424p1806o9667o7427o5969o4332o1212n7547n5297
$$ plain form
61726 3547622 3688485 3842399 4010650 4194532 4394732 4612020 4848921 5109958 5399513
61717 5399513 5719815 6071582 6456265 6877063 7337978 7842299 8391637 8985693 9622735
61708 9622735 10300078 11013096 11752592 12502549 13240068 13936714 14560083 15076455 15455658
61699 15455658 15676275 15728160 15612243 15340025 14933007 14419633 13829331 13187456 12514482
61690 12514482 11827937 11143176 10472164 9822967 9201228 8611394 8055863 7534045 7044203
61681 7044203 6586591 6163553 5776096 5421700 5096490 4798284 4526060 4277523 4049502
61672 4049502 3840736 3652058 3483105 3330651 3191147 3063289 2946906 2840776 2743191 2653571
61662 2653571 2571612 2495343 2421919 2350113 2280446 2213019 2147050 2082718 2021506 1963959 1908662
61651A908662n4319n2662m9756m6993m5036m2778l9615l6765l5162l3664l0827
61640A441085k7422k5508k5462k5492k4176k2164k1024k1272k2154k2691k2428
61629A181292k1445k0257j9480j9153j8498j6848j4770j3583j3638j3698j2629
61618I97293j1147j0937j2200j3100j2143j0096q712q083o632l794j437j653l884
61605H93475n448m739k822j570j437j817k657m274n965o317n236m391m826n199
61591H36777l499J36L434M708M391L839L563L167K324J366R77J511K421K625J808
61576H69548J027J408K456K687J987K111M311P407R082Q538O982N926N769N932
61562I35171N572M182J923n90l176o323j0075j3175j4247j3644j3074j3354j3554
$$ plain form
61651 1908662 1854343 1801681 1751925 1704932 1659896 1617118 1577503 1540738 1505576 1471912 1441085
61640 1441085 1413663 1388155 1362693 1337201 1313025 1290861 1269837 1248565 1226411 1203720 1181292
61629 1181292 1159847 1139590 1120110 1100957 1082459 1065611 1050841 1037258 1023620 1009922 997293
61618 997293 986146 975209 963009 949909 937766 927670 918958 910875 904243 900449 899012 897359 893475
61605 893475 888027 883288 880466 878896 877459 875642 872985 868711 862746 856429 851193 846802 841976 836777
61591 836777 833278 833414 836848 841556 845947 849786 853349 856516 858840 860206 861183 862694 865115 867740 869548
61576 869548 870575 871983 874439 877126 879113 881224 885535 892942 902024 910562 917544 923470 929239 935171
61562 935171 940743 944925 946848 946258 943082 936759 926684 913509 899262 885618 872544 859190 845636
61549H45636j2678j1110r806q957q304q011q179q003o595m520l298l293l237k191
61535G47454q33q7M78J757L307L775L019K653M112P012R747J1159J1241J0744
61521H15538J0447J0596J0755J0424R818R721J0565J2029J3642J5223J6598J7454
61509I62810J7891J8601K0153K2295K4249K5398K5613K5263K5066K5436K5749
61498A218524K4849K2541K0040J8486J7608J6337J4195J1552R068P508P592R198
61486A397498J0977J1422J0057P246L502j79k154j687m26r30l580o178o891o328
61472A412349o072o249n614l457m72K241M338O248Q426J0872J3413J6244J9790
61459A472057K4025K8312L2329L6592M1561M6708N1356N6109O2423P0668P9620
$$ plain form
61549 845636 832958 821848 812042 803085 794781 786770 778591 770588 763993 759473 756175 752882 749645 747454
61535 747454 746621 746534 747012 748769 752076 755851 758870 761523 765635 772647 782394 793553 804794 815538
61521 815538 825985 836581 847336 857760 867578 877299 887864 899893 913535 928758 945356 962810
61509 962810 980701 999302 1019455 1041750 1065999 1091397 1117010 1142273 1167339 1192775 1218524
61498 1218524 1243373 1265914 1285954 1304440 1322048 1338385 1352580 1364132 1373200 1380708 1388300 1397498
61486 1397498 1408475 1419897 1429954 1437200 1440702 1440523 1438369 1436682 1436256 1435326 1431746 1425568 1418677 1412349
61472 1412349 1406277 1400028 1394414 1390957 1390485 1392726 1397064 1403312 1411738 1422610 1436023 1452267 1472057
61459 1472057 1496082 1524394 1556723 1593315 1634876 1681584 1732940 1789049 1851472 1922140 2001760
61448B001760Q8085R6202J04759J14023J23673J33312J42462J50368J56250J59641
61438C270535J60327J58104J52421J41986J25255J02205P5496M8809K3756o46
61428D258248k5142m8064o6691p9905q8628r4124r6865r6987r5089r2310q9531
61417C384912q6431q1593p4217o5589n7926n1592m4675l5939k6908j9920j4994
61406B825128j0029l728L170R507J5202K0660K5690K9673L2326L3868L4719L5370
61394C051556L6224L7253L8005L8197L8294L9196M1160M3214M3925M2993M1704
61383C491721M1303M1245L9792L6390L2405K9171K6310K2773J8635J4890J1865
61372C806500R002N914K568j336n987j0379j2931j3536j3946j5556j7785j9340
$$ plain form
61448 2001760 2089845 2186047 2290806 2404829 2528502 2661814 2804276 2954644 3110894 3270535
61438 3270535 3430862 3588966 3741387 3883373 4008628 4110833 4186329 4235138 4258894 4258248
61428 4258248 4233106 4185042 4118351 4038446 3949818 3855694 3758829 3661842 3566753 3474443 3384912
61417 3384912 3298481 3216888 3142671 3077082 3019156 2967564 2922889 2886950 2860042 2840122 2825128
61406 2825128 2815099 2811371 2814541 2824048 2839250 2859910 2885600 2915273 2947599 2981467 3016186 3051556
61394 3051556 3087780 3125033 3163038 3201235 3239529 3278725 3319885 3363099 3407024 3450017 3491721
61383 3491721 3533024 3574269 3614061 3650451 3682856 3712027 3738337 3761110 3779745 3794635 3806500
61372 3806500 3815502 3821416 3823984 3822648 3816661 3806282 3793351 3779815 3765869 3750313 3732528 3713188
61360C713188k0073k0610k0871k0336j9438j9355k0044j9716j6953j2693r359
61349C513740q248q500q538p919p507q221r997j2008j3605j4712j5148j4040j0572
61336C374725n387l82L417P265J3246K1636L0688L8942M6837N5843O6754P9270
61324C732854R2507J05469J17509J28878J40280J51449J60712J66580J69109J68954
61314E134301J65539J57099J42357J21540R6058O7918L9194J1259j5481m0643
61304E879141o3148q2220r8456j12948j25734j36274j44875j52027j56573j56532
61294D650354j52307j47209j43746j40699j35058j25893j15132j05109r6553q8655
61284C399993q0315p1256o2331n4490m7436l9978l1887k4461j8873j4953j2093
$$ plain form
61360 3713188 3693115 3672505 3651634 3631298 3611860 3592505 3572461 3552745 3535792 3523099 3513740
61349 3513740 3505492 3496992 3488454 3480535 3473028 3464807 3454810 3442802 3429197 3414485 3399337 3385297 3374725
61336 3374725 3369338 3368956 3372373 3379638 3392884 3414520 3445208 3484150 3530987 3586830 3653584 3732854
61324 3732854 3825361 3930830 4048339 4177217 4317497 4468946 4629658 4796238 4965347 5134301
61314 5134301 5299840 5456939 5599296 5720836 5816894 5884812 5924006 5935265 5919784 5879141
61304 5879141 5815993 5733773 5635317 5522369 5396635 5260361 5115486 4963459 4806886 4650354
61294 4650354 4498047 4350838 4207092 4066393 3931335 3805442 3690310 3585201 3488648 3399993
61284 3399993 3319678 3248422 3186091 3131601 3084165 3044187 3012300 2987839 2968966 2954013 2941920
61273B941920j0121q463n624q15M662Q958J1970J4827J7694J9631K0397K0788
61261C035824K1041K0410J8738J7149J6466J5829J3778J0210O549M094K764J575
61249C184427K8j295j660j357j386k001k295j694j075j677l413n035n586m986
61235C150995l572k019j569l323p107j1715j6249k0557k4445k7421k9409l0977
61223B972632l2369l2830l1282k7589k3001j9464j8222j8682j8854j7318j4656
61212B718365j2392j0948r376o948l993j026J995N157Q153J0920J4181J8668K4017
61199B756773K8951L2536L5001L7373M0449M4269M8476N3149N8884O5854P3051
61188C274766P8756Q1643Q1142P7062O9396N8485M4803K8545R841j0500l0803
$$ plain form
61273 2941920 2931799 2923336 2917712 2916897 2921559 2930517 2942487 2957314 2975008 2994639 3015036 3035824
61261 3035824 3056865 3077275 3096013 3113162 3129628 3145457 3159235 3169445 3175994 3180088 3182852 3184427
61249 3184427 3184455 3183160 3181500 3180143 3178757 3176756 3174461 3172767 3171692 3170015 3166602 3161567 3155981 3150995
61235 3150995 3147423 3145404 3143835 3140512 3133405 3121690 3105441 3084884 3060439 3033018 3003609 2972632
61223 2972632 2940263 2907433 2876151 2848562 2825561 2806097 2787875 2769193 2750339 2733021 2718365
61212 2718365 2705973 2695025 2685649 2678701 2674708 2673682 2675677 2680834 2688987 2699907 2714088 2732756 2756773
61199 2756773 2785724 2818260 2853261 2890634 2931083 2975352 3023828 3076977 3135861 3201715 3274766
61188 3274766 3353522 3435165 3516307 3593369 3662765 3721250 3766053 3794598 3804439 3793939 3763136
61177C763136m9186o4315p5745q3833q9296r2596r3854r3366r1725q9033q4625
61166B855562p8303p1380o5626o1386n7670n3983n0782m8042m4557l9383l3237
61155B251213k7740k3757k1032j8961j7109j5208j3302j1716j0457q769n805j784
61143B075573K033M629O151P357Q454Q877Q282P302O895P123P034N951M477L911
61129B164049M893O923Q984J0362J0976J1222J1369J1036R447O295J943l366r860
61116B244273j7250k4018k8512l0552l1314l1870l2669l4119l6603l9577m1582
61105A896207m1635m0226l8613l7539l6907l6315l5541l4624l3628l2264k9914
61094A499001k6454k2882k0537j9488j8263j5495j1410p301l890p87K555N967
$$ plain form
61177 3763136 3713950 3649635 3573890 3490057 3400761 3308165 3214311 3120945 3029220 2940187 2855562
61166 2855562 2777259 2705879 2640253 2578867 2521197 2467214 2416432 2368390 2323833 2284450 2251213
61155 2251213 2223473 2199716 2178684 2159723 2142614 2127406 2114104 2102388 2091931 2083162 2077357 2075573
61143 2075573 2077606 2082235 2088386 2095743 2104197 2113074 2121356 2128658 2135553 2142676 2149710 2155661 2160138 2164049
61129 2164049 2168942 2175865 2184849 2195211 2206187 2217409 2228778 2239814 2249261 2255556 2257499 2254133 2244273
61116 2244273 2227023 2203005 2174493 2143941 2112627 2080757 2048088 2013969 1977366 1937789 1896207
61105 1896207 1854572 1814346 1775733 1738194 1701287 1664972 1629431 1594807 1561179 1528915 1499001
61094 1499001 1472547 1449665 1429128 1409640 1391377 1375882 1364472 1357171 1353281 1352494 1355049 1361016
61082A361016Q951J1546J4301J7336J9787K0584J9543J7323J4417J0711O172J393
61070A523080k781n809p436p548o433m861l634l097l222l754m290m583m855n272
61056A455505n268m251l014l243n173o931o916n808n171n137m691l617k666k165
61042A391454j648p25N89K138L393L416K129J075J786L692M817M067J596k428
61028A415351p713j2660j5228j5295j4690j4662j4806j4748j5150j6170j6490
61017A257739j4924j2153r900q968q857q760q321p627o752n319k844P3J596Q13
61003A165796n90l89Q65N52j869l691k743k99J063R21P31J323K372L683N477P532
60987A180734R146R850R511Q182O494N701O572Q633J0969J3140J4786J5212J4426
$$ plain form
61082 1361016 1369967 1381513 1395814 1413150 1432937 1453521 1473064 1490387 1504804 1515515 1521687 1523080
61070 1523080 1520299 1514490 1507054 1499506 1493073 1488212 1484578 1481481 1478259 1474505 1470215 1465632 1460777 1455505
61056 1455505 1450237 1445986 1442972 1439729 1434556 1427625 1420709 1414901 1409730 1404593 1399902 1396285 1393619 1391454
61042 1391454 1389806 1389081 1389670 1391808 1395201 1398617 1400746 1401821 1403607 1407299 1412116 1416183 1417779 1415351
61028 1415351 1407638 1394978 1379750 1364455 1349765 1335103 1320297 1305549 1290399 1274229 1257739
61017 1257739 1242815 1230662 1220762 1211794 1202937 1194177 1185856 1178229 1171477 1166158 1163314 1163387 1164983 1165796
61003 1165796 1165206 1164817 1165682 1166234 1164365 1160674 1157931 1157632 1158695 1159616 1160347 1161670 1164042 1167725 1173202 1180734
60987 1180734 1189880 1199730 1209241 1217423 1223917 1229618 1236190 1244823 1255792 1268932 1283718 1298930 1313356
60974A313356J3785J4545J6213J7328J7435J7167J6869J6402J6161J6812J7883
60963A493956J7862J6210J4206J3133J2539J1237R354Q197Q229Q449Q118P991
60951A629481R037J0760J1917J2491J3678J5944J8439K0485K2349K4174K5645
60940A814400K7320L0784L6369M2136M6463N0407N5889O2627O8687P3386P7809
60929B386277Q2924Q8894R5854J03723J11718J19586J28557J39298J49803J57532
60919C564166J62988J68889J76403J84821J94253K05564K17857K29248K40448
60910E344637K54275K71129K88166L03773L19608L37297L56332L76580L99836
60901H251633M27559M59786M97408N42278N93839O49121P07641P73336Q50628
$$ plain form
60974 1313356 1327141 1341686 1357899 1375227 1392662 1409829 1426698 1443100 1459261 1476073 1493956
60963 1493956 1511818 1528028 1542234 1555367 1567906 1579143 1588497 1596694 1604923 1613372 1621490 1629481
60951 1629481 1638518 1649278 1661195 1673686 1687364 1703308 1721747 1742232 1764581 1788755 1814400
60940 1814400 1841720 1872504 1908873 1951009 1997472 2047879 2103768 2166395 2235082 2308468 2386277
60929 2386277 2469201 2558095 2653949 2757672 2869390 2988976 3117533 3256831 3406634 3564166
60919 3564166 3727154 3896043 4072446 4257267 4451520 4657084 4874941 5104189 5344637
60910 5344637 5598912 5870041 6158207 6461980 6781588 7118885 7475217 7851797 8251633
60901 8251633 8679192 9138978 9636386 10178664 10772503 11421624 12129265 12902601 13753229
60892A3753229R42460J053138J188081J348862J534053J747502J999256K294941
60884B5861522K632200L013403L453010L963572M541665N172689N823008O386574
60876F0847643O641674O326339N333082L854141K309415J101463M20569K45225
60868H7079551M51715Q59061J190525J099000L40018j038894k695672m201515
60860H3083789n271622n839603n981895n819259n470810n038948m593582m166605
60852D0901465l768553l406764l085066k796923k530468k279077k042530j821667
60844A9170417j617561j433362j271559j130506j007057r00488q10213p31895
60836A0267776o60041n93170n32968m79738m32425l92051l61011l38896l21932
$$ plain form
60892 13753229 14695689 15748827 16936908 18285770 19819823 21567325 23566581 25861522
60884 25861522 28493722 31507125 34960135 38923707 43465372 48638061 54461069 60847643
60876 60847643 67489317 73815656 79148738 83002879 85312294 86413757 86834326 87079551
60868 87079551 87531266 88390327 89580852 90679852 91019870 89980976 87285304 83083789
60860 83083789 77812167 71972564 65990669 60171410 54700600 49661652 45068070 40901465
60852 40901465 37132912 33726148 30641082 27844159 25313691 23034614 20992084 19170417
60844 19170417 17552856 16119494 14847935 13717429 12710372 11809884 10999671 10267776
60836 10267776 9607735 9014565 8481597 8001859 7569434 7177383 6816372 6477476 6155544
60827F155544l06710k92090k77633k62551k46563k30134k13827j98409j85008
60818C942619j73915j64054j54642j46250j39011j31381j22226j12744j04548
60809B693848r7328r0257q4125p9765p5768p0267o4021n9178n5886n2571m8852
60798A915830m5641m2905l9786l6592l4257l2203k9175k5897k4403k4695k4571
60787A555705k2979k1257k0594k0381j9590j8129j6373j4767j4170j5142j6861
60776A355462j8029j8570j9004j8820j7349j5671j5370j5776j4915j2940j1882
60765A177136j1932j0978q416o416o311o461n058k619k87K018M232N210M818M816
60751A139752N847N776L231O63J144L783N414N575O498Q696J0053R614R161J0009
$$ plain form
60827 6155544 5848834 5556744 5279111 5016560 4769997 4539863 4326036 4127627 3942619
60818 3942619 3768704 3604650 3450008 3303758 3164747 3033366 2911140 2798396 2693848
60809 2693848 2596520 2506263 2422138 2342373 2266605 2196338 2132317 2073139 2017253 1964682 1915830
60798 1915830 1870189 1827284 1787498 1750906 1716649 1684446 1655271 1629374 1604971 1580276 1555705
60787 1555705 1532726 1511469 1490875 1470494 1450904 1432775 1416402 1401635 1387465 1372323 1355462
60776 1355462 1337433 1318863 1299859 1281039 1263690 1248019 1232649 1216873 1201958 1189018 1177136
60765 1177136 1165204 1154226 1145810 1139394 1133083 1126622 1121564 1118945 1118658 1120676 1124908 1130118 1134936 1139752
60751 1139752 1145599 1151375 1154606 1155269 1156413 1160196 1165610 1171185 1177683 1186379 1196432 1206046 1215207 1225216
60737A225216J0881J0319R152R053J0083J1194J2106J3160J3999J3668J1707Q291
60725A358829L798r32m505o180o799p615q572q802q422q438q880q559p200o303
60711A271420p002q216q274p429p240p868p801o417n127n283o336o948o820o380
60697A174279n476l642j282N42J254R28k80j833k327n61K834N863P419Q082Q675
60682A194475R085Q881Q001O416M055J543R6k6j24j363l224m531n277o307p603
60667A204097q342q630r770j2279j4792j5713j5258j4948j5458j5909j5222j3408
60655A044368j1406j0212j0282j1286j2266j2424j1914j1480j1371j1168j0819
60644I19740j0998j1998j3076j3516j3571j3566j2850j0925q911q381q931q635
$$ plain form
60737 1225216 1236097 1246416 1255568 1264621 1274704 1285898 1298004 1311164 1325163 1338831 1350538 1358829
60725 1358829 1362627 1361695 1357190 1351010 1344211 1336596 1328024 1319222 1310800 1302362 1293482 1284923 1277723 1271420
60711 1271420 1264418 1256202 1247928 1240499 1233259 1225391 1217590 1211173 1206046 1200763 1194427 1187479 1180659 1174279
60697 1174279 1168803 1165161 1163879 1164421 1165675 1166603 1166323 1164490 1162163 1161602 1164436 1170299 1177718 1185800 1194475
60682 1194475 1203560 1212441 1220442 1226858 1230913 1232456 1232552 1232526 1232402 1231039 1227815 1223284 1218007 1211700 1204097
60667 1204097 1195755 1187125 1177355 1165076 1150284 1134571 1119313 1104365 1088907 1072998 1057776 1044368
60655 1044368 1032962 1022750 1012468 1001182 988916 976492 964578 953098 941727 930559 919740
60644 919740 908742 896744 883668 870152 856581 843015 830165 819240 810329 801948 793017 784382
60632G84382o973n490n065m405k384j32O88M57P24J711K540L338M953O743O790
60617G87877M874L316L938N673O403N982N992P155Q572R491J0450J2124J4010
60604H85857J4972J4726J4052J3630J3379J3151J3383J4465J5762J6119J5443
60593A044939J5076J6212J8491K0507K1314K0928J9830J8564J7743J7796J8579
60582A249979J9455J9719J8862J6774J3902J1013Q445N916L283J107j0l15p88
60569A367342k239m808p885j0352j1357j1212j0955j0823j0056q753q715j1180
60557A259007j4466j5444j3133r464o536m584k951j535n54K36J213K401L767N513
60543A203470P513R060R749J0337J2063J5199J8698K1430K3458K5841K9142L2434
$$ plain form
60632 784382 777409 771919 766854 762449 760065 759933 760621 761078 761802 763513 766053 769391 774344 781087 787877
60617 787877 792751 796067 800005 805678 812081 818063 824055 831210 839782 849273 859723 871847 885857
60604 885857 900829 915555 929607 943237 956616 969767 983150 997615 1013377 1029496 1044939
60593 1044939 1060015 1076227 1094718 1115225 1136539 1157467 1177297 1195861 1213604 1231400 1249979
60582 1249979 1269434 1289153 1308015 1324789 1338691 1349704 1358149 1364065 1367348 1368455 1368445 1368130 1367342
60569 1367342 1365103 1360295 1352410 1342058 1330701 1319489 1308534 1297711 1287655 1278902 1270187 1259007
60557 1259007 1244541 1229097 1215964 1206500 1199964 1195380 1192429 1190894 1190340 1190576 1191789 1194190 1197957 1203470
60543 1203470 1210983 1220043 1229792 1240129 1252192 1267391 1286089 1307519 1330977 1356818 1385960 1418394
60531A418394L4244L4308L3723L3181L1930K9000K4672J9957J5333J0846O968
60520A692556M087J582j494m856p402q986j0595j2751j4899j6520j7652j8216
60508A584854j8089j7964j8781k0042k0081j8545j7007j6453j5805j4056j2272
60497A395759j1868j2015j0732p963n631m683l800j540J623M095N225N872P320
60484A361662R932J2744J4342J4381J4040J4665J6242J7829J9257K1463K5117
60473A541674K9727L4402L8815M2921M6527M9847N4076O0434O8685P7456Q6277
60462B130841R6434J09123J23408J37116J49498J61611J73604J82867J86053J82028
60452C632583J71584J54922J31450J02451P2222M5499K4724J0410K662O93J601
$$ plain form
60531 1418394 1452638 1486946 1520669 1553850 1585780 1614780 1639452 1659409 1674742 1685588 1692556
60520 1692556 1696643 1698225 1696731 1691875 1684473 1675487 1664892 1652141 1637242 1620722 1603070 1584854
60508 1584854 1566765 1548801 1530020 1509978 1489897 1471352 1454345 1437892 1422087 1408031 1395759
60497 1395759 1383891 1371876 1361144 1353181 1347550 1342867 1339067 1337527 1339150 1343245 1348470 1354342 1361662
60484 1361662 1371594 1384338 1398680 1413061 1427101 1441766 1458008 1475837 1495094 1516557 1541674
60473 1541674 1571401 1605803 1644618 1687539 1734066 1783913 1837989 1898423 1967108 2044564 2130841
60462 2130841 2227275 2336398 2459806 2596922 2746420 2908031 3081635 3264502 3450555 3632583
60452 3632583 3804167 3959089 4090539 4192990 4265212 4310711 4335435 4345845 4348507 4349200 4350801
60441D350801J601j185o244j3010k2213l4163m6783n6537o1113o0582n6234m9127
60429C945211l9870k8866j6132j092J6832L7320N9033Q0494J00874J19835J36871
60418D410510J51029J61202J66464J66205J60397J50068J37457J25382J16327
60409E745041J12013J13826J23221J41262J67660K00836K39460K83755L34705
60400G461779L92273M55269N22990N96004O74675P57528Q41525R22888R96167
60391A3621098J052365J078916J062318R91859Q62750O77985M48029J88652q1273
60382A9902699l40982n70077p53320q84805r67191j007077j012031r90969r53938
60373A2422309r08869q58884q04122p45836o87608o32698n81506n32267m83722
$$ plain form
60441 4350801 4352402 4351217 4344973 4331963 4309750 4275587 4228804 4172267 4111154 4050572 3994338 3945211
60429 3945211 3905341 3876475 3860343 3859251 3876083 3913403 3972436 4052930 4153804 4273639 4410510
60418 4410510 4561539 4722741 4889205 5055410 5215807 5365875 5503332 5628714 5745041
60409 5745041 5857054 5970880 6094101 6235363 6403023 6603859 6843319 7127074 7461779
60400 7461779 7854052 8309321 8832311 9428315 10102990 10860518 11702043 12624931 13621098
60391 13621098 14673463 15752379 16814697 17806556 18669306 19347291 19795320 19983972 19902699
60382 19902699 19561717 18991640 18238320 17353515 16386324 15379247 14367216 13376247 12422309
60373 12422309 11513440 10654556 9850434 9104598 8416990 7784292 7202786 6670519 6186797
60364F186797m36640l92911l53636l18392k86185k56718k30355k07212j86765
60355C517983j68363j51783j37276j25226j15592j07394r9223r0677q2920p7079
60345B362450p2559o7814o2495n7736n4374n2056n0106m8233m6138m3558m0920
60334A766461l8908l7130l4391l0613k7201k5039k3386k1516k0039j9682j9899
60323A468657j9837j9696k0060k0745k1398k2235k3065k2651k0488j8194j7410
60312A242878j7174j5525j3067j2330j3492j3481j0339o228m533n652p352q107
60300A115598q111p734o995o551p369q978r523q220o616o492p444p586o165m237
60286A013577k972k459k413k893l699l891k794j037J30L51L03N79J129J753K468
$$ plain form
60364 6186797 5750157 5357246 5003610 4685218 4399033 4142315 3911960 3704748 3517983
60355 3517983 3349620 3197837 3060561 2935335 2819743 2712349 2613126 2522449 2439529 2362450
60345 2362450 2289891 2222077 2159582 2101846 2047472 1995416 1945310 1897077 1850939 1807381 1766461
60334 1766461 1727553 1690423 1656032 1625419 1598218 1573179 1549793 1528277 1508238 1488556 1468657
60323 1468657 1448820 1429124 1409064 1388319 1366921 1344686 1321621 1298970 1278482 1260288 1242878
60312 1242878 1225704 1210179 1197112 1184782 1171290 1157809 1147470 1141242 1136709 1131057 1123705 1115598
60300 1115598 1107487 1099753 1092758 1086207 1078838 1069860 1060337 1052117 1045501 1039009 1031565 1023979 1017814 1013577
60286 1013577 1010605 1008146 1005733 1002840 999141 995250 992456 991419 991549 991900 992203 992782 993911 995664 998132
60271I98132L463N045P420R889J0747Q964N829L770L574L926L809L933N207P039
60257A080747Q152Q191P683P073O622O548O454N198K218j524m654o871q540r433
60243A107864r002p547o079n190m811m789m786l935j560J754M728O865Q653J0441
60229A092606J2074J3466J4607J4904J3537J0670P582N361M123L524L249K846
60217A198549J945Q76M36P68J193J399J993L394M883N449N212N268O243P630Q695
60202A253933R414J0191J1002J1554J2393J4979J9788K4823K7274K6833K6235
60191A448419K8054L2133L6864M1688M6939N2132N6185N9160O2309O6268P0554
60180B000705P4784P9083Q2985Q5377Q6047Q6157Q6484Q6169Q3977P9899P4665
$$ plain form
60271 998132 1001595 1006640 1014060 1023949 1034696 1043660 1049489 1053259 1056833 1060759 1064568 1068501 1073708 1080747
60257 1080747 1088899 1097090 1104773 1111846 1118468 1125016 1131470 1136668 1138886 1137362 1132708 1125837 1117297 1107864
60243 1107864 1098862 1091315 1085236 1080046 1075235 1070446 1065660 1061725 1060165 1061919 1066647 1073512 1082165 1092606
60229 1092606 1104680 1118146 1132753 1147657 1161194 1171864 1179446 1184807 1188930 1192454 1195703 1198549
60217 1198549 1200494 1201370 1201806 1202574 1203767 1205166 1207159 1210553 1215436 1220885 1226097 1231365 1237608 1245238 1253933
60202 1253933 1263347 1273538 1284540 1296094 1308487 1323466 1343254 1368077 1395351 1422184 1448419
60191 1448419 1476473 1508606 1545470 1587158 1634097 1686229 1742414 1801574 1863883 1930151 2000705
60180 2000705 2075489 2154572 2237557 2322934 2408981 2495138 2581622 2667791 2751768 2831667 2906332
60169B906332O8302O0309N0963M1581L3363K6342J9528J1916L527m454j0628j4457
60157C192624j6154j5848j3634j0447p820o194m169j25N864J2386J8677K5432
60145C180592L3552M2654N1259N8319O4249P0187P6273Q1149Q3393Q3050Q1079
60134C905756P7646P1808O3091N2553M1929L2124K2804J3056K287r097j9719k8355
60122D225883l5003m0385m4399m5918m4263m0017l4029k6489j7609q256J028J1143
60110C901686K3442L7717N2061O4818P6069Q7023R8492J10099J20554J28412J32763
60099D833136J33416J30510J24023J13806R9900Q2687O2828M1212J8885l043k3312
60088E614048m0341n2516n8955n9871n6172m8894l9045k7549j4992j636J2227
$$ plain form
60169 2906332 2974634 3034943 3085906 3127487 3160850 3187192 3206720 3218636 3222163 3217709 3207081 3192624
60157 3192624 3176470 3160622 3146988 3136541 3128721 3122527 3118358 3118233 3124097 3136483 3155160 3180592
60145 3180592 3214144 3256798 3308057 3366376 3430625 3500812 3577085 3658234 3741627 3824677 3905756
60134 3905756 3983402 4055210 4118301 4170854 4212783 4244907 4267711 4280767 4283054 4273957 4254238 4225883
60122 4225883 4190880 4150495 4106096 4060178 4015915 3975898 3941869 3915380 3897771 3889515 3890543 3901686
60110 3901686 3925128 3962845 4014906 4079724 4155793 4242816 4341308 4451407 4571961 4700373 4833136
60099 4833136 4966552 5097062 5221085 5334891 5434791 5517478 5580306 5621518 5640403 5637360 5614048
60088 5614048 5573707 5521191 5462236 5402365 5346193 5297299 5258254 5230705 5215713 5214077 5226304
60077E226304K6269M0707N6414P3988R2948J12261J31443J50701J70137J89276
60067F270448K07298K23277K36167K45090K49824K50780K48274K42054K31759
60058H404971K17514J99706J78271J52758J23487R2200O0842K9640k780l7025
60048I419584p1305j02930j30896j55937j78199j96070k07761k13047k12749k07303
60038G743387j96792j82117j65214j47824j30275j11520r0335o6842m3107k1818
60028F587543m020J1472K6100L9477M9896N6356N9212N8911N5252M8283L9137
60017G027619K9361J9711J0087M17q895j7400k5107l2245l8637m3516m6177m6779
60005F828439m6231m5128m3084l9354l3951k7785k1798j6524j2550j0873j2196
$$ plain form
60077 5226304 5252573 5293280 5349694 5423682 5516630 5628891 5760334 5911035 6081172 6270448
60067 6270448 6477746 6701023 6937190 7182280 7432104 7682884 7931158 8173212 8404971
60058 8404971 8622485 8822191 9000462 9153220 9276707 9368907 9429749 9459389 9456609 9419584
60048 9419584 9348279 9245349 9114453 8958516 8780317 8584247 8376486 8163439 7950690 7743387
60038 7743387 7546595 7364478 7199264 7051440 6921165 6809645 6719310 6652468 6609361 6587543
60028 6587543 6583523 6594995 6621095 6660572 6710468 6766824 6826036 6884947 6940199 6988482 7027619
60017 7027619 7056980 7076691 7086778 7087195 7078300 7060900 7035793 7003548 6964911 6921395 6875218 6828439
60005 6828439 6782208 6737080 6693996 6654642 6620691 6592906 6571108 6554584 6542034 6531161 6518965
59994F518965j6046k0980k5669k9350l1234l0181k5710j9078j2464o802j170N169
59982F305450J0905J3962J4259J3827J3878J3040R253K407n912j4646k4008l4333
59970F318082m5435n7084o9085q0723r1029r9761j07198j12799j15118j13578
59960E426272j09359j04017r7973r0972q2923p3494o1815m7913l3798k1676j1337
59949D690995o80J1404K4151L6857M9899O3198P5211Q4563R1652R7593J02278
59938E327121J04481J03254R8323Q9714P8031O4694N0837L6271K0320L347j3471
59927E962922k9419m4299n7591o8694p7725q4803q8761q8038q2939p5610o7508
59916E197535n8435m8296l8140k8549j8571p350M312J5243K5674L6333M6628N5333
$$ plain form
59994 6518965 6502919 6481939 6456270 6426920 6395686 6365505 6339795 6320717 6308253 6301451 6300281 6305450
59982 6305450 6316355 6330317 6344576 6358403 6372281 6385321 6394574 6396981 6391069 6376423 6352415 6318082
59970 6318082 6272647 6215563 6146478 6065755 5974726 5874965 5767767 5654968 5539850 5426272
59960 5426272 5316913 5212896 5114923 5023951 4941028 4867534 4805719 4757806 4724008 4702332 4690995
59949 4690995 4690315 4701719 4725870 4762727 4812626 4875824 4951035 5035598 5127250 5224843 5327121
59938 5327121 5431602 5534856 5633179 5722893 5800924 5865618 5916455 5952726 5973046 5976393 5962922
59927 5962922 5933503 5889204 5831613 5762919 5685194 5600391 5511630 5423592 5340653 5265043 5197535
59916 5197535 5139100 5090804 5052664 5024115 5005544 4998194 5002506 5017749 5043423 5079756 5126384 5181717
59904E181717O2544O9231P4974P7782P6636P2976O9025O5485O1498N6343N0445
59893E918656M4808L9862L5106K9951K4835K1046J9353J9368K0771K4564L2249
59882F230569M3968N8253P3752R0507J09303J30236J52290J74239J95682K16970
59872G475769K37837K56239K69228K75080K73941K66052K50164K24598J89376
59863I718284J46506R8406M6854o707o0487j11965j57970j95594k23685k43080
59853I010562k54971k59686k57792k51349k42640k31836k17395j98693j77110
59844F919090j54421j31381j08322q5887o4477m3677k2826j796J8976L8733N6367
59833F420379P0768Q1501Q8755R2472R1933Q6236P4827N7575L4944Q178k1005
$$ plain form
59904 5181717 5244261 5313492 5388466 5466248 5542884 5615860 5684885 5750370 5811868 5868211 5918656
59893 5918656 5963464 6003326 6038432 6068383 6093218 6114264 6133617 6152985 6173756 6198320 6230569
59882 6230569 6274537 6332790 6406542 6497049 6606352 6736588 6888878 7063117 7258799 7475769
59872 7475769 7713606 7969845 8239073 8514153 8788094 9054146 9304310 9528908 9718284
59863 9718284 9864790 9963196 10010050 10003343 9942856 9830891 9672921 9477327 9253642 9010562
59853 9010562 8755591 8495905 8238113 7986764 7744124 7512288 7294893 7096200 6919090
59844 6919090 6764669 6633288 6524966 6439079 6374602 6330925 6308099 6306303 6325279 6364012 6420379
59833 6420379 6491147 6572648 6661403 6753875 6845808 6932044 7006871 7064446 7099390 7107568 7086563
59822G086563n0948q0046j06746j30142j50268j67222j80463j89768j96074k00239
59812E634647k01468j98447j91729j83436j74626j64748j53730j42678j31985
59803D091800j20715j08683r7327q7316p7053o5215n3541m5039m0202l6763l2924
59792C327022k9074k6237k4385k2746k0771j8275j5284j2110r205o694m371k133
59780C135737j56J184J255p46n174j1441j8412k5056l0541l4123l5712l6344l7381
59767B903090l9089m0381m0111l8242l5603l2826k9861k6471k2785j9019j4923
59756B563779r980m336J122N987J1036J6993K3243K8735L3744L9465M5799N0869
59744B806456N3112N2816N1087M8439M5087M1781L9394L8084L7445L7147L6960
$$ plain form
59822 7086563 7035615 6955569 6848823 6718681 6568413 6401191 6220728 6030960 5834886 5634647
59812 5634647 5433179 5234732 5043003 4859567 4684941 4520193 4366463 4223785 4091800
59803 4091800 3971085 3862402 3765075 3677759 3600706 3535491 3481950 3436911 3396709 3359946 3327022
59792 3327022 3297948 3271711 3247326 3224580 3203809 3185534 3170250 3158140 3148935 3142241 3137870 3135737
59780 3135737 3135581 3136765 3138020 3137274 3132100 3120659 3102247 3077191 3046650 3012527 2976815 2940471 2903090
59767 2903090 2864001 2823620 2783509 2745267 2709664 2676838 2646977 2620506 2597721 2578702 2563779
59756 2563779 2553799 2549463 2550585 2556572 2567608 2584601 2607844 2636579 2670323 2709788 2755587 2806456
59744 2806456 2859568 2912384 2963471 3011910 3056997 3098778 3138172 3176256 3213701 3250848 3287808
59733C287808L6772L7129L9292M4110N1091N8931O6511P3009P7725Q0595Q2690
59722C935663Q5714R1088R9720J12077J27759J45114J61878J76519J88963J99997
59712E324492K09950K17804K21510K18924K07894J85568J49288R9573M1856j6031
59702F860828o7990j10737j42214j61339j69413j69578j64257j54522j41959j28842
59692E449977j15618j00575q3291o6401n2217l9371k4891q362Q140K3382L8071
59681E028844N3003O8179Q3686R9784J15958J31294J45910J60870J76762J93420
59671F257710K10982K29921K50025K70519K91434L13870L38523L64738L91236
59662H918958M17089M41648M64037M83160M98196N08889N15123N16011N09952
$$ plain form
59733 3287808 3324580 3361709 3401001 3445111 3496202 3555133 3621644 3694653 3772378 3852973 3935663
59722 3935663 4021377 4112465 4212185 4324262 4452021 4597135 4759013 4935532 5124495 5324492
59712 5324492 5534442 5752246 5973756 6192680 6400574 6586142 6735430 6835003 6876859 6860828
59702 6860828 6792838 6682101 6539887 6378548 6209135 6039557 5875300 5720778 5578819 5449977
59692 5449977 5334359 5233784 5150493 5084092 5031875 4992504 4967613 4959251 4967391 4990773 5028844
59681 5028844 5081847 5150026 5233712 5333496 5449454 5580748 5726658 5887528 6064290 6257710
59671 6257710 6468692 6698613 6948638 7219157 7510591 7824461 8162984 8527722 8918958
59662 8918958 9336047 9777695 10241732 10724892 11223088 11731977 12247100 12763111 13273063
59653A3273063M96486M78022M58629M40981M25659M13527M06778M06521M10955
59644A7210621M17387M24782M32643M38320M37425M26768M05604L74490L34369
59635B0902409K86686K33298J76329J18636O3664J3889k9862o6682r4304j10804
59625B1493259j16406j12175r8080p4215m2816o740L3533P9199J29850J83270
59615B1468679K38335K95652L54783M12839M66392N13108N50761N76090N85073
59606B5461712N73435N36997M73108L82221K67448J33287j3787j64497l09068
59597B7340856m40613n54647o46318p11381p50344p68543p70897p58975p34247
59588B1204891p01412o66622o34363o07850n90516n84774n90138o04041o23355
$$ plain form
59653 13273063 13769549 14247571 14706200 15147181 15572840 15986367 16393145 16799666 17210621
59644 17210621 17628008 18052790 18485433 18923753 19361178 19787946 20193550 20568040 20902409
59635 20902409 21189095 21422393 21598722 21717358 21781022 21794911 21765049 21698367 21604063 21493259
59625 21493259 21376853 21264678 21166598 21092383 21049567 21042827 21076360 21155559 21285409 21468679
59615 21468679 21707014 22002666 22357449 22770288 23236680 23749788 24300549 24876639 25461712
59606 25461712 26035147 26572144 27045252 27427473 27694921 27828208 27814421 27649924 27340856
59597 27340856 26900243 26345596 25699278 24987897 24237553 23469010 22698113 21939138 21204891
59588 21204891 20503479 19836857 19202494 18594644 18004128 17419354 16829216 16225175 15601820
59579A5601820o43647o58613o62885o55519o39321o17120n89998n58673n24842
59570A0051202m90531m56945m24237l92250l61466l33137l07922k84605k61138
59561F738971k37132k14232j93826j75605j58831j43560j29893j17291j05537
59552E263064r5292q6870p9614p3387o9395o8340o8877o9161o9159p0175p2791
59541D440003p6418q0192q3205q4479q3705q1659p9100p5976p2294o8718o5325
59530C588932o0919n4800m8229m2784l8160l3125k7768k3122j9078j4626r794
59519C216527n554j812K693Q187J3179J6511J8728K0753K2431K3272K3893K5699
59507C384507K9200L3294L6381L8085L9652M2519M6762N1454N6327O2009O8472
$$ plain form
59579 15601820 14958173 14299560 13636675 12981156 12341835 11724715 11134717 10576044 10051202
59570 10051202 9560671 9103726 8679489 8287239 7925773 7592636 7284714 7000109 6738971
59561 6738971 6501839 6287607 6093781 5918176 5759345 5615785 5485892 5368601 5263064
59552 5263064 5167772 5080902 5001288 4927901 4858506 4790166 4721289 4652128 4582969 4512794 4440003
59541 4440003 4363585 4283393 4200188 4115709 4032004 3950345 3871245 3795269 3722975 3654257 3588932
59530 3588932 3528013 3473213 3424984 3382200 3344040 3310915 3283147 3260025 3240947 3226321 3216527
59519 3216527 3210973 3209161 3211854 3220041 3233220 3249731 3268459 3289212 3311643 3334915 3358808 3384507
59507 3384507 3413707 3447001 3483382 3521467 3561119 3603638 3650400 3701854 3758181 3820190 3888662
59496C888662P4674Q0458Q7509R7132J08083J18053J26660J35485J45615J56742
59486E019073J68364J80081J90673J98538K03523K06855K08963K08699K05327
59477F790096J99797J93106J84587J73051J59036J44622J31070J17416J01648
59468H194429Q2921O2625M3493K7719J5879P612K938K416O266J4010K5031L8782
59456H524121N4192O9446Q2684R2550R7873R7377R0120P5872N4797K7222n806
59445I260448m2246q0097j18588j57424j94776k27004k51158k67279k77400k82625
59435G361851k82315k76182k65751k52916k38144k21283k03367j86079j69668
59426E266146j52975j35680j19011j03752q8937p3332n7155m1418k6472j2141
$$ plain form
59496 3888662 3963336 4043794 4131303 4228435 4336518 4454571 4581231 4716716 4862331 5019073
59486 5019073 5187437 5367518 5558191 5756729 5960252 6167107 6376070 6584769 6790096
59477 6790096 6989893 7182999 7367586 7540637 7699673 7844295 7975365 8092781 8194429
59468 8194429 8277350 8339975 8383468 8411187 8427066 8434678 8437616 8440032 8446298 8460308 8485339 8524121
59456 8524121 8578313 8647759 8730443 8822993 8920866 9018243 9108363 9184235 9239032 9266254 9260448
59445 9260448 9218202 9138105 9019517 8862093 8667317 8440313 8189155 7921876 7644476 7361851
59435 7361851 7079536 6803354 6537603 6284687 6046543 5825260 5621893 5435814 5266146
59426 5266146 5113171 4977491 4858480 4754728 4665791 4592459 4535304 4493886 4467414 4455273
59416D455273J489J4393K7184M0431N3826O6854P9697R2676J05278J16699J26922
59405E180722J36269J44262J49830J52445J52044J48108J39903J27389J10835
59396F441807Q9670O3101L2106l44l1608o1040q8962j14833j37290j55359j68904
59385E868344j78109j83155j84538j83305j80644j77179j72617j66247j57963
59376D284587j48671j39505j30790j21972j12484j02378r2282q2895p4409o6266
59366C212935n7750m9100m1513l5717l1005k6239k1269j6492j1405m897K751R454
59354B929753J3652J6332J9755K4689L0007L4951M0325M6589N1797N3004M9777
59343C310631M5017M1787M0584M0601M2457M7864N6915O7499P7668Q6989R4970
$$ plain form
59416 4455273 4456762 4471155 4498339 4538770 4592596 4659450 4739147 4831823 4937101 5053800 5180722
59405 5180722 5316991 5461253 5611083 5763528 5915572 6063680 6203583 6330972 6441807
59396 6441807 6531477 6594578 6626684 6626340 6594732 6533692 6444730 6329897 6192607 6037248 5868344
59385 5868344 5690235 5507080 5322542 5139237 4958593 4781414 4608797 4442550 4284587
59376 4284587 4135916 3996411 3865621 3743649 3631165 3528787 3436505 3353610 3279201 3212935
59366 3212935 3155185 3106085 3064572 3028855 2997850 2971611 2950342 2933850 2922445 2917548 2920299 2929753
59354 2929753 2943405 2959737 2979492 3004181 3034188 3069139 3109464 3156053 3207850 3260854 3310631
59343 3310631 3355648 3397435 3438019 3478620 3521077 3568941 3625856 3693355 3771023 3858012 3952982
59332C952982R9780J00052R7310R5454R7874J05530J17215J30979J45541J61083
59322E103800J78480J97762K17961K38793K61402K86497L12726L38066L62334
59313G497821L86887M11998M35784M55763M70319M78404M79084M72191M58821
59304A1547072M40551M18427L93131L65801L38099L11354K85929K61452K37457
59295A4599273K13580J89179J63256J34976J04073P0520L4289l944m2153p7902
59285A5385147j09989j38501j63494j84675k02405k17614k30281k39277k44516
59276A3654395k48079k52092k56320k59024k59646k59412k59423k59363k58235
59267A1342801k55783k52873k50755k49834k49066k46866k42659k37099k30722
$$ plain form
59332 3952982 4052762 4152814 4250124 4345578 4443452 4548982 4666197 4797176 4942717 5103800
59322 5103800 5282280 5480042 5698003 5936796 6198198 6484695 6797421 7135487 7497821
59313 7497821 7884708 8296706 8732490 9188253 9658572 10136976 10616060 11088251 11547072
59304 11547072 11987623 12406050 12799181 13164982 13503081 13814435 14100364 14361816 14599273
59295 14599273 14812853 15002032 15165288 15300264 15404337 15474857 15509146 15505202 15463049 15385147
59285 15385147 15275158 15136657 14973163 14788488 14586083 14368469 14138188 13898911 13654395
59276 13654395 13406316 13154224 12897904 12638880 12379234 12119822 11860399 11601036 11342801
59267 11342801 11087018 10834145 10583390 10333556 10084490 9837624 9594965 9357866 9127144
59258I127144k23240k14410k04721j94764j84645j74461j64293j53366j40365
59249G472879j25476j11051r9205q9544q0219p0343o0344n0636m1223l2113k3234
59238F689491j4396n919J492Q266J6149K5785L5302M2734M8750N5308O2555O9067
59226G034584P4458P9577Q4288Q7195Q7813Q7103Q5489Q1967P5863O8106O0082
59215G906525N2169M3858L4683K4614J4137L875o384j7988l1888m7308o2839p8433
59203G835021r5022j12552j29807j45950j60731j73186j81611j85315j85269j82884
59193F282694j78984j73980j67902j60215j50542j39536j28153j16375j03740
59184D963267r0715p8172o5828n2701l8970k5691j2727J361J7107L3387M9224
$$ plain form
59258 9127144 8903904 8689494 8484773 8290009 8105364 7930903 7766610 7613244 7472879
59249 7472879 7347403 7236352 7137147 7047603 6967384 6897041 6836697 6786061 6744838 6712725 6689491
59238 6689491 6675095 6669176 6670668 6678934 6695083 6720868 6756170 6798904 6847654 6902962 6965517 7034584
59226 7034584 7109042 7188619 7272907 7360102 7447915 7535018 7620507 7702474 7778337 7846443 7906525
59215 7906525 7958694 8002552 8037235 8061849 8075986 8079861 8073477 8055489 8023601 7976293 7913454 7835021
59203 7835021 7739999 7627447 7497640 7351690 7190959 7017773 6836162 6650847 6465578 6282694
59193 6282694 6103710 5929730 5761828 5601613 5451071 5311535 5183382 5067007 4963267
59184 4963267 4872552 4794380 4728552 4675851 4636881 4611190 4598463 4599824 4616931 4650318 4699542
59173D699542O4680P9298R0996R7444R8311R6081R5142R9401J09559J23150J38248
59162E791852J56119J78556K03753K27548K48295K67487K85332K98851L05225
59153G963018L04188K95742K78240K50706K15082J74147J28721P8769K6092k5753
59143I688952p3411j14309j46536j69741j85487j95543k00406k00240j96001j88567
59133H018711j77809j63817j48070j32283j17011j02370q8900p6501o3710m9598
59123F898642l5499k3322j2984l142O171J3229J6786J7152J5276J1814O912J72
59111F911207q839j9430k9873l9352m8862n9109o8627p5467p9970q4092q8375
59100F309211r1210r1096q8202q3581p8087p2271o6399o0324n3936m7578m1382
$$ plain form
59173 4699542 4764222 4843520 4934516 5031960 5130271 5226352 5321494 5420895 5530454 5653604 5791852
59162 5791852 5947971 6126527 6330280 6557828 6806123 7073610 7358942 7657793 7963018
59153 7963018 8267206 8562948 8841188 9091894 9306976 9481123 9609844 9688613 9714705 9688952
59143 9688952 9615541 9501232 9354696 9184955 8999468 8803925 8603519 8403279 8207278 8018711
59133 8018711 7840902 7677085 7529015 7396732 7279721 7177351 7088451 7011950 6948240 6898642
59123 6898642 6863143 6839821 6826837 6823695 6829866 6843095 6859881 6877033 6892309 6904123 6911035 6911207
59111 6911207 6902368 6882938 6853065 6813713 6764851 6705742 6637115 6561648 6481678 6397586 6309211
59100 6309211 6218001 6126905 6038703 5955122 5877035 5804764 5738365 5678041 5624105 5576527 5535145
59089E535145l4605k6549j7954j0345m144J596P522J3134J7894K2255K7178L3113
59077E564240L9760M6474N2676N8196O3422O8890P4593P9606Q2591Q2974Q1830
59066F295252Q1142Q1520Q1006P7125O9955O1956N4732M7474L9114L0367K2429
59055F942072J4922O737j660q323j2144j3897j4962j5881j6322j5880j4690j3352
59043F836620j2203j0634p820m280k049k862o895j3766k4003l8676n7934q0649
59031F574849j05104j29608j52664j73068j89787k01933k09423k13439k15263
59022D984560k14644k10480k03113j94529j85905j76603j66186j55745j46202
59013C331153j36843j26823j16788j07570r8641q9469q1375p6058p2809o9028
$$ plain form
59089 5535145 5500540 5473991 5456037 5445692 5441548 5443144 5450666 5463800 5481694 5503949 5531127 5564240
59077 5564240 5604000 5650474 5703150 5761346 5824768 5893658 5968251 6047857 6130448 6213422 6295252
59066 6295252 6376394 6457914 6538920 6616045 6686000 6747956 6802688 6850162 6889276 6919643 6942072
59055 6942072 6956994 6963731 6962071 6953748 6941604 6927707 6912745 6896864 6880542 6864662 6849972 6836620
59043 6836620 6824417 6813783 6805963 6801683 6799634 6796772 6789877 6776111 6752108 6713432 6655498 6574849
59031 6574849 6469745 6340137 6187473 6014405 5824618 5622685 5413262 5199823 4984560
59022 4984560 4769916 4559436 4356323 4161794 3975889 3799286 3633100 3477355 3331153
59013 3331153 3194310 3067487 2950699 2843129 2744488 2655019 2573644 2497586 2424777 2355749
59003B355749o3323n6696n0787m6253m2771l9612l6190l2766l0245k8727k7042
58992A901337k4501k2110k0916k0199j8777j7140j6488j6288j4837j1988r310
58981A708783p425n169j911J197L249N378R162J3980J7379J8116J7805J8981K1929
58968A821454K4290K4081K2289K1490K2393K3134K2032J9424J6262J2572Q286
58957B037707M308J393r60l372n181n379m109k152K79L066N391O542O828O632
58943B050993N511L249O54j954n751j1398j7308k1662k4946k8522l1816l3201
58931A883849l2754l1766l0120k6808k2631j9702j8162j5972j2308q786o733n358
58919A652749l431r50J637M408P492J0751J4150J7372J9258J9225J8994K1015
$$ plain form
59003 2355749 2292426 2235730 2184943 2138690 2095919 2056307 2020117 1987351 1957106 1928379 1901337
58992 1901337 1876836 1854726 1833810 1813611 1794834 1777694 1761206 1744918 1730081 1718093 1708783
58981 1708783 1701358 1696189 1694278 1695475 1698724 1704102 1713264 1727244 1744623 1762739 1780544 1799525 1821454
58968 1821454 1845744 1869825 1892114 1913604 1935997 1959131 1981163 2000587 2016849 2029421 2037707
58957 2037707 2042015 2043408 2042448 2039076 2033895 2028516 2024407 2022255 2022534 2025600 2030991 2037533 2044361 2050993
58943 2050993 2056504 2059753 2060407 2058453 2052702 2041304 2023996 2002334 1977388 1948866 1917050 1883849
58931 1883849 1851095 1819329 1789209 1762401 1739770 1720068 1701906 1685934 1673626 1664840 1658107 1652749
58919 1652749 1649318 1648368 1650005 1654413 1661905 1672656 1686806 1704178 1723436 1742661 1761655 1782670
58907A782670K5145K8858L0735L1577L1931L1014K8817K6878K6003K5197K3944
58896B092769K3509K4730K6303K6664K6125K5918K6530K8250L1812L7024M1996
58885B411630M5242M7620N0781N4700N8238O1434O5638P1553P8309Q4440Q9163
58874C118748R2960R7408J03942J12382J21337J30260J40041J51151J62392J72497
58864D403118J81973J92353K04322K17559K31871K47532K64943K84521L06431
58855F534623L29763L52814L74805L96750M19855M43659M66462M86805N03437
58846A0308973N14295N16565N07949M87565M55741M13240L60243K96008K20263
58837A4080842J35415M6698m0396j22464j97988k65944l25287l74944m13466m39461
$$ plain form
58907 1782670 1807815 1836673 1867408 1898985 1930916 1961930 1990747 2017625 2043628 2068825 2092769
58896 2092769 2116278 2141008 2167311 2193975 2220100 2246018 2272548 2300798 2332610 2369634 2411630
58885 2411630 2456872 2504492 2555273 2609973 2668211 2729645 2795283 2866836 2945145 3029585 3118748
58874 3118748 3211708 3309116 3413058 3525440 3646777 3777037 3917078 4068229 4230621 4403118
58864 4403118 4585091 4777444 4981766 5199325 5431196 5678728 5943671 6228192 6534623
58855 6534623 6864386 7217200 7592005 7988755 8408610 8852269 9318731 9805536 10308973
58846 10308973 10823268 11339833 11847782 12335347 12791088 13204328 13564571 13860579 14080842
58837 14080842 14216257 14262955 14222559 14100095 13902107 13636163 13310876 12935932 12522466 12083005
58827A2083005m53271m57795m56744m52223m44367m32793m17699l99958l80843
58818H187312l61494l42344l23350l04926k87989k72664k57875k42759k27694
58809E566217k13190j98753j83998j70111j58570j48639j37889j25536j13780
58800D115751j04849r7996r0767q2601p5295o9825o4475n7264m8932m1910l6855
58789C344982l2090k6416k0551j5179r482k849L489Q155J1905J6610K2791K9717
58777C331082L7180M5333N3401O0531O7621P6278Q6080R4971J02455J10276J19536
58766D184744J29334J38976J49359J61032J72750J83461J94374K07548K23330
58757E744908K40473K58162K76671K96468L17453L38912L59932L80213M00537
$$ plain form
58827 12083005 11629734 11171939 10715195 10262972 9818605 9385812 8968113 8568155 8187312
58818 8187312 7825818 7483474 7160124 6855198 6567209 6294545 6036670 5793911 5566217
58809 5566217 5353027 5154274 4970276 4800165 4641595 4492956 4355067 4229531 4115751
58800 4115751 4010902 3912906 3822139 3739538 3664243 3594418 3529943 3472679 3423747 3381837 3344982
58789 3344982 3312892 3286476 3265925 3250746 3241264 3238415 3241904 3250059 3261964 3278574 3301365 3331082
58777 3331082 3368262 3413595 3466996 3527527 3595148 3671426 3757506 3852477 3954932 4065208 4184744
58766 4184744 4314078 4453054 4602413 4763445 4936195 5119656 5314030 5521578 5744908
58757 5744908 5985381 6243543 6520214 6816682 7134135 7473047 7832979 8213192 8613729
58748H613729M21491M41648M58215M69553M75585M75329M65830M44551M11218
58739A2677149L66287L09267K40444J63003Q1486j388q4471j65266k39313l03054
58729A3044144l55865l98612m31411m53769m66281m70962m69723m63294m52002
58720I082225m37057m20256m02527l83644l63552l42916l22069l00726k79643
58711E829835k61168k46548k33702k19603k04241j90166j78499j67732j56526
58702C971650j45286j34417j23472j12897j04395r8175r1666q2555p1827o2332
58692B944628n5363m9990m4902l9580l4272k9775k6793k4860k2623j9662j7062
58681B579746j5594j4442j2538j0181q430p750q096r504j1909j4895j8098k1124
$$ plain form
58748 8613729 9035220 9476868 9935083 10404636 10880221 11355550 11821380 12265931 12677149
58739 12677149 13043436 13352703 13593147 13756150 13837636 13836248 13751777 13586511 13347198 13044144
58729 13044144 12688279 12289667 11858256 11404487 10938206 10467244 9997521 9534227 9082225
58720 9082225 8645168 8224912 7822385 7438741 7075189 6732273 6410204 6109478 5829835
58711 5829835 5568667 5322119 5088417 4868814 4664573 4474407 4295908 4128176 3971650
58702 3971650 3826364 3691947 3568475 3455578 3351183 3253008 3161342 3078787 3006960 2944628
58692 2944628 2889265 2839275 2794373 2754793 2720521 2690746 2663953 2639093 2616470 2596808 2579746
58681 2579746 2564152 2549710 2537172 2526991 2518561 2510811 2502715 2493211 2481302 2466407 2448309 2427185
58669B427185k3092k3461k3616k5972l0971l6286l9736m1475m2677m3840m5332
58658B050727m7971n1593n4337n4741n3542n2255n1102m9477m7387m5193m2783
58647A500346m0036l7311l4647l1614k8580k6793k6364k5615k3432k0691j8420
58636A186843j6264j4049j2915j3354j3853j3253j2765j3606j4349j2887r801
58625A039747p304n981m858l718k824j191K214N970P525O811O163O637O812N431
58611A061434L025N41j659k986k698j380p68j584k873l792m628n607o184o099
58597A024742n979o248o367n849n138m917n069m894m135l423l544m149l456oN179
58582I66747R202J0495J0468J1423J3981J7439K1240K4840K7153K7775K8107K9881
$$ plain form
58669 2427185 2404093 2380632 2357016 2331044 2300073 2263787 2224051 2182576 2139899 2096059 2050727
58658 2050727 2002756 1951163 1896826 1842085 1788543 1736288 1685186 1635709 1588322 1543129 1500346
58647 1500346 1460310 1422999 1388352 1356738 1328158 1301365 1275001 1249386 1225954 1205263 1186843
58636 1186843 1170579 1156530 1143615 1130261 1116408 1103155 1090390 1076784 1062435 1049548 1039747
58625 1039747 1032443 1026462 1021604 1017886 1015062 1013871 1016085 1022055 1029580 1036391 1042554 1049191 1056003 1061434
58611 1061434 1064459 1065000 1063341 1060355 1057657 1056277 1055509 1053925 1051052 1047260 1042632 1037025 1030841 1024742
58597 1024742 1018763 1012515 1006148 1000299 995161 990244 985175 980281 976146 972723 969179 965030 961574 961568 966747
58582 966747 975949 986444 996912 1008335 1022316 1039755 1060995 1085835 1112988 1140763 1168870 1198751
58570A198751L2956L5902L8123M0121M2158M4083M6214M9184N3018N7286O1884
58559A699680O6927P2424P8717Q6541R5788J05023J13129J20440J27405J33320
58549B699394J37549J40783J43536J44302J40643J31426J16877R7534P4514M9762
58539C876320K4548j265k7171n0657o9500q4158r6074j05056j10325j12806j13875
58528C129981j13008j09069j03067r7102r1360q4743p7700p1708o6407o0083n2757
58517B202977m6144m0741l5718l1585k9952l0232k9402k5841k1118j7366j4979
58506A879899j3480j2548j1539r869q429r003j1933j6107k1189k7747l4946m0479
58494A662630m3413m5079m6444m6693m5139m2710m0573l8825l7321l6299l5548
$$ plain form
58570 1198751 1231707 1267609 1305732 1345853 1388011 1432094 1478308 1527492 1580510 1637796 1699680
58559 1699680 1766607 1839031 1917748 2004289 2100077 2205100 2318229 2438669 2566074 2699394
58549 2699394 2836943 2977726 3121262 3265564 3406207 3537633 3654510 3752044 3826558 3876320
58539 3876320 3900868 3899603 3872432 3821775 3752275 3668117 3572043 3466987 3356662 3243856 3129981
58528 3129981 3016973 2907904 2804837 2707735 2616375 2531632 2453932 2382224 2315817 2255734 2202977
58517 2202977 2156833 2116092 2080374 2048789 2018837 1988605 1959203 1933362 1912244 1894878 1879899
58506 1879899 1866419 1853871 1842332 1832463 1824034 1815031 1803098 1786991 1765802 1738055 1703109 1662630
58494 1662630 1619217 1574138 1527694 1481001 1435862 1393152 1352579 1313754 1276433 1240134 1204586
58483A204586l4205l2012k9598k7238k4724k2450k1157k0352j8591j5678j3057
58472I45524j1684j0954r979q546o707m782l662l750l878k858j681k157l894m904
58458H66088m947n568o692o218l657j432j353k119j667k5J508K385K808K979L334
58443H45424M301N206M803L403K954M402O416P436P461P276P219P452Q160R003
58429I30916R360R366R416Q849O755M000K496K289J388j144m021o084p796r671
58415I56119j1102j1591j1568j1325j0657j0024j0397j1429j1329r211o166l599
58403H37721j933j254j601k252k173j504j225j355r78Q0J252K664M716O521O828
58388H45507O297O668P876Q306P713P419P683P484O965P444Q848R743J0038J0988
$$ plain form
58483 1204586 1170381 1138369 1108771 1081533 1056809 1034359 1013202 992850 974259 958581 945524
58472 945524 933840 922886 912907 904361 897654 892872 889210 885460 881582 878724 877043 874886 870992 866088
58458 866088 861141 855573 848881 842663 839006 837574 836221 834102 832435 832410 833918 836303 839111 842090 845424
58443 845424 849725 854931 859734 863137 866091 870493 876909 884345 891806 899082 906301 913753 921913 930916
58429 930916 940276 949642 959058 967907 974662 978662 981158 983447 984835 983691 979670 973586 965790 956119
58415 956119 945017 933426 921858 910533 899876 889852 879455 868026 856697 847486 841320 837721
58403 837721 835788 834534 832933 830681 828508 827004 825779 824424 823446 823526 824778 827442 832158 838679 845507
58388 845507 851804 858472 866348 874654 882367 889786 897469 904953 911918 919362 928210 937953 947991 958979
58374I58979J2412J2719J1749J0718R261N797J064k122l110m085n915o854o210
58361I94403n683o010n623l840k056o67J710M746N784M245L133M397O207O738
58347A007484P242R243J1721J3215J3955J4047J2354R041O346N131L468M06k058
58334A111595k538k595l540m111l364k760l189l058j554o29j530k538k380k550
58320A075259l859m168k248m97p73p88K051O287R121J0709J2446J3637J3276J2708
58306A143161J3259J3452J1722R602R184R604R094Q342Q819R871J0401J1364J3773
58293A281648J6362J7775J8825K0164K0352J8762J7419J7325J6007J1842P596
58282A464077O263O453N531M355M942O136N797N025O149Q431R557R601J0068J0873
$$ plain form
58374 958979 971391 984110 995859 1006577 1015838 1021635 1022699 1020577 1017467 1013382 1007467 1000613 994403
58361 994403 988720 982710 977087 973247 971191 970524 972234 976980 982764 987009 990142 994539 1000746 1007484
58347 1007484 1014726 1023969 1035690 1048905 1062860 1076907 1089261 1098302 1104648 1109779 1113247 1113653 1111595
58334 1111595 1109057 1106462 1102922 1098811 1095447 1092687 1089498 1086440 1084886 1084257 1082727 1080189 1077809 1075259
58320 1075259 1071400 1067232 1064984 1064487 1063714 1062926 1064977 1071264 1080385 1091094 1103540 1117177 1130453 1143161
58306 1143161 1156420 1169872 1181594 1191196 1200380 1209984 1219078 1227420 1236239 1246110 1256511 1267875 1281648
58293 1281648 1298010 1315785 1334610 1354774 1375126 1393888 1411307 1428632 1444639 1456481 1464077
58282 1464077 1470340 1476793 1482324 1486679 1491621 1497757 1503554 1508579 1514728 1523159 1532716 1542317 1552385 1563258
58268A563258J1546J3323J6815J9769K0396K0561K2532K5008K5802K5879K7261
58257A792150K9355L0725L2046L3882L4277L1957K9249K8391K7854K5697K3470
58246B119053K3162K3454K2654K2089K2949K3337K2152K2125K4920K7369K6875
58235B380139K6313K8760L1809L2345L2522L5247L8069L7804L7293M0854M6521
58224B767676M9525N0400N3042N7414O0765O3523O7739P2279P5363P8987Q5116
58213C481829R0822R3013R4161R7346R9983R9121R8211J01305J05129J04879J03294
58202D569093J05524J09419J10102J10126J15466J24911J33115J40985J53159
58193E671900J68026J80147J90327K03690K20172K36073K52173K71157K90306
$$ plain form
58268 1563258 1574804 1588127 1604942 1624711 1645107 1665668 1688200 1713208 1739010 1764889 1792150
58257 1792150 1821505 1852230 1884276 1918158 1952435 1984392 2013641 2042032 2069886 2095583 2119053
58246 2119053 2142215 2165669 2188323 2210412 2233361 2256698 2278850 2300975 2325895 2353264 2380139
58235 2380139 2406452 2435212 2467021 2499366 2531888 2567135 2605204 2643008 2680301 2721155 2767676
58224 2767676 2817201 2867601 2920643 2978057 3038822 3102345 3170084 3242363 3317726 3396713 3481829
58213 3481829 3572651 3665664 3759825 3857171 3957154 4056275 4154486 4255791 4360920 4465799 4569093
58202 4569093 4674617 4784036 4894138 5004264 5119730 5244641 5377756 5518741 5671900
58193 5671900 5839926 6020073 6210400 6414090 6634262 6870335 7122508 7393665 7683971
58184G683971L06313L23670L48150L75823L99002M19064M42592M69224M95024
58175A1262833N23354N59965O01333O40217O78443P21593P66272Q06321Q46241
58166A7406572Q93968R46099R95762J048999J116313J193967J271541J352002
58158B6225223J445268J548099J650908J758333J881265K014693K146782K283919
58150D0954490K442645K623770K820777L046344L321754L648060M019310M455929
58142F7333079M990107N626391O353778P186855Q155865R273462J0562199J2095565
58134A31577301J3943870J6086989J8447502K1001043K3794766K6905743L0457971
58127B82215185L4488352L8377705M0297837L7715074K9119714J5525960J38373
$$ plain form
58184 7683971 7990284 8313954 8662104 9037927 9436929 9855993 10298585 10767809 11262833
58175 11262833 11786187 12346152 12947485 13587702 14266145 14987738 15754010 16560331 17406572
58166 17406572 18300540 19246639 20242401 21291400 22407713 23601680 24873221 26225223
58158 26225223 27670491 29218590 30869498 32627831 34509096 36523789 38670571 40954490
58150 40954490 43397135 46020905 48841682 51888026 55209780 58857840 62877150 67333079
58142 67333079 72323186 77949577 84303355 91490210 99646075 108919537 119481736 131577301
58134 131577301 145521171 161608160 180055662 201056705 224851471 251757214 282215185
58127 282215185 316703537 355081242 395379079 433094153 462213867 477739827 477878200
58120D77878200j3579565k3611659k9625970l2218558l2260987l0675019k8301510
58113B87604932k5733018k3285619k1116116j9290189j7766079j6427651j5175637
58106A48810623j3957750j2734574j1484159j0239624r066680p998875p031800
58099G6297161o168498n422348m780463m210517l703433l270715k903998k576988
58091D3260201k284297k039593j836951j651188j475410j322583j190765j061610
58083C0397804r32813q17990p14482o04505m88345l83900k93475k03251j14072
58074B5844971l8379L3642J30298K59721M07845N73484P70168R95952J241684
58065C0219386J528433J892774K332040K807981L306380L850121M466543N204537
$$ plain form
58120 477878200 464298635 440686976 411061006 378842448 346581461 315906442 287604932
58113 287604932 261871914 238586295 217470179 198179990 180413911 163986260 148810623
58106 148810623 134852873 122118299 110634140 100394516 91327836 83328961 76297161
58099 76297161 70128663 64706315 59925852 55715335 52011902 48741187 45837189 43260201
58091 43260201 40975904 38936311 37099360 35448172 33972762 32650179 31459414 30397804
58083 30397804 29464991 28647001 27932519 27328014 26839669 26455769 26162294 25959043 25844971
58074 25844971 25806592 25840234 25970532 26230253 26638098 27211582 27981750 28977702 30219386
58065 30219386 31747819 33640593 35972633 38780614 42086994 45937115 50403658 55608195
58057E5608195O147115P247845Q081966P911647O212881L192889k81742l285299
58049I0835497n341825o444975o790506o596462o081112n449513m840715m311600
58041D4978789l874982l528724l253717l017493k793697k569467k337094k093693
58033B1509922j849342j622271j423151j251161j103703r80787q79926p95006
58025A1604575p21743o58928o03976n52379n02211m55301m13411l76334l43963
58016F976329l17489k98077k85655k78615k73514k66105k54237k39147k23055
58007D540435k06769j90698j76597j66265j59019j52060j43352j33337j23902
57998C088436j16272j10069j04353r9141r5154r1970q7804q1858p5645p0734o6454
$$ plain form
58057 55608195 61755310 69003155 77085121 84996768 91209649 94402538 94120796 90835497
58049 90835497 85493672 79048697 72258191 65661729 59580617 54131104 49290389 44978789
58041 44978789 41103807 37575083 34321366 31303873 28510176 25940709 23603615 21509922
58033 21509922 19660580 18038309 16615158 15363997 14260294 13279507 12399581 11604575
58025 11604575 10882832 10223904 9619928 9067549 8565338 8110037 7696626 7320292 6976329
58016 6976329 6658840 6360763 6075108 5796493 5522979 5256874 5002637 4763490 4540435
58007 4540435 4333666 4142968 3966371 3800106 3641087 3489027 3345675 3212338 3088436
57998 3088436 2972164 2862095 2757742 2658601 2563447 2471477 2383673 2301815 2226170 2155436 2088982
57987B088982o1472n6443n3103n1345m9358m6397m3460m1218l9113l6754l4669
57976A575650l3283l2289l1341l0508k9884k9438k9130k8746k7914k6767k5963
57965A250387k5665k5231k4347k3416k2343k0247j7256j5119j4851j5155j4352
57954A032405j2664j1205j0072q930q226q208p931o814n958o187o112m211j626
57941I34261n76q93o76K52J79j329k697l084l585n172p389r675j2282j5182j7542
57926H54610j8954j9980k0854k0842j9601j8017j6888j5620j3131r580o409m778
57914F69956m567m911n287n771o246o035m696k879j470j62J960M341N047L519
57900F42799J796J915L245L737K828J586O27n89k434m504o362p857q696q576p762
$$ plain form
57987 2088982 2027510 1971067 1917964 1866619 1817261 1770864 1727404 1686186 1647073 1610319 1575650
57976 1575650 1542367 1510078 1478737 1448229 1418345 1388907 1359777 1331031 1303117 1276350 1250387
57965 1250387 1224722 1199491 1175144 1151728 1129385 1109138 1091882 1076763 1061912 1046757 1032405
57954 1032405 1019741 1008536 998464 989534 981308 973100 965169 958355 952397 946210 940098 935887 934261
57941 934261 933685 932792 932116 932368 932547 931218 928521 925437 921852 916680 909291 899616 887334 872152 854610
57926 854610 835656 815676 794822 773980 754379 736362 719474 703854 690723 681143 674734 669956
57914 669956 665389 660478 655191 649420 643174 637139 632443 629564 628094 627932 629892 634233 639280 642799
57900 642799 644595 646510 649755 653492 656320 657906 658533 657944 655510 651006 644644 636787 628091 619515 611753
57885F11753o794n678m132k546j882k465l490l844l066j467L82K186M065N980
57871E89002P225P071N946N106M920M324K562N63j20Q61K566L953M413L692K052
57856F44136K48j288k994n415q181j0290j1176j1193j1095j1282j1388j0769r614
57843E39699r150j0064j1344j1614j1166j1192j1382j0242p852o197o135o081
57831D27280m676k810j761j104l1Q63P99N81J372K746L722M689O476Q161P865
57816D54172N502L055K128K615L603M329M208L036J196q92l216n362o131m988
57802D63255l261k731l484m272m428m309m303m485m862m936l563l41L483O397
57788D28160Q242R439R681Q837Q218R120J0750J1294J0560R732R046P681N792
$$ plain form
57885 611753 604959 599281 595149 592603 590721 588256 584766 580922 577856 576389 576771 578957 583022 589002
57871 589002 596227 603298 609244 614350 619270 623594 626156 626719 626599 627460 630026 633979 638392 642084 644136
57856 644136 644384 643096 640102 634687 626506 616216 605040 593847 582752 571470 560082 549313 539699
57843 539699 530549 520485 509141 497527 486361 475169 463787 453545 445693 439496 433361 427280
57831 427280 422604 419794 418033 416929 416898 417761 418560 419141 420513 423259 426981 431670 438146 446307 454172
57816 454172 459674 462729 464857 467472 471075 475404 479612 482648 483844 482952 479736 474374 468243 463255
57802 463255 459994 457263 453779 449507 445079 440770 436467 431982 427120 422184 418621 418280 421763 428160
57788 428160 436402 445841 455522 464359 472577 481697 492447 503741 514301 524033 533079 540760 546552
57775E46552M501L704J829j729n510p908q817q965q929r236j0313j1828j2882
57762D70469j3053j2575j1571j0008q182o283l909j158M90l0j211o60J323K069
57748D05711N79j126j343j101k114m193o061p253p939p990p379o619n898m751
57734C42523l249k353k306k002q93j07m30m96J320M219N948N878N476N881O624
57719C66033O830O442N917N613N771O518P662Q781R515R662R414R649J1277J3865
57705D82949J5597J5203J3223J0805Q166N165K452P79l01j781l671n412p286r854
57691E26034j2245j2802j1625j0778j1384j2141j1563j0147r142q444p204n761
57679D02798n202n351m760k881q16N41J871M153O823Q263P896O945P086Q726J0770
$$ plain form
57775 546552 551053 554757 556586 554857 549347 541439 532622 523657 514728 505492 495179 483351 470469
57762 470469 457416 444841 433270 423262 415080 408797 404888 403730 404220 404190 402979 402319 403642 405711
57748 405711 406290 405164 403821 402720 400606 396413 390352 383099 375160 367170 359791 353172 347274 342523
57734 342523 339274 336921 334615 332613 331720 331613 331183 330687 332007 336226 342174 348052 353528 359409 366033
57719 366033 372863 379305 385222 390835 396606 403124 410786 419567 429082 438744 448158 457807 469084 482949
57705 482949 498546 513749 526972 537777 545943 551108 553560 554339 554038 552257 548586 543174 535888 526034
57691 526034 513789 500987 489362 478584 467200 455059 443496 433349 424207 415763 408559 402798
57679 402798 397596 392245 387485 384604 383788 384329 386200 390353 397176 405439 413335 420280 427366 436092 446862
57664D46862J1848J1731J1511J2294J3854J4996J5233J5419J6333J7431J7763
57653F05275J7637J8292J9898K1025K0626J9711K0201K2502K5096K6752K8379
57642H45394L1970L7756M3242M5938M6760M9536N6581O5704P2582P5282P4902
57631A445647P2232O5952N5056M1483K8970J9996J4972J3809J6782K3751L3486
57620A832136M4133N4180O3067P1404Q0392R0645J01630J12397J22277J30474
57610B702735J35601J36650J34120J29373J22982J14545J04097R2680Q0891O7200
57600C820874M8208K0888j4916n5626r5516j29531j54938j70931j77859j77347
57590B913306j72137j64436j54517j41853j27498j14170j03674r5165q6500p6703
$$ plain form
57664 446862 458710 470441 481952 494246 508100 523096 538329 553748 570081 587512 605275
57653 605275 622912 641204 661102 682127 702753 722464 742665 765167 790263 817015 845394
57642 845394 877364 915120 958362 1004300 1051060 1100596 1157177 1222881 1295463 1370745 1445647
57631 1445647 1517879 1583831 1638887 1680370 1709340 1729336 1744308 1758117 1774899 1798650 1832136
57620 1832136 1876269 1930449 1993516 2064920 2145312 2235957 2337587 2449984 2572261 2702735
57610 2702735 2838336 2974986 3109106 3238479 3361461 3476006 3580103 3672783 3753674 3820874
57600 3820874 3869082 3889970 3875054 3819428 3723912 3594381 3439443 3268512 3090653 2913306
57590 2913306 2741169 2576733 2422216 2280363 2152865 2038695 1935021 1839856 1753356 1676653
57580A676653o6577n7350m9460m2576l6313l0518k5014j9397j3326o933p18M918
57568A333389R870J4255J8471K3150K8508L3841L8331M2254M6598N1697N7226
57557A697590O3523P1305P9687Q6153Q9395R0757R1705R1278Q7532Q0115O9551
57546B598591N5116L5738J2707j0750l2460n1959o8435q0491q8432r4593j00329
57535B174703j04395j05179j03014r9305r4737q9579q4586q0375p6643p2877o9066
57524A194947o5031n9995n3903m8276m4644m2647m0677l7946l4803l1576k8164
57513G07285k4804k2211k0865k0548k0587k0199j8764j6353j3801j1985j1067
57502E06101j0599j0087r252q103o925n898m737l114j435l59M55K109M569O182
$$ plain form
57580 1676653 1610076 1552726 1503266 1460690 1424377 1393859 1368845 1349448 1336122 1329189 1328471 1333389
57568 1333389 1343259 1357514 1375985 1399135 1427643 1461484 1499815 1542069 1588667 1640364 1697590
57557 1697590 1761113 1832418 1912105 1998258 2087653 2178410 2270115 2361393 2448925 2529040 2598591
57546 2598591 2653707 2689445 2702152 2691402 2658942 2606983 2538548 2458057 2369625 2275032 2174703
57535 2174703 2070308 1965129 1862115 1762810 1668073 1578494 1493908 1413533 1336890 1264013 1194947
57524 1194947 1129916 1069921 1016018 967742 923098 880451 839774 801828 767025 735449 707285
57513 707285 682481 660270 639405 618857 598270 578071 559307 542954 529153 517168 506101
57502 506101 495502 485415 476163 468060 461135 455237 450500 447386 445951 445592 446047 448156 452725 458907
57488D58907N950N348O720J0267J3845J5498J5224J4223J3506J3620J4872J7109
57476F05089J9487K1070K1866K3039K5746K9710L3253L5058L5663L6806L9513
57465I26300M3386M7597N1871N6343O1099O6042P0703P4053P5129P3977P1359
57454A617859O7376O1118N1921M0222K6737J1647m692k0823l4774m5504n3343
57443A717744n9126o3334o5822o6279o4927o2726o0580n8489n5983n3232n0902
57432A056344m8939m6371m2555l7938l3299k8944k4852k0979j7267j3873j1367
57421G29960r825q019m738q13J655K353L246N578Q260J0217J2452J6105J9928
57408G86359K1861K2332K4058K8675L5152M1535M6872N1291N5254N9049O2505
$$ plain form
57488 458907 464857 470205 476925 487192 501037 516535 531759 545982 559488 573108 587980 605089
57476 605089 624576 645646 667512 690551 716297 746007 779260 814318 849981 886787 926300
57465 926300 969686 1017283 1069154 1125497 1186596 1252638 1323341 1397394 1472523 1546500 1617859
57454 1617859 1685235 1746353 1798274 1838496 1865233 1876880 1872188 1851365 1816591 1771087 1717744
57443 1717744 1658618 1595284 1529462 1463183 1398256 1335530 1274950 1216461 1160478 1107246 1056344
57432 1056344 1007405 961034 918479 880541 847242 818298 793446 772467 755200 741327 729960
57421 729960 720135 712116 707378 706565 708220 710573 713819 719397 727657 737874 750326 766431 786359
57408 786359 808220 830552 854610 883285 918437 959972 1006844 1058135 1113389 1172438 1234943
57397A234943O5069O6378O6329O4395N9689N2108M2392L0529J5464k495k0359
57386A674442l5094m6627n6657o5517p2067p6019p8058p7966p4790o9144o3408
57375I59095n9214n6390n4595n4121n4312n2998m8709m2537l6778l2429k8747
57364D38265k4730k0353j6630j4669j4446j4607j3918j2479j0872q748n554k161
57352B79098k29rl14o75j769l499m535m366m025l984l112r25Q59N85p35q23P26
57335B52268K329K978L215L690M186M392M538M884N187M945L894K303R47O41J418
57320C01815K449K917K671J899P93j19j07Q46J854K330K697L366L913M101M801
57305C36226O674Q575Q641O863N132M752N151N323N258N346N380N028M594M486
$$ plain form
57397 1234943 1300012 1366390 1432719 1497114 1556803 1608911 1651303 1681832 1697296 1694801 1674442
57386 1674442 1639348 1592721 1536064 1470547 1398480 1322461 1244403 1166437 1091647 1022503 959095
57375 959095 899881 843491 788896 734775 680463 627465 578756 536219 499441 467012 438265
57364 438265 413535 393182 376552 361883 347437 332830 318912 306433 295561 286813 281259 279098
57352 279098 278869 278860 278546 277871 276102 272603 268068 263702 259677 255693 252581 251656 252515 253100 252365 251542 252268
57335 252268 254597 257575 260790 264480 268666 273058 277596 282480 287667 292612 296506 298809 299756 300397 301815
57320 301815 304264 307181 309852 311751 312544 312425 312318 313164 315018 317348 320045 323411 327324 331425 336226
57305 336226 342900 351475 360116 366979 372111 376863 382014 387337 392595 397941 403321 408349 412943 417429
57291D17429M384L788L191L724N582P576Q604Q830Q953Q988Q548P921P681P322
57277E12521N624K857J254K322M740O181O389O770P556P530O751P256J0006J2938
57263F00695J3508J2058J1056J1787J3238J4019J3914J3608J3904J5217J6964
57252G49968J7564J5944J3082J1186J1269J2292J2760J2353J1728J1457J1541
57241H91144J1594J1223J0446R851J0026J0863J1664J2013J2175J2693J3901J5748
57229A033341J7711J9079J9800K0908K3449K6987K9962L1641L2932L4824L6809
57218A327443L7640L7213L6767L7116L7476L6382L3263K8748K3755J8867J4477
57207A669147J0860P867M933J838r17k841m276n840p246p396n892l841k697k676
$$ plain form
57291 417429 421813 425601 428792 432516 438098 445674 454278 463108 472061 481049 489597 497518 505199 512521
57277 512521 518145 521002 522256 524578 529318 535499 541888 548658 556214 563744 570495 577751 587757 600695
57263 600695 614203 626261 637317 649104 662342 676361 690275 703883 717787 733004 749968
57252 749968 767532 783476 796558 807744 819013 831305 844065 856418 868146 879603 891144
57241 891144 902738 913961 924407 934258 944284 955147 966811 978824 990999 1003692 1017593 1033341
57229 1033341 1051052 1070131 1089931 1110839 1134288 1161275 1191237 1222878 1255810 1290634 1327443
57218 1327443 1365083 1402296 1439063 1476179 1513655 1550037 1583300 1612048 1635803 1654670 1669147
57207 1669147 1680007 1687874 1692807 1694645 1693728 1690887 1686611 1680771 1673525 1666129 1660237 1656396 1653699 1651023
57193A651023k730j822J09K323M005M788M865M710M692N056O139Q258J1157J3800
57179A716373J5067J4753J3890J4020J5943J8987K1651K3211K4452K6541K9520
57168A934408L2462L4917L7325L9884M1923M2716M2342M1376M0329L9726M0052
57157B367460M1067M1741M1444M0841M1033M2158M3471M4553M5746M7431M9323
57146B846268N0819N1777N2849N4752N7186N8807N8796N8125N8497O0287O2579
57135C470742O5065O8471P2691P6072P7449P7645P7846P7550P5440P1545O7076
57124D277592O2811N8851N5536N3154N1086M8606M6143M4403M2632L9470L5322
57113D815606L1975K9706K6701K1916J6631J2241Q246L666j069n263r868j6245
$$ plain form
57193 1651023 1648293 1646471 1646580 1648903 1652908 1657696 1662561 1667271 1671963 1677019 1683158 1691416 1702573 1716373
57179 1716373 1731440 1746193 1760083 1774103 1790046 1809033 1830684 1853895 1878347 1904888 1934408
57168 1934408 1966870 2001787 2039112 2078996 2120919 2163635 2205977 2247353 2287682 2327408 2367460
57157 2367460 2408527 2450268 2491712 2532553 2573586 2615744 2659215 2703768 2749514 2796945 2846268
57146 2846268 2897087 2948864 3001713 3056465 3113651 3172458 3231254 3289379 3347876 3408163 3470742
57135 3470742 3535807 3604278 3676969 3753041 3830490 3908135 3985981 4063531 4138971 4210516 4277592
57124 4277592 4340403 4399254 4454790 4507944 4559030 4607636 4653779 4698182 4740814 4780284 4815606
57113 4815606 4847581 4877287 4903988 4925904 4942535 4954776 4963022 4966688 4965619 4960356 4950488 4934243
57101D934243k3489k8938l1517l2970l5209l7825l9224l9306l9652m1120m2467
57090D542526m1865l9070l5468l2448l0525k9677k9465k8713k6397k3388k2319
57079D203191k4977l0704l8056m6873n7463o8936q0250r2375j07365j25231j43732
57068C387229j61464j79391j98909k20498k45012k74496l10172l50752l93728
57059A052807m37297A35144c87202n64481o10030o61748p19902p83981q55021
57050d582365r34503j022168j117200j220866j335877j463390j602919j755055
57042a5034343j922005k105404k306368k528887k781797l077783l433814l872675
57034c7063076m416615n070599n811205o600782p419791q280576r194212j0113968
$$ plain form
57101 4934243 4910754 4881816 4850299 4817329 4782120 4744295 4705071 4665765 4626113 4584993 4542526
57090 4542526 4500661 4461591 4426123 4393675 4363150 4333473 4304008 4275295 4248898 4225510 4203191
57079 4203191 4178214 4147510 4109454 4062581 4005118 3936182 3855932 3763557 3656192 3530961 3387229
57068 3387229 3225765 3046374 2847465 2626967 2381955 2107459 1797287 1446535 1052807
57059 1052807 615510 135144 -387202 -951683 -1561713 -2223461 -2943363 -3727344 -4582365
57050 -4582365 -5516868 -6539036 -7656236 -8877102 -10212979 -11676369 -13279288 -15034343
57042 -15034343 -16956348 -19061752 -21368120 -23897007 -26678804 -29756587 -33190401 -37063076
57034 -37063076 -41479691 -46550290 -52361495 -58962277 -66382068 -74662644 -83856856 -93970824
57026i3970824j0924446j1523985j1955476j2457490j3334340j4692556j6240530
57019a85099647j7341944j7324660j5830966j2955283r097531m695657o8704M547293
57011b57867099Q886572J2625711J5475017J7287474J8083964J7999322J7222774
57004a50286265J5972687J4481093J2957571J1546039J0309885R253566Q355542
56997f7409882P587966O921494O326256N775039N247749M734757M237502L765054
56989b2814065L327951K933344K583947K278962K014382J783491J579335J397919
56981d914734J238703J101982R86429f98331A09470P39516O81483O30378N83609
56972B744456N39846M98189M57382M16317L75207L35768K99978K68629K40948
$$ plain form
57026 -93970824 -104895270 -116419255 -128374731 -140832221 -154166561 -168859117 -185099647
57019 -185099647 -202441591 -219766251 -235597217 -248552500 -257650031 -262345688 -262414392 -257867099
57011 -257867099 -248980527 -236354816 -220879799 -203592325 -185508361 -167509039 -150286265
57004 -150286265 -134313578 -119832485 -106874914 -95328875 -85018990 -75765424 -67409882
56997 -67409882 -59821916 -52900422 -46574166 -40799127 -35551378 -30816621 -26579119 -22814065
56989 -22814065 -19486114 -16552770 -13968823 -11689861 -9675479 -7891988 -6312653 -4914734
56981 -4914734 -3676031 -2574049 -1587620 -698331 109470 848986 1530469 2160847 2744456
56972 2744456 3284302 3782491 4239873 4656190 5031397 5367165 5667143 5935772 6176720
56963F176720K15512J91195J66942J41018J11830Q0626N2584L3273K3418J8405
56953G211523J3493Q026L593K1m372r372j2602j3155j3130j4605j7072j9428k2931
56940G109989l0131m1389n4224o6176p7192q9039j03046j18378j32053j41060
56930F257301j45164j47459j51603j58892j68340j78512j87919j94118j94215
56921D731079j86952j73644j56920j38941j20755j02563q4172o5266m5167k2484
56911C634215M300L5759P1961J14186J64935K25702K95691L71548M43217M87214
56901E848728M69962L68618J94029r402j89996l16697l85816m09476m02925l79275
56891D787750l48347l16382k86963k62241k42786k27107k12937j99004j84940
$$ plain form
56963 6176720 6392232 6583427 6750369 6891387 7003217 7083843 7136427 7169700 7193118 7211523
56953 7211523 7225016 7233042 7236635 7236656 7232284 7222912 7210310 7197155 7184025 7169420 7152348 7132920 7109989
56940 7109989 7079858 7038469 6984245 6918069 6840877 6751838 6648792 6530414 6398361 6257301
56930 6257301 6112137 5964678 5813075 5654183 5485843 5307331 5119412 4925294 4731079
56921 4731079 4544127 4370483 4213563 4074622 3953867 3851304 3767132 3701866 3656699 3634215
56911 3634215 3638515 3674274 3746235 3860421 4025356 4251058 4546749 4918297 5361514 5848728
56901 5848728 6318690 6687308 6881337 6871935 6681939 6365242 5979426 5569950 5167025 4787750
56891 4787750 4439403 4123021 3836058 3573817 3331031 3103924 2890987 2691983 2507043
56882B507043j70337j54831j38503j21485j04106q7946p5206o5952n7542m8037
56872A483098l8592l0919k4360j7909j3552j4467k0415k7734l3751l8548m2357
56861A180494m4089m3290m1349l9716l8409l6814l4564l1330k7238k3706k2161
56850G97828k1819k0579j8277j6843j6720j5636j2088p929n895o157o835o573
56838F42477n051k131J821N448P670R009J0627J2700J4693J6555J8587K0682K2606
56825G75693K4351K5336K4117J9991J4210Q617L658j053m910o620o208n361n539
56812H66282o619p502p294n823l636j587J13K315N916J0673J5733K1201K8030
56799I17802L5946M2186M3156L7462K7012J5121L921o066j4394j9870k1715k0709
$$ plain form
56882 2507043 2336706 2181875 2043372 1921887 1817781 1729835 1654629 1588677 1531135 1483098
56872 1483098 1444506 1413587 1389227 1371318 1357766 1343299 1322884 1295150 1261399 1222851 1180494
56861 1180494 1136405 1093115 1051766 1012050 973641 936827 902263 870933 843695 819989 797828
56850 797828 776009 755430 737153 720310 703590 687954 675866 667937 662042 655885 649050 642477
56838 642477 637426 635295 637116 642564 650234 659243 669870 682570 697263 713818 732405 753087 775693
56825 775693 800044 825380 849497 869488 883698 892315 895973 894920 890010 883390 877182 871821 866282
56812 866282 859663 852161 844867 839044 835408 833821 833934 836249 842165 852838 868571 889772 917802
56799 917802 953748 995934 1039090 1076552 1103564 1118685 1122606 1116540 1102146 1082276 1060561 1039852
56787A039852j8258j4836j0344n563j888N78L394P874J3816K0384K7141L3779
56775A095929L9924M5803N1945N7173N7740M9836L3144J1496r817k7160l9522
56764A366491m7326n0747m9629m4930l9226l4646l0830k6109k0318j4907j0421
56753I97402n671L13P207J4558K2224K9159L3625L5242L4811L1401K2187O875
56741A229333r931k3035l1607l7664m1528m1887l9383l6752l5124l2902k8883
56730H70637k4250k0651j8005j5102j1126o113q74L240N447O579P899Q898P679
56717H14258L600j907p522j3371j9438k4213k6238k6053k5299k4454k2773k0343
56705F06247j8753j9119k0335k0193j7966j5006j2710j1009r470q664r068r250
$$ plain form
56787 1039852 1021594 1006758 996414 990851 988963 989541 992935 1000809 1014625 1035009 1062150 1095929
56775 1095929 1135853 1181656 1233601 1290774 1348514 1398350 1431494 1442990 1433173 1406013 1366491
56764 1366491 1319165 1268418 1218789 1173859 1134633 1099987 1069157 1043048 1022730 1007823 997402
56753 997402 991731 992044 999251 1013809 1036033 1065192 1098817 1134059 1168870 1200271 1222458 1229333
56741 1229333 1219402 1196367 1164760 1127096 1085568 1043681 1004298 967546 932422 899520 870637
56730 870637 846387 825736 807731 792629 781503 775390 774516 777756 783203 789782 797681 806579 814258
56717 814258 817858 815951 808429 795058 775620 751407 725169 699116 673817 649363 626590 606247
56705 606247 587494 568375 548040 527847 509881 494875 482165 471156 461686 453022 443954 434704
56693D34704p067k887K96M85j117k332k727l017l261l182l096l135k521j133n92
56678C99418k083m076m234k913k597m135n673n455l786j897m28M32O34N25N36
56663C64268M68j75j314k495l508l889k690n0J893J387l77r52k19Mn89m65N78
56646C51875P54n62j770k125l254n967p847o225k053J290K216K027K348L235L962
56631C37904M293M481M571M127K805J236Q06J919K929K014j43r98L80K038J950
56616C70312O51J33J231L047M269M265L389K756L184M109M186L046J676R32P39
56601D07925R61J854L235M301M642M447L576J669n33j487r43k71j81J54R84Q85
56585D31218r14k741k705j449r28j372j378n32k0o19j651k253k421k446k202j636
$$ plain form
56693 434704 427637 424750 425046 425531 424414 422082 419355 416338 413077 409895 406799 403664 401143 400010 399418
56678 399418 397335 393259 389025 386112 383515 379380 373707 368252 364466 362569 362141 362573 363207 363732 364268
56663 364268 364736 364561 363247 360752 357244 353355 350665 350615 352508 353895 353518 352566 352347 352351 351762 351297 351875
56646 351875 352629 352067 350297 348172 344918 338951 331104 324879 322826 324116 326332 328359 330707 333942 337904
56631 337904 342197 346678 351249 355376 358181 359417 360223 362142 365071 367085 366942 365944 366324 368362 370312
56616 370312 370963 371096 372327 375374 379643 383908 387297 390053 393237 397346 401532 404578 406254 407186 407925
56601 407925 408886 410740 413975 418276 422918 427365 430941 432610 432077 430590 429647 429376 429195 429349 430333 431218
56585 431218 430304 427563 424858 423409 422481 421109 419731 419199 419179 418560 416909 414656 412235 409789 407587 405951
56569D05951j439k536m950p367q244p474o559o723p258o579m508k409j172l61
56555C38372M13O54jj004j716k015j727m62J433K724K656J581J3j890l471l608
56539C31952k269r23p17j276j799k080j882o55J253K401K176J707K111L055M003
56524C37057N282O899P698P068O134N850N303L485J551J293K400L167L238L642
56510D00067M523M979M952N453O628P316O830N951N794O707Q351R903J0211Q848
56496D96513P095O880Q569J0668J1769J1947J2061J2544J3130J3334J2882J1969
56484F29361J1046J0184Q927P066N209M154L961L967L437K003p1j883k703k867
56470F81791l222l761l914m235o153r513j2040j2232j1293j0817j0228q269n906
$$ plain form
56569 405951 404512 401976 397026 389659 381415 373941 367382 360659 353401 346822 342314 339905 338733 338372
56555 338372 338785 339439 339438 338434 336718 334703 332976 332514 333947 336671 339327 340908 340921 339031 335560 331952
56539 331952 329683 328760 328043 326767 324968 322888 321006 320351 321604 324005 326181 327888 329999 333054 337057
56524 337057 342339 349238 356936 364004 370138 375988 381291 384776 386327 387620 390020 393187 396425 400067
56510 400067 404590 409569 414521 419974 426602 433918 440748 446699 452493 459200 467551 477454 487665 496513
56496 496513 503608 510488 519057 529725 541494 553441 565502 578046 591176 604510 617392 629361
56484 629361 640407 650591 659518 666584 671793 675947 679908 683875 687312 689315 689244 687361 684658 681791
56470 681791 678569 674808 670894 666659 660506 650993 638953 626721 615428 604611 594383 586114 580208
56457E80208n481p342r337r812r343r150r170q456o731m892m120m679n646n972
56443D80077n758n884o495o697n935m617l159j597n02q18k164k750j925j234j913
56428D28629k825k339q98k6R4L01N40J79l64K3J340K434K553J843P04l36n78J8
56410D31292N21M13N45J764L415M341M488M484M516M684N411O405O405N227M667
56395D88578N885P375P248O238O334P550Q332Q305Q326Q411P803O727O126O005
56381E89243N750N643O244O944O833O340O209N799M422L333M016N362N067L105
56367F64310J160p28l836p323q430o549m322m022n298o961q619r790r650q530
56353E81412p756p516o696n256m703n581o448o152n433n473o278p175p697p543
$$ plain form
56457 580208 574727 567385 558048 548236 538893 529743 520573 512117 505386 500494 496374 491695 486049 480077
56443 480077 474319 468435 461940 455243 449308 444691 441532 439935 439433 438615 436451 433701 431776 430542 428629
56428 428629 425804 423465 422567 422541 422635 422936 423476 423655 423291 423314 424654 427088 429641 431484 432188 431852 431274 431292
56410 431292 431813 432226 432771 434535 437950 442291 446779 451263 455779 460463 465874 472279 478684 483911 488578
56395 488578 494463 501838 509086 515324 521658 529208 537540 545845 554171 562582 570385 577112 583238 589243
56381 589243 594993 600636 606880 613824 620657 626997 633206 639005 643427 646760 650776 656138 661205 664310
56367 664310 665470 664742 660906 653583 645153 638604 634282 630260 624962 618001 609382 599592 589942 581412
56353 581412 573656 566140 559444 554188 549485 543904 537456 531304 525871 520398 514120 506945 499248 491705
56339D91705o676n611m787l953l098l046l758l318n85K352K820J585J335K143
56325D67108J705l49k021k685l709n088n114l950l812m842m482k039j33j37O7
56310D30519J902L254K275R04J804M165N373M814L533J898K6q88Q5K037L641M833
56294D70175N663N310L926L502M978O306N463L675L236L705K985J105K09J162
56280E21400K648L534M074M572M533L605K295J419J393J969K382K061J416J355
56266E58656J998K822L945N961Q286R258Q398P086O560O678P144Q251R740J0600
56252F55383J0693J1104J2202J2969J2783J2145J1157R255P069O288O848O431
56240G74327L892R72n82j415k638l594l282k210j347p92p70k102m312n168l687
$$ plain form
56339 491705 485029 479418 474631 470678 467580 464534 460776 457458 456873 459225 462045 463630 464965 467108
56325 467108 468813 468464 466443 463758 460049 454961 449847 445897 442085 437243 432761 430722 430589 430452 430519
56310 430519 432421 435675 437950 438854 440658 444823 450196 455010 458543 460441 460467 459579 459664 461701 465342 470175
56294 470175 475838 481148 485074 488576 493554 499860 505323 508998 512234 515939 518924 520029 520238 521400
56280 521400 524048 527582 531656 536228 540761 544366 546661 548080 549473 551442 553824 555885 557301 558656
56266 558656 560654 563476 567421 573382 581668 590926 599324 606410 612970 619648 626792 635043 644783 655383
56252 655383 666076 677180 689382 702351 715134 727279 738436 747691 754760 761048 767896 774327
56240 774327 778219 779191 778609 777194 774556 770962 767680 765470 764123 763331 762561 760459 756147 750979 747292
56225G47292j795j518k254k382j816j317r51q71j853l472l436n33L328N705O629
56210G40756P332P711P040N989O023P740J0915J4903J7924J7778J4758J2165J2566
56197H83600J5192J8275K1707K5709K9023L0583L1333L2559L4055L5502L7674
56186A195212M0468M1846M0725L8912L8198L7618L5688L3249L1620K9938K6807
56175A590281K2904J9460J5992J1930Q659P370O639M714K616K318L549M894O280
56162A707606P728P557M851J881R98P30j686n517p860q526r913j2772j5680j8267
56148A651130k1524k5111k7370k8058k8359k8454k7570k6172k5656k5987k5921
56137A360948k5179k4348k3184k1170j9163j8400j8480j8084j6968j5484j3484
$$ plain form
56225 747292 745497 743979 741725 739343 737527 736210 735259 734388 732535 729063 725627 725094 728422 734127 740756
56210 740756 748088 755799 762839 768828 774851 782591 793506 808409 826333 844111 858869 871034 883600
56197 883600 898792 917067 938774 964483 993506 1024089 1055422 1087981 1122036 1157538 1195212
56186 1195212 1235680 1277526 1318251 1357163 1395361 1432979 1468667 1501916 1533536 1563474 1590281
56175 1590281 1613185 1632645 1648637 1660567 1669226 1676596 1683235 1687949 1690565 1692883 1696432 1701326 1707606
56162 1707606 1715334 1722891 1727742 1729623 1730621 1731351 1729665 1724148 1716288 1707762 1697849 1685077 1669397 1651130
56148 1651130 1629606 1604495 1577125 1549067 1520708 1492254 1464684 1438512 1412856 1386869 1360948
56137 1360948 1335769 1311421 1288237 1267067 1247904 1229504 1211024 1192940 1175972 1160488 1147004
56126A147004j1279j0202j0180q717m677j069j181l690m761l424j570r1J519K756
56112A090438K664K124K549L362L509M180O758R510R843Q737R293J1763J3652
56099A178382J3993J3916J3619J2406J1171J1363J1986J0981R015Q479R494J0285
56087A315090J0782J2100J3289J2483J0840J1413J4454J7540K0003K3257K7060
56076A488311K9519L0876L3410L7436M1082M4184M8658N4829O1118O7546P5966
56065B012935Q6550R7504J08530J21077J35017J48703J62566J79239J99460K20920
56055C472501K41157K58472K70001K72422K65142K50300K30067K06891J85329
56046E652282J69555J58837J48553J35153J17149R2856O1930K8850K12k1744l9504
$$ plain form
56126 1147004 1135725 1125523 1115343 1106626 1101949 1100880 1099699 1096009 1091248 1087824 1086254 1086163 1087682 1090438
56112 1090438 1093102 1095226 1097775 1101137 1104646 1108826 1115584 1125094 1134937 1143674 1152967 1164730 1178382
56099 1178382 1192375 1206291 1219910 1232316 1243487 1254850 1266836 1277817 1286832 1295311 1304805 1315090
56087 1315090 1325872 1337972 1351261 1363744 1374584 1385997 1400451 1417991 1437994 1461251 1488311
56076 1488311 1517830 1548706 1582116 1619552 1660634 1704818 1753476 1808305 1869423 1936969 2012935
56065 2012935 2099485 2196989 2305519 2426596 2561613 2710316 2872882 3052121 3251581 3472501
56055 3472501 3713658 3972130 4242131 4514553 4779695 5029995 5260062 5466953 5652282
56046 5652282 5821837 5980674 6129227 6264380 6381529 6474385 6536315 6565165 6565377 6543633 6504129
56035F504129n5073o9026q4170j04789j31243j59341j85579k08963k27718k38767
56025E039460k41463k38011k29687k16281j99415j82447j66721j51382j36779
56016C277274j24256j12905j00610q8079p7744o9141n9703m9633m1484l5285k8750
56005B489684k1946j6947j3205q230k679J87N9j01R88K425M867R755J5396J8884
55991B479137K1116K4723K8350K8771K7404K8314L0965L1613L1006L3447L8762
55980B803608M2584M4377M7775N2929N6005N6480N7830O0902O3765O7616P5142
55969C429013Q3613Q7700Q8664R2255R8230J01309J02035J06436J14591J20039
55959D423885J21538J25013J32451J39357J44779J53252J64861J74034J80361
$$ plain form
56035 6504129 6449056 6380030 6295860 6191071 6059828 5900487 5714908 5505945 5278227 5039460
56025 5039460 4797997 4559986 4330299 4114018 3914603 3732156 3565435 3414053 3277274
56016 3277274 3153018 3040113 2939503 2851424 2773680 2704539 2644836 2595203 2553719 2518434 2489684
56005 2489684 2467738 2450791 2437586 2429356 2426677 2426864 2426923 2426822 2427810 2430235 2435102 2444857 2460253 2479137
55991 2479137 2500253 2524976 2553326 2582097 2609501 2637815 2668780 2700393 2731399 2764846 2803608
55980 2803608 2846192 2890569 2938344 2991273 3047278 3103758 3161588 3222490 3286255 3353871 3429013
55969 3429013 3512626 3600326 3688990 3781245 3879475 3980784 4082819 4189255 4303846 4423885
55959 4423885 4545423 4670436 4802887 4942244 5087023 5240275 5405136 5579170 5759531
55950E759531J90101K04901K19615K33144K50219K70535K87773L01603L18787
55941H036209L40238L59493L76283L98390M27250M55360M81067N11853N49398
55932A1935541N86019O19678O57517P00480P40139P75357Q15917Q64920R14415
55923A8609983R63415J022244J093230J165720J236601J316443J408630J502800
55915B8319066J596404J701308J821064J944187K068662K209590K373894K553287
55907D4587462K751916K992884L286594L622988M007296M470303N029886N678878
55899G6428207O426022P308575Q349030R548174J0941247J2604973J4583333J6870655
55891A63060216J9496238K2538670K6001854K9749720L3552354L6927202L8701238
$$ plain form
55950 5759531 5949632 6154533 6374148 6607292 6857511 7128046 7415819 7717422 8036209
55941 8036209 8376447 8735940 9112223 9510613 9937863 10393223 10874290 11386143 11935541
55932 11935541 12521560 13141238 13798755 14499235 15239374 16014731 16830648 17695568 18609983
55923 18609983 19573398 20595642 21688872 22854592 24091193 25407636 26816266 28319066
55915 28319066 29915470 31616778 33437842 35382029 37450691 39660281 42034175 44587462
55907 44587462 47339378 50332262 53618856 57241844 61249140 65719443 70749329 76428207
55899 76428207 82854229 90162804 98511834 108060008 119001255 131606228 146189561 163060216
55891 163060216 182556454 205095124 231096978 260846698 294399052 331326254 370027492
55884C70027492L6973154L0125519J8294083L797743j0080968k0861555k7682639
55877D00592829l0917597l1442447l0211972k8080067k5655814k3255995k1016333
55870B10012604j9012823j7273552j5762332j4419676j3202293j2068120j0967847
55863A07305961r882374q840149p875774o996093o199277n494560m883105m345093
55855E2789536l864040l442920l082817k768188k487259k246144k048818j882204
55847C0967146j733695j605157j497443j398555j299556j206432j124945j048704
55839B0052659r72647r03421q46034p94174p43459p00487o69051o40581o07784
55830A3175021n75133n46959n18052m85651m58197m41927m29661m12436l91935
$$ plain form
55884 370027492 407000646 437126165 455420248 459217991 449137023 428275468 400592829
55877 400592829 369675232 338232785 308020813 279940746 254284932 231028937 210012604
55870 210012604 190999781 173726229 157963897 143544221 130341928 118273808 107305961
55863 107305961 97423587 88583438 80707664 73711571 67512294 62017734 57134629 52789536
55855 52789536 48925496 45482576 42399759 39631571 37144312 34898168 32849350 30967146
55847 30967146 29233451 27628294 26130851 24732296 23432740 22226308 21101363 20052659
55839 20052659 19080012 18176591 17330557 16536383 15792924 15092437 14423386 13782805 13175021
55830 13175021 12599888 12052929 11534877 11049226 10591029 10149102 9719441 9307005 8915070
55821H915070l72569l51767l27423l05142k88881k73282k53717k34869k21098
55812F286322k07488j89292j71463j59827j50678j38147j24507j14461j06063
55803D924396r6010q7766q5992q8501r1284r6038j05411j16072j23519j28708
55793C905095j33528j35260j32033j28153j27323j25891j19427j10726j04539
55784B788215r9456r1980q3869p8430p3756o6480n8432n3037m8600m1594l3382
55773B059199k7695k4354k0938j7758j5996j3924r958o362n279m464j476J500
55761A912495J858J790M141O293L398m974j5871k7492l8266m4740m5325m3468
55749A709839m2786m1973l8539l4051l0993k7831k2123j5694j1689r047m722Q71
$$ plain form
55821 8915070 8542501 8190734 7863311 7558169 7269288 6996006 6742289 6507420 6286322
55812 6286322 6078834 5889542 5718079 5558252 5407574 5269427 5144920 5030459 4924396
55803 4924396 4828386 4740620 4654628 4566127 4474843 4378805 4273394 4157322 4033803 3905095
55793 3905095 3771567 3636307 3504274 3376121 3248798 3122907 3003480 2892754 2788215
55784 2788215 2688759 2596779 2512910 2434480 2360724 2294244 2235812 2182775 2134175 2092581 2059199
55773 2059199 2031504 2007150 1986212 1968454 1952458 1938534 1928576 1922214 1916935 1912471 1910995 1912495
55761 1912495 1914353 1916143 1920284 1926577 1929975 1925001 1909130 1881638 1843372 1798632 1753307 1709839
55749 1709839 1667053 1625080 1586541 1552490 1521497 1493666 1471543 1455849 1444160 1435113 1430391 1431262
55737A431262N106P740J0136J2017J2798J3832J5694J5819J2309P399L675P2m699
55724A543160q310q544p480p505o518j871M094P542R294J2285J5392J5114J1294
55711A577947O067r63j1120k1929k9209l2888l5977l8993m0018l9234l8637l7869
55699A257177l4876l0284k7204k6929k8167k9910l1798l2559l1211k9001k7405
55688I27833k5695k3123k1373k1641k1581j8841j5503j4976j6525j7192j7130
55677G14253j8314j9608j8228j5135j3948j4874j4552j1879r442q795q533p728
55665E53217p540q513r330r098q482q106p912q009q358q109p010o499p402q054
55651D40795o866n077m399l791j595J052K207K705M147N004K807j068k939k262
$$ plain form
55737 1431262 1436368 1444108 1454244 1466261 1479059 1492891 1508585 1524404 1536713 1544112 1547787 1547859 1543160
55724 1543160 1534850 1526306 1518826 1511321 1504803 1502932 1507026 1514568 1523862 1536147 1551539 1566653 1577947
55711 1577947 1584014 1583051 1571931 1550002 1520793 1487905 1451928 1412935 1372917 1333683 1295046 1257177
55699 1257177 1222301 1192017 1164813 1137884 1109717 1079807 1048009 1015450 984239 955238 927833
55688 927833 902138 879015 857642 836001 814420 795579 780076 765100 748575 731383 714253
55677 714253 695939 676331 658103 642968 629020 614146 599594 587715 578273 569478 560945 553217
55665 553217 545677 537164 527834 518736 510254 502148 494236 486227 477869 469760 462750 456251 448849 440795
55651 440795 433929 428852 424453 420662 419067 420119 422326 425031 429178 434182 436989 435921 432982 430720
55637D30720j516j553j158n88j238k070n74K618M102K948J736J962K134J125L3
55622D38681k48l39o14o34p54j836l215l476l211m429p241r768j1184j2186j2629
55607C66917j1632r856q868q313o624m368l705m499m251k305p93q23p49P78K755
55592C03664L823M054L874L180K196J486P82n09j762j970j790k537l584l190j713
55577C06004j322k556l726l882l777l760l145k005j224p75j15j75k305n301o280
55562B65656m784l286l259l413k363n68J122K530L252K756J783J652K075J787
55548B64940J222K027L848M299K601P29M20J447L130N120O246N190K987K310L635
55533C10151M571L727K679L151M602N817O841Q028Q933R285R688J0571J1762J3470
$$ plain form
55637 430720 429204 427651 426493 425905 424667 422597 422023 424641 428743 431691 433427 435389 437523 438648 438681
55622 438681 438433 438094 437480 436846 436092 434256 431041 427565 424354 419925 412684 402916 391732 379546 366917
55607 366917 355285 345429 336561 328248 321624 317256 313551 309052 304801 302496 301703 300880 300131 300909 303664
55592 303664 307487 311541 315415 318595 320791 322277 323059 322550 320788 318818 317028 314491 310907 307717 306004
55577 306004 304682 302126 298400 294518 290741 286981 283836 281831 280607 279832 279717 279542 277237 271936 265656
55562 265656 260872 257586 254327 250914 248551 247983 249105 251635 254887 257643 259426 261078 263153 264940
55548 264940 266162 268189 272037 276336 278937 279666 280086 281533 284663 289783 296029 301219 304206 306516 310151
55533 310151 314722 318449 321128 324279 328881 334698 341539 349567 358500 367785 377473 388044 399806 413276
55519D13276J6217J9367K1418K2160K3200K5912L0184L5165L9982M4019M7936
55508G38836N3831O2651P2178P9652Q5439R1495R6948R8284R3609Q3645O8816
55497A625384M8806K5343J945j9775m0469n9197p2788q0076q3533q5252q4439
55486A175949q0452p5388p1503o8267o3972n8492n2802m7373m2450l8583l5713
55475E40954l3019l0243k7848k5537k2508j9369j7639j7011j5443j2455r738q068
55463C02076o364m612m671o885q766q578p684p693p723o424m515l368k821k168
55449B19804j796k280l265m439o135p897q204o625m604l154j735k87k15k019l927
55434A63222m252l332k121p58L71K63q89j526j351j920l600m416l266j693j049
$$ plain form
55519 413276 429493 448860 470278 492438 515638 541550 571734 606899 646881 690900 738836
55508 738836 792667 855318 927496 1007148 1092587 1184082 1281030 1379314 1472923 1556568 1625384
55497 1625384 1674190 1699533 1701478 1681703 1641234 1582037 1509249 1429173 1345640 1260388 1175949
55486 1175949 1095497 1020109 948606 880339 816367 757875 705073 657700 615250 576667 540954
55475 540954 507935 477692 449844 424307 401799 382430 364791 347780 332337 319882 310144 302076
55463 302076 295712 291100 286429 279544 270778 262200 254516 246823 239100 232676 228161 224793 221972 219804
55449 219804 218008 215728 212463 208024 201889 193992 185788 179163 174559 171405 169670 169383 169168 167149 163222
55434 163222 158970 155638 153517 152759 153130 153393 152504 150978 149627 147707 144107 139691 136425 134732 133683
55419A33683m64O71R06o03k077j935j270j405j383l47K4j678l422k514m8O25j162
55402A17601k925k895j732o44q6p8k89o4M33%j567k552j742k87L35N18R56P63
55384A05745p29j936j185M88J119J061J736K417J137j708l492k930j226J97R76
55369A01670R70J49p07q00n06n15k92R50K514L128K898K572J658o09k998l217
55353A06865j091J202K090K123K433L218M011M390M252M036M241M298K972O67
55339A45707j62J786M431M930L208J166l60j672k427k186j973k969m202l796k052
55324A39429j050j537k417l042l730m115l220j404k37l28q99j489k228k634j925
55309A09174n97J46L73R61J393K53j956k908j830o80j143k387k783k230j643j367
$$ plain form
55419 133683 133219 133890 134796 134193 132116 130181 128911 127506 126123 125776 125800 124122 120700 118186 118138 118763 117601
55402 117601 114676 111781 110049 109405 109319 109241 108952 108888 109321 109321 107754 105202 103460 103173 103508 104026 104982 105745
55384 105745 105016 103080 101895 102383 103502 104563 106299 108716 109853 108145 104653 101723 100497 100694 101670
55369 101670 102640 102789 102082 101282 100776 100261 99969 100919 103433 106561 109459 112031 113689 113080 110082 106865
55353 106865 105774 106976 109066 111189 113622 116840 120851 125241 129493 133529 137770 142068 145040 145707
55339 145707 145545 147331 151762 156692 159900 161066 160706 159034 156607 154421 152448 149479 145277 141481 139429
55324 139429 138379 136842 134425 131383 127653 123538 120318 118914 118677 118349 117450 115961 113733 111099 109174
55309 109174 108577 108723 109096 110057 111450 111703 109747 106839 105009 104329 103186 100799 98016 95786 94143 92776
55293I2776j211j222j527j864j883j529r38l33k1n1r9o6l34q34o38O72K010K243
55275H5151J743J369Q30l28j049q6J529J468o06k569k748j474K26J643J946N62
55259H7607j483k170j002L60K72j093k389k368o09J961L256K078j29q08N06J915
55243H5904J958J048M9q68j585j611q63J53J088J663J189m59j684p53J527K551
55227H9307J544M25O21J064L64q07r09QM95k33j359j571m71R84J544J238J349
55210I3593K318K553N49k631m567m615m002l230j561P25J829Q98p23j426j085
55195G8625m04J21M7p09j111l6J616J671K2p97P46K912L308K012O19l31j233j760
55177H5318j112M50J695J784P40r53k374k398q38R44J328O4j824l172l266j960
$$ plain form
55293 92776 91565 90343 88816 86952 85069 83540 82602 82269 82248 82197 82098 82032 81698 80864 80226 80898 82908 85151
55275 85151 86894 88263 89093 88765 87716 87630 89159 90627 90021 87452 84704 83230 83456 85099 87045 87607
55259 87607 86124 83954 82952 83312 83584 82491 80102 77734 77125 79086 82342 84420 84291 83483 83989 85904
55243 85904 87862 88910 88959 88091 86506 84895 84032 84185 85273 86936 88125 87666 85982 85229 86756 89307
55227 89307 90851 91276 91897 92961 93325 92518 91609 91617 92112 91879 90520 88949 88478 89462 91006 92244 93593
55210 93593 95911 98464 99013 96382 91815 87200 83198 79968 78407 79132 80961 81859 81136 79710 78625
55195 78625 78221 78342 78389 77680 76569 76533 78149 79820 79842 79045 79791 82703 86011 88023 88642 88311 87078 85318
55177 85318 84206 84656 86351 88135 88875 87922 85548 83150 82312 83256 84584 84648 82824 79652 76386 74426
55161G4426J49K008L020L344L112K071L25j287k021j871j108Q8J316J962J946
55146H7480J837J995K117J775Q40n35j682j524L0J239M96j159j191P97K574K683
55130I7772K089J778J070m57j453r42k28q35j942j788n19L72M61K67m80k150l247
55113H9768j633K098M596L822J302l29m58j61m4J19K46k06j188j798j388l87K99
55096I4658L91L30L35qq58j357n48J052J733O85r64j660j248o66m65m38l34j23
55078I0515M13J509K646K588P06j981l462k535J4K152K425J046o31j390r39J75
55062I3251J100J333J141J207J805K673L628M664N269M603K874J623J824K462
55048A29457J970K78j527k753l181k439q27N9p42j743j080L21J04j397j374P56
$$ plain form
55161 74426 74575 76583 79603 82947 86059 88130 88455 87168 85147 83276 82168 82256 83572 85534 87480
55146 87480 89317 91312 93429 95204 96044 95509 93827 92303 92333 93572 94068 92909 91718 92515 95089 97772
55130 97772 99861 101639 102709 102252 100799 99857 99629 98794 96852 95064 94545 94917 95378 95645 95165 93015 89768
55113 89768 88135 90233 94829 98651 99953 99624 99166 99005 98961 99080 99326 99120 97932 96134 94746 94359 94658
55096 94658 95049 95379 95714 95706 94848 93491 92943 93995 95728 96413 95449 93789 92541 91875 91410 90972 90638 90515
55078 90515 90928 92437 95083 97671 98377 96396 92934 90399 90413 92565 94990 96036 95405 94015 93076 93251
55062 93251 94351 95684 96825 98032 99837 102510 106138 110802 116071 120674 123548 125171 126995 129457
55048 129457 131427 131705 130178 127425 124244 121805 120978 121037 120295 118552 117472 117793 117897 116500 115126 115882
55032A15882K109Q57r62j009l37j113k683k763j374o44j179j309p1J352J726J451
55016A09933J304R29m59k513l740k912k80K483L662L091K056J462P72q07k737
55001A12244l711l271j982l71J248K160J646J36r54q41j23L42O12J279K362L086
54985A13862K702J313j32o01J97J703L025L538L122K172J395J233J444J554J661
54970A38188K295L496M478M393L044Q71j238k191j483J6P20K6j126j538r73K1
54954A48999Q35J107R21R60J866L236L945L669L348L720M233L826K282L39j174
54939A82112k039k707l742m884n033l768k384k361l270l562l073l027l512l064
54925A35686j232M08O91L85K63m63k191l153j494J816M026L858K258N58n99j023
$$ plain form
55032 115882 117991 118848 117886 116877 116540 115427 112744 109981 108607 107963 106784 105475 105404 106756 108482 109933
55016 109933 111237 112166 111707 109194 105454 102542 102262 104745 108407 111498 113554 115016 115788 114981 112244
55001 112244 108533 105262 103280 102909 104157 106317 107963 108099 107145 106304 106181 106523 107135 108414 110776 113862
54985 113862 116564 117877 117745 117144 117341 119044 122069 125607 128729 130901 132296 133529 134973 136527 138188
54970 138188 140483 143979 148457 152850 155894 156765 155527 153336 151853 151869 152589 152615 151489 149951 148978 148999
54954 148999 149834 150941 151862 152822 154688 157924 161869 165538 168886 172606 176839 180665 182947 183286 182112
54939 182112 180073 177366 173624 168740 163707 159939 157555 155194 151924 148362 145289 142262 138750 135686
54925 135686 134454 134862 135553 135938 136201 135738 133547 130394 128900 130716 134742 138600 140858 141416 140817 139794
54909A39794j094j637k534k109P90M751P212P300N973M118K213J213J867L342
54895A71199M209M562N494O858P486P538Q347R749R899Q484P830R474J1712J2278
54881B85119J1922J3111J6055J8329J8335J7074J5868J4260J1239P401M200J608
54869D34521j895o775j1358j3957j4874j5324j5352j4320j2869j2538j3415j3854
54857B87990j2921j1402r882p658m636k643l185n022n650m427k629j071N07K050
54843B19421K844K835K948L973O008Q789J1645J3478J3883J4022J5109J6474J6405
54830C47834J4565J1962Q805M309j195n871q712j0609j2475j3781j3831j3099
54818C07902j2254j1050r311q006q082q887q914p787o509n991o134o208n482l653
$$ plain form
54909 139794 138700 137063 134529 132420 133210 137961 145173 152473 158446 162564 164777 165990 167857 171199
54895 171199 175408 179970 185464 192322 199808 207346 215693 225442 235341 243825 251655 261129 272841 285119
54881 285119 297041 310152 326207 344536 362871 379945 395813 410073 421312 428713 432913 434521
54869 434521 432626 425851 414493 400536 385662 370338 354986 340666 327797 315259 301844 287990
54857 287990 275069 263667 253785 246127 241491 238848 235663 230641 224991 220564 217935 216864 217371 219421
54843 219421 222265 225100 228048 232021 238029 246818 258463 271941 285824 299846 314955 331429 347834
54830 347834 362399 374361 383166 387475 386280 380409 371697 361088 348613 334832 321001 307902
54818 307902 295648 284598 275287 267281 259199 250312 241398 233611 227102 221111 214977 208769 203287 199634
54804A99634j175R88K244K802K912K374J278N25P48J176O42m89n45J165L332M365
54788B21976M262M053M038L549K292J008M34K49m85k144m206n966p044p270o553
54773B08193n162l955l863n031o542p199o740o092o112o243n153k749o52j28m50
54758A42122k66J88m17k124l418l365k636k108j685j011j85P35J956L238L947
54743A34971M174M662N295N049L942L462M241M910M430L997N149P303Q818R504
54729B09907J0329J1550J2807J4220J5746J6278J5356J4901J6944K0098K0732
54718C78868J7565J2760Q360M135m08m333o815q450r851j0394r603q557q609r568
54704C45100j0240r961q737o620l917j462K06J485K912M245N052N721P129R513
$$ plain form
54804 199634 198459 199447 201691 204493 207405 209779 211057 211582 212330 213506 214148 213659 213114 214279 217611 221976
54788 221976 226238 230291 234329 237878 240170 241178 241612 241861 241376 239232 235026 229060 222016 214746 208193
54773 208193 203031 199076 195213 190182 183640 176441 169701 163609 157497 151254 146101 143352 142700 142572 142122
54758 142122 141856 142044 141627 139503 136085 132720 130084 127976 126291 125280 125095 125830 127786 131024 134971
54743 134971 139145 143807 149102 154151 158093 161555 165796 170706 175136 179133 184282 191585 200403 209907
54729 209907 220236 231786 244593 258813 274559 290837 306193 321094 338038 358136 378868
54718 378868 396433 409193 417553 421688 421280 416947 410132 401682 391831 381437 371834 363277 354668 345100
54704 345100 334860 324899 316162 309542 305625 304163 304369 305854 308766 313011 318063 323784 330913 340426
54690C40426J2134J3951J4438J4025J3751J4100J4250J3049J0715Q762Q198Q531
54678D86330Q564P368M563O03l131n624p684j0886j4954j7796j8538j8871k0382
54665C89562k2042k1749j9337j6597j4939j4365j4218j3737j2291j0169q818r182
54653B12118j0118r645p549n493m653m569m437m156l625k275j67J339J058l08
54639A57520q85O4J355J526N88k10OQ57J344R93K18k53j22M81J449K799M095M194
54621A76019K269p35k403j240J603L696M167M273N088N835N165L357K281L324
54607B12699N931Q218Q644P185N118L667K896K190J561J735K830L826L819L171
54593B73490K902L523M793O046O445N691M887N761Q586J1846J4417J6795J9445
$$ plain form
54690 340426 352560 366511 380949 394974 408725 422825 437075 450124 460839 469601 477799 486330
54678 486330 494894 502262 506825 507428 504297 498673 490989 480103 465149 447353 428815 409944 389562
54665 389562 367520 345771 326434 309837 294898 280533 266315 252578 240287 230118 221300 212118
54653 212118 202000 192355 184806 179313 174660 170091 165654 161498 157873 155598 155431 156770 157828 157520
54639 157520 156635 156699 158054 159580 160168 159958 159964 160821 162165 163158 163376 163123 163001 163482 164931 167730 171825 176019
54621 176019 178288 177553 175150 173910 175513 179209 183376 187649 192737 198572 203737 207094 209375 212699
54607 212699 218630 226848 235492 242677 247795 251462 254358 256548 258109 259844 262674 266500 270319 273490
54593 273490 276392 279915 284708 290754 297199 302890 307777 313538 322124 333970 348387 365182 384627
54580C84627K1524K2441K3192K4586K5371K4025K1185J8160J3993O711k812j0874
54568E72129j5202j6905j7924j8770j9356j9880j9986j8783j6608j5148j4992
54557C78575j4784j3529j2051j1140j0065q253o852p012p853p704o448n258m679
54544B62947m436m499m971n292m750l570k583k129k134k763m093n437n923n577
54530B04790n122m923m717m107k813q22J195K019J083p87k280k835k640k008j350
54515A74683j173j472j541r52k67j99n61o70l99j93l30o76r94j004m69N17J474
54498A65774J998J987J370K90m07K59K007L299L285K930L578M998N781N175L855
54483B06179K982L067L636L763L049K172K170L228M626N787O778P825R045J0592
$$ plain form
54580 384627 406151 428592 451784 476370 501741 525766 546951 565111 579104 585815 583003 572129
54568 572129 556927 540022 522098 503328 483972 464092 444106 425323 408715 393567 378575
54557 378575 363791 350262 338211 327071 317006 308753 301901 294889 287036 279332 272884 267626 262947
54544 262947 258511 254012 249041 243749 238999 235429 232846 230717 228583 225820 221727 216290 210367 204790
54530 204790 199668 194745 190028 185921 183108 182286 183481 185500 186583 185796 183516 180681 178041 176033 174683
54515 174683 173510 172038 170497 169545 169278 169079 168518 167848 167449 167256 166926 166250 165256 164252 163783 164300 165774
54498 165774 167772 169759 171129 171419 171012 171271 173278 176577 179862 182792 186370 191368 197149 202324 206179
54483 206179 209161 212228 215864 219627 222676 224848 227018 230246 234872 240659 247437 255262 264307 274899
54469B74899J2241J2931J1740R372P547O850O295N016L103N05l256p705j1031
54456C28507j1957j1100r979r495r610r509q120n640m312n946q878r619p563n411
54442B11368m584l514j584j076l009m289k159J211J994M79j60P09R86L39O62K135
54426A99508K601J483R09K036L223K907J715O56l06p94M51L176M840L770J446
54411B27621K28L55O25O19O37M64k28q24m25Q56K069K508J990P05o16j169j209
54394B34206j886l311l834k196M21J571L93j563k237j130L76M60j221l107l588
54379B13354l009k877l250k534k74J493P73j596l142k896k021j711j905k051j964
54364A86390j683j278j064j280j401n14J402L061L251K258J489J912L170M220
$$ plain form
54469 274899 287140 300071 311811 321183 328730 335580 341875 346891 349994 350499 347243 339538 328507
54456 328507 316550 305450 295471 285976 276366 266857 258737 253097 248785 242839 233961 224342 216779 211368
54442 211368 206784 203270 201686 200610 197601 193312 191153 192364 194358 194837 194677 195386 196372 196711 197373 199508
54426 199508 202109 203592 204501 206537 209760 212667 214382 215038 214732 213938 214389 217565 222405 226175 227621
54411 227621 227849 228204 228829 229448 230085 230549 230321 229497 229072 229928 231997 234505 236495 237200 236584 235415 234206
54394 234206 232320 229009 225175 222979 223400 224971 225364 223801 221564 220434 220810 221270 220049 216942 213354
54379 213354 210345 207468 204218 201684 201410 202903 203676 202080 198938 196042 194021 192310 190405 188354 186390
54364 186390 184707 183429 182365 181085 179684 179170 180572 183633 186884 189142 190631 192543 195713 199933
54350A99933M408L876L187K823K791K535J467j02q39J98K228L537L727M131N726
54335B39626P521P818O291L990J886M16lP07J519R95j024l206m380m661m724m678
54319B48093m149l019j751r54q03q52o66n70j344k953m185l990k696j370o13n08
54303B17670j066j893j967p18J044K146K517K768K863K344J464R00N44j43p77
54288B27696l49J141K591L442M219N242N919N589M212K165J22j007r44p15j411
54273B57912k470k476j406o82r71j587k200l355m852n347m469l842m850o510o781
54258B06114n224l294k435k734l245l157k676k757l660m216l323j706r54j204
54244A65529j344j278k030l357l478k003j055k244m234m783l681k147o52R14J875
$$ plain form
54350 199933 204341 208217 211404 214227 217018 219553 221020 220918 220079 220277 222505 226042 229769 233900 239626
54335 239626 247147 254965 261256 265246 267132 267548 267545 268252 269771 270766 269742 266536 262156 257495 252771 248093
54319 248093 243944 240925 239174 238220 237417 236565 235899 235329 233985 231032 226847 222857 220161 218791 218178 217670
54303 217670 216604 214711 212744 212026 213070 215216 217733 220501 223364 225708 227172 228072 228616 228473 227696
54288 227696 227347 228488 231079 234521 238740 243982 249901 255490 259702 261867 261989 260982 260038 259323 257912
54273 257912 255442 252966 251560 250878 249907 248320 246120 242765 237913 232566 228097 224255 219405 212895 206114
54258 206114 200890 197596 195161 192427 189182 186025 183349 180592 176932 172716 169393 167687 166733 165529
54244 165529 164185 162907 160877 157520 154042 152039 150984 148740 144506 139723 136042 133895 133243 134157 136032
54229A36032J502N05J99M98J08j464l310m303l904k278m28K88l18q35k64L93j66
54212A22255j253j133K99J595K125K539K908K315P31m08j75N32M55k63n50J06
54196A32078J222J913J485O1j225j168L0R59Q38L73M54Q36P83L69L44R33J457
54179A41742J203L03l14J48J427K309J939Q53K16K32O3o63j242j120q06r08j064
54162A44318p00k35n10j376j961k144k560l131k843j446k26l87j580k745l533
54147A18941m013l779k608j521j788l053l635k672q99P32J895K222J270m05j367
54132I9320j113o76q89j289j415j844k904l499k504m78J170J910J865P39j591
54117H6802l975m805l688j344J400L527L758K014K05M2Q23J051J122K290L687
$$ plain form
54229 136032 137534 138039 138238 138736 138844 137380 134070 129767 125863 123585 123157 123445 123127 122292 122028 122421 122255
54212 122255 121002 119869 120168 121763 123888 126427 129335 131650 132381 131973 131798 132330 132785 132522 131972 132078
54196 132078 133300 135213 136698 136759 135534 134366 134396 135355 136193 136566 137020 137856 138639 139008 139352 140285 141742
54179 141742 142945 143248 142934 143082 144509 146818 148757 149610 149826 150058 150121 149458 148216 147096 146290 145382 144318
54162 144318 143618 143383 142873 141497 139536 137392 134832 131701 128858 127412 127186 126799 125219 122474 118941
54147 118941 114928 111149 108541 107020 105232 102179 98544 95872 94973 95705 97600 99822 101092 100687 99320
54132 99320 98207 97531 96642 95353 93938 92094 89190 85691 83187 82709 83879 85789 87654 88393 86802
54117 86802 82827 78022 74334 72990 74390 77917 81675 83689 83894 83936 84759 85810 86932 89222 92909
54102I2909L092N90j151o10Q63J595J556J091r3j621k017q15M48L75m71q14l93
54085I4534L88J354K217K475K221K056J856J011m8k49Rp01j911j376J104K676
54069A07616J703L20P74J747Q12j479k720k379j716j081l9P21K38n34N6J429J448
54052A06916j40j446j447r89o75k7Q58R05p6q36n12L91J259K230L336L922L397
54035A17066J928K55n81J32J643J909Q9j992k342j681j917k592j528J170K604
54020A14163J218j013j499j74J386K278K492K110J494J294J460J100l2r24p83
54005A24570j33K08K80M74O91O81N53N31P92J656L100M054L331J459K85N35J056
53988A44123R26P43J135J450R36J6o27j157j671j305N13K665L463K664J332K34
$$ plain form
54102 92909 96001 96591 95440 94830 95693 97288 98844 99935 99842 98221 96204 95389 95837 96212 95741 94927 94534
54085 94534 94922 96276 98493 100968 103189 105245 107101 108112 108064 107815 107824 107123 105212 103836 104940 107616
54069 107616 109319 109639 110413 112160 112972 111493 108773 106394 104678 103597 103558 104279 104517 103983 104039 105468 106916
54052 106916 106776 105330 103883 102894 102219 102192 103050 103955 103879 103043 102531 102922 104181 106411 109747 113669 117066
54035 117066 118994 119249 118668 118800 120443 122352 122441 120449 118107 116426 114509 111917 110389 111559 114163
54020 114163 115381 114368 112869 112695 114081 116359 118851 120961 122455 123749 125209 126309 126277 125353 124570
54005 124570 124437 124645 124925 125399 126090 126771 127324 127855 128647 130303 133403 137457 140788 142247 142532 143067 144123
53988 144123 145049 145792 146927 148377 149313 149329 148702 147545 145874 144569 145082 147747 151210 153874 155206 155440
53972A55440m88n30M11J870L012L775M648N544N917O045O981Q808R908Q855O495
53957B26691N138N683O516N671L384J630J542K361K959L184L205K788K014J783
53943B74549K457K854J800O9p09m82n20j139j485j585k638m740o213n937m886
53928B51395m404m244l457k138j270j486k772m711o240o076m163k069j177j199
53914B05989j151r87j246j762j792j234p38q20j351j746j285L34K235K841J659
53899A98946R9k13O32J360J403J247J242J208J265K035L618N027N226M427L911
53884B31433M538N729O144N264L947L328L584M151M642M960M870M347M133M910
53870B95980N976N828M253K769K650L580M688N774O699O607M868K367R20J469
$$ plain form
53972 155440 154952 154422 154833 156703 159715 163490 168138 173682 179599 185644 192625 201433 211341 220196 226691
53957 226691 231829 237512 244028 249699 253083 254713 256255 258616 261575 264759 267964 270752 272766 274549
53943 274549 277006 279860 281660 281729 281020 280538 280018 278879 277394 275809 273171 268431 262218 256281 251395
53928 251395 246991 242747 239290 237152 235882 234396 231624 226913 220673 214597 210434 208365 207188 205989
53914 205989 204838 203851 202605 200843 199051 197817 197079 196259 194908 193162 191877 192211 194446 197287 198946
53899 198946 199045 198832 199464 200824 202227 203474 204716 205924 207189 209224 212842 217869 223095 227522 231433
53884 231433 235971 241700 247844 253108 257055 260383 263967 268118 272760 277720 282590 286937 291070 295980
53870 295980 301956 307784 312037 314806 317456 321036 325724 331498 338197 344804 349672 352039 352959 354428
53856C54428L363N088N258L303j68l662n749n810m047j327J089K382K847L195
53842C60190L376K951K552L529N837P648P670O719O221O309O204N504M160K166
53828D31036J44o45J38J205J336Q09J50j228l779o232o966o247n548n272m980
53813C93921n190o849r061r608q053o469o440p137p123o450n913n546n068m923
53799C00091n623o658p095o885o631o478o096n523n109m745m006l051k620k878
53785B26693k918j931m67K1j098k812l566k906j739j098j133j369j418j138n24
53770B02597M8j91j506k831k613p02J280J742Q65L6k2J78P4q6N2N2o33j439j148
53751A95753K40J091K31j277j464o3J291J416R34Q93J222J288J271K004L595N018
$$ plain form
53856 354428 357791 362879 368137 371440 371272 367610 361861 356051 352004 350677 351766 354148 356995 360190
53842 360190 363566 366517 369069 372598 378435 386083 393753 400472 406693 413002 419206 424710 428870 431036
53828 431036 431180 430535 430673 431878 433214 434023 434173 432945 429166 422934 415968 409721 404173 398901 393921
53813 393921 388731 381882 372821 363213 355160 348691 342251 335114 327991 321541 315628 310082 305014 300091
53799 300091 294468 287810 280715 273830 267199 260721 254625 249102 243993 239248 235242 232191 229571 226693
53785 226693 223775 221844 221377 221398 220300 217488 213922 211016 209277 208179 207046 205677 204259 203121 202597
53770 202597 202645 202454 200948 198117 195504 194802 196082 197824 198689 198725 198703 198881 198955 198869 198921 198973 198340 196901 195753
53751 195753 195993 197084 197315 196038 194574 194511 195802 197218 198152 199045 200267 201555 202826 204830 208425 213443
53735B13443N164L946K214R28N70J236L013N808Q725J0228R609P989P187P544
53721B87604P678O443M446L301L881N498O565O002M321L050K723K046o8k381k785
53706C38324j525j045k428m043m427m439n187n678m368j913l55k42l92j62j81
53691C01939q00j347j254q48p50j166j914k540k483j703r17p56j103j711k740
53676B79907l869l797j847M90J015m71k168k711k335j752j286j201j718k370k366
53661B53521j740j268j244j211r69q53r66j076j296j969k883l441l467k990j608
53646B26540O46K166J174j672l746l774l010k750k443j206M81J755K813M080M997
53631B26051M985M715N021N259M157J992M94O55J725K514K702K669K731K785K392
$$ plain form
53735 213443 218607 222553 224767 225695 226265 227501 230514 236322 245047 255275 264884 272873 280060 287604
53721 287604 295282 301725 306171 309472 313353 318851 325416 331418 335739 338789 341512 343558 343490 341109 338324
53706 338324 336799 335754 333326 329283 324856 320417 315230 309552 305184 303271 302916 302674 302282 302120 301939
53691 301939 301139 299792 298538 297690 296940 295774 293860 291320 288837 287134 286217 285461 284358 282647 279907
53676 279907 276038 272241 270394 270884 271899 271428 269260 266549 264214 262462 261176 259975 258257 255887 253521
53661 253521 251781 250513 249269 248058 247089 246236 245270 244194 242898 240929 238046 234605 231138 228148 226540
53646 226540 227186 229352 230526 228854 225108 221334 218324 215574 213131 211925 212406 214161 216974 221054 226051
53631 226051 231036 235751 240772 246031 250188 252180 252674 253329 255054 257568 260270 262939 265670 268455 270847
53616B70847J246j23n16N59J986K289J496Q97J101J341R70N07O68J105R77L17
53600B85667q6n2k46r14j213m84M80L14j004j994j599m50J39j81p04p31k17M52
53582B77177Q00N64l4m36m48n13j025j684j796r25Q92L094M561M406L201K557
53566B90391K936K773P94j741k419q42J144K136K577L266L924L781K728J309K25
53551C12982N5Q67J932K381K220K126K317K493K750L520M582N127N005M909N095
53536C58361M968M313L904M334N095N404N234N087N206N438N418M678L107J437
53522D21984O73J002J830K792L868M599M342L383K709K562K318J904J946K326
53508D58238K049R73K18K93L74Q3L42J443K023J204L41R73K220K039K39j513k183
$$ plain form
53616 270847 272093 271970 271454 272013 273999 276288 277784 278681 279782 281123 282093 282600 283268 284373 285350 285667
53600 285667 285581 285529 285283 284369 283156 282672 283152 283466 282462 280468 278869 278419 278558 278377 277673 276942 276725 277177
53582 277177 277977 278541 278507 278071 277623 277110 276085 274401 272605 271680 272572 275666 280227 284633 287834 290391
53566 290391 293327 296100 296894 295153 292734 291892 293036 295172 297749 301015 304939 308720 311448 312757 312982
53551 312982 313037 313904 315836 318217 320437 322563 324880 327373 330123 333643 338225 343352 348357 353266 358361
53536 358361 363329 367642 371546 375880 380975 386379 391613 396700 401906 407344 412762 417440 420547 421984
53522 421984 422657 423659 425489 428281 432149 436748 441090 444473 447182 449744 452062 453966 455912 458238
53508 458238 460287 461260 461478 461771 462145 462228 462570 464013 466036 467240 467581 468554 470774 472813 473052 471539 469356
53491D69356k242k221j954j173J37J897L593M289L807L288L577L881L255K544
53477D92034L167M655N328N144N739P515Q700P930O094M871M773N509P033R202
53463E77694J1136J1925J1633J1154J1329J2475J4250J5745J6192J5713J5068
53452G24314J4863J5553J7761K1495K5179K6864K6536K5973K6151K6322K6074
53441I77085K6631K9019L2302L4857L6288L6880L6260L4341L2757L3384L5630
53430A345434L7088L7023L7272L9111M1032M0852L8820L7122L6937L7419L7391
53419A765501L6778L6140L5855L6101L6938L8001L8587L8349L7391L5657L2932
53408B168230K9798K7550K6518K5268K2621J9800J9095K0466K1010J8362J3393
$$ plain form
53491 469356 467114 464893 462939 461766 461903 463800 467393 471682 475489 478777 482354 486235 489490 492034
53477 492034 495201 499856 505184 510328 516067 523582 532282 540212 546306 551177 555950 561459 568492 577694
53463 577694 588830 600755 612388 623542 634871 647346 661596 677341 693533 709246 724314
53452 724314 739177 754730 772491 793986 819165 846029 872565 898538 924689 951011 977085
53441 977085 1003716 1032735 1065037 1099894 1136182 1173062 1209322 1243663 1276420 1309804 1345434
53430 1345434 1382522 1419545 1456817 1495928 1536960 1577812 1616632 1653754 1690691 1728110 1765501
53419 1765501 1802279 1838419 1874274 1910375 1947313 1985314 2023901 2062250 2099641 2135298 2168230
53408 2168230 2198028 2225578 2252096 2277364 2299985 2319785 2338880 2359346 2380356 2398718 2412111
53397B412111Q759N759L670J496q52l048m984o663q013r248j0967j3642j6996
53384B357382k0068k2108k3484k5432k8558l1804l3550l3590l3318l3801l4729
53373B036940l5468l6166l7068l7544l6721l4704l2403l0509k9253k8714k8662
53362A669728k8520k8024k7451k6536k3999j9174j3483r074o345l965j070J916
53350A484003M481O670Q434R702J1379J4896K0169K5220K8531L0862L3864L7740
53338A715951M1215M3355M4529M5664M7303M9451N1902N4518N7242N9858O2027
53327B273015O3764O5706O8451P1729P4693P6962P8903Q0946Q2973Q4441Q4812
53316C106395Q4242Q4120Q6008Q9223R0549Q7783Q2954Q0025P9649P8444P3899
$$ plain form
53397 2412111 2420870 2426629 2430299 2431795 2430943 2427895 2422911 2416248 2408235 2398987 2388020 2374378 2357382
53384 2357382 2337314 2315206 2291722 2266290 2237732 2205928 2172378 2138788 2105470 2071669 2036940
53373 2036940 2001472 1965306 1928238 1890694 1853973 1819269 1786866 1756357 1727104 1698390 1669728
53362 1669728 1641208 1613184 1585733 1559197 1535198 1516024 1502541 1493467 1487122 1483157 1482087 1484003
53350 1484003 1488484 1495154 1503588 1513290 1524669 1539565 1559734 1584954 1613485 1644347 1678211 1715951
53338 1715951 1757166 1800521 1845050 1890714 1938017 1987468 2039370 2093888 2151130 2210988 2273015
53327 2273015 2336779 2402485 2470936 2542665 2617358 2694320 2773223 2854169 2937142 3021583 3106395
53316 3106395 3190637 3274757 3360765 3449988 3540537 3628320 3711274 3791299 3870948 3949392 4023291
53305D023291O7587O2429N8746N4755M9491M3340L6686K9872K3942J9605J5746
53294D485490J0480L622l286r340j5248k1716k8242l4082l9414m4969n1116n7780
53282D194399o4864p2209p9245q4961q8444q9828r0576r2161r4327r5441r4973
53271C247370r4454r5149r5901r4701r1620q8440q5803q2670p8609p4723p1798
53260B293502o9269o6695o4691o3377o1290n7080n1470m6302m2309l8975l5877
53249A696167l2973k9861k6110k2185j9020j6565j3693r756n449j896N47K278
53237A521484L825N547P558R669J1582J3400J5644J8510K1324K3123K3817K4568
53225A700051K6648K9977L3124L4889L5548L6307L7807L9712M1383M2391M2489
$$ plain form
53305 4023291 4090878 4153307 4212053 4266808 4316299 4359639 4396325 4426197 4450139 4469744 4485490
53294 4485490 4495970 4499592 4496306 4486966 4471718 4450002 4421760 4387678 4348264 4303295 4252179 4194399
53282 4194399 4129535 4057326 3978081 3893120 3804676 3714848 3624272 3532111 3437784 3342343 3247370
53271 3247370 3152916 3057767 2961866 2867165 2775545 2687105 2601302 2518632 2440023 2365300 2293502
53260 2293502 2224233 2157538 2092847 2029470 1968180 1911100 1859630 1813328 1771019 1732044 1696167
53249 1696167 1663194 1633333 1607223 1585038 1566018 1549453 1535760 1526004 1520555 1518659 1519206 1521484
53237 1521484 1525309 1530856 1538414 1548083 1559665 1573065 1588709 1607219 1628543 1651666 1675483 1700051
53225 1700051 1726699 1756676 1789800 1824689 1860237 1896544 1934351 1974063 2015446 2057837 2100326
53214B100326M1770M0827M0050L8946L7004L4984L4023L3423L1147K7125K4100
53203B483725K3788K3976K1417J6345J1633Q366N165J745p7O7n20l894q304j0903
53189B572529j1982j4076j7917k1862k5149k9103l4510l9807m2972m4094m4976
53178B246081m6838m9299n1265n2292n3013n4277n5842n6278n4628n1707m9083
53167A671559m7196m5414m3630m2454m1895m1174m0188l9632l9284l7711l4784
53156A218197l2899l4092l6831l7432l4411k9760k6020k3787k2402k1512k0891
53145H98160j9841j7894j5683j4300j3992j4217j4643j5290j5783j5249j3376
53134G27892j1073r729r949j1194j2467j3129j3146j2806j2297j1527j0381r040
$$ plain form
53214 2100326 2142096 2182923 2222973 2261919 2298923 2333907 2367930 2401353 2432500 2459625 2483725
53203 2483725 2507513 2531489 2552906 2569251 2580884 2589250 2594415 2596160 2596083 2596150 2595630 2591736 2583432 2572529
53189 2572529 2560547 2546471 2528554 2506692 2481543 2452440 2417930 2378123 2335151 2291057 2246081
53178 2246081 2199243 2149944 2098679 2046387 1993374 1939097 1883255 1826977 1772349 1720642 1671559
53167 1671559 1624363 1578949 1535319 1492865 1450970 1409796 1369608 1329976 1290692 1252981 1218197
53156 1218197 1185298 1151206 1114375 1076943 1042532 1012772 986752 962965 940563 919051 898160
53145 898160 878319 860425 844742 830442 816450 802233 787590 772300 756517 741268 727892
53134 727892 716819 707090 697141 685947 673480 660351 647205 634399 622102 610575 600194 591154
53122E91154p951p435p543q313r804j1629j2850j2894j2311j1959j1553r930p060
53109D59922m682m283n248o024o396p271q525q664o982m738l571l690m256m708
53095C80884n009n215n509o174o960p112o373n376m546l558k540k627m216n601
53081C10068m869k566q81o48q39q67j444k748l505k751j234k01J35J37k58j133
53065B86396j983k329k343k165j382O5J183J084K90M4P05J650K274K338J738Q20
53049B88385M54J089K043K484K545K700K730K344K082K354K171N46j294j015J439
53034C11057L534L611K776K505K227O14j984l988m705m700m603m722n324o286
53020B90012o667n754m187l210l113l270l400l793m460m976n064m634l499j922
$$ plain form
53122 591154 583203 575768 568225 559912 550108 538479 525629 512735 500424 488465 476912 466982 459922
53109 459922 455240 450957 445709 439685 433289 426018 417493 408829 401847 397109 393538 389848 385592 380884
53095 380884 375875 370660 365151 358977 352017 344905 338532 333156 328610 325052 322512 319885 315669 310068
53081 310068 305199 302633 301752 301104 300265 299398 297954 295206 291701 288950 287716 287515 287650 287787 287529 286396
53065 286396 284413 282084 279741 277576 276194 276259 277442 278526 278816 278860 279565 281215 283489 285827 287565 288385
53049 288385 288839 289928 291971 294455 297000 299700 302430 304774 306856 309210 311381 311927 310633 309618 311057
53034 311057 314591 318202 320978 323483 325710 326324 324340 320352 315647 310947 306344 301622 296298 290012
53020 290012 283345 277591 273404 270194 267081 263811 260411 256618 252158 247182 242118 237484 233985 232063
53006B32063j054j779l285l907l245k393k117k149k264k682l009k226m35N59n72
52991B01505k747l683k491k88J336J677R68j79j373k589l689l983k907j137j72
52976A80248o57j842k835l376l179j836J5Q00M3q69q54o58j089j260l00M48q58
52959A61941l308m097k437l61M96O71Q83M84j052k687l126k455j539p96l98p02
52943A41517j522j858j191k75J44M13R74J204M28p07j029n23j1M11J247K139J921
52926A43282M24q98o94O45J639J514P92K16k83j235k541l236k510n98J576L285
52910A41378M110L682K087K72p14p46k22R33K638L623K653R32J331M566P905Q627
52894A83055P186N784N198M699M036L678L514K860J712R24J180K435L923M291
$$ plain form
53006 232063 231009 229230 225945 222038 218793 216400 214283 212134 209870 207188 204179 201953 201518 202077 201505
52991 201505 198758 195075 192584 192296 193632 195309 196277 196098 194725 192136 188447 184464 181557 180420 180248
52976 180248 179591 177749 174914 171538 168359 166523 166538 167338 167381 166512 165658 165000 163911 162651 162351 162799 161941
52959 161941 158633 154536 152099 151738 152234 152905 153788 154272 153220 150533 147407 144952 143413 142617 142219 141517
52943 141517 139995 138137 136946 136671 136815 137228 138202 139406 139834 139127 138098 137575 137564 137975 139222 141361 143282
52926 143282 143706 142808 142114 142759 144398 145912 146704 146920 146637 145402 142861 139625 137115 136517 138093 141378
52910 141378 145488 149170 151257 151529 150815 150069 149847 150780 153418 157041 159694 160626 161957 166523 174428 183055
52894 183055 190241 196025 201223 205922 209958 213636 217150 220010 221722 222646 223826 226261 230184 234475
52880B34475K550l92k154j673n60o95j764k556l209m404n377m951l808l606m328
52865A97548m588m102l745l560l001k753l833n085m411k444k013l543m265k879
52851A47326j568j872j855K71K517K017m83k071k041j930k179j775p64l72o58
52836A34563l27R93K211K584K259J210o59k407k864k502k657l062k153Q3J724
52821A28996J813J474J508J063k92j183n55M56L60l76m99l82j280k847l354k330
52805A22572j173q71o18O21K346L242K992K376J860J120J00k61Q18K502L015K010
52789A42651J255K276M058M245K288Q3n15M68K070L774N151N363M168K748K493
52774A82576L345M270M888N551O153O016M991L679K534J603J131J375J630O30
$$ plain form
52880 234475 237025 236633 234479 232806 232246 231551 229787 227231 224022 219618 214241 209290 205482 201876 197548
52865 197548 192960 188858 185113 181553 178552 175799 171966 166881 162470 160026 158013 154470 150205 147326
52851 147326 145758 143886 142031 142302 144819 146836 146353 144282 142241 140311 138132 136357 135593 135221 134563
52836 134563 134236 135229 137440 140024 142283 143493 142834 140427 137563 135061 132404 129342 127189 127272 128996
52821 128996 130809 132283 133791 134854 134562 133379 132824 133280 133640 133264 132765 132383 131103 128256 124902 122572
52805 122572 121399 120528 119910 120531 122877 126119 129111 131487 133347 134467 134567 134306 135124 137626 140641 142651
52789 142651 143906 146182 150240 154485 156773 156856 156341 156809 158879 162653 167804 173167 177335 180083 182576
52774 182576 185921 190191 195079 200630 206783 212799 217790 221469 224003 225606 226737 228112 229742 230372
52760B30372j640l498l592k616k160k552k755k083j041m73o09j166j796k306k685
52745A99400l128l760m413m895n339n860n987m969k846p89%m59j091j174j179
52730A53511j966l339m010l236j895j336j515j206m6Q70P00J05OK56M01P50J343
52713A39393R23j336l687l529j147N69L54J37J477K809J903p25k845l630l766
52698A26900l343j878M7J208J618K210K788K266R21L62Q53P02q78k189j540J66
52682A30213P68k31j494j907j459n46L66N21m80j835k257j589r56j095j408r36
52666A15675L29J589K243K231J571L05j006j406p23p8n22j425j310j51L48o92
52650A16978j893j596j34J097J858K777L540L175J930J100R65O06m5J57J347J906
$$ plain form
52760 230372 228732 225234 221642 219026 216866 214314 211559 209476 208435 207962 207353 206187 204391 202085 199400
52745 199400 196272 192512 188099 183204 177865 172005 166018 161049 158203 157414 157414 156955 155864 154690 153511
52730 153511 151545 148206 144196 140960 139065 137729 136214 135008 134962 135832 136532 136637 136643 136899 137300 138050 139393
52713 139393 140316 138980 135293 131764 130617 131186 131540 131677 133154 135963 137866 137141 134296 130666 126900
52698 126900 123557 121679 121726 122934 124552 126762 129550 131816 132737 133099 133952 134654 133776 131587 130047 130213
52682 130213 130981 130750 129256 127349 125890 125344 125710 126231 125751 123916 121659 120070 119114 118019 116611 115675
52666 115675 116004 117593 119836 122067 123638 123943 122937 121531 120808 120730 120208 118783 117473 117322 117670 116978
52650 116978 115085 113489 113355 114452 116310 119087 122627 125802 127732 128832 129797 130403 130358 130515 131862 133768
52634A33768Q80m87o58P8N71P43J165J656J745J907K921M324M852M258L506L116
52618A64345K483J148n5K28K132M087M312K790J320J218J498K66k458m571m707
52603A74036l807l378l476l283k532j433q9J082J079m95k603m008m651m987m804
52588A36651l763k449j654j139j96R51J341O33n83j562j724p79O60J158R7j318
52572A26324j597q59k27l1J01k4q72j930k120j305k69N63J242J427P04m23j057
52555A19647j228j522j720j195m07l59o79Q4J958K978J790m95j772j395m64l42
52539A14879j309k360k263j045r1j88k83P88K175K210J144Q09J735K547K357J756
52523A22861J119r8j685k147q20J003J928K060J970J533P05J81K22Q9m95n88K52
$$ plain form
52634 133768 134648 134161 133503 133581 134152 134895 136060 137716 139461 141368 144289 148613 153465 157723 161229 164345
52618 164345 166828 167976 167921 168149 170281 174368 178680 181470 182790 184008 185506 185772 183314 178743 174036
52603 174036 170229 166851 163375 160092 157560 156127 156038 157120 158199 157704 155101 151093 146442 141455 136651
52588 136651 132888 130439 128785 127646 127450 128401 129742 130375 129792 128230 126506 125727 126387 127545 127642 126324
52572 126324 124727 123868 123641 123610 123711 123687 122815 120885 118765 117460 117191 117754 118996 120423 121127 120704 119647
52555 119647 118419 116897 115177 113982 113575 113216 112537 112621 114579 117557 119347 118852 117080 115685 115221 114879
52539 114879 113570 111210 108947 107902 107811 107623 107340 108128 110303 112513 113657 114466 116201 118748 121105 122861
52523 122861 123980 123882 122197 120050 119230 120233 122161 124221 126191 127724 128429 128610 128832 128921 128426 127838 128090
52506A28090Q34J23j065j422j083p76k00J131K245J720m4j107m51J117K316K485
52490A33913J526p1j195j126n56p02j510j735p55O14J269R29J9p77p13O24K697
52473A32451M227M214K789J102M29J104K095K034Q26l05m87k73n48j214j611j565
52457A45268j197k95J163K379K492J692P40k85j639k720k383o71R11J123K68n55
52441A46291p49m05K18Q98J407J578J308M90q41k227k900k311n60J493K629K157
52425A48476P33k4Q49K673L934L725K116k40k185k329l29K127K655Q54j049p63
52409A61223J381K908K196K50p80l06K06n34j783j751NK072K925K401J319L89
52393A72121j93o18j166j736j741r99m32r80j939j676m5J235J149Q13J598L071
$$ plain form
52506 128090 128924 129047 127982 126560 125477 124701 124501 125632 127877 129597 129553 128446 127995 129112 131428 133913
52490 133913 135439 135368 134173 133047 132491 131789 130279 128544 127789 128403 129672 130601 130620 129843 129130 129754 132451
52473 132451 136678 140892 143681 144783 145212 146316 148411 150445 151271 150966 150479 150206 149658 148444 146833 145268
52457 145268 144071 143776 144939 147318 149810 151502 152242 151957 150318 147598 145215 144544 145455 146578 146846 146291
52441 146291 145542 145137 145355 146253 147660 149238 150546 151036 150195 147968 145068 142757 142197 143690 146319 148476
52425 148476 149209 149185 150034 152707 156641 160366 162482 162242 160057 157728 157399 159526 162181 163035 161986 161223
52409 161223 162604 165512 167708 167958 167178 166872 167078 166544 164761 163010 163015 165087 168012 170413 171732 172121
52393 172121 171928 171310 170144 168408 166667 165668 165236 164256 162317 160641 160596 161831 162980 163793 165391 168462
52377A68462L973M065L730K679N11j944l278l235k784k713l072l533l433k027
$$ plain form
52377 168462 172435 176500 180230 182909 183420 181476 178198 174963 172179 169466 166394 162861 159428 157401
$$ [...]
##END NTUPLES=NMR SPECTRUM
##END=
