##TITLE=coffee_type ROVE100-16-0203
COFFEE_meoh_noesyp64 COFFEE_meoh {C:\Bruker\TOPSPIN} Administrator 4
##JCAMPDX= 6.0         $$ Bruker NMR JCAMP-DX V2.0
##DATA TYPE= NMR SPECTRUM
##DATA CLASS= NTUPLES
##ORIGIN= Bruker BioSpin GmbH
##OWNER= Administrator
$$ 1.72 TOPSPIN		Version 2.1
$$ 2012-05-29 13:26:02.157 -0700  Administrator@X
$$ Compression mode = diff/dup
##.OBSERVE FREQUENCY= 400.13188235
##.OBSERVE NUCLEUS= ^1H
##.ACQUISITION MODE= SIMULTANEOUS (DQD)
##.ACQUISITION SCHEME= undefined
##.AVERAGES= 64
##.DIGITISER RES= 22
##SPECTROMETER/DATA SYSTEM= spect
##.PULSE SEQUENCE= noesygpps1d.comp
##.SOLVENT NAME= COFFEE_meoh
##.SHIFT REFERENCE= INTERNAL, COFFEE_meoh, 1, 14.98061
##AUDIT TRAIL= $$ (NUMBER, WHEN, WHO, WHERE, PROCESS, VERSION, WHAT)
$$ ##TITLE= Audit trail, TOPSPIN		Version 2.1
$$ ##JCAMPDX= 5.01
$$ ##ORIGIN= Bruker BioSpin GmbH
$$ ##OWNER= Administrator
$$ $$ Z:/data/jwist/nmr/12-COFFEE-0203/62/pdata/1/auditp.txt
$$ ##AUDIT TRAIL=  $$ (NUMBER, WHEN, WHO, WHERE, PROCESS, VERSION, WHAT)
(   1,<2012-03-02 21:25:25.662 -0500>,<Administrator>,<TOPSPIN>,<go>,<TOPSPIN 2.1>,
      <created by zg
	started at 2012-03-02 21:13:55.318 -0500,
	POWCHK enabled, PULCHK disabled,
       configuration hash MD5:
       1A 1E CE 29 27 FD 77 03 67 4E F0 E3 C4 B2 CB 90
       data hash MD5: 64K
       A7 4F 41 ED B5 F0 23 B7 3F ED 5E 8B 3B 0E 6F 05>)
(   2,<2012-03-02 21:25:30.303 -0500>,<Administrator>,<TOPSPIN>,<audit>,<TOPSPIN 2.1>,
      <user comment:
       ICON-NMR User ID: Administrator
       data hash MD5: 64K
       A7 4F 41 ED B5 F0 23 B7 3F ED 5E 8B 3B 0E 6F 05>)
(   3,<2012-05-29 09:24:06.175 -0700>,<Administrator>,<X>,<proc1d>,<TOPSPIN 2.1>,
      <Start of raw data processing
       efp LB = 0.3 FT_mod = 6 PKNL = 1 PHC0 = 0 PHC1 = 0 SI = 128K 
       data hash MD5: 128K
       1F 5E 47 24 C7 C4 C7 B7 40 34 4F 2C 82 AD 84 A1>)
(   4,<2012-05-29 09:24:06.706 -0700>,<Administrator>,<X>,<proc1d>,<TOPSPIN 2.1>,
      <pk PHC0 = 37.72705 PHC1 = 0 
       data hash MD5: 128K
       3A 5F D4 1C EB EA 29 F0 EF D0 11 E8 74 D8 8E E3>)
(   5,<2012-05-29 09:24:08.378 -0700>,<Administrator>,<X>,<proc1d>,<TOPSPIN 2.1>,
      <abs ABSG = 1 
       data hash MD5: 128K
       7A C5 59 A4 90 15 B9 39 D3 7E 3A EB 78 62 60 1E>)
(   6,<2012-05-29 09:24:08.472 -0700>,<Administrator>,<X>,<proc1d>,<TOPSPIN 2.1>,
      <abs ABSG = 2 
       data hash MD5: 128K
       C5 65 6B 98 30 12 A3 F3 EC A1 D8 6C 8C 05 69 1C>)
(   7,<2012-05-29 09:24:08.565 -0700>,<Administrator>,<X>,<proc1d>,<TOPSPIN 2.1>,
      <abs ABSG = 3 
       data hash MD5: 128K
       FE 23 7F 0E 4E CC 95 E3 28 5B 18 32 B9 C0 D0 AC>)
(   8,<2012-05-29 09:24:08.644 -0700>,<Administrator>,<X>,<proc1d>,<TOPSPIN 2.1>,
      <abs ABSG = 4 
       data hash MD5: 128K
       1E CC 49 73 3E 42 65 62 F5 EB F5 86 A8 7A C4 91>)
(   9,<2012-05-29 09:24:08.722 -0700>,<Administrator>,<X>,<proc1d>,<TOPSPIN 2.1>,
      <abs ABSG = 5 
       data hash MD5: 128K
$$ [...]
150 150 150 150 150 150 150 150
##$TP07= 0
##$TPNAME0= <>
##$TPNAME1= <>
##$TPNAME2= <>
##$TPNAME3= <>
##$TPNAME4= <>
##$TPNAME5= <>
##$TPNAME6= <>
##$TPNAME7= <>
##$TPOAL= (0..7)
0.5 0.5 0.5 0.5 0.5 0.5 0.5 0.5
##$TPOFFS= (0..7)
0 0 0 0 0 0 0 0
##$TUNHIN= 0
##$TUNHOUT= 0
##$TUNXOUT= 0
##$USERA1= <user>
##$USERA2= <user>
##$USERA3= <user>
##$USERA4= <user>
##$USERA5= <user>
##$V9= 5
##$VALIST= <valist>
##$VCLIST= <CCCCCCCCCCCCCCC>
##$VD= 0
##$VDLIST= <DDDDDDDDDDDDDDD>
##$VPLIST= <PPPPPPPPPPPPPPP>
##$VTLIST= <TTTTTTTTTTTTTTT>
##$WBST= 1024
##$WBSW= 4
##$XGAIN= (0..3)
0 0 0 0
##$XL= 0
##$YL= 0
##$YMAX_a= 10919402
##$YMIN_a= -4943763
##$ZGOPTNS= <>
##$ZL1= 120
##$ZL2= 120
##$ZL3= 120
##$ZL4= 120
##$ABSF1= 14.98061
##$ABSF2= -5.57192
##$ABSG= 5
##$ABSL= 3
##$ALPHA= 0
##$AQORDER= 0
##$ASSFAC= 0
##$ASSFACI= 0
##$ASSFACX= 0
##$ASSWID= 0
##$AUNMP= <proc_prof1d_extract>
##$AXLEFT= 0
##$AXNAME= <>
##$AXNUC= <1H>
##$AXRIGHT= 0
##$AXTYPE= 0
##$AXUNIT= <>
##$AZFE= 0.1
##$AZFW= 0.1
##$BCFW= 0
##$BC_mod= 0
##$BYTORDP= 0
##$COROFFS= 0
##$CY= 15
##$DATMOD= 1
##$DC= 0
##$DFILT= <>
##$DTYPP= 0
##$F1P= 0
##$F2P= 0
##$FCOR= 0.5
##$FTSIZE= 131072
##$FT_mod= 6
##$GAMMA= 0
##$GB= 0
##$INTBC= 1
##$INTSCL= 1
##$ISEN= 128
##$LB= 0.3
##$LEV0= 0
##$LPBIN= 0
##$MAXI= 10000
##$MC2= 0
##$MEAN= 0
##$ME_mod= 0
##$MI= 0
##$NCOEF= 0
##$NC_proc= -3
##$NLEV= 6
##$NOISF1= 0
##$NOISF2= 0
##$NSP= 0
##$NTH_PI= 0
##$NZP= 0
##$OFFSET= 14.98061
##$PC= 1
##$PHC0= 37.72705
##$PHC1= 0
##$PH_mod= 1
##$PKNL= yes
##$PPARMOD= 0
##$PPDIAG= 0
##$PPIPTYP= 0
##$PPMPNUM= 2147483647
##$PPRESOL= 1
##$PSCAL= 4
##$PSIGN= 0
##$PYNMP= <proc.py>
##$REVERSE= no
##$SF= 400.13
##$SI= 131072
##$SIGF1= 0
##$SIGF2= 0
##$SINO= 400
##$SIOLD= 131072
##$SPECTYP= <>
##$SREGLST= <1H.CDCl3>
##$SSB= 0
##$STSI= 131072
##$STSR= 0
##$SW_p= 8223.68421052632
##$SYMM= 0
##$S_DEV= 0
##$TDeff= 65536
##$TDoff= 0
##$TI= <>
##$TILT= no
##$TM1= 0
##$TM2= 0
##$TOPLEV= 0
##$USERP1= <user>
##$USERP2= <user>
##$USERP3= <user>
##$USERP4= <user>
##$USERP5= <user>
##$WDW= 1
##$XDIM= 131072
##$YMAX_p= 467115745
##$YMIN_p= -142540343
##$CURPLOT= <Network HP LaserJet P1505>
##$CURPRIN= <$Network HP LaserJet P1505>
##$DFORMAT= <normdp>
##$LAYOUT= <+/1D_H.xwp>
##$LFORMAT= <normlp>
##$PFORMAT= <normpl>
##$SURQMSG= 1
$$ End of Bruker specific parameters
$$ ---------------------------------
##NTUPLES= NMR SPECTRUM
##VAR_NAME=  FREQUENCY,     SPECTRUM/REAL,   SPECTRUM/IMAG
##SYMBOL=    X,             R,               I
##VAR_TYPE=  INDEPENDENT,   DEPENDENT,       DEPENDENT
##VAR_FORM=  AFFN,          ASDF,            ASDF
##VAR_DIM=   131072,        131072,          131072
##UNITS=     HZ,            ARBITRARY UNITS, ARBITRARY UNITS
##FACTOR=    0.0627417313425165, 1,          1
##FIRST=     8223.62146879498, 7163,         -60602
##LAST=      0,             6460,            -59696
##MIN=       0,             -142540343,      0
##MAX=       8223.62146879498, 467115745,    0
$$ Real data points
##PAGE= N=1
##DATA TABLE= (X++(R..R)), XYDATA
$$ [...]
60893B4308023K345993K686724L074907L521067M015101M535640N087443N683073
60885E5257971O232165O464711O055682M905256L296757J734808O09987K3292
60877H4580629j09401J09784N50287R28873Q37272J467j474926l157755m580928
60868G7685302n502838n925529n959272n718710n307287m821414m331649l870826
60860C6247777l450232l076871k750980k461839k198143j957868j742946j550987
60852A7057911j378262j225313j093612r80326q81288p95612p23055o59919o01723
60843H718801n47491m98017m52683m11391l76806l50821l30729l12208k94232
60834E144423k77974k62866k47091k30567k14453j98823j83380j69124j56808
$$ plain form
60893 24308023 26654016 29340740 32415647 35936714 39951815 44487455 49574898 55257971
60885 55257971 61490136 67954847 74010529 78915785 82212542 83947350 84557337 84580629
60877 84580629 84471228 84581012 85131299 86060172 86897444 86898911 85423985 82266230 77685302
60868 77685302 72182464 66256935 60297663 54578953 49271666 44450252 40118603 36247777
60860 36247777 32797545 29720674 26969694 24507855 22309712 20351844 18608898 17057911
60852 17057911 15679649 14454336 13360724 12380398 11499110 10703498 9980443 9320524 8718801
60843 8718801 8171310 7673293 7220610 6809219 6432413 6081592 5750863 5438655 5144423
60834 5144423 4866449 4603583 4356492 4125925 3911472 3712649 3529269 3360145 3203337
60825C203337j45135j32921j21603j13137j06734j00389r4267q9804q6373q1817
60815B131157p5941p0725o7223o4453o1418n8236n5152n2005m8879m6113m3716
60804A487296m1541l9615l7669l5159l2420l0690l0085k8888k5993k2728k0992
60793A141516k0879k1439k2262k2768k1499j7995j4230j2240j1481j0339q995
60782I57389q672r102r055q637q861r491r502r137r333r523q234n770m150m339
60768H43583n397o394p254p532o140k928P65L362M033K809Q27M3J267K945L235
60753H27224K680L113M479M927L861K704K399K236J710J639K619L890M542M721
60739H72744M931N199N533O193O982P126O314N093L908K655J467J006J452J859
$$ plain form
60825 3203337 3058202 2925281 2803678 2690541 2583807 2483418 2389151 2299347 2212974 2131157
60815 2131157 2055216 1984491 1917268 1852815 1791397 1733161 1678009 1626004 1577125 1531012 1487296
60804 1487296 1445755 1406140 1368471 1333312 1300892 1270202 1240117 1211229 1185236 1162508 1141516
60793 1141516 1120637 1099198 1076936 1054168 1032669 1014674 1000444 988204 976723 966384 957389
60782 957389 948717 939615 930560 921923 913062 903571 894069 884932 875599 866076 857842 852072 847922 843583
60768 843583 838186 831792 824538 817006 810866 807938 808703 812065 816098 818907 819734 819777 821044 823989 827224
60753 827224 829904 833017 837496 842423 846284 848988 851387 853623 855333 856972 859591 863481 868023 872744
60739 872744 877675 882874 888407 894600 901582 908708 915022 920115 924023 926678 928145 929151 930603 932462
60725I32462J101r50l428n351o422p197q375r748j0366r965r532r806j0087r403
60711H32933q032o727n344l549k165k180k891k708j522o24m52j69N41R89J022
60696G99122J431K412L187L462L889M664N156N443O661R127J1313J1536R757P150
60682H84310M835L648M094N650O687N754K784j136m685p061q441r681j0988j1323
60668H64447j0114q890r646j1820j2819j1726j0557j1131j2574j3033j2350j1641
60656G28146j1333j1065j0770j0583j0103q940p708p419p939p954o718n257n389
60643F16968p620j0309j1246r998q122o885n807m129k623k579l584m054l614l219
60629E33179l014j976q4J078O34k91l63K05O56J112J998L092M076N113O145O570
$$ plain form
60725 932462 933563 932613 929185 923834 917412 910215 901840 892092 881726 871761 862229 852423 842336 832933
60711 832933 824901 818174 812830 809281 807116 804936 802045 799337 797815 797191 796739 796570 797111 798100 799122
60696 799122 800553 802965 806152 809614 813503 818167 823323 828766 835427 844554 855867 867403 877160 884310
60682 884310 889145 892793 896887 902537 909224 914978 917762 916626 911941 904880 896439 886758 875770 864447
60668 864447 854333 845443 835797 823977 811158 799432 788875 777744 765170 752137 739787 728146
60656 728146 716813 705748 694978 684395 674292 665352 657644 650225 642286 634332 627614 622357 616968
60643 616968 609348 599039 587793 577795 569673 562788 556981 552852 550229 547650 544066 540012 536398 533179
60629 533179 530165 528189 528105 529183 529817 529526 529163 529368 530024 531136 533134 536226 540302 545415 551560 558130
60613E58130O363O420P078P382O713N958O105O737P103P552Q594R431R008Q005
60599F60579Q214J0145J2455J3721J3729J3023J2073J1066J0029R109Q896R999
60587G93038J2098J4051J5270J6140J6679J5911J3304R882O886M250J518o44j278
60574I17105r41j269k878m822n981o023n225m229l776l921l888l432l574m929
60560H62217o101n353l361k528l571m573l736j448Q98K720M072M862N129N437
60546H54664O175P099P999R180J0732J2050J2722J3401J5117J8116K1762K5097
60534A014114K7093K6930K4830K2190K0195J8533J6117J2726R089N535J648k484
60522A196516n689p128p615q639j0378j1572j1417j0720j0819j1968j3238j3616
$$ plain form
60613 558130 564493 570913 577991 585373 592086 598044 604149 610886 617989 625541 634135 643566 652574 660579
60599 660579 668793 678938 691393 705114 718843 731866 743939 755005 765034 774143 783039 793038
60587 793038 805136 819187 834457 850597 867276 883187 896491 906373 913259 917509 919027 918383 917105
60574 917105 916164 914895 912017 907195 901214 895191 889966 885737 881961 878040 874152 870720 867146 862217
60560 862217 856116 850763 847402 844874 841303 836730 832994 831546 832444 835164 839236 844098 849227 854664
60546 854664 860839 867938 875937 885117 895849 907899 920621 934022 949139 967255 989017 1014114
60534 1014114 1041207 1068137 1092967 1115157 1135352 1153885 1170002 1182728 1191817 1197352 1199000 1196516
60522 1196516 1190827 1183699 1176084 1167445 1157067 1145495 1134078 1123358 1112539 1100571 1087333 1073717
60510A073717j2852j1616j1139j2154j3720j3672j1007p415n546o051p296p659
60498I53590o896n278k951o80J91n29j177l22J228J717J160J464L876P424J0073
60483I62890J0625R378P657P051Q341J0742J2554J3062J3466J5516J9362K3274
60471A113918K5522K6158K6619K8034L0416L3332L6630M0371M4596M9469N5074
60460A510139O1008O6884P3462Q2144R2757J03215J12505J22620J35645J49775
60450B510154J60527J65486J65595J61705J52560J37066J16423R2867O7978M3113
60440C773474J9705k066k3238m3461o0172p1743p9677q5999r0191r0655q7681
60429C158296q2574p4939o3399m8461l2327j6250k20J5139K8810M1490N4977O8939
$$ plain form
60510 1073717 1060865 1049249 1038110 1025956 1012236 998564 987557 980142 974596 968545 961249 953590
60498 953590 946694 941416 938465 937785 937976 937447 936270 935948 937176 938893 940053 941517 945393 952817 962890
60483 962890 973515 982893 990550 997601 1005942 1016684 1029238 1042300 1055766 1071282 1090644 1113918
60471 1113918 1139440 1165598 1192217 1220251 1250667 1283999 1320629 1361000 1405596 1455065 1510139
60460 1510139 1571147 1638031 1711493 1793637 1886394 1989609 2102114 2224734 2360379 2510154
60450 2510154 2670681 2836167 3001762 3163467 3316027 3453093 3569516 3662383 3730361 3773474
60440 3773474 3793179 3791113 3767875 3724414 3664242 3592499 3512822 3426823 3336632 3245977 3158296
60429 3158296 3075722 3000783 2937384 2888923 2856596 2840346 2840126 2855265 2884075 2925565 2980542 3049481
60417C049481Q0186Q5688Q4716P7920O6302N1584L5898K0480O047n403j1273j1400
60405C530226q440m361J605J0493K1020L1120M0738N1432O4189P8998R5826J14513
60393D027359J34333J55061J78181K05738K38203K74489L13743L56032M01488
60384F284627M49989N01676N56561O13221O68421P18190P58422P83889P87280
60375A2122276P60163O95818N91899M51397K81884R4263r8245k81454m42557n72606
60365A3602838o67590p27871p57081p60900p45487p16203o77614o34061n89183
60356G326848n44865n01574m59892m20833l84503l49716l15618k82972k53170
60347C813705k26760k03654j84023j67935j54481j42116j29876j17798j06524
$$ plain form
60417 3049481 3129667 3215355 3300071 3377991 3444293 3495877 3531775 3552255 3558302 3552899 3541626 3530226
60405 3530226 3521786 3517425 3519030 3529523 3550543 3581663 3622401 3673833 3738022 3817020 3912846 4027359
60393 4027359 4161692 4316753 4494934 4700672 4938875 5213364 5527107 5883139 6284627
60384 6284627 6734616 7236292 7792853 8406074 9074495 9792685 10551107 11334996 12122276
60375 12122276 12882439 13578257 14170156 14621553 14903437 14997700 14899455 14618001 14175444 13602838
60365 13602838 12935248 12207377 11450296 10689396 9943909 9227706 8550092 7916031 7326848
60356 7326848 6781983 6280409 5820517 5399684 5015181 4665465 4349847 4066875 3813705
60347 3813705 3586945 3383291 3199268 3031333 2876852 2734736 2604860 2487062 2380538
60338B380538r6971q9849q4737p9931p4042o7539o2054n8234n5097n1418m7076
60327A613590m2886l9722l7886l6766l5136l2305k9097k7061k6533k6158k4624
60316A255416k2235k0262j9348j9222j9541k0021j9844j8100j5262j3344j3703
60305A054534j5225j5610j4141j2135j0746r626q234p229p485q461q760q129p819
60292I20934q814j0552j1654j1309r713p748o462o451p408q422q866q812q608
60279H06115q465q450q500q234p086m875k158J30J387J736J810K089K509K805
60265G70813K994L204L278L172L496M658N598M849L171L424O734J0435J1353R822
60251H47001Q435P936O869M859L437L331L363K780K474K949L135K443K225L637
$$ plain form
60338 2380538 2283567 2193718 2108981 2029050 1955008 1887469 1825415 1767181 1712084 1660666 1613590
60327 1613590 1570704 1530982 1493096 1456330 1421194 1388889 1359792 1332731 1306198 1280040 1255416
60316 1255416 1233181 1212919 1193571 1174349 1154808 1134787 1114943 1096843 1081581 1068237 1054534
60305 1054534 1039309 1023699 1009558 997423 986677 977051 968817 961588 954103 945642 936882 928753 920934
60292 920934 912120 901568 889914 878605 868892 861144 854682 848231 840823 832401 823535 814723 806115
60279 806115 797650 789200 780700 772466 765380 760505 758347 758477 759864 761600 763410 765499 768008 770813
60265 770813 773807 777011 780289 783461 786957 791615 797213 802062 805233 808657 815391 825826 837179 847001
60251 847001 855436 863372 870241 875100 878537 881868 885231 888011 890485 893434 896569 899012 901237 904874
60237I04874N540O093N262M240L338K107Q25J80j51j171k988m847o550q617j0990
60222H97145j2675j2851j1763j0369r470r049q245o440m479l899m526m068j168
60209G98143K318L555K427J350J820L050L908M484N273O233P225Q288R031Q746
60195H65851P682P255Q428J0570J2458J3734J4830J6008J7137J8184J9541K1922
60183A033600K5825L0749L5057L7340L8076L9170M1654M4566M6609M8040N0107
60172A470793N3088N5778N6955N6619N5588N4246N2175M8949M4972M1198L7970
60161B028331L4408K9267K2387J5118R215N378K757p4l562o511p298n822l727
60148B119867k447j563M46M267R223J4278J8781K2410K5332K8411L2558L7708
$$ plain form
60237 904874 910414 916507 921769 926009 929347 931454 932279 932459 932308 931137 928149 923302 916752 908135 897145
60222 897145 884470 871619 859856 849487 840017 830968 822723 816283 811804 807905 803379 799311 798143
60209 798143 800461 804016 806443 807793 809613 812663 816571 821055 826328 832561 839786 848074 857105 865851
60195 865851 873533 880788 889216 899786 912244 925978 940808 956816 973953 992137 1011678 1033600
60183 1033600 1059425 1090174 1125231 1162571 1200647 1239817 1281471 1326037 1372646 1420686 1470793
60172 1470793 1523881 1579659 1636614 1693233 1748821 1803067 1855242 1904191 1949163 1990361 2028331
60161 2028331 2062739 2092006 2114393 2129511 2138726 2144104 2146861 2146787 2143225 2136714 2129416 2123594 2119867
60148 2119867 2117420 2115857 2116303 2120570 2129793 2144071 2162852 2185262 2210594 2239005 2271563 2309271
60136B309271M3022M8030N2744N6602N8410N7821N6108N4729N3605N1368M7009
60125B888719M0712L3385K5931J8875J2309O144M27m769r734j4828j9582k2680
60113B954909k3327k2016j9491j5562r813k900M068J1349K0353L1196M1779N0182
60101C020727N7092O4683P3565Q2229Q9377R5249R9827J00963R5636Q3126O6010
60090C928484M7842L0380J3277m087k0973l5432m5767n1792n4705n5775n5199
60079C696253n2275m6573l8693k9857k0946j2035k771P105J7688K9144M1537N4282
60067C642859O6378P7569Q8908J01359J14110J25292J34375J42636J50805J57554
60057D801845J61164J61608J59702J55200J47254J36312J23841J10235R4502P6189
$$ plain form
60136 2309271 2352293 2400323 2453067 2509669 2568079 2625900 2682008 2736737 2790342 2841710 2888719
60125 2888719 2929431 2962816 2988747 3007622 3019931 3026075 3026502 3021733 3011999 2997171 2977589 2954909
60113 2954909 2931582 2909566 2890075 2874513 2864700 2861800 2865868 2877217 2897570 2928766 2970545 3020727
60101 3020727 3077819 3142502 3216067 3298296 3387673 3482922 3582749 3683712 3779348 3862474 3928484
60090 3928484 3976326 4006706 4019983 4015896 3994923 3959491 3913724 3861932 3807227 3751452 3696253
60079 3696253 3643978 3597405 3558712 3528855 3507909 3495874 3493103 3500208 3517896 3547040 3588577 3642859
60067 3642859 3709237 3786806 3875714 3977073 4091183 4216475 4350850 4493486 4644291 4801845
60057 4801845 4963009 5124617 5284319 5439519 5586773 5723085 5846926 5957161 6051663 6127852
60047F127852N6196L5481J4275p153k8310m9314p0405r0149j05866j16635j24390
60036E641582j30958j35462j36042j32767j27184j19924j10561r9306q7124p4377
60026D487877o0984m7671l5490k4012j1742J237J2500J9882K3841K6362K8388
60015D420188K9150K7629K3850J8708J3111P503K021l271q486j3976j9763k4986
60003D471678k8732l1470l4642l8369m0607l9607l6209l2464k8645k3292j5919
59992D121722p882j93Q034J8194L0110M2167N2982O2508P1692Q1246R0286R6219
59980D667085R6557R1145Q2105P1645O0404M8040L4567K0720P328n272j7394k9530
59968E127400m1594n2775o2520p1341q0196q9172r7295j03378j06684j07196j05967
$$ plain form
60047 6127852 6184048 6219529 6233804 6226651 6198341 6149027 6078622 5988473 5882607 5765972 5641582
60036 5641582 5510624 5375162 5239120 5106353 4979169 4859245 4748684 4649378 4562254 4487877
60026 4487877 4426893 4379222 4343732 4319720 4307978 4309215 4321715 4341597 4365438 4391800 4420188
60015 4420188 4449338 4476967 4500817 4519525 4532636 4540139 4542160 4538889 4530403 4516427 4496664 4471678
60003 4471678 4442946 4411476 4376834 4338465 4297858 4258251 4222042 4189578 4160933 4137641 4121722
59992 4121722 4113840 4113647 4121681 4139875 4169985 4212152 4265134 4327642 4399334 4480580 4570866 4667085
59980 4667085 4763642 4854787 4936892 5008537 5068941 5116981 5151548 5172268 5179596 5174324 5156930 5127400
59968 5127400 5085806 5033031 4970511 4899170 4818974 4729802 4632507 4529129 4422445 4315249 4209282
59957D209282j04692j04043j02655r8726r2344q5220p8314p0997o2619n3580m4449
59946C311643l5045k4963j4328l744O015J4290K1282K8515L7458M7555N6491O2544
59934C507713O5805O7095O6886O5417O2601N7545M9406L9123K8945J9728J0141
59923D040405q25j2101k2256l1479m0428m8326n3801n6850n8472n8784n6939n2705
59911C547439m6875m0302l3480k6782k0052j2332l058O686J5207K2158K8286L3588
59899C470483L7295L9769M2788M7192N1368N2942N1340M8026M4744M2044L9240
59888C967231L5276K9904K4224J9773J6933J4712J2303J0386J0409J2969J7486
59877D171606K3330L0656L9963N1152O3340P5556Q7541R9721J12412J25156J36852
$$ plain form
59957 4209282 4104590 4000547 3897892 3799166 3706822 3621602 3543288 3472291 3409672 3356092 3311643
59946 3311643 3276598 3251635 3237307 3233563 3239578 3253868 3275150 3303665 3341123 3388678 3445169 3507713
59934 3507713 3573518 3640613 3707499 3772916 3835517 3893062 3942468 3981591 4010536 4030264 4040405
59923 4040405 4039580 4027479 4005223 3973744 3933316 3884990 3831189 3774339 3715867 3657083 3600144 3547439
59911 3547439 3500564 3460262 3426782 3400000 3379948 3367616 3364558 3371244 3386451 3408609 3436895 3470483
59899 3470483 3507778 3547547 3590335 3637527 3688895 3741837 3793177 3841203 3885947 3927991 3967231
59888 3967231 4002507 4032411 4056635 4076408 4093341 4108053 4120356 4130742 4141151 4154120 4171606
59877 4171606 4194936 4225592 4265555 4316707 4380047 4455603 4543144 4642865 4755277 4880433 5017285
59866E017285J46592J54107J59252J61167J58395J50155J37154J20560J00280
59857F304947P5112M4863J1570k1944n4001q3635j09065j28233j41016j49474
59847E749124j55321j58175j56964j52078j45102j36882j26848j14381j00165
59838D503208q5944p2944o0602m7184l2017j6689l299Q078J9020K9964L9378M6069
59826D327038N0664N3843N4560N1480M5031L6455K5536J1165o119k3960m0788
59815D584905n6949p2789q6911r7321j03604j07258j10186j13157j15463j15792
59805C605475j13620j09856j05942j02452r8887r4515q8922q2007p4221o6726
59795B668327o0437n4713m7773l8854k9571k2621j9132j7542j5156j0938o498
$$ plain form
59866 5017285 5163877 5317984 5477236 5638403 5796798 5946953 6084107 6204667 6304947
59857 6304947 6380059 6424922 6436492 6414548 6360547 6276912 6167847 6039614 5898598 5749124
59847 5749124 5593803 5435628 5278664 5126586 4981484 4844602 4717754 4603373 4503208
59838 4503208 4417264 4344320 4283718 4236534 4204517 4187828 4184529 4192607 4211627 4241591 4280969 4327038
59826 4327038 4377702 4431545 4486105 4537585 4582616 4619071 4644607 4655772 4649653 4625693 4584905
59815 4584905 4527956 4455167 4368256 4270935 4167331 4060073 3949887 3836730 3721267 3605475
59805 3605475 3491855 3381999 3276057 3173605 3074718 2980203 2891281 2809274 2735053 2668327
59795 2668327 2607890 2553177 2505404 2466550 2436979 2414358 2395226 2377684 2362528 2351590 2345092
59784B345092m028l470k677m60J737K132J387J756L921O302P314O839N284K700
59770B373829o21l880o821j0073j3833j7085j8858j9592k0431k1698k2843k3479
59758B194615k3698k3581k3128k2525k1937k1087j9390j6613j3054r102m825P
59746A995682N528J1306J6355K0027K2943K6591L1718L7537M2732M6852N0140
59735B307411N2285N1949M7829M0079L0589K1858J5497J1848J0786J2251J5502
59724B617884J8323J8162J4518R615O388O292R238J4855K2937L2961M4035N5368
59712B870576O6376P6505Q5666R4909J05908J19123J32645J43258J48605J48021
59702C991592J41300J27318J04607P3439L6999J07l3182o0733q1739r5761j02665
$$ plain form
59784 2345092 2341064 2337594 2334917 2334457 2336194 2338326 2339713 2341469 2345390 2351692 2359006 2365845 2371129 2373829
59770 2373829 2373208 2369328 2362507 2352434 2338601 2321516 2302658 2283066 2262635 2240937 2218094 2194615
59758 2194615 2170917 2147336 2124208 2101683 2079746 2058659 2039269 2022656 2009602 2000500 1995675 1995682
59746 1995682 2001210 2012516 2028871 2048898 2071841 2098432 2130150 2167687 2210419 2257271 2307411
59735 2307411 2359696 2411645 2459474 2499553 2530142 2552000 2567497 2579345 2590131 2602382 2617884
59724 2617884 2636207 2654369 2668887 2678502 2684890 2691182 2700420 2715275 2738212 2771173 2815208 2870576
59712 2870576 2936952 3013457 3099123 3194032 3299940 3419063 3551708 3694966 3843571 3991592
59702 3991592 4132892 4260210 4364817 4438256 4475255 4475362 4442180 4381447 4299708 4203947 4101282
59691D101282j03113r8683r1450q3260p5105o6912n8057m8245l8061k8600k0508
59680C389288j3188n065N109J6976K8759L8851M7159N4855O3126P2329Q2032R1568
59668C871799J00774J10364J21340J33820J46893J59903J73353J88049K03969
59659E210264K20672K38326K57261K76719K95079L11348L25558L37580L46543
59650G819350L51609L52501L49061L41172L29539L15790L01483K87689K75652
59641A0723846K66747K61061K56923K52516K47342K41430K33826K22869K07555
59632A2914115J87911J64473J38113J10044Q1212N2011K3314k723k3820l9392
59622A3605258n0276n6792n8137n3770m4441l1362j4936N201K9246N6588Q5995
$$ plain form
59691 4101282 3998169 3899486 3808036 3724776 3649671 3582759 3524702 3476457 3438396 3409796 3389288
59680 3389288 3376100 3371035 3376144 3393120 3421879 3460730 3507889 3562744 3625870 3698199 3780231 3871799
59668 3871799 3972573 4082937 4204277 4338097 4484990 4644893 4818246 5006295 5210264
59659 5210264 5430936 5669262 5926523 6203242 6498321 6809669 7135227 7472807 7819350
59650 7819350 8170959 8523460 8872521 9213693 9543232 9859022 10160505 10448194 10723846
59641 10723846 10990593 11251654 11508577 11761093 12008435 12249865 12483691 12706560 12914115
59632 12914115 13102026 13266499 13404612 13514656 13595868 13647879 13671193 13668470 13644650 13605258
59622 13605258 13554982 13498190 13440053 13386283 13341842 13310480 13295544 13300745 13329991 13386579 13472574
59611A3472574J16350J47360J79258K11588K42609K70303K93508L11351L22013
59602A5566914L23027L12671K90089K54214K04037J40399O6504j3817r7347j80525
59592A6866166k58595l26952l82958m25668m54630m70121m74016m69039m57096
59583A3147091m39245m17082l93088l69686l49113l34266l28157l31717l42815
59574I841922l57754l72910l84881l90649l88985l81052l68635l52330l32329
59565F512397l10119k88002k67161k47464k28913k11859j95782j79411j62617
59556D421069j46905j33369j21174j08934r6736q5933p7433p0922o5341n9560
59546C454762n3164m7199m3514m2752m3493m4041m4201m4602m5195m5801m7189
$$ plain form
59611 13472574 13588924 13736284 13915542 14127130 14369739 14640042 14933550 15244901 15566914
59602 15566914 15889941 16202612 16492701 16746915 16950952 17091351 17157855 17144038 17046691 16866166
59592 16866166 16607571 16280619 15897661 15471993 15017363 14547242 14073226 13604187 13147091
59583 13147091 12707846 12290764 11897676 11527990 11178877 10844611 10516454 10184737 9841922
59574 9841922 9484168 9111258 8726377 8335728 7946743 7565691 7197056 6844726 6512397
59565 6512397 6202278 5914276 5647115 5399651 5170738 4958879 4763097 4583686 4421069
59556 4421069 4274164 4140795 4019621 3910687 3813951 3728018 3650585 3579663 3514322 3454762
59546 3454762 3401598 3354399 3310885 3268133 3224640 3180599 3136398 3091796 3046601 3000800 2953611
59535B953611m9846n2073n1321m7756m4601m4214m5334m5110m2561l8919l5640
59524B456236l3242l1473k9470k6189k1652j7277j4131j1453p979m158j581l67
59512B257264J362N030R794J3742J5932J6754J7028J7542J8914K1086K3157K4357
59500B441962K5041K6287K8665L1883L5501L9415M3495M7275N0388N3114N6133
59489B879159N9825O4126O9154P5476Q3250R1339R8004J02750J06845J11571J16477
59478C857976J20089J21878J22362J21386J17766J11403J04573R9640R5773Q9184
59468D962030P6873N9393L9975K1989P451l304j1501j8974k6341l2436l6010l7443
59456E001702l7720l6240l1157k2056j0911K56J1501K3844L7075M9913O1889P3445
$$ plain form
59535 2953611 2903765 2851692 2800371 2752615 2708014 2663800 2618466 2573356 2530795 2491876 2456236
59524 2456236 2422994 2391521 2362051 2335862 2314210 2296933 2282802 2271349 2263370 2259212 2257631 2257264
59512 2257264 2258626 2263656 2273450 2287192 2303124 2319878 2336906 2354448 2373362 2394448 2417605 2441962
59500 2441962 2467003 2493290 2521955 2553838 2589339 2628754 2672249 2719524 2769912 2823026 2879159
59489 2879159 2938984 3003110 3072264 3147740 3230990 3322329 3420333 3523083 3629928 3741499 3857976
59478 3857976 3978065 4099943 4222305 4343691 4461457 4572860 4677433 4777073 4872846 4962030
59468 4962030 5038903 5098296 5138271 5160260 5167711 5164407 5152906 5133932 5107591 5075155 5039145 5001702
59456 5001702 4963982 4927742 4896585 4874529 4863618 4863874 4875375 4899219 4936294 4986207 5048096 5121541
59444E121541Q4137R1889R4655R1907Q4094P1323N3347L0555M432k2984m9913
59433E654983p5381r9117j20680j38580j50812j56684j57814j56709j54460j50216
59423D294530j42755j32172j19958j07949r7197q7446p7489o6380n4435m2888
59413C365861l2420k2406j1794l98J0859K0899K9307L6533M3588N1359N9695O7305
59401C618388P3069P7290Q0875Q3305Q2570P7668P0071O1593N1613L8022K0691
59390D335155K274j4865l0948m7115o2860p6510q7339r5722j01640j04765j05937
59379C609728j06944j08213j08074j05019r9783r4233q8955q3031p5947o8553
59369B670976o2020n6583n1699m6847m1715l6055l0004k4450k0379j7489j4041
$$ plain form
59444 5121541 5205678 5297567 5392222 5484129 5568223 5639546 5692893 5723448 5727880 5704896 5654983
59433 5654983 5579602 5480485 5359805 5221225 5070413 4913729 4755915 4599206 4444746 4294530
59423 4294530 4151775 4019603 3899645 3791696 3694499 3607053 3529564 3463184 3408749 3365861
59413 3365861 3333441 3311035 3299241 3298843 3309702 3330601 3359908 3396441 3440029 3491388 3551083 3618388
59401 3618388 3691457 3768747 3849622 3932927 4015497 4093165 4163236 4224829 4276442 4314464 4335155
59390 4335155 4337429 4322564 4291616 4244501 4181641 4105131 4017792 3922070 3820430 3715665 3609728
59379 3609728 3502784 3394571 3286497 3181478 3081695 2987462 2898507 2815476 2739529 2670976
59369 2670976 2608956 2552373 2500674 2453827 2412112 2376057 2346053 2321603 2301224 2283735 2269694
59358B269694q651j968M069Q488J2075J5875J9960K4004K8217L2832L7292M0802
59346B482689M3171M4316M3382L9538L3634K8155K5405K6276L0534L7244M4937
59335B879281N2409N9472O6096P0906P1819O8690O4245O1832O2875O6800P2335
59324C596760P8269Q3922Q9735R6803J05208J13573J20951J28338J37408J48265
59314D699232J59436J69650J78810J87561J96872K07820K20923K35705K51351
59305F507360K67488K83821K99528L13685L25898L35779L42203L43945L40817
59296I360524L33411L22079L06975K88776K68498K46872K24585K02577J80976
59287A1735273J58393J33542J07200Q0887N3925K3711j0793m7777q5252j23045
$$ plain form
59358 2269694 2261043 2259075 2263144 2271632 2283707 2299582 2319542 2343546 2371763 2404595 2441887 2482689
59346 2482689 2525860 2570176 2613558 2653096 2686730 2714885 2740290 2766566 2797100 2834344 2879281
59335 2879281 2931690 2991162 3057258 3128164 3199983 3268673 3332918 3394750 3457625 3524425 3596760
59324 3596760 3675029 3758951 3848686 3945489 4050697 4164270 4285221 4413559 4550967 4699232
59314 4699232 4858668 5028318 5207128 5394689 5591561 5799381 6020304 6256009 6507360
59305 6507360 6774848 7058669 7358197 7671882 7997780 8333559 8675762 9019707 9360524
59296 9360524 9693935 10016014 10322989 10611765 10880263 11127135 11351720 11554297 11735273
59287 11735273 11893666 12027208 12134408 12215295 12269220 12292931 12282138 12234361 12149109 12026064
59277A2026064j61019j97142k28993k56078k78956k96886l08073l12052l10380
59268I676485l05023k97237k87861k77411k65564k51564k35461k18403k01568
59259G336393j85409j69887j54948j40788j28116j17676j08890r9552q8246p6574
59249F066307o7435o1075n4780m6987l9741l5848l5194l5492l5559l5891l6626
59238E581679l7083l7474l9311m3419m8738n3614n7368o0195o2536o5036o8190
59227E008715p1312p2662p1370o8527o5696o2924n9151n3998m8139m2117l5811
59216D357008k9150k2408j5648q615j492M801R449J2644J5304J8002K0280K0912
59204D381087J8889J4310Q164J204o733j5948k5734l4611m1674m7216n1844n5473
$$ plain form
59277 12026064 11865045 11667903 11438910 11182832 10903876 10606990 10298917 9986865 9676485
59268 9676485 9371462 9074225 8786364 8508953 8243389 7991825 7756364 7537961 7336393
59259 7336393 7150984 6981097 6826149 6685361 6557245 6439569 6330679 6231127 6142881 6066307
59249 6066307 5998872 5937797 5883017 5836030 5796289 5760441 5725247 5689755 5654196 5618305 5581679
59238 5581679 5544596 5507122 5467811 5424392 5375654 5322040 5264672 5204477 5141941 5076905 5008715
59227 5008715 4937403 4864741 4793371 4724844 4659148 4596224 4537073 4483075 4434936 4392819 4357008
59216 4357008 4327858 4305450 4289802 4281187 4279695 4284496 4293945 4306589 4321893 4339895 4360175 4381087
59204 4381087 4399976 4414286 4422450 4423654 4416921 4400973 4375239 4340628 4298954 4251738 4199894 4144421
59192D144421n7350n6913n4399n0695m6591m2014l6159k8564j9806j0847j923
59181C739160P259J6128K2569K4136K0025J1946L188l235n874m782o66N604J3046
59168C848504K0930K9282L8393M7733N6213O3913P2470Q2867R3733J02976J10516
59157D567530J18128J27003J36916J47601J59423J72377J85585J98169K09690
59148F022422K19583K27210K32573K35840K35884K30533K18650K00970J78531
59139H002196J51540J20289Q5948M9706J2265k5083n9990r0555j16386j37465
59129G992465j53184j63546j70151j74606j76711j75597j71935j67419j62470
59120F476846j56032j47678j38700j30758j24398j19044j13671j07437j00290
$$ plain form
59192 4144421 4087071 4030158 3975759 3925064 3878473 3836459 3800300 3771736 3751930 3741083 3739160
59181 3739160 3746419 3762547 3785116 3809252 3829277 3841223 3844411 3841176 3835302 3830520 3829854 3835458 3848504
59168 3848504 3869434 3898716 3937109 3984842 4041055 4104968 4177438 4260305 4354038 4457014 4567530
59157 4567530 4685658 4812661 4949577 5097178 5256601 5428978 5614563 5812732 6022422
59148 6022422 6242005 6469215 6701788 6937628 7173512 7404045 7622695 7823665 8002196
59139 8002196 8153736 8274025 8359973 8409679 8421944 8396861 8336871 8246316 8129930 7992465
59129 7992465 7839281 7675735 7505584 7330978 7154267 6978670 6806735 6639316 6476846
59120 6476846 6320814 6173136 6034436 5903678 5779280 5660236 5546565 5439128 5338838
59111E338838r3012q6298p9885p3113o5981n8993n2315m5821l9864l5104l1562
59100D676890k8311k4365j9684j5406j2943j2296j1412q312l954j503k087l060
59088D533557j786M77M84k476o378j0125j4609k0058k4985k8662l2450l7546m3071
59075D312372m7628n1250n4505n6880n7623n7409n7640n8400n8413n6923n4619
59064C701082n2454n0358m7429m3049l7579l1985k6813k1632j5805r710m645j278
59052C358345J269M313P844J0477J1226J0817J0800J1506J1521R679O923N367
59040C460087N764P066Q526J0768J4225J8027K1462K5143K9333L2399L2632L0585
59028C696017K7561K2669J3909J743j1103k3573l7262n2679o7247p8432q6652
$$ plain form
59111 5338838 5245826 5159528 5079643 5006530 4940549 4881556 4829241 4783420 4743556 4708452 4676890
59100 4676890 4648579 4624214 4604530 4589124 4576181 4563885 4552473 4544161 4540207 4538704 4536617 4533557
59088 4533557 4531771 4532248 4532732 4530256 4523878 4513753 4499144 4479086 4454101 4425439 4392989 4355443 4312372
59075 4312372 4264744 4213494 4158989 4102109 4044486 3987077 3929437 3871037 3812624 3755701 3701082
59064 3701082 3648628 3598270 3550841 3507792 3470213 3438228 3411415 3389783 3373978 3364268 3359623 3358345
59052 3358345 3359614 3363927 3371771 3382248 3393474 3404291 3415091 3426597 3438118 3447797 3454720 3460087
59040 3460087 3465851 3472917 3481443 3492211 3506436 3524463 3545925 3571068 3600401 3632800 3665432 3696017
59028 3696017 3723578 3746247 3760156 3761899 3750796 3727223 3689961 3637282 3570035 3491603 3404951
59017C404951r3472r8817j01946j03645j05135j05641j03206r7714r1356q6100
59007B417919q2078p8501p4893p1186o7397o3517n9288n4396m9281m5221m2860
58996A729301m1172l8628l4894l0628k6292k2285j9716j9440k0321j9879j7091
58985A438955j3535j1259j0389r527p801n684l858k143J56L099O023Q583J1303
58972A403923J4511J7295J8567J8955K0324K3100K5402K5538K4167K2863K1644
58961A636289J9456J6444J3903J2090R725O125K459K09o04p79l16J539M866Q534
58947A729940J1285J2885J4022J5308J6575J7017J5787J2418P065P01n193r787
58935A838023j3871j9000k5408l1390l5135l6458l6186l4597l1576k7959k5331
$$ plain form
59017 3404951 3311479 3212662 3110716 3007071 2901936 2796295 2693089 2595375 2504019 2417919
59007 2417919 2335841 2257340 2182447 2111261 2043864 1980347 1921059 1866663 1817382 1772161 1729301
58996 1729301 1688129 1649501 1614607 1583979 1557687 1535402 1515686 1496246 1475925 1456046 1438955
58985 1438955 1425420 1414161 1403772 1394245 1386444 1380760 1376902 1374759 1374915 1378014 1384037 1392620 1403923
58972 1403923 1418434 1435729 1454296 1473251 1493575 1516675 1542077 1567615 1591782 1614645 1636289
58961 1636289 1655745 1672189 1686092 1698182 1707907 1714032 1716491 1716700 1716096 1715317 1715001 1716540 1721406 1729940
58947 1729940 1741225 1754110 1768132 1783440 1800015 1817032 1832819 1845237 1852302 1853003 1847810 1838023
58935 1838023 1824152 1805152 1779744 1748354 1713219 1676761 1640575 1605978 1574402 1546443 1521112
58924A521112k4179k3264k1341j8671j6166j3801j1004q203o644o278n146j857
58912A364558K064L814L177L168O272J1356J5367J7000J7259J7104J6346J4856
58900A492341J3207J1702J0065Q524P874P969P387N468L505K985L601M240N105
58887A583973P449J1492J5801J8818K0147K0435K0799K2278K5095K8278L0528
58876A805093L1522L2027L2908L4463L6541L8864M1281M4102M7920N2709N7362
58865B254792O0766O3155O5843O9727P4592P9902Q5593R1806R8131J03645J07940
58854C155892J12012J17579J25208J33561J41164J48575J57820J69764J83174
58845D444749J96575K09771K23025K35954K48003K59123K69153K77318K82997
$$ plain form
58924 1521112 1496933 1473669 1452328 1433657 1417491 1403690 1392686 1384483 1377839 1371561 1366415 1364558
58912 1364558 1366622 1370436 1373613 1376781 1383053 1394409 1409776 1426776 1444035 1461139 1477485 1492341
58900 1492341 1505548 1517250 1527315 1535839 1543713 1551682 1559069 1564537 1568042 1571027 1574628 1578868 1583973
58887 1583973 1591422 1602914 1618715 1637533 1657680 1678115 1698914 1721192 1746287 1774565 1805093
58876 1805093 1836615 1868642 1901550 1936013 1972554 2011418 2052699 2096801 2144721 2197430 2254792
58865 2254792 2315558 2378713 2444556 2514283 2588875 2668777 2754370 2846176 2944307 3047952 3155892
58854 3155892 3267904 3385483 3510691 3644252 3785416 3933991 4091811 4261575 4444749
58845 4444749 4641324 4851095 5074120 5310074 5558077 5817200 6086353 6363671 6646668
58836F646668K86136K86065K81012K69752K52735K30507K02133J66716J25706
58827H747430Q1925L6835r473n5813r9451j38297j71964k00335k22733k39119
58817G729005k50696k58422k61923k60780k56163k50267k44463k38540k31447
58808E476304k22458k11933k01306j91998j84077j76169j66863j56074j45084
58799C820342j35416j27546j20456j12693j04084r5976q9439q3923p8360p2836
58789B799613o8118o3959n9228n3672m8248m3524l8838l3415k7447k1666j6561
58778B324937j2250q532m938j306J792M028O472J0630J6226K1293K4831K8163
58766B411346L2928L8861M4562M9571N4566N9931O5203O9900P4131P8437Q3455
$$ plain form
58836 6646668 6932804 7218869 7499881 7769633 8022368 8252875 8455008 8621724 8747430
58827 8747430 8829355 8866190 8856717 8800904 8701453 8563156 8391192 8190857 7968124 7729005
58817 7729005 7478309 7219887 6957964 6697184 6441021 6190754 5946291 5707751 5476304
58808 5476304 5253846 5041913 4840607 4648609 4464532 4288363 4121500 3965426 3820342
58799 3820342 3684926 3557380 3436924 3324231 3220147 3124171 3034732 2950809 2872449 2799613
58789 2799613 2731495 2667536 2608308 2554636 2506388 2462864 2424026 2390611 2363164 2341498 2324937
58778 2324937 2312687 2304155 2299217 2297911 2299703 2303731 2310203 2320833 2337059 2358352 2383183 2411346
58766 2411346 2444274 2483135 2527697 2577268 2631834 2691765 2756968 2826868 2900999 2979436 3062891
58755C062891Q9681R6985J04461J11218J17392J24036J31895J40575J49245J58043
58745D286422J68297J80880J94642K07188K17493K26902K37127K47885K57300
58736F224136K63907K67186K66481K60748K49457K32783K10611J82335J48010
58727H305654J08932O6670K2140k3890o9819j13239j51851j84348k10692k31472
58717G518085k46920k56799k61586k62962k62385k59592k53667k45217k36194
58708E232763k27602k18662k08483j97280j85675j73927j62344j51352j40672
58699C566766j29513j18143j08142j00327r3437q5834p7707p0566o5088o0461
58689B657548n5560m9903m3742l7978l3778l1415k9585k6592k2275j8089j5162
$$ plain form
58755 3062891 3152572 3249557 3354018 3465236 3582628 3706664 3838559 3979134 4128379 4286422
58745 4286422 4454719 4635599 4830241 5037429 5254922 5481824 5718951 5966836 6224136
58736 6224136 6488043 6755229 7021710 7282458 7531915 7764698 7975309 8157644 8305654
58727 8305654 8414586 8481256 8503396 8479506 8409687 8296448 8144597 7960249 7749557 7518085
58717 7518085 7271165 7014366 6752780 6489818 6227433 5967841 5714174 5468957 5232763
58708 5232763 5005161 4786499 4578016 4380736 4195061 4021134 3858790 3707438 3566766
58699 3566766 3437253 3319110 3210968 3110641 3017204 2931370 2853663 2783097 2718009 2657548
58689 2657548 2601988 2552085 2508343 2470365 2436587 2405172 2375587 2348995 2326720 2308631 2293469
58678B293469j2924j0062o465l522k454k960m064n778q796j2507j4740j4488j3672
58665B181037j4756j7178j8064j6414j4792j6275k1177k7509l3487l8567m2856
58654A919962m6487m9347n1028n1445n1463n2078n2741n1730m8639m5312m3427
58643A376265m2215l9680l5447l1138k8190k6390k4558k1913j8611j5336j2540
58632A080247j0128p989o609o603p691q903r769j0519j1128j1176j0933j1248
58620I67551j2026j1880j0044p554n773m779l907k886j485Q41L880O147O641O380
58606I31106O944Q222Q860Q330P263O147N042M074K879J28m721r582j1487j0356
58592I52849r253j0438j2838j4047j3286j1420r325p528o632o829p299p019n960
$$ plain form
58678 2293469 2280545 2270483 2264018 2260496 2258042 2255082 2251018 2245240 2236444 2223937 2209197 2194709 2181037
58665 2181037 2166281 2149103 2131039 2114625 2099833 2083558 2062381 2034872 2001385 1962818 1919962
58654 1919962 1873475 1824128 1773100 1721655 1670192 1618114 1565373 1513643 1465004 1419692 1376265
58643 1376265 1334050 1294370 1258923 1227785 1199595 1173205 1148647 1126734 1108123 1092787 1080247
58632 1080247 1070119 1062130 1055521 1048918 1041227 1032324 1022555 1012036 1000908 989732 978799 967551
58620 967551 955525 943645 933601 926047 920274 915495 911588 908702 907217 908058 911938 918085 924726 931106
58606 931106 938050 946272 955132 963462 970725 976872 981914 985988 988867 988995 984274 974692 963205 952849
58592 952849 943596 933158 920320 906273 892987 881567 872242 864714 858082 851253 843954 836935 830975
58579H30975m663l004l59L063N996P503P964Q372R127R958J0667J1474J2691J4330
58565I24094J6086J7450J7980J7812J7914J9422K2466K5861K8157K8872K8748
58554A164862K9101L1102L5093M0193M4814M7949M9805N1177N2842N5718O0588
58543A663244O6810P2210P5424P7638Q0654Q3762Q4278Q1106P5915P0321O3647
58532B495009N4318M2107K8108J3566l56j2696k3431l3348m2412m9288n3243n5427
58520B362907n7139n7875n6449n3290n0006m7044m3308l8202l2701k8169k5081
58509A873643k3151k1865k0623j9088j7650j6936j6666j5696j3516j1151j0100
58498A687201j0682j2021j3473j5489j8805k3246k7844l1876l5055l6802l6447
$$ plain form
58579 830975 826312 823308 822949 826012 832008 839511 847475 855847 864974 874932 885599 897073 909764 924094
58565 924094 940180 957630 975610 993422 1011336 1030758 1053224 1079085 1107242 1136114 1164862
58554 1164862 1193963 1225065 1260158 1300351 1345165 1393114 1442919 1494096 1546938 1602656 1663244
58543 1663244 1730054 1802264 1877688 1955326 2035980 2119742 2204020 2285126 2361041 2431362 2495009
58532 2495009 2549327 2591434 2619542 2633108 2632752 2620056 2596625 2563277 2520865 2471577 2418334 2362907
58520 2362907 2305768 2247893 2191444 2138154 2088148 2041104 1997796 1959594 1926893 1898724 1873643
58509 1873643 1850492 1828627 1808004 1788916 1771266 1754330 1737664 1721968 1708452 1697301 1687201
58498 1687201 1676519 1664498 1651025 1635536 1616731 1593485 1565641 1533765 1498710 1461908 1425461
58487A425461l4554l3040l3033l3497l2995l2037l2089l2907l2664l0742k8482
58476A069421k6938k5649k4159k3012k2300k0834j7826j4255j1588j0158r572
58465H63130r614r782r089p364n805n273m924l597j660l99k91q20j403j628j244
58450H00237o28n95j114j063K61K292M239N778O301N202L594L935O654R022Q780
58435H52895P172O568O835O395N480N708P131Q249Q615R150R949R936Q824P522
58421I60429O464N061K980M80k423n654q059q360p378p650j0401j4029j6037j5524
58407H79899j3479j1472j0409j0099r846r440r066q273o164l140j122j099j701
58394G84589j339m01P4M68J640L058L789M326N548O787O943O636P110P844P591
$$ plain form
58487 1425461 1390907 1357867 1324834 1291337 1258342 1226305 1194216 1161309 1128645 1097903 1069421
58476 1069421 1042483 1016834 992675 969663 947363 926529 908703 894448 882860 872702 863130
58465 863130 853516 843734 834645 827281 821476 816203 811279 807682 806022 805623 805332 804512 803109 801481 800237
58450 800237 799609 799014 797900 796837 797098 799390 803629 809407 815708 820910 824504 828439 835093 844115 852895
58435 852895 860067 866635 873470 879865 885345 891053 898184 906433 915048 924198 934147 944083 952907 960429
58421 960429 966893 971954 974934 975414 972991 967337 959278 950918 943540 935890 925489 911460 895423 879899
58407 879899 866420 854948 844539 834440 824594 815154 806088 797815 791651 788511 787389 786290 784589
58394 784589 783250 782849 782923 783391 785031 788089 791878 796204 801752 808539 815482 822118 829228 837072 844663
58379H44663P049P912R697J0223R266R099J0989J3485J4664J4180J2554J0176
58367I73957P624N496L587J380p27j935k504l200l708l232k231j896k217k236
58353I68158j759j142r9J421K169J611J889N015R063J0465R471R712J2258J4013
58339A042245J2726J0040Q307P440O442N383M367K790Q35l00o53j716l562m207
58325A090137k922j740k291l371l072j380O68K708M660O272P900J0057J1549J0217
58311A129392O292K778J581J550J340J709L400N060N187M495M691O172Q167R920
58297A191734J0812J0649J0347J1059J2336J3045J3870J6386J9568K0360J8324
58286A348490J6470J6379J6090J4269J3018J4198J6022J5851J3970J2106J0523
$$ plain form
58379 844663 851712 859624 869321 879544 888810 897909 908898 922383 937047 951227 963781 973957
58367 973957 981581 987077 990664 992044 991317 989382 986878 983678 979970 976738 974507 972611 970394 968158
58353 968158 966399 965257 965158 966579 968748 970359 972248 977263 986326 996791 1006262 1015974 1028232 1042245
58339 1042245 1054971 1065011 1073318 1080758 1087200 1092583 1096950 1099740 1100575 1100275 1099622 1097906 1094344 1090137
58325 1090137 1087215 1085475 1083184 1079813 1076741 1075361 1076029 1078737 1083397 1089669 1097569 1107626 1119175 1129392
58311 1129392 1135684 1138462 1140043 1141593 1142933 1144642 1148042 1153102 1158289 1162784 1167475 1173647 1181814 1191734
58297 1191734 1202546 1213195 1223542 1234601 1246937 1259982 1273852 1290238 1309806 1330166 1348490
58286 1348490 1364960 1381339 1397429 1411698 1424716 1438914 1454936 1470787 1484757 1496863 1507386
58275A507386R038Q832J0559J2394J2494J1967J3055J5592J7510J7806J7140J6458
58263A670231J6500J7728J9554K0729K1255K2389K4171K5080K4879K5369K7285
58252A915170K9123L0229L2144L5169L6611L4678L1511L0027L0087L0081L0007
58241B264837L0477L0665K9774K8943K9535L1068L2586L4308L6232L7099L6582
58230B622106L6565L8524M1509M4179M6765M9521N1606N2983N5181N8735O2271
58219C159945O5217O8728P2902P6165P8482Q1744Q6043Q9450R2563R8578J07312
58208D077129J14184J17209J19838J24296J27728J28174J28777J32049J35234
58199E204618J35905J37254J43111J52087J61277J71305J83098J94224K03488
$$ plain form
58275 1507386 1516424 1525256 1535815 1548209 1560703 1572670 1585725 1601317 1618827 1636633 1653773 1670231
58263 1670231 1686731 1704459 1724013 1744742 1765997 1788386 1812557 1837637 1862516 1887885 1915170
58252 1915170 1944293 1974522 2006666 2041835 2078446 2113124 2144635 2174662 2204749 2234830 2264837
58241 2264837 2295314 2325979 2355753 2384696 2414231 2445299 2477885 2512193 2548425 2585524 2622106
58230 2622106 2658671 2697195 2738704 2782883 2829648 2879169 2930775 2983758 3038939 3097674 3159945
58219 3159945 3225162 3293890 3366792 3442957 3521439 3603183 3689226 3778676 3871239 3969817 4077129
58208 4077129 4191313 4308522 4428360 4552656 4680384 4808558 4937335 5069384 5204618
58199 5204618 5340523 5477777 5620888 5772975 5934252 6105557 6288655 6482879 6686367
58190F686367K14765K31186K49637K65972K81333K98500L16652L34859L55788
58181I235059L80429M04112M23588M43054M67275M94155N20291N48235N81229
58172A3497427O16290O49755O84329P23400P64049Q03396Q45829Q95889R50008
58163B0430372J003725J060609J125156J193874J263216J339261J428853J528164
58155C0373230J631048J741449J865953K001926K145490K302896K480741K674277
58147D7217010K880703L115081L396773L729259M110105M550312N065367N659805
58139G9724415O343302P150970Q123994R281408J0633698J2205659J4011618J6018031
58131A63493095J8159413K0382654K2673113K5090827K7769971L0659410L2989138
$$ plain form
58190 6686367 6901132 7132318 7381955 7647927 7929260 8227760 8544412 8879271 9235059
58181 9235059 9615488 10019600 10443188 10886242 11353517 11847672 12367963 12916198 13497427
58172 13497427 14113717 14763472 15447801 16171201 16935250 17738646 18584475 19480364 20430372
58163 20430372 21434097 22494706 23619862 24813736 26076952 27416213 28845066 30373230
58155 30373230 32004278 33745727 35611680 37613606 39759096 42061992 44542733 47217010
58147 47217010 50097713 53212794 56609567 60338826 64448931 68999243 74064610 79724415
58139 79724415 86067717 93218687 101342681 110624089 121257787 133463446 147475064 163493095
58131 163493095 181652508 202035162 224708275 249799102 277569073 308228483 341217621
58124C41217621L3045716K8931487K0015785P767352m958619j5569639k2860086
58117C87589617k6927564k8458340k8207894k6850383k4934872k2836426k0773224
58110B08600914j8869446j7173052j5650421j4233777j2887283j1609910j0398893
58103A07778132r250043q181818p222491o377204n632538m983801m431410l958838
58095E7739989l540428l166230k837655k545310k272641k015852j780519j564261
58087C8017093j361242j177160j020659q84843p53970o21981m88244l43258j76759
58078C1188977P714K04933M26869O89930R89631J308027J643065K016394K460357
58069D0935897L008355L673698M405985N081250N566816N780370N645746N018095
$$ plain form
58124 341217621 374263337 403194824 423210609 430977961 426019342 410449703 387589617
58117 387589617 360662053 332203713 303995819 277145436 252210564 229374138 208600914
58110 208600914 189731468 172558416 156907995 142674218 129786935 118177025 107778132
58103 107778132 98528089 90346271 83123780 76746576 71114038 66130237 61698827 57739989
58095 57739989 54199561 51033331 48195676 45650366 43377725 41361873 39581354 38017093
58087 38017093 36655851 35478691 34458032 33573189 32819219 32197238 31708994 31365736 31188977
58078 31188977 31196691 31401624 31828493 32518423 33508054 34816081 36459146 38475540 40935897
58069 40935897 43944252 47617950 52023935 57105185 62672001 68452371 74098117 79116212
58061G9116212L747022J866138l18188k376028l991608n059872n618425n759506
58053F1605745n599906n263647m846115m397937l947571l522054l139121k797437
58045B8091957k487859k206751j952279j718144j500277j304392j139566j007560
58037A4775129r02967q20469p57094p09055o70177o33537n93854n49666n03946
58028H634364m61030m22298l86030l51294l20055k95170k77845k67293k61443
58019E591906k57507k52801k45544k34887k21014k05507j90593j77259j64910
58010C641884j53141j42458j32824j23256j13706j05783j00466r6558r2338q7458
58000B493896q2375p7395p3144p0347o8330o5355o1183n7574n5449n3489n0619
$$ plain form
58061 79116212 82863234 84729372 84411184 82035156 78043548 72983676 67365251 61605745
58053 61605745 56005839 50742192 45896077 41498140 37550569 34028515 30889394 28091957
58045 28091957 25604098 23397347 21445068 19726924 18226647 16922255 15782689 14775129
58037 14775129 13872162 13051693 12294599 11585544 10915367 10281830 9687976 9138310 8634364
58028 8634364 8173334 7751036 7365006 7013712 6693657 6398487 6120642 5853349 5591906
58019 5591906 5334399 5081598 4836054 4601167 4380153 4174646 3984053 3806794 3641884
58010 3641884 3488743 3346285 3213461 3090205 2976499 2870716 2770250 2673692 2581354 2493896
58000 2493896 2411521 2334126 2260982 2190635 2122305 2056950 1995767 1938193 1882744 1829255 1778636
57989A778636m7902m6560m5845m4283m1576l8140l4255l0767k8984k8646k7621
57978A364057k4896k2272k1724k2620k3070k2608k2084k1946k2054k2196k1844
57967A116743k0383j8402j7527j8176j8895j8628j8037j7797j7359j6516j6150
57956I18873j6209j4883j1526q464p981q976q815p250o164o137n610l442n82J157
57942H13991R03p29k172k030k47K057L910N053N335M683L806L519L219J539j148
57927H41689k840l050l596n292o234n150m188o067r861j2166j1645j0129r591
57914G51880j0160j1009j1401j0645q390n232k289j83R57J040L66p0M83J716L035
57899G00098M514O156O901N513K270j278m067o290q404j0044j0178q393o003n366
$$ plain form
57989 1778636 1730734 1684174 1638329 1594046 1552470 1514330 1480075 1449308 1420324 1391678 1364057
57978 1364057 1339161 1316889 1295165 1272545 1249475 1226867 1204783 1182837 1160783 1138587 1116743
57967 1116743 1096360 1077958 1060431 1042255 1023360 1004732 986695 968898 951539 935023 918873
57956 918873 902664 887781 876255 867791 859810 850834 842019 834769 828605 822468 816858 813416 812834 813991
57942 813991 814894 814165 811993 809963 809716 811773 815683 820736 826071 830754 834560 838079 841298 842837 841689
57927 841689 838849 835799 832203 826911 820677 815527 811339 805272 795411 783245 771600 761471 751880
57914 751880 741720 730711 719310 708665 700275 695043 692754 692571 693528 694568 694934 694864 695347 697063 700098
57899 700098 704612 710768 717669 723182 725452 724174 720107 713817 705413 695369 685191 676798 670795 665429
57885F65429p426j0342j1502j0486q776p094m919k535j261j164o73Q77K431L764
57871F06323O349J0455J3725J4373J3721J3668J3728J2825J2018J2590J2878J0086
57859G52739M645k38l017n111p686r880j0829j1279j2273j3755j5228j6535j7481
57846F34072j7669j7183j6553j5879j4813j3448j2406j1869j1426j0824j0144
57835D81858r233p829o250n189m744m313l472k422j533q26M8J452L211M562N167
57820D50487N897P569R097Q515O083M423M684M660K156j545l573l405k846l093
57806D89109m002n432p215q166p165n061l714l461l157k287j218J65K099L512
57792D44007L176K158L009O214R473J0871J0919J0929J1186J1299J0949R749P623
$$ plain form
57885 665429 658003 647661 636159 625673 616897 609803 604884 602349 601088 599924 599251 600128 602559 606323
57871 606323 612672 623127 636852 651225 664946 678614 692342 705167 717185 729775 742653 752739
57859 752739 757384 757146 754129 749018 741332 731452 720623 709344 697071 683316 668088 651553 634072
57846 634072 616403 599220 582667 566788 551975 538527 526121 514252 502826 492002 481858
57835 481858 472625 464796 458546 453357 448613 444300 440828 438406 436873 436047 436095 437547 440758 445320 450487
57820 450487 456384 463953 473050 481565 487648 492071 496755 501415 503571 502026 498453 495048 492202 489109
57806 489109 485107 479675 472460 464294 457129 452068 448354 444893 441736 439449 438231 438396 440495 444007
57792 444007 447183 449341 452350 458564 468037 478908 489827 500756 511942 523241 534190 543939 551562
57779E51562N534M493L872K299J23j007j064j866l877n234m955m774o279q290
57765E30537q828q134p776q034q054p680p285o392m312j692J04Q51J178R11n61
57750D64833k365k543p88Q63P54l89j185j962l888o490p781o994n678n468n849
57735D15070n174l138j075LM02P39J000J177J868L556N768P613Q848R860J0848
57720D57365J1447J0966R065O486M965N541P042P391O445N963O475O255M504L351
57706E53261M675O660O158L351J268J008M58j903m674o018o287o901q175r513
57692E33368j0584j1211j0973r795q364p357o781o317n583m106j970m59p45j937
57678D47186j858q2J479J418N63J20j94q99j159K9J968L024K792K314K607L807
$$ plain form
57779 551562 557096 561589 565461 567760 567883 566876 565812 563946 560069 554835 549880 545106 538827 530537
57765 530537 521709 513575 505799 497765 489711 482031 474746 468354 464042 462350 462454 463305 464483 465394 464833
57750 464833 462468 459925 459137 460000 460754 460365 459180 457218 453330 446840 439059 432065 426387 420919 415070
57735 415070 409896 406758 405683 405686 406088 406827 407827 409004 410872 414428 420196 427809 436657 446517 457365
57720 457365 468812 479778 488843 495329 500294 505835 512877 520268 526713 532676 539151 545406 549910 553261
57706 553261 557936 564596 570754 574105 575373 576381 576839 574936 570262 564244 557957 551056 542881 533368
57692 533368 522784 511573 500600 490805 482441 475084 468303 461986 456403 452297 450327 449868 449123 447186
57678 447186 445328 445246 446725 448143 448706 448826 448632 447733 446574 446603 448571 451595 454387 456701 459308 463115
57662D63115N433O702P038O850P339R058J1237J2930J4041J4706J4611J3723J2895
57649E99678J2920J3649J4649J5965J7536J8778J9596K0955K3433K6151K8193
57638H11503L0283L3732L8354M2835M6628M9923N2021N1303M7006L9736L0116
57627A273440J8366N711n234j2403j5949j7286j7088j5077j1275o364p94N715
57615A201762J3370K1559K9441L7036M5146N4257O4113P4540Q6025R9029J13156
57604A839434J27333J40284J50272J54845J51569J38728J15070Q0250L7007p822
57594B926970m6585p5599r5808j09237j16811j19573j19503j17817j13993j07749
57584A904295j00631r4327q8632q2364p5384o8353o1383n4395m8111m3294l9299
$$ plain form
57662 463115 468548 475250 482288 489138 496477 505535 516772 529702 543743 558449 573060 586783 599678
57649 599678 612598 626247 640896 656861 674397 693175 712771 733726 757159 783310 811503
57638 811503 841786 875518 913872 956707 1003335 1053258 1105279 1156582 1203588 1243324 1273440
57627 1273440 1291806 1297517 1292283 1279880 1263931 1246645 1229557 1214480 1203205 1196841 1196047 1201762
57615 1201762 1215132 1236691 1266132 1303168 1348314 1402571 1466684 1541224 1627249 1726278 1839434
57604 1839434 1966767 2107051 2257323 2412168 2563737 2702465 2817535 2897785 2934792 2926970
57594 2926970 2880385 2804786 2708978 2599741 2482930 2363357 2243854 2126037 2012044 1904295
57584 1904295 1803664 1709337 1620705 1538341 1462957 1394604 1333221 1278826 1230715 1187421 1148122
57573A148122l4800k9630k4839k1111j8207j5676j3188j0374p301m844l664l128
57561I61360k063j87K084M713P712J0262J1558J2340J4191J7333K0564K3451K6886
57548A110204L1074L4596L6526L8155M1178M4854M6553M5020M1740L8582L5283
57537A543765L0181K2869J4630O168l576j5273k6861l5188l9782m3283m7707n2009
57525A353934n4273n4657n4580n4140n2284m9142m6309m4540m2703l9527l5358
57514H26421l1636k9368k8514k8174k6996k4031j9818j6274j5034j5828j6676
57503E74072j5664j2604r042o668n764n467n257n442o010o006m696k776j568j444
57489D85664j765j976j852j054N99K438L371L095K255J478R47Q78J593L060M917
$$ plain form
57573 1148122 1113322 1083692 1058853 1037742 1019535 1003859 990671 980297 972996 968152 964488 961360
57561 961360 959297 959110 961194 965907 973619 983881 995439 1007779 1021970 1039303 1059867 1083318 1110204
57548 1110204 1141278 1175874 1212400 1250555 1291733 1336587 1383140 1428160 1469900 1508482 1543765
57537 1543765 1573946 1596815 1611445 1617613 1614037 1598764 1571903 1536715 1496933 1453650 1405943 1353934
57525 1353934 1299661 1245004 1190424 1136284 1084000 1034858 988549 944009 901306 861779 826421
57514 826421 794785 765417 736903 708729 681733 657702 637884 621610 606576 590748 574072
57503 574072 558408 545804 536762 530094 524330 518863 513606 508164 502154 496148 491452 488676 487108 485664
57489 485664 483899 481923 480071 479017 479616 482054 485425 488520 490775 492253 493200 494078 495671 498731 503648
57474E03648P027R353J1275J1785J0675Q902P586P055P184P998R449J0885J1459
57461F24281J1266J1689J4078J8099K1755K3396K3434K3726K5560K8723L2166
57450H58173L4754L5595L4644L3127L2393L2172L0890K7723K3146J7383R924J259
57438A171183o611j2448j7289k2484k7566l1363l4035l6322l7764l7471l5986
57427H71844l4594l3276l1065k8054k5265k2809j9975j7046j5084j3894j2103
57416F18679r630q150q455r048q279o534n217m613l764k002L28K411L764M590
57402E64080N454O498P282P812R136J2043J5591J8007J8847J9299K0657K3412
57390G28118K7419L1742L4667L5245L4524L3881L2640K9096K3508J7948J3148
$$ plain form
57474 503648 510675 520028 531303 543088 553763 562665 570251 577306 584490 592488 601937 612822 624281
57461 624281 635547 647236 661314 679413 701168 724564 747998 771724 797284 826007 858173
57450 858173 892927 928522 963166 996293 1028686 1060858 1091748 1119471 1142617 1160000 1169924 1171183
57438 1171183 1164572 1152124 1134835 1112351 1084785 1053422 1019387 983065 945301 907830 871844
57427 871844 837250 803974 772909 744855 719590 696781 676806 659760 644676 630782 618679
57416 618679 609049 600899 592444 583396 575117 568583 563366 558753 554989 552987 553315 555726 559490 564080
57402 564080 569534 576032 583314 591126 600262 612305 627896 645903 664750 684049 704706 728118
57390 728118 755537 787279 821946 857191 891715 925596 958236 987332 1010840 1028788 1041936
57379A041936P711P52o816j4155k1420k8015l2294l4080l5412l7395l8435l7188
57367G65189l5138l4205l3538l1179k7644k5224k4400k3502k1590j9374j7243
57356D72152j4708j2085j0584j0122q937o208l463k286k121j499l50L81P19J632
57342D02521L192M219M134L964M855O317O920O322N628N757O385O782O910P125
57328D81031P534Q206R391J0723J0890R169O920O288P439Q362P542N615M038L339
57314E86487L311L859M726N147M698M095M398N588O531O278N033L903L866M815
57300F52735N625N412M655M566N467O336O105M888L822M065N784P670P842O009
57286G30981M342N173Q017J0221J0417R906J0337J1552J2367J2263J1490J0423
$$ plain form
57379 1041936 1049647 1050399 1043583 1029428 1008008 979993 947699 913619 878207 840812 802377 765189
57367 765189 730051 695846 662308 631129 603485 578261 553861 530359 508769 489395 472152
57356 472152 457444 445359 434775 424653 415716 409508 406045 403759 401638 400139 399789 400170 400889 402521
57342 402521 405713 409932 414066 418030 422885 429202 436122 442444 448072 453829 460214 466996 473906 481031
57328 481031 488565 496771 506162 516885 527775 536944 543864 550152 557591 565953 573495 579110 583148 586487
57314 586487 589798 593657 598383 603530 608228 612323 616721 622309 628840 635118 640151 644054 647920 652735
57300 652735 658360 663772 668427 672993 678460 684796 690901 695789 699611 703676 709460 717130 724972 730981
57286 730981 735323 740496 748513 758734 769151 779057 789394 800946 813313 825576 837066 847489
57274H47489R575R477R973J0266J0000R611R459R475R781J0475J0728R581P939
57261I73829Q006J0086J1704J0959Q984P780P266O256N091N173O633Q403J0274
57248A080444J2983J6282J8558J8728J7387J5852J4999J5114J6137J7693J9363
57237A263540K0859K1685K1132J9228J7213J6356J6584J6905J6817J6641J6745
57226A463705J7158J7749J8359J8939J9795K1278K3034K4340K5398K7365L0558
57215A707678L3589L5033L5114L4959L5074L5219L4969L3583L0124K4661J8690
57204B058693J3650R882P464O790P372P537O593O171P910J0924J3118J4062J4814
57191B184980J5749J6458J7177J8403J9425J9051J7692J6961J7352J7828J7716
$$ plain form
57274 847489 857064 866541 876514 886780 896780 906391 915850 925325 935106 945581 956309 965890 973829
57261 973829 981835 991921 1003625 1014584 1023568 1031348 1038614 1044870 1049961 1055134 1061767 1070170 1080444
57248 1080444 1093427 1109709 1128267 1146995 1164382 1180234 1195233 1210347 1226484 1244177 1263540
57237 1263540 1284399 1306084 1327216 1346444 1363657 1380013 1396597 1413502 1430319 1446960 1463705
57226 1463705 1480863 1498612 1516971 1535910 1555705 1576983 1600017 1624357 1649755 1677120 1707678
57215 1707678 1741267 1776300 1811414 1846373 1881447 1916666 1951635 1985218 2015342 2040003 2058693
57204 2058693 2072343 2082225 2089689 2096479 2103851 2111388 2117981 2124152 2132062 2142986 2156104 2170166 2184980
57191 2184980 2200729 2217187 2234364 2252767 2272192 2291243 2308935 2325896 2343248 2361076 2378792
57180B378792J7280J6506J5109J3978J4902J8143K1606K3099K2594K1714K1834
57169B585557K3116K4787K5996K6655K7469K8921L0561L1818L2927L4319L5639
57158B907765L6284L6440L6532L6057L4237L1693L0358L1472L4386L7382L9163
57147C291769L9565L9296L9018L8689L8164L8133L9433M1582M3446M5501M9358
57136C743954N4510N7924N8169N7699N9215O1823O3090O3010O3212O3583O2675
57125D408864O0637N8959N7799N6106N4022N2711N2158N1473N0915N1192N1253
57114E006089M9345M6113M4084M4122M4710M4561M3559M1447L8025L4525L2287
57103E468867L0442K7355K3907K2426K2821K2940K2566K3551K5917K7567K8330
$$ plain form
57180 2378792 2396072 2412578 2427687 2441665 2456567 2474710 2496316 2519415 2542009 2563723 2585557
57169 2585557 2608673 2633460 2659456 2686111 2713580 2742501 2773062 2804880 2837807 2872126 2907765
57158 2907765 2944049 2980489 3017021 3053078 3087315 3119008 3149366 3180838 3215224 3252606 3291769
57147 3291769 3331334 3370630 3409648 3448337 3486501 3524634 3564067 3605649 3649095 3694596 3743954
57136 3743954 3798464 3856388 3914557 3972256 4031471 4093294 4156384 4219394 4282606 4346189 4408864
57125 4408864 4469501 4528460 4586259 4642365 4696387 4749098 4801256 4852729 4903644 4954836 5006089
57114 5006089 5055434 5101547 5145631 5189753 5234463 5279024 5322583 5364030 5402055 5436580 5468867
57103 5468867 5499309 5526664 5550571 5572997 5595818 5618758 5641324 5664875 5690792 5718359 5746689
57092E746689L0495L4324L6788L6158L4440L3540L2283K9242K5762K3793K2917
57081F086431K1468J8966J5718J1526O050r61j0426k3085l7285m9984o0595p1677
57069E906146q5097j00124j15990j33658j54016j76899k02793k32779k65922k99533
57059D139335l33073l69091m09418m53240m99829n50111o04555B57608d66218
57049a256141q60314r34139j013371j101239j197301j298698j406519j526035
57041a0593757j660594j810967j980762k175663k396492k639867k906667l203269
57033b9368038l535181l907600m329024m800447n300718n795508o255488o645193
57025f9937197o911032p044152p180812p561117q272707r009596r160538q212447
$$ plain form
57092 5746689 5777184 5811508 5848296 5884454 5918894 5952434 5984717 6013959 6039721 6063514 6086431
57081 6086431 6107899 6126865 6142583 6154109 6160159 6159198 6148772 6125687 6088402 6038418 5977823 5906146
57069 5906146 5821049 5720925 5604935 5471277 5317261 5140362 4937569 4704790 4438868 4139335
57059 4139335 3806262 3437171 3027753 2574513 2074684 1524573 920018 257608 -466218
57049 -1256141 -2116455 -3050594 -4063965 -5165204 -6362505 -7661203 -9067722 -10593757
57041 -10593757 -12254351 -14065318 -16046080 -18221743 -20618235 -23258102 -26164769 -29368038
57033 -29368038 -32903219 -36810819 -41139843 -45940290 -51241008 -57036516 -63292004 -69937197
57025 -69937197 -76848229 -83892381 -91073193 -98634310 -106907017 -115916613 -125077151 -133289598
57017a33289598o094060l156685J11144L318280O204850Q578939J0291963J1264121
57009a02771046J1507310J1124566J0290732R213143Q080707P028368O130844
57002c9395376N411249M851132M406529M031021L691506L368614L052008K739482
56994g843835K435542K146210a385922B44337J412824J223363J056930R10039
56986D847493P82913O74993N82427N01701M32008L72143L18405K67698K20291
56977I000072J77883J41347J11342Q8344P0589N4381L7871K2512R885m64r141
56966I704621j5509j9678k3619k8899l5265m2570n2150o4910p9564r3883j06296
56955I142278j15768j21916j25949j29711j33159j34607j33781j32391j31108
$$ plain form
57017 -133289598 -139383658 -142540343 -142429199 -139110919 -132906069 -124327130 -114035167 -102771046
57009 -102771046 -91263736 -80139170 -69848438 -60635295 -52554588 -45526220 -39395376
57002 -39395376 -33984127 -29132995 -24726466 -20695445 -17003939 -13635325 -10583317 -7843835
56994 -7843835 -5408293 -3262083 -1385922 244337 1657161 2880524 3937454 4847493
56986 4847493 5630406 6305399 6887826 7389527 7821535 8193678 8512083 8779781 9000072
56977 9000072 9177955 9319302 9430644 9518988 9589577 9643958 9681829 9704341 9714226 9713762 9704621
56966 9704621 9689112 9669434 9645815 9616916 9581651 9539081 9486931 9422021 9342457 9248574 9142278
56955 9142278 9026510 8904594 8778645 8648934 8515775 8381168 8247387 8114996 7983888
56946G983888j28443j23710j18772j15475j13273j10738j07792j05205j03341
56937F957139j02352j02160j01675r9761r7528r7724j01141j05782j10134j14839
56927E924043j20160j24342j25817j24632j20365j11029r5494p4795m9851k0354
56917D957204J3341N0542R3385J45151K03385K59784L09293L51681L77011L56949
56907G117726K64778J07182p2163k24614l27878l86539m13085m16474m03429l80233
56897D865271l51061l18709k87397k61573k41841k25063k08658j92412j76253
56888B602304j59352j42130j26757j14519j04454r5362q7514q1296p5643o9260
56878A546017o2431n6304n0892m5097l8507l2137k7102k3398k0279j7339j4987
$$ plain form
56946 7983888 7855445 7731735 7612963 7497488 7384215 7273477 7165685 7060480 6957139
56937 6957139 6854787 6752627 6650952 6551191 6453663 6355939 6254798 6149016 6038882 5924043
56927 5924043 5803883 5679541 5553724 5429092 5308727 5197698 5102204 5027409 4977558 4957204
56917 4957204 4970545 5021087 5114472 5259623 5463008 5722792 6032085 6383766 6760777 7117726
56907 7117726 7382504 7489686 7417523 7192909 6865031 6478492 6065407 5648933 5245504 4865271
56897 4865271 4514210 4195501 3908104 3646531 3404690 3179627 2970969 2778557 2602304
56888 2602304 2442952 2300822 2174065 2059546 1955092 1859730 1772216 1690920 1615277 1546017
56878 1546017 1483586 1427282 1376390 1331293 1292786 1260649 1233547 1210149 1189870 1172531 1157544
56867A157544j4299j6558k2298l0190l7295m1187m1891m1211m0391l9226l7445
56856G95553l5681l4431l3041l0705k7825k5453k3813k2368k0930j9700j8504
56845E03102j7084j5893j5438j5113j3936j2270j1331j0994r808p426n165l717
56833C64927k161j96O63l07j058O86M008O174O614P139Q381Q488O060K428r0j030
56817D10726j770l396n512o870o497m243o26L753Q420J2769J6021J7949J9223
56804D59947K0641K2487K5126K9331L4994M0153M2537M1683L8260L1934K1777
56793H08870Q892l396j2523j8505k2233k3721k2851k0402j7128j2878p661k475
56781F53989K059O957J3476K1298K9174L6624M3660M9657N3918N6665N7695N4648
$$ plain form
56867 1157544 1143245 1126687 1104389 1074199 1036904 995717 953826 912615 872224 832998 795553
56856 795553 759872 725441 692400 661695 633870 608417 584604 562236 541306 521606 503102
56845 503102 486018 470125 454687 439574 425638 413368 402037 391043 381235 373809 368644 364927
56833 364927 362766 362570 363233 362926 361868 362554 366562 372736 379350 386489 394870 403358 409418 411846 411756 410726
56817 410726 408956 405560 400048 393178 386681 382438 381812 385565 393985 406754 422775 440724 459947
56804 459947 480588 503075 528201 557532 592526 632679 675216 716899 755159 787093 808870
56793 808870 817762 814366 801843 783338 761105 737384 714533 694131 677003 664125 656464 653989
56781 653989 656048 663005 676481 697779 726953 763577 807237 856894 910812 967477 1025172 1079820
56769A079820M4708K8290R326q367k3404l5336m3054m5985m5433m3128l9293l3437
56757H44707k6481k0472j6224j2475p703j781M524J0824J7222K3501K8876L2490
56745H77008L3775L2201K7039J7784M954r514k2811l2480l7491l8532l7367l5570
56733G78996l3594l0953k7300k3088j9059j5439j2029q800n804k606J422O010
56721F07756R778J1575J1543J0391Q075L904k174r119j5602k0735k4072k5562
56709E65758k5743k5413k4851k3847k2561k1584k0831j9287j6571j3832j2202
56698C39036j1020r015o721o060p538r427j0171r952r258p552m640k112j840l594
56684B40136n468o290o371o229n838n013l679j817N4P56l51k456m358n762o568
$$ plain form
56769 1079820 1124528 1152818 1162144 1153777 1130373 1095037 1051983 1005998 960565 917437 878144 844707
56757 844707 818226 797754 781530 769055 761352 759571 764095 774919 792141 815642 844518 877008
56745 877008 910783 942984 970023 987807 992761 983247 960436 927956 890465 851933 814566 778996
56733 778996 745402 714449 687149 664061 645002 629563 617534 608734 602930 600324 601746 607756
56721 607756 617534 629109 640652 651043 659118 663022 660848 651729 636127 615392 591320 565758
56709 565758 540015 514602 489751 465904 443343 421759 400928 381641 365070 351238 339036
56698 339036 328016 319001 312280 306220 298682 289255 279084 269132 259874 252322 247682 245570 243730 240136
56684 240136 234668 228378 222007 215778 209940 204927 201248 199431 199485 200241 199890 197434 193076 187314 180746
56669A80746n924l602j496j706l390l671j609Q96K253K863L075K058j49j631j195
56654A67518k41m78j308j214l25K10L16N84O41j70j088p79M89J213J011Q40J032
56637A68251P08n22j692j681m60J111K105K121J693J905K996L803L307K138J639
56622A87422J986K324K230J833R61m41j287k91J973L253K162m53k731l467k552
56607A92922p42P12R50J96q05j659k163j886q76j14k01k97M03Q48m68k766l697
56590A80357k729j787k164k765k144n56R33K026K792K871K130J260Q36M21n40
56575A80941j574j671n67R83K011K032J352Q09P85M95j057l391m685l836j669
56560A70958J75Q48O13K25L59J148K057K533K653K666K316J446Q63J524L028M011
$$ plain form
56669 180746 174822 171220 169724 168018 164628 160957 159348 160244 162497 165360 168435 170493 170344 168713 167518
56654 167518 167277 166799 165491 164277 163952 164162 164478 165062 165703 165533 164445 163666 164155 165368 166379 167219 168251
56637 168251 168959 168437 166745 165064 164604 165715 167820 169941 171634 173539 176535 180338 183645 185783 187422
56622 187422 189408 191732 193962 195795 196756 196315 195028 194737 196710 199963 202125 201672 198941 195474 192922
56607 192922 192180 192892 193842 194038 193233 191574 189411 187525 186649 186535 186334 186037 186440 187288 186820 184054 180357
56590 180357 177628 175841 173677 170912 168768 168212 169145 171171 173963 176834 178964 180224 181060 181481 180941
56575 180941 179367 177696 177129 178112 180123 182155 183507 184316 185101 185596 184539 181148 176463 172627 170958
56560 170958 171133 171981 172594 172819 173178 174326 176383 178916 181569 184235 186551 187997 188860 190384 193412 197423
56544A97423M021L788L723L416K700J980J288K70n83n6J972M026M810M579M214
56529B37571M038L990M009L794L035K209K252L112L610L017J797O46j44j68Q97
56514B73665K317K753K155J910K683L491L381K747K310K167K507L870N840O875
56500C18671O432O011O959Q413Q724P976P691Q630J0178J1517J2258J2076J0722
56487D36258Q614O917O783Q285R972R966Q055O152N666N223K610j533m186m183
56473E04599l658m591o157o682o265o031o232o548p151q111q693q295p357o639
56459D12189o530p410r323j0910j0390q164o542o209n224k668p76j618l845m957
56445C27623m949n375o196o081m921l680k472q51N72Q06K00j55k35p30j564k237
$$ plain form
56544 197423 201444 205232 208955 212371 215071 217051 218339 218609 218026 217970 219942 223968 228778 233357 237571
56529 237571 241609 245599 249608 253402 256437 258646 260898 264010 267620 270637 272434 273080 272936 272768 273665
56514 273665 275982 278735 280890 282800 285483 288974 292355 295102 297412 299579 302086 305956 311796 318671
56500 318671 325103 331114 338073 346486 355210 363186 370877 379507 389685 401202 413460 425536 436258
56487 436258 444872 451789 458572 466857 476829 486795 494850 501002 506668 511891 514501 512968 508782 504599
56473 504599 500941 496350 490193 483511 477246 471215 464983 458435 451284 443173 434480 426185 418828 412189
56459 412189 405659 398249 388926 378016 367626 359462 352920 346711 341487 338819 338043 336425 332580 327623
56445 327623 322674 317299 311103 305022 300101 296421 293949 293098 293670 294476 294676 294521 294286 293556 291992 289755
56429B89755k701k643j124J467K593Q32j447j089J309K531J624P48J449K765L287
56414B99356K835J803O64J95P18J370J567K276M056N037L362P88P70L383N315
56399C33495M826L571L115K908K599L223M842N656M912M359N337O560O459N742
56385C97604N881O626O812O342N695M558K596P69L09Q61R45pj061j041K43J808
56369D38940K140N15k050l697l752l238l266l901m773n765o576o526n504m402
56355C88145m136m708n562o260o467n870m505k854j488q20r64j436j386p40n56
56340C40393j565k905l280k738k174j718r51j84j5m4M30R16N08k82l81l92j746
56323C23872l694l600o51K922M940N541N578M865L138J125m02j423j779r18P04
$$ plain form
56429 289755 287054 284411 283287 284754 287347 288179 286732 285643 286952 289483 291107 291855 293304 296069 299356
56414 299356 302191 303994 304658 304853 305571 306941 308508 310784 314840 319877 323239 324027 324797 328180 333495
56399 333495 338321 341892 345007 347915 350514 353737 358579 364235 369147 373506 378843 385403 391862 397604
56385 397604 403485 410111 416923 423265 428960 433518 436114 436883 437192 438053 438998 438991 437930 436889 437132 438940
56369 438940 441080 441595 439545 435848 432096 428858 425592 421691 416918 411153 404577 398051 392547 388145
56355 388145 384009 379301 373739 367479 361012 355142 350637 347783 346295 345475 344511 343075 341689 340949 340393
56340 340393 338828 335923 332643 329905 327731 326013 325062 324878 324863 324819 325249 326165 326673 326391 326010 325618 323872
56323 323872 320178 316578 315927 318849 323789 329330 334908 339773 342911 344036 343634 342211 340432 339514 340218
56308C40218J508Q60q1l48m39p32l40J272K761K375J06k566m160l809j537J131
56292C36219K095J154M50J509L022K778Q52o37k98J249K632L184L201L379M036
56277C64825M729M970N096N768O672O803O082N485N403N205M687M543M853M578
56263D39699L395K591L220M535N258N353N485N641N489N296N434N534N087M414
56249E06431M167M323M421M427M632N035N342N331M817L734K432J570J418J668
56235E59748K010K304K221J404R3j126k142l181l964l973l447l086k756j599M81
56220E42987K468L425L210K116Q55N26J404K151J675J217K713N466O825O219N941
56205E89198P282Q512P953O802P109Q556R219Q568Q084R203J1715J4069J4864
$$ plain form
56308 340218 341726 342586 342505 342157 341718 340986 340646 341918 344679 347054 347160 344594 340434 336625 335088 336219
56292 336219 338314 339468 339918 341427 344449 347227 348079 347442 347144 348393 351025 354209 357410 360789 364825
56277 364825 369554 374524 379620 385388 392060 398863 404945 410430 415833 421038 425725 430268 435121 439699
56263 439699 443094 445685 448905 453440 458698 464051 469536 475177 480666 485962 491396 496930 502017 506431
56249 506431 510598 514921 519342 523769 528401 533436 538778 544109 548926 552660 555092 556662 558080 559748
56235 559748 561758 564062 566283 567687 567780 566654 564512 561331 557367 553394 549947 546861 544105 542506 542987
56220 542987 545455 548880 552090 554206 555061 555587 556991 559142 560817 562034 564747 570213 577038 583257 589198
56205 589198 596480 604992 612945 619747 626856 635412 644631 653199 661283 670486 682201 696270 711134
56192G11134J4285J4095J5522J7481J8004J7120J6718J7638J8705J8791J8074
56181H97567J6730J4320J1064Q205O436N283M295L456K320M97j045j034l10q86
56167I66898k547k919j400k08o70j315p74J07L94P43J343Q11j150k348j405k13
56151I55347j025l004l949l715l625l787l385k593k270k363k279k096k225k641
56137I16390l330m366m910l719j529r46k786m551l981k091j033q64l66M52P28
56122H83098M59J71q6j63M64J459J701J612L272O898R527Q966O933O272O968P168
56106I44719O497O132O788Q451J0889J3042J3475J2750J3489J6542J9331J9745
56094A091850J9224J9839K0708K0058J8906J9738K2744K5924K7832K8200K7104
$$ plain form
56192 711134 725419 739514 755036 772517 790521 807641 824359 841997 860702 879493 897567
56181 897567 914297 928617 939681 947886 954322 959605 963900 967356 969676 970173 969128 968094 967784 966898
56167 966898 964351 961432 960032 959824 959154 957839 957065 957172 957566 958309 959652 960463 959313 956965 955560 955347
56151 955347 954322 951318 947369 943654 940029 936242 932857 930264 927994 925631 923352 921256 919031 916390
56137 916390 913060 908694 903784 900065 898536 897590 894804 890253 886272 884181 883148 882284 881918 882370 883098
56122 883098 883557 883728 883642 883479 883943 885402 887103 888715 891987 898885 908412 917378 924311 930583 937551 944719
56106 944719 951216 957348 964136 972587 983476 996518 1009993 1022743 1036232 1052774 1072105 1091850
56094 1091850 1111074 1130913 1151621 1171679 1190585 1210323 1233067 1258991 1286823 1315023 1342127
56083A342127K5677K6216K9580L3768L6841L9533M3195M7061M9877N2527N6772
56072A783174O2776O9935P8509Q8603R9327J10764J24817J42200J60884J79555
56062B900544K00067K24009K49046K71109K87848K97496K97074K84857K62937
56053E274987K35120K04616J75603J53301J38870J26994J11649R1665O8123M0536
56043F621464R919j8067l8290n2172o4443p7070r1156j11244j41107j76794k09610
56032E651430k34703k51732k59350k55593k42905k26659k08782j88021j65781
56023C617904j46020j29612j14228r9747q8460q0018p1616o3352n7946n4773m9581
56012B662551m1153l3172k8363k5288k2041j8772j5476j1254o825m127k756k48
$$ plain form
56083 1342127 1367804 1394020 1423600 1457368 1494209 1533742 1576937 1623998 1673875 1726402 1783174
56072 1783174 1845950 1915885 1994394 2082997 2182324 2293088 2417905 2560105 2720989 2900544
56062 2900544 3100611 3324620 3573666 3844775 4132623 4430119 4727193 5012050 5274987
56053 5274987 5510107 5714723 5890326 6043627 6182497 6309491 6421140 6512805 6580928 6621464
56043 6621464 6631383 6613316 6575026 6522854 6458411 6381341 6290185 6178941 6037834 5861040 5651430
56032 5651430 5416727 5164995 4905645 4650052 4407147 4180488 3971706 3783685 3617904
56023 3617904 3471884 3342272 3228044 3128297 3039837 2959819 2888203 2824851 2766905 2712132 2662551
56012 2662551 2621398 2588226 2559863 2534575 2512534 2493762 2478286 2467032 2460207 2456080 2453324 2453076
56000B453076L801P447J0196J3331J6456J7725J7705J9186K2770K6264K8602L0882
55988B667441L3574L5973L8308M1252M3954M5583M7579N1097N4035N4424N4678
55977C167898N7980O2548O4562O4875O7362P2216P6480P9858Q4237Q8892R1976
55966C978884R5456J02673J12215J20014J25994J32730J39548J44459J49808J58933
55956E260714J69336J76653J83215J94413K08601K19650K27949K39297K54022
55947G133850K67173K79145K95727L17229L37746L55981L76683M00406M22042
55938A0185982M41116M63499M91235N20254N49582N82895O19537O54215O87234
55929A5195549P25041P69096Q14383Q59962R10357R65543J020670J076752J140152
$$ plain form
56000 2453076 2456877 2464324 2474520 2487851 2504307 2522032 2539737 2558923 2581693 2607957 2636559 2667441
55988 2667441 2701015 2736988 2775296 2816548 2860502 2906085 2953664 3004761 3058796 3113220 3167898
55977 3167898 3225878 3288426 3352988 3417863 3485225 3557441 3633921 3713779 3798016 3886908 3978884
55966 3978884 4074340 4177013 4289228 4409242 4535236 4667966 4807514 4951973 5101781 5260714
55956 5260714 5430050 5606703 5789918 5984331 6192932 6412582 6640531 6879828 7133850
55947 7133850 7401023 7680168 7975895 8293124 8630870 8986851 9363534 9763940 10185982
55938 10185982 10627098 11090597 11581832 12102086 12651668 13234563 13854100 14508315 15195549
55929 15195549 15920590 16689686 17504069 18364031 19274388 20239931 21260601 22337353 23477505
55920B3477505J210837J283454J360424J450646J554514J664124J778987J906732
55912C5687223K047900K196369K355586K537021K741611K961888L204282L489395
55904E7221275L828452M220553M674423N208963N831396O542720P368361Q353621
55896A03249764R524248J0883052J2449919J4270382J6381141J8802899K1556342
55889B07117747K4620775K7870173L1100034L4046032L6151120L6234734L2707679
55882D29848294K4607371J2660080p74811j2972456k2184019k8008094l0890802
55875C72285563l1535024l0638947k8821062k6554320k4147436k1800098j9640423
55868A89148253j7710536j5977864j4396652j2944642j1605938j0360868r207959
$$ plain form
55920 23477505 24688342 25971796 27332220 28782866 30337380 32001504 33780491 35687223
55912 35687223 37735123 39931492 42287078 44824099 47565710 50527598 53731880 57221275
55904 57221275 61049727 65270280 69944703 75153666 80985062 87527782 94896143 103249764
55896 103249764 112774012 123657064 136106983 150377365 166758506 185561405 207117747
55889 207117747 231738522 259608695 290708729 324754761 360905881 397140615 429848294
55882 429848294 454455665 467115745 466340934 453368478 431184459 403176365 372285563
55875 372285563 340750539 310111592 281290530 254736210 230588774 208788676 189148253
55868 189148253 171437717 155459853 141063201 128118559 116512621 106151753 96943794
55861I6943794q167877p252871o452573n754948n157611m651043m212123l823310
55853E1471438l481617l182928k914238k667404k445432k249455k072679j911207
55845C0546478j767657j640199j520570j406359j303436j213266j129420j049178
55837A9516393r76939r13472q53066p94163p41872o97192o54180o10669n71692
55828A2703148n39546n10050m81315m56717m36591m16047l93592l73318l56383
55819H739589l38904l20231l04317k90879k74282k53660k35158k21371k07350
55810F293437j90252j74350j62712j51959j39274j27600j19925j14851j11227
55801E001287j11085j14871j19457j23511j29089j35826j39764j40015j40170
$$ plain form
55861 96943794 88775917 81523046 75070473 69315525 64157914 59506871 55294748 51471438
55853 51471438 47989821 44806893 41892655 39225251 36779819 34530364 32457685 30546478
55845 30546478 28778821 27138622 25618052 24211693 22908257 21694991 20565571 19516393
55837 19516393 18539454 17625982 16772916 15978753 15236881 14539689 13885509 13274840 12703148
55828 12703148 12163602 11653552 11172237 10715520 10278929 9862882 9469290 9095972 8739589
55819 8739589 8400685 8080454 7776137 7485258 7210976 6957316 6722158 6500787 6293437
55810 6293437 6103185 5928835 5766123 5614164 5474890 5347290 5227365 5112514 5001287
55801 5001287 4890202 4775331 4655874 4532363 4403274 4267448 4127684 3987669 3847499
55792C847499j41013j38512j31531j24758j21142j17847j12521j07032j02010
55783B751133r4343q3558p4436o9547o5068n7639m9476m2938l5979k7139j9347
55772B131663j4354q639M40R536J5112J9423K5236K8832K4224J1563l747j7872
55760B221417k9686l7622m0505m0435m0703m1773m2306m2640m3998m5554m5402
55749A770793m3580m1701m0386l9017l7000l3754k8709k2619j7313j3212q896
55738A444606l885M78L766P297J1214J3534J3470J2741J2261J0467O672L032J368
55725A537021P99L65J091L413N356N445N034N729O821P093O723N460J484n837
55711A585997j4220k1390k7530l3266l7653l9933m0965m1250l9796l6537l3286
$$ plain form
55792 3847499 3706486 3567974 3436443 3311685 3190543 3072696 2960175 2853143 2751133
55783 2751133 2656790 2573232 2498796 2429249 2364181 2306542 2257066 2214128 2178149 2151010 2131663
55772 2131663 2117309 2108670 2109110 2118646 2133758 2153181 2178417 2207249 2231473 2243036 2239289 2221417
55760 2221417 2191731 2154109 2113604 2073169 2032466 1990693 1948387 1905747 1861749 1816195 1770793
55749 1770793 1727213 1685512 1645126 1606109 1569109 1535355 1506646 1484027 1466714 1453502 1444606
55738 1444606 1440721 1441199 1444965 1452262 1463476 1477010 1490480 1503221 1515482 1525949 1532621 1535653 1537021
55725 1537021 1537820 1538185 1539276 1542689 1548045 1553490 1558524 1564253 1571074 1578167 1584890 1590350 1591834 1585997
55711 1585997 1571777 1550387 1522857 1489591 1451938 1412005 1371040 1329790 1289994 1253457 1220171
55700A220171l0805k7712k4021k2676k5333k9319l1068l0214k8209k5602k2948
55689I22264k1780k2180k1745j9227j6814j6562j7222j6997j6777j7793j8724
55678G16443j8096j7249j7831j8557j7557j5748j4539j2423p638k548j230l634
55666E69393n946o154n781o356p582r106j1122j2836j2810j1188r644r001q636
55653D53231p998p013n328k898j072j262k768l482k477n28J462K927L046J354
55639D27194j182l047l972m778n864o893p543p608o838n476m344l751l227k861
55625C59810l515m914n074k864L29K679M169N472O307O548P324R053R783P644
55611D02751L862J180O4j266l601n695o452o407o840q408j0578j1883j1145r001
$$ plain form
55700 1220171 1189366 1161654 1137633 1114957 1089624 1060305 1029237 999023 970814 945212 922264
55689 922264 900484 878304 856559 837332 820518 803956 786734 769737 752960 735167 716443
55678 716443 698347 681098 663267 644710 627153 611405 596866 584443 576805 574257 573027 569393
55666 569393 563447 557293 551512 545156 537574 528468 517346 504510 491700 480512 470868 461867 453231
55653 453231 445233 438220 432892 429994 428922 427660 424892 421410 418933 418405 419867 422794 425840 427194
55639 427194 426012 422965 418993 414215 408351 401458 393915 386307 379469 373993 369649 365898 362671 359810
55625 359810 356295 351381 346307 343443 343772 346451 350620 356092 362399 368947 376271 385324 395107 402751
55611 402751 406613 407793 407857 406591 402990 397295 390843 384436 377596 369188 358610 346727 335582 326581
55597C26581p375p043o967o416o067o160n574l925k699k745k592r11J153J985
55583B71245K012K257K147J120O10J841L040J685j416l185k655j634j474j826
55569B73767k364l236l773k921j111J09J48l52r36j368q95P29K107J837N23n36
55553B61728j552k969l229q05K357K664M7j847r56Q69J533J639K404L206L000
55538B68089K354K363K772K695K362K802M355O354P968Q811R066R344J0058J0942
55524C50335J1528J1890J2342J2732J2816J3029J4079J6061J8788K2458K7159
55513E23217L2193L6850M1349M6099N0932N6123O3060P2208Q1309Q7576R1049
55502A181965R3502R4403R0502P9762O3329M3153J9912n440l0036n0714o6499
$$ plain form
55597 326581 319206 312163 305196 298780 292713 286553 280979 277054 274355 271610 269018 268107 269260 271245
55583 271245 273257 275514 277661 278781 279391 281232 284272 285957 284541 281356 278701 277067 275593 273767
55569 273767 271403 268167 264394 261473 260362 260471 260619 260267 259331 257963 257068 257797 259904 261741 262264 261728
55553 261728 260176 257207 253978 253173 255530 258194 258241 256394 255438 256307 257840 259479 261883 265089 268089
55538 268089 270443 272806 275578 278273 280635 283437 287792 294146 302114 310925 319991 329335 339393 350335
55524 350335 361863 373753 386095 398827 411643 424672 438751 454812 473600 496058 523217
55513 523217 555410 592260 633609 679708 730640 786763 849823 922031 1003340 1090916 1181965
55502 1181965 1275467 1369870 1460372 1540134 1603463 1646616 1666528 1661088 1631052 1580338 1513839
55491A513839p8285q6714r1409r1932q8682q2856p5972o9254o3195n7633n2192
55480F75715m6769m1949l8832l7721l6977l4322k9641k5173k2284j9640j5759
55469C26648j1804j0077j0809j2321j3442j3858j2830r859o274m203m064m812
55457B12295o153q365j0216r542o267k892j421j577k302l182l889l806k831j411
55443A48441L19K061K397L36k256k177P76L313L208J871J341J123j83k115l299
55428A55156l825m658n522n366m265l214k386j239j24k19j634k992l261k988l194
55413A10269l875m196l749k950k287j755j169o77n10m62j54K10M1n05m18P18J854
55396I0385J747M64j058k346l373l729k894j167N15J554J908J723J348J287J413
$$ plain form
55491 1513839 1435554 1348840 1257431 1165499 1076817 993961 917989 848735 785540 727907 675715
55480 675715 628946 586997 548165 510444 473467 439145 409504 384331 362047 342407 326648
55469 326648 314844 304767 293958 281637 268195 254337 241507 231648 225374 221171 217107 212295
55457 212295 206142 197777 187561 178019 171752 168860 167439 165862 163560 160378 156489 152683 149852 148441
55443 148441 148760 150821 153218 153554 151298 149121 149897 153210 156418 158289 159630 160753 160570 158455 155156
55428 155156 151331 146673 141151 135785 131520 128306 125920 124681 124557 124338 122704 119712 116451 113463 110269
55413 110269 106394 102198 98449 95499 93212 91457 90288 89611 89101 88639 88485 88695 88736 88231 87813 88531 90385
55396 90385 92132 92596 91538 89192 85819 82090 79196 78029 78544 80098 82006 83729 85077 86364 87777
55381H7777R17k77p99L41K106K825K425J871J208r1j368j383m91k71r64j291r49
55364I1586j114j969j869p3J557R77j047j877l74J868K564J317m2M63K566M016
55348I8549L476K287K375L374L469K483K052K695K852J498j81o57j46K29J52j69
55332A24338j103l191n873p526o901m288j335L95P90Q03O04p54l252m844m032
55317H3831k302j998k677k028N0J087Oj372j526j300j630j599l07J291J931J848
55301G3305J576N35j501k974k403o53L51L15L33O24K89r38k164k544k016r27K91
55284F1499J149J437J285O99m14j445j302J2R53K96j320k403k351j432j8J293
55268E7938J565O23l58k51N63R79R04J171J999K464J633j92j450p20J466K653
$$ plain form
55381 87777 88694 88417 87618 87959 90065 92890 95315 97186 98394 98303 96935 95552 95061 94790 93826 92535 91586
55364 91586 90472 88503 86634 86561 88118 89095 88048 86171 85797 87665 90229 91546 91504 91967 94533 98549
55348 98549 102025 104312 106687 110061 113530 116013 118065 120760 123612 125110 124929 124272 124126 124355 124507 124338
55332 124338 123235 120044 114171 106645 99744 95456 94121 94516 95306 96109 96713 95959 92707 87863 83831
55317 83831 81529 79531 76854 74826 74876 75963 75969 74597 73071 71771 70141 68542 68235 69526 71457 73305
55301 73305 74881 75416 73915 70941 68538 67885 68236 68551 68884 69508 69797 68859 66695 64151 62135 61208 61499
55284 61499 62648 64085 65370 66069 65655 64210 62908 62920 63873 64169 62849 60446 58095 56663 56645 57938
55268 57938 59503 60126 59768 59517 60080 61059 61963 63134 65133 67597 69230 69038 67588 66868 68334 70987
55252G0987J185j430k219o85P44L73o55p55l16l31m51r6j20j387k772k515r46
55235E8611O6j10l88p6L74O57J090J698K063K219K521K635J779P4j393j939j742
55218F8139j026O3P57Q8j652k890k663j600o77R6J089J935J847Q71K3J71J117
55201F5688J906J809R19j12p15q33q22r88j129o41N94J579J052p75k093j527L34
55184F4246K089L186L520K449j72k627l010k000j963l282l771k214j67P13R58
55169E7955J564J864Q27q75j882k103k069j356N36K537L043K211J552J584J431
55154F6819O74J25M64J289J727J409O70K79P33J461J179m70k238k743j977q32
55138F8569N3L01l48j364j474l57N61M1j160j524r99p23j140j644j666j053J19
$$ plain form
55252 70987 72172 70742 68523 67838 68582 68955 68300 67545 67229 66898 66447 66351 66231 64844 62072 59557 58611
55235 58611 58677 58567 58179 58103 58477 59134 60224 61922 63985 66204 68725 71360 73139 73213 71820 69881 68139
55218 68139 67113 67176 67933 68021 66369 63479 60816 59216 58539 58635 59724 61659 63506 64377 64400 64571 65688
55201 65688 67594 69403 70322 70210 69495 68662 67840 66852 65723 65082 65676 67255 68307 67532 65439 63912 64246
55184 64246 66335 69521 73041 75490 75318 72691 69681 67681 65718 62436 58665 56451 56284 56997 57955
55169 57955 59519 61383 62210 61335 59453 57350 55281 53925 54461 56998 60041 62252 63804 65388 66819
55154 66819 67493 67618 68082 69371 71098 72507 73177 73456 74189 75650 76829 76359 74121 71378 69401 68569
55138 68569 68622 68923 68575 67211 65737 65380 65941 65982 64822 63298 62299 61576 60436 58792 57126 56073 56192
55121E6192J236J354O07N09J763K867K117L0j715k691l370l378k089l61L39J01
55105E3511O4J96l88j346j409n61J60P29J807K556J424o96q65J595L701K947N68
55088F3993p24l93K18K80k12j383l058l989k967m57J840K661J839p0j970k646
55072E2962j789l37O87J141J191O47m35j191q36K99J291J783K027K189K227K172
55056F4028K043J735J354J306J720K137K151J931J845J839J629J132N15L6O5Q56
55040H6322K053K788K468J329J74k10M96J751K267J087j321l437m158l538k311
55025H5760j249q50r36o69L31J111N03j014j670p46N57Q58K93p9K42Q59J133P87
55007H5221K19K62J188K038J651K11j124j996l035m184m190k406PJ411J481J060
$$ plain form
55121 56192 57428 58782 59389 59898 61661 64528 66645 66675 64960 62269 58899 55521 53432 53071 53410 53511
55105 53511 53575 53771 53383 52037 50628 50067 50227 50956 52763 55319 56743 56047 55182 56777 60478 63425 63993
55088 63993 63269 62876 63094 63374 63162 61779 58721 54732 51765 51308 53148 55809 57648 57578 55608 52962
55072 52962 51173 50836 51523 52664 53855 54502 54067 52876 52040 52339 53630 55413 57440 59629 61856 64028
55056 64028 66071 67806 69160 70466 72186 74323 76474 78405 80250 82089 83718 84850 85365 85401 85466 86322
55040 86322 88375 91163 93631 94960 95134 94924 95420 97171 99438 100525 99204 95767 91609 88071 85760
55025 85760 84511 83661 82725 82056 82387 83498 84001 82987 81317 80571 81128 81986 82279 82200 82442 83301 84434 85221
55007 85221 85440 85702 86890 88928 90579 90790 89666 87670 84635 80451 76261 73855 73862 75273 76754 77814
54991G7814R22J265J785J750O07j102k078j834j094m01O19J993K505J180j031
54976H2900k088j065J249L511M824M848L792K319J045J40m39o65o54o51n31K75
54960I8810J923L635M361L700K071M43q6P88J936J853N68m32m32l82j042j485
54944A16229n97R88J739J381Q77P10N12K59N12J309J790J319K92m39m62K1N25
54927A26965O48L64l1l48o43p84m46J18n3j350k590k165k4K153K741J539m67k048
54909A23579k443j694m54O48J413J757J487P40J85K83P82J414K437L798M399L291
54893A41622J281J29L15P34O67P30J519K577L363M259N745P282Q026Q197Q756
54878A95202R955J1086J1739J2329J3069J3254J2230J0669R981J0516J1005J0135
$$ plain form
54991 77814 78736 80001 81786 83536 84143 83041 80963 79129 78035 77634 78253 80246 82751 83931 82900
54976 82900 80812 79747 80996 84507 89331 94179 97971 100290 101335 101475 101036 100371 99717 99066 98535 98810
54960 98810 100733 104368 108729 112429 114500 114943 114857 115645 117581 119434 120002 119570 119138 118756 117714 116229
54944 116229 115632 116620 118359 119740 120617 121327 121839 122098 122610 123919 125709 127028 127320 126881 126419 126440 126965
54927 126965 127613 127977 127946 127598 126955 126171 125725 125843 125790 124440 121850 119685 119661 121814 124555 126094 125627 123579
54909 123579 121136 119442 118988 119636 121049 122806 124293 125033 125218 125501 126283 127697 130134 133932 138331 141622
54893 141622 142903 143032 143347 144081 144748 145478 146997 149574 152937 157196 162941 170223 178249 186446 195202
54878 195202 205157 216243 227982 240311 253380 266634 278864 289533 299514 310030 321035 331170
54866C31170Q103O053M358K190j134n117q654j1160j2704j3423j3350j2757j2163
54853B61412j1890j1699j0952r208o885n195m987n565n336l875k602k785l588
54840A76845l144j170P51J558K022L140M517N332O049P773J0291J2097J2684J3404
54826B52149J5346J7354J7227J4393J0299O331K544j263m515o630q115r825j1533
54813B93762j2244j1796j1214j1188j1112j0074q215o517n620n321n049m358l183
54800A87871j941j258j183q02P94L140M586M171K891K604L939N734O631O440N718
54785B29335M561K597J1k315l945n464p424r181r517q243o617o042o782p978q602
54770A54394q194o929n282l732k728k645l352l960l483j934l69K81o2j093k490
$$ plain form
54866 331170 339273 345326 349684 351874 350740 345623 336969 325809 313105 299682 286332 273575 261412
54853 261412 249522 237823 226871 217663 210778 205583 200596 195031 189695 185820 183218 180433 176845
54840 176845 173701 172531 173282 174840 176862 180002 184519 189851 195900 203673 213964 226061 238745 252149
54826 252149 267495 284849 302076 316469 326768 333099 335643 334380 329865 323235 315120 305295 293762
54813 293762 281518 269722 258508 247320 236208 226134 217919 211402 205782 200461 195412 191054 187871
54800 187871 185930 184672 183489 182687 183481 186621 191207 195378 198269 200873 204812 210546 217177 223617 229335
54785 229335 233896 236493 236504 234189 230244 224780 217356 208175 198658 190415 183798 177756 170974 162996 154394
54770 154394 146200 139271 133989 130257 127529 124884 121532 117572 114089 112155 111786 112067 112005 110912 108422
54755A08422l396k565N3K546K911J377j42n89n29n79l60O32K077L252L725L399
54739A20234K539J840J816K031J692J064J273K554L782M159M254M766N320N299
54725A62623N111N584O632P504Q115R246J1417J4150J6418J7568J7836J7944J8037
54712C18185J7202J4692J1405R047P648N251Q43l768o213o719p364q690q896o683
54698C35940l291j037p80j667k615l108k884j731J85K322M250N957P452Q324P970
54683C55287O331M118K200R78M42N17R75J296J087O13N40J231K620M392N770N491
54667C93888K960p49m006o684r885j3574j6024j6321j5919j6512j7449j6784j4266
54654B48675j1730j0621j0531j0374r739q714p302n709m656m759n708o374n768
$$ plain form
54755 108422 105026 102461 102514 105060 107971 109348 109206 108617 108088 107509 107149 107781 109858 113110 116835 120234
54739 120234 122773 124613 126429 128460 130152 131216 132489 135043 138825 142984 147238 152004 157324 162623
54725 162623 167734 173318 179950 187454 195569 204815 216232 230382 246800 264368 282204 300148 318185
54712 318185 335387 350079 361484 370531 378179 383430 384273 380505 374292 367573 360209 351519 342623 335940
54698 335940 332649 331612 330832 329165 326550 323442 320558 318827 319012 321334 325584 331541 338993 347317 355287
54683 355287 361618 365736 367936 368914 369356 369873 370848 372144 373231 373844 374384 375615 378235 382627 388397 393888
54667 393888 396848 396099 392093 385409 375524 361950 345926 329605 313686 297174 279725 262941 248675
54654 248675 236945 226324 215793 205419 195680 186966 179664 173955 169299 164540 158832 152458 146690
54641A46690l954k101j498k278l192k861j114J012K402K630J887O09o53j224m58
54626A35897J792M526N905M850K418Q21R11J482J328R81J612L110M273M505M301
54611A78712M233M377M572M477L580J906O27R33K312K860J569n13j669j297P2
54596B06751J732L110L629L144K468K805M485O564P897Q330Q688R736J1442J3182
54582B93963J4322J4590J4291J4367J5732J8222K0360K0734J9221J6535J3035
54571D75372Q783M291J78l795q140j2155j4247j4157j3497j3558j3772j3125j1878
54558C70300j0915j0303r609q929q511p985p018o211o311p058p800q635r815j0538
54544B50662r759p873o257n325m377l283k837l200l404k924k553l148m333n119
$$ plain form
54641 146690 142736 140635 139137 136859 133667 130806 129692 130704 133106 135736 137623 138232 137579 136355 135897
54626 135897 137689 142215 148120 152970 155388 156209 157120 158602 159930 160911 162523 165633 169906 174411 178712
54611 178712 182945 187322 191894 196371 199951 201857 202484 203417 205729 208589 210158 209645 207976 206679 206751
54596 206751 208483 211593 215222 218366 220834 223639 228124 234688 242585 250915 259603 269339 280781 293963
54582 293963 308285 322875 337166 351533 367265 385487 405847 426581 445802 462337 475372
54571 475372 484155 488446 488624 484829 476689 464534 450287 436130 422633 409075 395303 382178 370300
54558 370300 359385 349082 339473 330544 322033 314048 307030 300819 294508 287450 279650 271015 261200 250662
54544 250662 240903 233030 226773 221448 217071 213788 210951 207751 204347 201423 198870 195722 191389 186270
54530A86270n115m596l872l076k220j168J81J557K420K437J575jj686k415j621
54515A68670j20O49J58j062k436l542l616k167j90N24l02r77j79J387K327K403
54499A61527K200J833J090L74L05O43N84P2J1R45K161K497J725Q61J105K459L602
54482A83994L366K210J748K723M087M609M661N608P700R541R919R289Q965R380
54468B67800R933J0196J0358J0329R380P179M512K175j93l278o480q375q746q806
54454B95984r187r066p928o919p235q189q089o547m788m032m548n852o833o144
54440B00627l656j111j96l42J50J306J619Q77O93J657K080P88o07J00K380L789
54424B10154L495K932L000K565O33j457j356J284M322N632N133M038L057K009
$$ plain form
54530 186270 181155 176559 172687 169611 167391 166223 166404 167961 170381 172818 174393 174392 172706 170291 168670
54515 168670 168550 169199 169357 168295 165859 162317 158701 156534 156344 156868 156566 155589 155410 156797 159124 161527
54499 161527 163727 165560 166650 167024 167329 167972 168556 168628 168639 169584 171745 174242 175967 176828 177933 180392 183994
54482 183994 187360 189570 191318 194041 198128 202737 207398 213006 220706 230247 240166 249455 258420 267800
54468 267800 277733 287929 298287 308616 317996 325175 329687 331862 331669 328391 321911 313536 304790 295984
54454 295984 286797 277731 269803 262884 255649 247460 239371 232824 228036 224004 219456 213604 206771 200627
54440 200627 196971 195860 195664 195322 195472 196778 198397 199274 199967 201624 203704 204492 203885 203985 206365 210154
54424 210154 213649 216581 219581 222146 222779 221322 219966 221250 225572 231204 236337 240375 243432 245441
54410B45441Q22m2k33R7O63J316J831J945J759J494Q84m21j680j472K84J864K034
54393B56586J666K020K556J971N95mN48R97L70j064k714m086m408l367k272k872
54377B46522m726n435l911j781r07j124j353j439j670j703j269j016j406j652
54363B17130j024l22o26j176l24J650K564J499K75Q20K436L024K301K052L189
54348B33468M181L404J839J880L805N156M066J591k8j18O28J848L370M057K774
54333B71921L25j221j228r67j368j861j852j723j761j507q65o36j224j967k354
54318B51712k789l411l463k694k145k510k745j648N2N39n64j778j732n82M95N70
54302B27307k64r83o47N65J716K458L151L612K986J424N29J268K387K148P75n2
$$ plain form
54410 245441 246263 246221 245988 246085 246748 248064 249895 251840 253599 255093 255977 255556 253876 252404 252688 254552 256586
54393 256586 258252 260272 262828 264799 265394 265390 265938 266935 267305 266241 263527 259441 255033 251666 249394 246522
54377 246522 241796 236361 232450 230669 229762 228638 227285 225846 224176 222473 221204 220188 218782 217130
54363 217130 216106 215784 215158 213982 213658 215308 217872 219371 219646 220466 222902 225926 228227 230279 233468
54348 233468 237649 241053 242892 244772 248577 253733 257799 259390 259362 259244 259872 261720 265090 269147 271921
54333 271921 272246 271025 269797 268830 267462 265601 263749 262026 260265 258758 257893 257257 256033 254066 251712
54318 251712 248923 245512 242049 239355 237210 234700 231955 230307 230359 230898 230334 228556 226824 226242 226737 227307
54302 227307 227043 226060 225413 225978 227694 230152 233303 236915 239901 241325 241854 243122 245509 247657 248432 248380
54286B48380L11P93K70j070k069j818n83K20o30k648m114m227l824l610l009j655
54270B20717q12j909m381o336o803o217n089l552j954q14j82J41J8o60j436j872
54254A78859k266l038l871m168l922l369k453j411r95j259j058O4O35o40k451
54239A48657k575j206n49j446k605l083l312l373k532j191j205l137m962m654
54225A12827k725r83j8O67J053N32r28k649l923m218l261j691r37j552k233j417
54209H8544N85K172K698K983L517L551K460J065P71J710K601K404J524J084J424
54194A19093J762J228j26j450j836r02R46K608L011K064O82l43j083j819k188
54179A21647j672o21L3J04M06J357K010J072j092k261o99K323L323N38l523m699
$$ plain form
54286 248380 248691 249484 249754 248684 246615 244797 244214 244434 243804 241156 237042 232815 228991 225381 222372 220717
54270 220717 219905 217996 213615 207279 200476 194259 189170 185618 183664 182850 182668 182809 182827 182167 180731 178859
54254 178859 176593 173555 169684 165516 161594 158225 155772 154361 153366 152107 151049 151113 151748 151108 148657
54239 148657 146082 144876 144327 142881 140276 137193 133881 130508 127976 126785 125580 122443 117481 112827
54225 112827 110102 109119 109101 109768 110821 111353 110425 107776 103853 99635 96374 94683 93746 92194 89961 88544
54209 88544 89129 91301 93999 96982 100499 104050 106510 107575 108346 110056 112657 115061 116585 117669 119093
54194 119093 120855 122083 121957 120507 118671 117769 118715 121323 124334 126398 127080 126737 125654 123835 121647
54179 121647 119975 119354 119387 119491 119897 121254 123264 124336 123244 120983 120284 122607 125930 126468 122945 118246
54163A18246k148P07N38k061l990l545j622J63J057J142Q98P32L60r79l021m050
54147A02427k941q90J80J34J41K90l96j765k398j903j544k030k363j645n90k66
54131H4441l94J4J043J823J702Q51p4o01r73j866l185l649k539j311j866l462
54115F9954l269l99K574L011J363k26q88j103j000m13N1l26r32m56J089K327K427
54098G3784K001J894K016J695O61n24p89M53K313K912J460o10j379q85p75j775
54082H2452k727k350q38P72J914K519K412J573O48L95O11L42o53j368r12J48N32
54065H5470Qm51k86n9k34l01J70N20J86P2J273K858K634K95j860j918o17K27K50
54046H8237L29Q23J335J723K079J976Q41r22k144k287j776r97J99J633K348J622
$$ plain form
54163 118246 116098 116805 117343 115282 111292 107747 106125 106288 107345 108487 109385 110117 110477 109498 106477 102427
54147 102427 99486 98596 98776 98910 99051 99341 98945 97180 94782 92879 91335 89305 86942 85297 84707 84441
54131 84441 84047 84061 85104 86927 88629 89480 89406 88805 87832 85966 82781 79132 76593 75282 73416 69954
54115 69954 66685 66286 68860 71871 73234 73008 72120 71017 70017 69604 69655 69329 68397 67941 69030 71357 73784
54098 73784 75785 77679 79695 81390 82051 81527 80738 81191 83504 86416 87876 87266 85887 85002 84227 82452
54082 82452 79725 77375 76537 77309 79223 81742 84154 85727 86375 86770 87381 87723 87070 85702 84790 84938 85470
54065 85470 85478 85027 84741 84682 84448 84147 84317 84837 85023 85095 86368 89226 91860 92155 90295 88377 87760 87987 88237
54046 88237 88566 89389 90724 92447 94526 96502 97343 96421 94277 91990 90214 89217 89416 91049 93397 95019
54030I5019K3j129j129k84R12K345L815M598M015K287L44j099j736j216N26K340
54014A09631K474P46q76q08J11J92m95p05m18o25j099o22M44K40j381k076n60
53997A04173J275J333N03Q16K029K352J602J241J629J566N93k97m68l54q4R60
53981A18869K618L609L421L112L425L438K200O64O02K160L658L716K625J654J711
53966A57482K788M195N233N890O735P848Q204O800M329K822L336M696N194M907
53952B30459N288O576O995N217K598J598K492L064J811m8n01M69J157M78j221
53937B66432l258n246o456n997m117k512k520l535l944l244k467k585l275l600
53923B13676l306k858k590k313j919j772k278l298m211m400l667k431j512j351
$$ plain form
54030 95019 95042 93913 92784 92500 93412 95757 99572 104170 108185 110472 110816 109717 107981 106765 107291 109631
54014 109631 112105 112851 111975 111167 111278 111470 110975 110270 109852 109227 108128 107506 107950 108190 106809 104733 104173
53997 104173 105448 106781 107284 108100 110129 112481 114083 115324 116953 118519 119112 118815 118347 117993 117909 118869
53981 118869 121487 125096 128517 131629 135054 138492 140692 141356 141958 144118 147776 151492 154117 155771 157482
53966 157482 160270 164465 169698 175588 182323 190171 198375 205175 209504 212326 215662 220358 225552 230459
53952 230459 235747 242323 249318 254535 257133 258731 261223 264287 266098 266050 265549 266018 267175 267653 266432
53937 266432 263174 257928 251472 245475 241358 238846 236326 232791 228847 225603 223136 220551 217276 213676
53923 213676 210370 207512 204922 202609 200690 198918 196640 193342 189131 184731 181064 178633 177121 175770
53909A75770j420q62J79O60K75R8Q43J512Q25o83j383r28m05k19M78K014L340
53892A80094L620L399L506L840L885L527K810J844J420K509M497N267M017K676
53878B26911L352N399O494N866M844M646N105N490N403M811L997L472L346L101
53864B92237K563K347K633K411R78o59j181j025j442k163j806k83J031J609K368
53849B99618L780N077N873O921Q533R631R198P709O447O157O838Q008Q700Q125
53835D00615O651N394M689L891K770J833J117J03r08r09k22o95k955n174n609
53820D10591m875m333l961l501m163o779r363r085o412m759n796p514p580o452
53806C26018o005o683p414p382o651n696n171n641o746p281o741o097o198o154
$$ plain form
53909 175770 174350 173488 173667 174327 174602 174700 175543 177055 177880 177197 175814 174886 174481 174262 174740 176754 180094
53892 180094 183714 187113 190619 194459 198344 201871 204681 206525 207945 210454 214951 220218 224235 226911
53878 226911 230263 235662 242156 248022 252866 257512 262617 268107 273510 278321 282318 285790 289136 292237
53864 292237 294800 297147 299780 302191 303169 302510 301329 300304 298862 296699 294893 294610 295641 297250 299618
53849 299618 303398 308475 314348 321269 329802 339433 348631 356340 362787 368944 375782 383790 392490 400615
53835 400615 407266 412660 417349 421240 424010 425843 426960 427063 426155 425246 425024 424329 421374 416200 410591
53820 410591 405716 401383 397422 393921 389758 382979 373616 364531 358119 353360 347564 340050 332470 326018
53806 326018 320013 313330 305916 298534 291883 286187 281016 275375 268629 261348 254607 248510 242312 236158
53792B36158m576j993p05j990m574o213o046m875l780l112k656k120j306k07P59
53777A92764P27q63l201m214k538O05K339J361o06j283q24j080k387k942j639
53762A76219J60O33m0m73l13j90m4Q33K137K504J458J10m67m52k98K51J334K063
53744A85425J534K48l68L29J700K869L536L849L970L895L506K934K914M147O190
53729B26678P541P373O515O164O239N877N010M456M665N264N738N779N085L737
53715C06121K669K839L779L911K551Q01M5K48L14l67j375k050k386k918l780m149
53699C06253l141j254j82o99j449p88Q05J405M41o77r25j113k262l819m510m177
53683B83908l663l364l002k624k745l430m011m016l861m201m864m891l705j940
$$ plain form
53792 236158 231582 229589 228884 226894 222320 216107 210061 205186 201406 198294 195638 193518 192212 192005 192764
53777 192764 193491 192628 189427 185213 182675 183280 185619 186980 186374 185091 184267 183187 180800 177858 176219
53762 176219 176379 177012 176972 176499 176186 175996 175952 176785 178922 181426 182884 182994 182527 182075 181777 182028 183362 185425
53744 185425 186959 187207 186839 187168 188868 191737 195273 199122 203092 206987 210493 213427 216341 220488 226678
53729 226678 234219 241592 248107 254271 260510 266387 271397 275853 280518 285782 291520 297299 302384 306121
53715 306121 308790 311629 315408 319319 321870 322671 322716 322964 323278 322911 321536 319486 317100 314182 310402 306253
53699 306253 303112 301858 301676 300977 299528 298740 299545 300950 301391 300714 299789 298676 296414 292595 288085 283908
53683 283908 280245 276881 273879 271255 268510 265080 261069 257053 253192 248991 244127 239236 235531 233591
53669B33591p76n12l50K23M64n07k201l248l297l235l467l185j860m46j76r58
53653B10060j721j940j874j726j398r89p56o78n81n22n04k8J301K821L226K078
53637B06769L10r45j392j285o87M78J831K557K043N22r33j214j69J296K291K865
53621B14337L533M145L958K843J599P96N9j013j833j549l51P72J511K456L813
53606B35076M722M313K746Q56o23j105j44J675K523J100j445k449q38J608K433
53591B50448J153p74j909k017j591r64j66O50R43K10j172j992j560p29p34j273
53575B38523r10N57J541J027J08K27J050J354J020P67N43j60p70l9J913L479L744
53558B53974L461L563L825L552K579J129m07j179l15J766L251K857J290L55J065
$$ plain form
53669 233591 232815 232303 231953 232176 232640 232133 229932 226684 223387 220152 216685 213500 211640 211194 211018 210060
53653 210060 208339 206399 204525 202799 201401 200412 199656 198978 198397 197875 197371 197343 198644 201465 204691 206769
53637 206769 207079 206134 204742 203457 202770 203248 205079 207636 209679 210201 209268 208054 207885 209181 211472 214337
53621 214337 217870 222015 225973 228816 230415 231211 231270 230257 228424 226875 226524 227296 228807 231263 235076
53606 235076 239798 244111 246857 247713 247090 245985 245841 247516 250039 251139 249694 247245 246407 248015 250448
53591 250448 251601 250827 248918 246901 245310 244346 244180 244830 245773 245983 244811 242819 241259 240530 239796 238523
53575 238523 237613 238170 239711 240738 240846 241073 242123 243477 244497 245264 245807 245647 244877 244838 246751 250230 253974
53558 253974 257435 260998 264823 268375 270954 272083 271676 270497 270182 271948 275199 278056 279346 279701 280766
53543B80766K968M780N336M441L156K746L264L717L672L777M384M721M010K649
53529C34387J556J057J110J946L532M819M549K799J080Q54K251M141N152M734
53515C73967L511K533K199K003J289j14j825l023k819j260K14J52j030j593r42
53500C73262k77m89q03k53O95R57L97l09o52m45K05M20q38k976l692j754J324
53483C64772L503M794O034O485M936K517J868L510N302N760N746O235O529N789
53469D33780M783M867O238Q170J0022J1162J0962R870R609J1242J3729J5300J5661
53456E65395J5765J6024J6051J5994J6812J8955K1691K4026K5706K6957K7709
53445G91085K7619K6836K6348K7220K9424L1715L3036L3779L5019L6699L7512
$$ plain form
53543 280766 283734 288514 293850 298291 301447 304193 307457 311174 314846 318623 323007 327728 331738 334387
53529 334387 335943 337000 338110 340056 343588 348407 352956 355755 356835 357689 359940 364081 369233 373967
53515 373967 377478 380011 382210 384213 385502 385388 383563 380540 377721 376461 376675 376827 375797 374204 373262
53500 373262 372985 372496 371693 371440 372135 373092 373489 373180 372528 372083 372288 372708 371870 368894 365202 363448 364772
53483 364772 368275 373069 379103 385588 390524 393041 394909 398419 403721 409481 415227 421462 427991 433780
53469 433780 438563 443430 449668 457838 467860 479022 489984 499854 509463 520705 534434 549734 565395
53456 565395 581160 597184 613235 629229 646041 664996 686687 710713 736419 763376 791085
53445 791085 818704 845540 871888 899108 928532 960247 993283 1027062 1062081 1098780 1136292
53434A136292L6910L6231L7056L9070M0523M0516L9820L9424L9188L8354L6814
53423A560198L5340L4732L4984L5425L5559L5674L6439L7848L8943L8829L7702
53412A961673L6384L5050L3108L0348K7558K5515K3901K1832J9307J7318J6316
53401B248310J5201J2559Q699N577M492M391L060l97m846q667j1288j3049j4324
53388B249718j5363j6612j8616k1586k5199k8764l1394l2411l2026l1445l1843
53377A964459l3154l4192l4008l2853l1848l1985l3383l5046l5268l2912k8618
53366A601192k4502k2278k1865k1971k1544k0203j7701j3849r071m444q84J421
53354A424301K819L961N755Q926J3265J7731K1528K4772K7885L0921L3728L6284
$$ plain form
53434 1136292 1173202 1209433 1246489 1285559 1326082 1366598 1406418 1445842 1485030 1523384 1560198
53423 1560198 1595538 1630270 1665254 1700679 1736238 1771912 1808351 1846199 1885142 1923971 1961673
53412 1961673 1998057 2033107 2066215 2096563 2124121 2149636 2173537 2195369 2214676 2231994 2248310
53401 2248310 2263511 2276070 2284769 2290346 2294838 2299229 2302289 2301892 2297046 2288379 2277091 2264042 2249718
53388 2249718 2234355 2217743 2199127 2177541 2152342 2123578 2092184 2059773 2027747 1996302 1964459
53377 1964459 1931305 1897113 1863105 1830252 1798404 1766419 1733036 1697990 1662722 1629810 1601192
53366 1601192 1576690 1554412 1532547 1510576 1489032 1468829 1451128 1437279 1428208 1423764 1422880 1424301
53354 1424301 1427120 1431081 1436836 1445762 1459027 1476758 1498286 1523058 1550943 1581864 1615592 1651876
53342A651876L8477M0145M1737M4149M7356M9961N1103N2164N5191N9933O3919
53331B196011O5684O6484O8321P1498P4931P7911Q0378Q2116Q2829Q3016Q3870
53320C033049Q6060Q8970R1243R1900R1046Q9634Q8460Q7289Q5212Q1865P7944
53309C992672P4341P1158O7718O3242N7389N0469M3324L6664L0454K4259J8102
53298D529792J2362O852P62o205j3354j9895k5742l1178l6477m2094m8449n5296
53286D271078o2069o9130p7444q6432r3494r6795r7514r8170r9532j00569j00710
53275C289219j00500j00182r9230r7407r5117r2572q9690q6889q4897q3584q1933
53264B277218p9432p6532p3567p0222o6381o2581n9078n5236n0363m4763l9464
$$ plain form
53342 1651876 1690353 1730498 1772235 1816384 1863740 1913701 1964804 2016968 2072159 2132092 2196011
53331 2196011 2261695 2328179 2396500 2467998 2542929 2620840 2701218 2783334 2866163 2949179 3033049
53320 3033049 3119109 3208079 3299322 3391222 3482268 3571902 3660362 3747651 3832863 3914728 3992672
53309 3992672 4067013 4138171 4205889 4269131 4326520 4376989 4420313 4456977 4487431 4511690 4529792
53298 4529792 4542154 4549006 4549768 4543563 4530209 4510314 4484572 4453394 4416917 4374823 4326374 4271078
53286 4271078 4209009 4139879 4062435 3976003 3882509 3785714 3688200 3590030 3490498 3389929 3289219
53275 3289219 3188719 3088537 2989307 2891900 2796783 2704211 2614521 2527632 2442735 2359151 2277218
53264 2277218 2197786 2121254 2047687 1977465 1911084 1848503 1789425 1734189 1683826 1639063 1599599
53253A599599l5273l2258k9808k7013k3266j8653j3665q731m394j427n6O46J832
53240A407533L618N520P767J0892J4235J6301J6939J7776J9877K2365K4054K5277
53228A592154K6946K8826L0086L1038L2888L5765L8243L9143L8996L9280M0711
53217A974076M2689M4057M4042M2639M0439L8169L6226L4496L2545L0019K6852
53206B386249K3247J9581J6390J4015J2004R172M950M75k499l783m930p042r635
53193B458194j2169j5370k0043k5580l0848l5631l9946m3001m4524m6258n0074
53182B094750n5022n8340n9164n9010n8760n7743n6195n5878n7115n7621n5734
53171A464168n2792n0714m9250m7403m5784m5309m4971m3336m1259m0645m1134
$$ plain form
53253 1599599 1564326 1532068 1502260 1475247 1451981 1433328 1419663 1410932 1406538 1405111 1405055 1405701 1407533
53240 1407533 1411151 1416671 1424438 1435330 1449565 1465866 1482805 1500581 1520458 1542823 1566877 1592154
53228 1592154 1619100 1647926 1678012 1709050 1741938 1777703 1815946 1855089 1894085 1933365 1974076
53217 1974076 2016765 2060822 2104864 2147503 2187942 2226111 2262337 2296833 2329378 2359397 2386249
53206 2386249 2409496 2429077 2445467 2459482 2471486 2480658 2485608 2486083 2483584 2479801 2474871 2467829 2458194
53193 2458194 2446025 2430655 2410612 2385032 2354184 2318553 2278607 2235606 2191082 2144824 2094750
53182 2094750 2039728 1981388 1922224 1863214 1804454 1746711 1690516 1634638 1577523 1519902 1464168
53171 1464168 1411376 1360662 1311412 1264009 1218225 1172916 1127945 1084609 1043350 1002705 961571
53160I61571m0455l7855l4877l2743l1156k9848k9167k8570k6566k2994j9721
53149F27619j8157j7525j6476j5139j4370j4072j3458j2339j1077r784q500p753
53137D68969p954q509q400p559o921p014p244o861o145o069o835p378o632n099
53123C70349m401n142o006n533m147l471l990m567m366l989m275m939n054m328
53109C06141l260k495k530l609n234o191n638m093k790k332k544l337m771o193
53095B51124o217m152j080J117J520O73m85j442j919j650r10p18j861l710m695
53080B25595l950k125m38M63N92K25k42n22p94j457k240k265j391p30j043j374
53064B08304m24J209J532o4j923k374j681j076r04o52j54K45L72K50l27j380k154
$$ plain form
53160 961571 921116 883261 848384 815641 784485 754637 725470 696900 670334 647340 627619
53149 627619 609462 591937 575461 560322 545952 531880 518422 506083 495006 485222 476722 468969
53137 468969 461015 452506 444106 436547 429626 422612 415368 408507 402362 396293 389458 382080 375448 370349
53123 370349 365948 360806 354800 349267 345120 341649 337659 333092 328726 324737 320462 315523 310469 306141
53109 306141 302881 300386 297856 294247 289013 282822 277184 273091 270301 267969 265425 262088 257317 251124
53095 251124 244907 240755 239675 240792 242312 242985 242500 241058 239139 237489 236579 235861 234000 230290 225595
53080 225595 221645 219520 219082 219545 220137 220362 220120 219598 218804 217347 215107 212842 211451 210721 209678 208304
53064 208304 207880 209089 210621 210557 208634 206260 204579 203503 202599 201947 201793 202038 202410 202660 202333 200953 198799
53047A98799j780n47K76P4m48m52p9P6j4p6k72r59j841k170j813j346j027m16
53029A85985N75J131O50k78p62j006j833l104l721l188k122j056J67J462K066
53014A74966J669J138J279J694J701J630K163K922K935K248J888K301K958L560
53000B05052M373N070M504K408L52R7J349K042P76j712l552l723k811k100k309
52985B09816l335m875o702q229q479p087m952l281k299j566j210j813l118l851
52971A49019l202j734n28j02l98j105j646j513j059j256k363l496l935m008m157
52956A18517l969k961j608p21l45j68n17j779l163l196j473R01K630L194K567
52941A07909J043n27j217r63m49p7K44K75m17j369j382k61O72M61n0L24J164J032
$$ plain form
53047 198799 197019 196472 196748 196822 196374 195922 195843 195919 195905 195829 195557 194598 192757 190587 188774 187428 186401 185985
53029 185985 186560 187691 188341 188063 187301 186295 184462 181358 177637 174449 172327 171271 171438 172900 174966
53014 174966 176635 177773 179052 180746 182447 184077 186240 189162 192097 194345 196233 198534 201492 205052
53000 205052 209425 214495 218999 221407 221759 221856 223205 225247 226023 224311 220759 217036 214225 212125 209816
52985 209816 206481 201606 194904 186675 178196 171109 166157 162876 160577 159011 157801 155988 152870 149019
52971 149019 145817 144083 143555 143453 143055 141950 140304 138791 137732 136476 134113 130617 126682 122674 118517
52956 118517 114548 111587 109979 109258 108913 108745 108228 106449 103286 100090 98617 99518 102148 105342 107909
52941 107909 108952 108425 107208 106245 105796 105719 105963 106238 105821 104452 103070 102809 103481 103942 103892 104216 105380 106412
52923A06412m16k099l045l167k573j248L56J300J223Q47J057J858K496K292J194
52908A06487j60r35r58r50j401j557m41J265J614J16j289q29O24R11l00j353j176
52891I9668m06K41J096K339K988K148M96n66q42j268k062k087l89K308M219M232
52875A12115K709Q05n78j117p90K97J744K811K972K449J964J932K238K741L439
52860A35731L996L774K690J596J227J329J371J567K348L130K819J533O92R80J363
52845A66146P34m04p99l19N2l07j265k707m526n885n703m229l101l193l445k517
52829A28532q69o9n28j156j196j164j656k238k145j477j027j265k106l283m318
52814A04035m337k771l88J062O10q12j415m49J133J796R33o49j529r22O79K024
$$ plain form
52923 106412 105996 103897 100852 97685 95112 93864 94220 95520 96743 97590 98647 100505 103001 105293 106487
52908 106487 106327 105392 104434 103484 102083 100526 100085 101350 102964 103080 101791 100962 101586 102497 102197 100844 99668
52891 99668 99262 99503 100599 102938 105926 108074 108570 108004 107162 105894 103832 101745 101356 103664 107883 112115
52875 112115 114824 115629 115051 113934 113144 113441 115185 117996 120968 123417 125381 127313 129551 132292 135731
52860 135731 139727 143501 146191 147787 149014 150343 151714 153281 155629 158759 161578 163111 163803 164783 166146
52845 166146 166880 166476 165677 165358 165410 165103 163838 161131 156605 150720 145017 140788 137687 134494 131049 128532
52829 128532 127663 127594 127066 125910 124714 123550 121894 119656 117511 116034 115007 113742 111636 108353 104035
52814 104035 99698 96927 96539 97601 98211 97399 95984 95535 96668 98464 99397 98748 97219 96297 96976 99000
52798I9000K168J050p58k507l406k856j028Q72J529Q32j3J62J276K365K743K507
52782A03936K081J835K068K801L499L387K309R68J37m7P7J06l65j495k625k592
52766A16080j296k89q81k097j762M29K290J907o9j605j823j505j589k106k465
52751A03219k246j589r35k52J196L642N664N340K820N02J26Q85J212J089J369
52736A22042J915K005J960K649L783M181L590K884K532K194J765J444Q89l88j742
52721A51703j993j291r66j410j692j460j484j952j989j456j520k520l003j905
52707A27062k29P39J358K394L087K161o1k076l207l886m456m844n029m834l815
52692A04364k209j239j452j684q45K19J41o12n03N65J332J399J523J759J175m46
$$ plain form
52798 99000 101168 102218 101460 98953 95547 92691 91663 92535 94064 94896 94883 95045 96321 98686 101429 103936
52782 103936 106017 107852 109920 112721 116220 119607 121916 122884 123021 122974 123051 123157 122792 121297 118672 116080
52766 116080 114784 114495 113614 111517 109755 110184 112474 114381 114312 112707 110884 109379 107790 105684 103219
52751 103219 100973 99384 98449 98197 99393 103035 108699 114039 116859 117361 117487 118372 119584 120673 122042
52736 122042 123957 125962 127922 130571 134354 138535 142125 145009 147541 149735 151500 152944 153833 153445 151703
52721 151703 149710 148419 147453 146043 144351 142891 141407 139455 137466 136010 134490 131970 128967 127062
52707 127062 126833 127572 128930 131324 134411 136572 136511 134435 131228 127342 122886 118042 113013 108179 104364
52692 104364 102155 100916 99464 97780 96935 97154 97295 96683 96180 96745 98077 99476 100999 102758 103933 103487
52676A03487k148l263l856l587j801Q19K246J524l4o73k34K11j80j457k966l554
52660H4534k460l96J095J458J444J488J063Q6l96L18J361J531Q63J84j90m35m64
52643I1084j42J59N2m7N75J670J995O72j749l698l938k610r95j45O5L68Q93J142
52625H5351R88Q98J098J257J159Q88K48j143k836l487k420n39P97J330J676K175
52609H7440K584K627K274J578O08n04j512j945j255M52K010K317J828J941K755
52594A03198K698R09j160j557l27R35J458J983L115M259M561M062L514L409L642
52579A34699L930M134M066L227J251j250k752k337r27l21j173k530l324l428l129
52564A30136k524j772j136m26P91J983J659o31l158l801k583j513k123l933n210
$$ plain form
52676 103487 101339 98076 94220 90633 88832 89651 91897 93421 93387 92714 92480 92691 92511 91054 88088 84534
52660 84534 82074 81678 82773 84231 85675 87163 88226 88312 87916 88234 89595 91126 91989 92173 91983 91548 91084
52643 91084 90942 91101 91153 91106 91681 93351 95346 96018 94269 90571 86633 84023 83028 82883 82948 83316 84209 85351
52625 85351 86339 87237 88335 89592 90751 91639 91887 90744 87908 84421 82001 81462 82259 83589 85265 87440
52609 87440 90024 92651 94925 96503 97111 96607 95095 93150 91895 92347 94357 96674 98502 100443 103198
52594 103198 105896 106805 105645 104088 103761 104696 106154 108137 111252 115511 120072 124134 127648 131057 134699
52579 134699 138629 142763 146829 150056 151307 150057 147305 144968 144041 143720 142547 140017 136693 133265 130136
52564 130136 127612 125840 124704 124278 125069 127052 128711 128080 124922 121121 118538 117025 114902 110969 105759
52549A05759m617k238M73J801J137o69k363l284l242k254q01J49qq79j610j617
52533H5737o30J199K818K731P66j259j468L1J701K527K467J565k8j396j470m42
52517I4849M33N60N08O87N35l52j235j055J70J422J929J735J115P2j202j786o80
52500I7705J711L363K595P4j956k338j933j769j511n76L61J78q68j475j234j040
52484I1287j433j726j122J3O16K24o40j130q84k31L10P55J641L068M077L462J231
52467I9518j206k312j695k36P33M80m96q66J92K023L007K128M2j359o62J487K769
52450A03547J659o59j694q04K71J57l08J76J213J590J333J357J603J124j43j143
52434A09279j237p36N4J066J646R08q02j908j614q26o95j233j871k422k744k296
$$ plain form
52549 105759 101142 98904 99377 101178 102315 101646 99283 95999 92757 90503 89702 89851 89843 88964 87354 85737
52533 85737 85107 86306 89124 91855 92621 91362 89894 89925 91626 94153 96620 98185 98157 96761 95291 94849
52517 94849 95282 95842 96350 97037 97572 97220 95985 94930 95100 96522 98451 100186 101301 101373 100171 98385 97705
52500 97705 99416 102779 105374 105448 103492 101154 99221 97452 95941 95365 95726 95904 95036 93561 92327 91287
52484 91287 89854 88128 87006 87019 87635 87859 87219 86089 85205 84974 85284 86039 87680 90748 94825 98287 99518
52467 99518 98312 96000 94305 94069 94802 95282 94786 93920 94112 96135 99142 101270 101312 99953 99291 100778 103547
52450 103547 105206 104547 102853 102049 102320 102477 102169 102345 103558 105148 106481 107838 109441 110565 110422 109279
52434 109279 108042 107306 107360 108426 110072 110980 110178 108270 106656 105830 105135 103902 102031 99609 96865 94569
52418I4569q77P50J630J622J075R5j167k018j824r45k02M66J891L998N123L785
52402A07971Q06j209o54J392K654K249J131L50j53q00j423j627j535j539j652
52387A05961j527q64M10J967K902K434J121N04J127J819J580R14M23n08k144k827
52371A13292j117J311J401q90k461j548J14M08l40q49j157j777k219k035j981
52356A00152k476k145R6K489K273l05k023r77J319K561K548K435K507K061R21
52341A11436j17l33J24M68L8j025j685q60J301L277L594K272N85l96p09j090k040
52324A14840l344m223l871k102L13K131K680K315J674P01r75k801l231j434J463
52309A04136L553M176M050L576K192l07k707l425k199k29J132J331N38o89j559
$$ plain form
52418 94569 93692 94442 96072 97694 98769 98864 97697 95679 93855 92910 92708 93174 95065 99063 104186 107971
52402 107971 108777 107568 106914 108306 110960 113209 114340 114690 114537 113737 112314 110687 109152 107613 105961
52387 105961 104434 103570 103980 105947 108849 111283 112404 112908 114035 115854 117434 118348 118771 118263 116119 113292
52371 113292 112175 113486 114887 113997 111536 109988 110102 110510 110170 109321 108164 106387 104168 102133 100152
52356 100152 97676 95531 95627 98116 100389 100084 98061 97084 98403 100964 103512 105947 108454 110515 111436
52341 111436 111319 110986 111110 111578 111616 110591 108906 108046 109347 112624 116218 118490 119075 118679 117970 116880 114840
52324 114840 111496 107273 103402 101300 101613 103744 106424 108739 110413 111114 110139 107338 104107 102673 104136
52309 104136 107689 111865 115915 119491 121683 121376 118669 115244 113045 112816 113948 115279 115817 115128 113569
52294A13569j431l63P93J168O95R4L3N56J357K300L243L615K855J414O21J097
52278A31616J883J711O36k28l47k68o52j505k329k477j482L25J631J375J40m62
52262A29567K10J257J694J556J198M80o83j641j559n07N03N01n40j639j646l87
52246A28364J158K075K468K681K207M88j424j534N30K911L948M024M317M886N022
52231A62121M610M113L669L087K357J448J23j455k358j959r23m11o58r77p30K67
52215A72324J864L350L632K400O70m41r83j398j297j93J045R69k73r26j4J519
52199A82248K405K613K712K655K095J330J077J463J867J647P47l70j107j212j049
52184A99121j303k155k870k412n43J765L127K914J717O09J10Q0M63J548L318M929
$$ plain form
52294 113569 112138 111775 112568 113736 114431 114525 114558 115114 116471 118771 122014 125629 128484 129898 130519 131616
52278 131616 133499 135210 135846 135618 135271 135003 134351 132846 130517 128040 126558 126883 128514 129889 130029 129567
52262 129567 129777 131034 132728 134284 135482 135962 135279 133638 132079 131572 132075 132576 132036 130397 128751 128364
52246 128364 129522 131597 134065 136746 138953 139441 138017 136483 137013 139924 143872 147896 152213 157099 162121
52231 162121 166731 170844 174513 177600 179957 181405 181528 180073 177715 175756 174833 174422 173764 172787 172057 172324
52215 172324 174188 177538 181170 183570 184240 183799 182816 181418 180121 179928 180973 181942 181669 180743 180729 182248
52199 182248 184653 187266 189978 192633 194728 196058 197135 198598 200465 202112 202859 202489 201382 200170 199121
52184 199121 197818 195663 192793 190381 189838 191603 194730 197644 199361 199970 200080 200160 200623 202171 205489 210418
52168B10418N343M347K724J501J215J679K266K485K370K143J661P36q2J33J316
52153B40255K167J795Q04J84N5K34J144K928M381M251L233L120M032M094K160
52138B74837n48k086j777L9K882N769P027N802L253J268M00j54r55j827k587l111
52122B88232k767r54J595L118K814J707J056Q19L54n5N01J964K994K561J110j67
52106C04882p73j096j432j392n33P27J285O32l38k33J144K404K197P67n73j100
52090C06568j132j044p57l74m26j063j656j736j647j778j710r64o4M9o18j232
52074B90416j351j165o63L91J576J882Q81q52k502l463l147j523M0k39k246l786
52058B74249l364k039j713k566l198k604r01J220K793K739Q87j423k599k435j725
$$ plain form
52168 210418 215761 220108 222832 224333 225548 227227 229493 231978 234348 236491 238152 238888 238806 238939 240255
52153 240255 242422 244217 245021 245205 245260 245494 246638 249566 253947 258198 261431 264551 268583 272677 274837
52138 274837 274289 272203 270426 270465 273347 279116 286143 291945 295198 296466 296866 296712 295757 293930 291343 288232
52122 288232 285465 284511 286106 289224 292038 293745 294801 295620 295974 295919 296420 298384 301378 303939 305049 304882
52106 304882 304109 303013 301581 300189 299656 300383 301668 302300 301962 301729 302873 305277 307474 308241 307668 306568
52090 306568 305436 304392 303635 303261 302835 301772 300116 298380 296733 294955 293245 292281 292217 292266 291648 290416
52074 290416 289065 287900 287237 287628 289204 291086 291967 291115 288613 285150 282003 280480 280520 280281 278035 274249
52058 274249 270885 268846 267133 264567 261369 258765 257864 259084 261877 264616 265503 264080 261481 259046 257321
52043B57321q62J22O25N6p86l18J491K771K163N40l93k54P1j30q69j849k449j748
52025B55502M22K552K676P80r42o87R43K206K643L089L742L801L233L303M445
52010B87708M976L287M53j020n56P1l99j275j614j556j287l20J118J519K03j145
51994B90163n78J338K397J821Q45M83M33L05M50J010J213M09q49j301l59J382
51978B99162K886L753M357M889M570K572l57k169j818m25L41Pj090k680m137m305
51962C05556l057k034k467l228k678j393j157j976k329j951j933k192j428K8q
51947B77753k035l625l001j646j667k521k360j142l24l78o52j014j695j945q11
51932B52937Q96J261j5j150r39l19p56k300l865m507l849k143n16l53j707k899
$$ plain form
52043 257321 256459 256581 257206 257262 256476 256158 257649 260420 262583 263123 262730 262476 262547 262417 261548 259699 257250 255502
52025 255502 255924 258476 261152 261932 260990 260303 261246 263452 266095 269184 272926 276727 279960 283263 287708
52010 287708 292684 295971 296424 295404 294848 294919 294520 293245 291631 290075 288788 288468 289586 291105 291308 290163
51994 290163 289585 290923 293320 295141 295986 296469 296902 297207 297657 298667 299880 300289 299440 298139 297780 299162
51978 299162 302048 305801 310158 315047 319617 322189 321832 319663 317845 317420 317761 317768 316678 313998 309861 305556
51962 305556 302499 300465 297998 294770 292092 290699 289542 287566 285237 283286 281353 279161 277733 277761 277753
51947 277753 275718 272093 269092 267446 265779 263258 260898 259756 259432 259054 258402 257388 255693 253748 252937
51932 252937 253833 255094 255079 253929 252990 252671 251915 249615 245750 241243 237394 235251 234735 234382 232675 229776
51916B29776k430q40L2p80k626m416n509n514m230k280j097j604l247m824n883
51901A84528o600o763n952m698m277m902n127l810j803p82j017j285o72N77J757
51886A39174K312J826L74j170j907j961j963j818j021%K47r2K14J219J252o47
51870A36039l019l798k777j226Q3J250K101K039J060l6n52m40k1M00O46P63Q53
51853A33365O96j0q15n95Q79K043J127j628m096m512l025j051K33O27O15O26N36
51836A25015m8j096k056k473k270j396J61J700K006P76o45o50Q64K591L267K491
51820A28237P24q90j145l7R43N11q63j804j904j706j286j93J323K339K621K822
51804A29692L062K650J541Q72J235J583P11j034k480l264l623l195j470Q15K088
$$ plain form
51916 229776 227346 226506 226538 225758 223132 218716 213207 207693 203463 201183 200086 198482 195235 190411 184528
51901 184528 177928 171165 165213 160515 156238 151336 146209 142399 140596 139814 138797 137512 136840 137417 139174
51886 139174 141486 143312 143686 142516 140609 138648 136685 134867 133846 133846 134093 134001 134215 135434 136686 136039
51870 136039 133020 129222 126445 125219 125302 126552 128653 130692 131752 131716 131164 130724 130703 131103 131749 132512 133365
51853 133365 134061 134051 133236 132641 133520 135563 136690 135062 130966 126454 123429 122378 122611 123238 123853 124479 125015
51836 125015 124967 123871 121815 119342 117072 115676 115837 117537 119543 120319 119674 119024 119888 122479 125746 128237
51820 128237 128961 128071 126926 126889 127832 128343 127480 125676 123772 122066 120780 120587 121910 124249 126870 129692
51804 129692 132754 135404 136945 137817 139052 140635 141346 140312 137832 134568 130945 127750 126280 127095 129183
51789A29183J958J621J903K139J579Q83J086J759J375m83k310k345l78K339M405
51774A44714N099M407K793R98k43m98P6O95M10r73k421k607j339L03J300J696
51758A54410K209L266M599N425M960L227J433Q84J497K116K242K395K490J408
51744A92561q32j925J28M015O511O515N955O631P851P820O124M048L129L795M984
51729B57310M930K939L83q43o52o75j860l375m075l941l681l763m308n058n154
51714B28177l814j582m3qp02r89m51Q21K419L262K298M1j567j416l23M64P44Q04
51696B28135O09K36P4r5j079k680l327k177l22Q77J453J830J538K04j198j504
51680B22574q84r5Q54J979K380J489L38J26L46j19q87q34k09r7l77o8N82M14n20
$$ plain form
51789 129183 131141 132762 134665 136804 138383 139266 140352 142111 143486 143003 140693 138348 137970 140309 144714
51774 144714 149813 154220 157013 158011 157768 157270 157346 158041 158451 157478 155057 152450 151111 151414 152714 154410
51758 154410 156619 159885 164484 169909 174869 178096 179529 180413 181910 184026 186268 188663 191153 192561
51744 192561 191729 189804 189932 193947 200458 206973 212928 219559 227410 235230 241354 245402 248531 252326 257310
51729 257310 262240 265179 265562 264719 264067 263392 261532 258157 254082 250141 246460 242697 238389 233331 228177
51714 228177 224363 222781 222738 222730 222028 221039 220588 221409 223828 227090 229388 229429 227862 226446 226123 226587 227331 228135
51696 228135 228744 228980 229054 228959 227880 225200 221873 219696 219374 220251 221704 223534 225072 225276 224078 222574
51680 222574 221690 221595 222449 224428 226808 228297 228635 228761 229107 228988 228101 227267 227058 226961 226584 226516 227098 227512 226992
51661B26992r66o02l02k64K15R44O98p10j964k240k142k138j674m36Q62J628K057
51644B19958K143J389oq80p43n20j076k067k817l148k841j450O45K053J974J021
51628B13635p0j383k833l434k509p20Q27J671J631N07j084j726j024k54l29k73
51612B02632R50K254J654r53l668m905m491k964j161k19n61r63Q3K117L062J909
51596A94776j38j474j788j561r03K77J595K369K271J392r1j902l399l741k479
51581A85204j06K098L091K996K763K826K594J448l44k079l378l955l273j307Q68
51566A89446K120K592L013L195K328P84Q0P11J328P54k51j97R39J753J292r3j551
51549B08243k464k441j420j16K72p77k485l481l059j713n35j33j1P29J947K215
$$ plain form
51661 226992 226026 225424 225122 224858 225073 226017 226715 226005 224041 221801 219659 217521 215847 215411 216273 217901 219958
51644 219958 222101 223490 223484 222604 221861 221341 220265 218198 215381 212233 209392 207942 208587 210640 212614 213635
51628 213635 213565 212182 209349 205915 203406 202686 203513 205184 206815 207322 206238 204512 203488 203234 202905 202632
51612 202632 203582 205836 207490 206537 202869 197964 193473 190509 189348 189129 188568 187605 187688 189805 192867 194776
51596 194776 194638 193164 191376 189815 188912 189189 190784 193153 195424 196816 196725 194823 191424 187683 185204
51581 185204 185098 187196 190287 193283 196046 198872 201466 202914 202570 200491 197113 193158 189885 188578 189446
51566 189446 191566 194158 197171 200366 202694 203478 203558 204269 205597 206351 206100 205903 206842 208595 209887 209794 208243
51549 208243 205779 203338 201918 201802 202074 201297 198812 195331 192272 190559 190024 189891 189880 190609 192556 194771
51533A94771O10j653k406j311l42j079k590k858j464K64J252J536J276L08r53
51518A85361j278j08J505K110J584R69R00Q92J59j258k382k144m48J540K370J536
51502A91308l21k229l378l134j444O02J502J042N49J060K008K249J618P53j5p53
51486A91417j323j481j255o93L51J610K115J363K94K20J088J605R23n17j559j134
51470A93024J112M205O192N966M419L166K587K076J554J525J907K053J821J559
51456B33166J252P41O10J463K507K253P27m63l92J96M47N61R28J369J737K149
51440B49251K245J382m6p46n13o89j973l008k247r3J738K299J827R05P4k43j78
51423B49985l87j010j393j207j114j593k131k207k198k440k258j097J20l2j444
$$ plain form
51533 194771 195381 193728 191322 190011 189669 188590 186000 183142 181678 181942 183194 184730 186006 186314 185361
51518 185361 184083 183975 185480 187590 189174 190143 191043 191935 192094 190836 188454 186310 185862 187402 189772 191308
51502 191308 190987 188758 185380 182246 180802 181404 182906 183948 184497 185557 187565 189814 191432 192185 192170 191417
51486 191417 190094 188613 187358 186665 187016 188626 190741 192104 192398 192618 193706 195311 196234 195717 194158 193024
51470 193024 194136 198341 204533 210499 214918 218084 220671 222747 224301 225826 227733 229786 231607 233166
51456 233166 234418 235159 235769 237232 239739 241992 242719 242256 241864 242060 242507 243068 243996 245365 247102 249251
51440 249251 251496 252878 252832 252086 251573 250884 248911 245903 243656 243563 245301 247600 249427 250332 250406 250163 249985
51423 249985 249598 248588 247195 245988 244874 243281 241150 238943 236745 234305 232047 230950 231070 231038 229594
51408B29594k532k181p56P45J787K404K771K810K252J189L89M18O18j71j780k805
51392B34752k723k619l191l537k856k015k085k523k377k377l855n992o208l587
51378A88807k19J420J255R34J285J374n9k853n305n690l793q58J659K976K920
51363A83853J942J199J628K514K026l16k645k976j508J12R30J147J100R43Q79
51348A90828Q81N68L3J45J196K054J599L18o72j343k271l143l170k556k099j703
51332A80665p75J99O8j008j544p53O56J893K829L229K600J276M51O48J127J092
51316A92653M69o48k118k939j694J417M033M030J788o98k296l364m377m939m386
51301A76931k809j124k57l53q74j362j804k166k107j474p54o16j266k460l631
$$ plain form
51408 229594 227062 224881 224125 224870 226657 229061 231832 234642 236894 238083 238472 238890 239508 239337 237557 234752
51392 234752 232029 229410 226219 222682 219826 217811 215726 213203 210826 208449 204594 198602 192394 188807
51378 188807 188588 190008 191263 192197 193482 194856 194797 191944 186639 180949 177156 176298 177957 180933 183853
51363 183853 185795 186994 188622 191136 193162 192846 190201 187225 185717 185829 186759 187906 189006 189949 190828
51348 190828 191709 192277 192310 192455 193651 195705 197304 197622 196950 195607 193336 190193 187023 184467 182368 180665
51332 180665 179890 180089 180157 179149 177605 176852 177508 179401 182230 185459 188059 189335 189786 190434 191561 192653
51316 192653 193122 192474 190356 187417 185723 187140 191173 195203 196991 196293 193997 190633 186256 181317 176931
51301 176931 174122 172998 172741 172388 171514 170152 168348 166182 164075 162601 161847 161231 159965 157505 153874
51286A53874l777k090O67K232J231j163k781k882k018m63J588K861J875r32l491
51271A44731m506m312l397j728K72J553J717J331P59j16q55n71N97J392J192O34
51255A38693K07l61r71q35J84J207J767K180K175Q13j443k382q92J272J816P58
51239A44188k98n26j86M30Q99L65j386l097l464k707j744p23M01P76k64j716k079
51222A28869j486j061p04O33K516K896Q43k048l674l633k870k130j440n74N65
51207A16702J625J813P30q28j577j201m08L76J287J993J624K92n12J11R52K46
51191A23225j751k859j674P90K404K173Q46j26J15J388K680K877J695J12m49M37
51175A31883J657J745N12p57p64L74J375J222J54q95j520k103k752k610r50J335
$$ plain form
51286 153874 150097 148007 148674 150906 152137 150974 148193 145311 143293 142830 144418 147279 149154 148222 144731
51271 144731 140225 135913 132516 130788 131060 132613 134330 135661 136420 136304 135449 134878 135475 136867 138059 138693
51255 138693 138900 138539 137568 136733 136917 138124 139891 142071 144246 145059 143616 141234 140342 141614 143430 144188
51239 144188 143890 143364 143178 143608 144507 144872 143486 140389 136925 134218 132474 131751 132152 132928 132664 130948 128869
51222 128869 127383 126322 125618 126251 128767 131663 132506 130458 126784 123151 120281 118151 116711 116137 116702
51207 116702 118327 120140 120870 120042 118465 117264 116856 117232 118519 120512 122136 122428 121916 122027 122979 123225
51191 123225 121474 118615 116941 117731 120135 122308 123154 123028 123143 124531 127211 130088 131783 131895 131446 131883
51175 131883 133540 135285 135797 135040 134276 134650 136025 137247 137401 136506 134986 132883 130131 127521 126571 127906
51159A27906K393J780R91J034P77j033l087k790l8K308K236J067J152K451K887
51144A40034J377q69j992j416rJ035J244J107J281J703J840J681J745J950J424
51129A52135j9j070m58J251K170J190j129l408m512m007k276l45Q24J020Q17R95
51113A43178J813K522J816n24k642k410l95M08j524l941l673p34J849J832j53
51098A37422k111k828k293j152k18N9j4J33N74R68J167J190Q46J38k57L38J573
51081A35535K456K705K848L100K951K056P43m75j209r54O62K984M394L771J588
51066A63155p40k230k839k928k689k039r70J23O34M78L48R59K083K771K471J685
51050A60272J414K072K851K380L79j388p11K252M588L857R22j422j933j818k279
$$ plain form
51159 127906 130299 132079 133070 134104 134881 133848 130761 127971 127933 130241 132477 133544 134696 137147 140034
51144 140034 141411 140542 138550 137134 137125 138160 139404 140511 141792 143495 145335 147016 148761 150711 152135
51129 152135 152116 151046 150588 151839 154009 155199 154070 150662 146150 142143 139867 139522 140346 141366 142183 143178
51113 143178 144991 147513 149329 148805 146163 143753 143358 143766 142242 138301 134628 133894 135743 137575 137422
51098 137422 135311 132483 130190 129038 128820 128879 128865 128998 129572 130540 131707 132897 133743 133881 133624 133962 135535
51081 135535 137991 140696 143544 146644 149595 151651 152394 151919 150710 149756 150418 153402 157796 161567 163155
51066 163155 162415 160185 157346 154418 151729 149690 148720 148843 149477 149955 150303 151262 153345 156116 158587 160272
51050 160272 161686 163758 166609 168989 169368 167980 167269 169521 174109 177966 178888 177466 175533 173715 171436
51035A71436k722j845L89K566L124J580j141l443m334m096l354j984L97L063M340
51020A63976L431J304n43j498j726j383o41m7j23n83n08N58J880K246J265k18
51004A67390j176j451j381o97J146L402M068K220n22j933j938k220l419m293l762
50989A55434k450j538j066j97J434L203M134L674K129N90J58Q89J704J459L6j648
50973A67945k497k083q76L01R34R81N64K3J38J449L044L092J251m31jJ778K576
50956A78188J692N54L20N56N80O57J344K495L417L438K301O14k65L36J313J204
50940A98744L38K08R23J063J81l93J22O07j8j020j028J88K079M223N725N079K028
50923B19049j249k287j034N81J164P12k75j112q75O91K395K813K028J177P28L40
$$ plain form
51035 171436 168714 166869 167258 169824 172948 174528 173387 169944 165610 161514 158160 156176 156573 159636 163976
51020 163976 167407 168711 168168 166670 164944 163561 162920 162873 162750 162167 161659 162217 164097 166343 167608 167390
51004 167390 166214 164763 163382 162685 163831 167233 171301 173521 172999 171066 169128 166908 163489 159196 155434
50989 155434 152984 151446 150380 150183 151617 154820 158954 162628 164757 165347 165505 166394 168098 169557 169593 167945
50973 167945 165448 163365 162489 162790 163724 164705 165269 165292 165430 166879 169923 173015 174266 173835 173834 175612 178188
50956 178188 179880 180434 180754 181310 181890 182547 183891 186386 189803 193241 195542 196156 195891 196227 197540 198744
50940 198744 199082 199290 200213 201276 201457 201064 201186 201793 201775 200755 199727 199915 201994 206217 211942 217021 219049
50923 219049 217800 215513 214479 215060 216224 216936 216661 215549 214674 215365 217760 220573 222601 223778 224506 224846
50907B24846J66Q91K497M006M609M261L322K347K041K571L108K869K236K068K316
50892B64154K391K448L080M017M517M770N435N937N043L313L037N035P284P836
50878C28297P457P983R398J0283J0444J1066J2323J2631J0838P982O091N990O880
50865D47663P669P896P380N756K841n81k920l131j874r31j416k801l721l438k333
50850D56059j264o61k45M92J488K023J658J040J268K564M085N118N761O271O406
50835D92063N976N519N845P100Q663R799J0113R602Q727Q210Q356Q704Q614P988
50821F05279P071N879M441L366L360M085M202K856N83j524l045m151m901n285
50807F22216n659o335o799o232n040m948o878r352r914p994n385l894l487l092
$$ plain form
50907 224846 225012 225903 228400 232406 237015 241276 244598 246945 248986 251557 254665 257534 259770 261838 264154
50892 264154 266545 268993 272073 276090 280607 285377 290812 296749 301792 305105 308142 313177 320461 328297
50878 328297 335754 343737 353135 363418 373862 384928 397251 409882 420720 428702 434793 440783 447663
50865 447663 455332 463228 470608 476364 479205 478624 475704 472573 470699 469768 468352 465551 461830 458392 456059
50850 456059 454795 454134 453889 454381 455869 457892 459550 460590 461858 464422 468507 473625 479386 485657 492063
50835 492063 498039 503558 509403 516503 525166 534965 545078 554680 563407 571617 579973 588677 597291 605279
50821 605279 612350 618229 622670 626036 629396 633481 637683 640539 641122 639598 636553 632402 627501 622216
50807 622216 616557 610222 603423 597191 592151 587203 580325 570973 561059 553065 547680 543786 540299 537207
50793E37207k276j419q64p56j335k479l236k793j795j673k473k462m01K740N001
50778E20986N685N533N309N196N350O008O924P470P469P424P816Q810J0547J3070
50764F23597J5802J7862J9143K0347K1625K2096K1429K1043K2625K5723K8071
50753H59363K8298K7343K6768K6673K5884K3684K0639J7899J6212J5499J4938
50742A103200J3693J1816J0365J0215J0876J0965R824Q375Q229J0165J3397J6096
50730A237216J6855J6101J5968J8199K2190K5749K7888K9904L3219L7118L9704
50719A520111M0596M1308M2853M4237M3925M1939L9663L8084L6910L5105L1719
50708A956450K6506K0485J5627J3165J2240J0787P591K722l674j1607k0026k6808
$$ plain form
50793 537207 534931 533512 532648 531892 530557 528078 524842 522049 520254 518581 516108 513646 513245 515985 520986
50778 520986 526671 532204 537513 542709 548059 554067 560991 568461 575930 583354 591170 599980 610527 623597
50764 623597 639399 657261 676404 696751 718376 740472 761901 782944 805569 831292 859363
50753 859363 887661 915004 941772 968445 994329 1018013 1038652 1056551 1072763 1088262 1103200
50742 1103200 1116893 1128709 1139074 1149289 1160165 1171130 1180954 1189329 1197558 1207723 1221120 1237216
50730 1237216 1254071 1270172 1286140 1304339 1326529 1352278 1380166 1410070 1443289 1480407 1520111
50719 1520111 1560707 1602015 1644868 1689105 1733030 1774969 1814632 1852716 1889626 1924731 1956450
50708 1956450 1982956 2003441 2019068 2032233 2044473 2055260 2062851 2065573 2061899 2050292 2030266 2003458
50696B003458l0902l3466l6012l8275l9164l9043l9425m0584m1046l9775l7465
50685A588301l5189l2839k9728k5994k2586k0267j9004j7984j6075j2926r593
50674A346116p260n235j532M012Q775J0570J0527J1255J3187J4593J4611J4070
50662A433689J3404J1749Q646M894J151k862p032j0269j2175j3879j5973j6984
50650A394359j5405j2375j0474j0289r981q177n436k553Q54N064Q943J1311J2831
50637A358672J5090J8011J9720J9278J8186J8307J9299J9420J8311J7487J7781
50626A559562J7911J6501J4396J3526J4132J4723J4705J5394J7820K0940K3090
50615A742700K4255K5802K8297L0889L2825L4697L7740M2425M8051N3674N9173
$$ plain form
50696 2003458 1972556 1939090 1903078 1864803 1825639 1786596 1747171 1706587 1665541 1625766 1588301
50685 1588301 1553112 1520273 1490545 1464551 1441965 1421698 1402694 1384710 1368635 1355709 1346116
50674 1346116 1338856 1333621 1332089 1336101 1344876 1355446 1365973 1377228 1390415 1405008 1419619 1433689
50662 1433689 1447093 1458842 1467488 1472382 1473533 1470671 1463639 1453370 1441195 1427316 1411343 1394359
50650 1394359 1378954 1366579 1356105 1345816 1335835 1327658 1322222 1319669 1320523 1325587 1334530 1345841 1358672
50637 1358672 1373762 1391773 1411493 1430771 1448957 1467264 1486563 1505983 1524294 1541781 1559562
50626 1559562 1577473 1593974 1608370 1621896 1636028 1650751 1665456 1680850 1698670 1719610 1742700
50615 1742700 1766955 1792757 1821054 1851943 1884768 1919465 1957205 1999630 2047681 2101355 2160528
50604B160528O5300P2431P9476Q4519Q6727Q7118Q7123Q6962Q5960Q3943Q1479
50593C061566P8942P6101P2814O9525O6743O4392O1823N8403N3980M8870M3429
50582C756588L7697L1777K6596K3708K3771K5493K6786K6981K7351K9304L2547
50571D068599L5417L6664L6353L5038L2549K8247K2409J6486J1414O158r94r812
50559D318528j8001k4047k8835l3648l7653l8745l6327l1852k6830k1580j6056
50548D004954j0628n764j838L52j15l081p198j1467j6201k2186k9713l8811m9431
50535C808873o0712p0948p9161q6082r2665r8275j01417j01820j00588r8411r5012
50524B823782r0536q6141q2568p8934p3880o7499o1414n7105n4652n3010n0942
$$ plain form
50604 2160528 2225828 2298259 2377735 2462254 2548981 2636099 2723222 2810184 2896144 2980087 3061566
50593 3061566 3140508 3216609 3289423 3358948 3425691 3490083 3551906 3610309 3664289 3713159 3756588
50582 3756588 3794285 3826062 3852658 3876366 3900137 3925630 3952416 3979397 4006748 4036052 4068599
50571 4068599 4104016 4140680 4177033 4212071 4244620 4272867 4295276 4311762 4323176 4329334 4328340 4318528
50559 4318528 4300527 4276480 4247645 4213997 4176344 4137599 4101272 4069420 4042590 4021010 4004954
50548 4004954 3994326 3988562 3986724 3987076 3986961 3983880 3976682 3965215 3949014 3926828 3897115 3858304 3808873
50535 3808873 3748161 3677213 3598052 3511970 3419305 3321030 3219613 3117793 3017205 2918794 2823782
50524 2823782 2733246 2647105 2564537 2485603 2411723 2344224 2282810 2225705 2171053 2118043 2067101
50513B067101m7739m3400l8421l3378k8665k4547k1195j8570j6346j3943j0619
50502A770278n809J32N604Q949J0247J1328J3551J6349J8606K0781K4372K9624
50490A924012L5147L9997M4833N0456N6396O1896O7348P3619Q0372Q6241R0464
50479B610781R3388R5523R7072R8455J00253J02482J04722J07152J10546J15053
50469C635427J19864J24532J29658J35628J41486J46000J49352J52829J56951
50460D891727J60759J63100J64055J64730J65779J66276J64231J58418J49480
50451F348555J38665J25702J08826Q7287O2765L7603J2545j2791l7883o1255q2306
50440F727713j01689j19368j33400j41480j43239j40371j34753j26871j15940
$$ plain form
50513 2067101 2019362 1975962 1937541 1904163 1875498 1850951 1829756 1811186 1794840 1780897 1770278
50502 1770278 1764469 1764601 1770205 1779154 1789401 1800729 1814280 1830629 1849235 1870016 1894388 1924012
50490 1924012 1959159 1999156 2043989 2094445 2150841 2212737 2280085 2353704 2434076 2520317 2610781
50479 2610781 2704169 2799692 2896764 2995219 3095472 3197954 3302676 3409828 3520374 3635427
50469 3635427 3755291 3879823 4009481 4145109 4286595 4432595 4581947 4734776 4891727
50460 4891727 5052486 5215586 5379641 5544371 5710150 5876426 6040657 6199075 6348555
50451 6348555 6487220 6612922 6721748 6809035 6871800 6909403 6921948 6909157 6871274 6810019 6727713
50440 6727713 6626024 6506656 6373256 6231776 6088537 5948166 5813413 5686542 5570602
50431E570602j01223q3285o4216m6590l2077k1062j3412r347r533j4603k4692
50420E150562l9137n6451p4880r3271j11262j28336j42888j52811j57452j58562
50410D035512j58649j58371j56340j51716j45988j41133j36851j31155j23545
50401B731764j15879j09615j03762r6614q8246q0051p2659o5758n9355n3887m9221
50390A836717m4704m0083l5475l0915k6773k4055k2863k1275j7441j2506r402
50379A551225q673p677m472l25K793N250Q527J2364J5064J6149J7072J9429K3583
50366A650309K8837L3977L7906M0722M3910M8665N4382N9542O3728O7755P2226
50355B201959P6969Q1668Q6054Q9726R2704R5949J00208J04642J07873J10127
$$ plain form
50431 5570602 5469379 5386094 5321878 5275288 5243211 5222149 5208737 5199390 5189857 5175254 5150562
50420 5150562 5111425 5054974 4980094 4886823 4775561 4647225 4504337 4351526 4194074 4035512
50410 4035512 3876863 3718492 3562152 3410436 3264448 3123315 2986464 2855309 2731764
50401 2731764 2615885 2506270 2402508 2305894 2217648 2137597 2064938 1999180 1939825 1885938 1836717
50390 1836717 1792013 1751930 1716455 1685540 1658767 1634712 1611849 1590574 1573133 1560627 1551225
50379 1551225 1542552 1534875 1530403 1530078 1532871 1538121 1546648 1559012 1574076 1590225 1607297 1626726 1650309
50366 1650309 1679146 1713123 1751029 1791751 1835661 1884326 1938708 1998250 2061978 2129733 2201959
50355 2201959 2278928 2360596 2446650 2536376 2629080 2725029 2825237 2929879 3037752 3147879
50345C147879J12886J16260J18287J17298J13558J08014J00924R2766Q4947P8205
50335D191024P1129O1840N0561L8875K6740J2195n582k4473m1627n6354o9793
50324D254535q2472r3516j01933j07599j10707j11079j08452j02918r4885q5091
50314C255883p4844o5510n7286m8922l9423k9807k2357j8224j6576j6245j7358
50303B849331k0857k6981l4972m3786n2466n9968o5406o8682p0517p1699p2444
50292B261553p2430p1247o8867o5829o2783n9758n6210n2076m8305m5745m3931
50281A614372m1748l9047l6650l4718l2200k8359k3996k0534j8495j7389j6677
50270A304559j6038j5040j3348j1208r251p907p340p605q345q643p869o552n708
$$ plain form
50345 3147879 3260765 3377025 3495312 3612610 3726168 3834182 3935106 4027872 4112819 4191024
50335 4191024 4262153 4323993 4374554 4413429 4440169 4452364 4446782 4422309 4380682 4324328 4254535
50324 4254535 4172063 4078547 3976614 3869015 3758308 3647229 3538777 3435859 3340974 3255883
50314 3255883 3181039 3115529 3058243 3009321 2969898 2940091 2917734 2899510 2882934 2866689 2849331
50303 2849331 2828474 2801493 2766521 2722735 2670269 2610301 2544895 2476213 2405696 2333997 2261553
50292 2261553 2189123 2117876 2049009 1983180 1920397 1860639 1804429 1752353 1704048 1658303 1614372
50281 1614372 1572624 1533577 1496927 1462209 1430009 1401650 1377654 1357120 1338625 1321236 1304559
50270 1304559 1288521 1273481 1260133 1248925 1239674 1231767 1224427 1216822 1208477 1199834 1191965 1185413 1179705
50257A179705n333m468k820j479j477k323k609j716k83Q92J864L334N722Q626
50243A177635J1163J2878J4216J5970J8364K0921K3094K4512K4680K3112K0077
50232A386622J6663J3766J1458R648Q625Q307P555N160J285k962p077j1417j5988
50219A431645k0089k3238k5562k6912k6703k5148k3751k3666k4177k3761k2257
50208A166381k0939k0458j9791j7705j4640j2401j2071j2744j2663j1375j0195
50197A001399j0303j0980j0503q635p176p651r288j0100r351q041p135o467n594
50184H90175m839m860n628o355o332n345l518j307L27L93j029k565l080k979l206
50169H39852l177j196K545M952L429n91l352l447k853l280l868l358k475k551
$$ plain form
50257 1179705 1174372 1169904 1167084 1165605 1164128 1161805 1159196 1157480 1157197 1158089 1159953 1163287 1169009 1177635
50243 1177635 1188798 1201676 1215892 1231862 1250226 1271147 1294241 1318753 1343433 1366545 1386622
50232 1386622 1403285 1417051 1428509 1438157 1446782 1455089 1462644 1467804 1469089 1466127 1459050 1447633 1431645
50219 1431645 1411556 1388318 1362756 1335844 1309141 1283993 1260242 1236576 1212399 1188638 1166381
50208 1166381 1145442 1124984 1105193 1087488 1072848 1060447 1048376 1035632 1022969 1011594 1001399
50197 1001399 991096 980116 969613 960978 953802 946151 936863 926763 917412 909371 902236 895769 890175
50184 890175 885336 880476 874848 868493 862161 856816 853298 851991 852318 852711 851682 849117 846037 843058 839852
50169 839852 836675 835479 838024 842976 846405 845814 842462 839015 836162 832882 829014 825656 823181 820630
50155H20630l241l382l162l606m431m261k852j514j183j353j200o10P5M21j06
50140G90225j475k475j769L17K079K575K401K280K165K161K943M553N798N704
50126H17482M791M249M403M775N025N250N704O667Q166R462R413P852N980M934
50112I04153M546M049L473L581M783O724Q738J0232J0774J0355R480Q769Q546
50099I98203Q912R843J1109J2395J3607J4724J5427J5407J5035J5070J5639J6165
50087A161536J6295J6151J5754J5176J5178J6468J8037J7803J5422J3120J2915
50076A333855J4416J6228J8042K0017K1476K1925K2438K4260K6782K8646L0265
50065A578350L3282L7882M2630M7025N2177N8641O5347P1299P6644Q1423Q4712
$$ plain form
50155 820630 817389 814007 810845 807239 802808 798547 795695 794181 792998 791645 790445 789835 789910 790331 790225
50140 790225 788750 786275 784506 784823 786902 789477 791878 794158 796323 798484 801427 805980 811778 817482
50126 817482 822273 826522 830925 835700 840725 845975 851679 858346 866512 875974 885387 893239 899219 904153
50112 904153 908699 912748 916221 919802 924585 931309 940047 950279 961053 971408 980888 989657 998203
50099 998203 1007115 1016958 1028067 1040462 1054069 1068793 1084220 1099627 1114662 1129732 1145371 1161536
50087 1161536 1177831 1193982 1209736 1224912 1240090 1256558 1274595 1292398 1307820 1320940 1333855
50076 1333855 1348271 1364499 1382541 1402558 1424034 1445959 1468397 1492657 1519439 1548085 1578350
50065 1578350 1611632 1649514 1692144 1739169 1791346 1849987 1915334 1986633 2063277 2144700 2229412
50054B229412Q5938Q5844Q5224Q3636Q0205P4841O7926N9860N1798M5691M2264
50043B992639L9568L4958K8166K1073J4565P190k821j5383k9099m2850n5852o6878
50031B925276p4740p9588q2710q4783q5139q3223p9837p6205p2358o7527o1800
50020B077366n6288n1664m7708m4412m2246m0739l8094l3203k7248k2327j9266
50009A654171j7569j6665j6025j4722j2397j0240r678j0291j0340r152p564o080
49997A513448m339k614k081k917l523k550n96R36J583J563Q77j49k49J502M123
49982A505014N664N586N257O049P903R878J1422J2595J3460J3733J3194J2345
49970A622100J2370J4036J6716J8937J9993K0536K1510K3037K4535K5501K5980
$$ plain form
50054 2229412 2315350 2401194 2486418 2570054 2650259 2725100 2793026 2852886 2904684 2950375 2992639
50043 2992639 3032207 3067165 3095331 3116404 3130969 3138159 3135338 3119955 3090856 3048006 2992154 2925276
50031 2925276 2850536 2770948 2688238 2603455 2518316 2435093 2355256 2279051 2206693 2139166 2077366
50020 2077366 2021078 1969414 1921706 1877294 1835048 1794309 1756215 1723012 1695764 1673437 1654171
50009 1654171 1636602 1619937 1603912 1589190 1576793 1566553 1556875 1546584 1536244 1527092 1519528 1513448
49997 1513448 1509109 1506495 1504414 1501497 1497974 1495424 1494828 1495764 1497347 1498910 1499787 1499638 1499389 1500891 1505014
49982 1505014 1510678 1516264 1521521 1527570 1535473 1545351 1556773 1569368 1582828 1596561 1609755 1622100
49970 1622100 1634470 1648506 1665222 1684159 1704152 1724688 1746198 1769235 1793770 1819271 1845251
49959A845251K6696K8740L2449L6396L8415L8067L7355L8491M1678M5788N0349
49948B259675N5798O2261O9225P6412Q4120R2606J01694J10987J19962J27930
49938C160670J34425J39442J42784J43472J40536J34251J25948J16738J07259
49929D345525R8505R1739Q7039Q2546P5832O5771N2871L8122K1885L704j6970
49918D946569l9696o2663q3702j01782j17108j29886j39677j46245j50319j52832
49908C822659j53847j52919j50205j46372j41521j35034j26810j17902j09484
49899B588565j01801r4620q8177q2754p7670p1721o4837n8381n3365m9167m4663
49888A801409m0049l6535l4503l2901l0668k7928k5461k3607k2207k1277k1054
$$ plain form
49959 1845251 1871947 1900687 1933136 1969532 2007947 2046014 2083369 2121860 2163538 2209326 2259675
49948 2259675 2315473 2377734 2446959 2523371 2607491 2700097 2801791 2912778 3032740 3160670
49938 3160670 3295095 3434537 3577321 3720793 3861329 3995580 4121528 4238266 4345525
49929 4345525 4444030 4535769 4622808 4705354 4781186 4846957 4899828 4937950 4959835 4963539 4946569
49918 4946569 4906873 4844210 4760508 4658726 4541618 4411732 4272055 4125810 3975491 3822659
49908 3822659 3668812 3515893 3365688 3219316 3077795 2942761 2815951 2698049 2588565
49899 2588565 2486764 2392144 2303967 2221213 2143543 2071822 2006985 1948604 1895239 1846072 1801409
49888 1801409 1761360 1724825 1690322 1657421 1626753 1598825 1573364 1549757 1527550 1506273 1485219
49877A485219k1423k1654k1022j9500j7641j5794j3780j1551r812r282r414q685
49865A305661o566m308l170k715j805n87j24m61n18N9N42P89J713L530N032N498
49849A302570N963P421R041R641R872J1265J3490J4574J3858J3061J3872J5789
49837A440417J7143J7320J7205J7908J9733K2199K4637K6808K9035L1690L4777
49826A698872L8347M3012M9356N6866O4147P0328P5695Q0860Q5951R0738R4886
49815B449058R7725R8443R6757R3010Q7308P9387O9746O0196N2457M6572M1405
49804C272064L6285L1289K6059J9330R963k182j6483l2047m7706o2231p5096q6502
49792C072743r6142j02427j03894j01321r7493r4515r1938q7944q1831p4731o8185
$$ plain form
49877 1485219 1463796 1442142 1421120 1401620 1383979 1368185 1354405 1342854 1333042 1323760 1314346 1305661
49865 1305661 1299095 1294787 1291617 1288902 1287097 1286510 1286386 1285925 1285407 1285466 1286008 1286797 1288510 1292040 1297072 1302570
49849 1302570 1308533 1315954 1324995 1334636 1344508 1355773 1369263 1383837 1397695 1410756 1424628 1440417
49837 1440417 1457560 1474880 1492085 1509993 1529726 1551925 1576562 1603370 1632405 1664095 1698872
49826 1698872 1737219 1780231 1829587 1886453 1950600 2020928 2096623 2177483 2263434 2354172 2449058
49815 2449058 2546783 2645226 2741983 2834993 2922301 3001688 3071434 3131630 3184087 3230659 3272064
49804 3272064 3308349 3339638 3365697 3385027 3394990 3392808 3376325 3344278 3296572 3234341 3159245 3072743
49792 3072743 2976601 2874174 2770280 2668959 2571466 2476951 2385013 2297069 2215238 2140507 2072322
49781B072322o2743n8021n3565m9276m5251m1455l7725l4046l0763k8209k6132
49770A605136k3927k1558j9767j8951j8374j7193j5779j5135j5201j4806j3319
49759A411126j1317r382p373n326l991l750l846l553l300l695m164l758k916k995
$$ plain form
49781 2072322 2009579 1951558 1897993 1848717 1803466 1762011 1724286 1690240 1659477 1631268 1605136
49770 1605136 1581209 1559651 1539884 1520933 1502559 1485366 1469587 1454452 1439251 1424445 1411126
49759 1411126 1399809 1390427 1383054 1377728 1373737 1369987 1366141 1362588 1359288 1355593 1351429 1347671 1344755 1341760
$$ [...]
##END NTUPLES=NMR SPECTRUM
##END=
