##TITLE=coffee_type ROVE100-17-0203
COFFEE_meoh_noesyp64 COFFEE_meoh {C:\Bruker\TOPSPIN} Administrator 5
##JCAMPDX= 6.0         $$ Bruker NMR JCAMP-DX V2.0
##DATA TYPE= NMR SPECTRUM
##DATA CLASS= NTUPLES
##ORIGIN= Bruker BioSpin GmbH
##OWNER= Administrator
$$ 1.72 TOPSPIN		Version 2.1
$$ 2012-05-29 13:26:11.845 -0700  Administrator@X
$$ Compression mode = diff/dup
##.OBSERVE FREQUENCY= 400.13188235
##.OBSERVE NUCLEUS= ^1H
##.ACQUISITION MODE= SIMULTANEOUS (DQD)
##.ACQUISITION SCHEME= undefined
##.AVERAGES= 64
##.DIGITISER RES= 22
##SPECTROMETER/DATA SYSTEM= spect
##.PULSE SEQUENCE= noesygpps1d.comp
##.SOLVENT NAME= COFFEE_meoh
##.SHIFT REFERENCE= INTERNAL, COFFEE_meoh, 1, 14.98061
##AUDIT TRAIL= $$ (NUMBER, WHEN, WHO, WHERE, PROCESS, VERSION, WHAT)
$$ ##TITLE= Audit trail, TOPSPIN		Version 2.1
$$ ##JCAMPDX= 5.01
$$ ##ORIGIN= Bruker BioSpin GmbH
$$ ##OWNER= Administrator
$$ $$ Z:/data/jwist/nmr/12-COFFEE-0203/72/pdata/1/auditp.txt
$$ ##AUDIT TRAIL=  $$ (NUMBER, WHEN, WHO, WHERE, PROCESS, VERSION, WHAT)
(   1,<2012-03-02 21:48:33.709 -0500>,<Administrator>,<TOPSPIN>,<go>,<TOPSPIN 2.1>,
      <created by zg
	started at 2012-03-02 21:37:03.068 -0500,
	POWCHK enabled, PULCHK disabled,
       configuration hash MD5:
       1A 1E CE 29 27 FD 77 03 67 4E F0 E3 C4 B2 CB 90
       data hash MD5: 64K
       C1 B2 5E 8A D2 8F 5C 02 71 85 38 BE 70 59 5B 43>)
(   2,<2012-03-02 21:48:38.631 -0500>,<Administrator>,<TOPSPIN>,<audit>,<TOPSPIN 2.1>,
      <user comment:
       ICON-NMR User ID: Administrator
       data hash MD5: 64K
       C1 B2 5E 8A D2 8F 5C 02 71 85 38 BE 70 59 5B 43>)
(   3,<2012-05-29 09:24:11.597 -0700>,<Administrator>,<X>,<proc1d>,<TOPSPIN 2.1>,
      <Start of raw data processing
       efp LB = 0.3 FT_mod = 6 PKNL = 1 PHC0 = 0 PHC1 = 0 SI = 128K 
       data hash MD5: 128K
       08 A2 4A 35 55 0B F1 E4 57 66 39 1E FD 30 59 BD>)
(   4,<2012-05-29 09:24:12.190 -0700>,<Administrator>,<X>,<proc1d>,<TOPSPIN 2.1>,
      <pk PHC0 = 38.03467 PHC1 = 0 
       data hash MD5: 128K
       BD 43 0A FB 12 76 9E F6 8A FC C4 CB EB 0F E3 F1>)
(   5,<2012-05-29 09:24:13.237 -0700>,<Administrator>,<X>,<proc1d>,<TOPSPIN 2.1>,
      <abs ABSG = 1 
       data hash MD5: 128K
       1D 01 43 B9 53 EC A6 FB 91 B5 51 17 C6 08 32 C1>)
(   6,<2012-05-29 09:24:13.315 -0700>,<Administrator>,<X>,<proc1d>,<TOPSPIN 2.1>,
      <abs ABSG = 2 
       data hash MD5: 128K
       42 48 57 7B 60 CA BD 04 B3 9C 72 5F 3D C5 32 FB>)
(   7,<2012-05-29 09:24:13.409 -0700>,<Administrator>,<X>,<proc1d>,<TOPSPIN 2.1>,
      <abs ABSG = 3 
       data hash MD5: 128K
       C8 D9 1F 2F DF 73 FA 54 F6 E4 9B 09 A5 8B 0B C2>)
(   8,<2012-05-29 09:24:13.487 -0700>,<Administrator>,<X>,<proc1d>,<TOPSPIN 2.1>,
      <abs ABSG = 4 
       data hash MD5: 128K
       25 64 25 87 15 C9 6A 9F B4 41 FA 8D 03 10 17 E2>)
(   9,<2012-05-29 09:24:13.565 -0700>,<Administrator>,<X>,<proc1d>,<TOPSPIN 2.1>,
      <abs ABSG = 5 
       data hash MD5: 128K
$$ [...]
150 150 150 150 150 150 150 150
##$TP07= 0
##$TPNAME0= <>
##$TPNAME1= <>
##$TPNAME2= <>
##$TPNAME3= <>
##$TPNAME4= <>
##$TPNAME5= <>
##$TPNAME6= <>
##$TPNAME7= <>
##$TPOAL= (0..7)
0.5 0.5 0.5 0.5 0.5 0.5 0.5 0.5
##$TPOFFS= (0..7)
0 0 0 0 0 0 0 0
##$TUNHIN= 0
##$TUNHOUT= 0
##$TUNXOUT= 0
##$USERA1= <user>
##$USERA2= <user>
##$USERA3= <user>
##$USERA4= <user>
##$USERA5= <user>
##$V9= 5
##$VALIST= <valist>
##$VCLIST= <CCCCCCCCCCCCCCC>
##$VD= 0
##$VDLIST= <DDDDDDDDDDDDDDD>
##$VPLIST= <PPPPPPPPPPPPPPP>
##$VTLIST= <TTTTTTTTTTTTTTT>
##$WBST= 1024
##$WBSW= 4
##$XGAIN= (0..3)
0 0 0 0
##$XL= 0
##$YL= 0
##$YMAX_a= 10544808
##$YMIN_a= -4954945
##$ZGOPTNS= <>
##$ZL1= 120
##$ZL2= 120
##$ZL3= 120
##$ZL4= 120
##$ABSF1= 14.98061
##$ABSF2= -5.57192
##$ABSG= 5
##$ABSL= 3
##$ALPHA= 0
##$AQORDER= 0
##$ASSFAC= 0
##$ASSFACI= 0
##$ASSFACX= 0
##$ASSWID= 0
##$AUNMP= <proc_prof1d_extract>
##$AXLEFT= 0
##$AXNAME= <>
##$AXNUC= <1H>
##$AXRIGHT= 0
##$AXTYPE= 0
##$AXUNIT= <>
##$AZFE= 0.1
##$AZFW= 0.1
##$BCFW= 0
##$BC_mod= 0
##$BYTORDP= 0
##$COROFFS= 0
##$CY= 15
##$DATMOD= 1
##$DC= 0
##$DFILT= <>
##$DTYPP= 0
##$F1P= 0
##$F2P= 0
##$FCOR= 0.5
##$FTSIZE= 131072
##$FT_mod= 6
##$GAMMA= 0
##$GB= 0
##$INTBC= 1
##$INTSCL= 1
##$ISEN= 128
##$LB= 0.3
##$LEV0= 0
##$LPBIN= 0
##$MAXI= 10000
##$MC2= 0
##$MEAN= 0
##$ME_mod= 0
##$MI= 0
##$NCOEF= 0
##$NC_proc= -3
##$NLEV= 6
##$NOISF1= 0
##$NOISF2= 0
##$NSP= 0
##$NTH_PI= 0
##$NZP= 0
##$OFFSET= 14.98061
##$PC= 1
##$PHC0= 38.03467
##$PHC1= 0
##$PH_mod= 1
##$PKNL= yes
##$PPARMOD= 0
##$PPDIAG= 0
##$PPIPTYP= 0
##$PPMPNUM= 2147483647
##$PPRESOL= 1
##$PSCAL= 4
##$PSIGN= 0
##$PYNMP= <proc.py>
##$REVERSE= no
##$SF= 400.13
##$SI= 131072
##$SIGF1= 0
##$SIGF2= 0
##$SINO= 400
##$SIOLD= 131072
##$SPECTYP= <>
##$SREGLST= <1H.CDCl3>
##$SSB= 0
##$STSI= 131072
##$STSR= 0
##$SW_p= 8223.68421052632
##$SYMM= 0
##$S_DEV= 0
##$TDeff= 65536
##$TDoff= 0
##$TI= <>
##$TILT= no
##$TM1= 0
##$TM2= 0
##$TOPLEV= 0
##$USERP1= <user>
##$USERP2= <user>
##$USERP3= <user>
##$USERP4= <user>
##$USERP5= <user>
##$WDW= 1
##$XDIM= 131072
##$YMAX_p= 447503654
##$YMIN_p= -123007858
##$CURPLOT= <Network HP LaserJet P1505>
##$CURPRIN= <$Network HP LaserJet P1505>
##$DFORMAT= <normdp>
##$LAYOUT= <+/1D_H.xwp>
##$LFORMAT= <normlp>
##$PFORMAT= <normpl>
##$SURQMSG= 1
$$ End of Bruker specific parameters
$$ ---------------------------------
##NTUPLES= NMR SPECTRUM
##VAR_NAME=  FREQUENCY,     SPECTRUM/REAL,   SPECTRUM/IMAG
##SYMBOL=    X,             R,               I
##VAR_TYPE=  INDEPENDENT,   DEPENDENT,       DEPENDENT
##VAR_FORM=  AFFN,          ASDF,            ASDF
##VAR_DIM=   131072,        131072,          131072
##UNITS=     HZ,            ARBITRARY UNITS, ARBITRARY UNITS
##FACTOR=    0.0627417313425165, 1,          1
##FIRST=     8223.62146879498, -4972,        -67382
##LAST=      0,             -3199,           -68630
##MIN=       0,             -123007858,      0
##MAX=       8223.62146879498, 447503654,    0
$$ Real data points
##PAGE= N=1
##DATA TABLE= (X++(R..R)), XYDATA
$$ [...]
60932C415982J40059J52585J66114J79436J93422K09236K26692K45697K67064
$$ 3415982 3556041 3708626 3874740 4054176 4247598 4456834 4683526 4929223 5196287
60923E196287K90231L12482L32209L50667L68962L86456M04414M27556M58836
$$ 5196287 5486518 5799000 6131209 6481876 6850838 7237294 7641708 8069264 8528100
60914H528100M95891N35924N80335O30463O82867P34399P88785Q52874R30082
$$ 8528100 9023991 9559915 10140250 10770713 11453580 12187979 12976764 13829638 14759720
60905A4759720J023783J143239J298010J489362J715345J980508K290738K643126
$$ 14759720 15783503 16926742 18224752 19714114 21429459 23409967 25700705 28343831
60897B8343831L034359L473990L970308M507115N061534N638500O223492O652385
$$ 28343831 31378190 34852180 38822488 43329603 48391137 54029637 60253129 66905514
60889F6905514O580581N704118M083417K213452P06587j12317l01760p5068L97941
$$ 66905514 73486095 79190213 83273630 85487082 86193669 86081352 85779592 85704524 86102465
60880H6102465R24085J144492O41713p23035k614241m420501n662028o220898
$$ 86102465 87026550 88171042 88812755 88089720 85475479 81054978 75392950 69172052
60872F9172052o251874n965717n512855m990816m470380l991836l563761l181861
$$ 69172052 62920178 56954461 51441606 46450790 41980410 37988574 34424813 31242952
60864C1242952k842916k541366k267294k014921j786734j586256j412593j263719
$$ 31242952 28400036 25858670 23591376 21576455 19789721 18203465 16790872 15527153
60856A5527153j138653j033709r41748q57919p82296p15282o54372n97174n43833
$$ 15527153 14388500 13354791 12413043 11555124 10772828 10057546 9403174 8806000 8262167
60847H262167m94759m49302m08362l74868l49842l30482l13467k97457k81417
$$ 8262167 7767408 7318106 6909744 6534876 6185034 5854552 5541085 5243628 4962211
60838D962211k63787k44963k27730k13465k00408j87044j74372j63119j51651
$$ 4962211 4698424 4453461 4225731 4012266 3811858 3624814 3450442 3287323 3135672
60829C135672j39041j27599j19666j13810j06980r8957r1896q6446q1052p4906
$$ 3135672 2996631 2869032 2749366 2635556 2528576 2429619 2337723 2251277 2170225 2095319
60819B095319o9210o5313o3088o1371n9026n5626n1817m8846m7225m6394m5889
$$ 2095319 2026109 1960796 1897708 1836337 1777311 1721685 1669868 1621022 1573797 1527403 1481514
60808A481514m5808m5647m4022m0588l7044l4988l3800l1920k9382k7431k6222
$$ 1481514 1435706 1390059 1346037 1305449 1268405 1233417 1199617 1167697 1138315 1110884 1084662
60797A084662k4567k1946j9382j8008j7720j7478j6233j3589j0166p442o633p539
$$ 1084662 1060095 1038149 1018767 1000759 983039 965561 949328 935739 925573 918131 911498 903959
60785I03959q697q712p353n556m529m688n384n862o185o698o889n924m365m051
$$ 903959 895262 886550 879197 873641 869112 864424 859040 853178 846993 840295 833406 827482 823117 819066
60771H19066n686p632p950o663n006l358j279Q16J503K13j699k264r62R03J778
$$ 819066 813380 805748 797798 791135 786129 782771 781492 782308 783811 784024 782325 780061 779099 780002 781780
60756G81780J611J815L355N335N990M827K924J303Q4o67m87N73J689K456L340
$$ 781780 783391 785206 788561 793896 799886 804713 807637 808940 809024 808357 807870 808443 810132 812588 815928
60741H15928M446N078N284O359Q571R762Q018M868L708N329P015O334L973K158
$$ 815928 820374 825452 830736 837095 845666 855428 863446 868314 872022 877351 884366 890700 894673 896831
60727H96831J723J710R40q65l004m309m150l280l168m340n986p333q555r888j0776
$$ 896831 898554 900264 901204 900339 897335 893026 888876 885596 882428 878088 872102 864769 856214 846326 835550
60712H35550j0581r507q045o048l225l19J167O14r71k142k377k093j693j206o03
$$ 835550 824969 815462 807417 801369 798144 797825 798992 799606 798635 796493 794116 792023 790330 789124 788521
60697G88521k7M91J154K048K904L472L919M443M705M273L620M010N881P960Q497
$$ 788521 788494 788985 790139 792187 795091 798563 802482 806925 811630 815903 819523 823533 829414 837374 845871
60682H45871P134N083L692L371L684L869L246J680k49j791k753l463m239n269
$$ 845871 853005 858088 861780 865151 868835 872704 875950 877630 877381 875590 872837 869374 865135 859866
60668H59866o781q712j0401j1186j1381j2027j3502j4861j4850j3269j1145r762
$$ 859866 853085 844373 833972 822786 811405 799378 785876 771015 756165 742896 731751 721989
60656G21989r628j0224j0670j0623j0359r984r163q009p481q093q725p842n757
$$ 721989 712361 702137 691467 680844 670485 660501 651338 643329 635848 627755 619030 611188 605431
60643F05431m481n173o855p915p840o993n696m224k983k085j262n85n63j112j444
$$ 605431 600950 595777 588922 581007 573167 566174 560478 556254 553271 551186 549924 549339 548776 547664 546220
60628E46220j452k121l652m466l290j272l95n81k59O26M49r95j479M10K879L393
$$ 546220 544768 542647 538995 534529 531239 529967 529572 528991 528732 529358 529807 528812 527333 527743 530622 534015
60612E34015K422K814N775R237J0558R622Q472Q630R696J0393J0231R709R283
$$ 534015 536437 539251 545026 554263 564821 574443 582915 591545 601241 611634 621865 631574 640857
60599F40857Q727P735O712O611P916J0023J1648J1839J0788R713R672J0408J0746
$$ 640857 649584 657319 664031 670642 678558 688581 700229 712068 722856 732569 742241 752649 763395
60586G63395J0281R954J0571J1419J1351J0625J0516J1191J1341J0074Q026O113
$$ 763395 773676 783630 794201 805620 816971 827596 838112 849303 860644 870718 878744 884857
60574H84857M295K215K14j215k303l570m895n794o217o355n905m368k109m88o59
$$ 884857 889152 891367 891581 890366 888063 884493 879598 873804 867587 861232 855327 850959 848850 848362 847703
60559H47703k391m184m557l485k459k721l520k790K26L847N866N851N078M990
$$ 847703 845312 841128 836571 833086 830627 827906 824386 821596 821822 825669 831535 837386 842464 847454
60545H47454O394R282J2480J4116J3626J2837J3910J6564J8595J8904J8572J8781
$$ 847454 853848 863130 875610 889726 903352 916189 930099 946663 965258 984162 1002734 1021515
60533A021515J9241J9181J8549J7344J4759J0232M779K91k444m221n951p399p668
$$ 1021515 1040756 1059937 1078486 1095830 1110589 1120821 1125600 1125891 1123447 1119226 1113275 1105876 1098208
60520A098208o620n495n896q047j0303j0737r230p591p545r053j0705j1279j0682
$$ 1098208 1091588 1086093 1080197 1072150 1061847 1051110 1041880 1034289 1026744 1017691 1006986 995707 985025
60507I85025r683r091q994q672p421n489l868l199l381m122n266o291o324n131
$$ 985025 975342 966251 957257 948585 941164 935675 931807 928608 925227 921105 915839 909548 903224 898093
60493H98093l521k251r95Q83L008M324M575M639N198N942O337O543P035P777Q436
$$ 898093 894572 892321 891326 892209 895217 899541 904116 908755 913953 919895 926232 932775 939810 947587 956023
60478I56023R116J0235J1609J2508J2841J3671J5941J9128K1860K3650K5286K7567
$$ 956023 965139 975374 986983 999491 1012332 1026003 1041944 1061072 1082932 1106582 1131868 1159435
60466A159435L0632L4577L9622M5093M9415N2175N5414O1709P1261Q2025R2396
$$ 1159435 1190067 1224644 1264266 1309359 1358774 1410949 1466363 1528072 1599333 1681358 1773754
60455A773754J02428J12484J22230J31329J39748J46606J49762J47457J39665
$$ 1773754 1876182 1988666 2110896 2242225 2381973 2528579 2678341 2825798 2965463
60446B965463J27179J10260Q9211O5662M1995J9556j814k2402m1505n7800p0379
$$ 2965463 3092642 3202902 3292113 3357775 3399770 3419326 3417512 3395110 3353605 3295805 3225426
60435C225426p9367q5629q9592r0364q6477p7972o6985n5652m3988l0689j5573
$$ 3225426 3146059 3060430 2970838 2880474 2793997 2716025 2649040 2593388 2549400 2518711 2503138
60424B503138j53J4094K7003L9080N0403O0284O7292O9555O5936N7301M6047L4009
$$ 2503138 2502985 2517079 2544082 2583162 2633565 2693849 2761141 2830696 2896632 2953933 2999980 3033989
60412C033989K1488Q704k561r581j0902p438j452N160J1653J8058K4429L0692
$$ 3033989 3055477 3064181 3061620 3052039 3041137 3033699 3032247 3037407 3049060 3067118 3091547 3122239
60400C122239L7130M4667N4260O6073P9527R4179J10222J28126J48211J70704
$$ 3122239 3159369 3204036 3258296 3324369 3403896 3498075 3608297 3736423 3884634 4055338
60390D055338J95914K24168K55715K90714L29193L71088M16502M65494N17136
$$ 4055338 4251252 4475420 4731135 5021849 5351042 5722130 6138632 6604126 7121262
60381G121262N68876O17337O59287O90924P06160O96871O55694N78810M66735
$$ 7121262 7690138 8307475 8966762 9657686 10363846 11060717 11716411 12295221 12761956
60372A2761956L24117J59699j4545j85578l41301m71486n69030o32036o64145
$$ 12761956 13086073 13245772 13231227 13045649 12704348 12232862 11663832 11031796 10367651
60363A0367651o71633o60235o34905o00970n63331n24570m85282m46148m08377
$$ 10367651 9696018 9035783 8400878 7799908 7236577 6712007 6226725 5780577 5372200
60354E372200l72426l38166l06534k79183k55943k34392k12878j92508j75088
$$ 5372200 4999774 4661608 4355074 4075891 3819948 3585556 3372678 3180170 3005082
60345C005082j60492j47292j34749j22828j11343j00534r1673q5419q0371p4723
$$ 3005082 2844590 2697298 2562549 2439721 2328378 2227844 2136171 2050752 1970381 1895658
60335A895658o8759o3994o0516n7006n2943m8731m4050l8422l3427l1673l2898
$$ 1895658 1826899 1762905 1702389 1645383 1592440 1543709 1499659 1461237 1427810 1396137 1363239
60324A363239l3617l1696k8935k7674k7175k5427k2699k0785j9897j8813j7523
$$ 1363239 1329622 1297926 1268991 1241317 1214142 1188715 1166016 1145231 1125334 1106521 1088998
60313A088998j7139j7325j6179j3084r725p668o503n201l950l700m739o483q112
$$ 1088998 1071859 1054534 1038355 1025271 1015546 1007878 1001375 996174 992224 988524 983785 977302 969190
60300I69190q986q956q636q913r894j0857j1338j1575j1719j1384j0365r187q538
$$ 969190 960204 951248 942612 933699 923805 912948 901610 890035 878316 866932 856567 847380 838842
60287H38842q519q790q986q783p944o624n370m679m613m790m524l290j483m08
$$ 838842 830323 821533 812547 803764 795820 789196 783826 779147 774534 769744 765220 761930 760447 760039
60273G60039p93j668j492k33O79M89J24P10J988K758K426J606J451K557M226M994
$$ 760039 759246 757578 756086 755853 756532 757021 757145 757855 759843 762601 765027 766633 768084 770641 774867 779861
60257G79861M307L401L814N303O243N925N225M877M452L510K590K422L046M258
$$ 779861 784168 787569 791383 796686 802929 808854 814079 818956 823408 826918 829508 831930 834976 839234
60243H39234O009P778Q548Q196Q023R108J0834J1838J1686J0839R649Q303P013
$$ 839234 845243 853021 861569 869765 877788 886896 897730 909568 921254 932093 941742 950045 957058
60230I57058N400K297k728q149j1843j3437j4330j5756j7707j9593k0807k0689
$$ 957058 962458 964755 962027 953878 942035 928598 914268 898512 880805 861212 840405 819716
60218H19716j8755j5215j0868o714l938l508m846n553l731l29K069K504K293K539
$$ 819716 800961 785746 774878 768164 764226 760718 755872 750319 746588 746259 748328 750832 753125 755664
60204G55664K755K492K599L808N274N803N678N910O322N876M818M883O880R293
$$ 755664 758419 760911 763510 767318 772592 778395 784073 789983 796305 802181 806999 811882 818762 828055
60190H28055J0224R886J0078J1597J3445J4718J6047J8387K1178K2794K2747K2526
$$ 828055 838279 848165 858243 869840 883285 898003 914050 932437 953615 976409 999156 1021682
60178A021682K3954K7268L1105L4138L6345L8705M1718M4475M5650M5472M5861
$$ 1021682 1045636 1072904 1104009 1138147 1174492 1213197 1254915 1299390 1345040 1390512 1436373
60167A436373M7930N0102M9916M7195M3973M1394L8524L4648L0782K7768K4430
$$ 1436373 1484303 1534405 1584321 1631516 1675489 1716883 1755407 1790055 1820837 1848605 1873035
60156A873035J9332J3379Q774N973L395P9l158n334o526o878n781k908Q73M402
$$ 1873035 1892367 1905746 1914520 1920493 1923888 1923967 1920809 1915475 1908949 1902071 1896290 1893382 1894255 1898657
60142A898657P468J0405J3167J5669J8656K3194K9230L5358M0292M4007M7156
$$ 1898657 1906125 1916530 1929697 1945366 1964022 1987216 2016446 2051804 2092096 2136103 2183259
60131B183259M9876N1808N3103N4513N6173N6935N5518N1902M6861M0577L2820
$$ 2183259 2233135 2284943 2338046 2392559 2448732 2505667 2561185 2613087 2659948 2700525 2733345
60120B733345K4397J7010J1225N784l75o442j1078j4360j7098j8829j8061j4408
$$ 2733345 2757742 2774752 2785977 2791761 2791386 2784944 2773866 2759506 2742408 2723579 2705518 2691110
60108B691110r141l422K804R931J7737K5852L4320M3231N2368O1510P0426P8246
$$ 2691110 2681969 2678547 2681351 2691282 2709019 2734871 2769191 2812422 2864790 2926300 2996726 3074972
60096C074972Q3423Q4872Q2635P7118O8220N5870M0987K5303J0243l581j5966
$$ 3074972 3158395 3243267 3325902 3403020 3471240 3527110 3568097 3593400 3603643 3600062 3584096
60085C584096k6659l5350m1712m5427m6472m5411m3076l9897l5772l0743k5372
$$ 3584096 3557437 3522087 3480375 3434948 3388476 3343065 3299989 3260092 3224320 3193577 3168205
60074C168205k0046j4167o779J888J0197J6995K3312L1418M2316N4695O6373P6239
$$ 3168205 3148159 3133992 3127213 3129101 3139298 3156293 3179605 3211023 3253339 3308034 3374407 3450646
60062C450646Q4812R3476J03273J13972J24185J32685J39401J44675J47911J47987
$$ 3450646 3535458 3628934 3732207 3846179 3970364 4103049 4242450 4387125 4535036 4683023
60052D683023J44820J39525J32772J24045J12630R8302Q0822O0040L7060J4014
$$ 4683023 4827843 4967368 5100140 5224185 5336815 5435117 5515939 5575979 5613039 5627053
60042E627053p975k9539n1148p1717q9843j05011j16545j23092j24780j24513
$$ 5627053 5619078 5589539 5538391 5466674 5376831 5271820 5155275 5032183 4907403 4782890
60032D782890j24982j25183j22003j14668j05349r5567q4521p1428n7473m4451
$$ 4782890 4657908 4532725 4410722 4296054 4190705 4095138 4010617 3939189 3881716 3837265
60022C837265l2843k2051j1538j200Q400J5949K0557K3179K5586K7670K7301K3455
$$ 3837265 3804422 3782371 3770833 3769633 3778033 3793982 3814539 3837718 3863304 3890974 3918275 3941730
60010C941730J7999J3442J0112O645K261k612p389j1833j5714j8719k0673k1490
$$ 3941730 3959729 3973171 3983283 3989928 3992189 3989577 3982188 3970355 3954641 3935922 3915249 3893759
59998C893759k1292k0697k0377j9955j8075j4001q451k227N087J4219K4560L4548
$$ 3893759 3872467 3851770 3831393 3811438 3793363 3779362 3770911 3768684 3773771 3787990 3812550 3847098
59986C847098M3523N2116O0604O7669P1360P1017O7694O2648N5872M6602L5126
$$ 3847098 3890621 3942737 4003341 4071010 4142370 4213387 4281081 4343729 4399601 4446203 4481329
59975D481329K3271J2736L657m539j1699j7539k3100k9948l7795m4447m8684n1884
$$ 4481329 4504600 4517336 4520993 4516454 4504755 4487216 4464116 4434168 4396373 4351926 4303242 4251358
59963D251358n6000o1091o5958p0339p5085q0411q5183q8046q8539q7060q4331
$$ 4251358 4195358 4134267 4068309 3997970 3922885 3842474 3757291 3669245 3580706 3493646 3409315
59952C409315q1078p7572p3278o7314n9618n1483m4581l9269l4118k7328j8626
$$ 3409315 3328237 3250665 3177387 3110073 3050455 2998972 2954391 2915122 2881004 2853676 2835050
59941B835050r382r09O849J4639K2601L0290L7578M4685N1464N7334O1882O4924
$$ 2835050 2825668 2824759 2831608 2846247 2868848 2899138 2936716 2981401 3032865 3090199 3152081 3217005
59929C217005O6018O4537O0325N3755M5349L5802K6073J6688P188k960j3101k2011
$$ 3217005 3283023 3347560 3407885 3461640 3506989 3542791 3568864 3585552 3592740 3589780 3576679 3554668
59917C554668k9554l6723m3931n0255n4395n5506n3182m7766m0872l4432k8968
$$ 3554668 3525114 3488391 3444460 3394205 3339810 3284304 3231122 3183356 3142484 3108052 3079084
59906C079084k3705j8294j3102p661n63Q308J6907K3347K8027L2547L7525M2462
$$ 3079084 3055379 3037085 3023983 3016322 3015759 3024067 3040974 3064321 3092348 3124895 3162420 3204882
59894C204882M6900N0459N2368N2012M9736M6327M2112L7301L2592K8519K4549
$$ 3204882 3251782 3302241 3354609 3406621 3456357 3502684 3544796 3582097 3614689 3643208 3667757
59883C667757J9801J4475R890P193O569P573R592J2162J5325J9705K5868L3784
$$ 3667757 3687558 3702033 3711923 3719116 3725685 3733258 3742850 3755012 3770337 3790042 3815910 3849694
59871C849694M3113N3778O5770P8580R1181J02637J12648J21480J29250J35164
$$ 3849694 3892807 3946585 4012355 4090935 4182116 4284753 4397401 4518881 4648131 4783295
59861D783295J37710J35916J29945J20131J06043Q7387O5149M0741J4457j3717
$$ 4783295 4921005 5056921 5186866 5306997 5413040 5500427 5565576 5606317 5620774 5607057
59851E607057m2003o7308q7957j04405j17029j25121j28766j29884j30153j29147
$$ 5607057 5565054 5497746 5409789 5305384 5188355 5063234 4934468 4804584 4674431 4545284
59841D545284j25414j18356j08313r6217q3960p3522o4610n4699m2595l0304j9749
$$ 4545284 4419870 4301514 4193201 4096984 4013024 3939502 3874892 3820193 3777598 3747294 3727545
59830C727545r508K789J6149K7059L4217L9685M5131M9308N0108M7241M1820L4485
$$ 3727545 3718037 3720826 3736975 3764034 3798251 3837936 3883067 3932375 3982483 4029724 4071544 4106029
59818D106029K5020J3293j87j4475k8863m3392n8299p2624q4105r1287r5099r7376
$$ 4106029 4131049 4144342 4144155 4129680 4100817 4057425 3999126 3926502 3842397 3751110 3656011 3558635
59806C558635r8536r8056r6634r5940r6067r5033r1572q7035q3554q1198p8015
$$ 3558635 3460099 3362043 3265409 3169469 3073402 2978369 2886797 2799762 2716208 2635010 2556995
59795B556995p2517o5256n7915n1433m5335l8825l2056k5921k0715j5875j1202
$$ 2556995 2484478 2419222 2361307 2309874 2264539 2225714 2193658 2167737 2147022 2131147 2119945
59784B119945p503n309l746j514J372L683M533M132L310K968L661N069O144O233
$$ 2119945 2112442 2107133 2103387 2101873 2103245 2106928 2111461 2115593 2118903 2121871 2125532 2130601 2136745 2142978
59770B142978N642M733L294J418J4o15j751m522p993j0445j1871j3523j5461j6571
$$ 2142978 2148620 2153353 2156647 2158065 2158079 2157464 2155713 2151191 2143198 2132753 2120882 2107359 2091898 2075327
59756B075327j6845j7491j8352j7399j3731r367o636n033k182K768Q257J2693
$$ 2075327 2058482 2040991 2022639 2005240 1991509 1982142 1975506 1970473 1968291 1971059 1979316 1992009
59744A992009J6419K0896K6639L2465L6513L7550L5349L0373K3828J7829J4527
$$ 1992009 2008428 2029324 2055963 2088428 2124941 2162491 2197840 2228213 2252041 2269870 2284397
59733B284397J4489J6422J8717K0416K0248J6120P189m096j3622j9326k2012k2660
$$ 2284397 2298886 2315308 2334025 2354441 2374689 2390809 2397998 2393902 2380280 2360954 2338942 2316282
59721B316282k0763j5984r821m181J033P563J6111K5107L2520L8276M4171N1609
$$ 2316282 2295519 2279535 2269714 2265533 2266566 2274129 2290240 2315347 2347867 2386143 2430314 2481923
59709B481923O0093O8407P6588Q5864R6694J07861J17731J25578J31185J33898
$$ 2481923 2542016 2610423 2687011 2772875 2869569 2977430 3095161 3220739 3351924 3485822
59699C485822J32503J25417J10883Q8030N8417K5700o754l6949o2696q0929r0065
$$ 3485822 3618325 3743742 3854625 3942655 4001072 4026772 4020018 3983069 3920373 3839444 3749379
59688C749379r1957q9898q5565p9177p1421o3130n3932m3303l2576k3678j6158
$$ 3749379 3657422 3567524 3481959 3402782 3331361 3268231 3214299 3170996 3138420 3114742 3098584
59677C098584p774J955J0968J7886K3835L0303L7100M3480M9745N6673O4450P3085
$$ 3098584 3090810 3092765 3103733 3121619 3145454 3175757 3212857 3256337 3306082 3362755 3427205 3500290
59665C500290Q2747R3058J03111J12964J24052J37312J51832J66215J80361J95065
$$ 3500290 3583037 3676095 3779206 3892170 4016222 4153534 4305366 4471581 4651942 4847007
59655D847007K10548K26375K42239K58014K73230K87143K99140L08645L14959
$$ 4847007 5057555 5283930 5526169 5784183 6057413 6344556 6643696 6952341 7267300
59646G267300L17575L16506L12132L04805K94731K82096K67579K52880K40110
$$ 7267300 7584875 7901381 8213513 8518318 8813049 9095145 9362724 9615604 9855714
59637I855714K30145K22037K14545K07345J99877J90080J75930J57849J37982
$$ 9855714 10085859 10307896 10522441 10729786 10929663 11119743 11295673 11453522 11591504
59628A1591504J17404R5647P2672M9471K6681M492j5832l2177m3684n0960n3955
$$ 11591504 11708908 11804555 11877227 11926698 11953379 11957871 11942039 11909862 11866178 11815218 11761263
59617A1761263n1616m4176l3662k1214n842J3084L4160N6188Q0175J07135J35223
$$ 11761263 11709647 11665471 11631809 11610595 11604753 11617837 11651997 11708185 11788360 11895495 12030718
59606A2030718J61274J84461K06408K27883K47081K61200K68260K67018K56229
$$ 12030718 12191992 12376453 12582861 12810744 13057825 13319025 13587285 13854303 14110532
59597A4110532K34694K01820J57946J04093M1496k8227j01820j73857k38719k93437
$$ 14110532 14345226 14547046 14704992 14809085 14850581 14822354 14720534 14546677 14307958 14014521
59587A4014521l37764l71738l94695m06834m09786m04830l92165l72948l50534
$$ 14014521 13676757 13305019 12910324 12503490 12093704 11688874 11296709 10923761 10573227
59578A0573227l28389l07913k89559k74857k65897k63751k68629k80411k97268
$$ 10573227 10244838 9936925 9647366 9372509 9106612 8842861 8574232 8293821 7996553
59569G996553l14493l26713l31268l28481l19510l05598k88811k71381k53924
$$ 7996553 7682060 7355347 7024079 6695598 6376088 6070490 5781679 5510298 5256374
59560E256374k35729k16887j98766j82208j66706j51827j38117j25952j14543
$$ 5256374 5020645 4803758 4604992 4422784 4256078 4104251 3966134 3840182 3725639
59551C725639j03044r2017q2818p5757o9695o3597n7841n3551n0886m8677m5913
$$ 3725639 3622595 3530578 3447760 3372003 3302308 3238711 3180870 3127319 3076433 3027756 2981843
59540B981843m2997m0946l9825l8938l8352l9070m1347m3851m5087m5020m4698
$$ 2981843 2938846 2897900 2858075 2819137 2780785 2741715 2700368 2656517 2611430 2566410 2521712
59529B521712m4740m4704m3619m0828l6661l2430k9340k7350k5604k3658k1434
$$ 2521712 2476972 2432268 2388649 2347821 2311160 2278730 2249390 2222040 2196436 2172778 2151344
59518B151344j8337j3888r381p186p666q240o420k605J090L609N315O621P653
$$ 2151344 2133007 2119119 2109738 2102552 2094886 2086646 2080226 2077621 2078711 2082320 2087635 2094256 2101909
59505B101909Q838J0631J2911J5281J7474J9038J9510J9586K1085K4686K8619
$$ 2101909 2110747 2121378 2134289 2149570 2167044 2186082 2205592 2225178 2246263 2270949 2299568
59494B299568L0713L1067L1586L3656L7405M2546M8517N4174N8702O2671O7245
$$ 2299568 2330281 2361348 2392934 2426590 2463995 2506541 2555058 2609232 2667934 2730605 2797850
59483B797850P2553P7813Q2653Q7301R1711R5580R8983J02030J04102J04355J03010
$$ 2797850 2870403 2948216 3030869 3118170 3209881 3305461 3404444 3506474 3610576 3714931 3817941
59472C817941J01269R9922R8268R4162Q4986O9627N0333L1857J7726P666p16q760
$$ 3817941 3919210 4019132 4117400 4211562 4296548 4366175 4416508 4448365 4466091 4473757 4473041 4464281
59460D464281j6212k2858k8967l4289l7948l9514l9328l7813l5033l0777k4678
$$ 4464281 4448069 4425211 4396244 4361955 4324007 4284493 4245165 4207352 4172319 4141542 4116864
59449D116864j6660p497J794J1520K3105L6749N0532O2653P3161Q2400Q9302R2706
$$ 4116864 4100204 4092707 4094501 4106021 4129126 4165875 4216407 4279060 4352221 4434621 4523923 4616629
59437D616629R2859Q9823Q1818O7340M7835K6049K794k2139m6929o8688q7037
$$ 4616629 4709488 4799311 4881129 4948469 4996304 5022353 5025147 5003008 4956079 4887391 4800354
59426D800354j03617j18044j27593j31371j31686j30282j26261j19008j10307
$$ 4800354 4696737 4578693 4451100 4319729 4188043 4057761 3931500 3812492 3702185
59417C702185j01757r2582q2047p1881o3777n6186m6319l4398k3283j4320n994
$$ 3702185 3600428 3507846 3425799 3353918 3290141 3233955 3187636 3153238 3129955 3115635 3109641
59406C109641L125J2346K0437K7653L5122M2983N0057N5212N8600O1413O4238
$$ 3109641 3112766 3125112 3145549 3173202 3208324 3251307 3301364 3356576 3415176 3476589 3540827
59395C540827O5831O3948N7673M8298L7667K6283J3561o59j5590l0191m3642n5350
$$ 3540827 3606658 3670606 3728279 3776577 3814244 3840527 3854088 3853429 3837839 3807648 3764006 3708656
59383C708656o5123p3307q0290q5898q9604r1248r1256r0230q8523q6073q2591
$$ 3708656 3643533 3570226 3489936 3404038 3314434 3223186 3131930 3041700 2953177 2867104 2784513
59372B784513p8197p3912p0865o8774o5789o0511n3721m7395m2281l7367l1697
$$ 2784513 2706316 2632404 2561539 2492765 2426976 2366465 2312744 2265349 2223068 2185701 2154004
59361B154004k5742k0565j6364j2588r045n890k660J731P542J3486J8172K1907
$$ 2154004 2128262 2107697 2091333 2078745 2069700 2063810 2061150 2062881 2070423 2083909 2102081 2123988
59349B123988K6324L2340L8945M3851M4761M0419L1585K1303J3357R944J0958
$$ 2123988 2150312 2182652 2221597 2265448 2310209 2350628 2382213 2403516 2416873 2426817 2437775
59338B437775J5224K1540K8697L5774M2779M9818N5203N5797N0284M1409L4084
$$ 2437775 2452999 2474539 2503236 2539010 2581789 2631607 2686810 2742607 2792891 2834300 2868384
59327B868384L1718L4650M0930M7797N3401N8225O4218P1928P9462Q5155Q9959
$$ 2868384 2900102 2934752 2975682 3023479 3076880 3135105 3199323 3271251 3350713 3435868 3525827
59316C525827R5905J03270J10780J17740J24351J30567J36338J42479J49822J57940
$$ 3525827 3621732 3725002 3835782 3953522 4077873 4208440 4344778 4487257 4637079 4795019
59306D795019J66165J75320J86728K00088K13973K27975K42468K56764K69642
$$ 4795019 4961184 5136504 5323232 5523320 5737293 5965268 6207736 6464500 6734142
59297F734142K81377K92808L02471L07169L05809L00148K91196K77753K59689
$$ 6734142 7015519 7308327 7610798 7917967 8223776 8523924 8815120 9092873 9352562
59288I352562K40003K21512K03435J83412J61452J39638J18698R7126P3396M7254
$$ 9352562 9592565 9814077 10017512 10200924 10362376 10502014 10620712 10717838 10791234 10838488
59278A0838488J8838j1876m4495p8245j12786j48050j82888k14757k41109k60806
$$ 10838488 10857326 10845450 10800955 10722710 10609924 10461874 10278986 10064229 9823120 9562314
59268I562314k74055k81451k83448k80577k73837k64545k53696k41567k28177
$$ 9562314 9288259 9006808 8723360 8442783 8168946 7904401 7650705 7409138 7180961
59259G180961k13862j99142j84344j69767j55999j43447j31755j20362j09415
$$ 7180961 6967099 6767957 6583613 6413846 6257847 6114400 5982645 5862283 5752868
59250E752868r9378q9975q0538p1338o3526n7526n2496m7722m3674m1125l9988
$$ 5752868 5653490 5563515 5482977 5411639 5348113 5290587 5238091 5190369 5146695 5105570 5065582
59239E065582l9528l9258l9143l9321l9926m0983m2338m4010m6398m9592n2660
$$ 5065582 5026054 4986796 4947653 4908332 4868406 4827423 4785085 4741075 4694677 4645085 4592425
59228D592425n4411n4839n5095n5853n6513n6192n4772n2743n0486m7963m4662
$$ 4592425 4538014 4483175 4428080 4372227 4315714 4259522 4204750 4152007 4101521 4053558 4008896
59217D008896l9820l3210k5651j8314j1677n657l94L829P241J0324J3024J4892
$$ 4008896 3969076 3935866 3910215 3891901 3880224 3874567 3874173 3878002 3885243 3895567 3908591 3923483
59205C923483J5806J5816J4601J1884Q055L569j863q497j5412k1262k5725k9157
$$ 3923483 3939289 3955105 3969706 3981590 3989645 3993214 3991351 3982854 3967442 3946180 3920455 3891298
59193C891298l1342l1936l1548l0869k9242k5642k0697j5961j1982r271j0705
$$ 3891298 3859956 3828020 3796472 3765603 3736361 3710719 3690022 3674061 3662079 3652808 3642103
59182C642103j9605l4668m9304n7377n7918n3608m6938l9197l1256k3456j5552
$$ 3642103 3622498 3587830 3538526 3481149 3423231 3369623 3322685 3283488 3252232 3228776 3213224
59171C213224p739p13N734J2667J9881K5686K9779L4439M1501M9728N6708O1994
$$ 3213224 3205485 3204772 3210506 3223173 3243054 3268740 3298519 3332958 3374459 3424187 3480895 3542889
59159C542889O6749P1566P6367Q1642Q8021R5185J02400J09742J17736J26446
$$ 3542889 3609638 3681204 3757571 3839213 3927234 4022419 4124819 4234561 4352297 4478743
59149D478743J35823J46168J57338J68236J77992J86863J95157K02099K06530
$$ 4478743 4614566 4760734 4918072 5086308 5264300 5451163 5646320 5848419 6054949
59140F054949K07802K05194J97692J85177J68543J47655J20782Q7544N1127J5840
$$ 6054949 6262751 6467945 6665637 6850814 7019357 7167012 7287794 7375338 7426465 7442305
59130G442305j6611m6863p5042j00102j21383j38884j52171j60596j64613j65481
$$ 7442305 7425694 7378831 7303789 7203687 7082304 6943420 6791249 6630653 6466040 6300559
59120F300559j63827j59607j53257j45741j37601j29007j20495j12706j05490
$$ 6300559 6136732 5977125 5823868 5678127 5540526 5411519 5291024 5178318 5072828
59111E072828r8223r0782q3602p7025p1257o6469o2356n8135n3500m8973m4887
$$ 5072828 4974605 4883823 4800221 4723196 4651939 4585470 4523114 4464979 4411479 4362506 4317619
59100D317619m0875l6919l3692l1095k7812k3284j8889j5960j3925j1770r926
$$ 4317619 4276744 4239825 4206133 4175038 4147226 4123942 4105053 4089093 4075168 4063398 4053472
59089D053472r138q660p542o611p177q592r365r978j2269j6240j9897k2433k5292
$$ 4053472 4044334 4035674 4028132 4021521 4014344 4005752 3996387 3986409 3974140 3957900 3938003 3915570 3890278
59076C890278k9579l4269l7775l9787m0916m1736m2725m4121m5386m5639m4851
$$ 3890278 3860699 3826430 3788655 3748868 3707952 3666216 3623491 3579370 3533984 3488345 3443494
59065C443494m3721m2320l9943l6566l3309l0960k8803k5421k0284j4361r362
$$ 3443494 3399773 3357453 3317510 3280944 3247635 3216675 3187872 3162451 3142167 3127806 3118444
59054C118444o278m396k163P24K826L019K053J236O72M4O7J403K783K127n99l252
$$ 3118444 3112166 3107770 3105607 3106331 3109157 3112176 3114229 3115465 3116137 3116181 3116248 3117651 3120434 3122561 3121962 3118710
59038C118710m221l720k425m51J972M310O640R723J3735J7746K0640K1744K0686
$$ 3118710 3114489 3110769 3108344 3107893 3109865 3114175 3120815 3130538 3144273 3162019 3182659 3204403 3225089
59025C225089J7559J3181Q195K030o211j5945k5490l4063m2189n0145n7433o3983
$$ 3225089 3242648 3255829 3264024 3266054 3259843 3243898 3218408 3184345 3142156 3092011 3034578 2970595
59013B970595p0443p6676q1259q3135q2886q1781q0229p7793p4197o9843o5552
$$ 2970595 2900152 2823476 2742217 2659082 2576196 2494415 2414186 2336393 2262196 2192353 2126801
59002B126801o2033n9367n6938n4046n0436m6265m2056l8852l7535l7390l6273
$$ 2126801 2064768 2005401 1948463 1894417 1843981 1797716 1755660 1716808 1679273 1641883 1605610
58991A605610l3001k8777k5393k2923k0409j7825j5913j4598j2995j0816q495
$$ 1605610 1572609 1543832 1518439 1495516 1475107 1457282 1441369 1426771 1413776 1402960 1394465
58980A394465o438n048m835n201m111n10L814O504P834R592J1778J3109J4204
$$ 1394465 1388027 1382979 1378144 1372943 1368832 1368322 1372136 1378640 1386474 1396066 1407844 1420953 1435157
58967A435157J7210K1945K5356K5637K4355K3408K2282J9665J5886J2134Q687
$$ 1435157 1452367 1474312 1499668 1525305 1549660 1573068 1595350 1615015 1630901 1643035 1651722
58956A651722N216J849j088l419m605m062k536j728j877j147J699N528Q681J1087
$$ 1651722 1656938 1658787 1657699 1654280 1649675 1645613 1643077 1641349 1639472 1638325 1640024 1645552 1654233 1665320
58942A665320J3383J5164J5532J4429J2251Q995M817O32k905o404j0787j6030
$$ 1665320 1678703 1693867 1709399 1723828 1736079 1745074 1749891 1750523 1747618 1741214 1730427 1714397
58930A714397k1355k5953k8901k9563k8790k8552k9404k9488k7195k3598k0847
$$ 1714397 1693042 1667089 1638188 1608625 1579835 1551283 1521879 1492391 1465196 1441598 1420751
58919A420751j9236j7491j5219j3160j1387r177o651m878l898k148J466N989R645
$$ 1420751 1401515 1384024 1368805 1355645 1344258 1335081 1328430 1323552 1319654 1317506 1318972 1324961 1334606
58906A334606J1809J2941J3214J2411J1076J0631J1654J2655J1525Q196M941L711
$$ 1334606 1346415 1359356 1372570 1384981 1396057 1406688 1418342 1430997 1442522 1450718 1455659 1459370
58894A459370L990L856K438M16j288k130j574O68L897O955R556J2291J5260J7711
$$ 1459370 1463360 1467216 1469654 1470070 1468782 1466652 1465078 1465746 1469643 1476598 1486154 1498445 1513705 1531416
58880A531416J9161J9877K0132J9996J9970K0736K2075K3129K3983K5658K8147
$$ 1531416 1550577 1570454 1590586 1610582 1630552 1651288 1673363 1696492 1720475 1746133 1774280
58869A774280K9895L0039L0005L1768L5369L9236M2334M4995M7987N1635N5797
$$ 1774280 1804175 1834214 1864219 1895987 1931356 1970592 2012926 2057921 2105908 2157543 2213340
58858B213340O0093O4285O8692P3901P9827Q5553R0385R4522R8425J02200J06106
$$ 2213340 2273433 2337718 2406410 2480311 2560138 2645691 2736076 2830598 2929023 3031223 3137329
58847C137329J11082J17986J26589J35826J44964J54167J64035J74782J85832
$$ 3137329 3248411 3366397 3492986 3628812 3773776 3927943 4091978 4266760 4452592
58838D452592J96220K05549K14299K22852K30498K35998K38756K38711K35256
$$ 4452592 4648812 4854361 5068660 5291512 5522010 5758008 5996764 6235475 6470731
58829F470731K27298K14410J97105J75815J50309J20251Q5810M7959Q824k8651
$$ 6470731 6698029 6912439 7109544 7285359 7435668 7555919 7641729 7689688 7698512 7669861
58819G669861o2542r3369j22521j49406j71531j87504j98532k06477k11806k14098
$$ 7669861 7607319 7513950 7391429 7242023 7070492 6882988 6684456 6477979 6266173 6052075
58809F052075k13460k10632k06493k01990j97905j94059j89434j83364j76037
$$ 6052075 5838615 5627983 5421490 5219500 5021595 4827536 4638102 4454738 4278701
58800D278701j67623j57853j46888j35897j26274j18595j12439j06766j00686
$$ 4278701 4111078 3953225 3806337 3670440 3544166 3425571 3313132 3206366 3105680
58791C105680r4417q9080q4914q0479p4767o9155o5377o2364n7408n0303m3679
$$ 3105680 3011263 2922183 2837269 2756790 2682023 2612868 2547491 2485127 2427719 2377416 2333737
58780B333737l8935l4630k9645k5210k2351j9710j5742j1177p415m160n15K964
$$ 2333737 2294802 2260172 2230527 2205317 2182966 2163256 2147514 2136337 2128922 2124762 2124247 2127211
58768B127211N465P971J2008J7068K1260K4146K7154L1398L6619M2008M6855N0643
$$ 2127211 2132676 2140647 2152655 2169723 2190983 2215129 2242283 2273681 2310300 2352308 2399163 2449806
58756B449806N3638N7076O1715O6725P1037P5113P9998Q5367R0111R4545J00281
$$ 2449806 2503444 2560520 2622235 2688960 2759997 2835110 2915108 3000475 3090586 3185131 3285412
58745C285412J07805J15749J22924J29904J38019J47647J57926J67846J77217
$$ 3285412 3393217 3508966 3631890 3761794 3899813 4047460 4205386 4373232 4550449
58736D550449J86760J97098K07543K16222K21682K23880K23282K19656K12215
$$ 4550449 4737209 4934307 5141850 5358072 5579754 5803634 6026916 6246572 6458787
58727F458787K00404J83849J62171J35499J04744P0812L4200m073m1843p7008
$$ 6458787 6659191 6843040 7005211 7140710 7245454 7316266 7350466 7346393 7304550 7227542
58717G227542j08682j36536j59768j77823j91556k02525k11227k16960k19151
$$ 7227542 7118860 6982324 6822556 6644733 6453177 6250652 6039425 5822465 5603314
58708E603314k18064k14365k08764k01943j94241j85634j76355j67100j58173
$$ 5603314 5385250 5170885 4962121 4760178 4565937 4380303 4203948 4036848 3878675
58699C878675j49113j39792j31018j23227j15377j06399r7142q9463q3615p7892
$$ 3878675 3729562 3589770 3458752 3335525 3220148 3113749 3016607 2927144 2843529 2765637
58689B765637p1042o3670n6932n0896m4933l9048l3953k9965k6487k2778j8883
$$ 2765637 2694595 2630925 2573993 2523097 2478164 2439116 2405163 2375198 2348711 2325933 2307050
58678B307050j5366j2284r088n887m007m520o601q431r469j0721j2753j4809j6106
$$ 2307050 2291684 2279400 2270312 2264425 2260418 2255898 2249297 2240866 2231397 2220676 2207923 2193114 2177008
58665B177008j6666j6500j5264j3343j1978j1583j1251j0880j2368j7300k4473
$$ 2177008 2160342 2143842 2128578 2115235 2103257 2091674 2080423 2069543 2057175 2039875 2015402
58654B015402l1212l6534m1410m6349n0364n2544n3313n3685n4032n4083n3536
$$ 2015402 1984190 1947656 1906246 1859897 1809533 1756989 1703676 1649991 1595959 1541876 1488340
58643A488340n2198m9804m6100m1288l6381l2804l1191l0649k9547k6910k2850
$$ 1488340 1436142 1386338 1340238 1298950 1262569 1229765 1198574 1167925 1138378 1111468 1088618
58632A088618j8066j3537j0335q730p723o343n143n350o814q073q319p994p553
$$ 1088618 1070552 1057015 1046680 1037950 1030227 1023884 1018741 1013391 1006577 998504 990185 982191 974638
58619I74638p047o914p638q498q245p053o144n411l563q20Q67J018J632L995O708
$$ 974638 967591 960677 953039 944541 936296 929243 923099 917688 914125 913305 914172 915190 916822 920817 927525
58604I27525Q127Q692R362R640Q746P058M999K253n23j368r7L84k004n315o713
$$ 927525 935652 944344 953706 963346 972092 979150 984149 986402 985879 984511 984414 984798 982794 977479 970766
58589I70766o940q596j1414j2626j1483j0155j0069j0244r688r025q944q925q183
$$ 970766 963826 955230 943816 931190 919707 909552 899483 889239 879551 870526 861582 852657 844474
58576H44474o565m141j234J021J592J219J799L834N768O263N993O653Q895J1779
$$ 844474 837909 833768 832534 833555 835147 836366 838165 841999 847767 854030 860023 866676 875571 887350
58562H87350J3834J4407J4100J3846J3817J3837J4596J7079K0501K2482K2222
$$ 887350 901184 915591 929691 943537 957354 971191 985787 1002866 1023367 1045849 1068071
58551A068071K2007K4276K8529L2575L5540L7921L9759M0832M2177M5399N0544
$$ 1068071 1090078 1114354 1142883 1175458 1210998 1248919 1288678 1329510 1371687 1417086 1467630
58540A467630N6090O0833O4500O6934O8145O9079P0800P2856P3479P1437O6837
$$ 1467630 1523720 1584553 1649053 1715987 1784132 1853211 1924011 1996867 2070346 2141783 2208620
58529B208620O0280N2099M2382L1137J8569N577o526j7112k6369l4090l9425m2296
$$ 2208620 2268900 2320999 2363381 2394518 2413087 2418664 2412138 2395026 2368657 2334567 2295142 2252846
58517B252846m3842m4745m4374m2318l9414l6398l2886k8668k4646k1524j8974
$$ 2252846 2209004 2164259 2119885 2077567 2038153 2001755 1968869 1940201 1915555 1894031 1875057
58506A875057j7016j6519j7315j7684j6897j6358j6845j6848j5375j4155j4859
$$ 1875057 1858041 1841522 1824207 1806523 1789626 1773268 1756423 1739575 1724200 1710045 1695186
58495A695186j6247j6601j7082j9875k4468k8656l1944l5113l7470l7538l5818
$$ 1695186 1678939 1662338 1645256 1625381 1600913 1572257 1540313 1505200 1467730 1430192 1394374
58484A394374l4155l2866l0941k8523k6698k5390k3780k2297k1912k2106k1698
$$ 1394374 1360219 1327353 1296412 1267889 1241191 1215801 1192021 1169724 1147812 1125706 1104008
58473A104008k1027k1104k1433k0911j9938j9373j8516j6585j4951j5017j5174
$$ 1104008 1082981 1061877 1040444 1019533 999595 980222 961706 945121 930170 915153 899979
58462H99979j3072r891q761r594r355p248n816o464p505p447p004o814o009m097
$$ 899979 886907 877016 868255 858661 849306 842058 836242 829778 822273 814826 807822 801008 794999 790902
58448G90902j997l22J311K670K749J718J170J993L701N848Q234R821R535Q106
$$ 790902 788905 788583 789894 792564 795313 797031 798201 800194 803895 809743 817977 827798 837333 845439
58434H45439P115O569N468M328M686O432Q031R179J0700J2171J2327J1521J1123
$$ 845439 852554 859123 864591 868919 873605 880037 888068 897247 907947 920118 932445 943966 955089
58421I55089J0768R074O755N908O164M846J182k714n394p556r550j0525j0749
$$ 955089 965857 974931 981686 987594 993758 998604 999786 997072 991678 984122 974572 964047 953298
58408I53298j1925j4323j6079j5991j4756j3106j1120r517r126q982p500n451
$$ 953298 941373 927050 910971 894980 880224 867118 855998 846481 837355 828373 820873 815422
58396H15422m905n494m882k969k027k454k013L7J664J770J861K963M072M653N581
$$ 815422 810517 805023 800141 797172 795145 792691 790678 790715 792379 794149 796010 798973 803045 807698 813279
58381H13279O690O501N395N828Q310J0255J0088R511J0305J1723J2465J2699J2878
$$ 813279 819969 826470 831865 837693 846003 856258 866346 875857 886162 897885 910350 923049 935927
58368I35927J2902J3239J4460J5248J3519R942P200N514K467k148n232n256m402
$$ 935927 948829 962068 976528 991776 1005295 1015237 1022437 1027951 1030418 1028270 1023038 1017782 1013380
58355A013380m398l963k191q90j403k178j549k83N56J714L996O593Q542R711R543
$$ 1013380 1008982 1005019 1002828 1001938 1000535 998357 996808 996525 997081 998795 1002791 1009384 1017926 1027637 1037180
58340A037180P477N194N402P701Q798P559O168N576L865M33k315l146l856n277
$$ 1037180 1044657 1049851 1055253 1062954 1071752 1079311 1085479 1091055 1094920 1095353 1093038 1089892 1086036 1080759
58326A080759n490l996l616n733p510o394l773j592R24M307O123M544J765P22
$$ 1080759 1075269 1071273 1067657 1061924 1054414 1048020 1044247 1042655 1043579 1047886 1054009 1058553 1060318 1061040
58312A061040J017R41J029K629N081O995Q471R881J0333R436Q502Q426Q435Q258
$$ 1061040 1062057 1062998 1064027 1066656 1071737 1078732 1087203 1097084 1107417 1116853 1125355 1133781 1142216 1150474
58298A150474Q925J0226J0285R005Q868J0923J3208J4453J5911J7990J8876J8218
$$ 1150474 1159399 1169625 1179910 1188915 1197783 1208706 1221914 1236367 1252278 1270268 1289144 1307362
58286A307362J8466K0613K2387K2370K2066K2083K0521J7235J5209J5341J4390
$$ 1307362 1325828 1346441 1368828 1391198 1413264 1435347 1455868 1473103 1488312 1503653 1518043
58275A518043J0756P774Q139R526R059P941Q220Q907Q912R947J2943J5209J4693
$$ 1518043 1528799 1536573 1544712 1554238 1563297 1571238 1579458 1588365 1597277 1607224 1620167 1635376 1650069
58262A650069J3667J4855J7371J9573K2302K6079K8813K9469L0285L2436L3532
$$ 1650069 1663736 1678591 1695962 1715535 1737837 1763916 1792729 1822198 1852483 1884919 1918451
58251A918451L2379L1808L3545L4943L4223L4138L6672L8917L8283L6899L6689
$$ 1918451 1950830 1982638 2016183 2051126 2085349 2119487 2156159 2195076 2233359 2270258 2306947
58240B306947L5215L1095K8361L0139L2771L1758K9229K9820L3166L6101L8519
$$ 2306947 2342162 2373257 2401618 2431757 2464528 2496286 2525515 2555335 2588501 2624602 2663121
58229B663121M1561M3640M3791M5297N0637N6382N8476N8828O1396O5476O8410
$$ 2663121 2704682 2748322 2792113 2837410 2888047 2944429 3002905 3061733 3123129 3188605 3257015
58218C257015P1144P5484P9466Q1072Q2992Q8206R4512R8792J02770J09028J15320
$$ 3257015 3328159 3403643 3483109 3564181 3647173 3735379 3829891 3928683 4031453 4140481 4255801
58207D255801J18574J20550J23943J27060J27964J29425J33895J38331J40095
$$ 4255801 4374375 4494925 4618868 4745928 4873892 5003317 5137212 5275543 5415638
58198E415638J43016J51086J61294J69509J78176J90761K03906K13243K22263
$$ 5415638 5558654 5709740 5871034 6040543 6218719 6409480 6613386 6826629 7048892
58189G048892K36948K55696K72849K88203L04931L22195L37954L55252L77616
$$ 7048892 7285840 7541536 7814385 8102588 8407519 8729714 9067668 9422920 9800536
58180I800536M02178M24875M48193M76020N05935N34672N65932O04252O46575
$$ 9800536 10202714 10627589 11075782 11551802 12057737 12592409 13158341 13762593 14409168
58171A4409168O88640P33832P86368Q41780Q94122R46708J005547J068395J130932
$$ 14409168 15097808 15831640 16618008 17459788 18353910 19300618 20306165 21374560 22505492
58162B2505492J197179J272348J351724J428504J506373J592630J685920J783250
$$ 22505492 23702671 24975019 26326743 27755247 29261620 30854250 32540170 34323420
58154C4323420J891731K019714K163533K316667K484299K674663K884860L111042
$$ 34323420 36215151 38234865 40398398 42715065 45199364 47874027 50758887 53869929
58146E3869929L363771L656941L991427M367934M806199N332600N959937O699968
$$ 53869929 57233700 60890641 64882068 69250002 74056201 79388801 85348738 92048706
58138I2048706P583290Q643362R893438J1343525J3023596J4958306J7128705
$$ 92048706 99631996 108275358 118168796 129512321 142535917 157494223 174622928
58131A74622928J9482749K1964041K4508960K7052203K9535395L1743513L2925465
$$ 174622928 194105677 216069718 240578678 267630881 297166276 328909789 361835254
58124C61835254L1642617K6397149J6826099M395290q203088j8496589k5300318
$$ 361835254 393477871 419875020 436701119 441096409 432893321 414396732 389096414
58117C89096414k8735917k9588079k8728634k6889076k4623518k2300692k0118643
$$ 389096414 360360497 330772418 302043784 275154708 250531190 228230498 208111855
58110B08111855j8154396j6413359j4860046j3445821j2135702j0917483r792654
$$ 208111855 189957459 173544100 158684054 145238233 133102531 122185048 112392394
58103A12392394q765780p840279p016654o290147n649169n077278m559910m089836
$$ 112392394 103626614 95786335 88769681 82479534 76830365 71753087 67193177 63103341
58095F3103341l663266l272316k907726k567838k256425j972442j711648j475696
$$ 63103341 59440075 56167759 53260033 50692195 48435770 46463328 44751680 43275984
58087D3275984j265536j067289q61095o42887m18577j79137R4980M07097P51018
$$ 43275984 42010448 40943159 40082064 39439177 39020600 38841463 38936443 39343540 40094558
58078D0094558J141909J602826K118912K650619L202098L830654M581789N464224
$$ 40094558 41236467 42839293 44958205 47608824 50810922 54641576 59223365 64687589
58070F4687589O457867P394681P770058O866732M333248O85311k917833n483062
$$ 64687589 71145456 78540137 86310195 93176927 97510175 98195486 95277653 89794591
58062H9794591o753733p061376o832001o332177n722894n127199m602880m143218
$$ 89794591 83040858 75979482 69147481 62815304 57092410 51965211 47362331 43219113
58054D3219113l737535l390340l086928k794673k505225k236960j995623j769043
$$ 43219113 39481578 36091238 33004310 30209637 27704412 25467452 23471829 21702786
58046B1702786j559742j386607j251577j135570j029745r42961q76555q17963
$$ 21702786 20143044 18756437 17504860 16369290 15339545 14396584 13520029 12702066
58038A2702066p61700p12901o68231o15777n56037n02157m57573m12982l66706
$$ 12702066 11940366 11227465 10559234 9943457 9387420 8885263 8427690 8014708 7648002
58029G648002l28700l02379k80665k61978k52772k51966k49366k41789k35497
$$ 7648002 7319302 7016923 6736258 6474280 6221508 5969542 5720176 5478387 5242890
58020E242890k31164k21716k06801j94445j86277j75498j61298j50980j45622
$$ 5242890 5011726 4790010 4583209 4388764 4202487 4026989 3865691 3714711 3569089
58011C569089j37756j25831j17344j14563j10269j01095r2664q7867q2069p3736
$$ 3569089 3431333 3305502 3188158 3073595 2963326 2862231 2769567 2681700 2599631 2525895
58001B525895o8469o8100o6472o0233n4309n2521n1875m9924m9224n0682n0508
$$ 2525895 2457426 2389326 2322854 2262621 2208312 2155791 2103916 2053992 2004768 1954086 1903578
57990A903578m7261m4581m4168m3189m0864m0161m0965l9113l4282l1316l1677
$$ 1903578 1856317 1811736 1767568 1724379 1683515 1643354 1602389 1563276 1528994 1497678 1466001
57979A466001l1094k7695k4960k4488k3365k0944k0704k2961k3108j9709j7292
$$ 1466001 1434907 1407212 1382252 1357764 1334399 1313455 1292751 1269790 1246682 1226973 1209681
57968A209681j8280j9078j7100j5119j5670j7089j7774j8652j9100j6418j1528
$$ 1209681 1191401 1172323 1155223 1140104 1124434 1107345 1089571 1070919 1051819 1035401 1023873
57957A023873r261j0732j1537r602q357r628j0002p569n913p587r244p329l696
$$ 1023873 1014612 1003880 992343 982741 974384 964756 954754 947185 941272 933685 924441 917112 913416
57944I13416j664q22M77J388J012J231L762P178R360J0319J0722J0406R905J0410
$$ 913416 911752 910930 911407 912795 913807 915038 918800 925978 935338 945657 956379 966785 976690 987100
57930I87100J1161R964P092N000L681N35m405p768q479r418j1977j3757j3453
$$ 987100 998261 1008225 1015317 1020317 1023998 1024533 1020128 1012360 1003881 994463 982486 968729 955276
57917I55276j3355j4853j5811j4826j3953j4801j5595j4549j2734j1368r522o619
$$ 955276 941921 927068 911257 896431 882478 867677 852082 837533 824799 813431 803909 797290
57905G97290m147k920j482J048L302M200M353L867J799j207k944l237m293o750
$$ 797290 793143 790223 788741 789789 793091 797291 801644 805511 807310 806103 803159 799922 795629 788879
57891G88879q778r754j1142j2832j2553j0074q118p912p537n844m204l277j908
$$ 788879 780101 770347 759205 746373 733820 723746 715628 707716 700179 694335 690131 686854 684946
57878F84946k82k25j280o06K101L913M057N306Q538J0708J0254R789J1095J2018
$$ 684946 684664 684439 683159 682553 684654 688567 692624 697930 706468 717176 727430 737219 748314 760332
57864G60332J1008J0384J2112J4216J4293J3078J1735R193M904Q52j939n413j0368
$$ 760332 771340 781724 793836 808052 822345 835423 847158 856351 861255 862107 860168 854755 844387
57851H44387j3869j3731j2338j2972j5395j7845k0238k2418k2424j9729j7420
$$ 844387 830518 816787 804449 791477 776082 758237 737999 715581 693157 673428 656008
57840F56008j7920j9161j8094j5387j3433j2170j0244q166o998n840l701k092
$$ 656008 638088 618927 600833 585446 572013 559843 549599 541433 534435 528595 524894 522802
57828E22802k714m157l911k197r85n71K80J881L672N592P393P847O512M998M786
$$ 522802 520088 515931 512020 509823 508838 508267 508547 510428 514100 519692 527085 534932 541444 546442 551228
57813E51228N189M876L830K337L5k622l883l354l038m283n866o585p237q317q260
$$ 551228 556417 561293 565123 567460 567495 564873 560990 557636 554598 550315 544449 537864 530627 522310 514050
57798E14050o104l527k250j674r83j044k076k116j19J861K090K296M797Q661J1449
$$ 514050 507946 504419 502169 500495 499512 498468 496392 494276 494157 496018 498108 500404 505201 513862 525311
57783E25311J2673J2965J1917R523P776Q109Q926Q253O921O439N679K682j804
$$ 525311 537984 550949 562866 572389 580165 588274 597200 605453 612374 618813 624492 627174 625370
57770F25370n373p307q352q669q360q594r781j0237q891p543p964q725p616n323
$$ 625370 619997 612690 604338 595669 587309 578715 568934 558697 549806 542263 534299 525574 517958 512635
57756E12635l822k839r96J055J781J675K028K066L61k017k917k734l558n451o542
$$ 512635 508813 505974 504978 506033 507814 509489 511517 513583 513944 511927 509010 506276 502718 497267 490725
57741D90725o246n714n475n142m883n005m758l531k285j883j348J11J131P24R68
$$ 490725 484479 478765 473290 468148 463265 458260 453502 449971 447686 445803 444455 444566 445697 446421 447389
57726D47389M054Q281J0339J0267J0647J1818J1659R636P483N999M450L106L160
$$ 447389 451443 459724 470063 480330 490977 502795 514454 524090 531573 537572 542022 545128 548288
57713E48288L960L394J301j58J72J300K306L327M234M690N423P202Q690P718M547
$$ 548288 552248 555642 556943 556785 556957 558257 560563 563890 568124 572814 578237 585439 594129 601847 606394
57698F06394J488m47k115l807m929o059q501j1665j3421j3220j2455j1677j0094
$$ 606394 607882 607435 605320 601513 596584 590525 582024 570359 556938 543718 531263 519586 509492
57685E09492p964o823o949p010o513o254o071m792k703j525j443p32J051K168
$$ 509492 501528 494705 487756 480746 474233 467979 461908 457116 454413 452888 451445 450713 451764 453932
57671D53932J728J162J687K592L056L492M082M080L590L986N495O415N899N517
$$ 453932 455660 456822 458509 461101 464157 467649 471731 475811 479401 483387 488882 495297 501196 506713
57657E06713O665Q273Q671Q205Q325R339J0600J1916J3174J3607J2962J2781J4831
$$ 506713 513378 521651 530322 538527 546852 556191 566791 578707 591881 605488 618450 631231 646062
57644F46062J8533K1287K1531K0430K0414K2798K7140L2228L7057M1021M3937
$$ 646062 664595 685882 707413 727843 748257 771055 798195 830423 867480 908501 952438
57633I52438M6279M8872N1432N1528M6101L4494J9403M674p072j4747j8505j9803
$$ 952438 998717 1047589 1099021 1150549 1196650 1231144 1250547 1255221 1248149 1233402 1214897 1195094
57621A195094k0406k0428j8456j4244r564n417k62P343J6131K4140L1853M0972
$$ 1195094 1174688 1154260 1135804 1121560 1111996 1106579 1106317 1113660 1129791 1153931 1185784 1226756
57609A226756N1275O1218P0993Q2445R6050J10128J23020J34100J42206J44284
$$ 1226756 1278031 1339249 1410242 1492687 1588737 1698865 1821885 1955985 2098191 2242475
57599B242475J35929J13483P7379L4668l839l1254m8711o0798o9294p3874p6175
$$ 2242475 2378404 2491887 2569266 2603934 2600095 2568841 2520130 2459332 2390038 2316164 2239989
57588B239989p8808q1342q1380p9312p8108p8321p7184p3321o8798o5554o2934
$$ 2239989 2161181 2079839 1998459 1919147 1841039 1762718 1685534 1612213 1543415 1477861 1414927
57577A414927n9797n6181n1937m6324m0056l5167l2006k8872k5254k2693k1476
$$ 1414927 1355130 1298949 1247012 1200688 1160632 1125465 1093459 1064587 1039333 1016640 995164
57566I95164j9557j6041j2900j1634j0907r133o931n194l186n20J227J105R81
$$ 995164 975607 959566 946666 935032 924125 914992 908061 902867 899681 899161 900388 901493 902474
57553I02474K853N776P777R199J1497J4045J5023J4878J6153J9862K4262K7569
$$ 902474 905327 911103 918880 928079 939576 953621 968644 983522 999675 1019537 1043799 1071368
57541A071368K9908L2045L3759L4531L4890L5901L7375L7361L3984K7521J9925
$$ 1071368 1101276 1133321 1167080 1201611 1236501 1272402 1309777 1347138 1381122 1408643 1428568
57530A428568J2267L769o002j5443k2758k8487l4235l9664m2981m4019m4451m4900
$$ 1428568 1440835 1444604 1438602 1423159 1400401 1371914 1337679 1298015 1255034 1211015 1166564 1121664
57518A121664m4367m2757m1482m0914l9770l7871l6883l7077l5915l1634k6213
$$ 1121664 1077297 1034540 993058 952144 912374 874503 837620 800543 764628 732994 706781
57507G06781k2773k1575k0618j8908j7147j5990j5317j4780j3847j1895r229p216
$$ 706781 684008 662433 641815 622907 605760 589770 574453 559673 545826 533931 524702 517486
57495E17486o599o549o129n699n844o113n829n194m488l170q55J567K811K601
$$ 517486 510887 504338 498209 492510 486666 480553 474724 469530 465042 461872 461017 462584 465395 467996
57481D67996J596O53O34J875L292L232J764Q56J647L006L559L562L806M182M491
$$ 467996 469592 470245 470879 472754 476046 479278 481042 481898 483545 486551 490110 493672 497478 501660 506151
57466E06151N211O293O606N805N375O506Q234R066R185R572J0153J0390J0764
$$ 506151 511362 517655 524261 530066 535441 541947 550181 559247 568432 578004 588157 598547 609311
57453F09311J2197J4688J7688K0881K3598K4645K4016K3563K4731K6674K7879
$$ 609311 621508 636196 653884 674765 698363 723008 747024 770587 795318 821992 849871
57442H49871K8208K8042K6913K4677K2477K0686J7348J0999L658j657n382j0522
$$ 849871 878079 906121 933034 957711 980188 1000874 1018222 1029221 1032879 1031222 1025840 1015318
57430A015318j7671k3875k6786k7396k7892k8772k9005k7816k5565k3588k3263
$$ 1015318 997647 973772 946986 919590 891698 862926 833921 806105 780540 756952 733689
57419G33689k4461k5172k3671k0610j7901j6164j4638j3107j2031j1090r364p106
$$ 733689 709228 684056 660385 639775 621874 605710 591072 577965 565934 554844 545480 538374
57407E38374n626n139m327k415k37J124J565J472J169J403L201O609J0218J2468
$$ 538374 532748 527609 523282 520867 520630 521754 523319 524791 525960 527363 530564 537173 547391 559859
57393E59859J3016J2578J2121J2341J3498J5514J8204K1192K3594K4597K4728
$$ 559859 572875 585453 597574 609915 623413 638927 657131 678323 701917 726514 751242
57382G51242K5475K7033K7546K5591K2215J9109J5949J1401N822P39l909r591
$$ 751242 776717 803750 831296 856887 879102 898211 914160 925561 931383 932122 928213 918622
57370I18622j6186k1540k4622k6971k9954l2474l2731l1057k9474k9030k8808
$$ 918622 902436 880896 856274 829303 799349 766875 734144 703087 673613 644583 615775
57359F15775k7472k4928k2326k0711j9855j8621j6591j4761j4090j4036j3479
$$ 615775 588303 563375 541049 520338 500483 481862 465271 450510 436420 422384 408905
57348D08905j2601j2422j2729j2036r931p930p298p216o132m023k215j372q06
$$ 408905 396304 383882 371153 359117 349186 341256 333958 326742 320610 316587 314372 313000 312194
57335C12194J27Q59L69j201k464k469j907k034k829l178k709k238k190j993j575
$$ 312194 312321 313180 313549 312348 309884 307415 305508 303474 300645 297467 294758 292520 290330 288337 286762
57320B86762j970l488m617m119k983k723k851j964o99j208l852o396o895n680
$$ 286762 284792 281304 276687 272568 269585 266862 264011 262047 261348 260140 256288 249892 242997 237317
57306B37317m099k861k149k090k417k575k480k369j914o33P86R42j32o47N38K292
$$ 237317 233218 230357 228208 226118 223701 221126 218646 216277 214363 213730 214516 215458 215326 214679 215217 217509
57290B17509K736J615M14N68K058L545L788K985K473K853L181K639J978K163K517
$$ 217509 220245 221860 222274 222842 224900 228445 232233 235218 237691 240544 243725 246364 248342 250505 253022
57275B53022J927J102J617K992L011J165l92J28K015L664M526M694M270M013N078
$$ 253022 254949 256051 257668 260660 263671 264836 264444 264572 266587 270251 274777 279471 283741 287754 292832
57260B92832P136Q297P788P268Q272R874J0204R136P957P365P227P629Q795J0345
$$ 292832 299968 308265 316053 323321 331593 341467 351671 360807 368764 376129 383356 390985 399780 410125
57246D10125J1654J2489J2567J1274Q807O867P165R629J2789J5291J6422J6010
$$ 410125 421779 434268 446835 458109 466916 473783 480948 490577 503366 518657 535079 551089
57234E51089J4793J4063J4073J3657J2259J1244J1964J3570J4250J3829J3535
$$ 551089 565882 579945 594018 607675 619934 631178 643142 656712 670962 684791 698326
57223F98326J3752J3769J3529J3888J5038J6123J6571J6598J6206J4872J2506
$$ 698326 712078 725847 739376 753264 768302 784425 800996 817594 833800 848672 861178
57212H61178R718P114N138M482N430O713O338L883R06j195k615m018n192n520
$$ 861178 870896 878010 883148 887630 893060 899773 906111 909994 910900 909705 907090 903072 897880 892360
57198H92360m964l892k543j242m82j58N79K166L800M620N159O685R210J1167J1267
$$ 892360 887396 883504 880961 879719 879237 879079 879658 881824 885624 890244 895403 902088 911298 922465 933732
57183I33732J0130R647J0954J3355J5111J5263J4600J4791J6496J8544J9215J8213
$$ 933732 943862 953509 964463 977818 992929 1008192 1022792 1037583 1054079 1072623 1091838 1110051
57171A110051J7014J7180J8694K0322K1340K2363K4273K6804K8695K9208K9095
$$ 1110051 1127065 1144245 1162939 1183261 1204601 1226964 1251237 1278041 1306736 1335944 1365039
57160A365039K9884L2297L5404L7345L7035L5286L4087L4580L6053L7124L7509
$$ 1365039 1394923 1427220 1462624 1499969 1537004 1572290 1606377 1640957 1677010 1714134 1751643
57149A751643L8099L9563M1610M3540M4806M4951M3771M1903M0617M0749M2177
$$ 1751643 1789742 1829305 1870915 1914455 1959261 2004212 2047983 2089886 2130503 2171252 2213429
57138B213429M4455M7206M9788N1422N2211N3272N5230N7200N7975N7680N7443
$$ 2213429 2257884 2305090 2354878 2406300 2458511 2511783 2567013 2624213 2682188 2739868 2797311
57127B797311N7803N8280N8295N7692N6435N4673N3148N2801N3648N4499N4247
$$ 2797311 2855114 2913394 2971689 3029381 3085816 3140489 3193637 3246438 3300086 3354585 3408832
57116C408832N3087N2230N2394N2970N2790N1570N0187M9415M8862M7674M5801
$$ 3408832 3461919 3514149 3566543 3619513 3672303 3723873 3774060 3823475 3872337 3920011 3965812
57105C965812M3816M1721L9000L5893L3591L2844L3380L4968L7893M1771M5131
$$ 3965812 4009628 4051349 4090349 4126242 4159833 4192677 4226057 4261025 4298918 4340689 4385820
57094D385820M6993M8001M9002M9534M8624M6260M2888L8339L2481K6345K1168
$$ 4385820 4432813 4480814 4529816 4579350 4627974 4674234 4717122 4755461 4787942 4814287 4835455
57083D835455J6794J2117O642L52p244j6481k6428l6027m5888n7398p0291q2782
$$ 4835455 4852249 4864366 4871008 4871360 4864116 4847635 4821207 4785180 4739292 4681894 4611603 4528821
57071D528821r3926j04060j12984j19690j24231j28266j33382j40250j49512j61928
$$ 4528821 4434895 4330835 4217851 4098161 3973930 3845664 3712282 3572032 3422520 3260592
57061C260592j77610j96608k20096k49059k82056l16556l52487l92031m35860
$$ 3260592 3082982 2886374 2666278 2417219 2135163 1818607 1466120 1074089 638229
57052F38229A55621c76955n88671o52489p22806p99311q84495r79604j081809
$$ 638229 155621 -376955 -965626 -1618115 -2340921 -3140232 -4024727 -5004331 -6086140
57043f086140j188048j299084j417189j542470j674639j816388j972325k146466
$$ -6086140 -7274188 -8573272 -9990461 -11532931 -13207570 -15023958 -16996283 -19142749
57035a9142749k342943k566368k818603l097681l401688l729221m073173m419835
$$ -19142749 -21485692 -24052060 -26870663 -29968344 -33370032 -37099253 -41172426 -45592261
57027d5592261m757725n079879n374886n635345n895838o244994o748220p323510
$$ -45592261 -50349986 -55429865 -60804751 -66440096 -72335934 -78580928 -85329148 -92652658
57019i2652658p705413p564919o690094n077968k899569m17237K077199M309482
$$ -92652658 -100358071 -107922990 -114613084 -119691052 -122590621 -123007858 -120930659 -116621177
57011a16621177O075781P281381P937727Q128197P972262P597973P117534O610163
$$ -116621177 -110545396 -103264015 -95326288 -87198091 -79225829 -71627856 -64510322 -57900159
57003e7900159O120875N670251N262696M891258M544148M211472L886846L565879
$$ -57900159 -51779284 -46109033 -40846337 -35955079 -31410931 -27199459 -23312613 -19746734
56995a9746734L247009K933079K629178K339064K065307J811514J581669J377380
$$ -19746734 -16499725 -13566646 -10937468 -8598404 -6533097 -4721583 -3139914 -1762534
56987a762534e64830D76317R06362P91465O94438O13558N46253M88635M37622
$$ -1762534 -564830 476317 1382679 2174144 2868582 3482140 4028393 4517028 4954650
56978D954650L92576L53409L18248K84767K52782K23495J97050J72801J51287
$$ 4954650 5347226 5700635 6018883 6303650 6556432 6779927 6976977 7149778 7301065
56969G301065J33657J19337J06253R3389Q1399P0705O0512M9871L8475K6434J4397
$$ 7301065 7434722 7554059 7660312 7753701 7835100 7905805 7966317 8016188 8054663 8081097 8095494
56958H095494L674m847j1612j7400k2148k6011l0720l8015m7285n6615o5978p7350
$$ 8095494 8099168 8094321 8082709 8065309 8043161 8017150 7986430 7948415 7901130 7844515 7778537 7701187
56946G701187r1679j07661j23941j40615j57737j73771j86378j93851j95391j91173
$$ 7701187 7609508 7501847 7377906 7237291 7079554 6905783 6719405 6525554 6330163 6138990
56936F138990j82988j74038j67134j63189j61455j60517j58690j54179j45614
$$ 6138990 5956002 5781964 5614830 5451641 5290186 5129669 4970979 4816800 4671186
56927D671186j32444j14553r1565o2948k8965Q903M9458R3706J43584J97922K51645
$$ 4671186 4538742 4424189 4332624 4269676 4240711 4249614 4299072 4392778 4536362 4734284 4985929
56916D985929L00430L41798L65412L44965K52066Q6951j08714k77676l86506m37905
$$ 4985929 5286359 5628157 5993569 6338534 6590600 6677551 6568837 6291161 5904655 5466750
56906E466750m50981m40322m13982l79492l43121l06605k69998k35947k07528
$$ 5466750 5015769 4575447 4161465 3781973 3438852 3132247 2862249 2626302 2418774
56897B418774j83936j61938j40536j21498j06452r5804q9361q5799q2590p8512
$$ 2418774 2234838 2072900 1932364 1810866 1704414 1608610 1519249 1433450 1350860 1272348
56887A272348p5007p3131p0734o5151n7355n0636m5978m1489l6093l0863k6672
$$ 1272348 1197341 1124210 1053476 988325 930970 880334 834356 792867 756774 725911 699239
56876F99239k2922j9149j5806j2852r268m605J68L669M819K601l407j1793j9758
$$ 699239 676317 657168 641362 628510 619242 614637 614805 618474 623293 625894 622487 610694 590936
56863E90936k5327k8395k9678k9614k8532k6888k4969k2906k0981j9325j7544
$$ 590936 565609 537214 507536 477922 449390 422502 397533 374627 353646 334321 316777
56852C16777j5316j3098j1479j0210q804p670p486p688o870m673k145k63Q53J274
$$ 316777 301461 288363 276884 266674 257870 250200 242714 235026 228156 223483 221338 221075 221928 223202
56838B23202J062R03J694L256M524N233O164P393P714O577N429N985P896R260
$$ 223202 224264 225167 226861 230117 234641 239874 246038 253431 261145 267722 273151 279136 287032 296292
56824B96292R068Q010O973N749L607N32k582m764n661n434m371k782j031O61K362
$$ 296292 305360 313370 320343 326092 329699 330231 327649 322885 317224 311790 307419 304637 303606 304267 306629
56809C06629M042N289N955P090J0323J6016K2620K8290L2571L6020L8878M0674
$$ 306629 310671 315960 321915 329005 339328 355344 377964 406254 438825 474845 513723 554397
56797E54397M0485L6955K8885J6814L658p205j4357j8264j9470j8046j4597j0519
$$ 554397 594882 631837 660722 677536 681194 673989 659632 641368 621898 603852 589255 578736
56785E78736o902l832q46K541O707J1630J6768K1781K7164L3524M0497M7076N2651
$$ 578736 571834 568002 567156 569697 576404 588034 604802 626583 653747 687271 727768 774844 827495
56772H27495N6738N7832N3661M2908K6354O637j2483k7386l6552m1335m3757m3858
$$ 827495 884233 942065 995726 1038634 1064988 1071625 1059142 1031756 995204 953869 910112 866254
56760H66254m0485l4325k8068k3227j8570j2590n911pN085J0378J6063K1420K6062
$$ 866254 825769 791444 763376 740149 721579 708989 703078 703071 708156 718534 734597 756017 782079
56747G82079K9867L2026L1339K7473K0914J1807n7j3732k6465l5121l8265l6999
$$ 782079 811946 843972 875311 902784 923698 935505 935448 921716 895251 860130 821865 784866
56735G84866l4041l1716l0234k7919k3552j8295j4662j3649j3591j2105q494l906
$$ 784866 750825 719109 688875 660956 637404 619109 604447 590798 577207 565102 556608 552702
56723E52702L67M025P347J0140J1420J0068N853k09o613j2389j7159k0377k1418
$$ 552702 553069 557094 564441 574581 586001 596069 601922 601713 595100 582711 565552 545175 523757
56710E23757k0830k0631k2187k4176k4023k1420j8790j7768j6991j4773j2344
$$ 523757 502927 482296 460109 435933 411910 390490 371700 353932 336941 322168 309824
56699C09824j2152j3748j4005j1657r055q579r494r687q718p464o160m694l825
$$ 309824 297672 283924 269919 258262 249207 240628 231134 221447 212729 205265 199105 194411 190586
56686A90586m191m832m462l637l723m147k873K58K810K920J452K86n7j66m87j244
$$ 190586 186395 181563 177101 173464 169741 165594 162721 162979 165789 168709 170161 170447 170390 170224 169737 168493
56670A68493k617m007l982j941P37K122J872J146Q24O56J17p82j632k148k207
$$ 168493 165876 161869 157887 155946 156683 158805 160677 161823 162647 163303 163420 162638 161006 158858 156651
56655A56651j632l29J183J785R19l28k19J268K128J071n67q35m9k1j038j642j277
$$ 156651 155019 154690 155873 157658 158577 158249 158030 159298 161426 162497 161930 161095 161046 161025 159987 158345 157068
56638A57068j059j587j945j496r25p52m93k29j185l613n637n632m363l229j796
$$ 157068 156009 154422 152477 150981 150056 149304 148811 148582 147397 143784 138147 132515 128152 124923 123127
56623A23127R57L984N013L720K067J521J756K176K932L917M258L597K688K147
$$ 123127 124084 128068 133081 136801 138868 140389 142145 144321 147253 151170 155428 159025 161713 163860
56609A63860J542M21o24o94J98J322K171K643K725K507K280K158J819J000o7j085
$$ 163860 165402 165823 165199 164505 164703 166025 168196 170839 173564 176071 178351 180509 182328 183328 183261 182176
56593A82176k190l429m039l195j498p70j776k924k177K00J987K061J652K020K377
$$ 182176 179986 176557 172518 169323 167825 167055 165279 162355 160178 160378 162365 164426 166078 168098 170475
56578A70475J359m85j329p21J55P80J991L904M996M200K506J345M88j025k738
$$ 170475 171834 171349 170020 169299 169454 170234 172225 176129 181125 185325 187831 189176 189664 188639 185901
56563A85901l106j710K05J415J834J850J577J102Q95J430K576L460L022J044j249
$$ 185901 182795 181085 181290 182705 184539 186389 187966 189068 189963 191393 193969 197429 200451 201495 200246
56548B00246k183j441l16J88N96J639K555J963L6j452j233K48J817K781K996K545
$$ 200246 198063 196622 196306 196494 197090 198729 201284 203247 203283 201831 200598 200846 202663 205444 208440 210985
56532B10985J815J356J465K052K837L362L064J993J176J607K863L554L078K259
$$ 210985 212800 214156 215621 217673 220510 223872 226936 228929 230105 231712 234575 238129 241207 243466
56518B43466K019K171J908J048L85R00K736M870N993N843N386N440N754N915O348
$$ 243466 245485 247656 249564 250612 250997 251897 254633 259503 265496 271339 276725 282165 287919 293834 300182
56503C00182P499Q573Q405P338O842P225P205O166N416O422Q801J0991J2075J2063
$$ 300182 307681 316254 324659 331997 338839 346064 353269 359435 364851 371273 380074 391065 403140 415203
56489D15203J1102R460P972P425P571P424O521N341M492M020L459K295M17j600
$$ 415203 426305 435765 443737 451162 458733 466157 472678 478019 482511 486531 489990 492285 492702 491102
56475D91102k954l606m357n589o542o565o444p358q854r332q617q525j0042j1342
$$ 491102 488148 484542 480185 474596 468054 461489 455045 447687 438833 429501 420884 412359 402317 390975
56461C90975r997o419l599l464m985o111o225n992n828n568n135m557l517j846
$$ 390975 380978 374559 370960 367496 362511 356400 350175 344183 338355 332787 327652 323095 319578 317732
56447C17732l07o4j180k337k330j310l08N8K5M6j4q75k958n405o480n388l367
$$ 317732 317425 317361 316181 313844 311514 310204 309896 309954 309979 310025 310011 309136 306178 300773 294293 288905 285538
56430B85538k365k859l745m031l605k378n2K746M306L687K018J124J470K182K554
$$ 285538 283173 280314 276569 272538 268933 266555 266503 269249 273555 277242 279260 280384 281854 284036 286590
56415B86590K543K237J682J194J179J615K168K607K775K509K043K031K684L289
$$ 286590 289133 291370 293052 294246 295425 297040 299208 301815 304590 307099 309142 311173 313857 317146
56401C17146L067K196J514J671K984N344P591P888N775L312K989M963P368Q832
$$ 317146 320213 322409 323923 325594 328578 333922 341513 349401 355176 358488 361477 366440 373808 382640
56387C82640R208Q359O107L558K751M207O136O729O175N641N279M385K839J379
$$ 382640 391848 400207 406314 409872 412623 416830 422966 429695 435870 441511 446790 451175 454014 455393
56373D55393N52J32m31j417k695l872m651n116n580o163o682o862o512n625m562
$$ 455393 455945 456077 455646 454229 451534 447662 443011 437895 432315 426152 419470 412608 406096 400471 395909
56358C95909l904l804l884m079m896o201o571n020k858k361l761n039m768l537
$$ 395909 392005 388201 384317 380238 375342 369141 362570 357550 354692 352331 348570 343531 338763 335226
56344C35226k319j039M30J297R33m0o44o93k58R83K864L983L101P75j272k111
$$ 335226 332907 331868 332298 333595 334528 334488 333844 333151 332893 333876 336740 340723 343824 344599 343327 341216
56328C41216j990j402q18r47k099l305l156j629j32L94N12J046J614J200j36r86
$$ 341216 339226 337824 337006 336059 333960 330655 327499 325870 325738 326132 326644 327690 329304 330504 330368 329382
56312C29382l01J045J076p52k483j786J195L978M658L572J941J96j443j887j76
$$ 329382 329081 330126 331202 330450 327967 326181 327376 331354 336012 339584 341525 341721 340278 338391 338215
56297C38215K732M615M562L764L443L158J890M9q52k78N50M11j96K05J995M053
$$ 338215 340947 345562 350124 353888 357331 360489 362379 362428 361576 361298 361848 362259 362063 362268 364263 368316
56281C68316N332N886O031N432L809J949J090J576K826M321N878P125P618P369
$$ 368316 373648 379534 385565 390997 394806 396755 397845 399421 402247 406568 412446 419571 427189 434558
56267D34558O684N660M632M596O097P957Q380P228N918N168M408L574L653M800
$$ 434558 441242 446902 451534 456130 462227 470184 478564 485792 491710 496878 501286 504860 508513 513313
56253E13313N610N221M743N418O538O509N109L431K241J528J190J114R58O91Q24
$$ 513313 518923 524144 528887 534305 540843 547352 552461 555892 558133 559661 560851 561965 562923 563614 564438
56238E64438J370J316Q8j167r41M27J179M95p08j307j268j183j256j072p3J767
$$ 564438 565808 567124 567212 566045 565104 565531 566710 567205 566497 565190 563922 562739 561483 560411 560338 562105
56222E62105L570M181L282J615L8r81j025J07J570J989J323J106K170L427L793
$$ 562105 565675 569856 573138 574753 574791 573810 572785 572892 574462 576451 577774 578880 581050 584477 588270
56207E88270L921M790N866O211O437P612R001Q920P597P224Q949J1464J2952J3154
$$ 588270 592191 596981 602847 609058 615495 623107 632108 641028 648625 655849 664798 676262 689214 702368
56193G02368J3035J3451J4569J5988J7102J7689J8013J8105J7572J6590J6199
$$ 702368 715403 728854 743423 759411 776513 794202 812215 830320 847892 864482 880681
56182H80681J6779J7133J6199J4757J4042J3501J1548Q065M505J911M15K16J220
$$ 880681 897460 914593 930792 945549 959591 973092 984640 992705 997210 999121 999536 999752 1000972
56169A000972J977R85j035j974j481j219j849k017j011k35r57k322k924l082m059
$$ 1000972 1002949 1003934 1002899 1000925 999444 998225 996376 994359 993348 993113 992156 989834 986910 983828 979769
56154I79769n833o966o358m456k843k964m728o298n896l859k089j622j789j815
$$ 979769 973936 966970 960612 956156 953313 950349 945621 939323 933427 929568 927479 925857 924068 922253
56140I22253j975k679l566m053m018l641l166k946k937k370r30O0r51l208m241
$$ 922253 920278 917599 914033 909980 905962 902321 899155 896209 893272 890902 889972 890032 889081 885873 881632
56125H81632l153j581r14l85J044K580K789J881J392K160L697N249O504P345P621
$$ 881632 878479 876898 875984 875599 876643 879223 882012 883893 885285 887445 891142 896391 902895 910240 917861
56110I17861P301O725O535P130Q082Q663R198J0899J3609J4977J3287J0211Q923
$$ 917861 925162 931887 938422 945552 953634 962297 971495 982394 996003 1010980 1024267 1034478 1043401
56097A043401J0188J2285J4125J6119J8115J9093J9244J9997K1568K2678K3167
$$ 1043401 1053589 1065874 1079999 1096118 1114233 1133326 1152570 1172567 1194135 1216813 1239980
56086A239980K4482K6852K8407K8158K7649K8537L0642L3613L8165M4216M9784
$$ 1239980 1264462 1291314 1319721 1347879 1375528 1404065 1434707 1468320 1506485 1550701 1600485
56075A600485N3564N7009O2189O9151P6890Q5372R4947J05163J15978J28863J45031
$$ 1600485 1654049 1711058 1773247 1842398 1919288 2004660 2099607 2204770 2320748 2449611 2594642
56064B594642J63710J83826K06065K31274K57543K80646K96906L04211L00944
$$ 2594642 2758352 2942178 3148243 3379517 3637060 3917706 4214612 4518823 4819767
56055D819767K85972K60142K27161J92898J63486J42584J29251J18701J05623
$$ 4819767 5105739 5365881 5593042 5785940 5949426 6092010 6221261 6339962 6445585
56046F445585Q6652O0851L0043j062k7262m6495o0243p0902q1202r5866j19933
$$ 6445585 6532237 6593088 6623131 6622069 6594807 6548312 6488069 6417167 6335965 6240099 6120166
56035F120166j53485j90442k23845k49991k66604k70948k62763k46414k27066
$$ 6120166 5966681 5776239 5552394 5302403 5035799 4764851 4502088 4255674 4028608
56026D028608k06274j83632j60630j40041j22845j08274r5706q4478p3378o2291
$$ 4028608 3822334 3638702 3478072 3338031 3215186 3106912 3011206 2926728 2853350 2791059
56016B791059n2791m5290l7705k9117k2263j9606j9075j6900j2983j0133r231
$$ 2791059 2738268 2692978 2655273 2626156 2603893 2584287 2565212 2548312 2535329 2525196 2515965
56005B515965q529o857m617k124O11L188N834R780J4781J8086J8159J7402J8619
$$ 2515965 2507436 2500579 2495962 2493838 2494449 2497637 2503471 2513251 2528032 2546118 2564277 2581679 2600298
55992B600298K1102K2986K5006K8463L1827L3305L4710L8633M3617M6447M7722
$$ 2600298 2621400 2644386 2669392 2697855 2729682 2762987 2797697 2836330 2879947 2926394 2974116
55981B974116N0486N4588N7145N7871N9278O1974O4241O5981O8891P2869P6316
$$ 2974116 3024602 3079190 3136335 3194206 3253484 3315458 3379699 3445680 3514571 3587440 3663756
55970C663756P9707Q4848R0895R5235R8058J01944J07257J12062J16265J21695
$$ 3663756 3743463 3828311 3919206 4014441 4112499 4214443 4321700 4433762 4550027 4671722
55960D671722J28366J34890J42215J52629J65289J77041J87279J97835K08725
$$ 4671722 4800088 4934978 5077193 5229822 5395111 5572152 5759431 5957266 6165991
55951F165991K18765K29637K44152K60767K75133K87050L00610L17413L35054
$$ 6165991 6384756 6614393 6858545 7119312 7394445 7681495 7982105 8299518 8634572
55942H634572L52613L72142L94152M16707M39576M64485M91186N18303N47823
$$ 8634572 8987185 9359327 9753479 10170186 10609762 11074247 11565433 12083736 12631559
55933A2631559N83319O23971O65843P08616P55148Q05072Q55347R06656R62552
$$ 12631559 13214878 13838849 14504692 15213308 15968456 16773528 17628875 18535531 19498083
55924A9498083J022741J084287J148695J220128J297150J374482J452550J536839
$$ 19498083 20520824 21605111 22753806 23973934 25271084 26645566 28098116 29634955
55916B9634955J628487J724936J829505J950216K088957K241863K410154K599596
$$ 29634955 31263442 32988378 34817883 36768099 38857056 41098919 43509073 46108669
55908D6108669K809905L037174L286860L571389L895512M259049M674721N167642
$$ 46108669 48918574 51955748 55242608 58813997 62709509 66968558 71643279 76810921
55900G6810921N757060O455822P287432Q282937R459969J0827362J2411543J4252943
$$ 76810921 82567981 89023803 96311235 104594172 114054141 124881503 137293046 151545989
55892A51545989J6374534J8778655K1463811K4393840K7437696L0361588L2812951
$$ 151545989 167920523 186699178 208162989 232556829 259994525 290356113 323169064
55885C23169064L4146679L3237720K8758517K0078731Q112943m809038j6108519
$$ 323169064 357315743 390553463 419311980 439390711 447503654 442694616 426586097
55878D26586097k4188499k8794793l0536211l0255587k8711796k6508367k4073776
$$ 426586097 402397598 373602805 343066594 312811007 284099211 257590844 233517068
55871B33517068k1664436j9415516j7391699j5601240j4010658j2583338j1302679
$$ 233517068 211852632 192437116 175045417 159444177 145433519 132850181 121547502
55864A21547502j0158439r134011q217689p408798o702211o079926n525194n032057
$$ 121547502 111389063 102255052 94037363 86628565 79926354 73846428 68321234 63289177
55856F3289177m594486m198756l833752l498399l192717k911051k649349k409999
$$ 63289177 58694691 54495935 50662183 47163784 43971067 41060016 38410667 36000668
55848C6000668k194253j997938j818933j660931j525555j408154j304878j216567
$$ 36000668 33806415 31808477 29989544 28328613 26803058 25394904 24090026 22873459
55840B2873459j142155j075471j012331r54143r01278q49669p97433p48365p05058
$$ 22873459 21731304 20655833 19643502 18689359 17788081 16938412 16140979 15392614 14687556
55831A4687556o64468o23882n85679n52518n22821m94513m68552m45507m22937
$$ 14687556 14023088 13399206 12813527 12261009 11738188 11243675 10775123 10329616 9906679
55822I906679l99233l76178l55155l34823l14773k97289k83053k69002k52892
$$ 9906679 9507446 9131268 8776113 8441290 8126517 7829228 7546175 7277173 7024281
55813G024281k36401k21677k08343j95816j85057j76150j67563j59292j53430
$$ 7024281 6787880 6566203 6357860 6162044 5976987 5800837 5633274 5473982 5320552
55804E320552j50452j48653j48136j51022j56430j59873j59368j57757j57029
$$ 5320552 5170100 5021447 4873311 4722289 4565859 4405986 4246618 4088861 3931832
55795C931832j54812j48904j41083j33768j26584j18728j11205j04309r6358q7353
$$ 3931832 3777020 3628116 3487033 3353265 3226681 3107953 2996748 2892439 2796081 2708728
55785B708728q0298p6246p1589o3223n3330m5959m1502l7512l2614k6681j9144
$$ 2708728 2628430 2552184 2480595 2417372 2364042 2318083 2276581 2239069 2206455 2179774 2160630
55774B160630r924p78O182R869Q985J878j0611k4178l4611m0669m2657m0903l6964
$$ 2160630 2150706 2149928 2156110 2165979 2174964 2176842 2166231 2142053 2107442 2066773 2024116 1983213 1946249
55761A946249l3490l1112k7872k3095j9111j7694j7606j7295j7095j7113j6061
$$ 1946249 1912759 1881647 1853775 1830680 1811569 1793875 1776269 1758974 1741879 1724766 1708705
55750A708705j4173j4133j6941j9754k0077j9134j8775j8162j6204j4203j3060
$$ 1708705 1694532 1680399 1663458 1643704 1623627 1604493 1585718 1567556 1551352 1537149 1524089
55739A524089j0692n628n51J270R35J691L565L901J919p94l414o173q262q432
$$ 1524089 1513397 1507769 1507218 1508488 1509423 1511114 1514679 1518580 1520499 1519705 1516291 1510118 1501856 1493424
55725A493424p120n412k655K455R123J5225J9868K2883K2927J8841J2180N545
$$ 1493424 1486304 1480892 1478237 1480692 1489815 1505040 1524908 1547791 1570718 1589559 1601739 1607284
55713A607284j092r768k0606l1006l8739m3694m6564m7708m7351m5400m1415l5811
$$ 1607284 1606192 1596424 1575818 1544812 1506073 1462379 1415815 1368107 1320756 1275356 1233941 1198130
55701A198130l0338k6046k2118j8292j6705j8895k2474k3658k2282k1203k1294
$$ 1198130 1167792 1141746 1119628 1101336 1084631 1065736 1043262 1019604 997322 976119 954825
55690I54825k0369j7325j4220j3353j4633j6889j9682k2773k5259k6509k6886
$$ 954825 934456 917131 902911 889558 874925 858036 838354 815581 790322 763813 736927
55679G36927k6814k5933k3796k0797j7920j5835j4413j2919j0899q967q194q560
$$ 736927 710113 684180 660384 639587 621667 605832 591419 578500 567601 558634 550440 541880
55667E41880q921q776q885r582j0019r941j0525j2053j2470j0150o799n467o595
$$ 541880 532959 524183 515298 505716 495697 485756 475231 463178 450708 440558 433759 428292 421697
55654D21697q076q532q246p356n326k372L12J858J981M80k039l448k023J102L088
$$ 421697 413621 405089 396843 389487 384161 381789 382101 383959 385940 386420 384381 380933 378910 380012 383100
55639C83100K805J486K37j285l576o270q668j0089r876q254o845o894p300o032
$$ 383100 385905 387391 387628 386343 382767 376497 367829 357740 347864 339610 332765 325871 318571 312539
55625C12539l230j088q23j548k153k404k045o69J000J505Q55Q06K350M398N646
$$ 312539 309309 308221 307398 305850 303697 301293 299248 298579 299579 301084 301939 302745 305095 309493 315139
55610C15139O170O345N591L514J327Q09K163L768L875K008r68l705n287n739n644
$$ 315139 321309 327654 333245 336759 338086 338895 341058 344826 348701 350709 349741 346036 340749 335010 329366
55595C29366n356m801l950l178l103m143n990p483p520o388n570n853o356n898
$$ 329366 324010 319209 315259 312081 308978 304835 298845 291362 283842 277454 271884 266031 259675 253777
55581B53777m623l468k699j877q08K67J071J252N25o09j025n85o56k077l630l724
$$ 253777 249154 245686 242987 241110 240302 240569 241640 242892 243417 242808 241783 241198 240542 238465 234835 231111
55565B31111k710k079k099j954j592j698j983j364N5Q49M74K08J235K811L104
$$ 231111 228401 226322 224223 222269 220677 218979 216996 215632 215687 216536 217010 217218 218453 221264 224368
55550B24368J309j431l043k478p99Q2j07K98K189L910L514J740J104K554M622
$$ 224368 225677 224246 221203 218725 217926 218008 217901 218199 220388 224298 227812 229552 230656 233210 237832
55535B37832N765N978O007O302O926P569P665P259P344Q432R386Q941P893Q318
$$ 237832 243597 249575 255582 261884 268810 276379 284044 291303 298647 307079 316465 325406 333299 341617
55521C41617J0851J4154J6921J8944K0242K0704K0868K1897K4613K9248L5861
$$ 341617 352468 366622 383543 402487 422729 443433 464301 486198 510811 540059 575920
55510E75920M3839N1492N7666O3530P1125Q0113Q7697R1918R3347R2723Q8462
$$ 575920 619759 671251 728917 792447 863572 943685 1031382 1123300 1216647 1309370 1397832
55499A397832P7668N9192L5021R024j5510l7348n6566p2575q3729q9289r0584
$$ 1397832 1475500 1534692 1569713 1578737 1563227 1525879 1469313 1396738 1313009 1223720 1133136
55488A133136q9236q5334p8655p0668o3614n8119n3371m8992m5067m0935l6020
$$ 1133136 1043900 958566 879911 809243 745629 687510 634139 585147 540080 499145 463125
55477D63125l1506k9088k8116k6091k2150j8106j5722j4752j4071j3109j1832
$$ 463125 431619 402531 374415 348324 326174 308068 292346 277594 263523 250414 238582
55466B38582j0658j0493j1413j1600r400o168m953o280p645p375o452n917n039
$$ 238582 227924 217431 206018 194418 185018 178850 173897 167617 159972 152597 146145 140228 135189
55453A35189l292j914k082l125l780l706k983j598m54j054l140m328l251j400
$$ 135189 131897 129983 127901 124776 120996 117290 114307 112709 112255 111201 108061 103733 100482 99082
55439I9082n76l00O47J717J595O01K20Q44J582J852J793J417O56p0k75k44o13
$$ 99082 98506 98206 98853 100570 102165 102766 102986 103830 105412 107264 109057 110474 111130 111060 110785 110541 109928
55422A09928j391k070k313k167j805j577j766k146k287k413l166m373m950m259
$$ 109928 108537 106467 104154 101987 100182 98605 96839 94693 92406 89993 86827 82454 77504 73245
55408G3245k692q13J058K314K277J209N9q94k013l035l283l038l123l122j988
$$ 73245 70553 69740 70798 73112 75389 76598 76657 75763 73750 70715 67432 64394 61271 58149 56161
55393E6161m52m72j946k472j170j42r21k018j677p04n79p11K39J869L025L820
$$ 56161 55709 55237 53291 50819 49649 49507 48586 46568 44891 44187 43608 42897 43136 45005 48030 51850
55377E1850M629M465K583N31K85J204J073n34k120k842l051k651j138P53J476
$$ 51850 56479 60944 63527 64058 64343 65547 66620 66086 63966 61124 58073 55422 54284 55037 56513
55362E6513Q81L02L50K05n94j040O7K519M604M425J641j735l005j761k34j80q02
$$ 56513 57394 57696 58046 58251 57657 56617 56684 59203 63807 68232 69873 68138 65133 63372 63138 62958 62156
55345F2156o85j45l5K49J551K833K526J253R76J832K081J095K00L19O39J66r65
$$ 62156 61471 61326 61291 61540 63091 65924 68450 69703 70679 72511 74592 75687 75887 76206 76845 77011 76046
55328G6046k123k947l161k603j629p50p5K00n32k097k848j645J98O16j88l09O93
$$ 76046 73923 70976 67815 65212 63583 62833 62758 62958 62426 60329 57481 55836 56034 56650 56462 56153 56846
55311E6846J297O22m71j121j448j521j076o50j334k955l876l131j442J16J163
$$ 56846 58143 58765 58294 57173 55725 54204 53128 52478 51144 48189 44313 41182 39740 39856 41019
55296D1019J401M69j107k045j836j149n66n7J92k41r63r70j50O75J255K051K736
$$ 41019 42420 42889 41782 39737 37901 36752 36186 36129 36321 36080 35117 34147 33997 34672 35927 37978 40714
55279D0714K172L09j452k153k134j617j94J689K456J544M19M74J268J671J469
$$ 40714 42886 43195 41743 39590 37456 35839 35645 37334 39790 41334 41753 42227 43495 45166 46635
55264D6635P83o53k522l402k469q10J08K82M55N11l2q10j244j613k216k162o17
$$ 46635 47418 46765 44243 40841 38372 37562 37670 37952 38407 38918 38886 38076 36832 35219 33003 30841 30224
55247C0224J263J356m42j939j589l59n3q98j644j341j32J440L050M367M789L958
$$ 30224 31487 32843 32401 30462 28873 28514 28461 27563 25919 24578 24446 25886 28936 33303 38092 42050
55231D2050K434J395J327J377M79j154k193j859o93L25P19L87o42j793j932m84
$$ 42050 44484 45879 47206 48583 49062 47908 45715 43856 43163 43488 44207 44594 43952 42159 40227 39743
55215C9743J601K635J899K99o25j52J059J634P71j096k825l595l269k131p45K13
$$ 39743 41344 43979 45878 46177 45552 45400 46459 48093 48864 47768 44943 41348 38079 35948 35203 35416
55199C5416M31K99L38N71P89J065J381J210L52l05K2L63q34k925l278r72J441
$$ 35416 35847 36146 36484 37055 37844 38909 40290 41500 41852 41547 41569 41932 41098 38173 34895 33923 35364
55182C5364J098j526l585l585k465j351k8J824L291K996Q87j442k207j064P07
$$ 35364 36462 34936 31351 27766 25301 23950 23922 25746 29037 32033 32920 31478 29271 28207 28914
55167B8914J584J297P69P24Q44N83K14M40J169J386L86j240k203j856p90o9L8
$$ 28914 30498 31795 32564 33288 34132 34715 34929 35369 36538 37924 38310 37070 34867 33011 32221 32152 32190
55150C2190L31J553L110L313J245j894l638k715l66R85L43r38r77L88J658J716
$$ 32190 32521 34074 37184 40497 41742 39848 36210 33495 33129 34114 34457 33519 32542 32930 34588 36304
55134C6304R61L78L26O46J253J903J908Q53o55j564j539r87k23P76J856K555K494
$$ 36304 37265 37643 37969 38615 39868 41771 43679 44532 43877 42313 40774 39787 39564 40340 42196 44751 47245
55117D7245J536k26k262l652l788k960j934j266j193j606j719o19J288K169J046
$$ 47245 48781 48555 46293 42641 38853 35893 33959 32693 31500 29894 28175 27556 28844 31013 32059
55102C2059p01j159m41k1k43j30N89J128J312J885K829K980J880N60j34p09j671
$$ 32059 31358 30199 29758 29737 29494 29364 29953 31081 32393 34278 37107 40087 41967 42527 42393 41684 40013
55085D0013k273j573J3J165J196N04j39j97L93J178J625J646J450J014K60m26
$$ 40013 37740 36167 36180 37345 38541 39045 38906 38709 39102 40280 41905 43551 45001 46015 46275 45849
55069D5849n94m51m24l54K6J43n78j306o73J025K065J794J184P62j68j686k497
$$ 45849 45255 44804 44380 44026 44052 44195 43617 42311 41638 42663 44728 46522 47706 48468 48300 46614 44117
55052D4117j823m34Q89K310L622L823L058L098M515N214L411N66n86L53J742K593
$$ 44117 42294 41860 42749 45059 48681 52504 55562 58660 63175 68389 71800 72366 71780 72133 73875 76468
55036G6468K899K243M20j123p67N91N45j191k340j542j77j31j400k684l020k139
$$ 76468 79367 81610 82030 80907 80140 80731 81276 80085 77745 76203 76026 75895 74495 71811 68791 66652
55020F6652l73J129J165K5o28J17J372J993K003J849J202m47k517l662l171j608
$$ 66652 66279 67408 68573 68598 67970 68087 69459 71452 73455 75304 76506 76059 73542 69880 66709 65101
55004F5101k48k21j743l675m183k354Q51L416L991K670N80q86q16O69K396L024
$$ 65101 64853 64632 62889 59214 55031 52677 53528 56944 60935 63605 64185 63299 62483 63152 65548 68572
54988F8572K182O93m07q89j326k048k573k277j342m80J58J170K755M041L985K552
$$ 68572 70754 71447 71040 70151 68825 66777 64204 61927 60585 60105 60263 61433 64188 68229 72214 74766
54972G4766O85n91p23J99J372J772J210O04P63J329J408Q53K08k95r39j718k055
$$ 74766 75451 74860 74137 74336 75708 77480 78690 79294 80057 81386 82794 83647 83855 83560 82621 80903 78848
54955G8848j495k00J251K256K471K091J837K163K542K002M01j284k068j898j280
$$ 78848 77353 77153 78404 80660 83131 85222 87059 89222 91764 93766 94167 92883 90815 88917 87637
54940H7637l66J087K840L827L133J332K25R15K537L363K863J933J405J290J443
$$ 87637 87271 88358 91198 95025 98158 99490 99715 100630 103167 106530 109393 111326 112731 114021 115464
54925A15464J901K263J767M62n32m63R4L12K97M86O52L68j77o10j092j789k204
$$ 115464 117365 119628 121395 121857 121325 120862 120956 121268 121565 122051 122703 123071 122894 122284 121192 119403 117199
54908A17199j991j798k275k685j806M3J216R75L26L85R86J326J070L64n87j362
$$ 117199 115208 113410 111135 108450 106644 106687 107903 108878 109204 109589 110575 111901 112971 113335 112748 111386
54892A11386j266J1J868L254L596L158K719K995M100N357N789M942L407K454L051
$$ 111386 110120 110131 111999 115253 118849 122007 124726 127721 131821 137178 142967 147909 151316 153770 156821
54877A56821M993P090Q418R195J0024J0618J0193R111R015J0811J3354J4853J4899
$$ 156821 161814 168904 177322 186517 196541 207159 217352 226463 235478 246289 259643 274496 289395
54864B89395J4333J3691J2593J0447P105K968j264n170r051j3164j6484j7373
$$ 289395 303728 317419 330012 340459 347564 350532 349268 344098 335047 321883 305399 288026
54852B88026j5918j4279j3901j3731j2362j0577r970r984q628n769l585l403l998
$$ 288026 272108 257829 243928 230197 217835 207258 197288 187304 178676 172907 169322 165919 161921
54839A61921l663k398j229m88J90R21J468J796K174K918M219O028Q083J0223J2381
$$ 161921 158258 155860 154631 154143 154333 155254 156722 158518 160692 163610 167829 173857 181940 192163 204544
54824B04544J4044J4381J3514J2958J3790J4882J4153J1159P143K856k015p150
$$ 204544 218588 232969 246483 259441 273231 288113 302266 313425 320568 323424 321409 314259
54812C14259j1029j2682j2765j2404j1952j1324j0512r294p482n852n712o949
$$ 314259 303230 290548 277783 265379 253427 242103 231591 222297 214815 208963 203251 196302
54800A96302p679o542m277k195k35K207M450N057M038L160L818N541O859O905
$$ 196302 188623 182081 177804 175609 175374 177581 182031 187088 191126 194286 198104 203645 210504 217409
54786B17409N686L425L96k693m879n968o884q396r826r875q630p596p489p309
$$ 217409 223095 226520 226916 224223 219344 213376 206492 198096 188270 178395 169765 162169 154680 147371
54772A47371o254n153m845m523l372k655l988o237o652m958l735m325m939l817
$$ 147371 141117 135964 131119 126596 123224 120569 116581 110344 103692 98734 94999 90674 85735 81918
54758H1918j908r32p10p7R49J634K052K466K142M27j612k142q43J060K510L179
$$ 81918 80010 79078 78368 78291 79240 80874 82926 85392 87534 87961 86349 84207 83364 84424 86934 90113
54742I0113K857J700P92J117K066K132R07n84j341j062L32K502M098L737J932
$$ 90113 92970 94670 95462 96579 98645 100777 101684 101100 99759 98697 99029 101531 105629 109366 111298
54727A11298R12K127M765P033Q040Q107P989Q292R140R998J0323J0478J1464J3530
$$ 111298 112210 114337 119102 126135 134175 142282 150271 158563 167703 177701 188024 198502 209966 223496
54713B23496J5695J6925J7191J6964J6276J4807J2565R887P044M300K120Q13j09
$$ 223496 239191 256116 273307 290271 306547 321354 333919 343806 350850 355150 357270 358083 357974
54700C57974j634m129o719q051p564n797l622j572K4O77J01j124j710p58J498
$$ 357974 356340 352211 345492 337441 329877 324080 320458 318886 318910 319587 319688 318564 316854 316096 317594
54685C17594M032N866O510O039N039M305M244M474M145K724N42j377k065j370
$$ 317594 321626 327492 334002 340041 345080 349385 353629 358103 362248 364972 365514 364137 362072 360702
54671C60702R8J805L747N862P408P566O464M923L139L64l901q999j3714j7233
$$ 360702 360800 362605 366352 372214 379622 387188 393652 398575 401714 402078 398177 389178 375464 358231
54657C58231j9235j9622j8681j7148j5731j4681j3970j3549j3162j2324j0892
$$ 358231 338996 319374 300693 283545 267814 253133 239163 225614 212452 200128 189236
54646A89236r344q249p605o964o049m995m049l213k201r96l36j092k719l235j625
$$ 189236 179892 171643 164038 157074 151025 146030 141981 138768 136567 135571 135235 134143 131424 128189 126564
54631A26564L04L4k082l006j158J547K551J813Q53J36p42j190N3K873N628P065
$$ 126564 126868 126902 124820 121814 120656 122203 124754 126567 127420 127556 126814 125624 125677 128550 134178 141243
54615A41243P117N963L764J513O50J335K121J912J204R19J061J364K248M052N787
$$ 141243 148360 154323 158087 159600 160250 161585 163706 165618 166822 167741 168802 170166 172414 176466 182253
54600A82253N885M141J950M41o04j682k295j614J32J869L170M522N912O348N494
$$ 182253 188138 192279 194229 194670 194066 192384 190089 188475 188607 190476 193646 198168 204080 210428 215922
54585B15922M876O366R763J2978J4525J4814J5093J6186J8348K1129K3147K3049
$$ 215922 220798 227164 236927 249905 264430 279244 294337 310523 328871 350000 373147 396196
54573C96196K1339K0029J9913J9248J6013J0434M286j331o314j0394j3174j5043
$$ 396196 417535 437564 457477 476725 492738 503172 507458 506127 499813 489419 476245 461202
54561D61202j6661j7679j7177j5407j3944j3767j4150j3800j2381j0552r057q192
$$ 461202 444541 426862 409685 394278 380334 366567 352417 338617 326236 315684 306627 298435
54549B98435p842p851q353r435j0434j0284q989p967q096q295p215n621n340o297
$$ 298435 290593 282742 274389 264954 254520 244236 235247 227280 219184 210889 203674 198053 192713 186416
54535A86416o474n016l376k786k508j556m97r6L00J343J796J36k507l251j433
$$ 186416 179942 174926 171550 168764 166256 164700 164203 164107 164407 165750 167546 167682 165175 161924 160491
54520A60491L86j7j709k438j854j386j774k285k268j978j637q60M21J315R97j75
$$ 160491 160877 160860 159151 156713 154859 153473 151699 149414 147146 145168 143531 142671 143092 144407 145404 145229
54504A45229j283k095k812k898j364J501L807M144L352L276M193M506L096R52
$$ 145229 143946 141851 139039 136141 134777 136278 140085 144229 147581 150857 155050 159556 162652 163604
54490A63604p9M81J530K116K510L344M371M737M225L556L287L018K118R42O25
$$ 163604 163525 164006 165536 167652 170162 173506 177877 182614 186839 190395 193682 196700 198818 199760 200385
54475B00385J713L517N040O056O893P607P961Q230R283J1426J3510J3814J1918
$$ 200385 202098 205615 210655 216711 223604 231211 239172 247402 256685 268111 281621 295435 307353
54462C07353R199P182N873M191J701r57l197n154o907q031q434q824r600j0037
$$ 307353 316552 323734 329607 333798 335499 334542 331345 326191 319284 311253 302819 293995 284395 274358
54448B74358r446q435p964p660o513m905m433n544o789o800n785m610l629k971
$$ 274358 264912 256477 248513 240853 234340 229435 225002 219458 212669 205869 200084 195474 191845 188874
54434A88874k860k858j795N95K834L398K509J471Q57L86N9K72R58J467J362Q11
$$ 188874 186014 183156 181361 181956 184790 188188 190697 192168 193025 193411 193470 193742 194700 196167 197529 198340
54418A98340L67O51J867L302L815L305L025L851M867M529K750R80N37J514L054
$$ 198340 198707 199358 201225 204527 208342 211647 214672 218523 223390 227919 230669 231649 232186 233700 236754
54403B36754L964L428J880Q70J392K588K914K147J365J134Q57J06m28J48J453
$$ 236754 240718 244146 246026 246896 248288 250876 253790 255937 257302 258436 259293 259399 258971 259119 260572
54388B60572J933N42j899l374k904j649j248j549j122J94P96l07k178l654m834
$$ 260572 262505 263047 261148 257774 254870 253221 251973 250424 249302 249496 250292 249985 247807 244153 239319
54373B39319n788n416l124n69N2j246k689l214k929j825R9J779J963J016K85j0
$$ 239319 233531 228115 224991 224422 224474 223228 220539 217325 214396 212571 212670 214449 216412 217428 217713 217703
54357B17703o15j250q46K97O23m7j22J078K131J962J521J986K739K605J868J729
$$ 217703 217088 215838 214992 215289 215912 215865 215743 216821 218952 220914 222435 224421 227160 229765 231633 233362
54341B33362K402K991K781J844P35K47Q95K022K053L18j932k989k629j959j757
$$ 233362 235764 238755 241536 243380 244115 244362 245257 247279 249332 249650 247718 244729 242100 240141 238384
54326B38384j857j987k379l199l841l296j546j66q32l058m433l630k074j667k000
$$ 238384 236527 234540 232161 228962 225121 221825 220279 220113 219281 216223 211790 208160 206086 204419 202419
54311B02419j370K26J185J006Q47J300J641J634K089K985L004J681K47l95p80
$$ 202419 201049 201275 202460 203466 204313 205613 207254 208888 210977 213962 216966 218647 218894 218499 217719
54296B17719j035j5K405M069L293J320L06K19k79j020o47Q28J865J606O02n37
$$ 217719 216684 216669 219074 223143 226436 227756 228062 228281 228002 226982 226335 227163 229028 230634 231236 230699
54280B30699j579k055j713j533k744m799n766m949l767l743m744n600n502m478
$$ 230699 229120 227065 225352 223819 221075 216276 210510 205561 201794 198051 193307 187707 182205 177727
54266A77727l174k428k443k500k052j848k935m741n353l860j469N8J48n81j182
$$ 177727 174553 172125 169682 167182 165130 163282 160347 155606 150253 146393 144924 144982 145130 144549 143367
54251A43367q74N02K019K248Q02j072j817j200l17k86j149k065k315k124k182
$$ 143367 142493 142995 145014 147262 148064 146992 145175 143975 143658 143372 142223 140158 137843 135719 133537
54236A33537k437j981m61R99J031k60j609k341k822l361l660l524l195k698j677
$$ 133537 131100 129119 128658 129657 130688 130428 128819 126478 123656 120295 116635 113111 109916 107218 105541
54221A05541l05L84m29k229l625l663k465q38M22R78R47N10k91j225j616j007
$$ 105541 105236 105620 105191 102962 99337 95674 93209 92371 92793 93771 94718 95228 94937 93712 92096 91089
54205I1089m5l8j267k303j527P99K666K578J238N76J314K164J639R7o98J93J867
$$ 91089 91044 91006 89739 87436 85909 86708 89374 91952 93190 93766 95080 97244 98883 98980 98282 98475 100342
54188A00342K879K898K653K698K782K327J165j36p34m13k8o66k347l960m440l616
$$ 100342 103221 106119 108772 111470 114252 116579 117744 117608 116874 116461 116433 115767 113420 109460 105020 101404
54172A01404j933q2R97O05p66j745j720j523j967k465j862j59J375J675Q34k39
$$ 101404 99471 99389 100386 100991 100225 98480 96760 95237 93270 90805 88943 88784 90159 91834 92668 92429
54156I2429o84l25K95O05O11N08k7j257k311j900l06P60N65J63J42n63k450l818
$$ 92429 91745 91420 91715 92320 92931 93439 93412 92155 89844 87944 87638 88398 88963 89126 89268 88705 86255 82437
54138H2437l096j398p43q55r3J243J159n78j822j355n10p39j452j379n91n4k37
$$ 82437 79341 77943 77200 76345 76252 77495 78654 78076 76254 74899 74389 73650 72198 70819 70228 70174 69937
54121F9937j038k155k880k377q17O23J345J893K469K174N32j263j734j036n17
$$ 69937 68899 66744 63864 61487 60670 61293 62638 64531 67000 69174 69706 68443 66709 65673 65156
54106F5156r38j965k897l140k349r07P5q8q51j295j306j300j239p26K18J210K116
$$ 65156 64218 62253 59356 56216 53867 52960 53035 52947 52096 50801 49495 48195 46956 46230 46448 47658 49774
54089D9774K965L427L049J964Q14N5k72k75k16n39j237j336J78K752M337L538
$$ 49774 52739 56166 59215 61179 61993 62048 61776 61501 61285 60746 59509 58173 58351 61103 65440 68978
54073F8978J239m45n17K08N95N37L86q7j243k363j998J58K641L937M043L734L092
$$ 68978 70217 69772 69255 69463 70058 70595 70981 70894 69651 67288 65290 65448 68089 72026 76069 79803 82895
54056H2895J713j45j660k451k673k370j641j214j664k172j252J075K952K957J769
$$ 82895 84608 84463 82803 80352 77679 75309 73668 72454 70790 68618 67366 68441 71393 74350 76119
54041G6119J010J194J471R52k40j178j186o48n51j067j178k89O31M68j65L2P03
$$ 76119 77129 78323 79794 80746 80506 79328 78142 77494 76943 75876 74698 74409 75040 75508 75343 75375 76078
54024G6078L19j113j781q84K83O82R86J788K154J340L75L72P13M43K10J014K067
$$ 76078 76397 75284 73503 72619 72902 73584 74570 76358 78512 79852 80227 80599 81312 81755 81965 82979 85046
54007H5046J866O74k3j7k69p14k65R77J623J368J491K485L079K411J465J283J230
$$ 85046 86912 87586 87563 87546 87277 86563 86298 87275 88898 90266 91757 94242 97321 99732 101197 102480 103710
53990A03710K78j069j460o08O12J423J621J266P90R33J751K138J240j43m97M18
$$ 103710 103988 102919 101459 100851 101463 102886 104507 105773 106563 107496 109247 111385 112625 112482 111985 112403
53974A12403J554K332L153M153M655M292L751L807M330M808N271O011O834P315
$$ 112403 113957 116289 119442 123595 128250 132542 136293 140100 144430 149238 154509 160520 167354 174669
53960A74669P508P668P486O427M920M217M734N332M883L874L535L735K946M85
$$ 174669 182177 189845 197331 203758 208678 212895 217629 222961 227844 231718 235253 238988 241934 242419
53946B42419k223l303k654j694j287j000m32j81q52j832k100j951k810m958o490
$$ 242419 240196 236893 234239 232545 231258 230258 229826 229645 228793 226961 224861 222910 220100 215142 208652
53931B08652n454k527m31o75j985k269j278m50p34j622k283k712l393m359n065
$$ 208652 203198 200671 200240 199565 197580 195311 194033 193583 192849 191227 188944 186232 182839 178480 173415
53916A73415n039m384l487k437r50R00K153J839L21q97j014q34j317k000j735
$$ 173415 168376 163992 160505 158068 157118 158018 160171 162010 162331 161434 160420 159586 158269 156269 154534
53901A54534m75O94J117J154J299J612K008K361K246J441O42Q63K062L196L703
$$ 154534 154059 154753 155870 157024 158323 159935 161943 164304 166550 167991 168633 169496 171558 174754 178457
53886A78457M015M527N051N466N937O226N747M621L689L277L053L311M895P269
$$ 178457 182472 186999 192050 197516 203453 209679 215426 220047 223736 227013 230066 233377 238272 245541
53872B45541Q262O776M385K987K288J188N11K048N185O758M839J170j033p10M25
$$ 245541 253803 260579 264964 267951 270239 271427 271938 273986 279171 285929 290768 291938 290905 290195 290620
53857B90620L75p57j023Q61L658M866L768K254K174L080L563L701M688O538P853
$$ 290620 290995 290238 289215 290076 293734 298600 302368 304622 306796 309876 313439 317140 321828 328366 336219
53842C36219P821P037O198N321M536M515N568P021P857P472N875L862K732K914
$$ 336219 344040 351077 357275 362596 367132 371647 377215 384236 392093 399565 405440 409302 412034 414948
53828D14948K965J076k396n091n505m504l723l752m335n242o108o402o219o373
$$ 414948 417913 418989 416593 411502 405997 401493 397770 394018 389683 384441 378333 371931 365712 359339
53814C59339p146p743p503o807o285o041o261p361q733q460n697k474j671l533
$$ 359339 352193 344450 336947 330140 323855 317814 311553 304192 295459 286999 281302 278828 277157 273624
53800B73624n674o371o309o753p438p195n919m884n112o049o200m880l030j997
$$ 273624 267950 261579 255270 248517 241079 233884 227965 223081 217969 211920 205720 200840 197810 195813
53786A95813j850j516m96L44R1j012k171l116l778l587k216n77O9j61r2N04N36
$$ 195813 193963 192447 191951 192295 192386 191374 189203 186087 182309 178722 176506 175929 175998 175837 175745 176249 176785
53769A76785m03j082l84Q99J060k57j744k186j666j069j018j437j758j398l78
$$ 176785 176382 175300 174916 175815 176875 176618 174874 172688 171022 169953 168935 167498 165740 164342 163964
53754A63964N38O62K53J68O29R12M73p3K94J564K595K551J988K193L604N184N368
$$ 163964 164502 165164 165417 165585 166214 167126 167599 167526 167820 169384 171979 174530 176518 178711 182315 187499 192867
53737A92867L698J500P50K087L985M391L081J860K223L578M306L979L650M105
$$ 192867 196565 198065 198815 200902 204887 209278 212359 214219 216442 220020 224326 228305 231955 236060
53723B36060M896N180M819M326M244M775N522N537M187K136P28L00q5r32j341
$$ 236060 240956 246136 250955 255281 259525 264300 269822 275359 279546 281682 282410 282710 282625 281693 280352
53708B80352l68J425K685K867K323J398L50k42j26j41j227k809l293k155n45L20
$$ 280352 279984 281409 284094 286961 289284 290682 291032 290790 290664 290523 289296 286487 283194 281039 280494 280814
53692B80814K91k36q65j018l45K79o85l281n544n924n191n104n987o658o158m563
$$ 280814 281105 280869 280004 278986 278641 278920 278235 274954 269410 263486 258295 253191 247204 240546 234388 229825
53676B29825k555j080r94k153l176k992k036j231n26M23Q94J4j394j690r98j012
$$ 229825 227270 226190 225196 223043 219867 216875 214839 213608 213082 213505 214399 214413 213019 211329 210331 209319
53660B09319k117k667j873j269k101k977j950K54J074l67k329k998k336j232k09
$$ 209319 207202 204535 202662 201393 199292 196315 194365 194619 195693 195326 192997 189999 187663 186431 186222
53645A86222N82J050J257J281P93m37j572j225O73K292J922O0j153m13J490K869
$$ 186222 186804 187854 189111 190392 191185 190748 189176 187951 188624 190916 192838 192898 191745 191332 192822 195691
53629A95691L174L297L965M410L228N18j683j506P53L107L965L181J659M85K50
$$ 195691 198865 202162 206127 210537 213765 214283 212600 211094 211847 214954 218919 222100 223759 224244 224494
53614B24494N04K46o53j035j01J168J297M68J52R68K236L396M367M555L147P94
$$ 224494 224998 225244 224591 223556 223455 224623 225920 226388 226540 227508 229744 233140 237507 242062 245209 246003
53598B46003o29l75M31Q17J009R19n13l170m752l651j454p44j450j455j26J054
$$ 246003 245374 244999 245430 246247 247256 248175 247662 244492 239740 236089 234635 233891 232441 230986 230860 231914
53582B31914J214J170J541J649R15j52r96j732k192j566J56J579J613J028J263
$$ 231914 233128 234298 235839 237488 238403 238251 237255 235523 233331 231765 231921 233500 235113 236141 237404
53567B37404K260K578J437k44r91m72L17M21J85Q03K519L942L704K243J082Q05
$$ 237404 239664 242242 243679 243435 242444 241972 242289 242710 242895 243698 246217 250159 253863 256106 257188 257993
53551B57993Q66J073J805K631K340R25Q1R29K526L588M338N334N720M484K685
$$ 257993 258859 259932 261737 264368 266708 267633 267714 268643 271169 274757 279095 284429 290149 294633 297318
53536B97318K506M102N253M444K704J864K343L359M127M091K868R08m31k87P42
$$ 297318 299824 303926 309179 313623 316327 318191 320534 323893 328020 332111 334979 335887 335456 335169 335911
53521C35911J636K261K863K972J955L32n95l74K64O66Q08N38n97k348l529l460
$$ 335911 337547 339808 342671 345643 347598 347930 347335 346961 347225 347891 348699 349237 348640 346292 342763 339303
53505C39303k878k769k871k130k18K059L657M015L133J609M37J75M69P74J156
$$ 339303 336425 333656 330785 328655 328437 330496 334153 338168 341301 342910 343347 343522 343991 344765 345921
53490C45921J780K077J437M83N51J768K812K773K270K314K953L704M476N350O006
$$ 345921 347701 349778 351215 351698 352249 354017 356829 359602 361872 364186 367139 370843 375319 380669 386675
53475C86675O091N722N095M116K977K589L653N642P476Q834J0186J1805J3482
$$ 386675 392766 398488 403583 407699 410676 413265 416918 422560 430036 438870 449056 460861 474343
53462D74343J5040J6346J7015J6792J6172J5917J6080J6165J6175J6797J8399
$$ 474343 489383 505729 522744 539536 555708 571625 587705 603870 620045 636842 655241
53451F55241K0534K2552K4221K5588K6673K7453K7912K8171K8766L0406L2935
$$ 655241 675775 698327 722548 748136 774809 802262 830174 858345 887111 917517 950452
53440I50452L4980L5426L5041L5568L7310L8688L8547L7737L7683L8174L7740
$$ 950452 985432 1020858 1055899 1091467 1128777 1167465 1206012 1243749 1281432 1319606 1357346
53429A357346L5883L3991L3648L4790L6047L6632L7022L7735L8302L8144L7850
$$ 1357346 1393229 1427220 1460868 1495658 1531705 1568337 1605359 1643094 1681396 1719540 1757390
53418A757390L8285L8838L8000L5839L4136L3441L1954K8625K5491K4758K5069
$$ 1757390 1795675 1834513 1872513 1908352 1942488 1975929 2007883 2036508 2061999 2086757 2111826
53407B111826K3347J9547J6521J5235J3387R578N742L867K813N09k633m764n762
$$ 2111826 2135173 2154720 2171241 2186476 2199863 2209441 2215183 2219050 2221863 2222372 2219739 2214975 2209213
53394B209213p082r215j1389j3355j5583j7922j9775k1387k3518k5930k7778k9260
$$ 2209213 2202131 2192916 2181527 2168172 2152589 2134667 2114892 2093505 2069987 2044057 2016279 1987019
53382A987019l1298l3568l4533l3778l2779l2844l3581l4011l3968l3651l2822
$$ 1987019 1955721 1922153 1887620 1853842 1821063 1788219 1754638 1720627 1686659 1653008 1620186
53371A620186l1201k9101k7043k5227k3699k2425k0931j8664j5937j3668j1810
$$ 1620186 1588985 1559884 1532841 1507614 1483915 1461490 1440559 1421895 1405958 1392290 1380480
53360A380480r130n142j203J339L214O203J0516J4529J7145J9085K1553K4599
$$ 1380480 1371350 1366208 1365005 1366344 1369558 1375761 1386277 1400806 1417951 1437036 1458589 1483188
53348A483188K7426K9727L2003L4760L7915M1009M3841M6725N0069N3602N6280
$$ 1483188 1510614 1540341 1572344 1607104 1645019 1686028 1729869 1776594 1826663 1880265 1936545
53337A936545N7349N7400N7919N9721O2345O5152O8394P2495P6731P9531Q0285
$$ 1936545 1993894 2051294 2109213 2168934 2231279 2296431 2364825 2437320 2514051 2593582 2673867
53326B673867Q0173Q0835Q2607Q4522Q5601Q5848Q6036Q6890Q8282Q9037Q7944
$$ 2673867 2754040 2834875 2917482 3002004 3087605 3173453 3259489 3346379 3434661 3523698 3611642
53315C611642Q5247Q2640Q1177P9643P5923O9718O2788N6479N0379M3863L7570
$$ 3611642 3696889 3779529 3860706 3940349 4016272 4085990 4148778 4205257 4255636 4299499 4337069
53304D337069L2295K7334K1440J4888R221M872M25n432j2290j8926k5005l1195
$$ 4337069 4369364 4396698 4418138 4433026 4442247 4447119 4447544 4442112 4429822 4410896 4385891 4354696
53292D354696l8133m6020n4870o4283p3089p9948q4673q8413r2298r6124r8814
$$ 4354696 4316563 4270543 4215673 4151390 4078301 3998353 3913680 3825267 3732969 3636845 3538031
53281C538031r9872r9905r9697r9334r8523r7280r5815r4034r1736q9259q7151
$$ 3538031 3438159 3338254 3238557 3139223 3040700 2943420 2847605 2753571 2661835 2572576 2485425
53270B485425q5163q2278p8176p4013p1182o9692o8352o6274o3544o0533n7209
$$ 2485425 2400262 2317984 2239808 2165795 2094613 2024921 1956569 1890295 1826751 1766218 1709009
53259A709009n3305m8773m3927l9232l4914l0692k6134k1503j7796j5460j3511
$$ 1709009 1655704 1606931 1563004 1523772 1488858 1458166 1432032 1410529 1392733 1377273 1363762
53248A363762j0579o693l166q64O90K336M318O585R303J2434J5333J7411J8786
$$ 1363762 1353183 1346490 1343324 1342460 1343150 1345486 1349804 1356389 1365692 1378126 1393459 1410870 1429656
53235A429656J9914K0904K1798K3175K5633K8685L0934L1638L1660L2561L5031
$$ 1429656 1449570 1470474 1492272 1515447 1541080 1569765 1600699 1632337 1663997 1696558 1731589
53224A731589L8445M1701M4142M5673M6299M5744M3769M0851L8279L7025L6543
$$ 1731589 1770034 1811735 1855877 1901550 1947849 1993593 2037362 2078213 2116492 2153517 2190060
53213B190060L5234L2362K8988K6482K4588K1770J7424J2777R289O945M710K089
$$ 2190060 2225294 2257656 2286644 2313126 2337714 2359484 2376908 2389685 2398974 2405919 2410629 2412718
53201B412718m73k561m350o261q631j1874j6311k1620k6677l0332l2405l3902
$$ 2412718 2412245 2409684 2405334 2399073 2390442 2378568 2362257 2340637 2313960 2283628 2251223 2217321
53189B217321l6258m0155m4892m9084n2112n4592n7196n9473o0498o0204n9364
$$ 2217321 2181063 2140908 2096016 2046932 1994820 1940228 1883032 1823559 1763061 1702857 1643493
53178A643493n8337n6756n4542n2421n1134n0626n0211m9135m7062m4628m3305
$$ 1643493 1585156 1528400 1473858 1421437 1370303 1319677 1269466 1220331 1173269 1128641 1085336
53167A085336m3783m4548m3287l9845l6559l5120l4540l3088l0966k9580k9037
$$ 1085336 1041553 997005 953718 913873 877314 842194 807654 774566 743600 714020 684983
53156F84983k7973k5670k2943k0777j9216j7756j6120j4380j2857j1874j1239
$$ 684983 657010 631340 608397 587620 568404 550648 534528 520148 507291 495417 484178
53145D84178j0200q432o736o121o572p407q355r335r577q268o019m556m700n591
$$ 484178 473978 465546 458810 452689 446117 438710 430355 421020 411443 403175 397156 392600 387900 382309
53131C82309o061n838n266m781m917n952p203p473o410m817l508k770k885l928
$$ 382309 376248 370410 365144 360363 355446 349494 342291 334818 328408 323591 320083 317313 314428 310500
53117C10500m848m118j985p24j772l788m642m245l974m134l740k579j775k163
$$ 310500 305652 301534 299549 298825 297053 293265 288623 284378 280404 276270 272530 269951 268176 266013
53103B66013l354m696n939o504n443k853m87mj046j952j930j688j989k616l064
$$ 266013 262659 257963 252024 245520 240077 237224 236737 236733 235687 233735 231805 230117 228128 225512 222448
53088B22448l418l912m106l282j594j13M61N18O30N97l2q42r00j55M85O50J131
$$ 222448 219030 215118 211012 207730 206136 206023 206484 207002 207632 208229 208197 207355 206455 206300 206785 207435 208566
53071B08566K423L445K741N77j191j501j318k039l481m256l834l246l429l676
$$ 208566 210989 214434 217175 217752 216561 215060 213742 211703 208222 203966 200132 196886 193457 189781
53057A89781k445M35L156L821K500R16L44N20O65P75J243J645Q59j368l629m235
$$ 189781 187336 187771 190927 194748 197248 198164 198508 199028 199693 200468 201711 203356 204215 202847 199218 194983
53041A94983l150k017k265l689n024n485n309n045m730l925k286j37J533J783
$$ 194983 191833 189816 187551 183862 178838 173353 168044 162999 158269 154344 152058 151921 153454 155237
53027A55237O78o15r32k81L84L61j57n76n77l19l01j011k279l134k788j660p47
$$ 155237 155915 155300 154368 154087 154471 154832 154675 154099 153522 153203 152902 151891 149612 146478 143690 142030 141283
53010A41283j51Q31K062K271R55n27o47L49J148J388J707K227K270J663J165J263
$$ 141283 141132 141963 144025 146296 147251 146724 146077 146426 147574 148962 150669 152896 155166 156829 157994 159257
52994A59257J526J503J466J768K018J571O17J80R25K346L309L314K821K341J729
$$ 159257 160783 162286 163752 165520 167538 169109 169726 169906 170831 173177 176486 179800 182621 184962 186691
52979A86691P89N5O0J12j002l042m303l944l090k909k948k368j562j345j474j457
$$ 186691 187480 187535 187595 187707 186705 183663 179360 175416 172326 169417 166469 164101 162539 161194 159720 158263
52963A58263j719k476k409m81J579Q67k686o098p218o752o051n142l892l164l441
$$ 158263 156544 154068 151659 151178 152757 153624 150938 144840 137622 130870 124819 119677 115785 112621 109180
52948A09180l681k758j120P7N70P87Q15N60K09j72q97j838k149j437m86j83l88
$$ 109180 105499 102741 101621 101698 102268 103055 103870 104430 104639 104467 103570 101732 99583 98146 97660 97477 97089
52931I7089n56p11j094j464j345m90J184L342M701L860J165j280k078j873j666
$$ 97089 96533 95822 94728 93264 91919 91429 92613 95955 100656 104516 105681 104401 102323 100450 98784
52916I8784j168J19J437J750J212N05m98k053l285l093j867j052j261j860k105
$$ 98784 97616 97735 99172 100922 102134 102639 102141 100088 96803 93710 91843 90791 89530 87670 85565
52901H5565j679n98N01M87q74k135j847m13P32J081R30J46j277k027p01J794K910
$$ 85565 83886 83288 83789 84276 83402 81267 79420 79007 79739 80820 81750 81896 80619 78592 77891 79685 82595
52884H2595J771J38k68R8j15r63j229p4K006L502L061Q22j432k014j118k14K3
$$ 82595 84366 84504 84236 84334 84219 83256 82027 81953 83959 87461 90522 91344 89912 87898 86780 86566 86589
52867H6589J61M86L85l38o27N58K672L993L464J792O48R10J711J570L87m08J11
$$ 86589 86750 87236 87621 87283 86656 87214 89886 93879 97343 99135 99783 100693 102404 103974 104361 103953 104064
52850A04064J143J574J631J935J839K17k399l982l320j017J665L781M604L974
$$ 104064 105207 106781 108412 110347 112186 112403 110004 106022 102702 101685 103350 107131 111735 115709
52836A15709K941K846L550L580K293P95M71J472K894L613K796N26j921l129k999
$$ 115709 118650 121496 125046 128626 130919 131714 132185 133657 136551 140164 142960 143486 141565 138436 135437
52821A35437k498k248k246k538l013k792j202P78J337N9j909l608m729m674l131
$$ 135437 132939 130691 128445 125907 122894 120102 118900 119678 121015 121074 119165 115557 110828 106154 103023
52806A03023j485j516k546k085J55J460K15j629j659m41L1m01l99L57J012J214
$$ 103023 101538 100022 97476 95391 95546 97006 97221 95592 93933 93492 93523 93122 92723 93080 94092 95306
52790I5306J267J170Q25P37J346K098K228J842J376Q05K72N23J612K216J404J03
$$ 95306 96573 97743 98568 99305 100651 102749 104977 106819 108195 109000 109272 109795 111407 113623 115027 115130
52774A15130m60o85j515k455k384j574j175j206p72J14N45K52l30j144k163k486
$$ 115130 114670 113985 112470 110015 107631 106057 104882 103676 102904 103018 103563 103815 103485 102341 100178 97692
52758I7692j404OJ01q82j328q32l14K58J917M180M757K665k08j581j361p73l78
$$ 97692 96288 96294 96395 95513 94185 93353 93039 93297 95214 99394 104151 106816 106608 105027 103666 102893 102515
52741A02515q5o5l93m83J36R67J154O12k7k05J34N92O20J84M3Q21J967K429K073
$$ 102515 102430 102365 101972 101489 101625 102592 103746 104358 104331 104126 104260 104852 105472 105656 105699 106520 108487 110916 112989
52722A12989J529Q67k95j420j253L11J969K872L485M121M087K999J791J562K335
$$ 112989 114518 115385 115090 113670 112417 112728 114697 117569 121054 125175 129262 132261 134052 135614 137949
52707A37949L475M328L936J439k389n203n555m403l341k560j488l62J16j52r65
$$ 137949 141424 145752 149688 151127 148738 143535 137980 133577 130236 127676 126188 125826 125942 125790 124825
52692A24825k322l624l439j486J56n57k705l622k600j501j763k664k964k661k381
$$ 124825 122503 118879 115440 113954 114110 113553 110848 107226 104626 103125 101362 98698 95734 93073 90692
52677I0692k197j815j181l39O88J484J325J00j254j658r28K62J171J490J242M21
$$ 90692 88495 86680 85499 85160 85848 87332 88657 88757 87503 85845 84917 85179 86350 87840 89082 89503
52661H9503j073k853l629k239N62K272J470l13n94Q02J858J411M38J00P9m04r43
$$ 89503 88430 85577 81948 79709 80271 82543 84013 83700 83106 83908 85766 87177 87615 87715 87794 87390 86447
52644H6447m37J255K932L267K075M06n28o31r60k190l477l499k356j433j454j639
$$ 86447 86010 87265 90197 93464 95539 95945 95417 94786 93826 91636 88159 84660 82304 80871 79417 77778
52628G7778j139l05l1m59r45q92j62R52J849J919J042l16j493j960j511n28J64
$$ 77778 76639 76334 76303 75844 74899 74007 73845 74797 76646 78565 79607 79291 77798 75838 74327 73799 73963
52611G3963K73M75J225J700R62k53l97L59J67j543k887k223n32P8p96j706j361
$$ 73963 74236 74711 75936 77636 78598 78345 77948 78307 78474 76931 74044 71821 71289 71367 70571 68865 67504
52594F7504L17K423L571K804Q73j89M62J405J247P74J394K558K630J677J367K269
$$ 67504 67821 70244 73815 76619 77492 77303 77765 79170 80417 81191 82585 85143 87773 89450 90817 93086
52578I3086L090K799J830R43M02N50J586K541K014M51O6J732L511L338J842J145
$$ 93086 96176 98975 100805 101748 102150 102700 104286 106827 108841 109292 109358 111090 114601 117939 119781 120926
52562A20926J959L271M280N033N289M187J525j462l131l020k185k010k811l745
$$ 120926 122885 126156 130436 135469 140758 144945 146470 145008 141877 138857 136672 134662 131851 128106
52548A28106m049l930l883l743l270l103l900m745l977j766k42m94j065m25P34
$$ 128106 124057 120127 116244 112501 109231 106128 102228 97483 93506 91740 91498 91004 89939 89514 90248
52533I0248R19K61j88m72j265k002j449R6R88O73K70M08J60j244k866l151j756
$$ 90248 91167 91428 91240 90768 89503 87501 86052 86148 87136 87809 88079 88487 88647 87403 84537 81386 79630
52516G9630L30J832K005J010j61o87r22j702k563j869Q11L474L823J985J60j34
$$ 79630 79960 81792 83797 84807 84646 83959 83037 81335 78772 76903 77714 81188 85011 86996 87156 87022
52500H7022M60L88p81k052k375j956j775j972j435M81K530K876J481m6q60j605
$$ 87022 87482 87870 87089 85037 82662 80706 78931 76959 75524 76005 78535 81411 82892 82846 81986 80381
52484H0381k392j914K92K155J444r50k018o68J132J495J092J533K734L307K844
$$ 80381 77989 76075 76367 78522 79966 79016 76998 76330 77462 78957 80049 81582 84316 87623 90467
52469I0467K331K362K196R98q66k246k470j759o91K18O48O08N09P72J356J829
$$ 90467 92798 95160 97356 98354 97488 95242 92772 91013 90322 90540 91188 91796 92305 93077 94433 96262
52453I6262J862J383M66n64r66j70J258J800N69j547k704k013l02Q11M03j023
$$ 96262 98124 99507 99973 99409 98443 98273 99531 101331 101900 100353 97649 95636 95334 96145 96548 95525
52437I5525j952j172R93K895L197K162J023M08j65j312k764l548l067j861j152
$$ 95525 93573 92401 93394 96289 99486 101648 102671 103079 102914 101602 98838 95290 92223 90362 89210
52422H9210j418j600l39K018L433K609N83p09o94j82K16N14N60R5n04n93m26q44
$$ 89210 87792 86192 85853 87871 91304 93913 94496 93787 93093 92911 93127 93641 94201 94296 93792 93199 92773 91929
52404I1929j751k012j130L1O33R66J589K257K326J669O24l91q34k15J114J878
$$ 91929 90178 88166 87036 87067 87700 88666 90255 92512 94838 96507 97131 96740 95906 95691 96805 98683
52388I8683J191l95j595j736j079k67J61R5Q5Q17K087K811K395J478R09O70L39
$$ 98683 99874 99479 97884 96148 95069 94802 94963 95058 95143 95960 98047 100858 103253 104731 105640 106310 106649
52371A06649N7K30O12M54m69j509j903j601j306j700k501k531j209K82K31j219
$$ 106649 106706 106936 107548 108002 107533 106024 104121 102520 101214 99514 97013 94482 93273 93555 93786 92567
52355I2567k001q21J174K052J442M08k28m31l99l75p17j350j565r27MN12P57J259
$$ 92567 90566 89745 90919 92971 94413 94821 94593 94162 93763 93388 92671 91321 89756 88829 88833 89345 90102 91361
52337I1361J930K396K706K829K064R2j881k279j244l74m34o10o4R71J905K479
$$ 91361 93291 95687 98393 101222 103286 103378 101497 99218 97974 97600 97166 96556 96492 97463 99368 101847
52321A01847K426J420l5n97L52J614J436l36j945j690J04J400P51j061k103j689
$$ 101847 104273 105693 105658 105061 105413 107027 108463 108127 106182 104492 104596 105996 106747 105686 103583 101894
52305A01894q44m69j56N47R80N37O0P50K166K796K250J542J264R29L11L2L44N46
$$ 101894 101050 100581 100425 100972 101952 102489 102549 103299 105465 108261 110511 112053 113317 114246 114557 114589 114933 115479
52287A15479J73j21M43J565K236J889Q16k12m90Q5Q79J227J293J676K381K694
$$ 115479 115652 115531 115974 117539 119775 121664 122480 122268 121778 121863 122742 123969 125262 126938 129319 132013
52271A32013K058N14j513l230l618k523j385j765l117l241j096J958M067M728
$$ 132013 134071 134585 133072 129842 126224 123701 122316 120551 117434 114193 113097 115055 119122 123850
52257A23850M321L025J091o26j361j247q65m73j07P7J27M53J164J630J205J08
$$ 123850 128171 131196 132287 131661 130300 129053 128188 127715 127608 127685 127812 128265 129429 131059 132264 132372
52241A32372p77p00M47K025K933K541J499J136J868K781K872K150J318R49J149
$$ 132372 131595 130895 131342 133367 136300 138841 140340 141476 143344 146125 148997 151147 152465 153414 154563
52226A54563J523J398O49J26O19J548J709J161J149K047K690K075O13p41j370
$$ 154563 156086 157484 158133 158259 158878 160426 162135 163296 164445 166492 169182 171257 171870 171129 169759
52211A69759q25R27K601K374L63j123o25N38M78o08j273j123p44k21O63J264P75
$$ 169759 168934 169861 172462 174836 175199 174076 173451 173989 174467 173859 172586 171463 170719 170498 171161 172425 173200
52194A73200l20p36j79M84P26Q91J328J884K231K112J514R78J163J740J645R32
$$ 173200 172880 172144 171965 172449 173175 174066 175394 177278 179509 181621 183135 184113 185276 187016 188661 189593
52178A89593J148K859M185L230Q91n19m53j03N5N50J130Q59j15p00p76j029j038
$$ 189593 190741 193600 197785 201015 201906 201387 200934 200831 200886 201436 202566 203425 203310 202610 201834 200805 199767
52161A99767L43K530L472K751K160K526K355P82n22m5J025R56N81J818M141N087
$$ 199767 200110 202640 206112 208863 211023 213549 215904 216686 216164 216119 217144 218100 218681 220499 224640 229727
52145B29727L987K811L036L710L378K229J415J297J430J593J837J949J689J506
$$ 229727 233714 236525 239561 243271 246649 248878 250293 251590 253020 254613 256450 258399 260088 261594
52131B61594K069L026L025J386q08j923j666r26q7J321L116L988L278K145J861
$$ 261594 263663 266689 269714 271100 270292 268369 266703 265777 265690 267011 270127 274115 277393 279538 281399
52116B81399J923J135k12q97r40j391k012j262R82K608K075M38m31l64l58o94
$$ 281399 283322 284457 284245 283348 282408 281017 279005 277743 278725 281333 283408 283846 283415 283051 282693 281999
52100B81999q81p71n95m10m41j240k550k881j473J66P3j368k084j353m82m47o35
$$ 281999 281118 280347 279752 279342 278901 277661 275111 272230 270757 270923 270996 269628 267544 266191 265709 265262 264627
52083B64627m09k51o01q61n10j90o10j163q25K0j06j632l236l541k693j782j359
$$ 264627 264218 263967 263366 262505 261995 261805 261195 260032 259207 259227 259121 257489 254253 250712 248019 246237 244878
52066B44878j154q85n55k4R66K114K495J640K13q43j430j925k100j394k17J49
$$ 244878 243724 242839 242284 242260 243226 245340 247835 249475 249688 248845 247415 245490 243390 241996 241779 241928
52050B41928o51j288m67J287K413K355J859J460P19q42k748l931l726k310n04
$$ 241928 241277 239989 239522 240809 243222 245577 247436 248896 249615 248773 246025 242094 238368 236058 235554
52035B35554P59J024N54l6m02n15k96M94J802L027L405K709J525P36O05N66J50
$$ 235554 236313 237337 237891 237855 237453 236938 236642 237136 238938 241965 245370 248079 249604 250340 250945 251511 251661
52018B51661j35N72K014K834K403J712J833K174J397m02j619j215K30J572K219
$$ 251661 251526 252098 254112 256946 259349 261061 262894 265068 266465 266063 264444 263229 263459 265031 267250
52003B67250J922O23r14j292j14J272J411N79O4J21j28q82j021K90K261L409L266
$$ 267250 269172 269795 268881 267589 267475 268747 270158 270737 270801 270922 270794 269912 268891 269181 271442 274851 278117
51986B78117K508J833J424J317J502J598J127L56K29J049J707R57q13j948j648
$$ 278117 280625 282458 283882 285199 286701 288299 289426 289782 290011 291060 292767 293724 292911 290963 289315
51971B89315q72o91o95N2R96L93k129m433m136j427J193J696K98j452k444k638
$$ 289315 288443 287752 287057 287109 288105 288498 286369 281936 277800 276373 277566 279262 279560 278108 275664 273026
51955B73026k561k689k971k725j303Q58K285J914J44j792l133l679l201j725k70
$$ 273026 270465 267776 264805 262080 260777 261635 263920 265834 265978 264186 261053 257374 254173 252448 252178
51940B52178k38j656k821k235m05Q07K72j432k934l442l244l091l233l122k295
$$ 252178 251940 250284 247463 245228 244823 245630 245902 244470 241536 238094 234850 231759 228526 225404 223109
51925B23109j307j166j806j933p82O81R11m12k295l645l906k987j427l53n50j588
$$ 223109 221802 220636 218830 216897 216115 216796 217707 217295 215000 211355 207449 204462 203035 202682 202132 200544
51909B00544k493k936l208l418l529l853m551m944m366l451l464m377m845m108
$$ 200544 198051 195115 191907 188489 184960 181107 176556 171612 167246 163795 160331 155954 151109 147001
51895A47001k739j456m39p9q70k140k343j345j004k456m187l945j578J276L246
$$ 147001 144262 142806 142367 142288 141418 139278 136935 135590 134586 132130 127943 123998 122420 123696 126942
51880A26942L666K041j170l824l902j930j89K38J51J60j72r41j326r97o25l95
$$ 126942 130608 132649 131479 127655 123753 121823 121634 121872 122023 122183 122011 121070 119744 118747 118122 117727
51864A17727N51K277L085J649p33j531j57J532J733O02n30p49p0R86J766J819
$$ 117727 118278 120555 123640 125289 124556 123025 122868 124400 126133 126735 126205 125456 125386 126372 128138 129957
51848A29957J252N97J49l03q97j142n54L63M06p03j637j075L95Q38m64k027k120
$$ 129957 131209 131806 131955 131652 130755 129613 129059 129422 129828 129125 127488 126413 126808 127646 127182 125155 123035
51831A23035q80J86J15q27j902k451j905k66J486K250K079J927K165K277J942
$$ 123035 122155 122341 122456 121629 119727 117276 115371 115105 116591 118841 120920 122847 125012 127289 129231
51816A29231J429O98p38k536l116j505R78J943O51j271j924j146k91m17j205j532
$$ 129231 130660 131358 130620 128084 124968 123463 124441 126384 127035 125764 123840 122694 122403 121986 120781 119249
51800A19249p84N64J545J556O33p74j910j992r77P5k2j158k019j697o54J13K98
$$ 119249 118465 119029 120574 122130 122763 121989 120079 118087 117110 117185 117163 116005 113986 112289 111635 111748 112046
51783A12046L96R80K180L536M205L635K246J003L46K1K7P55J925K327J474O18
$$ 112046 112442 113422 115602 119138 123343 126978 129224 130227 130573 130594 130621 131376 133301 135628 137102 137720
51767A37720J176K574K903J559J8j04J150K597L311L109K356J830K261L447M188
$$ 137720 138896 141470 144373 145932 145950 145846 146996 149593 152904 156013 158369 160199 162460 165907 170095
51752A70095L633K410J855K356L091L254K986K980L735N268P042P996P358N851
$$ 170095 173728 176138 177993 180349 183440 186694 189680 192660 196395 201663 208705 216701 224059 229910
51738B29910N416P027R160R449P598N527M494L458J080j915l635l779l918n070
$$ 229910 235326 242353 251513 260962 268560 274087 278581 282039 283119 281204 277569 273790 269872 264802
51724B64802o379o603n800m818l917k777j490p44j016j971k715k565j688j026
$$ 264802 258423 251820 246020 241202 237285 234508 233018 232274 231258 229287 226572 224007 222319 221293
51710B21293j429k683l702l621k494r59K03L11p56k087k387j368j00K02p01k143
$$ 221293 219864 217181 213479 209858 207364 206405 206608 206919 206163 204076 201689 200321 200221 200423 199722 197579
51694A97579l088k513k32K296L007J602n9m40j86o21j537j759j176p05n83j54
$$ 197579 194491 191978 191746 194042 197049 198651 198592 198152 197966 197345 195808 194049 192873 192168 191585 191431
51678A91431P11J290J179O66q9j184k206k355j550m48O56J957L049K992J806P45
$$ 191431 192142 193432 194611 195277 195188 194004 191798 189443 187893 187445 188101 190058 193107 196099 197905 198650
51662A98650O45R21P32J76j17J68J034K250L098K909K105J678J367k18l041m825
$$ 198650 199295 200216 200948 201124 201007 201175 202209 204459 207557 210466 212571 214249 215616 215398 212357 207532
51646B07532l874j462o7k96j037j620k117k075r14N18N89p76j885j690j055j218
$$ 207532 203658 202196 202129 201833 200796 199176 197059 194984 194070 194588 195177 194401 192516 190826 189771 188553
51630A88553k222l296l823l431k019k14R51J123Q50N65J59l33o03p74j327j985
$$ 188553 186331 183035 179212 175781 173762 173548 174499 175622 176472 177037 177196 176863 176260 175486 174159 172174
51614A72174j700j79J581K686L170K904J078k137m536l997j207J046J134O0k97
$$ 172174 170474 170295 171876 174562 177732 180636 181714 179577 175041 171044 169837 170883 172017 172077 171780
51599A71780O70K020K388J159r72k526k672k025j636j620j316m78N20J393K076
$$ 171780 172450 174470 176858 178017 177045 174519 171847 169822 168186 166566 165250 164772 165292 166685 168761
51584A68761K186J362J63k64K98P46K22o32o01M24J326J250N56J90M95R67J132
$$ 168761 170947 172309 172472 172208 172506 173252 173474 172842 172241 172665 173991 175241 175797 175987 176482 177449 178581
51567A78581J258J895K909L467L033J903N82p77j971k431j889r23k33K26P76J173
$$ 178581 179839 181734 184643 188110 191143 193046 193628 192851 190880 188449 186560 185637 185404 185630 186406 187579
51551A87579J040P45Q88J185R52L96J95l9j355l293l898k494r55j063j936j496
$$ 187579 188619 189364 190252 191437 192389 192785 192980 192941 191586 188293 184395 181901 180946 179883 177947 176451
51535A76451L83J894K025J621J602J639J072J87j53L46J103J289M35j226k879
$$ 176451 176834 178728 180753 182374 183976 185615 186687 186874 186721 187067 188170 189459 189894 188668 185789
51520A85789l676l344k283j165o36j012j987k754k740k108j309m96K70O26M06
$$ 185789 182113 178769 176486 175321 174685 173673 171686 168932 166192 164084 162775 162279 162549 163175 163581
51505A63581K41Q80K000K480J986J437J654K212K164J384O18N35J203K285L235
$$ 163581 163822 164702 166702 169182 171168 172605 174259 176471 178635 180019 180637 181172 182375 184660 187895
51490A87895L411K488Q82n23j204j235q16K5Q53O34j136l194l430j447O04O17
$$ 187895 191306 193794 194676 194153 192949 191714 190898 190923 191776 192410 191274 188080 184650 183203 183807 184424
51474A84424q00j369m02N31K89k00K54J187J578J710K412L253L171K474K513L429
$$ 184424 183624 182255 181853 182384 182673 182473 182727 183914 185492 187202 189614 192867 196038 198512 201025 204454
51458B04454L926L445K898K774K168N63q39q09j1N5n80m73J000K704L183K162
$$ 204454 208380 211825 214723 217497 219665 220228 219389 218580 218569 218624 218044 217571 218571 221275 224458 226620
51442B26620M36j062j796j688r38J34J092J355O29n06r12j13J189K039K153J597
$$ 226620 227056 225994 224198 222510 221572 221706 222798 224153 224782 224276 223364 223251 224440 226479 228632 230229
51426B30229K45j798l637m277l634k346q06Q81K226K438J348l21j799k932l817
$$ 230229 230474 228676 225039 220762 217128 214782 213976 214857 217083 219521 220869 220548 218749 215817 212000
51411B12000m151l346j362P66J595Q10j39L48J936K705J818N48P5l02j603k908
$$ 212000 207849 204503 203141 203907 205502 206312 206173 206521 208457 211162 212980 213528 213603 213301 211698 208790
51395B08790k597j218j047k607l673k525m48J49j101k592l171l021k469j354K00
$$ 208790 206193 204975 203928 201321 197648 195123 194675 194824 193723 191131 187960 184939 182470 181116 181316
51380A81316J369J492Q57K13k17q58j874k560k033n50N00L36j20L35J131O13j266
$$ 181316 182685 184177 185034 185247 185030 184172 182298 179738 177705 177155 177655 177991 177871 178206 179337 179950 178684
51363A78684k442j517J97N21o88j592r36O22J643J490O79K07N10Q66J53j464k349
$$ 178684 176242 174725 174922 175443 174755 173163 172227 172849 174492 175982 176661 176868 177378 178244 178397 176933 174584
51346A74584j477K9L96m53j171j159j001r30l57Q41J902K379K647K786K210Q85
$$ 174584 173107 173136 173532 173079 171908 170749 169748 168818 168461 169302 171204 173583 176230 179016 181226 182111
51330A82111k37o08p52q67j37J528K330P80j757k478q50Q91J070O67J437L278
$$ 182111 181874 181266 180514 179647 179510 181038 183368 184148 182391 179913 179063 179954 181024 181691 183128 186406
51314A86406M532M188K710R87n86j868k533k364j799j704k338k838k213r01n84
$$ 186406 190938 195126 197836 198823 198237 196369 193836 191472 189673 187969 185631 182793 180580 179679 179095
51299A79095k068l986m320k844j201p69j347k075k580k821k523j503k16N27K51
$$ 179095 177027 173041 168721 165877 164676 163907 162560 160485 157905 155084 152561 151058 150842 151369 151620
51284A51620q73k145k630j842m23K32m98j717k185j853j667k019k186j483l39
$$ 151620 150747 148602 145972 144130 143707 143939 143441 141724 139539 137686 136019 134000 131814 130331 129992
51269A29992K63J54J56P57J191M86q29j053L35J669J229l49j063n39l21j047j191
$$ 129992 130255 130409 130565 131322 132513 132999 132170 131117 131452 133121 134350 134001 132938 132399 132078 131031 129840
51252A29840L85K110J665n66j853q59P56R00j72o95j11M02o3p79n56M41R34M71
$$ 129840 130225 132335 134000 133434 131581 130722 131478 132378 132206 131511 131400 131802 131739 130960 130404 130845 131779 132250
51234A32250J70R74J972J506l38j648j392q27j478k864l375k644j615p60K65J311
$$ 132250 132420 133394 135366 136872 136534 134886 133494 132667 131189 128325 124950 122306 120691 119931 120196 121507
51218A21507J631J315J356J907J862Q63K85J086J882P75j561k446q08J350J696
$$ 121507 123138 124453 125809 127716 129578 130441 130726 131812 133694 134469 132908 130462 129654 131004 132700
51203A32700M19o07o34p26j831l271l589k275j85J458K093J905J280L77q38k107
$$ 132700 133119 132512 131878 131152 129321 126050 122461 120186 120001 121459 123552 125457 126737 127114 126276 124169
51187A24169k592j477Q46K612K276K53j460j470k39Q80J182Q91N77P11J347J904
$$ 124169 121577 120100 120946 123558 125834 126087 124627 123157 122918 123798 124980 125871 126448 127159 128506 130410
51171A30410J676Q81N72J115J534R69r1p74j137j503j272J18J618J545J9j201
$$ 130410 132086 132967 133539 134654 136188 137157 137066 136292 135155 133652 132380 132498 134116 135661 135680 134479
51155A34479j224q29o38k75J70l68k043l131k100L34K200K536J834J151J468L000
$$ 134479 133255 132426 131788 131513 131683 131315 129272 126141 124041 124375 126575 129111 130945 132096 133564 136564
51139A36564M418L831J450m2R94K593J847q74k454j343P71J734J437Q59K10q70
$$ 136564 140982 144813 146263 146221 147215 149808 151655 150781 148327 146984 147755 149489 150926 151785 151995 151125
51123A51125k108k655k236j662j979l047l315j543J227K506J569M82R68J688M27
$$ 151125 149017 146362 144126 142464 140485 137438 134123 132580 133807 136313 137882 138364 139332 141020 141447
51108A41447k074k846r33J512K502K337J832P59q09j554r68p56k447m670m707
$$ 141447 139373 136527 135594 137106 139608 141945 143777 144536 143727 142173 141205 140449 138002 133332 128625
51093A28625k182O42J977K142K008J497L54q39j260r54m92L0R34K017K474J979
$$ 128625 126443 127085 129062 131204 133212 134709 135063 134224 132964 132010 131518 131548 132482 134499 136973 138952
51077A38952J285J211J329N13j138j809j27K786M323L226O55j522k482k451j810
$$ 138952 140237 141448 142777 143290 142152 140343 140216 143002 147325 150551 151206 149684 147202 144751 142941
51062A42941q42P9N27K47m66n97Q41L260M362K695j26j124K36J572J141Jj64L77
$$ 142941 142099 142178 142705 142952 142486 141889 142730 145990 150352 153047 152921 151797 152033 153605 154746 154747 154583 154960
51044A54960L83k6K84J371K071J735R61N38O09R21J238J429J556J755J734Q97
$$ 154960 155343 155317 155601 156972 159043 160778 161739 162277 162886 163807 165045 166474 168030 169785 171519 172416
51028A72416p10k074k409k089j917k030k193k491k866k644j414Q5Q38Q16M81j98
$$ 172416 171706 169632 167223 165134 163217 161187 158994 156503 153637 150993 149579 149664 150502 151318 151799 151601
51012A51601j159j358N5K082K962K674K675L146K489P4k182k175k70J535K212
$$ 151601 150442 149084 149139 151221 154183 156857 159532 162678 165167 165241 163059 160884 160614 162149 164361
50997A64361K268K258K030J417O78M6o27j443k066k055j536j188j395j585r04
$$ 164361 166629 168887 170917 172334 173012 173058 172431 170988 168922 166867 165331 164143 162748 161163 160259
50982A60259L94R93K83n57J6J855L282L028J335o61j761j277L22J578J617J246
$$ 160259 160653 161646 161929 161372 161388 163243 166525 169553 170888 170227 168466 167189 167511 169089 170706 171952
50966A71952J570K101J678Q30J342L264M281K815J18j527j351m2J551K615K511
$$ 171952 173522 175623 177301 178131 179473 182737 187018 189833 189951 188424 187073 187031 188582 191197 193708
50951A93708J780J852K757K558L57j603q03J747K834J590K40L72J006R45P60J265
$$ 193708 195488 197340 200097 202655 203012 201409 200606 202353 205187 206777 207017 207389 208395 209340 210100 211365
50935B11365J768J294L44lJ60K4l94n28n97j322k370k466j251J11N86N44P28Q74
$$ 211365 213133 214427 214771 214768 214928 214952 214558 214030 213433 212111 209741 207275 206024 206135 206721 207265 207993 208867
50917B08867L07n20k58J405K996K941J387k18r83j141j051m81P01J897K415K327
$$ 208867 209174 208654 208396 209801 212797 215738 217125 216907 215924 214783 213732 213251 213952 215849 218264 220591
50901B20591K257K529K969L324L410L030K232J524J331J411J361J615L072N541
$$ 220591 222848 225377 228346 231670 235080 238110 240342 241866 243197 244608 245969 247584 250656 256197
50887B56197P288O833M773L232L638N534P429Q253P985P383P345Q180R262R679
$$ 256197 263485 270318 275091 278323 281961 287495 294924 303177 311162 318545 325890 334070 343332 353011
50873C53011R305Q892Q968R148Q813P980O970N754M340L427L639M332M264L370
$$ 353011 362316 371208 380176 389324 398137 406117 413087 418841 423181 426608 430247 434579 438843 442213
50859D42213K608J936J57k588m038k968j447k022l733l492q39J354J164j2q2J043
$$ 442213 444821 446757 446914 444326 440288 437320 435873 433851 430118 426626 425787 427141 428305 428293 428211 429254
50843D29254K486M103N628N956M791L655L675L837L113K829M718P764R503R747
$$ 429254 431740 435843 441471 447427 452218 455873 459548 463385 466498 469327 474045 481809 491312 501059
50829E01059J0379J1732J1945J0377Q888Q803Q851P501N553M833N438N832M960
$$ 501059 511438 523170 535115 545492 554380 563183 572034 579535 585088 589921 595359 601191 606151
50816F06151L116J218N0k39m95j695l334l679k273j062k005m501o412o789o296
$$ 606151 609267 610485 610535 610296 609801 608106 604772 601093 598820 597758 595753 591252 584840 578051 571755
50801E71755n568m722m277m957o434p477p605p538p645p145n423l377k435k681
$$ 571755 566187 561465 557188 552231 545797 538320 530715 523177 515532 508387 502964 499587 497152 494471
50787D94471k703j466K96R15j88j734j996n85J469L135M166M596M405M079M711
$$ 494471 491768 490302 490598 491513 491325 489591 487595 487010 488479 491614 495780 500376 504781 508860 513571
50772E13571O733R092J0389J0520J0375J0292R848R240R807J2574J6735K0221
$$ 513571 520304 529396 539785 550305 560680 570972 580820 590060 599867 612441 629176 649397
50760F49397K1654K1501K1363K2287K3875K4959K5098K4995K5352K5719K5021
$$ 649397 671051 692552 713915 736202 760077 785036 810134 835129 860481 886200 911221
50749I11221K3052K0947J9857J9557J8707J6508J3774J2055J1850J2136J1902
$$ 911221 934273 955220 975077 994634 1013341 1029849 1043623 1055678 1067528 1079664 1091566
50738A091566J1487J1793J2699J3259J3338J3907J5434J7102J8071J8551J9104
$$ 1091566 1103053 1114846 1127545 1140804 1154142 1168049 1183483 1200585 1218656 1237207 1256311
50727A256311J9944K1500K4593K9126L3549L6647L8973M1504M3839M5047M5327
$$ 1256311 1276255 1297755 1322348 1351474 1385023 1421670 1460643 1502147 1545986 1591033 1636360
50716A636360M5259M4279M1708L8691L6916L5665L2565K7477K3168K1351K0263
$$ 1636360 1681619 1725898 1767606 1806297 1843213 1878878 1911443 1938920 1962088 1983439 2003702
50705B003702J7360J2460O909J218m722j0377j5195j9733k4701k9575l3429l6360
$$ 2003702 2021062 2033522 2040431 2041649 2036927 2026550 2011355 1991622 1966921 1937346 1903917 1867557
50693A867557l8882m0622m0967m0368l9547l8229l6025l3865l2728l1614k8838
$$ 1867557 1828675 1788053 1747086 1706718 1667171 1628942 1592917 1559052 1526324 1494710 1465872
50682A465872k5070k2807k2623k2158j9500j5504j1797q401m761j600J65J465
$$ 1465872 1440802 1417995 1395372 1373214 1353714 1338210 1326413 1318012 1313251 1311651 1311816 1313281
50670A313281M218Q571J2517J4324J4312J3909J3779J3309J1535Q340M729J878
$$ 1313281 1317499 1326070 1338587 1352911 1367223 1381132 1394911 1408220 1419755 1428095 1432824 1434702
50658A434702j98k570n860r237j1431j2387j3265j4822j6260j5936j3173r327
$$ 1434702 1434504 1431934 1426074 1416837 1405406 1393019 1379754 1364932 1348672 1332736 1319563 1310236
50646A310236o739o293o264m261j11M177P406J0653J5068J9487K1795K1932K1949
$$ 1310236 1303497 1297204 1290940 1286679 1286568 1290745 1298151 1308804 1323872 1343359 1365154 1387086 1409035
50633A409035K3130K4613K5064K4413K3209K1329J8382J4973J2643J2446J3949
$$ 1409035 1432165 1456778 1481842 1506255 1529464 1550793 1569175 1584148 1596791 1609237 1623186
50622A623186J5806J7156J8344K0161K2508K4237K4695K4926K6541K9530L2164
$$ 1623186 1638992 1656148 1674492 1694653 1717161 1741398 1766093 1791019 1817560 1847090 1879254
50611A879254L3363L4386L7539M3583N1160N8584O5493P2411P9224Q4856Q8605
$$ 1879254 1912617 1947003 1984542 2028125 2079285 2137869 2203362 2275773 2354997 2439853 2528458
50600B528458R1079R3089R4002R2416Q8617Q5023Q3217Q1720P8206P3094O9073
$$ 2528458 2619537 2712626 2806628 2899044 2987661 3072684 3155901 3237621 3315827 3388921 3457994
50589C457994O7131O5249O1561N6808N2485M8213M2744L6577L1690K8904K7183
$$ 3457994 3525125 3590374 3651935 3708743 3761228 3809441 3852185 3888762 3920452 3949356 3976539
50578C976539K5614K4712K5396K7700L0894L4185L6988L9013M0323M0811L9736
$$ 3976539 4002153 4026865 4052261 4079961 4110855 4145040 4182028 4221041 4261364 4302175 4341911
50567D341911L6321L0857K4584J8343J1940M856l031j1564k0440k8942l6018m0961
$$ 4341911 4378232 4409089 4433673 4452016 4463956 4468812 4465781 4454217 4433777 4404835 4368817 4327856
50555D327856m3679m4296m2817l9290l3905k7045j9582j3000q445n714l779k380
$$ 4327856 4284177 4239881 4197064 4157774 4123869 4096824 4077242 4064242 4055797 4050083 4046304 4043924
50543D043924k387m644r220j5842k4146l3401m2915n2905o3826p4603q2938q8062
$$ 4043924 4041537 4036893 4027673 4011831 3987685 3954284 3911369 3858464 3794638 3720035 3637097 3549035
50531C549035r1890r6356j00650j02411j00865r7292r3010q8408q3871q0061p6925
$$ 3549035 3457145 3360789 3260139 3157728 3056863 2959571 2866561 2778153 2694282 2614221 2537296
50520B537296p3507o9219o4526o0136n6212n2581m9034m5214m0860l6321l2334
$$ 2537296 2463789 2394570 2330044 2269908 2213696 2161115 2112081 2066867 2026007 1989686 1957352
50509A957352k9055k5865k2241j8275j4248j0259o448k988K39L461O435Q722J0647
$$ 1957352 1928297 1902432 1880191 1861916 1847668 1837409 1830961 1827973 1828212 1831673 1838108 1846830 1857477
50496A857477J3226J6815K0584K3744K6776L0780L6049M1791M7216N2396N8114
$$ 1857477 1870703 1887518 1908102 1931846 1958622 1989402 2025451 2067242 2114458 2166854 2224968
50485B224968O5005P2800Q0328Q6372R0497R3027R4523R5707R7433J00024J02746
$$ 2224968 2289973 2362773 2443101 2529473 2619970 2712997 2807520 2903227 3000660 3100684 3203430
50474C203430J04793J06775J10237J15476J20936J25293J29141J33766J39037
$$ 3203430 3308223 3414998 3525235 3640711 3761647 3886940 4016081 4149847 4288884
50465D288884J43713J47455J51262J55808J60440J64236J67359J70573J73818
$$ 4288884 4432597 4580052 4731314 4887122 5047562 5211798 5379157 5549730 5723548
50456E723548J75910J75742J73135J68164J60204J48365J32747J14355R3527O9431
$$ 5723548 5899458 6075200 6248335 6416499 6576703 6725068 6857815 6972170 7065697 7135128
50446G135128M1825J2500j6133m3356o9778r5052j17375j35257j48220j55547
$$ 7135128 7176953 7189453 7173320 7129964 7060186 6965134 6847759 6712502 6564282 6408735
50436F408735j56077j50100j40006j28017j14240r8026q0033o1773m4082k7608
$$ 6408735 6252658 6102558 5962552 5834535 5720295 5622269 5542236 5480463 5436381 5408773
50426E408773j4093n551k516m419j1431k4279m2305o3224q5051j06853j27289
$$ 5408773 5394680 5389129 5386613 5382194 5370763 5346484 5304179 5240955 5155904 5049051 4921762
50415D921762j44043j55569j62463j66302j67895j67386j65227j61982j57584
$$ 4921762 4777719 4622150 4459687 4293385 4125490 3958104 3792877 3630895 3473311
50406C473311j51701j44772j37926j31684j25366j18021j09634j01119r3249q5977
$$ 3473311 3321610 3176838 3038912 2907228 2781862 2663841 2554207 2453088 2359839 2273862
50396B273862p8912p1981o5335n8951n3037m8454m5732m3587l9803l4070k8652
$$ 2273862 2194950 2122969 2057634 1998683 1945646 1897192 1851460 1807873 1768070 1734000 1705348
50385A705348k5256k2609j8576j3563r926q484p754o562n286m133k156J194N067
$$ 1705348 1680092 1657483 1638907 1625344 1615418 1606934 1599180 1592618 1587332 1583199 1581043 1582237 1587304
50372A587304Q590J1906J5082J7540J9541K2763K8074L3972L8556M2077M6016
$$ 1587304 1595894 1607800 1622882 1640422 1659963 1682726 1710800 1744772 1783328 1825405 1871421
50361A871421N0660N5285N9934O5113P0131P3804P6683Q0658Q6015R0799R3756
$$ 1871421 1922081 1977366 2037300 2102413 2172544 2246348 2323031 2403689 2489704 2580503 2674259
50350B674259R6132R9572J03787J07498J10512J13328J15462J15828J14484J12533
$$ 2674259 2770391 2869963 2973750 3081248 3191760 3305088 3420550 3536378 3650862 3763395
50340C763395J10150J06120R9638R1574Q3206P4538O4599N2903L9814K5715J0562
$$ 3763395 3873545 3979665 4079303 4170877 4254083 4328621 4393220 4446123 4485937 4511652 4522214
50329D522214n638k2521l9711n6922p3445q7885r8904j06137j10144j11552j10411
$$ 4522214 4516576 4494055 4454344 4397422 4323977 4236092 4137188 4031051 3920907 3809355 3698944
50318C698944j06430r9725r1284q2481p3842o4480n3398m1467l1332k4762k0872
$$ 3698944 3592514 3492789 3401505 3319024 3245182 3180702 3127304 3085837 3054505 3029743 3008871
50307C008871j7821j5725j6619k1575k9159l7135m4572n1590n8005o3269o7366
$$ 3008871 2991050 2975325 2958706 2937131 2907972 2870837 2826265 2774675 2716670 2653401 2586035
50296B586035p0740p3410p4807p4562p2932p0547o8064o6003o4353o2441n9624
$$ 2586035 2515295 2441885 2367078 2292516 2219584 2149037 2080973 2014970 1950617 1888176 1828552
50285A828552n6167n2922n0121m7067m3258l9261l6000l3499l0967k8045k5310
$$ 1828552 1772385 1719463 1669342 1622275 1579017 1539756 1503756 1470257 1439290 1411245 1385935
50274A385935k3321k1801k0208j8649j7542j6589j4984j2717j0809r913r516q877
$$ 1385935 1362614 1340813 1320605 1301956 1284414 1267825 1252841 1240124 1229315 1219402 1209886 1201009
50262A201009q069p472o955o303n823n679n291m290l411l325l171j736M22J678
$$ 1201009 1192940 1185468 1178513 1172210 1166387 1160708 1155417 1151127 1147716 1144391 1141220 1139484 1139906 1141584
50248A141584K034L182N686Q003Q967R549J1191J3802J6416J8587K0106K0490
$$ 1141584 1143618 1146800 1152486 1160489 1169456 1179005 1190196 1203998 1220414 1239001 1259107 1279597
50236A279597J9911J9603K0306K1023K0413J8520J6202J3710J0906Q042N265K120
$$ 1279597 1299508 1319111 1339417 1360440 1380853 1399373 1415575 1429285 1440191 1448233 1453498 1455618
50224A455618j553n158q739j3576k0014k6039k9446l0465l0537k9822k7951k6089
$$ 1455618 1454065 1448907 1440168 1426592 1406578 1380539 1351093 1320628 1290091 1260269 1232318 1206229
50212A206229k5646k5590k3786k0681j8844j8754j8023j5420j2799j1851j1570
$$ 1206229 1180583 1154993 1131207 1110526 1091682 1072928 1054905 1039485 1026686 1014835 1003265
50201A003265j0367q584p248o228n391n882q262j0652j0738q795o906n909n023
$$ 1003265 992898 984314 977066 970838 965447 959565 951303 940651 929913 921118 914212 908303 903280
50188I03280m061l975n043o117o146n417m866m936n386n715n431m308k601r95
$$ 903280 899219 895244 890201 884084 877938 872521 867655 862719 857333 851618 846187 841879 839278 838283
50174H38283k73p82j916k391j613n05l19q35r02m37m41j004j075o02r70k493l456
$$ 838283 838010 837228 835312 832921 831308 830803 830484 829649 828747 828310 827869 826865 825790 825188 824218 821725 818269
50157H18269k900k458l697n334n169l538k534k646k582j993j957k795l468l359
$$ 818269 815369 812911 809214 803880 798711 795173 792639 789993 787411 785418 783461 780666 777198 773839
50143G73839k801j738K00K064K120N04n56R6J046Q80N13J542L655N201N474N057
$$ 773839 771038 769300 769500 771564 773684 774188 773632 773728 774774 775654 776167 777709 781364 786565 792039 797096
50127G97096M447L617K806K674L586N249O948P873P619O665O049O179O425O128
$$ 797096 801543 805160 807966 810640 814226 819475 826423 834296 841915 848580 854629 860808 867233 873361
50113H73361N539N468O294P628Q570Q404P483P291Q761J0715J1029R533Q305Q745
$$ 873361 878900 884368 890662 898290 906860 915264 922747 930038 938799 949514 960543 970076 978381 987126
50099I87126R847J0270J0646J2387J5106J6927J7023J6358J6026J6022J5795J5207
$$ 987126 996973 1007243 1017889 1030276 1045382 1062309 1079332 1095690 1111716 1127738 1143533 1158740
50087A158740J4636J4749J6028J8085J9702K0170K0177K0721K1642K2253K2925
$$ 1158740 1173376 1188125 1204153 1222238 1241940 1262110 1282287 1303008 1324650 1346903 1369828
50076A369828K4690K7343K9465L0588L1976L4628L7758M0282M2889M7311N3804
$$ 1369828 1394518 1421861 1451326 1481914 1513890 1548518 1586276 1626558 1669447 1716758 1770562
50065A770562O0586O5904O9844P3684P7953Q1672Q3453Q2982Q1142P8723P5325
$$ 1770562 1831148 1897052 1966896 2040580 2118533 2200205 2283658 2366640 2447782 2526505 2601830
50054B601830O9832O1925N2890M4957L9781L7324L5751L2571K6400J7864Q496
$$ 2601830 2671662 2733587 2786477 2831434 2871215 2908539 2944290 2976861 3003261 3021125 3029621
50043C029621j145j1880k4344l7611m9785n9639o7379p3849p9347q3199q4445
$$ 3029621 3028476 3016596 2992252 2954641 2904856 2845217 2777838 2703989 2624642 2541443 2456998
50032B456998q2907p9486p5288p0727o5836o1178n7568n4770n1358m6433m0799
$$ 2456998 2374091 2294605 2219317 2148590 2082754 2021576 1964008 1909238 1857880 1811447 1770648
50021A770648l5876l2017k8717k5954k4192k3169k1813j9613j7156j5080j3353
$$ 1770648 1734772 1702755 1674038 1648084 1623892 1600723 1578910 1559297 1542141 1527061 1513708
50010A513708j1936j1183j0951j0154q117n796m688m869m981l987k106j64R82
$$ 1513708 1501772 1490589 1479638 1469484 1461367 1455571 1450883 1446014 1441033 1437046 1434940 1434776 1435758
49997A435758O53q71j786l16K818M806M313L271M061O176P273O791O553P870R772
$$ 1435758 1436411 1435540 1433754 1433438 1436256 1441062 1445375 1448646 1452707 1458883 1466156 1472947 1479500 1487370 1497142
49982A497142J0676J0358R676R458J0302J2461J5122J6626J6303J5488J5914J7707
$$ 1497142 1507818 1518176 1527852 1537310 1547612 1560073 1575195 1591821 1608124 1623612 1639526 1657233
49970A657233J9749K1313K2423K3137K3686K4884K7160K9533L0819L1612L3654
$$ 1657233 1676982 1698295 1720718 1743855 1767541 1792425 1819585 1849118 1879937 1911549 1945203
49959A945203L7230M0843M3788M7204N1812N6438O0130O4138P0101P7472Q4841
$$ 1945203 1982433 2023276 2067064 2114268 2166080 2222518 2282648 2346786 2416887 2494359 2579200
49948B579200R2919J03579J15962J26266J32241J35606J38674J40528J38547J32462
$$ 2579200 2672119 2775698 2891660 3017926 3150167 3285773 3424447 3564975 3703522 3835984
49938C835984J24863J18046J12187J06515J00520R3753Q5835P7180O8468N8989
$$ 3835984 3960847 4078893 4191080 4297595 4398115 4491868 4577703 4654883 4723351 4782340
49928D782340M6635L0205J0771r921l1440n4026p6665r7098j13753j26769j37017
$$ 4782340 4828975 4859180 4869951 4860030 4828590 4774564 4697899 4600801 4487048 4360279 4223262
49917D223262j44863j50152j52828j53186j51664j48616j44231j38577j31770
$$ 4223262 4078399 3928247 3775419 3622233 3470569 3321953 3177722 3039145 2907375
49908B907375j24168j16368j09045j02604r6719r0336q2699p4510o7546o2673
$$ 2907375 2783207 2666839 2557794 2455190 2358471 2268135 2185436 2110926 2043380 1980707
49898A980707n8752n4064m8513m3680m0810l9470l8282l6351l3714l0879k8352
$$ 1980707 1921955 1867891 1819378 1775698 1734888 1695418 1657136 1620785 1587071 1556192 1527840
49887A527840k6304k4483k2632k1055k0313k0207j9622j7891j5793j4601j4360
$$ 1527840 1501536 1477053 1454421 1433366 1413053 1392846 1373224 1355333 1339540 1324939 1310579
49876A310579j4004j3053j2206j1908j1329r521o961m995m039l266k005m29J191
$$ 1310579 1296575 1283522 1271316 1259408 1248079 1238558 1231597 1226602 1222563 1219297 1217292 1216863 1218054
49863A218054K843M117M289L638L678N230P252Q526R474J0954J2055J1085Q499
$$ 1218054 1220897 1225014 1229303 1232941 1236619 1241849 1249101 1257627 1267101 1278055 1290110 1301195 1309694
49850A309694O866P597R441J0739J1458J2226J3044J4081J6222J9432K1858K2216
$$ 1309694 1316560 1324157 1333598 1344337 1355795 1368021 1381065 1395146 1411368 1430800 1452658 1474874
49838A474874K2033K3674K6825K9065K9683L0833L4480L9955M5358N0053N4819
$$ 1474874 1496907 1520581 1547406 1576471 1606154 1636987 1671467 1711422 1756780 1806833 1861652
49827A861652O0278O6155P1840P7228Q2897Q9250R5206R8244R6482R0574Q2806
$$ 1861652 1921930 1988085 2059925 2137153 2220050 2309300 2404506 2502750 2599232 2689806 2772612
49816B772612P4787O6875N9384N2892M7448M2743L9050L6487L3298K6711J6066
$$ 2772612 2847399 2914274 2973658 3026550 3073998 3116741 3155791 3192278 3225576 3252287 3268353
49805C268353L457r475k3715m0602n8812p5145q7546r5982j01071j03286j03155
$$ 3268353 3271810 3262335 3238620 3198018 3139206 3064061 2976515 2880533 2779462 2676176 2573021
49794B573021j01005r6662r0346q3437p7339p2005o6584o0992n5741n0723m5602
$$ 2573021 2472016 2375354 2285008 2201571 2124232 2052227 1985643 1924651 1868910 1818187 1772585
49783A772585m1049l8044l5935l2934k8877k5843k5190k5422k4117k1093j8288
$$ 1772585 1731536 1693492 1657557 1624623 1595746 1569903 1544713 1519291 1495174 1474081 1455793
49772A455793j7014j6641j5960j4713j3405j2358j1515j0889j0579j0408r843
$$ 1455793 1438779 1422138 1406178 1391465 1378060 1365702 1354187 1343298 1332719 1322311 1312468
49761A312468q564o921n569m760m234l829l780m184m575m425l793l006j965l30
$$ 1312468 1303904 1296983 1291414 1286654 1282420 1278591 1274811 1270627 1266052 1261627 1257834 1254828 1252863 1252533
49747A252533J503K249R78j777m422n718n532m364k654q64J86j53j420k240j896
$$ 1252533 1254036 1256285 1257263 1255486 1251064 1245346 1239814 1235450 1232796 1231932 1232118 1231965 1230545 1228305 1226409
49732A226409j098o12J13J872L761L844J828m30j483j822k208k210j581j500k742
$$ 1226409 1225311 1224699 1224812 1226684 1230445 1234289 1236117 1235687 1234204 1232382 1230174 1227964 1226383 1224883 1222141
$$ [...]
##END NTUPLES=NMR SPECTRUM
##END=
