##TITLE=coffee_type ROVE100-18-0203
COFFEE_meoh_noesyp64 COFFEE_meoh {C:\Bruker\TOPSPIN} Administrator 6
##JCAMPDX= 6.0         $$ Bruker NMR JCAMP-DX V2.0
##DATA TYPE= NMR SPECTRUM
##DATA CLASS= NTUPLES
##ORIGIN= Bruker BioSpin GmbH
##OWNER= Administrator
$$ 1.72 TOPSPIN		Version 2.1
$$ 2012-05-29 13:26:20.329 -0700  Administrator@X
$$ Compression mode = diff/dup
##.OBSERVE FREQUENCY= 400.13188235
##.OBSERVE NUCLEUS= ^1H
##.ACQUISITION MODE= SIMULTANEOUS (DQD)
##.ACQUISITION SCHEME= undefined
##.AVERAGES= 64
##.DIGITISER RES= 22
##SPECTROMETER/DATA SYSTEM= spect
##.PULSE SEQUENCE= noesygpps1d.comp
##.SOLVENT NAME= COFFEE_meoh
##.SHIFT REFERENCE= INTERNAL, COFFEE_meoh, 1, 14.98061
##AUDIT TRAIL= $$ (NUMBER, WHEN, WHO, WHERE, PROCESS, VERSION, WHAT)
$$ ##TITLE= Audit trail, TOPSPIN		Version 2.1
$$ ##JCAMPDX= 5.01
$$ ##ORIGIN= Bruker BioSpin GmbH
$$ ##OWNER= Administrator
$$ $$ Z:/data/jwist/nmr/12-COFFEE-0203/82/pdata/1/auditp.txt
$$ ##AUDIT TRAIL=  $$ (NUMBER, WHEN, WHO, WHERE, PROCESS, VERSION, WHAT)
(   1,<2012-03-02 22:11:36.490 -0500>,<Administrator>,<TOPSPIN>,<go>,<TOPSPIN 2.1>,
      <created by zg
	started at 2012-03-02 22:00:06.318 -0500,
	POWCHK enabled, PULCHK disabled,
       configuration hash MD5:
       1A 1E CE 29 27 FD 77 03 67 4E F0 E3 C4 B2 CB 90
       data hash MD5: 64K
       F1 03 51 87 0C 66 44 23 E4 AC CF 9C 3C 31 FF B2>)
(   2,<2012-03-02 22:11:41.287 -0500>,<Administrator>,<TOPSPIN>,<audit>,<TOPSPIN 2.1>,
      <user comment:
       ICON-NMR User ID: Administrator
       data hash MD5: 64K
       F1 03 51 87 0C 66 44 23 E4 AC CF 9C 3C 31 FF B2>)
(   3,<2012-05-29 09:24:17.753 -0700>,<Administrator>,<X>,<proc1d>,<TOPSPIN 2.1>,
      <Start of raw data processing
       efp LB = 0.3 FT_mod = 6 PKNL = 1 PHC0 = 0 PHC1 = 0 SI = 128K 
       data hash MD5: 128K
       32 76 21 26 D4 82 82 AC 4C 6C B8 4B F6 FA 83 56>)
(   4,<2012-05-29 09:24:18.300 -0700>,<Administrator>,<X>,<proc1d>,<TOPSPIN 2.1>,
      <pk PHC0 = 37.17773 PHC1 = 0 
       data hash MD5: 128K
       17 F1 6B 2E A9 80 B4 21 5D D4 41 18 D1 31 AB 21>)
(   5,<2012-05-29 09:24:19.503 -0700>,<Administrator>,<X>,<proc1d>,<TOPSPIN 2.1>,
      <abs ABSG = 1 
       data hash MD5: 128K
       53 C1 34 BF BE E4 2A BE F5 F9 BF 6B 6C 78 38 79>)
(   6,<2012-05-29 09:24:19.581 -0700>,<Administrator>,<X>,<proc1d>,<TOPSPIN 2.1>,
      <abs ABSG = 2 
       data hash MD5: 128K
       0D 92 B0 5F 77 A6 66 1F 98 36 1B 09 C8 F2 17 9C>)
(   7,<2012-05-29 09:24:19.659 -0700>,<Administrator>,<X>,<proc1d>,<TOPSPIN 2.1>,
      <abs ABSG = 3 
       data hash MD5: 128K
       EA 25 86 1E 5A B5 F1 49 3A 52 02 A6 D0 5E 56 90>)
(   8,<2012-05-29 09:24:19.753 -0700>,<Administrator>,<X>,<proc1d>,<TOPSPIN 2.1>,
      <abs ABSG = 4 
       data hash MD5: 128K
       14 E6 45 C5 03 85 CA B0 9B D7 80 45 37 44 0E D1>)
(   9,<2012-05-29 09:24:19.831 -0700>,<Administrator>,<X>,<proc1d>,<TOPSPIN 2.1>,
      <abs ABSG = 5 
       data hash MD5: 128K
$$ [...]
150 150 150 150 150 150 150 150
##$TP07= 0
##$TPNAME0= <>
##$TPNAME1= <>
##$TPNAME2= <>
##$TPNAME3= <>
##$TPNAME4= <>
##$TPNAME5= <>
##$TPNAME6= <>
##$TPNAME7= <>
##$TPOAL= (0..7)
0.5 0.5 0.5 0.5 0.5 0.5 0.5 0.5
##$TPOFFS= (0..7)
0 0 0 0 0 0 0 0
##$TUNHIN= 0
##$TUNHOUT= 0
##$TUNXOUT= 0
##$USERA1= <user>
##$USERA2= <user>
##$USERA3= <user>
##$USERA4= <user>
##$USERA5= <user>
##$V9= 5
##$VALIST= <valist>
##$VCLIST= <CCCCCCCCCCCCCCC>
##$VD= 0
##$VDLIST= <DDDDDDDDDDDDDDD>
##$VPLIST= <PPPPPPPPPPPPPPP>
##$VTLIST= <TTTTTTTTTTTTTTT>
##$WBST= 1024
##$WBSW= 4
##$XGAIN= (0..3)
0 0 0 0
##$XL= 0
##$YL= 0
##$YMAX_a= 10387943
##$YMIN_a= -4985325
##$ZGOPTNS= <>
##$ZL1= 120
##$ZL2= 120
##$ZL3= 120
##$ZL4= 120
##$ABSF1= 14.98061
##$ABSF2= -5.57192
##$ABSG= 5
##$ABSL= 3
##$ALPHA= 0
##$AQORDER= 0
##$ASSFAC= 0
##$ASSFACI= 0
##$ASSFACX= 0
##$ASSWID= 0
##$AUNMP= <proc_prof1d_extract>
##$AXLEFT= 0
##$AXNAME= <>
##$AXNUC= <1H>
##$AXRIGHT= 0
##$AXTYPE= 0
##$AXUNIT= <>
##$AZFE= 0.1
##$AZFW= 0.1
##$BCFW= 0
##$BC_mod= 0
##$BYTORDP= 0
##$COROFFS= 0
##$CY= 15
##$DATMOD= 1
##$DC= 0
##$DFILT= <>
##$DTYPP= 0
##$F1P= 0
##$F2P= 0
##$FCOR= 0.5
##$FTSIZE= 131072
##$FT_mod= 6
##$GAMMA= 0
##$GB= 0
##$INTBC= 1
##$INTSCL= 1
##$ISEN= 128
##$LB= 0.3
##$LEV0= 0
##$LPBIN= 0
##$MAXI= 10000
##$MC2= 0
##$MEAN= 0
##$ME_mod= 0
##$MI= 0
##$NCOEF= 0
##$NC_proc= -3
##$NLEV= 6
##$NOISF1= 0
##$NOISF2= 0
##$NSP= 0
##$NTH_PI= 0
##$NZP= 0
##$OFFSET= 14.98061
##$PC= 1
##$PHC0= 37.17773
##$PHC1= 0
##$PH_mod= 1
##$PKNL= yes
##$PPARMOD= 0
##$PPDIAG= 0
##$PPIPTYP= 0
##$PPMPNUM= 2147483647
##$PPRESOL= 1
##$PSCAL= 4
##$PSIGN= 0
##$PYNMP= <proc.py>
##$REVERSE= no
##$SF= 400.13
##$SI= 131072
##$SIGF1= 0
##$SIGF2= 0
##$SINO= 400
##$SIOLD= 131072
##$SPECTYP= <>
##$SREGLST= <1H.CDCl3>
##$SSB= 0
##$STSI= 131072
##$STSR= 0
##$SW_p= 8223.68421052632
##$SYMM= 0
##$S_DEV= 0
##$TDeff= 65536
##$TDoff= 0
##$TI= <>
##$TILT= no
##$TM1= 0
##$TM2= 0
##$TOPLEV= 0
##$USERP1= <user>
##$USERP2= <user>
##$USERP3= <user>
##$USERP4= <user>
##$USERP5= <user>
##$WDW= 1
##$XDIM= 131072
##$YMAX_p= 448623146
##$YMIN_p= -91947334
##$CURPLOT= <Network HP LaserJet P1505>
##$CURPRIN= <$Network HP LaserJet P1505>
##$DFORMAT= <normdp>
##$LAYOUT= <+/1D_H.xwp>
##$LFORMAT= <normlp>
##$PFORMAT= <normpl>
##$SURQMSG= 1
$$ End of Bruker specific parameters
$$ ---------------------------------
##NTUPLES= NMR SPECTRUM
##VAR_NAME=  FREQUENCY,     SPECTRUM/REAL,   SPECTRUM/IMAG
##SYMBOL=    X,             R,               I
##VAR_TYPE=  INDEPENDENT,   DEPENDENT,       DEPENDENT
##VAR_FORM=  AFFN,          ASDF,            ASDF
##VAR_DIM=   131072,        131072,          131072
##UNITS=     HZ,            ARBITRARY UNITS, ARBITRARY UNITS
##FACTOR=    0.0627417313425165, 1,          1
##FIRST=     8223.62146879498, 2772,         -73586
##LAST=      0,             6228,            -73509
##MIN=       0,             -91947334,       0
##MAX=       8223.62146879498, 448623146,    0
$$ Real data points
##PAGE= N=1
##DATA TABLE= (X++(R..R)), XYDATA
$$ [...]
63369A010542K3221K5557K8193L0041L0295K9803L0364L2775L6376M0409M4621
63358A362197M8250M9781M8646M6291M4448M2738L8914L1530K1753J2442N669
63347A752659J181k783p139j0767j2173j1744j1450j2557j4993j8871k4762l1806
63335A594795l7361l9745m0028l9851l8863l6005l2192k9583k8627k7779k5983
63324A218778k3718k1482j9064j6501j4239j1962q685m488q07J486L032M488N456
63311A112294N701O211P990J0609J2951J4812J6780J9034K1219K3276K5522K8026
63299A304425L0487L2693L4555L5678L5438L3681L1034K8181K4793J9573J1851
63288A622389L060m141q514j1286j4031j6474j7472j7361j7800j9576k2126k5193
$$ plain form
63369 1010542 1033763 1059320 1087513 1117554 1147849 1177652 1208016 1240791 1277167 1317576 1362197
63358 1362197 1410447 1460228 1508874 1555165 1599613 1642351 1681265 1712795 1734548 1746990 1752659
63347 1752659 1753840 1751057 1743918 1733151 1720978 1709234 1697784 1685227 1670234 1651363 1626601 1594795
63335 1594795 1557434 1517689 1477661 1437810 1398947 1362942 1330750 1301167 1272540 1244761 1218778
63324 1218778 1195060 1173578 1154514 1138013 1123774 1111812 1103127 1098639 1097832 1099318 1102350 1106838 1112294
63311 1112294 1117995 1124206 1132196 1142805 1155756 1170568 1187348 1206382 1227601 1250877 1276399 1304425
63299 1304425 1334912 1367605 1402160 1437838 1473276 1506957 1537991 1566172 1590965 1610538 1622389
63288 1622389 1625449 1621308 1612794 1601508 1587477 1571003 1553531 1536170 1518370 1498794 1476668 1451475
63276A451475k9208l3740l7239l8984l9865m0590m0534l9324l8018l7437l6531
63265A040005l3867k9986k6844k5383k4942k4614k3902k2328j9662j6567j4115
63254G77795j2701j2031j1839j1848j1501j0635r993j0181j0565j0255r689j0017
63242F46540j1166j1822j1227r856q431p409p207p711p695o113l811k591k647
63229E48854k719k626l535n270n778m297k792k786k858j280P08P68n93p89P45
63214E15752J981J785J269J230Q45j65l72R56K310K287J826K312K904J910r6p95
63198E35939M98K068K530K346K215J837J087R07J883K927K611J210L99J217L085
63183E62759M683N143M594L964M039M333L424R33j282q82K168N338O218M816L040
$$ plain form
63276 1451475 1422267 1388527 1351288 1312304 1272439 1231849 1191315 1151991 1113973 1076536 1040005
63265 1040005 1006138 976152 949308 923925 898983 874369 850467 828139 808477 791910 777795
63254 777795 765094 753063 741224 729376 717875 707240 697247 687066 676501 666246 656557 646540
63242 646540 635374 623552 612325 602469 594038 586629 579422 571711 564016 557903 554092 551501 548854
63229 548854 546135 543509 539974 534704 528926 524629 521837 519051 516193 514913 515621 516389 515796 515007 515752
63214 515752 517733 519518 520787 522017 522862 522697 522325 523281 525591 527878 529704 532016 534920 536830 536734 535939
63198 535939 536437 538505 541035 543381 545596 547433 548520 549427 551310 554237 556848 558058 558457 559674 562759
63183 562759 567442 572585 577179 581143 585182 589515 592939 593872 592590 591708 593876 599214 605432 610248 613288
63168F13288K420K766K899K365K112L226N263O471N819M140K827K159J648J437
63154F58840K191L759N025N244M799M427M379M499M483L804K095p5j363r65N53
63139G01695K072L104L805M147L674K217O60M92K200M224M336K420J017K330N463
63124G43856P776Q320Q423R049R392Q554P144O400O733P752Q817R123Q243P065
63110H56647P054Q051Q108O249M081L554M412N057M868M194L089J584L73l31j779
63095I15211m781p642q078o738o427q069r824j0411j0684j1189j0773r036p959
63082H03600r131j0931j0513p654m717l436l545m237n142n845n933n785o160o842
63068G13729o744n537m150l389k969k305j424o47L2O84J017P19m5p94j213j312
$$ plain form
63168 613288 615708 618474 621373 623738 625850 629076 634339 640810 646629 650769 653596 655755 657403 658840
63154 658840 661031 664790 669815 675059 679858 684285 688664 693163 697646 701450 703545 703470 702107 701142 701695
63139 701695 703767 706871 710676 714823 718497 720714 721374 721866 724066 728290 732626 735046 736063 738393 743856
63124 743856 751632 759952 768375 777424 786816 795370 802514 808914 815647 823399 832216 841339 849582 856647
63110 856647 863701 871752 879860 886109 890190 893744 898156 903213 908081 912275 915364 916948 917321 916990 915211
63095 915211 910430 902788 894710 887972 881545 873476 863652 853241 842557 831368 820595 811559 803600
63082 803600 794469 783538 773025 765371 760654 757218 753673 749436 744294 738449 732516 726731 720571 713729
63068 713729 706985 701448 697298 693909 690940 688635 687211 686564 686596 687280 688297 689016 688971 688177 686964 685652
63052F85652j270j346j631j793j344l96K01k04j080j123K65K115K805J841M78
63037F83170K93J302J985J276M3RJ567L367M068L782L511L767M302M814N267N494
63021G28017N212M561M129M133M010L237K234J747J586O45j533m041n741o519
63007G41677o924p235p566q387r922j1343j1645j1159j1095j1510j1124r529q117
62994F16121p862p601n884l614l082m689o383o447n273l978k804j686j180j696
62980E53942k486k520j937j612j621j087M10K143L173L391L434L892M711N117
62966E68950M268K329O43L26Q96R58J99k12O18K034K873L033L302M048M902N578
62950F04745O264P097P746P807P248O432N826N815O527P806R311J0512J0678R445
$$ plain form
63052 685652 684382 683036 681405 679612 678268 677872 678073 677869 676789 675666 675931 678046 680851 682692 683170
63037 683170 683463 684765 686750 688026 688069 688078 689645 693012 697080 700862 704373 708140 712442 717256 722523 728017
63021 728017 733229 737790 741919 746052 750062 753299 755533 757280 758866 759511 757978 753937 748196 741677
63007 741677 734753 727518 719952 711565 701643 690300 678655 667496 656401 644891 633767 624238 616121
62994 616121 608259 600658 594774 591160 588078 583389 577006 570559 565286 561308 558504 556818 555638 553942
62980 553942 551456 548936 546999 545387 543766 542679 543089 545232 548405 551796 555230 559122 563833 568950
62966 568950 573218 575547 576190 576516 577412 578370 578569 578357 578975 581009 583882 586915 590217 594265 599167 604745
62950 604745 611009 618106 625852 633659 640907 647339 653165 658980 665507 673313 682624 693136 703814 713259
62936G13259P718P296Q930J1143J1899J1053J0101R714R036P649O635O833P364
62923H28630P098O435O236N947M483K355R55m1k380o074q812r489j0184j3161
62909H11998j7485k0584k1863k2611k3037k1965j9479j7482j6878j6205j4187
62898F00222j1926j1138j1376j0718q514n868l703j965p96r53k501m231n055n259
62884E16219n644o106n908n115m847n896p613q522p834o158m751m255m256m053
62870D35261l544l255l612m481n381n861n710n043m175l265k183j043n88j398
62856C85722k713k926j600k89o40k314l562l508k812k128j160L94J745J838Q30
62841C66877M0M07J519K280K186J870K408M184O258P095O142M592M169N249O645
$$ plain form
62936 713259 720977 728273 737203 748346 760245 771298 781399 791113 800149 807798 814433 821266 828630
62923 828630 835728 842163 848399 854346 858829 861184 862139 862098 859718 853644 844832 835343 825159 811998
62909 811998 794513 773929 752066 729455 706418 684453 664974 647492 630614 614409 600222
62898 600222 588296 577158 565782 555064 546550 540682 536979 535014 534218 533265 530764 526533 521478 516219
62884 516219 510575 504469 498561 493446 488599 482703 475090 466568 458734 452576 447825 443570 439314 435261
62870 435261 431717 428462 424850 420369 414988 409127 403417 398374 394199 390934 388751 387708 387120 385722
62856 385722 383009 380083 378483 378194 377554 375240 371678 368170 365358 363230 362070 362464 364209 366047 366877
62841 366877 366917 367324 368843 371123 373309 375179 377587 381771 388029 395124 401266 405858 410027 415276 421921
62826D21921P408Q139R885J2105J2852J1212Q634P212P309P761P910Q167Q577
62813E39092Q221O571M342K315K88j885l212k833j762j870l271m229l720k570
62799E35477j729r36J14O71J96k93N16K222L276L235L186L966N131N939O226O043
62783E73240N264M156L622M222N331N838N495M959M587L888K507J273J580L596
62769F29558N606N670L775J772J161J504J270k20k212l583l984l893l856l848
62755F28720l496k996l494n880r236j1289j0864r226q441r025r939j0345j0324
62742E24165j0024r233q074p233p078p085o600n782n436o043p277q316q473p676
62728D19835o475n591n312n266m715l248j339r9j44q77j333j516k035k545j841
$$ plain form
62826 421921 429329 437468 447353 459458 472310 483522 492156 499368 506677 514438 522348 530515 539092
62813 539092 547313 553884 558226 560541 560829 558944 555732 552899 551137 549267 545996 541767 538047 535477
62799 535477 533748 532812 532926 533597 533793 533500 534016 536238 539514 542749 545935 549901 555032 560971 567197 573240
62783 573240 578504 582660 586282 590504 595835 601673 607168 612127 616714 620602 623109 624382 625962 629558
62769 629558 635164 640834 644609 646381 647542 649046 650316 650096 647884 644301 640317 636424 632568 628720
62755 628720 625224 622228 618734 612854 603618 592329 581465 572239 563798 554773 544834 534489 524165
62742 524165 514141 504908 496834 489601 482523 475438 468838 463056 457620 451577 444300 435984 427511 419835
62728 419835 413360 407769 402457 397191 392476 389228 387889 387790 387646 386769 385436 383920 381885 379340 377499
62713C77499RJ109K50j119q68Q22K067K268K499L167L334K835L106N011P253P962
62697D17204O990N673N230O041P714R104R000P425N663M563L662K391J073R3q03
62682D91023j594j513n61l31k065m756o541p150p532p887p660p001o494n841m577
62667D19520l749m786o789p091n023k925k721l488l580l237l414l494k121M70
62653C67572K645L466L212K377J553J848L862O476Q052Q654R523J0524J0123Q254
62639D48141P246Q830J1846J4105J5339J6766J8695K0281K1276K2364K3645K4233
62627F52767K3671K2680K2138K2089K2130K1791K0337J7087J2495Q035M544J370
62615H51134k318o256r860j3281j6653j9060j9591j9058j9235k0491k1497k1369
$$ plain form
62713 377499 377508 378617 378867 377748 376880 377702 379769 382037 384536 387703 391037 393872 396978 401989 409242 417204
62697 417204 424194 429867 435097 441138 448852 457956 466956 474381 480044 484607 488269 490660 491733 491826 491023
62682 491023 489429 487916 487355 487024 484959 480203 473662 466512 458980 451093 443433 436432 429938 424097 419520
62667 419520 415771 410985 404196 397105 392082 389157 386436 382948 379368 376131 372717 369223 367102 367572
62653 367572 370217 373683 376895 379272 380825 382673 386535 393011 401063 409717 419240 429764 439887 448141
62639 448141 455387 464217 476063 490168 505507 522273 540968 561249 582525 604889 628534 652767
62627 652767 676438 699118 721256 743345 765475 787266 807603 824690 837185 845220 849764 851134
62615 851134 848816 842560 832700 819419 802766 783706 764115 745057 725822 705331 683834 662465
62603F62465k0736k0277j9579j8103j6296j4849j3662j2336j1090j0299r757r153
62591D86328q791q899q670p092m569k691k278k553k411j692r02m21l76p61j300
62576D32922j442q88Q3R80J544J732J532J011M07jn7J99N14N27J04m76q67j060
62558D36764j209j238q88m6J241K834M217M547L620K493K377L058L342K994L098
62543D67204M222N458N965O327P363Q386P998O197M522M165M946O156P309P932
62529E54150P617O709O087O026O022N942O309O934O460M245J888J614L513N497
62515F29013N827M581K735J033J6qM46K70q96k292l402m784o777q304q025o235
62499F03198m536l862l887m188m796n450n530n195n534o957q239q018o652n677
$$ plain form
62603 662465 641729 621452 601873 583770 567474 552625 538963 526627 515537 505238 495481 486328
62591 486328 477537 468638 459968 452876 448307 445616 443338 440785 438374 436682 435780 435359 434983 434222 432922
62576 432922 431480 430592 430675 431655 433199 434931 436463 437474 437881 437880 437823 438022 438536 439063 439167 438691 437824 436764
62558 436764 435555 434317 433429 433383 434624 437458 441675 446222 449842 452335 454712 457770 461112 464106 467204
62543 467204 471426 476884 482849 489176 496539 504925 512923 519120 523642 527807 532753 538909 546218 554150
62529 554150 561767 568476 574563 580589 586611 592553 598862 605796 612256 616501 618389 620003 623516 629013
62515 629013 634840 639421 642156 643189 643205 643197 643643 643913 643017 640725 637323 632539 625762 617458 609433 603198
62499 603198 598662 594800 590913 586725 581929 576479 570949 565754 560220 553263 545024 537006 530354 524677
62485E24677n832o509o994p223p223o707n629m579m084l861l179j822m01J73n80
62470D60227k295l804l818k066K94J663J409K05r10j299o66J108L528N380N694
62455D64650M933M649N847P980R725J0518J1017J2169J4022J5556J5801J5034
62443E91901J4541J5021J5666J5201J3540J1720J0457R625Q993Q495P602N496
62431G28258K343o54k964n362q120r851r473q301q471r837j0328r177p913p774
62417F32376q026p545o616o071n803n206m360l780l555l526l787m301m427l677
62403E61696k495j640j204q88q19j270j775j318N89L375N841O833N982M230L294
62388E80431L974N228N416M308L274L647N340O949P006N294L174K329K987L846
$$ plain form
62485 524677 518845 512336 505342 498119 490896 484189 478560 473981 469897 466036 462857 461035 460634 460807 460227
62470 460227 457932 454128 450310 448244 448538 450201 451610 451815 450905 449606 448940 450048 453576 458956 464650
62455 464650 469583 474232 480079 488059 497784 508302 519319 531488 545510 561066 576867 591901
62443 591901 606442 621463 637129 652330 665870 677590 688047 697672 706665 715160 722762 728258
62431 728258 730601 729947 726983 721621 713501 703650 694177 685876 677405 667568 657240 648063 640150 632376
62417 632376 624350 616805 610189 604118 598315 593109 588749 584969 581414 577888 574101 569800 565373 561696
62403 561696 559201 557561 556357 555469 554650 553380 551605 550287 550876 554251 560092 566925 572907 577137 580431
62388 580431 584405 589633 595049 599357 602631 606278 611618 618567 625573 630867 634041 636370 639357 643203
62374F43203L935L767M192M893M989M505M202M177L826L203L390N072P385Q728
62360G09467Q458P508P308Q293R565J0169J0369J1094J2288J2668J1569J0081
62348H28837R771J0845J2259J3062J2989J2298J1701J1966J2829J2948J1730J0495
62336I71730J0829J2502J4178J5496J6843J7631J6736J4758J3889J4928J6059
62325A135579J5522J4061J3595J4533J5769J6684J7719J8946J9331J7945J5324
62314A315008J3188J2918J4451J6590J8254J9475K1219K4330K8648L3077L6551
62303A553709L9159M2146M6469N1504N5824N9257O3158O8349P3680P7261P8229
62292B208745P6629P2626O6841O0649N4827M8532M0798L2464K5115J8716J1898
$$ plain form
62374 643203 647138 650905 655097 659990 664979 669484 673686 677863 681689 684892 688282 693354 700739 709467
62360 709467 717925 725433 732741 741034 750599 760768 771137 782231 794519 807187 818756 828837
62348 828837 838608 849453 861712 874774 887763 900061 911762 923728 936557 949505 961235 971730
62336 971730 982559 995061 1009239 1024735 1041578 1059209 1075945 1090703 1104592 1119520 1135579
62325 1135579 1151101 1165162 1178757 1193290 1209059 1225743 1243462 1262408 1281739 1299684 1315008
62314 1315008 1328196 1341114 1355565 1372155 1390409 1409884 1431103 1455433 1484081 1517158 1553709
62303 1553709 1592868 1635014 1681483 1732987 1788811 1848068 1911226 1979575 2053255 2130516 2208745
62292 2208745 2285374 2358000 2424841 2485490 2540317 2588849 2629647 2662111 2687226 2705942 2717840
62281B717840M279l302j0605j8140k5294l0374l3151l5566l8916m1824m2104l9633
62269B403210l6271l3803l2729l2393l1571k9497k6682k4117k1652j8371j4691
62258B101433j2381j1785j0685p186k355J391L470N089O934Q635J0203J2286J4883
62245B119932J7176J8823K0431K2345K3876K4234K3835K4184K6429L0026L3033
62234B384324L3921L3063L1968L1317L0441K8708K6493K4607K3613K3885K5302
62223B697642K6678K6695K5788K5787K7161K8106K7234K5696K5402K6449K7762
62212B990400K9115L0880L2716L4316L6737M1111M6497N0785N3552N6132N9083
62201C461324O1528O3270O5658O9694P4793Q0047Q5254Q9957R2756R2560Q9593
$$ plain form
62281 2717840 2722119 2718817 2708212 2690072 2664778 2634404 2601253 2565687 2526771 2484947 2442843 2403210
62269 2403210 2366939 2333136 2300407 2268014 2236443 2206946 2180264 2156147 2134495 2116124 2101433
62258 2101433 2089052 2077267 2066582 2059396 2057041 2058432 2061902 2066991 2073925 2082560 2092763 2105049 2119932
62245 2119932 2137108 2155931 2176362 2198707 2222583 2246817 2270652 2294836 2321265 2351291 2384324
62234 2384324 2418245 2451308 2483276 2514593 2545034 2573742 2600235 2624842 2648455 2672340 2697642
62223 2697642 2724320 2751015 2776803 2802590 2829751 2857857 2885091 2910787 2936189 2962638 2990400
62212 2990400 3019515 3050395 3083111 3117427 3154164 3195275 3241772 3292557 3346109 3402241 3461324
62201 3461324 3522852 3586122 3651780 3721474 3796267 3876314 3961568 4051525 4144281 4236841 4326434
62190D326434Q4400P6737O6389N4413M2580L1916K2402J3691N481k491j0118j6793
62178D695041k2176k6914l1938l7091m1009m2555m1908m0047l7527l4294l0487
62167D309095k6842k3964k1682j9482j7286j5251j3180j0885q967q235q206p278
62155D127837m784k002m58JO96K268M089N138M870L619K500K454L071L128K574
62140D155001K899M832O960P731P797Q859J1054J3008J4059J4805J5653J6393
62128D279051J7218J8755K0844K2426K2727K1716J9476J6112J2130P751K191n025
62116D455372j2294j7132j9226k0658k2727k4131k2914j8927j3627q442m041l08
62104D270945L476P642J1011J1662R111M754j50n694j2198j9114k5837l2475l9152
$$ plain form
62190 4326434 4410834 4487571 4553960 4608373 4650953 4682869 4705271 4718962 4724443 4721952 4711834 4695041
62178 4695041 4672865 4645951 4614013 4576922 4535913 4493358 4451450 4411403 4373876 4339582 4309095
62167 4309095 4282253 4258289 4236607 4217125 4199839 4184588 4171408 4160523 4151556 4143321 4135115 4127837
62155 4127837 4123053 4121051 4120593 4120594 4121290 4123558 4127647 4132785 4137655 4141274 4143774 4146228 4149299 4152427 4155001
62140 4155001 4157900 4162732 4169692 4177423 4185220 4194079 4205133 4218141 4232200 4247005 4262658 4279051
62128 4279051 4296269 4315024 4335868 4358294 4381021 4402737 4422213 4438325 4450455 4458206 4460397 4455372
62116 4455372 4443078 4425946 4406720 4386062 4363335 4339204 4316290 4297363 4283736 4275294 4271253 4270945
62104 4270945 4274421 4282063 4293074 4304736 4313847 4318601 4318451 4312757 4300559 4281445 4255608 4223133 4183981
62091D183981m5536n1610n7858o3931o8366p0570p2037p4435p7311p8806p8013
62080C445508p5445p1810o7552o3374o0048n7640n5574n3368n0889m8180m5528
62069B796100m3400m1799m0205l8520l7404l7018l6347l4579l2442l1060l0125
62058B393201k8467k6047k4009k2837k1867k0751k0091k0134j9967j8787j7248
62047B152996j6628j6973j6882j5281j2918j1697j2529j4159j4510j2994j0882
62036A997543r266p560m711j153J606L143M634P083J0134J3216J6786K1591K7157
62023B080203L1895L4485L4440L1809K7438K3601K2935K5961L0238L2736L2511
62012B408252L0283K6169J9329R974L31p062j1269j2756j2329j0927r669r050
$$ plain form
62091 4183981 4138445 4086835 4028977 3965046 3896680 3826110 3754073 3679638 3602327 3523521 3445508
62080 3445508 3370063 3298253 3230701 3167327 3107279 3049639 2994065 2940697 2889808 2841628 2796100
62069 2796100 2752700 2710901 2670696 2632176 2594772 2557754 2521407 2486828 2454386 2423326 2393201
62058 2393201 2364734 2338687 2314678 2291841 2269974 2249223 2229132 2208998 2189031 2170244 2152996
62047 2152996 2136368 2119395 2102513 2087232 2074314 2062617 2050088 2035929 2021419 2008425 1997543
62036 1997543 1988277 1980717 1976006 1974853 1976459 1979602 1984236 1991319 2001453 2014669 2031455 2053046 2080203
62023 2080203 2112098 2146583 2181023 2212832 2240270 2263871 2286806 2312767 2343005 2375741 2408252
62012 2408252 2438535 2464704 2484033 2494007 2494338 2487276 2476007 2463251 2450922 2439995 2430326 2421276
62000B421276q639q337r369j3025j8819k4957l0282l4747l8366m1152m4009m8102
61988B101472n2939n6391n7338n7201n8007n9719o0462n8832n5205n1062m7757
61977A486559m5735m4235m1784l7578l2521k8541k6636k5818k4301k1607j8969
61966A138834j7417j6241j4226j1936j1185j2138j2632j1286r641r739j1000j1365
61954I90028j0575j0071j0088r208o934m461k522l25K685N751Q137J0099J1863
61941I74379J3162J4284J6104J8357J9334J8092J5574J2943J0238P345M665J956
61929A126433j956p346j2850j7394k1354k4899k6985k7193k6853k6902k6238k3806
61917H82657k0774j8910j8054j6953j5435j4077j2789j1418j0570j0238q874n765
$$ plain form
62000 2421276 2412637 2404300 2394931 2381906 2363087 2338130 2307848 2273101 2234735 2193583 2149574 2101472
61988 2101472 2048533 1992142 1934804 1877603 1819596 1759877 1699415 1640583 1585378 1534316 1486559
61977 1486559 1440824 1396589 1354805 1317227 1284706 1256165 1229529 1203711 1179410 1157803 1138834
61966 1138834 1121417 1105176 1090950 1079014 1067829 1055691 1043059 1031773 1022132 1012393 1001393 990028
61954 990028 979453 969382 959294 950086 943152 938691 936169 935844 938529 944280 952417 962516 974379
61941 974379 987541 1001825 1017929 1036286 1055620 1073712 1089286 1102229 1112467 1119812 1124477 1126433
61929 1126433 1124477 1117131 1104281 1086887 1065533 1040634 1013649 986456 959603 932701 906463 882657
61917 882657 861883 842973 824919 807966 792531 778454 765665 754247 743677 733439 724565 718800
61905G18800k923k502l540l577k334j172R7K837O419Q472Q433Q192Q975J0016
61891G56193J0755J1942J3930J5916J7476J9143K1093K2973K5129K8093L0901
61880I73544L2138L2661L4790L8397M0538L9817L8365L8254L8617L7930L6831
61869A381882L6522L6214L4422L1607K9421K8091K6413K3811K0981J8841J7988
61858A686193J8707K0616K2797K4993K7897L1728L5651L9438M4521N2138O1297
61847B065976O9694P5955Q0115Q2786Q4915Q7546R0826R3917R6577R9810J04095
61836C032212J08239J11102J13173J15052J15634J13388J08350J01002R0122P4008
61826D082282N3367L0830P575j7326m3932o9642r1331j07997j20658j30541j37920
$$ plain form
61905 718800 715877 713375 709835 706258 703924 702752 702849 705686 712105 720577 729010 737202 746177 756193
61891 756193 766948 778890 792820 808736 826212 845355 866448 889421 914550 942643 973544
61880 973544 1005682 1038343 1073133 1111530 1152068 1191885 1230250 1268504 1307121 1345051 1381882
61869 1381882 1418404 1454618 1489040 1520647 1550068 1578159 1604572 1628383 1649364 1668205 1686193
61858 1686193 1704900 1725516 1748313 1773306 1801203 1832931 1868582 1908020 1952541 2004679 2065976
61847 2065976 2135670 2211625 2291740 2374526 2459441 2546987 2637813 2731730 2828307 2928117 3032212
61836 3032212 3140451 3251553 3364726 3479778 3595412 3708800 3817150 3918152 4008274 4082282
61826 4082282 4135649 4166479 4174054 4156728 4112796 4043154 3951823 3843826 3723168 3592627 3454707
61815C454707j42092j42136j38226j32226j26260j20756j14587j07034r8640r0170
61805B242580q1715p3127o4502n6003m7734m0005l3150k7059k1322j5682r882
61794A772399l442L588J0036J4772J8349K2392K7288L1552L3703L3701L2173K9230
61782B025741K4713J8944J2667O525R18m032q544j2820j6398j8298j7940j5555
61770A995921j1722p026k201J979N167P391Q554Q543P662O309M098J09n826j2702
61756B006256j9428k5506l0578l4165l6481l8611m1096m2857m2340l9397l5366
61745A620431l1469k7929k4655k1928j9957j8088j5136j0660n600j352J792M837
61733A450286Q614J2646J5962J8603K1419K4589K7357K9623L2780L8142M4961
$$ plain form
61815 3454707 3312615 3170479 3032253 2900027 2773767 2653011 2538424 2431390 2332750 2242580
61805 2242580 2160865 2087738 2023236 1967233 1919499 1879494 1846344 1819285 1797963 1782281 1772399
61794 1772399 1768957 1772545 1782581 1797353 1815702 1838094 1865382 1896934 1930637 1964338 1996511 2025741
61782 2025741 2050454 2069398 2082065 2088590 2089508 2085476 2076932 2064112 2047714 2029416 2011476 1995921
61770 1995921 1984199 1977173 1974972 1976951 1982118 1989509 1998063 2006606 2014268 2020577 2024675 2024784 2018958 2006256
61756 2006256 1986828 1961322 1930744 1896579 1860098 1821487 1780391 1737534 1695194 1655797 1620431
61745 1620431 1588962 1561033 1536378 1514450 1494493 1476405 1461269 1450609 1445009 1443657 1445449 1450286
61733 1450286 1458900 1471546 1487508 1506111 1527530 1552119 1579476 1609099 1641879 1680021 1724982
61722A724982N0963N4830N7592O1441O7713P6116Q5338R4067J01815J09353J18335
61711B602545J29969J43758J57872J71003J83500J96234K08754K19327K26715
61702D239677K30928K31900K28369K18691K02144J78586J47461J08484O3323J5586
61692E865149l1220p5108j14894j49114j76383j96450k10196k18586k22039k20886
61682D250273k16153k09571k02548j95159j86406j75747j64093j53075j43518
61673B604003j34948j26389j17195j07347r7484q8603q1282p5152o9424o3794
61663A642385n8409n3248m8137m3331l9368l6369l4009l2244l1379l1327l1472
61652A203092l1451l1479l1707l1874l1763l1374l0518k9012k7522k7296k8387
$$ plain form
61722 1724982 1775945 1830775 1888367 1949808 2017521 2093637 2178975 2273042 2374857 2484210 2602545
61711 2602545 2732514 2876272 3034144 3205147 3388647 3584881 3793635 4012962 4239677
61702 4239677 4470605 4702505 4930874 5149565 5351709 5530295 5677756 5786240 5849563 5865149
61692 5865149 5833929 5758821 5643927 5494813 5318430 5121980 4911784 4693198 4471159 4250273
61682 4250273 4034120 3824549 3622001 3426842 3240436 3064689 2900596 2747521 2604003
61673 2604003 2469055 2342666 2225471 2118124 2020640 1932037 1850755 1775603 1706179 1642385
61663 1642385 1583976 1530728 1482591 1439260 1399892 1363523 1329514 1297270 1265891 1234564 1203092
61652 1203092 1171641 1140162 1108455 1076581 1044818 1013444 982926 953914 926392 899096 870709
61641H70709k9003k7497k4449k1888k0701j9873j8308j6341j5003j4450j3827
61630F49369j2618j1438j1175j1564j1223r313o765n335n700p009q104q412p745
61617E32968o234m745m425n241n763n080m158m391n373n371l845k319k435l986
61603D69602n404n597m749l644k789k194j580n83J017K905M105L791K507K010
61589D59397L356N411O113N021L590L052L258L827N000O486O901N470L371K092
61575E22345J350O3j420j812j217j071j780k162j409k0J469L041M187M085L398
61560E29047M007O163P630O803M885L467J724j752n623p022n856n283p403j0533
61546E20254j1701j0287q089o802o655p033p390p431o931n760m187l050l099l912
$$ plain form
61641 870709 841706 814209 789760 767872 747171 727298 708990 692649 677646 663196 649369
61630 649369 636751 625313 614138 602574 591351 582038 575273 569938 564238 557229 549125 540713 532968
61617 532968 526734 521989 517564 512323 506560 501480 497322 492931 487558 482187 478342 476023 473588 469602
61603 469602 464198 458601 453852 450208 447419 445225 443645 443062 444079 446984 451089 454880 457387 459397
61589 459397 462753 468164 474277 479298 482888 485940 489198 493025 498025 504511 511412 516882 520253 522345
61575 522345 523695 523758 522338 520526 519309 518238 516458 514296 512887 512867 514336 517377 521564 525649 529047
61560 529047 533054 539217 546847 553650 558535 562002 563726 561974 556351 549329 543473 538190 530787 520254
61546 520254 508553 498266 490177 483375 476720 469687 462297 454866 447935 442175 437988 434938 431839 427927
61532D27927m029k676q02L22Q28J633K575K623J784J357K060L132L673L737L732
61517D47876L800M276N703P873R787J1042J2259J3637J4282J3787J3407J4569
61505E72298J6936J8944J9637J9029J7338J4945J2672J1115J0001Q817P607O390
61493G35729M598K122J76j04P13J399K099L615N216N157L460K172K324K569J648
61478G72893N19P13J908K618K448K149J889R35r40k904m043m191l666k866k209
61463G65253j796j016R92M316Q060J1273J3723J5636J7029J7709J7869J8387K0348
61450I07783K4044K8504L2267L4854L7330M1071M6028N0606N3441N4952N6735
61439A367615N9481O2084O3044O2229O0504N7957N3478M6380L7462K7886J7823
$$ plain form
61532 427927 423898 421222 420420 420742 421570 423203 425778 428401 430185 431542 433602 436734 440407 444144 447876
61517 447876 451676 455952 461655 469528 479315 490357 502616 516253 530535 544322 557729 572298
61505 572298 589234 608178 627815 646844 664182 679127 691799 702914 712915 721732 729339 735729
61493 735729 740327 742449 742625 742521 743234 744633 746732 750347 755563 760720 764180 766352 768676 771245 772893
61478 772893 773412 774125 776033 778651 781099 783248 785137 786072 785132 782228 778185 773994 770328 767462 765253
61463 765253 763457 762441 763433 767749 775809 787082 800805 816441 833470 851179 869048 887435 907783
61450 907783 931827 960331 992598 1027452 1064782 1105853 1151881 1202487 1255928 1310880 1367615
61439 1367615 1427096 1489180 1552224 1614453 1674957 1732914 1786392 1832772 1870234 1898120 1915943
61428A915943P111l361j2079j8580k3682k8083l1678l4261l5793l5823l3686k9758
61416A636270k5679k2722k0750j9122j7695j6323j4341j1543r030p936p738o953
61404A456438n245l685k901k257j175r9N49J518L787O908R396J0743J2029J4213
61390A500219J6646J8100J8696J9772K1785K3443K3450K2377K1934K2708K3401
61379A732531K2392J9472J5874J3053J1538J0741R681P989O034M159K233K60j180
61366A854777j665j676j749j426O5K193L357K703O80k232o061j0325j3732j5543
61352A809366j6296j6635j6432j5786j5750j6980j8369j8216j6425j4555j3870
61341A630052j4231j4645j4138j2188r113o038l943k774j820n36J530N157J0739
$$ plain form
61428 1915943 1923054 1919693 1907614 1889034 1865352 1837269 1805591 1771330 1735537 1699714 1666028 1636270
61416 1636270 1610591 1587869 1567119 1547997 1530302 1513979 1499638 1488095 1479065 1471129 1463391 1456438
61404 1456438 1451193 1447508 1444607 1442350 1441175 1441076 1441625 1443143 1446930 1453838 1463234 1473977 1486006 1500219
61390 1500219 1516865 1534965 1553661 1573433 1595218 1618661 1642111 1664488 1686422 1709130 1732531
61379 1732531 1754923 1774395 1790269 1803322 1814860 1825601 1835282 1843271 1849305 1853464 1855697 1855957 1854777
61366 1854777 1853112 1851436 1849687 1848261 1848326 1850519 1853876 1856579 1857259 1855027 1848966 1838641 1824909 1809366
61352 1809366 1793070 1776435 1760003 1744217 1728467 1711487 1693118 1674902 1658477 1643922 1630052
61341 1630052 1615821 1601176 1587038 1574850 1565737 1559699 1555756 1552982 1551162 1550626 1552156 1557313 1568052
61328A568052J7256K2841K6614K9413L2613L6821M1725M6679N1073N4573N7306
61317A984966N9708O2073O4229O5513O4897O1478N5131M6672L7157K7189J7025
61306B546038P008k418j0950j8384k4667l0217l5747m1228m5426m7162m6947m6650
61294B203250m7387m8296m7739m5325m2207l9498l6943l3641k9662k6045k3133
61283A783374j9992j6244j3445j3307j5098j6317j5802j4579j3700j3081j2779
61272A619030j3311j3779j1842p054k457r18j195J57L899P540R196R575R842R743
61258A618426Q680P098N933N562N884O580P032O800O330O313O316N244L390K653
61244A702241M135O655Q375Q946R191R400Q942P220M147j97n692j1841j7608k1830
$$ plain form
61328 1568052 1585308 1608149 1634763 1664176 1696789 1733610 1775335 1822014 1873087 1927660 1984966
61317 1984966 2044674 2106747 2170976 2236489 2301386 2362864 2417995 2464667 2501824 2529013 2546038
61306 2546038 2553046 2550628 2539678 2521294 2496627 2466410 2430663 2389435 2344009 2296847 2249900 2203250
61294 2203250 2155863 2107567 2059828 2014503 1972296 1932798 1895855 1862214 1832552 1806507 1783374
61283 1783374 1763382 1747138 1733693 1720386 1705288 1688971 1673169 1658590 1644890 1631809 1619030
61272 1619030 1605719 1591940 1580098 1573044 1570587 1569669 1568474 1568631 1572530 1580070 1589266 1598841 1608683 1618426
61258 1618426 1627106 1634204 1640137 1645699 1651583 1658163 1665195 1671995 1678325 1684638 1690954 1696198 1699588 1702241
61244 1702241 1706376 1713031 1721406 1730352 1739543 1748943 1757885 1765105 1769252 1769055 1763363 1751522 1733914 1712084
61230A712084k3863k3964k3042k1847k0493j8852j7136j5737j4677j3610j2241
61219A506622j0473q386o402n054m221k916l90K848N577P101P634P977R280J2373
61205A521570J6585K0025K1766K3030K5162K7405K8192K7903K8570L1018L4035
61194A805261L6343L7789L8381L7740L5889L3375L0241K6123K1510J7645J4864
61183B135161J2258R212O011K595j878p714j4051j9962k5008k8504k9633k8807
61171B009680k7630k6999k6485k5903k5853k6065k4911k1722j8323j6909j7462
61160A751418j8352j8679j8842j9499k0973k3229k5696k7538k8515k8890k8304
61149A492901k5854k1772j7809j5303j3976j3188j2962j3075j2651j1634j1198
$$ plain form
61230 1712084 1688221 1664257 1641215 1619368 1598875 1580023 1562887 1547150 1532473 1518863 1506622
61219 1506622 1496149 1487763 1481361 1476307 1472086 1469170 1468780 1471628 1477205 1484306 1491940 1499917 1509197 1521570
61205 1521570 1538155 1558180 1579946 1602976 1628138 1655543 1683735 1711638 1740208 1771226 1805261
61194 1805261 1841604 1879393 1917774 1955514 1991403 2024778 2055019 2081142 2102652 2120297 2135161
61183 2135161 2147419 2156631 2162642 2165237 2163359 2155645 2141594 2121632 2096624 2068120 2038487 2009680
61171 2009680 1982050 1955051 1928566 1902663 1876810 1850745 1825834 1804112 1785789 1768880 1751418
61160 1751418 1733066 1714387 1695545 1676046 1655073 1631844 1606148 1578610 1550095 1521205 1492901
61149 1492901 1467047 1445275 1427466 1412163 1398187 1384999 1372037 1358962 1346311 1334677 1323479
61138A323479j1496j0676p611m094k371j698N60N137J0217J4070J6378J7197J6444
61125A365536J4495J1839Q210L419j246l990m764n143o116p476r166j1474j3758
61112A340366j4697j4199j3668j4035j4884j5771j6884j7932j7920j6744j5641
61101A167991j5233j4375j1964q786o379m904l327j214R29K782M549O148P132
61088A123349P687Q839J1213J4083J6072J6622J6195J5057J2365P002o52q277
61076A239555j3407j5574j6322j7156j8056j8358j8347j9026k0284k0400j8128
61065A044497j4594j2119j1408j1079j0023q855q541q904r380j0032j0603r692
61053I19267o670l538k964m661n708m419k021l16L35L17mL13K214M832N938N009
$$ plain form
61138 1323479 1311983 1301307 1293696 1289602 1287231 1285533 1286093 1291230 1301447 1315517 1331895 1349092 1365536
61125 1365536 1380031 1391870 1400080 1403499 1402253 1398263 1393499 1388356 1382240 1374764 1365598 1354124 1340366
61112 1340366 1325669 1311470 1297802 1283767 1268883 1253112 1236228 1218296 1200376 1183632 1167991
61101 1167991 1152758 1138383 1126419 1117633 1111254 1106350 1103023 1101809 1102738 1105520 1110069 1116217 1123349
61088 1123349 1131036 1139875 1151088 1165171 1181243 1197865 1214060 1229117 1241482 1248484 1247832 1239555
61076 1239555 1226148 1210574 1194252 1177096 1159040 1140682 1122335 1103309 1083025 1062625 1044497
61065 1044497 1029903 1017784 1006376 995297 985274 976419 967878 958974 949594 939562 928959 919267
61053 919267 912597 909059 906095 901434 895726 891307 889286 888970 889305 889622 889618 889931 892145 896977 902915 907924
61037I07924L907L685K873K45k920n035o716q956j0563r962q272p887q659q140
61023H41524n463k562j365j710k368k480j671j65R54P94M8L04J960L864M869M755
61007H41288L946L337M032O052P825Q089P721Q377R945J0986J1076J0908J0534
60994I44116R476Q449Q851J0302J0655Q978O918O525Q042J0326J2225J3072J2892
60981A070827J2503J2621J2815J2270J1403J1566J3089J4851J5805J5916J5667
60970A219333J5690J6689J8678K0524K1398K2265K4584K8063L1118L3235L5309
60959A486886L7937M0936M4267M7921N1275N4098N7668O3193O9654P5056P9323
60948B108214Q3943Q9326R4697J00100J06190J12520J18506J25545J35453J47257
$$ plain form
61037 907924 911831 915516 918389 918634 915714 910679 903963 895007 884444 874482 866210 858323 849664 841524
61023 841524 836061 833499 832134 830424 828056 825576 823905 823740 824694 825488 825536 825840 827800 831664 836533 841288
61007 841288 845234 848571 852603 858655 866480 874569 882290 890667 900612 911598 922674 933582 944116
60994 944116 953592 962041 970892 981194 991849 1000827 1007745 1014270 1022312 1032638 1044863 1057935 1070827
60981 1070827 1083330 1095951 1108766 1121036 1132439 1144005 1157094 1171945 1187750 1203666 1219333
60970 1219333 1235023 1251712 1270390 1290914 1312312 1334577 1359161 1387224 1418342 1451577 1486886
60959 1486886 1524823 1565759 1610026 1657947 1709222 1763320 1820988 1884181 1953835 2028891 2108214
60948 2108214 2192157 2281483 2376180 2476280 2582470 2694990 2813496 2939041 3074494 3221751
60938C221751J58335J68379J79134J90589K00931K10244K20500K31808K42642
60929E024313K54407K71616K96496L27149L61763M00243M40756M79594N16692
60920H373029N57129O05855O65811P42808Q46118R81012J145615J337066J553746
60911A6808189J789483K036711K302828K613796K992615L444046L965477M539135
60903D0492280N065008N307125M985043M001882K596739J230970K91082j07185
60895F3862944o1297K81299P63933J139185J074195L45911r49500k418648l627957
60886F0410065m352091m613053m551376m302442l962912l601570l259668k947944
60878B8819009k660920k394755k149039j921035j708191j513490j342118j194771
$$ plain form
60938 3221751 3380086 3548465 3727599 3918188 4119119 4329363 4549863 4781671 5024313
60929 5024313 5278720 5550336 5846832 6173981 6535744 6935987 7376743 7856337 8373029
60920 8373029 8930158 9536013 10201824 10944632 11790750 12771762 13917377 15254443 16808189
60911 16808189 18597672 20634383 22937211 25551007 28543622 31987668 35953145 40492280
60903 40492280 45557288 50864413 55849456 59851338 62448077 63679047 63970129 63862944
60895 63862944 63801647 64082946 64846879 65986064 67060259 67406170 66456670 64038022 60410065
60886 60410065 56057974 51444921 46893545 42591103 38628191 35026621 31766953 28819009
60878 28819009 26158089 23763334 21614295 19693260 17985069 16471579 15129461 13934690
60870A3934690j068356r60439q68809p89065p16831o50973n91708n37394m86120
60861G264995m38417l95445l56365l20483k90056k67658k51912k38886k26591
60852D479182k15297k04572j93057j80723j68630j56945j45474j35472j28380
60843B950632j23205j17488j10637j04043r8315r2761q7406q3161p9905p6477
60833A977234p2681o9305o6128o1949n6893n2586m9639m6855m3595m1012l9995
60822A376596l9386l7401l3864l0075k7241k5834k5788k6525k7151k7137k6659
60811A049535k6041k5231k4019k2385k0597j9160j8538j8544j8302j7255j5947
60800H23516j5193j4713j3414j0899q046n959m887m276l579k993l336m793n857
$$ plain form
60870 13934690 12866334 11905895 11037086 10248021 9531190 8880217 8288509 7751115 7264995
60861 7264995 6826578 6431133 6074768 5754285 5464229 5196571 4944659 4705773 4479182
60852 4479182 4263885 4059313 3866256 3685533 3516903 3359958 3214484 3079012 2950632
60843 2950632 2827427 2709939 2599302 2495259 2396944 2304183 2216777 2133616 2053711 1977234
60833 1977234 1904553 1835248 1769120 1707171 1650278 1597692 1548053 1501198 1457603 1416591 1376596
60822 1376596 1337210 1299809 1265945 1235870 1208629 1182795 1157007 1130482 1103331 1076194 1049535
60811 1049535 1023494 998263 974244 951859 931262 912102 893564 875020 856718 839463 823516
60800 823516 808323 793610 780196 769297 761251 755292 750405 746129 742550 739557 736221 731428 725571
60787G25571m584j241J576K239K118L062M273L774K021J433K608L556L135K665
60773G52206L091K988J050j310j875j036r85k110k281j3L351N198M315J507j474
60758G62622l027k442k87K041L549M358N022N505N206L931K412J593J586J666
60744G93735J371J106J255J118m39l113m954m570k958k255l104m231m552m531
60730G63878n083o154p100p730q081p737o393m850m320m724m811m117l506l371
60716F85901k706r66L96k11j953k566j556n67n25m13O09J641J750J733K749M177
60700F87493M445L434K694L428N397P693R411R739Q473O553N165M308L199J994
60686G63426J798K675K967J345j388l451m378n224o818q724r984j0315j0303j0700
$$ plain form
60787 725571 720987 719746 721322 723561 725679 728741 733014 736788 738809 740242 742850 746406 749541 752206
60773 752206 755297 758285 759335 758025 756150 755114 754129 752019 749738 749725 753076 758274 762589 764096 762622
60758 762622 759595 757153 756866 758907 762456 766814 771836 777341 782547 786478 788890 790483 792069 793735
60744 793735 795106 796212 797467 798585 798146 795033 790079 785509 782551 780296 777192 772961 768409 763878
60730 763878 758795 752641 745541 737811 729730 721993 715600 710750 706430 701706 696895 692778 689272 685901
60716 685901 683195 682229 682625 682414 680461 677895 676339 675772 675247 674834 675443 677084 678834 680567 683316 687493
60700 687493 691938 695372 698066 701494 706891 714584 723995 733734 742207 748760 753925 758233 761432 763426
60686 763426 765224 767899 770866 772211 770823 767372 762994 757770 750952 742228 732244 721929 711626 700926
60672G00926j1624j2463j2540j1800j0684r531q556q178q787j0036j0942j0825
60660E74960r705p778n374l508l366m681n518m621l039k466k773k597j840j825
60646E15869k924l735l169j938j191q53j64R64K078K857K859J453r42k320j101
60631E07743J749L873M419M445M676M429L065J136l61q01K36K780N589O687N542
60616E55207L742K906K997L367M230N767O872O342M808M024M499N258N743O475
60602F22237P635Q373Q080P375P217P715Q287Q540Q532Q486Q414P899O379M057
60588G29226K253K114L094L457K325N18o98r60q22j044k014l374m237m283m369
60573G21186n241n987n018k551o73n25q20Q5J804K663K074J121J046J964L007
$$ plain form
60672 700926 689302 676839 664299 652499 641815 632284 623728 615550 606763 596727 585785 574960
60660 574960 565255 557477 552103 548595 545229 540548 535030 530409 527370 524904 522131 519534 517694 515869
60646 515869 512945 509210 506041 504103 502912 502059 501895 502859 504937 507794 510653 512106 511164 508844 507743
60631 507743 509492 513365 517784 522229 526905 531334 534399 535535 535174 534373 534609 537389 542978 549665 555207
60616 555207 558949 561855 564852 568219 572449 578216 585088 591430 596238 600262 604761 610019 615762 622237
60602 622237 629872 638245 646325 653700 660917 668632 676919 685459 693991 702477 710891 718790 725169 729226
60588 729226 731479 733593 736687 740144 742469 742987 742289 741329 740507 739463 737449 734075 729838 725555 721186
60573 721186 715945 709958 704940 702389 701716 701191 700371 700456 702260 704923 706997 708118 709164 711128 714135
60558G14135L331L001L009M131N956P544Q827J0332J1679J1766J0744J0448J2101
60545H17004J4855J7221J8809J9770J9946J9643K0078K1630K2676K1535J8634
60534A031801J5307J1444O204K87m583q110j1370j4457j6247j6620j6850j7363
60522I59443j7122j5849j4901j4979j4792j3299j1632j1299j1623j0726q343o017
60510H08861m842m413l930l181k390j939k161k870l265k884k151j274N87L938
60496G78086P355Q756Q049O998O424N334L359K220L526O297Q145Q271P800P613
60482H68233P389P041P581R827J3020J5478J6427J6596J7232J8821K0775K2284
60470A040704K3388K4987K7479K9879L1076L1830L4336L9470M5565N0763N5567
$$ plain form
60558 714135 717466 720467 723476 727607 733563 741107 749934 760266 771945 783711 794455 804903 817004
60545 817004 831859 849080 867889 887659 907605 927248 947326 968956 991632 1013167 1031801
60534 1031801 1047108 1058552 1064756 1065043 1060460 1052350 1040980 1026523 1010276 993656 976806 959443
60522 959443 942321 926472 911571 896592 881800 868501 856869 845570 833947 823221 814878 808861
60510 808861 804019 799606 795676 792495 790105 788166 786005 783135 779870 776986 774835 773561 774148 778086
60496 778086 785441 794197 802246 809244 815668 821002 824361 826581 830107 836404 844549 852820 860620 868233
60482 868233 875622 882663 890244 900071 913091 928569 944996 961592 978824 997645 1018420 1040704
60470 1040704 1064092 1089079 1116558 1146437 1177513 1209343 1243679 1283149 1328714 1379477 1435044
60459A435044O1907P0213P9037Q7527R6858J08477J21988J35555J47865J58850
60449B503321J68659J76487J80369J77824J66758J46207J16588P9695L8682k303
60439C752287l9332o9949r3210j08756j16455j16921j11574j01949q9459p5777
60429B828905o2409m9359l5114j8673j043J5860L0987M3829N2984N6426N3309
60418B915702M4458L1010J3710o079k5743m2820n6623o7687p5812p9683p8681
60407B571752p4257o8737o3032n6344m8174l9547l1682k4285j6266p747o4O361
60395B147978J2822K0534K8952L6634M3116M9164N5689O3083P1312Q0162Q9650
60384B699096J00465J13531J28743J44900J61453J79570K00889K25909K54388
$$ plain form
60459 1435044 1496951 1567164 1646201 1733728 1830586 1939063 2061051 2196606 2344471 2503321
60449 2503321 2671980 2848467 3028836 3206660 3373418 3519625 3636213 3715908 3754590 3752287
60439 3752287 3712955 3643006 3549796 3441040 3324585 3207664 3096090 2994141 2904682 2828905
60429 2828905 2766496 2717137 2682023 2663350 2662307 2678167 2709154 2752983 2805967 2862393 2915702
60418 2915702 2960160 2991170 3004880 2998801 2973058 2930238 2873615 2805928 2730116 2650433 2571752
60407 2571752 2497495 2428758 2365726 2309382 2261208 2221661 2189979 2165694 2149428 2141681 2141617 2147978
60395 2147978 2160800 2181334 2210286 2246920 2290036 2339200 2394889 2457972 2529284 2609446 2699096
60384 2699096 2799561 2913092 3041835 3186735 3348188 3527758 3728647 3954556 4208944
60375D208944K86488L22268L60580L99708M38924M78308N17110N53140N83282
60366H148752O03275O07042N87926N41459M66735L65786K43165J06457l4479j69988
60356A1466130k92136l94270m71086n20758n46377n53971n48797n33785n10869
60347G094081m82620m52112m21561l91522l61560l31684l02840k76032k51490
60338C822660k29107k09113j91550j75500j59940j45214j32552j22097j12573
60329B345014j03113r4181q6301p9104p2360o6783o2782n9330n5158n0543m6735
60318A568624m4075m1802l9472l7274l4901l1327k6354k1569j8956j8656j8778
60307A235460j7630j5735j5131j6703j8874j9417j8145j6883j6968j7763j7844
$$ plain form
60375 4208944 4495432 4817700 5178280 5577988 6016912 6495220 7012330 7565470 8148752
60366 8148752 8752027 9359069 9946995 10488454 10955189 11320975 11564140 11670597 11636118 11466130
60356 11466130 11173994 10779724 10308638 9787880 9241503 8687532 8138735 7604950 7094081
60347 7094081 6611461 6159349 5737788 5346266 4984706 4653022 4350182 4074150 3822660
60338 3822660 3593553 3384440 3192890 3017390 2857450 2712236 2579684 2457587 2345014
60329 2345014 2241901 2147720 2061419 1982315 1909955 1843172 1780390 1721060 1665902 1615359 1568624
60318 1568624 1524549 1482747 1443275 1406001 1371100 1339773 1313419 1291850 1272894 1254238 1235460
60307 1235460 1217830 1202095 1186964 1170261 1151387 1131970 1113825 1096942 1079974 1062211 1044367
60296A044367j6776j5214j4098j4105j5205j6239j5774j3984j2792j3328j4095
60285H82757j2816r583o781o182p297q620r167q559o759m380k575k009k322k722
60271G92985k674j896m57Q29Q11o93k487l272k838j651j6J758K941L082K855L269
60255G92546M085L996K540R28M28P05M94m77j217j001l25k6k20n06o78o97l11
60238H00264N20R96Q7k029l819m036l104k471l006m479o173p372p419o238n049
60223G46672n678q409j0962j0597p268l845k806l560l771k636j589j867k778k922
60209F77984k082r49J75J317J885J120l97r27L21K114K844K597K814M288O247
60194F99351P545Q054Q434Q775Q237O584N505P147J0997J3577J2429R434Q490
$$ plain form
60296 1044367 1027591 1012377 998279 984174 968969 952730 936956 922972 910180 896852 882757
60285 882757 869941 860358 853577 847395 840098 831478 822311 813752 806993 802613 800038 798029 795707 792985
60271 792985 790311 788415 787958 788787 789598 788905 786418 783146 780308 778657 778641 780399 783340 786422 789277 792546
60255 792546 796631 800627 803167 804095 804523 805228 805722 805245 804028 803027 802702 802676 802456 801950 801272 800575 800264
60238 800264 800784 801780 801867 799838 796019 791983 788879 786408 783402 778923 772750 765378 757959 751721 746672
60223 746672 740994 732585 721623 711026 703758 699913 697107 693547 689776 687140 685551 683684 680906 677984
60209 677984 675902 674953 675128 676445 678330 679450 679053 678126 678447 680561 683405 686002 688816 693104 699351
60194 699351 706896 714950 723384 732159 740396 746980 752485 759632 770629 784206 796635 806069 814559
60181H14559J0453J2597J3126J3668J6071J9022K0061J9552K0081K2487K5088
60170A006765K6903K9112L2458L5443L6546L6557L7045L7702L7134L5538L4424
60159A385627L3862L2136K8653K5153K3015K0976J7141J2103Q229O214M296J105
60147A598510k365m300m342l335j818K18K550M774O993R664J2843J6136J9264
60134A654792K2180K4792K7277L0387L4721L9645M3599M5598M5855M4962M3136
60123B056944M0521L7642L5010L2400K8773K3160J5890Q843L906J004j685n190
60111B277218q436j0198j1183j2718j4044j2922q888l967L54N074J1745J9978
60099B232013K8097L5356M2382N0059N8622O7433P4932P9440Q0419P8351P3191
$$ plain form
60181 814559 825012 837609 850735 864403 880474 899496 919557 939109 959190 981677 1006765
60170 1006765 1033668 1062780 1095238 1130681 1167227 1203784 1240829 1278531 1315665 1351203 1385627
60159 1385627 1419489 1451625 1480278 1505431 1528446 1549422 1566563 1578666 1586895 1593109 1597405 1598510
60147 1598510 1596145 1591845 1587503 1584168 1582350 1582568 1585118 1589892 1596885 1606549 1619392 1635528 1654792
60134 1654792 1676972 1701764 1729041 1759428 1794149 1833794 1877393 1922991 1968846 2013808 2056944
60123 2056944 2097465 2135107 2170117 2202517 2231290 2254450 2270340 2279183 2283089 2284093 2282408 2277218
60111 2277218 2268782 2258584 2247401 2234683 2220639 2207717 2198829 2194862 2195216 2200290 2212035 2232013
60099 2232013 2260110 2295466 2337848 2387907 2446529 2513962 2588894 2668334 2748753 2827104 2900295
60088B900295O4156N1518L7335K3407R649m431j7755k8576l6433m1838m4811m5268
60076B867248m4304m3338m2217l9670l5420l0312k4580j7721j0085k735M576J3392
60064B594834K3835L3711M1403M8279N6748O6905P6609Q4385R0858R7389J04359
60053C319315J10937J15795J17911J17184J14467J10607J05457R8180Q8530P7260
60043D375643O4959N0880L3620J3181q142k7540m4168n9117p2965q4417r1972
60032D149962r5954r7920r8669r8021r6052r3111q8692q1935p3471o5355n8445
60021C202337n1188m2053l2043k3566j7410j2223o731j204L521P353J0672J3300
60009C050765J4418J3476J0887P740M977K898J324j09j885m504p965j1516j4273
$$ plain form
60088 2900295 2964451 3015969 3053304 3076711 3086360 3081929 3064174 3035598 2999165 2957327 2912516 2867248
60076 2867248 2822944 2779606 2737389 2697719 2662299 2631987 2607407 2589686 2579601 2576866 2581442 2594834
60064 2594834 2618669 2652380 2693783 2742062 2798810 2865715 2942324 3026709 3117567 3214956 3319315
60053 3319315 3430252 3546047 3663958 3781142 3895609 4006216 4111673 4209853 4298383 4375643
60043 4375643 4440602 4491482 4525102 4538283 4530141 4502601 4458433 4399316 4326351 4241934 4149962
60032 4149962 4054008 3956088 3857419 3759398 3663346 3570235 3481543 3399608 3326137 3260782 3202337
60021 3202337 3151149 3109096 3077053 3053487 3036077 3023854 3017123 3015919 3019440 3026793 3037465 3050765
60009 3050765 3065183 3078659 3089546 3097286 3102263 3105161 3106485 3106376 3104491 3099987 3092022 3080506 3066233
59996C066233j5999j6882j6800j5545j3609j1780r769o196n65N647J0775J5124
59984B990634K0323K6768L2933L7372M0381M3105M5762M7603M8394M9180N1326
59973C433781N5260O0313O5390O9275P0534O7926O1345N1952M0908K8184J3160
59962D018028l725k0492l4950m6324n5524o4086p2778q0798q6333q8260q7265
59951C377493q5053q2607p9714p6038p1695o6648o0455n3166m5779l9124l2775
59940B684439k5805j8280j1191n036P64O878J3234J9439K5497L1542L7035M0813
59928B799329M2157M1601M0355L8944L6637L2396K6097J8588J0813L284l757j0348
59916C076096j7031k4415l2155l8879m3497m6137m7372m7078m4868m1315l7783
$$ plain form
59996 3066233 3050234 3033352 3016552 3001007 2987398 2975618 2965849 2959653 2959088 2964735 2975510 2990634
59984 2990634 3010957 3037725 3070658 3108030 3148411 3191516 3237278 3284881 3333275 3382455 3433781
59973 3433781 3489041 3549354 3614744 3684019 3754553 3822479 3883824 3935776 3976684 4004868 4018028
59962 4018028 4014303 3993811 3958861 3912537 3857013 3792927 3720149 3639351 3553018 3464758 3377493
59951 3377493 3292440 3209833 3130119 3054081 2982386 2915738 2855283 2802117 2756338 2717214 2684439
59940 2684439 2658634 2640354 2629163 2624127 2624891 2631769 2645003 2664442 2689939 2721481 2758516 2799329
59928 2799329 2841486 2883087 2923442 2962386 2999023 3031419 3057516 3076104 3086917 3090201 3086444 3076096
59916 3076096 3059065 3034650 3002495 2963616 2920119 2873982 2826610 2779532 2734664 2693349 2655566
59905B655566l4834l1589k6943k0788j3522n178M112J3012J9515K2961K4879K7292
59893B634483L0651L3904L6099L7186L7490L7185L6347L4888L2442K8890K4905
59882C004470K1263J7751J3761R924P715P041N875L346J685L507Q268J3297J7593
59869C135496K2458K8741L5727M3001N1206O0196O8482P5416Q2113Q8908R3680
59858C785424R4389R2000Q8987Q5627P9691O9382N4921L7374J7741k515k1508
59847D381513l8142n2438o4377p3379p9385q3482q6729q8861q8779q6023q1244
59836C558674p5322o8536o0771n2325m3953l5943k7576j8262q887j040N232J1641
59824C182932J8940K5310K8736K9894L1011L2264L1334K6787J9970J2770M941
$$ plain form
59905 2655566 2620732 2589143 2562200 2541412 2527890 2522712 2526824 2539836 2559351 2582312 2607191 2634483
59893 2634483 2665134 2699038 2735137 2772323 2809813 2846998 2883345 2918233 2950675 2979565 3004470
59882 3004470 3025733 3043484 3057245 3067169 3074884 3081925 3087800 3091146 3092831 3096338 3104606 3117903 3135496
59869 3135496 3157954 3186695 3222422 3265423 3316629 3376825 3445307 3520723 3602836 3691744 3785424
59858 3785424 3879813 3971813 4060800 4146427 4226118 4295500 4350421 4387795 4405536 4403021 4381513
59847 4381513 4343371 4290933 4226556 4153177 4073792 3990310 3903581 3814720 3725941 3639918 3558674
59836 3558674 3483352 3414816 3354045 3301720 3257767 3221824 3194248 3175986 3167099 3166059 3171291 3182932
59824 3182932 3201872 3227182 3255918 3285812 3316823 3349087 3380421 3407208 3427178 3439948 3444889
59813C444889n043j7295k9971m1124n0221n7772o4179o9255p2623p4331p4893
59802B888182p4719p3863p2693p2214p2915p3507p1811o7217o1360n6114n1826
59791B139943m7940m4280m0856l7044l2065k6111k0278j5475j1850r022o427l722
59779A844873j389m84j239k287k081p61K64M12N55J486K868M053N013N888O376
59764A863547O426O869Q435J0358J0992R948Q771R031J0429J1463J1534J1403
59752A979206J1282R560M435l252r901j2351j0746p829n965n498n631n909o691
59739A930710q727j2452j7133k0652k0906j7843j3579j0246q257o874n616m498
59727A783927l534k824k678k898k501r00J047K186K827M181O425Q740J1139J4603
$$ plain form
59813 3444889 3439846 3422551 3392580 3351456 3301235 3243463 3179284 3110029 3037406 2963075 2888182
59802 2888182 2813463 2739600 2666907 2594693 2521778 2448271 2376460 2309243 2247883 2191769 2139943
59791 2139943 2092003 2047723 2006867 1969823 1937758 1911647 1891369 1875894 1864044 1855022 1848595 1844873
59779 1844873 1843484 1843000 1841761 1839474 1837393 1836632 1836896 1837308 1837863 1839349 1842217 1846270 1851283 1857171 1863547
59764 1863547 1869973 1876842 1885277 1895635 1906627 1916575 1925346 1934377 1944806 1956269 1967803 1979206
59752 1979206 1990488 2000048 2004483 2001231 1991330 1978979 1968233 1960404 1954439 1948941 1943310 1937401 1930710
59739 1930710 1921983 1909531 1892398 1871746 1850840 1832997 1819418 1809172 1800915 1794041 1788425 1783927
59727 1783927 1780393 1777569 1774891 1771993 1769492 1768592 1769639 1771825 1774652 1778833 1785258 1793998 1805137 1819740
59713A819740J9159K3493K7106L1295L7015M3391M9544N6345O4604P2700P8307
59702B322699Q1979Q6667R3537J00228J03685J02740R7047Q5334O6445M1561J4294
59691C196216j1233l1997m6695n5811o0881o3136o2941o0541n6581n1529m5313
59680B649558l8098l0770k4129j8219j2900q266l884J471Q327J5437K1265K6002
59668B585794L0931L6281M1157M5451N0454N7182O5278P3968Q3094R2657J02248
59657C264495J11670J21530J32526J44487J56737J69058J81681J94491K06783
59648D683458K17797K27111K34441K39430K41690K40838K36468K28443K17442
59639F767118K05084J93189J82711J73455J64660J55664J46018J35419J23993
$$ plain form
59713 1819740 1838899 1862392 1889498 1920793 1957808 2001199 2050743 2107088 2171692 2244392 2322699
59702 2322699 2404678 2491345 2584882 2685110 2788795 2891535 2988582 3073916 3140361 3181922 3196216
59691 3196216 3184983 3152986 3106291 3050480 2989599 2926463 2863522 2802981 2746400 2694871 2649558
59680 2649558 2611460 2580690 2556561 2538342 2525442 2517176 2513292 2514763 2523090 2538527 2559792 2585794
59668 2585794 2616725 2653006 2694163 2739614 2790068 2847250 2912528 2986496 3069590 3162247 3264495
59657 3264495 3376165 3497695 3630221 3774708 3931445 4100503 4282184 4476675 4683458
59648 4683458 4901255 5128366 5362807 5602237 5843927 6084765 6321233 6549676 6767118
59639 6767118 6972202 7165391 7348102 7521557 7686217 7841881 7987899 8123318 8247311
59630H247311J12456J01506R0941P9696O6782N2008L5998K0049N856n399j4009
59619H793195k1136k6872k9702k8384k3735j7597j0454j012J1775K7099M3005
59608H716182N8170P2775Q7942J04559J22423J40192J55958J67957J75125J77579
59598I978862J76313J71681J62011J44648J18638Q5606M7591N262m0821q8322
59588A0761469j33954j75600k12204k42100k63239k75235k79893k79421k75196
59579H624627k68068k58390k45589k29484k12565j99258j92087j89965j91108
59570F638113j95891k05157k17022k27459k33696k35377k32787k25931k15565
59561D649228k03495j91079j78379j65248j52249j39998j28514j17737j07960
$$ plain form
59630 8247311 8359767 8461273 8552214 8631910 8698692 8750700 8786698 8806747 8812603 8807204 8793195
59619 8793195 8772059 8745187 8715485 8687101 8663366 8645769 8635315 8634303 8646078 8673177 8716182
59608 8716182 8774352 8847127 8935069 9039628 9162051 9302243 9458201 9626158 9801283 9978862
59598 9978862 10155175 10326856 10488867 10633515 10752153 10837759 10885350 10890612 10849791 10761469
59588 10761469 10627515 10451915 10239711 9997611 9734372 9459137 9179244 8899823 8624627
59579 8624627 8356559 8098169 7852580 7623096 7410531 7211273 7019186 6829221 6638113
59570 6638113 6442222 6237065 6020043 5792584 5558888 5323511 5090724 4864793 4649228
59561 4649228 4445733 4254654 4076275 3911027 3758778 3618780 3490266 3372529 3264569
59552C264569r9140r0645q2329p5240p0187o6135o1099n4618m8354m4000m1440
59541B531382l9372l7025l4691l2972l2204l2420l3278l4038l4105l3636l3223
59530B154418l2956l2292l0880k9069k7425k6135k5069k4050k2855k1309j9514
59519A862864j7640j5453j2643r844q348q357q317o821m525l145l043k976j956
59506A759796k32J598L248M426M979N658P638J0850J3729J5201J6031J7674K0509
59493A881105K3826K6821K8996L0265L1412L3779L7765M2149M5707M8907N3013
59482B283745N7927O2185O5057O7578P1059P5309P8870Q0667Q1034Q1023Q0684
59471C085138P8184P1269N9917M7056L5870K6798J8007Q563n5o026r687j3114
$$ plain form
59552 3264569 3165429 3074784 2992455 2917215 2847028 2780893 2719794 2665176 2616822 2572822 2531382
59541 2531382 2492010 2454985 2420294 2387322 2355118 2322698 2289420 2255382 2221277 2187641 2154418
59530 2154418 2121462 2089170 2058290 2029221 2001796 1975661 1950592 1926542 1903687 1882378 1862864
59519 1862864 1845224 1829771 1817128 1807284 1798936 1790579 1782262 1775441 1770916 1767771 1764728 1761752 1759796
59506 1759796 1759564 1761162 1764410 1768836 1773815 1779473 1787111 1797961 1811690 1826891 1842922 1860596 1881105
59493 1881105 1904931 1931752 1960748 1991013 2022425 2056204 2093969 2136118 2181825 2230732 2283745
59482 2283745 2341672 2403857 2468914 2536492 2607551 2682860 2761730 2842397 2923431 3004454 3085138
59471 3085138 3163322 3234591 3294508 3341564 3377434 3404232 3422239 3430802 3430747 3424721 3415034 3401920
59459C401920j7605k2543k6686k9770l2341l4522l5676l5353l3940l1865k8620
59448C072999k3326j6168q486j138O589J5877K6649L7451M6918N4723O1265O6931
59436C340284P1728P5199P6485P4652O9209O0333M8655L4831J9311K485j4876
59425C858296l1503m6191n8506o8628p6608q2078q4739q4751q2590p8908p4457
59414C089337o9630o4027n6987m8669m0036l1802k4060j6916j0499m227K912J0859
59402B736255J8321K4483K9813L4582L7956L9578M0622M1812M1532L7782L1335
59391C114071K4913J9504J3464N444l747j2715k1187k9346l6719m2718m7440n1134
59379B932390n3550n4412n4052n3085n1851n0372m8377m5315m1006l6128l1427
$$ plain form
59459 3401920 3384315 3361772 3335086 3305316 3272975 3238453 3202777 3167424 3133484 3101619 3072999
59448 3072999 3049673 3033505 3025019 3023881 3030470 3046347 3072996 3110447 3157365 3212088 3273353 3340284
59436 3340284 3412012 3487211 3563696 3638348 3707557 3767890 3816545 3851376 3870687 3873172 3858296
59425 3858296 3826793 3780602 3722096 3653468 3576860 3494782 3410043 3325292 3242702 3163794 3089337
59414 3089337 3019707 2955680 2898693 2850024 2809988 2778186 2754126 2737210 2726711 2722484 2725396 2736255
59402 2736255 2754576 2779059 2808872 2843454 2881410 2920988 2961610 3003422 3044954 3082736 3114071
59391 3114071 3138984 3158488 3171952 3177396 3173649 3160934 3139747 3110401 3073682 3030964 2983524 2932390
59379 2932390 2878840 2824428 2770376 2717291 2665440 2615068 2566691 2521376 2480370 2444242 2412815
59368B412815k6675k1486j6848j4271j3248j1271o925j388L904R355J5773K2235
59356B351970K7106L0314L3163L6486M0368M5258N1862N9774O7011P0880O9056
59345B883248O0874M8729L7560L1527L1093L4031L8500M4170N0945N8176O4699
59334C383552O8392O6288N7178M4333L3878K9635L0475L2839L4503L5459L6569
59323C853101L8304M0155M0871L9880L8485L8490L9601L9704L8166L7073L8255
59312D282085M0694M2409M3491M5340M7808M9352M9959N1851N6683O3605P0844
59301D844121P8059Q6290R6353J08165J21096J34229J46607J57814J68118J77488
59291F118340J84830J88717J88850J86089J81200J74220J65180J54727J43601
$$ plain form
59368 2412815 2386140 2364654 2347806 2333535 2320287 2309016 2302091 2300703 2304607 2313962 2329735 2351970
59356 2351970 2379076 2409390 2442553 2479039 2519407 2564665 2616527 2676301 2743312 2814192 2883248
59345 2883248 2944122 2992851 3030411 3061938 3093031 3127062 3165562 3209732 3260677 3318853 3383552
59334 3383552 3451944 3518232 3575410 3619743 3653621 3683256 3713731 3746570 3781073 3816532 3853101
59323 3853101 3891405 3931560 3972431 4012311 4050796 4089286 4128887 4168591 4206757 4243830 4282085
59312 4282085 4322779 4365188 4408679 4454019 4501827 4551179 4601138 4652989 4709672 4773277 4844121
59301 4844121 4922180 5008470 5104823 5212988 5334084 5468313 5614920 5772734 5940852 6118340
59291 6118340 6303170 6491887 6680737 6866826 7048026 7222246 7387426 7542153 7685754
59282G685754J31966J19667J06659R2590P6333N6893L4726J1270j2878l8358o5245
59271H199377r1979j17002j40540j63536j85234k03191k15757k23472k27847k29692
59261F401127k28976k25506k19439k11702k03840j96691j89245j79955j69315
59252D576458j59730j52337j45388j36758j26819j17466j09400j01976r5078q9248
59242C342258q4020p7983p0932o4545o0100n6716n2675m7711m2894l8800l4894
59231B710988l0795k7210k5010k3843k2201j9022j4742j0491o612k560J819N929
59219B536250R559J3522J8369K3219K6909K9990L4334M0685M7712N3824N8938
59208B893311O3888O8743P2714P5473P7884Q1071Q4866Q7175Q4820P5347N8628
$$ plain form
59282 7685754 7817720 7937387 8044046 8136636 8212969 8269862 8304588 8315858 8302980 8264622 8199377
59271 8199377 8107398 7990396 7849856 7686320 7501086 7297895 7082138 6858666 6630819 6401127
59261 6401127 6172151 5946645 5727206 5515504 5311664 5114973 4925728 4745773 4576458
59252 4576458 4416728 4264391 4119003 3982245 3855426 3737960 3628560 3526584 3431506 3342258
59242 3342258 3258238 3180255 3109323 3044778 2984678 2927962 2875287 2827576 2784682 2745882 2710988
59231 2710988 2680193 2652983 2627973 2604130 2581929 2562907 2548165 2537674 2531062 2528502 2530321 2536250
59219 2536250 2545809 2559331 2577700 2600919 2627828 2657818 2692152 2732837 2780549 2834373 2893311
59208 2893311 2957199 3025942 3098656 3174129 3252013 3333084 3417950 3505125 3589945 3665292 3723920
59197C723920L7311J5881j360j2323j7887k0570k2322k3586k4040k3449k1697
59186C609878j8938j6131j4443j3566j1636p687l138K92L167P099J1754J5099
59174C561750J6518J7532J9145K0436K0552K0257K0472K0677J9952J8545J7247
59163C773083J6220J5392J5117J5355J5091J3738J2420J2623J4262J6248J8447
59152C937996K1712K6200L0939L5193L9270M3876M9386N5767O2704O9890P7503
59141D450436Q6001R5048J03234J09438J13712J16013J14976J09106R8717Q5398
59131E482079P0043N2565L3170J2539q911l0607n0975o8534q3684r7586j09290
59120E200809j16167j17774j17260j17631j18303j16972j13572j10283j08165
$$ plain form
59197 3723920 3761231 3777112 3775752 3763429 3745542 3724972 3702650 3679064 3655024 3631575 3609878
59186 3609878 3590940 3574809 3560366 3546800 3535164 3527477 3524339 3524631 3527798 3534897 3546651 3561750
59174 3561750 3578268 3595800 3614945 3635381 3655933 3676190 3696662 3717339 3737291 3755836 3773083
59163 3773083 3789303 3804695 3819812 3835167 3850258 3863996 3876416 3889039 3903301 3919549 3937996
59152 3937996 3959708 3985908 4016847 4052040 4091310 4135186 4184572 4240339 4303043 4372933 4450436
59141 4450436 4536437 4631485 4734719 4844157 4957869 5073882 5188858 5297964 5396681 5482079
59131 5482079 5552122 5604687 5637857 5650396 5641485 5610878 5559903 5491369 5407685 5310099 5200809
59120 5200809 5084642 4966868 4849608 4731977 4613674 4496702 4383130 4272847 4164682
59111D164682j05839j01924r7165r3330r1013q9491q8237q7432q6940q5788q3353
59100C154170q0525p8823p8442p7965p6139p3166p0036o7440o5687o4650o3293
59089B358004o0342n6213n3065n1865n0667m7391m3150m0674m0137l8984l5806
59078A839710l1859k8379k4842k0707j6738j3463j0294p290n893o336o123k977
59066A664809K026O124Q586J0729J3077J4806J5894J7749K1288K5727K9567L1895
59054A862277L2663L2660L3089L4328L5330L5119L4392L4426L4818L3851L1060
59043B234013K7947K5912K4705K3192K0546J6501J1665P809O480O901O635M951
59031B417257M040N840Q954J0359R317P820P372P173N892L751J840L57j396l787
$$ plain form
59111 4164682 4058843 3956919 3859754 3766424 3675411 3585920 3497683 3410251 3323311 3237523 3154170
59100 3154170 3073645 2994822 2916380 2838415 2762276 2689110 2619074 2551634 2485947 2421297 2358004
59089 2358004 2297662 2241449 2188384 2136519 2085852 2038461 1995311 1954637 1914500 1875516 1839710
59078 1839710 1807851 1779472 1754630 1733923 1717185 1703722 1693428 1686138 1680245 1673909 1667786 1664809
59066 1664809 1666835 1672959 1681545 1692274 1705351 1720157 1736051 1753800 1775088 1800815 1830382 1862277
59054 1862277 1894940 1927600 1960689 1995017 2030347 2065466 2099858 2134284 2169102 2202953 2234013
59043 2234013 2261960 2287872 2312577 2335769 2356315 2372816 2384481 2392290 2398770 2405671 2412306 2417257
59031 2417257 2421297 2427137 2436091 2446450 2455767 2463587 2470959 2478132 2484024 2487775 2489615 2489972 2488576 2484789
59017B484789o831j1136j7477k5024l1234l4469l5938l7988m1105m3926m5815
59006B153846m7709n0145n2108n2674n2462n2348n1827m9817m6426m2725l9317
58995A616288l6240l3763l1994l0011k6723k2547j9157j7504j7011j6639j5686
58984A349013j3669j0588p485n656m983m021j944N05K383L935O059R047J2333
58971A334929J5162J7270J9116K1411K4149K6401K7526K8053K8674K8904K7774
58960A599369K5275K1888J7308J1404N975L309K799J332k233n345n653m356l870
58947A667202l972k595P37M528P680J0023J0869R385O501M444L789K561j047o390
58933A713715j1368j4678j6382j7189j7841j8790j9859k0547k0758k0799k0728
$$ plain form
59017 2484789 2477958 2466822 2449345 2424321 2393087 2358618 2322680 2284692 2243587 2199661 2153846
59006 2153846 2106137 2055992 2003884 1951210 1898748 1846400 1794573 1744756 1698330 1655605 1616288
58995 1616288 1580048 1546285 1514291 1484280 1457557 1435010 1415853 1398349 1381338 1364699 1349013
58984 1349013 1335344 1324756 1317271 1311615 1306632 1302611 1300667 1301172 1303555 1307490 1313549 1322596 1334929
58971 1334929 1350091 1367361 1386477 1407888 1432037 1458438 1485964 1514017 1542691 1571595 1599369
58960 1599369 1624644 1646532 1663840 1675244 1681219 1684528 1687327 1688659 1686426 1681081 1675428 1671072 1667202
58947 1667202 1663230 1660635 1661372 1665900 1673580 1683603 1694472 1703857 1710358 1714802 1718591 1721152 1720105 1713715
58933 1713715 1702347 1687669 1671287 1654098 1636257 1617467 1597608 1577061 1556303 1535504 1514776
58922A514776k0363j9847j9479j8998j7870j6354j5327j4969j4539j3705j2914
58911A330411j2150j0477p558m509k366o93J243K726K556J278R53K469M384M831
58897A313098L664K144J292J164J305J217N99l50r42o34M16J638K852M372O289
58882A338124Q024Q933R202R776J1288J3321J4917J5614J5564J4819J3142J0793
58870A483517Q887Q457R386J0794J2294J4234J6827J9763K2787K6030K9450L2567
58858A694993L5099L7378L9658M1623M3137M5056M8463N3199N7917O1593O4309
58847B222425O6557O8509P0353P2662P5984Q0276Q5111R0307R6202J03353J11861
58836C143600J20776J28503J34378J39503J45166J50600J53586J53601J52845
$$ plain form
58922 1514776 1494413 1474566 1455087 1436089 1418219 1401865 1386538 1371569 1357030 1343325 1330411
58911 1330411 1318261 1307784 1300226 1295717 1293351 1292658 1293901 1296627 1299183 1300461 1301414 1303883 1308267 1313098
58897 1313098 1316762 1318906 1320198 1321362 1322667 1323884 1324483 1324133 1323191 1322557 1322973 1324611 1327463 1331835 1338124
58882 1338124 1346148 1355081 1364283 1374059 1385347 1398668 1413585 1429199 1444763 1459582 1472724 1483517
58870 1483517 1492404 1500861 1510247 1521041 1533335 1547569 1564396 1584159 1606946 1632976 1662426 1694993
58858 1694993 1730092 1767470 1807128 1848751 1891888 1936944 1985407 2038606 2096523 2158116 2222425
58847 2222425 2288982 2357491 2427844 2500506 2576490 2656766 2741877 2832184 2928386 3031739 3143600
58836 3143600 3264376 3392879 3527257 3666760 3811926 3962526 4116112 4269713 4422558
58827D422558J53342J54165J52709J47732J39649J28613J14307R7455P9647O1171
58817E651348M0645J7557o228k8479m8948o8556q6997j02590j14336j23054j30426
58806D999936j37497j44096j49031j50970j49632j46244j42479j39010j35338
58797C705639j30729j24964j18425j11955j06388j01651r6605r0411q3833p8515
58787B662163p5013p2238o8898o4774o0481n6617n3388n0524m7383m3587l9627
58776B029633l6213l2981k8790k3621j9120j6504j4731j1905p934m553k783j634
58764A828864N08M124Q526J2681J5638J7053J7758J9182K1626K4025K5940K8796
58752B024721L3838L9625M3290M4229M4894M7471N1320N4629N7345O0968O6117
$$ plain form
58827 4422558 4575900 4730065 4882774 5030506 5170155 5298768 5413075 5510530 5590177 5651348
58817 5651348 5691993 5709550 5703322 5674843 5625895 5557339 5470342 5367752 5253416 5130362 4999936
58806 4999936 4862439 4718343 4569312 4418342 4268710 4122466 3979987 3840977 3705639
58797 3705639 3574910 3449946 3331521 3219566 3113178 3011527 2914922 2824511 2740678 2662163
58787 2662163 2587150 2514912 2446014 2381240 2320759 2264142 2210754 2160230 2112847 2069260 2029633
58776 2029633 1993420 1960439 1931649 1908028 1888908 1872404 1857673 1845768 1837834 1833281 1830498 1828864
58764 1828864 1829372 1833496 1842022 1854703 1870341 1887394 1905152 1924334 1945960 1969985 1995925 2024721
58752 2024721 2058559 2098184 2141474 2185703 2230597 2278068 2329388 2384017 2441362 2502330 2568447
58741B568447P1808P7217Q2761Q9039R5714J02253J09064J16890J25265J32476
58731C570934J37546J41491J45899J50529J53308J52912J50347J47064J42360
58722D892390J33878J20495J03356Q3956O2736M0134J7499m377k6403m9361p1568
58711E302735r0208j04714j17149j28957j39024j45464j48004j47720j45550j42121
58701C993824j38188j34176j29656j24099j17938j12140j06980j01883r6303r0240
58691B842221q4102p8488p3760o9342o3843n6594m8821m2501l8163l4573l0521
58680B221513k6054k1745j7630j3417r255n763l381k094j643j836k682m236o215
58667B105562p807q266p724p077p027p552q434r746j1490j3197j4447j5509j7002
$$ plain form
58741 2568447 2640255 2717472 2800233 2889272 2984986 3087239 3196303 3313193 3438458 3570934
58731 3570934 3708480 3849971 3995870 4146399 4299707 4452619 4602966 4750030 4892390
58722 4892390 5026268 5146763 5250119 5334075 5396811 5436945 5454444 5450067 5423664 5374303 5302735
58711 5302735 5212527 5107813 4990664 4861707 4722683 4577219 4429215 4281495 4135945 3993824
58701 3993824 3855636 3721460 3591804 3467705 3349767 3237627 3130647 3028764 2932461 2842221
58691 2842221 2758119 2679631 2605871 2536529 2472686 2416092 2367271 2324770 2286607 2252034 2221513
58680 2221513 2195459 2173714 2156084 2142667 2133412 2127649 2124268 2122174 2120531 2118695 2116013 2111777 2105562
58667 2105562 2097755 2089489 2081765 2074688 2067661 2060109 2051675 2041929 2030439 2017242 2002795 1987286 1970284
58654A970284j9091k1548k4515k8549l3750l9369m4396m8293n0953n2435n2928
58643A554457n2616n1400m9117m6230m3708m1911m0014l7080l3243k9319k5749
58632A104070k2605k0222j8774j7363j4688j0752p073m856l801l077k605k766
58620I75488l485m260m837n367o114p142p987p583n257j913N62J413J682K457
58606I27657L484M191M961O258P438P527O569N039K635r75m670o649o521n355
58592I51589l902k304j288j923l859n507o452q045j0904j3386j3668j2060j0102
58579H58189q376o629n218m887n368n550m988m132l093j452M80J442R24L03J289
58564H12934L628N256M839L359K823L949N778P271Q448R832J1477J2998J4113
$$ plain form
58654 1970284 1951193 1929645 1905130 1876581 1842831 1803462 1759066 1710773 1659820 1607385 1554457
58643 1554457 1501841 1450441 1401324 1355094 1311386 1269475 1229461 1192381 1159138 1129819 1104070
58632 1104070 1081465 1061243 1042469 1025106 1010418 999666 992593 987737 983936 980859 978254 975488
58620 975488 972003 967743 962906 957539 951425 944283 936296 928713 923456 921543 922105 923518 925200 927657
58606 927657 931141 935332 940293 946551 953989 961516 968085 973124 975759 974784 970114 963465 956944 951589
58592 951589 947687 945383 944095 942172 938313 932806 926354 918309 907405 894019 880351 868291 858189
58579 858189 849813 843184 837966 833079 827711 822161 817173 813041 809948 808496 808976 810418 811342 811645 812934
58564 812934 816562 821818 826657 830016 832839 836788 842566 849837 858285 868117 879594 892592 906705
58551I06705J4734J4888J4972J5768J7695K0236K2515K4208K5588K6949K8522
58540A132780L0568L3130L5863L8436M0852M3122M5221M7534N0527N3547N4937
58529A606517N4202N2857N2135N0889M7196M1087L4033K6545J8386J0518M494
58518A998859j03n247j1191j5728j7256j6590j5099j3116j1137j0461j1318j2020
58506A859593j1302j0094r706r700r116q551r275j1044j2349j2411j1747j1256
58494A733042j1724j3747j7246k1454k5924l0784l5537l8700l9456l8630l7307
58483A422533l5642l3804l2548l1792l0053k6721k3429k1665k0523j8668j7102
58472A130586j7586j9293j9687j8252j6813j6330j5872j4983j4517j4458j3211
$$ plain form
58551 906705 921439 936327 951299 967067 984762 1004998 1027513 1051721 1077309 1104258 1132780
58540 1132780 1163348 1196478 1232341 1270777 1311629 1354751 1399972 1447506 1498033 1551580 1606517
58529 1606517 1660719 1713576 1765711 1816600 1863796 1904883 1938916 1965461 1983847 1994365 1998859
58518 1998859 1998756 1993509 1982318 1966590 1949334 1932744 1917645 1904529 1893392 1882931 1871613 1859593
58506 1859593 1848291 1838197 1828491 1818791 1809675 1801124 1791849 1780805 1768456 1756045 1744298 1733042
58494 1733042 1721318 1707571 1690325 1668871 1642947 1612163 1576626 1537926 1498470 1459840 1422533
58483 1422533 1386891 1353087 1320539 1288747 1258694 1231973 1208544 1186879 1166356 1147688 1130586
58472 1130586 1113000 1093707 1074020 1055768 1038955 1022625 1006753 991770 977253 962795 949584
58461I49584j0185p288o546p523q356q414q625r666j0864j0902r211o598m570
58448H40836l796l388k062K31K390L592L869L530K863K480K968M060M838M935
58434H67346M942N530O795Q511J0349J1681J1819J0843R885J0138J1641J3179
58422I82659J3545J2856J2282J2266J1646R313O149L962K696N24l110o446q250
58409A050092r707j2132j4519j5198j4564j4145j3954j2873j1108j0022r793r172
58397I02905p695o276n467m674l492k491k273k598k669j710M29K632L099J602
58383H71322L48J387L788M946M114L016L302M936O938Q267Q266P520P756R561
58369I45467J0987J0209Q654R150J1556J2912J1861J0154R287Q392O395M011K343
$$ plain form
58461 949584 939399 932111 925565 918042 909686 901272 892647 882981 872117 861215 852004 845406 840836
58448 840836 837040 833652 831590 831821 834211 837803 841672 845202 848065 850545 853513 857573 862411 867346
58434 867346 872288 877818 884613 893124 903473 915154 926973 937816 947701 957839 969480 982659
58422 982659 996204 1009060 1021342 1033608 1045254 1054567 1060716 1064678 1067374 1067898 1064788 1058342 1050092
58409 1050092 1040385 1028253 1013734 998536 983972 969827 955873 943000 931892 921870 912077 902905
58397 902905 895210 888934 883467 878793 875301 872810 870537 867939 865270 863560 863989 866621 869720 871322
58383 871322 871670 873057 876845 881791 885905 888921 892223 897159 904097 912364 920630 928150 935906 945467
58369 945467 956454 966663 975317 984467 996023 1008935 1020796 1030950 1040237 1048629 1055024 1059035 1061378
58356A061378J273L03m57j030j861k676k490j337l96K70K187N845R300J0664J0426
58341A091399J0070R894R591R697J0783J2032J2181J1411J0877J0630R320O069
58329A213954J804j594l070l165l096l271l071k174j291r27k59J666M231N998
58315A205735O680O868O387M816L352L956O266P494O153M071L790N527P739R345
58301A288179J0086R828Q767P890Q241R821J1612J2495J2201J1772J2806J5661
58289A419359J8745K0424K0900K1189K1186K0380J9746K0621K2052K1665J9262
58278A645529J7146J6406J5387J2793J0075R325J0518J2155J3368J4192J4846
58267A791740J5757J7431J9503K0801K0910K0815K1436K2496K3337K3985K4889
$$ plain form
58356 1061378 1062651 1062954 1062497 1061467 1059606 1056930 1054440 1053103 1052707 1052977 1055164 1061009 1070309 1080973 1091399
58341 1091399 1101469 1111363 1120954 1130651 1141434 1153466 1165647 1177058 1187935 1198565 1207885 1213954
58329 1213954 1215758 1214164 1211094 1207929 1204833 1201562 1198491 1196317 1195026 1194099 1193840 1195506 1199737 1205735
58315 1205735 1212415 1219283 1225670 1230486 1233838 1237794 1244060 1251554 1257707 1261778 1265568 1271095 1278834 1288179
58301 1288179 1298265 1308093 1316860 1324750 1332991 1342812 1354424 1366919 1379120 1390892 1403698 1419359
58289 1419359 1438104 1458528 1479428 1500617 1521803 1542183 1561929 1582550 1604602 1626267 1645529
58278 1645529 1662675 1679081 1694468 1707261 1717336 1726661 1737179 1749334 1762702 1776894 1791740
58267 1791740 1807497 1824928 1844431 1865232 1886142 1906957 1928393 1950889 1974226 1998211 2023100
58256B023100K6203K7674K8839K9490L0388L2772L6347L8747L8335L6536L5856
58245B384287L6512L6956L6789L6866L7101L6646L5858L5809L6201L6031L5860
58234B784916L7060L9261M1070M2638M4976M7373M8431M8973N0833N3406N4800
58223C293737N5729N8548O2892O6273O8650P2083P6104P8136P8722Q1361Q6470
58212D078705R0586R2732R6404J03468J10930J15951J19691J23973J28223J31917
58202E192580J36171J40875J44021J45703J48831J54298J59645J64210J70989
58193F557323J81371J92661K02984K14033K26685K38776K49757K62690K78824
58184H605104K94993L09253L24224L41969L60617L79276M01048M27638M55904
$$ plain form
58256 2023100 2049303 2076977 2105816 2135306 2165694 2198466 2234813 2273560 2311895 2348431 2384287
58245 2384287 2420799 2457755 2494544 2531410 2568511 2605157 2641015 2676824 2713025 2749056 2784916
58234 2784916 2821976 2861237 2902307 2944945 2989921 3037294 3085725 3134698 3185531 3238937 3293737
58223 3293737 3349466 3408014 3470906 3537179 3605829 3677912 3754016 3832152 3910874 3992235 4078705
58212 4078705 4169291 4262023 4358427 4461895 4572825 4688776 4808467 4932440 5060663 5192580
58202 5192580 5328751 5469626 5613647 5759350 5908181 6062479 6222124 6386334 6557323
58193 6557323 6738694 6931355 7134339 7348372 7575057 7813833 8063590 8326280 8605104
58184 8605104 8900097 9209350 9533574 9875543 10236160 10615436 11016484 11444122 11900026
58175A1900026M83513N13079N46925N82686O18024O54904O95248P37366P80677
58166A7512448Q29032Q85074R45978J008908J075897J149456J228234J310918
58158B5945945J399376J494487J594324J699792J816354J947322K092139K253912
58150D0243651K440553K654976K892748L153038L442732L766522M124439M524792
58142F7243451M989071N539514O194082O978350P927045R065233J0398707J1924084
58134A30259537J3629241J5481672J7445610J9524649K1763648K4189992K6744613
58127B69038962K9192558L0949167L0950376K7920211K1140804J1193351p3587
58120D20311842j0440658j8351542k3326869k5699584k6142065k5348080k3889646
$$ plain form
58175 11900026 12383539 12896618 13443543 14026229 14644253 15299157 15994405 16731771 17512448
58166 17512448 18341480 19226554 20172532 21181440 22257337 23406793 24635027 25945945
58158 25945945 27345321 28839808 30434132 32133924 33950278 35897600 37989739 40243651
58150 40243651 42684204 45339180 48231928 51384966 54827698 58594220 62718659 67243451
58142 67243451 72232522 77772036 83966118 90944468 98871513 107936746 118335453 130259537
58134 130259537 143888778 159370450 176816060 196340709 218104357 242294349 269038962
58127 269038962 298231520 329180687 360131063 388051274 409192078 420385429 420311842
58120 420311842 409871184 391519642 368192773 342493189 316351124 291003044 267113398
58113B67113398k2160282k0383284j8668050j7059527j5559985j4151241j2822402
58106A46308627j1576636j0418558r350020q374397p490710o686250n945392n259516
58098H1207148m618692m003353l396119k793417k197931j612923j048918n11315
58090F1024480L2131O44494J360626K157052K980976L736398M186797L952756
58082H0075710K763185P70200j450948l276024m406140m906390m989554m838445
58074E9741594m576435m285623m002988l728237l455953l188952k924797k655087
58066C0923522k383384k126206j893622j683797j497010j339539j211619j104866
58058A7683479j013572r37789q74852q18533p67014p21932o79668o33162n82380
$$ plain form
58113 267113398 244953116 224569832 205901782 188842255 173282270 159131029 146308627
58106 146308627 134731991 124313433 114963413 106589016 99098306 92412056 86466664 81207148
58098 81207148 76588456 72585103 69188984 66395567 64197636 62584713 61535795 61024480
58090 61024480 61056611 61701105 63061731 65218783 68199759 71936157 76122954 80075710
58082 80075710 82838895 83609095 82158147 78882123 74475983 69569593 64580039 59741594
58074 59741594 55165159 50879536 46876548 43148311 39692358 36503406 33578609 30923522
58066 30923522 28540138 26413932 24520310 22836513 21339503 19999964 18788345 17683479
58058 17683479 16669907 15732118 14857266 14038733 13271719 12549787 11870119 11236957 10654577
58049A0654577n34209m92037m53557m18086l87732l61875l38412l19887l10466
58040G038316l07271l02325k92743k81873k70994k57565k41584k26259k11892
58031D645810j95757j78418j63733j52267j40778j28707j19205j13219j08229
58022C345497j03441j00734r9858r7899r4242r1233q9310q6109q1055p6357p2906
58011B352353o9366o5689o3352o1790n8725n4388n1512n0757n0006m8296m6688
58000A731784m5114m2329l9129l7802l8102l7527l5672l4461l3888l1675k7663
57989A328422k4629k3733k2898k0718j8607j7943j7932j7480j6638j5417j3520
57978A118907j1804j1649j2544j2662j2004j2468j4580j6635j7414j7433j7245
$$ plain form
58049 10654577 10120368 9628331 9174774 8756688 8368956 8007081 7668669 7348782 7038316
58040 7038316 6731045 6428720 6135977 5854104 5583110 5325545 5083961 4857702 4645810
58031 4645810 4450053 4271635 4107902 3955635 3814857 3686150 3566945 3453726 3345497
58022 3345497 3242056 3141322 3041464 2943565 2849323 2758090 2668780 2582671 2501616 2425259 2352353
58011 2352353 2282987 2217298 2153946 2092156 2033431 1979043 1927531 1876774 1826768 1778472 1731784
58000 1731784 1686670 1644341 1605212 1567410 1529308 1491781 1456109 1421648 1387760 1356085 1328422
57989 1328422 1303793 1280060 1257162 1236444 1217837 1199894 1181962 1164482 1147844 1132427 1118907
57978 1118907 1107103 1095454 1082910 1070248 1058244 1045776 1031196 1014561 997147 979714 962469
57967I62469j6755j6359j6648j6913j6011j4443j3574j3235j2413j1626j2056
57956H02436j2866j2070r764p853o966o270n759n878n482l275q52r93l135l910
57942G17363k192r6J167K898N704P982Q624Q382P917P066O518P369Q563P721N001
57927G99987L082K688J580j099k957k430j574k641m497m693l157j680j214j527
57913G79868k424l776n010n625n498m423k403n01%n33o71m34j330l688n942p116
57897G30494q005r300j0393j0712j0597j0290r614q900q629q097o330m202l483
57884F21942l782l076j342q25k036k583r02J677L712N527O909O059L023J343L721
57869F39367Q075J0482J0221R342Q803P930O851O524O542N242K228q75k441k514
$$ plain form
57967 962469 945714 929355 912707 895794 879783 865340 851766 838531 826118 814492 802436
57956 802436 789570 777500 767736 759883 752917 746647 740888 735010 729528 726253 725401 724408 721273 717363
57942 717363 715171 715075 716242 719140 724844 732826 741450 749832 757749 764815 771333 778702 787265 794986 799987
57927 799987 803069 805757 807337 806238 803281 800851 799277 796636 792139 787446 784289 782609 781395 779868
57913 779868 777444 773668 768658 763033 757535 753112 750709 750208 750208 749675 749004 748570 747240 743552 737610 730494
57897 730494 722489 713189 702796 692084 681487 671197 661583 652683 644054 635957 629627 625425 621942
57884 621942 618160 615084 613742 612917 610881 608298 607396 609073 612785 618312 625221 631280 634303 635646 639367
57869 639367 647442 657924 668145 677487 686290 694220 701071 707595 714137 719379 721607 720732 718291 715777
57855G15777k438l650o554r876j1720j1812j2009j3785j6189j7338j6967j6267
57843E77172j5883j5474j4757j3776j2381j0568r028q432q322p737o651n860n547
57830D42756m902l376j452J14J290K558L989N018N176M772M492M544M614M598
57816D74191M658M584L851K653J749J011p42l609n746n792m882m752n042m439
57802D57693l399l555m858n625n105l850j792J536M830N750M378L565N034P297
57788D61899Q405Q590R014R564R354Q106O047L494J283L73M08j29j732l307m256
57773E17113n436p234q421q010o863o214n874m991l559k157j085n87r81j793j767
57758D52141m75J027J770K041K401K636K342J680R04L7p24j253k231m284o385
$$ plain form
57855 715777 713339 709689 703135 693259 681539 669727 657718 643933 627744 610406 593439 577172
57843 577172 561289 545815 531058 517282 504901 494333 485305 476873 468551 460814 454163 448303 442756
57830 442756 437854 434478 433026 433140 434430 436988 440977 445995 451171 455943 460435 464979 469593 474191
57816 474191 478849 483433 487284 489937 491686 492697 491955 488346 482600 476808 471926 467174 462132 457693
57802 457693 454294 450739 445881 440256 435151 431301 429509 431045 435875 441625 446003 449568 454602 461899
57788 461899 470304 478894 487908 497472 506826 514932 520979 524473 525756 526129 526537 526408 524676 521369 517113
57773 517113 511677 504443 496022 488012 481149 474935 469061 464070 460511 458354 457269 456682 455701 453908 452141
57758 452141 451666 452693 454463 456504 458905 461541 463883 465563 466467 466504 465780 464527 462296 458012 451627
57743D51627o684n126l555l019k931l102m166n354m465j343J099R12K5J240M253
57728D19411O785Q082Q994R682R346P660M898J336k182m006l413j703m21N07J711
57713D66687K811L286L712M643N454N747O468P953Q300N757J606j468k950m249
57699E13757n783o676o933p590q708r313r365r782j0365r575o861l691j792j503
57685D15820k168k990l207k425j182n00o70r64n43P58K391L500L596L161L086
57670D17663L410L461L335M035N674O942O984O441N863M802L521L746O203R035
57656D91115J0296J0485J0821J0711R206P514P460Q510Q926R016J0543J3478J6163
57643F24244J8413K1545K5486K8599L0744L3620L7603M0922M2920M5398M9259
$$ plain form
57743 451627 444943 439817 436262 433243 430312 427210 423044 417690 413225 411882 412981 413893 413918 415158 419411
57728 419411 426196 434278 443272 452954 462300 469960 474858 476194 474012 470006 466593 464890 464469 464976 466687
57713 466687 469498 472784 476496 481139 486593 492340 498808 506761 515061 520818 522424 520956 518006 513757
57699 513757 507974 501298 494365 486775 478067 468754 459389 449607 439242 429667 422806 419115 417323 415820
57685 415820 413652 410662 407455 405030 403848 403348 402678 401714 401171 401929 404320 407820 411416 414577 417663
57670 417663 421073 424534 427869 431904 437578 444520 451504 457945 463808 468610 472131 475877 482080 491115
57656 491115 501411 511896 522717 533428 542634 550148 557608 566118 575044 584060 594603 608081 624244
57643 624244 642657 664202 689688 718287 749031 782651 820254 861176 904096 949494 998753
57632I98753N1773M8907L9300K4875Q898n633j6795k4304k8879l0781k9846k6955
57620A009313k4081k2138j9977j6056j0195l170M272J1386J7505K2978K9304L7686
57608A036827M7853N8619O9160P9608R0760J02778J13107J16052J06087Q2463
57598A903314N0167J6512j2487l3271m4796m8646m8057m5862m3515m1789m1095
57587A610475m1007m0652m0186m0781m2778m4864m5537m4514m2337l9570l6912
57576A151337l5275l5013l5465l5525l4340l1623k8015k4938k3198k1869j9545
57565H26531j6468j4172j3165j2483j1631j1281j1463j0587p343k731O89J180
57553G17076p63k840k675J08L464N203N413N740O862Q187R611J1628J3746J4823
$$ plain form
57632 998753 1050526 1099433 1138733 1163608 1172506 1166873 1150078 1125774 1096895 1066114 1036268 1009313
57620 1009313 985232 963094 943117 927061 916866 913696 917968 929354 946859 969837 999141 1036827
57608 1036827 1084680 1143299 1212459 1292067 1382827 1485605 1598712 1714764 1820851 1903314
57598 1903314 1953481 1969993 1957506 1924235 1879439 1830793 1782736 1736874 1693359 1651570 1610475
57587 1610475 1569468 1528816 1488630 1447849 1405071 1360207 1314670 1270156 1227819 1188249 1151337
57576 1151337 1116062 1081049 1045584 1010059 975719 944096 916081 891143 867945 846076 826531
57565 826531 810063 795891 782726 770243 758612 747331 735868 725281 717938 715207 715896 717076
57553 717076 716313 713473 710798 710906 714370 719573 724986 730726 737588 745775 755386 767014 780760 795583
57539G95583J5289J6928J9831K1676K1061J9534J9202K0020K0764K0909J9977
57528A010774J6695J0632L645k116o695j1312j5925j9541k2265k5072k7921k9769
57516H81130l0162k9547k8314k6952k6556k7606k8624k7765k5423k3505k2342
57505E84334k0376j7184j4625j4098j4498j4094j2946j2092j1348r683p239n459
57493D30692n092n342n240m804m342l503j925l59j74j474k562j778N11K380K649
57478C99637J974J601J855K318K875L793M882N393M950M115L624L414K842J856
57464D45129J433K569N022P453Q712Q619P577O006M462L763M337N619O643P219
57450E24563Q049R681J1692J3002J2872J1659J0731J1405J3688J6250J7846J8403
$$ plain form
57539 795583 810872 827800 847631 869307 890368 909902 929104 949124 969888 990797 1010774
57528 1010774 1027469 1038101 1041746 1039630 1032935 1021623 1005698 986157 963892 938820 910899 881130
57516 881130 850968 821421 793107 766155 739599 711993 683369 655604 630181 606676 584334
57505 584334 563958 546774 532149 518051 503553 489459 476513 464421 453073 443390 436151 430692
57493 430692 425600 420258 415018 410214 405872 402369 400444 400085 399911 398437 395875 394097 394608 396988 399637
57478 399637 401611 403212 405067 407385 410260 414053 418935 424328 429278 433393 437017 440431 443273 445129
57464 445129 446562 449131 454153 461606 470318 478937 486514 492520 496982 500745 505082 510701 517344 524563
57450 524563 532612 542293 553985 566987 579859 591518 602249 613654 627342 643592 661438 679841
57438F79841J8438J8011J6826J4989J2781J0025O497K665p98m067p757j1577j4568
57425G41306j6766j9269k2198k3885k3099k1122k0301k0872k0659j8061j4269
57414E20805j1727j1134j1018j0153r159r074r327q362o015l803k682j873n01
57401D25977Q85J400J291J257J237J106J692L622N851O867O990P780R434J0571
57387D85960J0646J0848J2107J3712J4594J4834J5235J6192J7441J8309J8073
57376F47951J6680J5138J4356J3805J2177R065N001K82m881r480j2618j5037j8008
57363F74431k0895k1801k0652j9493j9448j9659j9679k0407k1601k0960j7337
57352D52499j2981j0863j1182j2032j2161j1519j0320r140q893r376q922o789
$$ plain form
57438 679841 698279 716290 733116 748105 760886 770911 777408 780073 779275 775208 767451 755874 741306
57425 741306 724540 705271 683073 659188 636089 614967 594666 573794 553135 535074 520805
57414 520805 509078 497944 486926 476773 467614 458540 449213 440851 434836 431033 428351 426478 425977
57401 425977 426862 428262 429553 430810 432047 433153 434845 438467 444318 451185 458175 465955 475389 485960
57387 485960 496606 507454 519561 533273 547867 562701 577936 594128 611569 629878 647951
57376 647951 664631 679769 694125 707930 720107 729172 734173 734455 729574 720094 707476 692439 674431
57363 674431 653536 631735 611083 591590 572142 552483 532804 512397 490796 469836 452499
57352 452499 439518 428655 417473 405441 393280 381761 371441 362301 353408 344032 335110 328321
57340C28321m599l990m194l583k356j790j869j603j019r46j368j708k147k971
57326B94178l201j785L72J360R28L33J2n87j062j57J929L314K987J940J292R46
57310C02799O42Q12J537J916J340M24O8L15P20J078J237Q32k60j575k502k743
57294C06640k364j749j347j046j44J450K495J942P24Q26K641M568N294N184N222
57279C30336N796O966Q795J0860J2273J2614J2296J1780J1316J1407J2426J3475
57267D60340J2854J0362P955P333P749P289N614M312M747O665Q900J0679J1909
57254E66708J2679J2947J2583J1607J0351R455R557J0773J2323J2883J1703R555
57242G03124Q182Q646J0490J2668J4641J6205J6941J6648J5961J5743J5898J5568
$$ plain form
57340 328321 323722 319732 315538 311955 309599 307809 305940 304337 303318 302372 301004 299296 297149 294178
57326 294178 290977 289192 289564 290924 291852 292185 292197 291610 290548 290391 292320 295634 298621 300561 301853 302799
57310 302799 303441 304253 305790 307706 309046 309470 309538 309853 310573 311651 312888 313720 313460 311885 309383 306640
57294 306640 304276 302527 301180 300134 299990 301440 303935 305877 306601 307427 310068 314636 319930 325114 330336
57279 330336 336132 343098 351893 362753 375026 387640 399936 411716 423032 434439 446865 460340
57267 460340 473194 483556 491511 498844 506593 513882 519496 523808 528555 535220 544120 554799 566708
57254 566708 579387 592334 604917 616524 626875 636330 645887 656660 668983 681866 693569 703124
57242 703124 711306 719952 730442 743110 757751 773956 790897 807545 823506 839249 855147 870715
57230H70715J4421J3120J2501J2801J3786J5130J6560J7879J8944J9490J9245
57219A044592J8471J7992J8342J9174J9782J9726J8682J6421J3526J1431J0910
57208A229049J1079J0735J0115J0218J0898J0892R653P945O582N573M681L966
57196A331386L586L643M251N210N851N902O266Q052J0999J3675J5164J5783J6327
57183A446095J7353J8890K0189K0161J8969J8505K0173K2737K3812K3014K2047
57172A671945K2073K2776K3980K6103K8729L0566L1405L2407L3941L4911L5006
57161A993842L5761L8316M1608M4048M5607M6955M7847M7889M7937M9193N1423
57150B490426N3427N4645N5106N4441N2436N0310M9918N1582N3753N4835N4532
$$ plain form
57230 870715 885136 898256 910757 923558 937344 952474 969034 986913 1005857 1025347 1044592
57219 1044592 1063063 1081055 1099397 1118571 1138353 1158079 1176761 1193182 1206708 1218139 1229049
57208 1229049 1240128 1250863 1260978 1271196 1282094 1292986 1302639 1310584 1317166 1322739 1327420 1331386
57196 1331386 1334972 1338615 1342866 1348076 1353927 1359829 1366095 1374147 1385146 1398821 1413985 1429768 1446095
57183 1446095 1463448 1482338 1502527 1522688 1541657 1560162 1580335 1603072 1626884 1649898 1671945
57172 1671945 1694018 1716794 1740774 1766877 1795606 1826172 1857577 1889984 1923925 1958836 1993842
57161 1993842 2029603 2067919 2109527 2153575 2199182 2246137 2293984 2341873 2389810 2439003 2490426
57150 2490426 2543853 2598498 2653604 2708045 2760481 2810791 2860709 2912291 2966044 3020879 3075411
57139C075411N3410N2173N1445N1378N1238N0148M8477M7852M9276N1625N2591
57128C635024N1022M8121M6154M6236M7581M8780M9144M8574M6948M4568M2718
57117D154870M2611M3810M4743M4783M4728M5083M5251M4870M4622M4903M4848
57106D645122M3619M1737M0051L8167L5127L1105K7230K3919K0586J6938J3663
57095D977264J1613J0928J1035J1089J0424R040P708P387Q545J0934J3671J5332
57083E104970J4666J1489O438l36r415k0660l2349m2535n0813n7969o4430o9799
57071D789257p3709p6454p8923q2214q6946r2828r9446j07656j19138j34054j50337
57060C687552j66216j82428k00691k20975k41936k63573k87816l16467l49968
$$ plain form
57139 3075411 3128821 3180994 3232439 3283817 3335055 3385203 3433680 3481532 3530808 3582433 3635024
57128 3635024 3686046 3734167 3780321 3826557 3874138 3922918 3972062 4020636 4067584 4112152 4154870
57117 4154870 4197481 4241291 4286034 4330817 4375545 4420628 4465879 4510749 4555371 4600274 4645122
57106 4645122 4688741 4730478 4770529 4808696 4843823 4874928 4902158 4926077 4946663 4963601 4977264
57095 4977264 4988877 4999805 5010840 5021929 5032353 5041393 5049101 5056488 5065033 5075967 5089638 5104970
57083 5104970 5119636 5131125 5137563 5137227 5127812 5107152 5074803 5032268 4981455 4923486 4859056 4789257
57071 4789257 4715548 4639094 4560171 4477957 4391011 4298183 4198737 4091081 3971943 3837889 3687552
57060 3687552 3521336 3338908 3138217 2917242 2675306 2411733 2123917 1807450 1457482
57051A457482l88184m31126A59640c70217n85006o44456p08832p78955q55948
57042c943414r40156j030258j124739j224228j331397j449022j579941j728969
57034a4352124j903040k108741k350842k632886k956051l314819l694044m071708
57026c7384255m426273m744977n029446n291904n535481n725538n775078n563437
57018g9476389m981668l978730k587278r23269Q38987K511221L939459N033115
57010g9624552N763963O147193O224645O056774N716272N278097M809035M360929
57002c5267644L967327L642432L383179L174537K995976K827346K653785K468281
56994a0154781K270512K063570J852259J643486h79514C84939J102821R60033
$$ plain form
57051 1457482 1069298 638172 159640 -370217 -955223 -1599679 -2308511 -3087466 -3943414
57042 -3943414 -4883570 -5913828 -7038567 -8262795 -9594192 -11043214 -12623155 -14352124
57034 -14352124 -16255164 -18363905 -20714747 -23347633 -26303684 -29618503 -33312547 -37384255
57026 -37384255 -41810528 -46555505 -51584951 -56876855 -62412336 -68137874 -73912952 -79476389
57018 -79476389 -84458057 -88436787 -91024065 -91947334 -91108347 -88597126 -84657667 -79624552
57010 -79624552 -73860589 -67713396 -61488751 -55431977 -49715705 -44437608 -39628573 -35267644
57002 -35267644 -31300317 -27657885 -24274706 -21100169 -18104193 -15276847 -12623062 -10154781
56994 -10154781 -7884269 -5820699 -3968440 -2324954 -879514 384939 1487760 2447793
56986B447793Q35395P28562O38500N62945M98864M43104L93178L48087L07897
56977G204325K72102K39078K07653J78331J51942J27869J04802Q2763O3109M6595
56967H678569L2605K0285R166j527j2978k5516l8036m9362n9615o9708p9866q9343
56955H314674r7473j04385j10291j14596j16269j15344j13469j12458j12658j13252
56945G204479j13762j14382j15002j15110j14576j13476j11249j07411j02802
56936F196709r7923q9947p4218m9387j7843J9671O3609J04161J14877O8451l6465
56925F201695j67938k83097l56368l87178l88137l72157l48284l22106k96428
56916C280002k72356k50415k30249k10350j89807j69810j52139j36803j22618
$$ plain form
56986 2447793 3283188 4011750 4650250 5213195 5712059 6155163 6548341 6896428 7204325
56977 7204325 7476427 7715505 7923158 8101489 8253431 8381300 8486102 8568865 8631974 8678569
56967 8678569 8711174 8731459 8740625 8739098 8726120 8700604 8662568 8613206 8553591 8483883 8404017 8314674
56955 8314674 8217201 8112816 8002525 7887929 7771660 7656316 7542847 7430389 7317731 7204479
56945 7204479 7090717 6976335 6861333 6746223 6631647 6518171 6406922 6299511 6196709
56936 6196709 6098786 6008839 5934621 5885234 5867391 5887062 5950671 6054832 6169709 6238160 6201695
56925 6201695 6033757 5750660 5394292 5007114 4618977 4246820 3898536 3576430 3280002
56916 3280002 3007646 2757231 2526982 2316632 2126825 1957015 1804876 1668073 1545455
56907A545455j09348r7756q8005p9735p3216o8656o4544n8508n0064m1132l3695
56896G80796k8302k5100k4700k7106l0663l3049l3141l1653l0061k9089k8091
56885D59841k5981k2671j9157j6125j3238j0233p783o399n266l149n2L029N657
56872C38473Q355J1505J4672J6774J6432J2572N503k868j0462j6315k0091k1362
56860C53188k0427j8917j8254j7974j6877j5145j3818j2713j0789q525p813r049
56848A82887j0054q756n599k463l78Q24J486J832K174K686L341M388O281Q782
56834A87431J0803J1705J2136J2968J4065J4772J5208J6225J8141K0168K1114
56823C54736K0302J7808J4073R477M353o62m569o732p584q104q551q255o771m594
$$ plain form
56907 1545455 1436107 1338351 1250346 1170611 1097395 1028739 964195 905687 855623 814491 780796
56896 780796 752494 727394 702694 675588 644925 611876 578735 547082 517021 487932 459841
56885 459841 433860 411189 392032 375907 362669 352436 344653 338254 332988 329839 329787 332816 338473
56872 338473 346828 358333 373005 389779 406211 418783 424286 421418 410956 394641 374550 353188
56860 353188 332761 313844 295590 277616 260739 245594 231776 219063 208274 199749 191936 182887
56848 182887 172833 164077 158478 156015 155637 156461 157947 159779 161953 164639 167980 172368 178649 187431
56834 187431 198234 209939 222075 235043 249108 263880 279088 295313 313454 333622 354736
56823 354736 375038 392846 406919 416396 420749 420087 415518 408786 401202 393098 384547 376292 369521 364927
56809C64927k377M2L237P142J1039J4520J7801K1042K3973K6558K9371L2466L4092
56796E83833L1559K3994J3571L555m344j0135j3842j5124j4406j2986j1529r377
56784E64769n821j201L699Q527J3207J7708K2501K8359L5053M1058M5219M7802
56772H20880M9106M7788M1709L0130J4397k868j8636l0328l7019l9595l9242l6464
56760G99858l2054k7691k4358k1109j6816j2165q373m795K19O551J2521J7700
56748F89488K3301K9327L3260L2447K6458J6574M523p572j7397k3933k8059l0931
56736G47486l2488l2216l0512k8421k6400k4070k0947j6968j2623q761n941l727
56724E04412j164K002N024P242Q780R789R468O505N33o961j3383j7090j8763k0356
$$ plain form
56809 364927 362550 362592 365829 372971 384010 398530 416331 437373 461346 487904 517275 549741 583833
56796 583833 615392 639386 652957 656512 652168 642033 628191 613067 598661 585675 574146 564769
56784 564769 558948 557747 561446 569973 583180 600888 623389 651748 686801 727859 773078 820880
56772 820880 869986 917774 959483 989613 1004010 1001142 982506 952178 915159 875564 836322 799858
56760 799858 767804 740113 715755 694646 677830 665665 657292 652497 652716 659267 671788 689488
56748 689488 712789 742116 775376 807823 834281 850855 855378 847806 830409 806476 778417 747486
56736 747486 714998 682782 652270 623849 597449 573379 552432 535464 522841 514080 508139 504412
56724 504412 503248 505250 510274 517516 526296 536085 545553 552058 552591 545630 532247 515157 496394 476038
56710D76038k2521k3920k3386k1755k0552j9858j8711j6983j5315j3711j1803
56699B67523j0300j0378j1563j1892j0528q694p613p028o271n496n089n001n224
56686A62446n923o614o379n322m609m546l953k233o58n66j395j717j366j289j833
56671A14043k405k559k526k630k874k978k583j649p96p81j470j921j704j290j034
56656H4843o32o2o1r42j817j766j127q03q35n93k1J80l81j144j167q4J533K676
56638G7797K824K324J737J200Q18J123K340L520L456K247J062M99L06N10J398
56623A03161K446K741K643L420M894N188L432J158O7q6l22o22m64q3J44O85J901
56606A30303K820K274P69j8M82J037K16j846l440k862k76K061K033O4j498j228
$$ plain form
56710 476038 453517 429597 406211 384456 363904 344046 325335 308352 293037 279326 267523
56699 267523 257223 246845 235282 223390 212862 204168 196555 189527 183256 177760 172671 167670 162446
56686 162446 156523 149909 143530 138208 133599 129053 125100 122867 122209 121643 120248 118531 117165 115876 114043
56671 114043 111638 109079 106553 103923 101049 98071 95488 93839 93043 92262 90792 88871 87167 85877 84843
56656 84843 84211 84149 84088 83146 81329 79563 78436 77633 76798 76205 76184 76364 75983 74839 73672 73588 75121 77797
56638 77797 80621 82945 84682 85882 86700 87823 90163 93683 97139 99386 100448 100947 101253 101763 103161
56623 103161 105607 108348 110991 114411 119305 124493 127925 129083 129150 129064 128742 128120 127656 127573 127717 128402 130303
56606 130303 133123 135397 136166 136148 136630 137667 137883 136037 132597 129735 129459 131520 133553 133617 132119 130891
56590A30891K91K054L690M610L999K364J490J837J639l14k572l101k058q95qJ060
56574A44977K020K307K369K778K764J352m99q07O32J948J750N68l47m38R3O35
56558A62102O27K56M77J670K889L231L224L715M187L554K072Q37j21j590l146
56543A83984l185j294Q87J715J308Q17Q47J217J528J449P92k89j270j602j097
56528A85807j41N38P09J228K958N118N761M307K443J865K247K389K156K232K813
56513B22430L722M972O120O054M635L642M605O555P459P158P209Q293R567J0399
56499C12820J1038J1541J1440J0703R960R699R916J0418J0761J0408R580R372
56487D37656J0260J1356J1861J2102J2199J1138Q539N845M156K324q05l848n018
$$ plain form
56590 130891 131182 133236 136926 141536 145535 147899 149389 151226 152865 152551 149979 146878 144820 143925 143917 144977
56574 144977 146997 149304 151673 154451 157215 158567 158068 157261 157893 159841 161591 162159 161812 161374 161467 162102
56558 162102 162729 162985 163462 165132 168021 171252 174476 178191 182378 185932 188004 188841 188720 187130 183984
56543 183984 180799 179505 180392 182107 183415 184232 185079 186296 187824 189273 190065 189776 188506 186904 185807
56528 185807 185666 186204 186913 188141 191099 196217 201978 206285 208728 210593 212840 215229 217385 219617 222430
56513 222430 226152 231124 237244 243298 247933 251575 256180 262735 270194 277352 284561 292854 302421 312820
56499 312820 323858 335399 346839 357542 367502 377201 387117 397535 408296 418704 428284 437656
56487 437656 447916 459272 471133 483235 495434 506572 515111 520956 525112 527436 526631 522783 517765
56474E17765n434p475j0665j2337j1885j1404j2157j3292j4125j4797j4503j2094
56462C77597q821p527q453q766p135n731o377p560p064n249l879l483l611m168
56448B89773m946n204m969n305o281o221m253j959j169j533j567p36P50K662M044
56433B53086L275K86k653l683l486l322k763j169K28J3o98L75L100M931M349K478
56417B54347J183J164K118L493M633M921M170K632R21Q2R13K801L940L354J925
56402B92597R46P21J197K717N034O715O762O059O005O528O597N990N332M967M918
56387C63085N405O307O684N833M303K979J882P96K13M18N02l68j350r84O58K212
56371C98575K908K803J700n77k941l759k967k245k825m211n308n782n916n906
$$ plain form
56474 517765 512331 504856 494191 481854 469969 458565 446408 433116 418991 404194 389691 377597
56462 377597 368776 361249 352796 344030 336895 331164 324787 317227 310163 304914 301035 297552 293941 289773
56448 289773 284827 279623 274654 269349 263068 256847 252594 250635 249466 247933 246366 245630 246380 249042 253086
56433 253086 256361 256647 253994 250311 246825 243503 240740 239571 239799 239812 239114 239489 242589 247520 251869 254347
56417 254347 255530 256694 258812 262305 266938 271859 276029 278661 279582 279664 280577 283378 287318 290672 292597
56402 292597 293543 294264 295461 298178 303212 309927 316689 322748 328753 335281 341878 347868 353200 358167 363085
56387 363085 368490 374797 381481 387314 391617 394596 396478 397274 397487 397905 398407 398039 396689 395705 396363 398575
56371 398575 401483 404286 405986 405409 402468 398709 395742 393497 390672 386461 381153 375371 369455 363549
56357C63549n726n391n121n250n734n772m574k663j496j463j365n55k42j537l423
56342C13237m137l634l011k339r98K69r5j808k570j087J370L044L792M231M062
56327C10326K619M85o48J83K073L217K700J135l31j186j433q55O57K092J939K75
56311C23248r00k26J161J365L26m99l42M44J536K750L281K375P70J28Q22J500
56295C37739J006k63j162j027J48J883L294L661L140K420J719Q11j24m71m1P30
56279C53463J532K340K923K930K595K547K845K829K200J506J408J992L010M249
56265C88369N434O175O276N943N563N378N348N266N106N068N045M255K285L35
56251D55846K40J879K926J906K05j21P04J003N39O48J795K832K846K170J322K75
$$ plain form
56357 363549 357823 352432 347311 342061 336327 330555 325981 323318 321822 320359 318994 318439 318197 316660 313237
56342 313237 309100 305466 302455 300116 299118 299387 299292 297484 294914 293827 295197 298241 302033 306264 310326
56327 310326 312945 313430 312782 312965 315038 318255 320955 322090 321759 320573 319140 318285 318942 321034 322973 323248
56311 323248 322348 322122 323283 324648 324974 324475 324133 324577 326113 328863 332144 334519 335289 335417 336239 337739
56295 337739 338745 338482 337320 336293 336441 338324 341618 345279 348419 350839 352558 353369 353245 352774 352733 353463
56279 353463 354995 357335 360258 363188 365783 368330 371175 374004 376204 377710 379118 381110 384120 388369
56265 388369 393803 399978 406254 412197 417760 423138 428486 433752 438858 443926 448971 453226 455511 455846
56251 455846 456086 457965 460891 462797 463002 462881 463585 464588 465127 465775 467570 470402 473248 475418 476740 477015
56235D77015o66n52R21K618L151K531K100K889M279M432K358n35j680l53J581
56220E00089K359K469L080L770L548L212M435O846Q154P482O499O709P430P367
56206E73449O707O524P080P793Q234Q387Q324Q304Q757R753J0915J1989J3077
56193F89293J4066J4603J4863J5611J7112J8581J9177J9001J8643J8239J7399
56182H76588J5820J3584J1087Q892P436O687O270N877N291M266K796J452R43J272
56168I68261J676J334j02k464n028o702o891o150n629n870o532p055p153o804
56154I04891o261n975o093o203n846n026l938k685j650j438j854j627m9J613J470
56139H59329n36k504k867j903r33p96j252j465r02P8P59J068J481J921J798J375
$$ plain form
56235 477015 476349 475797 476718 479336 482487 485018 487118 490007 494286 498718 501076 500541 498861 498508 500089
56220 500089 502448 504917 507997 511767 515315 518527 522962 529808 537962 545444 551943 558652 566082 573449
56206 573449 580156 586680 593760 601553 609787 618174 626498 634802 643559 653312 664227 676216 689293
56193 689293 703359 717962 732825 748436 765548 784129 803306 822307 840950 859189 876588
56182 876588 892408 905992 917079 925971 933407 940094 946364 952241 957532 961798 964594 966046 966989 968261
56168 968261 969937 971271 971169 968705 963677 956975 950084 943934 938305 932435 925903 918848 911695 904891
56154 904891 898630 892655 886562 880359 874513 869487 865549 862864 861214 859776 857922 856295 856246 857859 859329
56139 859329 858793 856289 853422 851519 850586 849790 848538 847073 846171 846249 847008 848076 849557 851478 853276 854651
56123H54651J706K619K413O45l95J323M445O122N947N850O718P578P942Q545R501
56108I25610R820R325R225J0184J1311J1743J1930J2816J4646J6917J8564J8357
56096A080448J6383J4912J6338K0200K3752K5529K6615K8212K9877L0905L1815
56085A344986L3466L5862L8682M2094M6416N1788N8490O6647P5411Q3545R1140
56074A968527R9708J10348J22893J37123J53495J72205J92554K13416K33098K48395
56064C651762K55363K51894K38910K18883J94494J69214J47422J32233J23051
56055E383226J15697J04944Q7429O3356L6014R439j3530l1234m2946n0354n8530
56044E603511p3238r6529j25697j56086j83587k05081k18680k24158k22065k12495
$$ plain form
56123 854651 856357 858976 861389 862034 861639 862962 867407 873529 879476 885326 892044 899622 907564 916109 925610
56108 925610 935430 944755 953980 964164 975475 987218 999148 1011964 1026610 1043527 1062091 1080448
56096 1080448 1096831 1111743 1128081 1148281 1172033 1197562 1224177 1252389 1282266 1313171 1344986
56085 1344986 1378452 1414314 1452996 1495090 1541506 1593294 1651784 1718431 1793842 1877387 1968527
56074 1968527 2068235 2178583 2301476 2438599 2592094 2764299 2956853 3170269 3403367 3651762
56064 3651762 3907125 4159019 4397929 4616812 4811306 4980520 5127942 5260175 5383226
56055 5383226 5498923 5603867 5691296 5754652 5790666 5800105 5786575 5755341 5712395 5662041 5603511
56044 5603511 5530273 5433744 5308047 5151961 4968374 4763293 4544613 4320455 4098390 3885895
56034C885895j96207j76554j58113j42886j29284j15145j00283q6019p3736o4165
56024B643503n6642m9011l9778l0294k3190j8770j4775r656m050R89N112P828
56012B411266Q672Q548Q995R920J0111R915J1054J3493J5119J5085J4981J6009
56000B553168J7439J8658K0301K2451K3989K4703K5912K8111L0189L1686L3670
55989B830277L6616L9717M2840M6719N0619N2560N2760N3893N6976N9939O1567
55978C384483O3599O7325P1018P2918P4002P5784P7829P9563Q2260Q6949R2247
55967D227977R6406R9817J03858J08929J15108J22812J31422J39097J45276J51424
55957E442126J58434J65652J73377J83423J95889K08207K18902K29483K41199
$$ plain form
56034 3885895 3689688 3513134 3355021 3212135 3082851 2967706 2867423 2781404 2707668 2643503
56024 2643503 2586861 2537850 2498072 2467778 2444588 2425818 2411043 2401387 2397337 2398326 2403438 2411266
56012 2411266 2419938 2428486 2437481 2447401 2457512 2467427 2478481 2491974 2507093 2522178 2537159 2553168
56000 2553168 2570607 2589265 2609566 2632017 2656006 2680709 2706621 2734732 2764921 2796607 2830277
55989 2830277 2866893 2906610 2949450 2996169 3046788 3099348 3152108 3206001 3262977 3322916 3384483
55978 3384483 3448082 3515407 3586425 3659343 3733345 3809129 3886958 3966521 4048781 4135730 4227977
55967 4227977 4324383 4424200 4528058 4636987 4752095 4874907 5006329 5145426 5290702 5442126
55957 5442126 5600560 5766212 5939589 6123012 6318901 6527108 6746010 6975493 7216692
55948G216692K52929K63914K75626K89226L03923L19332L36437L54939L73020
55939I986038L91086M12151M37210M64099M92260N24004N59390N94849O29227
55930A4490314O66106P07543P50719P94001Q40969Q94898R54299J017483J086301
55921B2202633J161484J239720J319564J404971J498975J599605J706490J825197
55913C3958639J960265K110469K276421K465854K685206K932596L205330L507439
55905E5102219L843816M215857M631419N111732N680948O357456P163315Q131144
55897A00237906R289830J0650673J2214431J3979024J5932797J8060577K0370850
55890B00736088K2892225K5612855K8417140L1041168L2968818L3290361L0807923
$$ plain form
55948 7216692 7469621 7733535 8009161 8298387 8602310 8921642 9258079 9613018 9986038
55939 9986038 10377124 10789275 11226485 11690584 12182844 12706848 13266238 13861087 14490314
55930 14490314 15156420 15863963 16614682 17408683 18249652 19144550 20098849 21116332 22202633
55921 22202633 23364117 24603837 25923401 27328372 28827347 30426952 32133442 33958639
55913 33958639 35918904 38029373 40305794 42771648 45456854 48389450 51594780 55102219
55905 55102219 58946035 63161892 67793311 72905043 78585991 84943447 92106762 100237906
55897 100237906 109527736 120178409 132392840 146371864 162304661 180365238 200736088
55890 200736088 223628313 249241168 277658308 308699476 341668294 374958655 405766578
55883D05766578K4627540J4942253L286775q102974j7354886k3626011k7035837
55876C72503438k8203250k7847227k6592317k4893878k3027339k1136862j9300512
55869B01502053j7560536j5929816j4409063j3005286j1727022j0571172r527861
55862A08771297q593001p765175p034976o387120n809547n292843m825323m396782
55854E8666530m004263l647932l324519l029992k764502k528809k319017k130060
55846C4917436j961105j812588j681018j561560j453109j356309j269165j188726
55838B2633856j114656j047276r84499r24272q67644q15897p67126p19150o73474
55829A4719862o32868n97064n64062n33659n06383m80747m54736m28561m03354
$$ plain form
55883 405766578 430394118 445336371 448623146 440520172 423165286 399539275 372503438
55876 372503438 344300188 316452961 289860644 264966766 241939427 220802565 201502053
55869 201502053 183941517 168011701 153602638 140597352 128870330 118299158 108771297
55862 108771297 100178296 92413121 85378145 78991025 73181478 67888635 63063312 58666530
55854 58666530 54662267 51014335 47689816 44659824 41895322 39366513 37047496 34917436
55846 34917436 32956331 31143743 29462725 27901165 26448056 25091747 23822582 22633856
55838 22633856 21519200 20471924 19487425 18563153 17695509 16879612 16112486 15393336 14719862
55829 14719862 14086994 13489930 12925868 12392209 11885826 11405079 10950343 10521782 10118428
55820A0118428l78801l54474l31641l11192k91388k70093k47656k25477k03610
55811G504096j82001j62427j47070j36874j33038j37696j50688j67596j83465
55802F103241j96820k08107k16373k20082k19382k15094k07102j95960j84157
55793D240164j73289j61764j47845j33015j19630j07200r4210q2208p4754p3143
55783C073106p5876q1290q7616r1480q9924q4100p8095p3900o9916o4433n8017
55772B218459n2022m6826m2281l8354l4832l1330k7753k4076k0217j6950j6013
55761A867805j7981k0892k2390k2427k2297k1965k0228j6831j2518p485j738L351
55749A684404N931O237O525Q118R969J0387R075P190O207O751P856P608N130J457
$$ plain form
55820 10118428 9739627 9385153 9053512 8742320 8450932 8180839 7933183 7707706 7504096
55811 7504096 7322095 7159668 7012598 6875724 6742686 6604990 6454302 6286706 6103241
55802 6103241 5906421 5698314 5481941 5261859 5042477 4827383 4620281 4424321 4240164
55793 4240164 4066875 3905111 3757266 3624251 3504621 3397421 3303211 3221003 3146249 3073106
55783 3073106 2997230 2915940 2828324 2736844 2646920 2562820 2484725 2410825 2340909 2276476 2218459
55772 2218459 2166437 2119611 2077330 2038976 2004144 1972814 1945061 1920985 1900768 1883818 1867805
55761 1867805 1849824 1828932 1806542 1784115 1761818 1739853 1719625 1702794 1690276 1682791 1681053 1684404
55749 1684404 1690335 1696572 1703097 1711215 1721184 1731571 1740646 1747836 1754043 1760794 1768650 1776258 1781388 1782845
55735A782845k194o050j0661j5146j7941j8724j8128j6195j2612q099l977m63
55723A652655L248P298J0732J2644J2755J1013P427K115n091j4381k4579l3039
55711A642797l8179m1179m3859m5903m5896m4107m2011l9603l5698l0938k8109
55700A207315k8732l1170l2819l2757l1418k9144k6111k2904k0314j8841j8661
55689I14444j9516k0568k1075k1152k1242k1048k0022j8755j8533j9335j9467
55678F93731j7685j4748j2366j1383j1430j1613j0985q913n665k526j088k256
55666E83073n640r583j2145j2700j2350j2306j2344j1521r975q923q971r406r216
55653D47993q114o435m722l421k429j237Q8N70k39j142q09J05j83j945l721m712
$$ plain form
55735 1782845 1780651 1774601 1763940 1748794 1730853 1712129 1694001 1677806 1665194 1657095 1653118 1652655
55723 1652655 1655903 1663201 1673933 1686577 1699332 1710345 1717772 1719887 1714796 1700415 1675836 1642797
55711 1642797 1604618 1563439 1519580 1473677 1427781 1383674 1341663 1302060 1266362 1235424 1207315
55700 1207315 1178583 1147413 1114594 1081837 1050419 1021275 995164 972260 951946 933105 914444
55689 914444 894928 874360 853285 832133 810891 789843 769821 751066 732533 713198 693731
55678 693731 676046 661298 648932 637549 626119 614506 603521 594608 588943 586417 585329 583073
55666 583073 577433 567850 555705 543005 530655 518349 506005 494484 484509 475586 466615 457209 447993
55653 447993 439879 433444 428722 425301 422872 421635 421723 422293 422054 420912 420103 420208 420025 418080 414359 409647
55637D09647n708p271q714r472j0015j0607j0453r019p085n516m122k711k128
55624C16826k877l600k609m67O05j27j107j016n41q35j549j560q73m78o20m07
55608B98765P32K139K917L119L439M153M880N181M900M097K998J917R07k85j706
55593C38153k899l576m216n388o760p511p571p622p841p631o794o035n926o105
55579B52278n873m921l114m78K133L264K547J430J367K014K068J386J054J569
55565B56724K095J689M81p24j506k157l104m117m200k653k24J304J051p6o66l70
55549B43547L56J284K385L195L152K499K104K433L149L648L581L084K807L362
55535B80586M475N139N002M938N748O992P856Q369Q959R418R511J0116J2408J6006
$$ plain form
55637 409647 403939 396668 387954 378482 368467 357860 347407 338388 331303 325787 321665 318954 316826
55624 316826 313949 310349 307740 307273 307878 307751 306644 305628 305087 304252 302703 301143 300270 299792 299172 298765
55608 298765 299497 301636 304553 307672 311111 315264 320144 325325 330225 334322 337320 339237 340144 339859 338153
55593 338153 335254 331678 327462 322074 315314 307803 300232 292610 284769 277138 270344 264309 258383 252278
55579 252278 246405 241484 238370 237892 240025 243289 245836 247266 248633 250647 252715 254101 255155 256724
55565 256724 258819 260508 260989 260265 258759 256602 253498 249381 245181 242528 242304 243608 244659 244583 243917 243547
55549 243547 243903 245187 247572 250767 253919 256418 258522 260955 264104 267752 271333 274417 277224 280586
55535 280586 285061 290200 295202 300140 305888 312880 320736 329105 338064 347482 356993 367109 379517 395523
55521C95523J9126K0707K1423K2598K5032K9069L4773M1572M8382N4565O0478
55510G73248O6964P4671Q3654R3085J01109J05509J04634R7599Q3949O3842L8683
55499A686947J1083j5974m0052n9806p5088q6200r2837r4305r1124q5640q0235
55488I76769p5446p0639o5886o1927n8558n4375m8574m2161l7001l3975l2115
55477C96112k9458k5041k0273j7688j7930j8725j7482j4106j0362p500n816n662
55465B06069p158r052r560q407o898n995n574n390n429n295m644m102m387m653
55451A19525l412j245o58k629m989n124k917j64J617J801L70j763k885k064l14
55436I5149N26k21j625k149r17J425K935K263L93m25M61J552J658J395J538J452
$$ plain form
55521 395523 414649 435356 456779 479377 504409 533478 568251 609823 658205 712770 773248
55510 773248 840212 914883 998537 1091622 1192731 1298240 1402874 1500473 1584422 1648264 1686947
55499 1686947 1698030 1682056 1642004 1582198 1507110 1420910 1328073 1233768 1142644 1057004 976769
55488 976769 901323 830684 764798 702871 644313 589938 541364 499203 462202 428227 396112
55477 396112 366654 341613 321340 303652 285722 266997 249515 235409 225047 217547 211731 206069
55465 206069 198911 189859 180299 171892 164994 158999 153425 148035 142606 137311 132667 128565 124178 119525
55451 119525 116113 114868 114210 111581 106592 101468 98551 98387 100004 101805 102175 100412 97527 95463 95149
55436 95149 95675 95454 93829 91680 90763 92188 95123 97386 97779 97354 97815 99367 101025 102420 103958 105410
55420A05410J89j965m009n402n854m980l129j703j553j947j973j979k529k915
55406F5661k139p03J4l47j047j617k098k268j855j323j350j746j799j420r26k19
55390D4818Q13J455J010J13q2K56K2p87r91k61K95k4m99l11K40M52J65m94j373
55371D4817j882j238L61J726K267K596L042K777J252m77j007m95j99n53q19l64
55355E1804O28J630K178J936J175Q95J721K812K822J735P68M90K78j25J07J339
55339G2193K263J395q14k394k219j052l65q68k231l538l880l049j764q66m19k4
55323E2368K27j47j030j679j774j735j705j094M21K117K932K513J181n63k052
55308D9980k572k051j229p09l50Mq6q19j355q73J02L19n15j527j984j887j478
$$ plain form
55420 105410 105599 103634 99625 94223 88369 83389 80260 78557 77004 75057 73084 71105 68576 65661
55406 65661 63522 62819 62833 62486 61439 59822 57724 55456 53601 52278 50928 49182 47383 45963 45037 44818
55390 44818 45631 47086 48096 48209 48127 48383 48405 47618 46627 46366 46661 46637 46138 45827 46067 46519 46684 46190 44817
55371 44817 42935 41697 42058 43784 46051 48647 51689 54466 55718 55241 54234 53739 53540 52987 52168 51804
55355 51804 52432 54062 56240 58176 59351 60246 61967 64779 67601 69336 70104 70594 70872 70747 70854 72193
55339 72193 74456 75851 75037 72643 70424 69372 69007 68139 65908 62370 58490 55441 53677 52811 52392 52368
55323 52368 52595 52448 51418 49739 47965 46230 44525 43431 43852 45969 48901 51414 52595 52032 49980
55308 49980 47408 45357 44128 43419 43069 43073 42987 42168 40813 39940 40042 40361 39846 38319 36335 34448 32970
55291C2970r58o32n40k33M37O74j52j213j233m77l01r24j147m99M8p5o2O03R71
55272B7257J63j041j375q66l10K54J194J959J577L28l52P6M03n92k241k547n56
55255B3331K261L377J913l93j229k60R77J259O57n18k255l853l798j693O80J324
55239B1780M35l31l30k92n08j70J072K141J862O59P8Q35J963K123J266M86L95
55222C3464M44K19N27K117L803L327L37k911m313m164l796l276j799L94K003K444
55206B8820K398K491K429J733N92m43j195j943k834l468l277k431j871k010j862
55191A7129m68J223J307j84j065j40J157J248P29P55P42k84j287n70J146J415
55175B2853j74j368o80O75J040N40O5l34p91n74Q77K674L374K742J720J066Q02
$$ plain form
55291 32970 32012 31380 30840 30607 31044 31718 31566 30353 29120 28643 28342 27418 26271 25772 25820 25745 25683 26286 27257
55272 27257 27420 26379 25004 24138 23828 24082 25276 27235 28812 29140 28788 28864 29267 28675 26434 23887 23331
55255 23331 25592 28969 30882 30489 29260 29000 29977 31236 31893 31375 29120 25267 21469 19776 20456 21780
55239 21780 22215 21884 21554 21262 20754 20584 21656 23797 25659 26318 26396 27231 29194 31317 32583 33069 33464
55222 33464 33908 34127 34654 36771 40574 43901 44238 41327 37014 32850 29054 25778 23979 24373 26376 28820
55206 28820 31218 33709 36138 37871 38463 38020 36825 34882 32048 28580 25303 22872 21001 18991 17129
55191 17129 16661 17884 19191 19007 17942 17802 18959 20207 20936 21691 22433 22149 20862 20292 21438 22853
55175 22853 22679 21311 20631 21306 22346 22886 22951 22617 21826 21252 22129 24803 28177 30919 32639 33705 34507
55158C4507P12O71N36K74O6L3N0K2O3K33L86L70J48k63o39m78L95J335J696J868
55138D1985K656L692L609J969j75j810k870l215k155J01J757J348m58j982k678
55123D1774k903k486j086M57Q00J48J4P87J076l0j493j920j431r31m88L39J144
55106C3771J008rr05j334j978l106l808l295k137j404j147o00M00J089R28L40
55090A7813R9M61J129J674J822J640J454J292N95r70k467k377o06J121J324M29
55074B4433l50q95j807k727k436o83J339K592L128L052J821n10k288j816M06K118
55058B5377K031J042N53O28L94m79j527k220k114o75J987M348M674L336K765M321
55042D4441O238N817K988K61n05J13O82Q29Q87Q11L02m88j070j145o77R0N40J55
$$ plain form
55158 34507 35219 35890 36426 36700 36766 36799 36849 36871 36934 37167 37553 37923 38071 37808 37169 36691 37086 38421 40117 41985
55138 41985 44641 48333 51942 53911 53736 51926 49056 45841 43686 43787 45544 46892 46434 44452 41774
55123 41774 38871 36385 35299 35756 36556 36704 36718 37505 38581 38551 37058 35138 33707 32776 32288 32627 33771
55106 33771 34779 34770 33865 32531 30553 27447 23639 20344 18207 16803 15656 15056 15456 16545 17473 17813
55090 17813 17912 18373 19502 21176 22998 24638 26092 27384 27979 27009 24542 22165 21559 22680 24004 24433
55074 24433 24083 23188 21381 18654 16218 15535 16874 19466 22594 25646 27467 26957 24669 22853 23259 25377
55058 25377 27408 28450 29003 29631 30025 29546 28019 25799 23685 23010 24997 29345 34019 37355 40120 44441
55042 44441 50679 56496 59484 59745 59240 59353 60035 60864 61751 62562 62864 62376 61306 60161 59484 59574 60114 60269
55024F0269p57j376j621k067k459j589O51K358J871L4j119j134j166j702j942
55009D8251j573j512k258k698j428J218L262L178J436j50n10m37j426l615n489
54994C6249n589l835j103J552L013K644J335R10J781K271J188k16j27J142J970
54979D3185J998K033K031J204j01n72q1K10j8K34J355K400K735K688K248Q04j241
54962F1112k333j977j475j543q83J580M397N118L390J156J99N22R17L72r29j746
54946F7877j189P4P59R51J829L384M045L174K231K465L022K654J931K179L251
54931I8637L996M227M595N043M930M419M210M068K998Q89j210k486k953k669j635
54916A27059n75o81k095l531l837l330l174l821m490m058k259n3J290J448J191
$$ plain form
55024 60269 59512 58136 56515 54448 51989 50400 51051 53409 55280 55314 54195 53061 51895 50193 48251
55009 48251 46678 45166 42908 40210 38782 40000 43262 46440 47876 47726 47216 46779 45353 41738 36249
54994 36249 30660 26825 25722 27274 30287 32931 34266 35176 36957 39228 40416 40200 40073 41215 43185
54979 43185 45183 47216 49247 50451 50350 49778 49697 49907 49889 50123 51478 53878 56613 59301 61549 62353 61112
54962 61112 58779 56802 55327 53784 52901 54481 58878 63996 67386 68542 68741 69263 70180 70552 69623 67877
54946 67877 66688 66762 67521 68472 70301 73685 77730 80904 83135 85600 88622 91276 93207 95386 98637
54931 98637 102633 106860 111455 116498 121428 125847 130057 134125 137123 138012 136802 134316 131363 128694 127059
54916 127059 126484 125803 123708 120177 116340 113010 109836 106015 101525 97467 95208 95155 96445 97893 99084
54901I9084J248J447J163K02j024j806j502p8J554K345K224J782J044k47j109
54886A06327J02K938M453K851P4p43Q06K720L765M301M611M490M401N151O380
54871A52627O968O946P400Q506R326R732J0734J2476J3643J3461J2715J1948J0051
54858B86533N789j92n840r608j1247j1462j1257j1118j0522q936p324p456r335
54845A88025j0649r552o861m669l820l770l954m038l562k543j981k531l052j740
54831A25303J411M400N568N170M555M812O458R389J2564J4345J4002J2605J1888
54818B32470J2242J2293J0590P367M210K009j37l470p496j0243j0704r993r642
54805B29496r664r161q085p145o222m305j335J111J669J022J062K712N287P696
$$ plain form
54901 99084 100332 101779 102942 103144 102120 100314 98812 98734 100288 102633 104857 106639 107683 107436 106327
54886 106327 106429 109367 113820 116671 116745 116002 116808 119528 123293 127594 132205 136695 141096 146247 152627
54871 152627 159595 166541 173941 182447 191773 201505 212239 224715 238358 251819 264534 276482 286533
54858 286533 292322 292130 286290 276682 265435 253973 242716 231598 221076 212140 204816 197360 188025
54845 188025 177376 167824 160963 156294 152474 148704 144750 140712 137150 134607 132626 130095 127043 125303
54831 125303 126714 131114 136682 141852 146407 151219 157677 167066 179630 193975 207977 220582 232470
54818 232470 244712 257005 267595 274962 279172 281181 281044 277574 270078 259835 249131 239138 229496
54805 229496 219832 210671 202586 195441 189219 184914 183579 184690 186359 187381 188443 191155 196442 204138
54791B04138R265R425P604M014O0k664l719l878m129m963o370p826q348p293n426
54776A79890m604n813p887q817q029o728o042n760n121m108l260k739k344k247
54762A06391k926m228n149m922l886k981k686k786k888k661j805l81Q82J125M22
54747G1521k04J2P60J325J514J546J416J062Q83J481K739L730L662K640J405O12
54731I6104M29O25Q76J071J238J237R33Q06J792M012O154O856O399O213O944Q018
54715A49707R060J0579J2803J4795J5459J5020J4832J5832J7490J8303J7260J4844
54703C25984J2316J0011P032L124n7p84K33P49J05k07P08J759J919J947K917M277
54687C72033M547L141M88k773n744p350p575p933r622j1799j2696j1790r885p624
$$ plain form
54791 204138 213403 222828 230432 234446 234506 231842 228123 224245 220116 215153 208783 200957 192609 185316 179890
54776 179890 175286 169473 161586 152769 144740 138012 131970 126210 121089 116981 113721 110982 108638 106391
54762 106391 103465 99237 94088 89166 85280 82299 79613 76827 73939 71278 69473 69092 69974 71099 71521
54747 71521 71317 71329 72089 73414 74928 76474 77890 78952 79835 81316 84055 87785 91447 94087 95492 96104
54731 96104 96533 97158 98034 99105 100343 101580 102513 103319 105111 109123 115277 122133 128532 134745 141689 149707
54715 149707 158767 169346 182149 196944 212403 227423 242255 258087 275577 293880 311140 325984
54703 325984 338300 348311 355343 358467 358410 357626 357859 358608 358713 358506 359214 360973 362892 364839 367756 372033
54687 372033 376580 379721 380209 377436 371692 364342 356767 348834 339212 327413 314717 302927 293042 285418
54673B85418n165k861j130K38J785L618N470P216Q669R332Q942P702N586K169
54659C36989k278o497r657j1971j3505j3765j3332j4013j5982j6621j4116j0493
54647A94759q729q428p215n213m724n820n817l673j685j851l179l879l825l486
54633A27235k477o85P28Q84N30O44R81J015J158J896K813L363L602L470K529J245
54617A48931J138K674M247M303L313K537K007J153L76N64J544K318K499K497K688
54602A82789L173L924M517M187K876J591J229J590K091K651L300L850M559O226
54588B28553Q865J1216J2372J3026J4213J5770J7079J8432K0440K2645K3847K3423
54576D29881K1466J8027J3131P230J026m877r747j2891j4588j6015j7606j8356
$$ plain form
54673 285418 280253 277392 276262 276500 278285 281903 287373 294589 303258 312590 321532 329234 334820 336989
54659 336989 334711 328214 318557 306586 293081 279316 265984 251971 235989 219368 205252 194759
54647 194759 186030 177602 170387 165174 160450 154630 148813 145140 143455 141604 138425 134546 130721 127235
54633 127235 124758 124073 124801 125685 126215 126859 127840 128855 130013 131909 134722 138085 141687 145157 147686 148931
54617 148931 150069 152743 156990 161293 164606 167143 169150 170303 170679 171243 172787 175105 177604 180101 182789
54602 182789 185962 189886 194403 198590 201466 203057 204286 205876 207967 210618 213918 217768 222327 228553
54588 228553 237418 248634 261006 274032 288245 304015 321094 339526 359966 382611 406458 429881
54576 429881 451347 469374 482505 489735 490761 485884 476137 463246 448658 432643 415037 396681
54564C96681j7383j5299j3246j1486r863q759q442q135o867m764k787j793k353
54551B85504m524o997p660o095m538n113p188q659q804q309p419n933m522m299
54537A95444n176o028o252n968n136l800k824l024l804l979l539l310l222k445
54523A36937j067k40n61j398j803j247J89J483J205o69k248k214j688k132k641
54508A21906j488N94J305M85J75J037J529J126J435L198M658M259K847J851J182
54493A46099M09L24J507K680K303J022P48J917L085L077K248J640J816K608L529
54478A75012M307N188O537Q227R848J1291J2454J2649J1343R441Q573Q906Q895
54465B92671P437N097K818P42j249l023m872p318r710j0377r089p940q707j0342
$$ plain form
54564 396681 379298 363999 350753 339267 329404 320645 312203 304068 297201 292437 289650 287857 285504
54551 285504 280980 273983 266323 260228 255690 250577 243389 234730 225926 217617 210198 204265 199743 195444
54537 195444 190268 184240 177988 172020 166884 163084 160260 157236 153432 149453 145914 142604 139382 136937
54523 136937 135870 135630 135069 133671 131868 130621 130810 132293 133498 132829 130581 128367 126679 124547 121906
54508 121906 120418 121012 122317 122802 122977 124014 125543 126669 128104 131302 135960 140219 143066 144917 146099
54493 146099 146508 146832 148339 151019 153322 154344 155092 157009 160094 163171 165419 167059 168875 171483 175012
54478 175012 179319 184507 191044 199271 209119 220410 232864 245513 256856 266297 274870 283776 292671
54465 292671 300108 305205 308023 308765 307516 304493 299621 292303 282593 272216 263127 255187 246480 236138
54451B36138j0446q365n615l894l772m841o078o340n385m104l320k791j954r63
54437A68270k62J93O29R33J046J236J466J212M33q3J13M80O46J054J727J659N61
54420A81313K3J492L907M936L890J998M05n48n66M48J499J396M55Q6P28J471J671
54403B04604J538J149L89m4Q86K669L374K228P54N50J172J258O91M11N85L00r13
54386B21601k173k205q08R29J714J287M20k87j195k785m423m715l309j538j005
54371B01508k004l563m491m158k781j434j252k182k856k107l11J239J838J660
54357A79106R05l38j321p40J769M807O570O706O235N848N183L883K496J809J849
54342B24767K079K221K298K234K032J996K101J470o10l254m596m017k799k321
$$ plain form
54451 236138 225692 217327 211712 207818 204046 199205 193127 186787 181402 177298 173978 171187 169233 168270
54437 168270 168008 168201 168830 169763 170809 172045 173511 174723 175156 175073 175186 175666 176312 177366 179093 180752 181313
54420 181313 181336 182828 186735 191671 195561 197559 197964 197416 196850 197298 198797 200193 200648 200734 201462 202933 204604
54403 204604 206142 207291 207680 207636 208522 211191 214565 216793 217547 218097 219269 220527 221218 221629 222214 222514 221601
54386 221601 219428 217223 216415 217344 219058 220345 220765 220478 219283 216498 212075 207360 204051 202513 201508
54371 201508 199504 195941 191450 187292 184511 183077 181825 179643 176787 174680 174369 175608 177446 179106
54357 179106 180011 179673 178352 177612 179381 184188 190758 197464 203699 209547 214730 218613 221109 222918 224767
54342 224767 226846 229067 231365 233599 235631 237627 239728 241198 240588 237334 232738 228721 225922 223601
54328B23601k550k775k843k889k613j753q54o98j149j369j064p98j079j710k165
54313A97292k141j601n94O78J752K027J187l33j474j536r80p78j040r13L3J072
54297A92651J441J352J353J408J363J761L118M705N085L974K546J707R75l68j852
54282B21219k406k137k457m153o046o341m933l517l323l740l674l279l382l809
54268A68022l584k595j880k156l076m060m763m641l295j555r61j658k043j090
54254A30665J63K92n17j122j121q91o75n85q34j246j224q47r35j399r21O09R79
54237A20391j318m260m614k246N9M84l34j439k738l729l299j489J88P70P46N21
54221I7693l47j799k719k518j990j826j587r35n29p62p37M01J983K697K210J026
$$ plain form
54328 223601 221051 218276 215433 212544 209931 208178 207324 206626 205477 204108 203044 202246 201167 199457 197292
54313 197292 195151 193550 192956 193634 195386 197413 198600 198267 196793 195257 194277 193499 192459 191546 191579 192651
54297 192651 194092 195444 196797 198205 199568 201329 204447 209152 214237 218211 220757 222464 223439 223071 221219
54282 221219 218813 216676 214219 210066 204020 197679 192746 189229 185906 182166 178492 175213 171831 168022
54268 168022 164438 161843 159963 157807 154731 150671 145908 141267 137972 136417 135456 133798 131755 130665
54254 130665 130828 131120 130603 129481 128360 127469 126794 126209 125375 124129 122905 122058 121123 119724 118803 119412 120391
54237 120391 119073 114813 110199 107953 108012 108496 108162 106723 103985 100256 96957 95468 95656 96426 97172 97693
54221 97693 97346 95547 92828 90310 88320 86494 84907 83972 83443 82681 81944 82345 84328 87025 89235 90261
54205I0261m87j991k761k414j604j168r71l73N24J020R47R10J406K234K755K455
54189I0743J393L54K31J086K065K344J742M31j267k630k818j844o98j40N5L65
54173I1412P13Q06O15J39p52j828k442k351j897j156K13J817K287J042n85j016
54157H7017n14m90j194j423m41R38J378M65j138k414k786k483k156j969j486o19
54141G0685j65p39j715j954j430j233k018l064l072j507Q21K297J811j20j730
54126E6867j866j167r86j545j794q97P72K109K332J593Q26P67R71K36j617l033
54110E3568k487m72J197J546J018K35m97n95M40J787J692k10k047j967m11P63
54094E3560P55L75M90R86J312J117K74r75j752j211K38J202J099Q98J327J362
$$ plain form
54205 90261 89774 87783 85022 82608 81004 79836 78865 78492 79016 80036 80983 81893 83299 85533 88288 90743
54189 90743 92136 92490 92721 93807 95872 98216 99958 100389 99122 96492 93674 91830 91132 90992 91047 91412
54173 91412 92125 92931 93546 93685 92933 91105 88663 86312 84415 83259 83472 85289 87576 88618 88033 87017
54157 87017 86503 86013 84819 83396 82955 83893 85271 85736 84598 82184 79398 76915 74759 72790 71304 70685
54141 70685 70520 69781 68066 66112 64682 63449 61431 58367 55295 53788 54609 56906 58717 58597 56867
54126 56867 55001 53834 52848 51303 49509 48612 49384 51493 53825 55418 56244 57011 57982 58218 56601 53568
54110 53568 51081 50609 51806 53352 54370 54605 54108 53513 53953 55740 57432 57222 55175 53208 52797 53560
54094 53560 54315 54690 55180 56166 57478 58595 58869 57894 56142 54931 55169 56371 57470 58368 59695 61057
54078F1057k61k521k758j55K978M136L631L418L936L629J446j656l926m441l326
54063F5187j342L53Q49L13l34o76j063j556j572q53J9M88O00M68j9n39l64M14
54045F0373O93Kn70M5J285J857J477P41p4r69j438q84M96K031L359M087L368J032
54027G6911j391k073j080K4L80M00L81J49K0O68J804K310J909J370R36Lj194j290
54009H0237J00J458J464P05J97m35j808k771j532J449L507L089J665J612L109
53994I2046M057K832K93j267p70N97J096N52J34M52Q40P06M52O33J034J237J496
53977A06420K268L460M757O208P683Q239P094N064M056M957O705P649P334O666
53963A88560O709P369P343N625L165K233L520M718L192m03k724j958K08J345J299
$$ plain form
54078 61057 60796 58275 55517 55362 58340 62476 66107 69525 73461 77090 78536 76880 72954 68513 65187
54063 65187 63845 64198 65047 65360 65026 64350 63287 61731 60159 59306 59325 59813 60413 60881 60862 60323 59959 60373
54045 60373 61066 61068 60498 60543 61828 63685 65162 65903 65829 64860 63422 62538 63034 65065 68424 72511 75879 76911
54027 76911 75520 73447 72367 72391 72771 73171 73552 73701 73721 74389 76193 78503 80412 81782 82718 82721 81527 80237
54009 80237 80337 81795 83259 83964 84161 83726 81918 79147 77615 79064 82571 85660 87325 88937 92046
53994 92046 96103 98935 99228 97961 97191 97788 98884 99436 99570 100022 100862 101568 102020 102653 103687 104924 106420
53977 106420 108688 112148 116905 123113 130796 139035 146129 151193 155249 160206 166911 174560 181894 188560
53963 188560 195269 202638 209981 215606 218771 221004 224524 229242 232434 232031 229307 227349 227557 228902 230201
53948B30201J359J741J598Q97N18M45n55k981n484o438n842n002m852n265n583
53933A94757n279m349l519l685m720n203l968j677j85n17k047l466l939l387k401
53918A46415j888k188k526k029j071p91j282j497j022o02l89Q12L508N958O148
53903A47556M527L299L425L912L856L547L416L340L438M200N324N554M431L233
53889B03058L456M969O396O759O148N298N009N506O021N571M352L660M012M447
53875B74662M271M351N563O874O603N047M256N111O208N991M669L379K599K250
53861C41834K466L307L975L383J398r61k462k440q93J535L706M657M341L526L015
53846C70387L190M047N171N707M956L257J855J647K375L281M024M559M472L177
$$ plain form
53948 230201 231560 233301 234899 235796 236314 236759 236204 233223 227739 221301 215459 210457 205605 200340 194757
53933 194757 189478 185129 181610 177925 173205 168002 164034 162357 162172 161655 159608 156142 152203 148816 146415
53918 146415 144527 142339 139813 137784 136713 135922 134640 133143 132121 131519 131130 131942 135450 141408 147556
53903 147556 152083 155382 158807 162719 166575 170122 173538 176878 180316 184516 189840 195394 199825 203058
53889 203058 206514 211483 217879 224638 230786 236084 241093 246599 252620 258191 262543 266203 270215 274662
53875 274662 278933 283284 288847 295721 302324 307371 311627 316738 322946 328937 333606 336985 339584 341834
53861 341834 344300 347607 351582 354965 356363 355402 352940 350500 349607 351142 354848 359505 363846 367372 370387
53846 370387 373577 377624 382795 388502 393458 396715 398570 400217 402592 405873 409897 414456 418928 422105
53832D22105P79j798l683m709n126n169n097n353o348q090r988j1016j0332q216
53818C37959o255n997p353q831r353r099q556p692o584n861n848n949n648n334
53804B39599n309m832l330k009k668n136p274p557o368m711l090j969j864k329
53790A81153k093r10j39q17k105k532j915j195j036j438k061k310j597j54J059
53775A61910J682K301K995K798J452L34L95L75j190l284l669k166o37K2N96J289
53759A65203J048k88j294j199j008j358j152K95J353K13k042k526k84K683M190
53744A63834M110L592L306L121K957L175M117N411N959N067L530L005L945M923
53730B20052M611L800M407O846R395J0115Q630N896L096J026q4m55l32K76J139
$$ plain form
53832 422105 422884 421086 417403 412694 407568 402399 397302 391949 385601 377511 367523 356507 346175 337959
53818 337959 331704 325707 318354 309523 300170 291071 282515 274823 268239 262378 256530 250581 244933 239599
53804 239599 234290 229458 226128 224119 221451 216315 209041 201484 195116 190405 187315 185346 183482 181153
53790 181153 179060 178150 178011 177194 175089 172557 170642 169447 168411 166973 164912 162602 161005 160851 161910
53775 161910 163592 165893 168888 171686 173138 173472 173867 174242 173052 169768 166099 163933 163296 163318 163914 165203
53759 165203 166251 165963 164669 163470 162462 161104 159952 160247 161600 161813 159771 157245 156961 159644 163834
53744 163834 167944 171536 174842 177963 180920 184095 188212 193623 199582 204649 208179 211184 215129 220052
53730 220052 224663 228463 232870 239716 249111 259226 267856 273752 276848 277874 277790 277335 277003 277279 278418
53715B78418J443O85k73p5J183J773N52j516k599k143j116n85p75j232j314n81
53699B71845P41J757J710P15n77j777k739l166k892k549l135m779o429o989o284
53684B35452m824l173j874j431j876k601k995k955k531j540o6J000O88p58j989
53669B08527k076j465j204j723k649l453l927m112m017l445k103j03J748K438
53655A82436J678J15j312j964j595m29P54J096N43j36l43j43K53Q38J234O76p60
53638A82941j610p29R69J595Q83N12J692L660M954N103M392K952J080j00N53K706
53622B11553M587M662K903M80j264j530l80J284K285K055J041J46j85k14k40R8
53606B27281J378L112L629J897q14k126j425l41n6M16K137L704K701o36l260l190
$$ plain form
53715 278418 279861 280546 280273 280198 281381 283154 283706 282190 279591 277448 276332 275747 274972 273740 272426 271845
53699 271845 272586 274343 276053 276768 276191 274414 271675 268509 265617 263068 259933 255154 248725 241736 235452
53684 235452 230628 227455 225581 224150 222274 219673 216678 213723 211192 209652 209586 210586 211274 210516 208527
53669 208527 206451 204986 203782 202059 199410 195957 192030 187918 183901 180456 178353 178250 179998 182436
53655 182436 184114 184229 182917 180953 179358 178929 179683 180779 181322 181186 180843 180700 180953 181791 183025 183701 182941
53638 182941 181331 180602 181571 183166 184049 184561 186253 189913 194867 199970 204362 207314 208394 208294 208847 211553
53622 211553 216140 220802 223705 224185 222921 221391 221011 222295 224580 226635 227676 227822 227637 227423 227183 227281
53606 227281 228659 231771 235400 237297 236483 234357 232932 232591 232535 232951 235088 238792 241493 240857 237597 234407
53590B34407j794j376j998k174j553j130j197q38L01J218J125N94M72N59L07R4
53574B27017P70K163L049K692J707J255J742K411K076L42j686k260q97R77J806
53559B43164J737K005K920L654L742L606L567L489L650M493N303M573K446J143
53545B89492J899L040K654J768K696N239O922O811O384O364N340K644L53N91K432
53530C44629L284K424J323J103J462J878K238K118R38p63j391j99J614K334J552
53515C64544K20p29j195j579k113k644k981l267l750m112l558j877J4J042J269
53500C39284J486J880J832R99k35j467k612l256k576m98J783L055L476L931M395
53485C51477L989K710J990K935M659N287M349L322L620M922N948O140N897N633
$$ plain form
53590 234407 232613 231237 229239 227065 225512 224382 223185 222347 222648 223866 224991 225585 226057 226616 226923 227017
53574 227017 227787 229950 232999 235691 237398 238653 240395 242806 244882 245224 243538 241278 240381 241358 243164
53559 243164 244901 246906 249826 253480 257222 260828 264395 267884 271534 276027 281330 285903 288349 289492
53545 289492 291391 294431 297085 298853 301549 306788 313710 320521 326905 333269 338609 341253 341606 342197 344629
53530 344629 347913 350337 351660 352763 354225 356103 358341 360459 361397 360634 359243 359044 360658 362992 364544
53515 364544 364764 364035 362840 361261 359148 356504 353523 350256 346506 342394 338836 336959 336973 338015 339284
53500 339284 340770 342650 344482 345481 345246 343779 341167 337911 335335 334837 336620 339675 343151 347082 351477
53485 351477 355466 358176 360166 363101 367760 373047 377396 380718 384338 389260 395208 401348 407245 412878
53471D12878N515N951P257Q816R520R435R983J1937J4165J5275J5680J6919J9279
53458E62610K1340K1954K1577K1369K1806K2598K3514K4669K6207K7978K9520
53447H25142L0459L1039L2039L3843L5830L7102L7589L7968L8645L9431M0039
53436A219126M0330M0121L9414L8764L8854L9650M0597M1400M2016M2063M1282
53425A663617M0550M1212M3085M4265M3484M1595L9960L8444L6071L2986L0430
53414B095699K9033K8254K7462K6495K5111K2875J9996J7497J6050J4997J3132
53403B336601J0219P327N556M718L401L34m383r437j3562j6558j9077k1652k4082
53390B259405k5860k7155k9041l2347l6305l9019l9578l9079l8972l9198l8806
$$ plain form
53471 412878 418393 424344 431601 440417 449937 459372 469355 481292 495457 510732 526412 543331 562610
53458 562610 583950 605904 627481 648850 670656 693254 716768 741437 767644 795622 825142
53447 825142 855601 886640 918679 952522 988352 1025454 1063043 1101011 1139656 1179087 1219126
53436 1219126 1259456 1299577 1338991 1377755 1416609 1456259 1496856 1538256 1580272 1622335 1663617
53425 1663617 1704167 1745379 1788464 1832729 1876213 1917808 1957768 1996212 2032283 2065269 2095699
53414 2095699 2124732 2152986 2180448 2206943 2232054 2254929 2274925 2292422 2308472 2323469 2336601
53403 2336601 2346820 2354147 2359703 2364421 2367822 2368156 2363773 2354336 2340774 2324216 2305139 2283487 2259405
53390 2259405 2233545 2206390 2177349 2145002 2108697 2069678 2030100 1991021 1952049 1912851 1874045
53379A874045l7848l7258l7094l6402l5004l3875l3333l2292l0058k7490k5429
53368A507962k3211j9966j6386j3910j2786j2062j0819q338m000J677O602R386
53356A404149J1357J4720J9219K2733K4821K7391L1504L5659L8213L9586M1091
53345A710443M3023M5115M7595N0532N3136N4904N6669N9441O2949O6392O9914
53334B320113P4083P8458Q1905Q4175Q6073Q8202R0413R2294R3426R3488R2973
53323C275603R3440R5947R9310J00936R9507R5995R2100Q8645Q5607Q2650P9181
53312D288921P4672O9262O3564N7669N1141M4114L7486L1524K5317J8378J1788
53301D773836O597J704n115j4140k3233l0918l8539m8279n9936p1040p9806q6611
$$ plain form
53379 1874045 1836197 1798939 1761845 1725443 1690439 1656564 1623231 1590939 1560881 1533391 1507962
53368 1507962 1484751 1464785 1448399 1434489 1421703 1409641 1398822 1390484 1386484 1388161 1394763 1404149
53356 1404149 1415506 1430226 1449445 1472178 1496999 1524390 1555894 1591553 1629766 1669352 1710443
53345 1710443 1753466 1798581 1846176 1896708 1949844 2004748 2061417 2120858 2183807 2250199 2320113
53334 2320113 2394196 2472654 2554559 2638734 2724807 2813009 2903422 2995716 3089142 3182630 3275603
53323 3275603 3369043 3464990 3564300 3665236 3764743 3860738 3952838 4041483 4127090 4209740 4288921
53312 4288921 4363593 4432855 4496419 4554088 4605229 4649343 4686829 4718353 4743670 4762048 4773836
53301 4773836 4780433 4782137 4777022 4762882 4739649 4708731 4670192 4621913 4561977 4490937 4411131 4324520
53289D324520r2378r6997j00124j02485j05173j07935j09295j08499j06592j05202
53279C289840j04787j04376j02840j00178r7543r5977r5157r3745r1067q7909
53269B316261q5264q2831p9472p4763o9259o3537n8018n3505n0611m8396m4857
53258A605748l9314l3243k8191k3971j9733j5789j3069j1319r158n879k299L12
53246A404095J544K104L197N539Q632J1247J2850J4178J6118J8651K1397K4441
53234A543993K7824L0841L2850L4313L6017L7790L9036M0235M2408M5222M7080
53223A957609M7360M7181M7453M7533M6563M5031M3897M2847M0658L7007L2948
53212B436087K9536K6731K3920K0900J8047J5610J3171R861N222k48n410r404
$$ plain form
53289 4324520 4232142 4135145 4035021 3932536 3827363 3719428 3610133 3501634 3395042 3289840
53279 3289840 3185053 3080677 2977837 2877659 2780116 2684139 2588982 2495237 2404170 2316261
53269 2316261 2230997 2148166 2068694 1993931 1924672 1861135 1803117 1749612 1699001 1650605 1605748
53258 1605748 1566434 1533191 1505000 1481029 1461296 1445507 1432438 1421119 1411961 1406082 1403783 1404095
53246 1404095 1405639 1407743 1410940 1416479 1425111 1436358 1449208 1463386 1479504 1498155 1519552 1543993
53234 1543993 1571817 1602658 1635508 1669821 1705838 1743628 1782664 1822899 1865307 1910529 1957609
53223 1957609 2004969 2052150 2099603 2147136 2193699 2238730 2282627 2325474 2366132 2403139 2436087
53212 2436087 2465623 2492354 2516274 2537174 2555221 2570831 2584002 2593863 2599085 2598837 2593427 2584023
53200B584023j2224j4572j7314k0902k5067k9203l3142l7323m1997m6678n0747
53189B254854n4302n7803o1114o3459o4285o3804o2769o2091o2275o2694o1894
53178A578364n9293n6181n4189n3142n1589m9178m7133m6310m6093m5643m4979
53167A024634m4358m3578m2526m1459m0139l7645l3709k9524k6513k4943k4204
53156F36036k3668k2715k0866j8534j6812j5915j4787j2906j1246j0476r595p784
53144D50732o434p243r195r644q248p414q478r656q848o632n128n140n878o640
53130C46154p320p583o960n737m841m745n169n767o353o452n503l738k231j701
53116B72054j819k071k656l856m926m584k730q21k18p71j548k232k972l423l039
$$ plain form
53200 2584023 2571799 2557227 2539913 2519011 2493944 2464741 2431599 2394276 2352279 2305601 2254854
53189 2254854 2200552 2142749 2081635 2018176 1953891 1890087 1827318 1765227 1702952 1640258 1578364
53178 1578364 1519071 1462890 1408701 1355559 1303970 1254792 1207659 1161349 1115256 1069613 1024634
53167 1024634 980276 936698 894172 852713 812574 774929 741220 711696 685183 660240 636036
53156 636036 612368 589653 568787 550253 533441 517526 502739 489833 478587 468111 458516 450732
53144 450732 444298 437055 427860 418216 409968 402554 394076 384420 375572 368940 363812 358672 352794 346154
53130 346154 338834 331251 324291 318554 313713 308968 303799 298032 291679 285227 279724 275986 273755 272054
53116 272054 270235 268164 265508 261652 256726 252142 249412 248591 248373 247602 246054 243822 240850 237427 234388
53101B34388k281k298l146l421k211n77k42j424k802l208k648j881j664k168k729
53086B01688k388j130j13k01q76j273j550k269k966k657j521p15n88m10pk92j643
53069A81089l060l435k682j162Q34K371K078J51j050J32K137K189K12j185o07
53054A78012L96R8p42l97Q91J204k32k014k498j741j081j508k852m097m239l135
53038A56065j754j234j663k170k188k024j925j465l79O34P40P9o29j185j751k032
53022A37119j728j499k171l093k687r05M10J30o51n58Ko1n57n25J03P91J664K973
53004A28757L839L151J430K70K1l28j052j221o08l43j011j639j351o88l76n3P48
52987A29546J398J135L55j78o00j268j419j3K292L449K537R07M41J505L052M075
$$ plain form
53101 234388 232107 229809 226663 223242 221031 220454 220212 218788 215986 212778 210130 208249 206585 204417 201688
53086 201688 199300 198170 198057 197856 196980 195707 194157 191888 188922 186265 184744 184029 183441 183031 183024 182732 181089
53069 181089 178029 174594 171912 170750 171584 173955 176033 176184 175134 175266 177403 179592 179804 178619 178012
53054 178012 178408 178506 177764 177367 178258 179462 179230 177216 174718 172977 171896 170388 167536 163439 159200 156065
53038 156065 154311 153077 151414 149244 147056 145032 143107 141642 141263 141897 142637 142716 142087 140902 139151 137119
53022 137119 135391 133892 131721 128628 125941 125036 125446 125576 124925 124367 124369 124308 123751 123226 123329 124120 125784 128757
53004 128757 132596 135747 137177 137447 137468 137140 136088 134867 134259 133916 132905 131266 129915 129227 128851 128798 129546
52987 129546 130944 132079 132434 132256 131656 130388 128969 128956 131248 134697 137234 138141 138582 140087 143139 147214
52971A47214M338L974L029J668N08L30J181K123K181J395M99k52j210k340k968
52956A61670k743k121j618j225r39j164k068l175m071m848n442n258m155l019
52942A19824k621k540k005j182p77r17j443k639m531n823m955k205M41J600J593
52927I1820J214O30j36p32j008j240j461j247n77j00j49k34N6L34J33k53k69R8
52909H6879N65J140J755J700K79k049l849m083k905j177L03J094J211J069J045
52894H2977Q96O1j346k206j531K14J342P06j071k342k203j111J32J387K823L927
52878H2655L670J727q37k404k244j025k8J06j33J66J158K011J900R71K3m89p37
52861H6490r26r12m87L09J304K300K923K703J561J13q43j109j139j273j144k03
$$ plain form
52971 147214 151552 155526 158555 160223 160731 161061 162242 164365 166546 167941 168440 168188 166978 164638 161670
52956 161670 158927 156806 155188 153963 153024 151860 149792 146617 142546 137698 132256 126998 122843 119824
52942 119824 117203 114663 112658 111476 110699 109782 108339 105700 101169 95346 90391 88186 88627 90227 91820
52927 91820 93034 93664 93528 92796 91788 90548 89087 87840 87263 87163 87014 86780 86836 87170 87303 87050 86781 86879
52909 86879 87444 88584 90339 92039 92318 90269 86420 82337 79432 78255 78558 79652 80863 81932 82977
52894 82977 83873 83934 82588 80382 78851 79065 80407 81113 80042 77700 75497 74386 74518 75905 78728 82655
52878 82655 86325 88052 87215 84811 82567 81542 81514 81620 81487 81653 82811 84822 86722 87693 87716 87227 86490
52861 86490 85564 84652 84165 84474 85778 88078 91001 93704 95265 95378 94535 93426 92287 91014 89870 89667
52845H9667J196J786Q33p23j308p00j60l75l91Q20K648L684L691L489L198K075
52829A09430K48o96L69K545M008M123L749L756M072M061L356K187J203R85J509
52814A44905K046J793O66n43q67m9J156J705J262K89q11k070l227l387k302j326
52798A39240j894l292l325j361Q13J665J899K648L050J440j741m039m121l266
52784A27716l287m244m953m820m259l696l027k025q07J65M27n1o52n94J77Q01
52768I6871M97m11p99p6J132J618P88q73k313k722j936l93J102J698J020m39j688
52751I3076k202k396k917l558l356j823K53J557J676J400J531J734R62r89k778
52736H2170k786q81J412K568K461J917J454R80M76K49L08J00o65j318r40L49J449
$$ plain form
52845 89667 90863 92649 93482 92759 91451 90751 90591 90216 89825 90645 93293 96977 100668 104157 107355 109430
52829 109430 109678 108982 109351 111896 115904 120027 123776 127532 131604 135665 139021 141208 142411 143396 144905
52814 144905 146951 148744 149410 148867 148000 147951 149107 150812 152074 152363 151552 149482 146255 142868 140566 139240
52798 139240 137346 134054 130729 129368 130181 131846 133745 136393 139443 140883 139142 135103 130982 127716
52784 127716 124429 120185 115232 110412 106153 102457 99430 97405 96598 96763 97190 97139 96487 95893 96070 96871
52768 96871 97368 96957 96158 96082 97214 98832 99620 98747 96434 93712 91776 91383 92485 94183 95203 94764 93076
52751 93076 90874 88478 85561 82003 78647 76824 77077 78634 80310 81710 83241 84975 85937 84948 82170
52736 82170 79384 78503 79915 82483 84944 86861 88315 89295 89771 90020 90328 90428 89763 88445 87505 87854 89303
52719H9303J692J606J958K606K904K842K921K966K092K34j186r26K67N66m60j252
52703A08133l82J603L019L094K551K353K558K532J992J523J941L189M076L420
52689A41602J434m45j066o79m50j119k330l069k693j680j274k097l368l908l758
52674A15100l929m546m378k781j095j003k119k457j146M97R05K04k76K10J224
52659I4410J902J804J143O54J148K805M785N742M867K513l6j444j217l9P66K59
52643A20062j364k976l414k403p69K59J30o81j500k384l760n275n572l746p16
52628H5891J360J124p72k545l023k365j297j22J318K861L638K752L99j979k955
52613H4285k504j797j590j324j41J613K616K152Q95j05m27j14O99J482J268j84
$$ plain form
52719 89303 90995 92601 94559 97165 100069 102911 105832 108798 110890 111124 109938 109012 109279 109845 109385 108133
52703 108133 107751 109354 112373 115467 118018 120371 122929 125461 127453 128976 130917 134106 138182 141602
52689 141602 143036 142591 141525 140846 140396 139277 136947 133878 131185 129505 128231 126134 122766 118858 115100
52674 115100 111171 106625 102247 99466 98371 97368 95249 92792 91646 92143 93048 93252 92976 93186 94410
52659 94410 96312 98116 99259 99913 101061 103866 108651 114393 119260 121773 121737 120293 119076 119037 119803 120062
52643 120062 118698 115722 112308 109905 109136 109395 109525 108844 107344 104960 101200 95925 90353 86607 85891
52628 85891 87251 88375 87603 85058 82035 79670 78373 78251 79569 82430 86068 88820 89219 87240 84285
52613 84285 81781 79984 78394 77070 76929 78542 81158 83310 84205 84100 83673 83559 84258 85740 87008 86824
52597H6824j659j755p28j00n53j207j094m02J48L25L18L61P90J793K767K693J559
52580I0080N36K02l19j640k568j651M73J832J865J692J750R76j014k610k119O1
52564H7546K247L657M649N227M747L143J543J086J710K421K455J830R41L9o69
52549A22572p72N1J371K170J955J333J065J025P39M77P79J025k41l111n484n274
52533A19680k737K0J360J239M95j40m85q77j658k483k544j854j547k367l494l701
52517I8907l012k241j484m66J22p50k479l128k104q84m66J70J862L110J900j105
52501H7952l155k900j603p27j10R88K352L231L384K960K038R01K24K76M63K01
52485I6475k56m67o87j382k190k265j392q9J095J692J091p00k298k143o34K09
$$ plain form
52597 86824 85165 83410 82682 82582 82029 80822 79728 79326 79474 79799 80117 80478 81268 83061 85828 88521 90080
52580 90080 90616 90818 90499 88859 86291 84640 85113 86945 88810 90502 92252 93228 92214 89604 87485 87546
52564 87546 89793 93450 98099 103326 108073 111216 112759 113845 115555 117976 120431 122261 123202 123241 122572
52549 122572 121800 121851 123222 125392 127347 128680 129745 130770 131509 131986 132765 133790 133549 130438 124954 119680
52533 119680 116943 116963 118323 119562 120057 119917 119432 118555 116897 114414 111870 110016 108469 106102 102608 98907
52517 98907 95895 93654 92170 91704 91826 91076 88597 85469 83365 82481 82015 82185 84047 87157 89057 87952
52501 87952 84797 81897 80294 79567 79457 80445 82797 86028 89412 92372 94410 95311 95535 95811 96274 96475
52485 96475 96219 95752 95065 93683 91493 89228 87836 87747 88842 90534 91625 90925 88627 86484 85850 86059
52469H6059m54j111k97J095J186n1q29j46J195K312L504N051N873M578J455j489
52453A07931k544j777n04J13j26p25j251j748k387k722j839L39K285K214L18j144
52437I6433m58J500K408J278p84k356l111l216k416n68J458K428K213J811J947
52422I8567K322K354J942J244L68m58q44p84p63r96r86k82P65J435J477J033J53
52405A06547r66j682j623j494k206l145k391P04M071M973L200J253J158K072J700
52390A12171m61k423k479j488j434k355k281l81J505J460K71J85J531K430J768
52375A08019O10J21j95j127j951j380L25J727K299K716L055K307J48k011k684
52360A11979k228k046k445k379j222K85J231J664K004K028J335L80N3L31K66m69
$$ plain form
52469 86059 85605 84494 84197 85292 86478 86427 85598 85452 86647 88959 92463 97514 103387 107965 109420 107931
52453 107931 105387 103610 103106 103219 103093 102368 101117 99369 96982 94260 92421 92760 95045 97259 97577 96433
52437 96433 95975 97475 99883 101161 100377 98021 94910 91694 89278 88710 90168 92596 94809 96620 98567
52422 98567 100889 103243 105185 106429 106797 106339 105495 104711 103948 102952 101966 101684 102449 103884 105361 106394 106547
52405 106547 105581 103899 102276 100782 98576 95431 93040 93744 97815 102788 105988 107241 108399 110471 112171
52390 112171 111710 109287 106808 105320 103886 101531 99250 98869 100374 101834 102105 102290 103821 106251 108019
52375 108019 108629 108750 108555 107428 105477 104097 104422 106149 108448 111164 114219 116526 116674 114663 111979
52360 111979 109751 107705 105260 102881 101659 101944 103175 104839 106843 108871 110206 110586 110639 110970 111236 110767
52344A10767r33k68R70J487P37p97k338l160k652r78O13J051Q38J217K041J796
52328A10391k7j866k180j478j223j539j300k14N98L43j72M13K152L609L421J760
52312A12688J65m5R38J851K007K001K536L200L059K080J183Q91P00Or32j346q88
52295A30094J17J124J763J878J511Q83M28O23J571K633K775J621l5j049r70j8
52279A44949J542L251M029L016J013n5L91O38q73l073l572j978m12n04j321j097
52263A45944J49R19O95O02J589K993L400K359O66n82p47J21J284J725J180O23
52247A62920J243K957M504M979M650M121L468K656K213K703L629L677K203J31
52233B06054q56J01K333M362N275N327N168M691L166O89j275j393j93N75J69m13
$$ plain form
52344 110767 109834 109566 110536 112023 112760 111963 109625 106465 103813 102835 103448 104499 105337 106554 108595 110391
52328 110391 110364 108498 106318 104840 103617 102078 100778 100564 101162 101505 101333 101746 103898 107507 110928 112688
52312 112688 112853 112808 113746 115597 117604 119605 122141 125341 128400 130480 131663 132554 133254 133260 132328 130982 130094
52295 130094 130211 131335 133098 134976 136487 137370 137798 138421 139992 142625 145400 147021 146986 145937 144967 144949
52279 144949 146491 149742 153771 156787 157800 157745 158136 158774 157901 154828 151256 149278 148866 148362 147041 145944
52263 145944 146093 147012 147707 148309 149898 152891 156291 158650 159316 158734 157987 158108 159392 161117 162297 162920
52247 162920 164163 167120 171624 176603 181253 185374 188842 191498 193711 196414 200043 203720 205923 206054
52233 206054 205198 205299 207632 211994 217269 222596 227764 232455 235621 236310 235035 233642 233449 234024 234193 233780
$$ [...]
##END NTUPLES=NMR SPECTRUM
##END=
