##TITLE=Coffee green (ROVE100 + 1.5mL buffer 50/50,  450uL extracto + 50uL (D2O+TMS))
without heating, vortex and centrifuged, temperature 0oC.
##JCAMPDX= 6.0         $$ Bruker NMR JCAMP-DX V2.0
##DATA TYPE= NMR SPECTRUM
##DATA CLASS= NTUPLES
##ORIGIN= Bruker BioSpin GmbH
##OWNER= Administrator
$$ 1.72 TOPSPIN		Version 2.1
$$ 2012-05-22 16:17:58.668 -0700  Administrator@X
$$ Compression mode = diff/dup
##.OBSERVE FREQUENCY= 400.131882
##.OBSERVE NUCLEUS= ^1H
##.ACQUISITION MODE= SIMULTANEOUS (DQD)
##.ACQUISITION SCHEME= undefined
##.AVERAGES= 64
##.DIGITISER RES= 22
##SPECTROMETER/DATA SYSTEM= spect
##.PULSE SEQUENCE= noesygppr1d
##.SOLVENT NAME= H2O+D2O
##.SHIFT REFERENCE= INTERNAL, H2O+D2O, 1, 14.97974
##AUDIT TRAIL= $$ (NUMBER, WHEN, WHO, WHERE, PROCESS, VERSION, WHAT)
$$ ##TITLE= Audit trail, TOPSPIN		Version 2.1
$$ ##JCAMPDX= 5.01
$$ ##ORIGIN= Bruker BioSpin GmbH
$$ ##OWNER= Administrator
$$ $$ C:\Bruker\TOPSPIN/data/jwist/nmr/11-coffee-green-quantification-2/401/pdata/1/auditp.txt
$$ ##AUDIT TRAIL=  $$ (NUMBER, WHEN, WHO, WHERE, PROCESS, VERSION, WHAT)
(   1,<2011-11-18 18:03:13.888 -0500>,<Administrator>,<TOPSPIN>,<go>,<TOPSPIN 2.1>,
      <created by zg
	started at 2011-11-18 17:54:19.216 -0500,
	POWCHK enabled, PULCHK disabled,
       configuration hash MD5:
       DA 63 81 1B EF 4C B5 72 B4 DF EA D9 B4 DB 4C 08
       data hash MD5: 64K
       7A 46 F1 16 F6 25 97 CA 7B 7E BA D5 53 C0 50 13>)
(   2,<2011-11-18 18:03:30.529 -0500>,<Administrator>,<TOPSPIN>,<proc1d>,<TOPSPIN 2.1>,
      <Start of raw data processing
       efp LB = 0 FT_mod = 6 PKNL = 1 PHC0 = 0 PHC1 = 0 SI = 32K 
       data hash MD5: 32K
       1E D7 F5 9D A5 3B 8A 23 B2 23 92 C0 F7 CC 42 87>)
(   3,<2011-11-18 18:03:30.904 -0500>,<Administrator>,<TOPSPIN>,<proc1d>,<TOPSPIN 2.1>,
      <pk PHC0 = 24.37866 PHC1 = 0 
       data hash MD5: 32K
       26 7A AD B2 86 DE FA C5 14 96 1C 42 1F 5E 7A 8C>)
$$ ##END=
$$ 
$$ $$ hash MD5
$$ $$ 04 71 D5 9C 01 A5 CD 64 34 24 33 F5 C6 21 77 3B
##$RELAX= 
##$RELAX= 
##$RELAX= 
##$RELAX= 
##$RELAX= 
$$ Bruker specific parameters
$$ --------------------------
##$DU= <Z:>
##$EXPNO= 401
##$NAME= <11-coffee-green-quantification-2>
##$PROCNO= 1
##$TYPE= <nmr>
##$USER= <jwist>
##$ACQT0= -8.17239633613122
##$AMP= (0..31)
100 100 100 100 100 100 100 100 100 100 100 100 100 100 100 100 100 100
100 100 100 100 100 100 100 100 100 100 100 100 100 100
##$ANAVPT= -1
##$AQSEQ= 0
##$AQ_mod= 3
##$AUNM= <au_prof>
##$AUTOPOS= <>
##$BF1= 400.13
##$BF2= 400.13
##$BF3= 400.13
##$BF4= 400.13
##$BF5= 400.13
##$BF6= 400.13
##$BF7= 400.13
##$BF8= 400.13
##$BYTORDA= 0
##$CFDGTYP= 0
##$CFRGTYP= 9
##$CHEMSTR= <none>
##$CNST= (0..63)
1 1 145 1 1 1 1 1 1 1 1 1 1 1 1 1 1 1 1 1 1 1 1 1 1 1 1 1 1 1 1 1 1 1 1
1 1 1 1 1 1 1 1 1 1 1 1 1 1 1 1 1 1 1 1 1 1 1 1 1 1 1 1 1
##$CPDPRG= <>
##$CPDPRG1= <>
##$CPDPRG2= <>
##$CPDPRG3= <>
##$CPDPRG4= <mlev>
##$CPDPRG5= <mlev>
##$CPDPRG6= <mlev>
##$CPDPRG7= <mlev>
##$CPDPRG8= <mlev>
##$CPDPRGB= <>
##$CPDPRGT= <>
##$D= (0..63)
$$ [...]
0 120 120 120 120 120 120 120
##$TP= (0..7)
150 150 150 150 150 150 150 150
##$TP07= 0
##$TPNAME0= <>
##$TPNAME1= <>
##$TPNAME2= <>
##$TPNAME3= <>
##$TPNAME4= <>
##$TPNAME5= <>
##$TPNAME6= <>
##$TPNAME7= <>
##$TPOAL= (0..7)
0.5 0.5 0.5 0.5 0.5 0.5 0.5 0.5
##$TPOFFS= (0..7)
0 0 0 0 0 0 0 0
##$TUNHIN= 0
##$TUNHOUT= 0
##$TUNXOUT= 0
##$USERA1= <user>
##$USERA2= <user>
##$USERA3= <user>
##$USERA4= <user>
##$USERA5= <user>
##$V9= 5
##$VALIST= <valist>
##$VCLIST= <CCCCCCCCCCCCCCC>
##$VD= 0
##$VDLIST= <DDDDDDDDDDDDDDD>
##$VPLIST= <PPPPPPPPPPPPPPP>
##$VTLIST= <TTTTTTTTTTTTTTT>
##$WBST= 2048
##$WBSW= 25
##$XGAIN= (0..3)
0 0 0 0
##$XL= 0
##$YL= 0
##$YMAX_a= 5339506
##$YMIN_a= -2003934
##$ZGOPTNS= <>
##$ZL1= 120
##$ZL2= 120
##$ZL3= 120
##$ZL4= 120
##$ABSF1= 0
##$ABSF2= 0
##$ABSG= 0
##$ABSL= 0
##$ALPHA= 0
##$AQORDER= 0
##$ASSFAC= 0
##$ASSFACI= 0
##$ASSFACX= 0
##$ASSWID= 0
##$AUNMP= <proc_prof1d>
##$AXLEFT= 0
##$AXNAME= <>
##$AXNUC= <1H>
##$AXRIGHT= 0
##$AXTYPE= 0
##$AXUNIT= <>
##$AZFE= 0.1
##$AZFW= 0.1
##$BCFW= 0
##$BC_mod= 0
##$BYTORDP= 0
##$COROFFS= 0
##$CY= 15
##$DATMOD= 1
##$DC= 0
##$DFILT= <>
##$DTYPP= 0
##$F1P= 0
##$F2P= 0
##$FCOR= 0.5
##$FTSIZE= 32768
##$FT_mod= 6
##$GAMMA= 0
##$GB= 0
##$INTBC= 1
##$INTSCL= 1
##$ISEN= 128
##$LB= 0
##$LEV0= 0
##$LPBIN= 0
##$MAXI= 10000
##$MC2= 0
##$MEAN= 0
##$ME_mod= 0
##$MI= 0
##$NCOEF= 0
##$NC_proc= -7
##$NLEV= 6
##$NOISF1= 0
##$NOISF2= 0
##$NSP= 0
##$NTH_PI= 0
##$NZP= 0
##$OFFSET= 14.97974
##$PC= 1
##$PHC0= 24.37866
##$PHC1= 0
##$PH_mod= 1
##$PKNL= yes
##$PPARMOD= 0
##$PPDIAG= 0
##$PPIPTYP= 0
##$PPMPNUM= 2147483647
##$PPRESOL= 1
##$PSCAL= 4
##$PSIGN= 0
##$PYNMP= <proc.py>
##$REVERSE= no
##$SF= 400.13
##$SI= 32768
##$SIGF1= 0
##$SIGF2= 0
##$SINO= 400
##$SIOLD= 32768
##$SPECTYP= <>
##$SREGLST= <1H.CDCl3>
##$SSB= 0
##$STSI= 32768
##$STSR= 0
##$SW_p= 8223.6842105263
##$SYMM= 0
##$S_DEV= 0
##$TDeff= 65536
##$TDoff= 0
##$TI= <>
##$TILT= no
##$TM1= 0
##$TM2= 0
##$TOPLEV= 0
##$USERP1= <user>
##$USERP2= <user>
##$USERP3= <user>
##$USERP4= <user>
##$USERP5= <user>
##$WDW= 1
##$XDIM= 32768
##$YMAX_p= 466341346
##$YMIN_p= -819421
##$CURPLOT= <Network HP LaserJet P1505>
##$CURPRIN= <$Network HP LaserJet P1505>
##$DFORMAT= <normdp>
##$LAYOUT= <+/1D_H.xwp>
##$LFORMAT= <normlp>
##$PFORMAT= <normpl>
##$SURQMSG= 1
$$ End of Bruker specific parameters
$$ ---------------------------------
##NTUPLES= NMR SPECTRUM
##VAR_NAME=  FREQUENCY,     SPECTRUM/REAL,   SPECTRUM/IMAG
##SYMBOL=    X,             R,               I
##VAR_TYPE=  INDEPENDENT,   DEPENDENT,       DEPENDENT
##VAR_FORM=  AFFN,          ASDF,            ASDF
##VAR_DIM=   32768,         32768,           32768
##UNITS=     HZ,            ARBITRARY UNITS, ARBITRARY UNITS
##FACTOR=    0.250966925370065, 1,           1
##FIRST=     8223.43324360093, 189022,       -514236
##LAST=      0,             -153592,         -723402
##MIN=       0,             -819421,         0
##MAX=       8223.43324360093, 466341346,    0
$$ Real data points
##PAGE= N=1
##DATA TABLE= (X++(R..R)), XYDATA
$$ [...]
22995 783856 551075 614825 300426 929898 575987 1278283 1016340 648727 986974 865249
22985 865249 742492 772345 582286 816268 1055741 962274 586548 573723 929854 914281
22975 914281 370777 970753 827072 601725 740681 1369712 1032435 666497 836905 1553263
22965 1553263 969771 1248676 1119683 972106 1217192 1141471 1042752 938671 1294321 908968
22955 908968 1387314 833654 1627569 1789386 1366826 1247698 1701862 1860852 2034350 2129783
22945 2129783 2318807 3233556 3471325 4862193 6046446 7632216 9789771 11390939 13986643
22936 13986643 16029259 18470096 20273957 21999208 23451744 23567676 23916836 23308147
22928 23308147 23299654 21129840 20150502 17705159 15973993 13843252 11698132 9946444 7860843
22919 7860843 7009576 5630829 4854519 4264340 3934272 4112968 4446370 5159694 6341712
22910 6341712 7210125 8928292 11086886 13958880 15860182 19678323 22627448 26703319
22902 26703319 29775521 33190636 35462622 37549530 39621217 40789637 40670808 40042437
22894 40042437 39227732 36893765 34588709 31942526 28561797 25578896 22545024 19774838
22886 19774838 16974114 14867211 13187078 11943922 11371611 11421811 10700392 11286135 11982722
22877 11982722 13235334 14404491 15111517 16436995 18088454 19116589 19442124 19588588
22869 19588588 20083241 19949230 19285072 18624532 17086244 15603754 14313724 13164050 11243542
22860 11243542 9428085 8194089 6775586 5568177 4558951 4144551 3357586 2685441
22852 2685441 2744192 2005894 1807242 1658628 1418571 1491161 846118 1180745 1267687 986040
22842 986040 743168 1356849 668652 1119714 1077110 625774 1026449 1094809 703591 1126118
22832 1126118 909212 677770 215510 915124 686832 644002 902607 983251 302607 749718
22822 749718 845527 747375 828160 1100438 584582 1080555 717055 868330 306320 1158481
22812 1158481 1165643 925640 833324 1259362 973808 726384 916655 459951 638214 728340
22802 728340 627405 691213 904163 891491 735707 516369 745213 520553 485530 882580
22792 882580 479837 326383 1298688 992657 442949 859959 989370 749655 761529 486309
22782 486309 427137 373725 1082032 1134541 779243 738091 1078864 757372 887513 698091
22772 698091 382412 525914 1001838 658091 750163 605194 455169 551454 491591 512400
22762 512400 1081053 382468 301576 590879 883089 441488 669253 965806 547239 715722
22752 715722 893695 595358 420597 817380 1050734 320443 488922 420729 491401 736506
22742 736506 477640 642958 419265 778792 197868 598252 734089 765805 623004 478867
22732 478867 427911 335064 358006 1271376 547489 988646 477355 392471 639357 512605
22722 512605 781930 752408 586876 621094 1085580 1051021 568948 649853 278985 769195
22712 769195 369607 -16856 623754 326513 485022 745719 597979 582437 814758 957313
22702 957313 288625 289321 437497 547778 583157 127232 805233 912375 1245249 582343
22691 680536 681494 931927 206675 903607 1018743 881505 1079437 848138 1270849 532203
22680 860075 443942 628078 434273 733064 843615 366717 663574 413693 306088 768855
22670 768855 970407 493163 236884 696878 940745 948704 993347 16761 679866 506169
22660 506169 305107 617675 393351 770003 964272 821177 252410 728569 545131 305731
22650 305731 382679 659881 1018279 524835 445348 609866 862243 1163676 262933 455789
22640 455789 680140 399986 529681 448465 1061118 727238 279670 531121 825190 1242146
22630 1242146 568595 885569 799478 964858 690385 928057 573849 565688 897167 829623
22620 829623 692986 719122 963230 800996 1335788 869877 604367 530318 1061909 1222515
22610 1222515 952095 780532 416890 1130238 1013188 850523 1326049 1100065 683338
22601 683338 1107899 1040452 1093588 831667 825012 1224028 959937 1048483 795833 1060374
22591 1060374 1039713 1066888 1155944 771445 943833 938634 1311886 881932 948820 1335591
22581 1335591 967763 682258 1148939 630988 975436 1179019 954792 962852 188113 460802
22571 460802 1121171 1033435 805513 598703 1001612 1013332 1148147 943635 675260 1378773
22561 1378773 1146581 1014495 921955 687511 778824 1599934 1039932 900727 1120094 675705
22551 675705 685816 1112323 1507088 997715 960182 1031880 1124972 959748 1398370 831701
22541 831701 1051644 1597047 652041 599949 614643 975412 1130931 517267 1133017 1160254
22531 1160254 1215855 695513 927900 977324 885042 949354 480442 582260 1199777 986805
22521 986805 1096700 691713 918240 943418 930631 933744 1569889 883694 1040776 899156
22511 899156 649648 1514803 1245583 1110818 437837 979141 891054 1238779 1343540 607711
22500 1009950 891610 735203 893292 793584 909263 879337 834076 1635333 578125 988474
22490 988474 1127007 999210 1052964 888949 776633 1147485 812139 1272381 712600 915799
22480 915799 1004882 1141860 837318 987687 917784 768550 901302 1259437 1099843 970363
22470 970363 1157055 997437 787414 1036335 1606199 1217710 507063 1146201 907824 528139
22460 528139 1135074 1209213 1193002 1139423 742234 569830 1247977 764469 1394583 1000841
22450 1000841 942934 1061185 835055 1243899 1134407 860673 965165 634317 782105 839997
22440 839997 1455172 1020574 958619 1008848 1215652 825393 924754 894155 1039592 668203
22430 668203 563777 822817 1298918 1415072 856047 1047954 1187501 913475 882340 709918
22420 709918 951979 658723 704721 1188136 447841 831700 1520601 995310 911487 957961
22410 957961 1197624 1148902 1007756 680552 1208491 994531 1108183 1024875 1128710 731162
22400 731162 1115875 1416536 637745 776160 1438365 1105059 850565 1273782 990819 1275229
22390 1275229 738283 769301 963495 851761 941932 872503 1055787 1042109 875757 862640
22380 862640 1406732 1230666 1086727 649734 961864 604791 1070675 788626 979182 1104747
22370 1104747 756273 1271635 1322267 1217084 958043 686225 1199737 1411189 743542 1190375
22360 1190375 976793 1237535 989720 1104230 946179 846309 766894 899178 808076 845150
22350 845150 874188 1115845 1045041 1015780 1012405 1506892 1620580 913403 773825 782250 1035175
22339 1035175 1179924 1504543 1554954 787696 1084165 1462818 1338422 1738248 2219516 1900181
22329 1900181 2179576 2223178 1995611 2133014 2865238 2523008 1825082 2158451 1976521 1779003
22319 1779003 1613091 1578217 1115751 1099386 1219413 987733 1616783 1114942 1219067 1076173
22309 1076173 764969 1190591 1807018 1614027 912545 1176413 613752 1736371 1344776
22300 1344776 1553531 1284860 1564985 1657492 1671990 929819 1399805 1293665 1488499 1278293
22290 1278293 1264623 988692 1991302 904996 1379126 1575088 1498658 1047517 1240560 1003062
22280 1003062 1697458 1439262 1369992 1365572 1181693 1696652 1351187 1493376 1707720 1697155
22270 1697155 1580484 1469229 1343766 1430751 1742641 1698513 1503048 1657670 1178767 1780763
22260 1780763 1386109 1283869 1332793 1302585 2000680 1678850 1846148 1549183 1451019 1548240
22250 1548240 1270777 1252989 1777663 1641463 1612109 1551878 1555027 1983602 1707081 1595122
22240 1595122 1531842 1685241 2042001 1757935 1712631 1615046 1576205 1722060 1443795 1744358
22230 1744358 1150548 2022457 1732038 1391747 1814871 1625968 1574069 1136890 1480951 1680243
22220 1680243 1550219 1478391 1628391 1424065 1231650 2127821 1362771 1549563 1454305 1489521
22210 1489521 1574094 1625923 1656130 1819849 1485457 1364407 1555223 1338875 1325283 1447517
22200 1447517 1850187 1512755 1801459 1964594 1653883 1657046 1352168 1379282 1982698 1995117
22190 1995117 1675602 1277074 1307781 1261888 1646866 1537804 948719 1066061 1310194 1606641
22180 1606641 990745 1817477 1625337 1640465 1179079 936475 1550255 1489258 1103066 1506647
22170 1506647 1257970 1666582 1094235 1189537 1841762 1621701 1139779 1183473 1218317 1315775
22160 1315775 1575482 1659152 1110328 919048 1647437 1006951 1095490 1124662 1928461 1322731
22150 1322731 1476274 1487686 885878 1127306 1301549 1259626 1472228 1258132 1626436 1092860
22140 1092860 1354196 1060231 1081945 1471607 1567093 1646677 1315142 1538046 1741590 1208819
22130 1208819 1289293 1387787 1650088 1484237 1411295 1232053 1288692 1032682 1008333 1083040
22120 1083040 1088306 1223638 1358923 1227265 1545654 1261578 1050061 1195852 1464642 811890
22110 811890 1711565 1217714 981232 1594044 1547011 1422697 1450589 1393231 1612710 904489
22100 904489 1188454 1013758 1086067 1325843 1276415 1160962 1494094 1392663 1063277 1552057
22090 1552057 1323029 1252570 1124519 1558404 1273917 1474291 1771136 1802104 1129911 1479174
22080 1479174 1249936 1623229 1412485 1374432 1381465 1568808 1331889 1331202 1082195 1710089
22070 1710089 1289092 1580244 1535094 1571475 1391893 1572117 1815429 1755142 1903865 1652408
22060 1652408 1651471 1500674 1339425 1894497 1372519 1499128 2203782 2151077 1736479 1578632
22050 1578632 1831573 1254742 1573588 1671551 1851113 1975309 1338823 2049770 1692407 2061079
22040 2061079 980034 1696121 1832360 1599703 1495003 1722391 1207035 1719449 1696255 1827675
22030 1827675 1477637 1951429 1773121 1925453 1819693 1478500 2162508 1422087 1973777
22021 1973777 1456576 1916840 1782642 1703434 2070267 1909569 1556128 1651399 1308248 2245674
22011 2245674 1766142 1696759 1746653 1745733 1489730 2045665 1582366 1892166 1682855 1776463
22001 1776463 2126897 1699677 1558084 1443635 1845340 1828768 1644722 2079683 1376936 1698126
21991 1698126 1791497 1311446 1962384 1613985 1295853 1059671 1375213 1354121 1465751 1974893
21981 1974893 1570905 1711680 1984233 1933484 1710823 1804971 1770018 1892776 1707414 1985722
21971 1985722 1540356 2070799 2097286 1523857 1983834 1676939 1596055 1360607 1829508 1359134
21961 1359134 1456231 2129926 1704064 1238943 1945343 1602320 1230588 1800696 1459263 1726941
21951 1726941 2123617 1767394 1789516 1784018 1520348 1874917 2247390 1233574 1504773 1820852
21941 1820852 1913623 1257450 1776379 1944505 1467358 1583372 2005009 1405292 1810581 1794843
21931 1794843 1705763 1802254 1901184 1834853 1850806 2275682 1491304 1600511 1758159 1551214
21921 1551214 1728895 1483869 2343889 1675155 1636557 1845380 1907132 1780861 1945558 1374186
21911 1374186 1800449 1525360 1212287 2105692 1689898 1368752 1634764 1711926 1035699 1737946
21901 1737946 1408498 1715349 1060723 1398719 1381170 1379697 1777880 1799742 1715312 1465349
21891 1465349 1338072 1787799 1599569 1595576 1337607 1966817 1125497 1864894 1520013 1862373
21881 1862373 1758201 1868353 1415458 1933362 1778632 1373467 1526021 1622510 2022749 1973986
21871 1973986 1936293 2243669 2155708 1765144 2005064 1745978 1875598 1756836 1352692 1929166
21861 1929166 1611104 1623825 1939150 1765658 2083560 1634276 1770137 1449925 1473962 1690050
21851 1690050 1475219 991378 1896504 1491488 1259866 1795487 1888916 1952517 1415827 1451100
21841 1451100 1639024 1910436 1766313 1878553 1736812 1472860 1527735 1588591 1440969 993180
21831 993180 1975726 1843609 1331874 1865652 1740530 1487162 1098173 1611825 1241322 1850662
21821 1850662 1639601 1978907 1904454 1543209 1684407 1985019 1792101 1554187 1186252 1380689
21811 1380689 1475603 1856869 1763842 1898592 1408100 1861184 1583530 1724276 1485035 1222980
21801 1222980 1584953 1593111 1633660 1279422 1472350 1443497 1646042 1315425 1495774 1979666
21791 1979666 1497780 1480067 1464176 1558554 1524762 1574158 2048918 1943029 1303874 1855023
21781 1855023 1731696 1441968 1876140 949894 1126592 1023023 1456068 1662821 1557776
21772 1557776 1585309 1627376 1404280 1522308 1211673 1331508 1596299 1825252 1219996 1593414
21762 1593414 1534661 1790183 2153378 1408236 2394839 1885346 1779630 2407365 2097155 1874005
21752 1874005 1953764 1455135 2072991 2329296 2756048 2325793 2274911 3247418 2510132 2774261
21742 2774261 3053885 3932903 3765986 4699157 5168538 5487748 6982453 7746758 8219330
21733 8219330 9828164 10984745 11897498 12818287 12868519 13062178 12888536 12612179 12291048
21724 12291048 10963310 10213015 9040961 8371632 7981714 7612290 7313837 6820675 6492591
21715 6492591 7094152 7645707 8049078 8764131 9302618 10334342 11887656 13254857 14138682
21706 14138682 15547022 16307141 17477558 18084901 18783828 18936335 19433884 19063537 18731922
21697 18731922 17794409 17109116 16547600 15137392 13952461 12624260 11721140 10453907 8929593
21688 8929593 7945833 7963772 6787477 6866497 6679284 6791899 6306117 7402094 7613898
21679 7613898 8401521 8467284 10187848 10839851 11711436 11891169 12285861 12479724 12100366
21670 12100366 12151698 10848411 10445168 9315814 8153669 6868632 5675893 5655070 4531455
21661 4531455 4414943 3977442 3744732 3118587 3085930 2529304 2512389 2797153 2460941 2307407
21651 2307407 1999559 2244545 2168212 2032343 2061144 1905462 1658335 2037049 1932074 2206973
21641 2206973 1508213 1995151 1402906 1796890 1684216 1745468 1908458 1416412 1433600 2031799
21631 2031799 895973 1736352 2129853 1434046 1672088 1441983 1887730 1706266 1981189
21622 1981189 1813049 1593179 1760029 1551047 1906227 1584066 1397059 1250959 1462942
21613 1462942 1423438 1855392 1873248 1541008 1280964 1847353 1306962 1572348 1135182 1708704
21603 1708704 1559999 1595653 1598004 1598335 1158677 1377602 1236592 1910648 1764375 1477504
21593 1477504 1737890 1923462 1454022 1736136 1415397 1407827 2077002 1318971 1639469 1750782
21583 1750782 1396206 1026304 1681665 1705923 1472576 1339949 1690150 2062977 1767909 897617
21573 897617 1351063 1715812 1304194 1511961 1669032 1391439 1124136 1878740 1579485 2059001
21563 2059001 1497779 1226720 1271158 1340313 1097851 1368444 1268917 1285105 1356803 1156819
21553 1156819 1451184 1629466 1198603 1680018 1519291 1195052 2073994 1606187 1763618
21544 1763618 1516227 1656726 1578219 1424837 1457788 1427851 2090865 1498782 1830989 1868511
21534 1868511 1203080 1550508 1846570 1927298 1767120 1561421 1526504 1707333 1590695 1885401
21524 1885401 1823827 1291134 1803597 1559007 1622388 2170112 1978329 2007233 1672466 1843648
21514 1843648 1641806 1407003 1834193 1562138 1586284 1830512 1615808 1765280 1833450 1909648
21504 1909648 1687945 1801396 1884318 1795915 1809304 1516877 1558464 2188792 1986968 2124434
21494 2124434 1548046 1932057 1635104 1755212 1809990 1759374 1805459 2062455 1415612 1903474
21484 1903474 1964420 1591068 1973908 1810886 2454612 2018043 2081981 1268271 2140794 2084936
21474 2084936 1975349 1481362 1768655 1888313 1919551 1785407 1730541 1762153 2290589 1858179
21464 1858179 1765441 1816013 1884693 1700722 1832580 1970418 1479838 2006312 1732044 2174182
21454 2174182 2002531 1914683 1464077 1799095 2095886 2018055 1808479 1669926 2107822 2513794
21444 2513794 1679350 1405485 1685939 2066995 1674991 1468943 2006767 1814800 1960677
21435 1960677 1802561 1919385 1738897 1809127 1696828 1979842 1458989 1386179 1826986 1575210
21425 1575210 1940856 1878246 1562285 1765798 1616504 1737641 2133401 2069780 1736158 1486595
21415 1486595 2059379 1508582 2075307 1200041 1708653 1746936 1919692 1626742 2025340 1667130
21405 1667130 1580835 1927562 1936752 1643715 1856479 1725697 2046778 2029483 2165818 1608915
21395 1608915 2078101 2088605 1799894 1464054 1905954 1584755 2217291 2045506 1498033 1958515
21385 1958515 1705637 1780042 1983735 2153702 1792735 1286622 1391071 1806171 1800986 2059928
21375 2059928 1849857 2096539 2521755 1794870 1760285 2110321 1999021 2142036 1843664 1878600
21365 1878600 1845190 2177829 1982300 1535578 1653386 1613980 1844696 2221534 1851282 2107250
21355 2107250 2187576 2027819 2035749 1954120 2150792 1873638 2081565 2250753 1582856 2110719
21345 2110719 2112063 2110512 1964952 1847341 1917914 2253564 1797805 1607686 2337499 2437049
21335 2437049 2339212 2191698 2555245 2472178 2606186 1987524 2207754 2471544 2250738 2637875
21325 2637875 2575321 2348662 2285068 2219040 2182207 2019864 2274448 2081234 2245078 2292777
21315 2292777 2112000 2273910 2580327 2869673 2679885 2566989 2463758 2461475 2407753 3308705
21305 3308705 2989841 2373311 1784260 2893677 3298467 2964380 2767557 3100598 3184511
21296 3184511 2997752 2812039 3288372 2977003 3436182 3601206 3264509 3826250 3615355
21287 3615355 3904878 3755209 3767418 4273238 4043248 4112738 4431765 4472444 4693298 4857950
21277 4857950 4943381 5465696 5888342 6208660 6432520 6744993 6996979 7088299 7377138 7758935
21267 7758935 8707615 9266175 9937178 10491122 11199824 12411229 13350199 14872535 15754579
21258 15754579 17021706 19852196 22244122 24587254 27999589 31501173 36067960 40443378
21250 40443378 45800906 49994258 53955432 58145014 61839802 63830309 65061066 65671255
21242 65671255 63872753 61637776 57722181 53424179 49130131 44165751 39420218 34703274
21234 34703274 30847159 27294767 23986240 21189610 18514859 16525815 15033878 13666284
21226 13666284 12479412 11611278 10751425 9518293 9201157 8446510 7589146 7458210 7356082
21217 7356082 6640967 6636438 5699776 5658166 5348169 4809849 4619635 4053722 4171640 4441976
21207 4441976 3874942 4039607 3686457 3663613 3722147 3590362 3406548 3072711 3364345 3508416
21197 3508416 2950926 3264875 2972762 2963959 3221050 2437287 2720669 3183342 2770852 2831874
21187 2831874 2514969 2166959 2811262 2580514 2753130 2552504 2443860 2865347 2094869
21178 2094869 2456856 2890269 3036229 2677872 2922125 2419248 2254248 2392087 2453908 2312291
21168 2312291 2296524 2286558 2158988 2441274 2073080 2582260 2615379 2109657 2298366 2470932
21158 2470932 2637064 1977278 2082070 2416972 2422303 2555354 2400453 2266821 2759880 2363829
21148 2363829 2187113 2191854 2386931 2252675 2245402 1872055 2119110 2520585 2451779 2187379
21138 2187379 2343705 2167111 2413700 2245237 2027047 2328543 2140349 2099334 2512653 2045437
21128 2045437 2150196 2247687 1926165 2028466 1820770 1912543 2093197 2333128 2063548 2706344
21118 2706344 1968088 1860095 1928877 1797704 2184318 2182821 1844648 2170153 1459595 2266157
21108 2266157 2346993 2363065 2072617 2321467 2365356 1823831 2146621 2294438 2339927 1752271
21098 1752271 2250697 2541930 2747356 2798618 2501755 2351802 2493667 2879169 2445499 2453079
21088 2453079 2461035 2361099 2731105 2329950 2503540 2667715 2849379 2569293 2598922 2616486
21078 2616486 3005094 2284053 2479032 3267931 2736958 2284637 2672518 3033095 3381881
21069 3381881 3832738 4353463 4555128 4763536 4540835 4611126 4855285 4550604 4892575 4120403
21059 4120403 4453905 4054516 3653753 3519844 3471936 3468859 3230004 2799936 3540369 2791592
21049 2791592 3008985 2892311 2916082 2597327 2611158 2499109 2681152 2503481 2590402 2992609
21039 2992609 3044643 2844301 2929705 2661562 2995162 2676181 3181647 3111025 2832326 2792127
21029 2792127 3387431 2896868 3258666 3345243 3309925 3861978 3189691 3523273 3367153 3606387
21019 3606387 3809418 3905837 4288827 5004007 5805925 6471040 7410489 8951646 10254248
21010 10254248 11449398 12831235 13271064 13957508 13818913 13743461 14203146 12432370 11088739
21001 11088739 10321843 8978930 8436828 7728248 7788222 7149808 6371764 6328626 6459744
20992 6459744 5642943 5418225 5249249 4926655 4953077 4900736 4972231 4679544 4967283 4997943
20982 4997943 5370942 5465574 6297341 7197922 8487897 9132856 10968217 12151554 12984278
20973 12984278 13969564 14036718 14582997 14438109 13716527 12807095 11217290 9725191 9029889
20964 9029889 7821681 6977652 6169231 5573417 5739683 5342990 5647760 5225328 5340804
20955 5340804 5501224 6325123 6896441 7329321 7508603 8694461 10694719 11154285 12913424
20946 12913424 14023531 15151366 16535290 17295908 17796934 18578936 18714527 18461149 18405593
20937 18405593 18583130 18291426 17964142 18430974 18221642 17952050 17697748 16912568 16238874
20928 16238874 15931548 15908423 16689730 18976544 20932571 23966644 27951704 32515407 36692431
20919 36692431 41327836 45560790 47933872 50351226 51244048 51521788 49628306 46677671
20911 46677671 43772791 39573090 35455599 31546588 28569390 25068118 22393633 19598250
20903 19598250 17516461 14298309 12521501 10804861 9774743 8874523 8015403 7726525
20895 7726525 7026021 6532929 6211603 5963607 5670829 5613704 5339172 5530111 5162967 5761493
20885 5761493 5587127 5745747 5634994 5727437 5957867 6467206 7184105 7877425 9616583
20876 9616583 10698386 11704964 13483500 14018499 15164452 16054964 16203595 16135668 15842570
20867 15842570 15380624 14671319 14858283 14829820 15170954 16800155 19098545 22046601 25822017
20858 25822017 30608031 35094152 39783819 43836590 46459344 48904286 49480818 48536503
20850 48536503 45917927 42285386 37702682 32331333 27339092 22490498 18115271 14943511
20842 14943511 12905455 10969745 10265153 8661915 8180355 7416433 6938349 6394664 5532513
20833 5532513 4965454 5060504 4766691 4394281 4427449 4276388 4196853 4288424 4196568 3568491
20823 3568491 4378567 4098524 3541734 4002124 3937915 3582986 3704817 3674812 3940567 4143160
20813 4143160 3638540 3660689 3435136 3481212 3835089 3638837 3659273 3442623 3955529 3455815
20803 3455815 3428864 3277962 3886836 3545020 3558714 3661913 3609385 3836255 3432236 3598646
20793 3598646 4103789 3699386 4275848 3875460 3713276 3866530 3895678 3810736 3942606 3615179
20783 3615179 2838400 3062025 3046726 3596337 2871404 3178115 3025089 2866030 2918639 2716895
20773 2716895 2843105 2758712 2623152 2615634 2693705 2651165 3213387 2863350 2852219 3356140
20763 3356140 2939050 3367414 3206294 2965489 3495489 3666715 3519221 3582038 3596931 3791299
20753 3791299 3360577 3353494 3027843 3074933 2863879 3222650 3145559 2962080 2941489 2742060
20743 2742060 2476953 2798346 2662302 2907654 2684855 2689273 2339056 2814519 2438393 2089901
20733 2089901 2776541 3014796 2938279 2587914 2385920 3097667 3355700 2641391 3353887 2428714
20723 2428714 2884165 3033612 3225852 2783928 3191300 3071253 3323539 3175162 3280229
20714 3280229 2933584 3032472 3646498 3032603 3906365 3594067 3741704 3740530 3742022 3346543
20704 3346543 4288406 3529882 4164057 4232350 3740634 4641184 4365854 4384033 4051508 4476143
20694 4476143 4429628 4272030 4427390 4450907 4060270 4323614 3968360 4189313 4146969 4094843
20684 4094843 3736679 4232957 4151416 3739529 4314158 4720861 3826748 4422637 4639909 4680382
20674 4680382 4746781 5123742 4977657 5100607 5142929 5375340 5724156 5457063 5073884 4699050
20664 4699050 4864206 4757277 4446700 4433043 4422865 4172950 3718977 3736979 4020318 3877153
20654 3877153 4109611 3626987 4561581 3845569 4133638 4638641 4436859 4522245 4749440 4463453
20644 4463453 4744221 5073146 5490737 5329502 5157812 5115151 5037330 5114929 4759246 4785199
20634 4785199 5077087 4986882 4578030 3695512 3864163 4623238 3703000 4063796 4316977 3809723
20624 3809723 3833631 4069089 3871761 4447292 3965950 4282877 3800024 3762762 4057083 3949480
20614 3949480 4183144 4387262 3797235 4407001 4158901 4392032 4396995 4742674 4184845 3955426
20604 3955426 4484189 3968474 3573328 4198230 3908086 3857936 3645294 3424296 3622430 3305626
20594 3305626 3598238 3035512 3330445 3278970 3214144 3304391 3244084 3305327 3577774 3119575
20584 3119575 3418008 3470256 3855599 3506656 3338855 3499809 3598318 3356008 3121208 3226434
20574 3226434 2906414 2902076 3045502 2908710 2534906 2572969 2494605 2482939 3024948 2989819
20564 2989819 2834279 2948149 2876122 2930975 3017217 2746790 3207845 3115337 2743330 3346547
20554 3346547 3242462 3211544 3590662 3844241 3211403 3203085 3495458 3010287 3581496 3608433
20544 3608433 3772708 3161418 3201286 3586791 2991047 3109390 3436699 3754184 3452054 3687491
20534 3687491 3712340 3854295 3878049 4107060 4410301 4352065 4128614 4206394 4313514 4657426
20524 4657426 4813856 4172981 4520800 4347718 4116434 4257713 3590410 3694442 3048878
20515 3048878 3084432 2946691 3370692 3566672 3473010 3181986 2814385 3063449 3389451 2874699
20505 2874699 2893187 3322608 3504943 3325818 3522646 3562587 3376511 3676518 4011344 3940877
20495 3940877 3796406 3744549 3858078 3906376 3975036 3449061 3653162 3213586 3683826 3273664
20485 3273664 3078185 2502837 3025568 2467317 3091447 3294436 2952636 2946849 3360132 2203044
20475 2203044 2425554 3253606 2640884 3135413 3128112 3254830 3375325 3111121 3105502 3746157
20465 3746157 3648112 3718891 3381777 4038383 4025073 4239169 3923863 3620409 3543985 3118553
20455 3118553 3304747 3414459 3384622 3270362 3405432 3409823 3106135 3630574 3468813 3219748
20445 3219748 3621190 3357789 3353160 3424659 3574470 3755834 3441987 3577354 3150112 3460056
20435 3460056 3296502 3623802 3472217 3211678 3017561 3159986 2920791 3444296 2968654
20426 2968654 3006391 2750699 3413075 3261958 3138900 2894785 3602313 3063874 2818378 3801288
20416 3801288 3001538 3335999 3321278 3453148 3574999 3193293 3505817 3160172 3324016 3396132
20406 3396132 3636504 3620940 2869492 3436696 3136829 3015613 3001530 2967493 3397927 2966727
20396 2966727 3032486 3054047 2853855 2584884 2898443 3044870 2508117 2708061 2979266 3029890
20386 3029890 3540562 3675039 3390911 3419609 3251665 3752385 3645810 3447700 3818649 3756337
20376 3756337 3578900 3847881 3796635 3860759 3786755 3558605 3893902 3491897 3726813 3376304
20366 3376304 3135473 3561703 3704733 3388671 3415890 3200879 3237516 3314719 3332421 3228782
20356 3228782 3424979 3111405 3573792 3165206 3214220 3553175 3764295 3320069 3153268 4167646
20346 4167646 3549049 4022942 3848408 3769136 3717059 3621560 3623159 3307002 3652846 3519327
20336 3519327 3806045 3621909 3453564 3715685 3633811 3494574 3595374 3299236 3146281 3429014
20326 3429014 3303498 3574250 3301437 3672541 3216269 3404557 3117630 2930734 2994578 3529546
20316 3529546 3547766 3384659 3436256 3501440 3627519 3950350 3917192 3521861 4114932 3771672
20306 3771672 3898930 4589402 4646599 4360714 4527040 4968548 4770283 4925461 5354413 5603118
20296 5603118 5574945 5413891 5468765 6392846 5607277 5891245 6064635 6097672 6360738 6216452
20286 6216452 6245800 6488198 6521506 6473712 6332645 6375081 6311238 6203803 6417401 6730712
20276 6730712 6620693 6461156 6481398 6275686 6626997 5737468 5783806 6212830 5684874 5541831
20266 5541831 5470099 4817381 4966590 5172629 4783038 4725764 4586924 4668234 4473785 4448220
20256 4448220 4643288 4446224 5025161 5218582 4870360 5365685 5788596 5848019 5758400 6248584
20246 6248584 6511579 7037431 6889728 7307294 7998444 8590410 9827665 10724032 11679257
20237 11679257 12523123 14206080 15719868 16500853 17836309 18887005 19949102 20133672
20229 20133672 21074728 20776963 20388016 20177875 19617631 18178863 17651240 16479256 14834767
20220 14834767 13160821 11414285 10110732 9246130 8218532 7294170 7418179 6873930 6728885
20211 6728885 6136533 5782344 5676981 5627761 5084024 5629380 5737009 5314604 5165282 4755811
20201 4755811 4907083 5516007 5000344 5329702 5430491 5411568 5471319 5788263 6027054 5959798
20191 5959798 6254354 6539782 7155292 7507019 8148828 9152789 10535804 11585689 12512017
20182 12512017 14937075 16779632 19502938 21511400 23661972 25829987 27834862 29949456
20174 29949456 31410438 32434260 33314032 33206101 32857016 32156744 31382995 29878446 28939723
20165 28939723 26908316 24279962 21605798 19421453 16849002 15050999 13830846 12474768
20157 12474768 11288387 11247066 10910133 10760944 10725862 11334767 11568986 11728860 11928946
20148 11928946 12454747 13484515 14762830 15719621 17362168 19082464 21233024 24123140
20140 24123140 26823809 30010679 33764728 37422550 41596025 45386497 49971316 53928983
20132 53928983 57783573 61051060 64157701 66782825 68140836 69017264 69093594 68498858 67064864
20123 67064864 65458515 61950570 58642654 54552723 50312686 44919308 40424150 36143088
20115 36143088 31985717 28991263 25507365 22874317 20633473 18397556 17450267 15656963
20107 15656963 14956930 14254042 13311514 13440639 13232116 13332266 12996552 13510354 13206220
20098 13206220 14418687 14594899 15943311 16937703 17742247 19316982 20286736 21988442 22634043
20089 22634043 24507294 24598090 24985913 25515454 25468855 25080512 24465999 23974351 22773557
20080 22773557 21165857 20156090 19397060 17571614 16902971 15163787 14335114 13129934
20072 13129934 12024372 11679877 10504120 10470599 10120320 9950529 10087160 10019578 10677284
20063 10677284 11356765 12118493 12892794 14213695 15600695 16949981 18888429 20468073
20055 20468073 21982470 24006368 25672308 27413204 29241403 31102281 32533043 35054242
20047 35054242 36722598 37937452 39165900 40714928 41264194 41481106 41576264 40498119 39031331
20038 39031331 38358628 36715836 34915675 33180333 31313738 29393640 27532991 25572832
20030 25572832 23412955 20996150 19795458 17969769 16438435 15971241 15280384 15738255
20022 15738255 15516345 15875021 16591486 17533132 19647927 21457478 24152690 25728959 29264180
20013 29264180 31246282 33888277 36311779 38383233 40036752 41321800 41655213 41305243
20005 41305243 41080143 40335140 38322391 36386457 34625364 32432756 29870847 26838950
19997 26838950 23593782 20767588 18452433 15369176 13909634 12460025 11090432 9781219
19989 9781219 9478905 8913618 8522036 7350796 7451923 7372882 6626036 6324050 6142884
19980 6142884 6022585 6216760 5764125 5406086 4639642 5426425 5021577 4999585 4947189 5102451
19970 5102451 4707119 4836124 4946469 4834258 4606683 4715965 4694107 4754085 4806310 4811006
19960 4811006 4693463 4094463 4972176 4750549 5357891 4188908 4352719 4787054 4931664
19951 4931664 4653044 4458428 4355641 4667823 4586324 4697681 4483459 4089668 4486574 4081940
19941 4081940 3934266 3997264 4574299 4279698 3836906 4326434 4114576 4203194 3766844 4071457
19931 4071457 4057128 4327429 3608970 4122142 4042413 4169205 3742737 4306225 4287875 3980337
19921 3980337 4330483 4090261 4145709 4201481 4166525 3845145 4121474 4230482 4556321 4108719
19911 4108719 4272775 4089515 3589820 4330368 4148662 4072122 4199353 4269765 4164360 3902054
19901 3902054 4861518 5059640 4514604 4923406 4693355 4447863 5222184 4908129 4704524
19892 4704524 5088643 5031339 5469165 4851077 4930412 5190718 5494107 5388685 5368293 4888347
19882 4888347 4988026 5767276 5448186 5290456 5405254 5308480 5580838 5750266 5447569 5719032
19872 5719032 5642129 5545995 5904354 5612377 6029914 6458309 6383732 6192892 6230255 6199894
19862 6199894 6520028 6199912 6246441 6695125 6389782 6830388 7016210 6807387 7048952 6601951
19852 6601951 7168649 6948504 6996360 7452686 7725577 8044488 7952839 7296500 8000110 8127447
19842 8127447 8938034 8484053 9147178 9488541 9668794 10157055 10435465 11390130 11782753
19833 11782753 12266940 12843059 13930633 15751188 17280445 19272804 20950873 23815802
19825 23815802 25358078 28636314 30603054 32773686 34052776 35424887 36268533 38183638
19817 38183638 38227321 39221681 41062566 42201898 44076491 46582245 49090683 51663842
19809 51663842 53596709 55008949 56979354 57533558 57843788 56558690 54704392 52041613
19801 52041613 49680190 47102139 44411773 42582584 40260107 38386708 37755579 36473417
19793 36473417 36381445 35924289 36258923 36528583 36620125 36541044 36402103 36480921 35910561 36527317
19783 36527317 35943230 36364981 37549014 38409313 39426685 41705640 43356858 44572923
19775 44572923 45406317 45995023 46085292 45469768 43962487 41892684 39423594 36890045 34240760
19766 34240760 31348246 29222109 26198662 23912876 22314946 19983557 18163558 16414481
19758 16414481 15040508 14200454 13010634 12679777 11471178 10744560 10201616 10345898 9744650
19749 9744650 9050928 8717864 8793947 8139392 8047227 7964370 7708865 7032369 7411096 7547426
19739 7547426 6721580 7462710 7174063 6619843 6611056 6472580 6732545 6897847 6964573 6849671
19729 6849671 6666498 6559417 6624577 7299340 6546436 6413210 6689620 6431672 6843656 6679838
19719 6679838 6574589 6641667 6701971 6125735 6469248 6434103 6895480 7022245 6918590 6632480
19709 6632480 6471338 6830723 6892156 6757626 6433378 6493340 6636338 6628069 6849829 6515092
19699 6515092 6537973 6486793 6173714 6385088 5840877 6519143 5909688 6305708 6567850 6347565
19689 6347565 6563220 6280642 6248889 6271727 5745982 6345860 6134191 5919425 5862238 6016499
19679 6016499 5466747 5758853 5667581 5431122 5406179 5497362 5584363 5714259 5676442 5859824
19669 5859824 4938733 5280489 5481161 5356380 5480603 5287190 5066395 4784651 5228933
19660 5228933 4922475 4715126 4626703 5060587 5046955 4715676 4927032 4617341 5014443 4414954
19650 4414954 4686478 4559628 4854251 4792581 4808533 4612251 4712056 4499267 4677768 4894712
19640 4894712 5036916 5043190 5053685 4877865 4726885 5039952 4497307 4812279 5082520 4787073
19630 4787073 5428894 4918532 4840039 5168279 4778644 4596656 4460391 4819894 4559518 5065349
19620 5065349 4649678 4468263 4544672 4721599 4138308 4239345 4679232 4068852 4336804 4463178
19610 4463178 4186686 3925072 3570020 4650380 4004044 4021164 4291692 4084911 3828026
19601 3828026 3828092 4256029 3778706 4006266 4015415 4199503 3829650 3694179 4110458 3786899
19591 3786899 4438773 4239054 4367940 4148342 4294562 4071776 3986699 4356407 4315733 3951019
19581 3951019 4402177 4226268 4643289 4272157 3939559 4511182 4462168 4360035 4594892 4408499
19571 4408499 4357978 4133256 4558929 4232983 4403618 4581102 4403757 4034030 4490463 4510102
19561 4510102 4347280 4760156 4158131 4685728 4616433 4617941 4867692 4735224 4860389 4732262
19551 4732262 4385921 4831748 4880946 4420270 4637337 4800307 4425334 4401423 4422223 4298870
19541 4298870 4377966 4403727 3533558 3962458 4177458 4061850 4117990 3706169 3597220 4321378
19531 4321378 3558311 3621156 3635952 3828242 3505799 3669601 3508944 3619211 3592976 3423505
19521 3423505 3581066 4067082 3614563 3467619 3640404 3797121 3097787 3627448 3128073
19512 3128073 3253878 3496832 3604158 3324563 3538474 3631016 3216085 3399296 3695699 3628185
19502 3628185 3429416 3115025 3542449 3454713 3376026 3227153 3027823 3778162 2976260 3477373
19492 3477373 3035679 3888084 3675687 3688214 3577883 3626123 3506784 3339554 3293495 3698556
19482 3698556 3777861 3132870 3140034 3137632 3564478 3071427 2915747 2635262 3065252 2854603
19472 2854603 2732840 2874279 3253619 2854030 2509564 2920766 2650218 2724599 2685339 2944083
19462 2944083 2836787 2944702 2587936 2762915 2789008 2242145 2580340 2814802 2739902 2743546
19452 2743546 2994013 2387178 2670267 2587597 2342608 2654933 2589520 2528524 2099314 2383186
19442 2383186 2573698 2156124 2150615 2040285 2352752 2356907 2226916 1939124 1746786 2104804
19432 2104804 2363354 2343524 2247460 2170305 2024462 2316446 2600329 2345042 2358137 2174224
19422 2174224 2150122 1497811 2193541 2584693 1672024 1634467 2271386 1943209 2111140 1692641
19412 1692641 1810708 2061470 2452729 2066092 1949853 2261704 1869818 1774067 1925255 2185018
19402 2185018 1673799 1691672 1781711 1666466 1575389 1888837 2186131 1881416 1890448 1602727
19392 1602727 1732876 1564609 1670362 2018425 1605143 2188626 2097625 2287513 1803894 1545533
19382 1545533 1579025 1917507 2292972 1728743 1816600 1596508 2326308 1573437 2203947 2108337
19372 2108337 1599672 1462138 1566780 1516239 1763433 2121835 1573995 1814449 1711350 1989317
19362 1989317 1946483 1819299 2099763 1567953 1736866 2218968 1702643 2296393 2000159 1764634
19352 1764634 1737062 1743379 1707097 1765433 1870167 1765809 1722303 2066343 1519034 1806406
19342 1806406 1271732 1733676 1745840 1817344 1559253 1550626 1597075 1815455 1612776 1646887
19332 1646887 1828144 1799132 1430495 1445139 1458452 1945609 887643 1816359 1399581 1478204
19322 1478204 1552866 2172632 1746232 1381779 1592222 1093541 1640535 1505454 1903073 1467672
19312 1467672 1158644 1465240 1569407 1176359 1957797 1514144 1487227 1549989 1566180 1069642
19302 1069642 1097778 1799445 1347416 1497073 1608890 1626691 1652155 1831912 1528052 2058182
19292 2058182 1540350 2046197 1391103 1580741 1681709 1485797 1803012 1393877 1504580
19283 1504580 983007 1325174 1499124 1642796 1785849 1567185 1324326 1706343 1474138
19274 1474138 1563241 1761059 1392809 1713718 1529042 1905859 1805652 1679985 1659723 1623987
19264 1623987 1722428 1871709 1863052 1105293 1484257 1766085 1303685 1803934 1513092 1478143
19254 1478143 1541429 1582418 1885718 1607828 1312133 1815229 1501039 1272169 1660584 1652745
19244 1652745 1711463 2344891 2845670 2906243 2728509 2903758 3220323 3475254 3352575 3152738
19234 3152738 3026219 2263981 1841515 1963944 1623209 1609188 1520007 1597427 1602546 1250413
19224 1250413 1671068 1338844 1571730 1468258 1307472 981883 1485634 1353740 1067691
19215 1067691 1291246 1221841 1469050 979393 1238786 1964602 1382073 1259153 1526654 1473272
19205 1473272 1753690 1359064 1650746 1708173 1338362 1672616 1455057 1480721 1344104 1546758
19195 1546758 947812 1373738 1678785 1730730 1159047 1918453 1297780 1600745 1685289 1253716
19185 1253716 829373 1804235 1421208 1441030 1392520 1603562 1244776 1092794 1514507 1234800
19175 1234800 1381185 1464988 1821941 1711392 1247797 1702295 1452699 1383992 1292966 1590770
19165 1590770 1166104 1478550 1448075 1215612 1384474 1401652 1280342 1508917 1522950 1222050
19155 1222050 1507665 1457661 1769524 852265 1553833 1455391 1551865 1530294 1447609 1837986
19145 1837986 1618088 1572106 1559973 1380905 1567827 1757479 1873016 1717697 1660391 1580898
19135 1580898 1965914 1977545 2711258 2767281 3094336 3290806 3375856 3897483 3912533 3474476
19125 3474476 4203020 4119307 3558464 3895759 3485220 3294923 3186659 3678653 4120156 3992689
19115 3992689 3445779 3046205 3067839 2736573 2103798 2086881 2364342 2353999 1991797 2553093
19105 2553093 2156494 1641585 2069842 2170365 2207158 1847880 2311146 2262609 2177510 2427741
19095 2427741 2449088 2115346 2490627 2117077 2745229 2975967 2290202 2060244 2156712 2495764
19085 2495764 2101059 2208370 2575393 2525633 2491765 2544661 2715352 2218660 2761085 2812544
19075 2812544 2507557 3710265 3128094 3649228 3782734 3999502 4144070 4911574 5575539
19066 5575539 6927327 7571321 9977104 11064719 12642858 13762611 14855690 15048145
19058 15048145 15545391 15529913 14840376 13260992 11636653 10251702 9226796 6951328 6951691
19049 6951691 6075124 5959779 5336845 5814665 6316406 7391358 9240724 10151062 11147394
19040 11147394 12276385 12747399 13110287 13058582 12620599 11437310 9594275 8973613 7422540
19031 7422540 6109227 4965885 4843971 4272694 4861945 4215578 4423881 4706797 4582135
19022 4582135 4919048 4884297 6162094 6598998 7968568 9034835 10399106 11821504 12360442
19013 12360442 13745066 14242643 14661133 14541959 14439871 13311179 11974952 10491467 9050281
19004 9050281 8344407 7746457 7961637 9039717 9598656 10349291 12145289 12877651 12998082
18995 12998082 13543676 13467005 13699494 12738518 11409080 9553184 7835654 7116457 5985831
18986 5985831 5551930 5214045 5316682 5623409 6337127 7241309 8431892 9739088 10801539
18977 10801539 11343370 12642021 13566726 13187676 13863473 12522428 11716522 10447020 8664684
18968 8664684 7306375 6968603 6786896 6047534 6619984 6243651 6625302 6880053 7691994
18959 7691994 7778652 8531660 9678788 10532423 12582944 14257100 17120130 20235821 23566515
18950 23566515 27068465 31839440 36311749 40554372 45405494 49283587 51260940 52218215
18942 52218215 52798259 51204842 49048497 45678736 41351274 35690679 30783751 25427332
18934 25427332 21121778 17676659 14629828 12887766 10803025 9191175 8682564 7583224
18926 7583224 6770192 6012797 5734890 5298621 5046681 4462351 4357926 3970903 4215467
18917 4215467 4293742 4221914 4644591 3948895 4236781 4278257 4132601 4121316 4100899 3914823
18907 3914823 4059021 3916323 4187036 4048169 4641557 4810586 5020851 4856330 5431605
18898 5431605 6058929 6118857 6193961 6596251 7008207 7413133 8503448 8898991 10168667
18889 10168667 10934612 12999177 15382782 17771868 21906345 26199871 30378363 34684499
18881 34684499 38121321 41384429 42935310 43514541 43811285 41671153 38407031 34368877
18873 34368877 29836524 25008735 20495026 17263402 13854712 11305432 9287482 8650727
18865 8650727 7527834 6153367 5499119 5371558 4656962 4418824 3762436 3622429 3963393
18856 3963393 2924456 3100730 2906968 2623604 2767025 3041136 2690258 2443361 2741580
18847 2741580 2791395 1957509 2508180 2550502 2293705 2333302 2261542 2094120 2008772 2375190
18837 2375190 2297226 2537893 1893988 2388220 2251499 2163106 2440648 1996746 2189273 2192376
18827 2192376 1898859 2077874 1495768 1771297 1847682 1749436 1394530 1040182 1787329 1644613
18817 1644613 1715253 1967969 1536934 1698783 1808404 1776877 1828507 1387260 1513609 1495452
18807 1495452 1607317 1548068 1364453 1078474 1694663 1659806 1890077 1368449 1757108 1840415
18797 1840415 1396165 1627451 1250483 1309082 1965837 1668471 2021281 2119380 1854898 2205016
18787 2205016 1710380 1718425 2289141 2197820 1848560 2156197 2019571 2223706 2278803 1615098
18777 1615098 1939269 2420378 2473263 2115123 2206013 2236479 2010538 2452074 2197774 2130731
18767 2130731 1944974 2117350 2118679 1994740 1913729 1739182 2006781 2140743 1870941 2160826
18757 2160826 2063759 2362681 2000271 2731523 2382786 1859764 1683593 1966506 1916287 1687877
18747 1687877 1664132 2427262 1909682 1792750 2093284 1934749 1716966 1777635 1999292 1069557
18737 1069557 1224758 1984639 1577743 1708408 1476128 1724016 1668765 1057788 2028653 2043243
18727 2043243 1763226 1354089 1732931 1247064 1147211 1002470 1971244 1217731 1708119 1538351
18717 1538351 1882573 1595579 1637659 1614123 1901771 1577684 1752104 1989760 2121657 2293360
18707 2293360 1822673 1814455 1925249 1782748 1963356 1994012 1591726 1827641 1531900 2356325
18697 2356325 1997957 1840650 1830417 1992668 2509125 2043512 1519795 1602476 1593948 1913167
18687 1913167 1986453 1575970 1239752 1327053 1547763 1739187 1692000 1259569 1583302 1673081
18677 1673081 1177319 1352331 1110869 1598450 1360556 1277173 1032790 1704286 1345274 1637309
18667 1637309 1138591 1114332 658012 1040367 1264268 1855671 1063134 1165417 1404910 952037
18657 952037 1286706 1526910 1259880 1168264 1288656 923932 1206549 850454 1557174 1135068
18647 1135068 1190573 860249 1526407 2054874 1025293 1746286 813910 1365882 1062235
18638 1062235 1325171 1215767 1701100 1024641 1377767 1721881 1652914 1661653 1592866 872696
18628 872696 1259816 1342238 1688893 1339795 1919791 1227656 1618596 1201563 1410212 1643113
18618 1643113 2051633 1324773 1820163 1647233 1648525 1449062 1312061 1924187 1847938 1631575
18608 1631575 1447986 1853394 1583790 1764211 1664661 1699468 1646736 1249030 1737572 1775712
18598 1775712 1973367 1711836 1635617 1644801 1555033 2057928 1316293 1622096 1338791 1714747
18588 1714747 1448068 1435972 1615295 1759018 1641073 1528969 1583288 1921048 1212876 1566982
18578 1566982 1573117 1282011 1343617 1311862 1219454 1257149 1079205 1327292 1408218 1636741 1404635
18567 1404635 1806110 1370781 1814059 1669126 971577 1560700 1463082 1301848 983979 1275318
18557 1275318 1060349 1027139 1671857 1216180 1554561 906340 1633605 1315318 1200569 1384378
18547 1384378 1623096 1208606 962931 1412698 2345011 853700 998785 922059 1623056 1656690
18537 1656690 1097860 1147575 1352857 1025281 1229374 925601 953069 1043789 748711 1164700
18527 1164700 965600 934917 1179394 818354 700134 1075106 822311 1065141 987762 1211087
18517 1211087 1102032 789212 1182864 850292 654504 924088 1287661 1038038 1042911 1010021
18507 1010021 1384590 1009873 1227881 1176627 1116482 1191420 1042483 1537423 974951 1162408
18497 1162408 1112595 1251477 857979 1029041 755206 1335587 1091765 1161710 1406301 925652
18487 925652 851124 1024897 1103869 1217205 1025328 349868 608561 740409 633150 1163183
18477 1163183 1245309 709147 219239 900565 874560 1049604 1298327 1002252 929625 1087414
18467 1087414 735811 869676 924841 1136332 1364055 969722 1337106 1145874 1124104 1159487
18457 1159487 1155267 960150 772042 812102 1123238 1138939 988371 736448 1171390 969388
18447 969388 959256 743524 1160752 952757 829412 1063303 1024590 1314918 816850 1165662
18437 1165662 1391617 767480 522249 1459656 1197028 968175 1008859 868463 1285512 1252509
18427 1252509 1755901 1347430 1142930 1466920 1044416 1267277 1234551 964922 390672 1200769
18417 1200769 1281780 1312986 958359 872281 918365 832559 1137705 598547 861688 799313
18407 799313 1258034 986882 925771 838609 635994 533688 1188577 1061586 683570 1013154
18397 1013154 1385010 1238841 1185971 722053 429775 990111 801637 983003 1048426 1148122
18387 1148122 671417 1096311 1097413 1020282 755939 1342267 724447 1076902 1123469 1175397
18377 1175397 285300 1060982 1036657 734724 1190216 551221 951943 1398005 1408466 990384
18367 990384 1004836 737701 996773 1341895 824572 893997 1015740 1333938 1028194 1027274
18357 1027274 1433560 929349 662424 858244 838758 1028520 1080725 1273646 965693 1128665
18347 1128665 870447 917310 1365911 922831 394623 973197 1194556 590282 724097 1402683
18337 1402683 1085275 810291 782043 1070138 1390517 1005863 941321 902631 659012 793542
18327 793542 992785 1394323 754256 1451182 640511 952601 733229 991054 1032591 1146458
18317 1146458 1157412 816447 817205 866866 565848 887389 1009477 775018 910018 914323 1007844
18306 1007844 503679 909791 802293 1275086 1088040 1170907 1031658 1397112 789296 955093
18296 955093 890959 933070 1315155 1390496 1296573 1153178 1400865 1042499 806629 933170
18286 933170 902551 1205358 1428989 1268924 870040 987050 1050690 1550039 1195540 1180862
18276 1180862 773109 1127685 571563 894486 1201908 1073763 1060738 848122 725731 1071759
18266 1071759 1205027 700557 756332 882891 899451 524260 203872 1077841 688216 1071688
18256 1071688 814191 1101475 1160827 252994 632549 1259720 1396977 1178312 1476180 1751450
18246 1751450 1117500 1428760 1229439 1285113 1237733 996763 1389006 1171285 979568 900912
18236 900912 674730 1184404 768316 1083131 1126446 970189 640580 1143564 1214969 1430463
18226 1430463 781837 901616 814105 1241829 883785 1051695 591365 948174 1146803 506498
18215 1072911 645035 1274264 946026 1166398 1015892 992761 1143888 1166377 901365 781494
18205 781494 1173546 1320441 1365303 957740 979032 871590 716119 1292806 992478 810634
18195 810634 945231 1020644 1217210 1593461 1436959 1162606 699034 937302 1077989 1215025
18185 1215025 1003520 1260341 1090000 1165497 728287 1026601 1354048 509637 1131571 824474
18175 824474 1263747 1196404 782726 698896 1013098 1121297 713996 1039333 795201 935446
18165 935446 1541407 1347809 1237454 1393730 928449 1077552 795354 410694 870082 1014740
18155 1014740 679107 927360 360195 869719 737708 1236040 633083 1344928 1078010
18146 1078010 861970 1287531 1186473 730669 855604 527905 865834 963954 1045671 1192431
18136 1192431 936192 972177 1180611 478875 949496 1424919 625329 925854 1053942 1155470
18126 1155470 996056 763448 1201726 1009552 959945 532341 1376371 767888 627226 1556429
18116 1556429 1612642 1226666 771993 1209416 936430 885382 1134157 1098153 1078690 1080800
18106 1080800 686678 1285988 718322 836262 456028 1152628 1099672 1191459 1334990 1544149
18096 1544149 1213400 959667 1039901 1282127 456418 1314396 457375 978420 647323 1181305
18086 1181305 770349 752244 1291008 735456 1044975 923119 601450 757083 904868 987433
18076 987433 693748 618466 764588 1109059 1162913 391530 898775 1044562 919222 733118
18066 733118 770005 1157216 1051911 857657 693241 969104 893532 475335 495803 944874
18056 944874 890984 744703 999877 962781 964973 1003062 1429215 1202889 921443 1193802
18046 1193802 1446263 1028920 1067685 1134819 1067599 1438009 888989 633714 1020248 762308
18036 762308 861550 759770 871414 781250 1622639 980300 902277 842181 910744 1116832
18026 1116832 1035276 977544 836551 800143 693260 1096600 1077638 1454158 1203193 1159094
18016 1159094 1012664 1186579 1207757 1043070 1042685 1383394 893406 916760 1069378 938031
18006 938031 699155 1164097 664076 733154 1087715 661509 851573 788564 1024364 830116
17996 830116 865256 1028547 896765 1099487 1142525 1401301 815036 1168680 1374589 1025768
17986 1025768 929558 731143 1461454 658769 965390 1056369 1123611 1007290 774313 728406
17976 728406 376787 957390 986815 1163349 1578776 1394616 495559 1086900 811530 1294848
17966 1294848 1354743 1182097 1170156 657163 1126395 1444395 503057 1010468 888594 708295
17956 708295 790784 1059393 1252550 879522 1143799 1068154 1337558 1151453 818034 1174066
17946 1174066 1386127 1635227 1147647 1340977 993633 1242735 1382719 1291926 1554620 1380126
17936 1380126 1164797 1341687 1400729 1407968 1202999 1086832 1190830 1501834 1266886 1036115
17926 1036115 1520805 1460691 1700821 1431120 1419325 1759002 1458560 978344 1813867 1505696
17916 1505696 1713164 1128089 1906222 1211995 1812386 1810062 1522174 1661332 1580143 1728858
17906 1728858 1340911 1710278 2092128 1388551 1806739 1907264 1661886 1609227 1804978 2135579
17896 2135579 1825734 1979354 1999817 1959393 1652281 1962410 1562288 1662362 2137896 1944446
17886 1944446 2280097 2133131 1802713 2209371 1990228 1760368 1990441 2857464 2020455
17877 2020455 2498260 2138629 1990950 2024125 2107888 2106812 1751459 2486409 2459576 1669716
17867 1669716 2036751 2197546 2452380 2020251 2356951 1878690 1754632 2313988 2021132
17858 2021132 2056369 2005818 1567464 1760131 1505649 1810183 2143490 1690743 2075157 1980452
17848 1980452 1515563 1498334 1844680 1451617 1535662 1395218 1669442 2001726 1337978 1711172
17838 1711172 2040015 1278322 1521196 1122089 1232662 1782640 1448345 1692591 1802873
17829 1802873 1458677 1833903 1558206 1335682 1239140 2071628 1553100 1607625 1344168 1243810
17819 1243810 1179088 1767547 1809545 1728774 1647946 1500452 1911196 1539167 1401892 1921300
17809 1921300 1525049 1903998 1435043 1665052 1437688 1632367 1707328 1732378 1392120 2091651
17799 2091651 2153248 1588885 1841751 1911652 2467340 1805663 1840182 1914842 1753387 1251516
17789 1251516 1459291 1483488 880486 1466852 1338376 1369509 1393150 1491589 1356386 1218854
17779 1218854 1263151 1171877 1402183 1387247 1247988 1077525 1690917 1153231 1096005 839950
17769 839950 1370981 1023589 1188676 1153974 1433523 1014713 1544587 1500060 1256802 1368219
17759 1368219 1167440 1356048 1255088 1331364 1470427 1528477 1511791 1472167 1552969 1406714
17749 1406714 1297607 1402464 1551996 1132000 1064052 1836794 1318386 1498375 1192896 1649016
17739 1649016 1705844 1627758 1419625 1167962 1855770 1092739 1189522 1360612 1754204 1409633
17729 1409633 1212343 1519536 1493928 1328107 733944 910769 1044515 1583045 1321867 911321
17719 911321 1423539 1352960 971553 905489 1158803 1047934 1133741 1454462 683591 1569617
17709 1569617 1273999 1361221 1025950 1410309 1332599 1547483 1812451 1246255 908856 1228874
17699 1228874 1695779 1406481 1283735 1317253 1475912 1206510 1262143 1691476 1536344 1590788
17689 1590788 1216990 1113693 1121888 1396246 1686562 1164258 1475092 1613617 1491790 1632897
17679 1632897 1507489 1343176 1648657 1706521 1792008 1059019 1315752 1646961 1577655 1346960
17669 1346960 1596285 924160 1810825 1371556 2121484 1793111 1613885 1185425 1297939
17660 1297939 1287878 1569947 1223541 1942134 1365494 1852117 1102843 1685209 1616769 1888800
17650 1888800 1708265 1605594 1657803 1859573 1371720 1745282 1661368 1938954 2014444 1780478
17640 1780478 1520562 1749392 1621691 1750287 1833939 2183327 2004494 2010154 2402563 2273115
17630 2273115 2359321 1781363 2248214 2204430 2503451 2647110 2467328 3107559 1767760 2074562
17620 2074562 2696446 2568727 2299434 2512041 2400288 2213202 2229999 2645783 2469209 2672032
17610 2672032 2564584 2852846 2709091 2370306 2404908 2531176 2906182 3004549 2569996 2629601
17600 2629601 3039523 2791577 2937124 2916525 2769054 2739999 2497396 2608417 2684400 2647864
17590 2647864 2687407 3020489 2183475 2635492 3057364 2634143 2494315 3007866 2813315 2603143
17580 2603143 2666037 2513315 2693076 2957874 2520258 2315423 2392490 2453225 2288414 2083870
17570 2083870 2612855 2069532 2611439 2509546 2411254 2457867 2377821 2438995 2729377 2465602
17560 2465602 2389182 2600756 2127861 2314452 2810926 2341314 2077244 2423400 2250936 2051332
17550 2051332 2101990 2442813 1975128 2625461 2386085 2492476 2454326 2205167 2041374 2147358
17540 2147358 2651726 2018618 2568823 2453165 2789058 2486540 2741334 2585650 2506485 2476516
17530 2476516 2168258 2500221 2500388 2245084 2788914 2171914 1746889 2499064 2540539 2735724
17520 2735724 2360756 2440152 2230659 2959346 2812302 2678727 2922742 3081555 2916483 3138613
17510 3138613 3195746 3099992 2946509 3384348 3537549 3559373 3354047 3646980 3905886 4107539
17500 4107539 3458230 3568262 3323422 4377735 4165910 4971426 5023613 4772513 5396426
17491 5396426 6361797 6524750 7927018 9133486 10919798 13491117 18970363 27314578
17483 27314578 38145602 51200585 64359000 75094496 83895192 90130378 94524375
17476 94524375 95798265 92208672 84039544 71019616 56936908 45802892 39181557 38808976
17468 38808976 44117072 53808547 65437324 76944211 85228497 91184783 95420470 96717546
17460 96717546 94569013 87018494 73610733 58212991 43494959 30724139 21412989
17453 21412989 15844723 13062583 10580050 9524999 8765553 8278248 8037668 7562168 8171312
17444 8171312 8928682 9114236 9478382 10083113 10090762 10556255 10829434 10918134 10279111 9216217
17434 9216217 9157010 8768331 8212159 8216612 8554087 8486355 9264539 9547617 9376269 9429192
17424 9429192 9063796 9290235 8621610 8143611 7092262 6815044 6233155 6505824 5704648
17415 5704648 5670311 5885498 6044789 5806094 5538208 5264061 5980076 5704966 5837477 5760053
17405 5760053 5798017 5803046 6100124 6476517 6503220 6850858 7565963 7512691 7966440 7594510
17395 7594510 8266589 8498039 8681774 9310502 10059670 10784021 11294887 12223297 13351560
17386 13351560 14209945 15177535 15663138 16362466 17017582 17092949 16560698 16269457 16216896 15206710
17376 15206710 14802487 14161373 14132832 13879350 14066918 14704890 15189943 15641497 17081634
17367 17081634 18010478 18818233 19834321 20912694 20898790 21496492 21821798 21569095 20917839
17358 20917839 20722017 20701817 20199826 20527999 19665221 20471103 20260357 21240799 22179911
17349 22179911 23725973 24547130 25501937 27375636 28544224 29437553 30951937 32538568
17341 32538568 32696364 33276425 33649852 33381846 32813306 32094756 31022077 30337070 29701402
17332 29701402 29774302 29355366 29858559 30744761 31489348 33949299 34612817 36574584 38450380
17323 38450380 39547803 41415746 41848428 42352302 42815906 42295837 42055899 41036253 40291458
17314 40291458 38551375 37794025 36258362 34702550 34302158 33478433 32618749 32757731 32300154
17305 32300154 33046797 33689004 34011879 35204420 35910625 36951080 37909297 37910333 38102904
17296 38102904 38370390 38554150 37676129 36721877 36256916 34934266 33744316 32733310 31613483
17287 31613483 30804656 29842342 29817008 28482794 28265008 27255795 26283752 25786546 24967642
17278 24967642 23509363 22480644 21077301 19869432 18439367 17431125 16137537 16005781
17270 16005781 14267131 14188950 13883221 13974388 13354742 12773656 12377452 12833338 12042273
17261 12042273 11698497 11315534 10634264 10589097 10221948 10211094 10347107 9724425 9846277 9369855
17251 9369855 9352403 9202175 8966536 9101106 8967161 9123785 8270133 8044077 8379523 8079985
17241 8079985 8174130 7507821 7039935 7666765 6967063 6799752 6961440 6514391 6215980 6124296
17231 6124296 6508315 6268769 6419927 6643703 6411712 6301724 6988535 6712215 6974830
17222 6974830 7021802 7027715 6970442 7102929 6854227 7222093 7372170 6805962 6958915 7259485
17212 7259485 7002841 7086602 7024634 6941951 7256566 7451824 7562859 7225538 8061631 8516121
17202 8516121 7723078 8397615 8424898 8184096 7425963 7902535 7590260 6985859 6379389 5996240
17192 5996240 5730447 5238678 5575939 5756741 5648788 6291537 5829805 5783601 6275536 6103195
17182 6103195 6136012 5645836 5763959 4983817 4874152 4660682 4690769 4801725 4854307 4513176
17172 4513176 4798449 5004302 4648488 4637729 4679403 5389236 4597580 5124575 5258296 4792665
17162 4792665 5049101 5350034 4914240 5291531 6088464 5669916 5942080 6326251 5693233
17153 5693233 6005621 5768499 6006090 5459874 5463660 5088221 5780440 5478495 4921160 5176943
17143 5176943 4814981 5129919 5271361 5665145 5125545 5391751 5784353 5278309 5320235 5297583
17133 5297583 5217514 5807483 5806714 5612189 5394051 5652015 5879001 5981917 6938702 6911350
17123 6911350 7346521 6965919 7213026 7986542 7880412 7673390 7207516 7178144 6813224 6687478
17113 6687478 6148798 5650944 4822111 4372222 4144208 3726020 3534358 3766877 3332283
17104 3332283 3183220 3342141 2719220 2800207 2831406 2508987 2796293 3060043 2670064 3125855
17094 3125855 3058279 2713901 3100753 2728034 2719472 2742268 2434823 2128624 2322472 2296657
17084 2296657 2500531 2678383 2510418 2349917 2554509 2832421 2462369 2397266 2237961 2028728
17074 2028728 2704884 1928831 2450049 2199050 2286974 2133369 2312487 1934481 2059448 2337672
17064 2337672 1735074 2474208 1676186 1952579 2088621 2236181 2267032 2287721 2991950 2317190
17054 2317190 1508095 1921712 1764294 1922999 2048157 2225506 2204046 2040022 2062216 2246076
17044 2246076 2292942 2342506 2070508 2320065 2414603 2675584 1959046 2240901 2337474 2172834
17034 2172834 2352903 2793570 2685801 1985004 2346186 2324298 2633618 2452806 2157857 2225394
17024 2225394 1579232 2553740 2385371 2152284 2551913 2180684 1953074 2339684 1977349
17015 1977349 2822051 2239530 2317999 2621570 1928419 2365329 2547712 2466838 2311594 2468611
17005 2468611 2437448 2621090 2225071 2591129 2574342 2391056 2325329 2272773 2443555 2414971
16995 2414971 2687727 2318961 2259197 2244704 2051623 2081210 2298804 2031635 2447754 1953031
16985 1953031 2647083 1977188 2735268 2492424 2336185 2348806 2511831 2597633 2713838 2229650
16975 2229650 3094169 3084072 2901518 2455101 2901601 2805967 3120487 3370573 3350151 3644832
16965 3644832 3722883 4474357 4612080 4915008 4918763 5244096 5189780 5393265 5286114 6141016
16955 6141016 6271164 5632941 6089555 5746647 6383248 6004175 5148593 5301858 5490317
16946 5490317 4725008 4469653 4137801 4701681 4217244 4033766 3717119 3421891 4159649
16937 4159649 3548796 3267374 2535156 3072205 2522982 3002685 2815117 2506653 2680567
16928 2680567 2616603 2400205 2609379 2429513 2284544 2345681 2133915 2743442 2426477 2404408
16918 2404408 2178780 2427629 2292727 2300543 2192550 1988585 2441441 2462413 2389746 2362628
16908 2362628 2072571 2179228 2026740 2030510 1846089 1792170 2061735 2280543 1958742 1687753
16898 1687753 1814824 2163108 2335681 2039409 1981308 1625051 2068745 1493576 1818101 1888124
16888 1888124 2037874 2069890 1884251 1832837 2160623 2034049 1758142 1994368 1912777 2171554
16878 2171554 1586633 1579667 2446761 1952760 1949356 2484639 2314333 2396415 2290101 2543229
16868 2543229 2424570 2194737 2014570 2724849 2679674 2104507 2590519 2227664 2226375 2001476
16858 2001476 2507090 2281383 2302436 2359441 2420634 2713236 2626754 2504850 2484389 2393461
16848 2393461 2580704 2608864 2413508 1933367 1828836 1869464 1882594 1751089 2493182 1906056
16838 1906056 2393054 2099970 1635106 2160976 2291443 2515014 1781749 2204387 2156097 2245634
16828 2245634 2123825 2223846 1812185 2305017 1882318 1992405 2156710 1934839 2589437
16819 2589437 1739058 2411771 2052689 2603448 2164120 2551001 2238622 2042273 2238972
16810 2238972 1956572 2186475 2446738 1963194 2134322 2101962 2592676 1850485 2169612 1924304
16800 1924304 2418696 2268419 1894336 2045683 1910422 1970334 2263317 1899387 1660061 2130285
16790 2130285 1764758 1638198 2035407 1573457 1399888 1542411 1699301 1804523 1805800 1530610
16780 1530610 1284223 1614608 1703714 1203828 1433148 1304110 1607507 1341085 2170726 2065535
16770 2065535 1370243 2065821 1500166 1648455 1787173 1607337 2084751 1595533 2274401
16761 2274401 1719444 1900690 1786335 1923259 1585517 1723106 1967156 1740697 2179785
16752 2179785 2002901 2202504 1736982 1832213 2120725 1662957 2021256 2062749 2025156 1845502
16742 1845502 1559221 1526321 1782113 2270469 1616550 1989946 1960914 1917846 2168971 1821885
16732 1821885 1759421 2042447 2081759 1656643 2409394 1924470 1990841 1825225 1728745 1972150
16722 1972150 2087194 2208608 1829217 3107053 2209948 2600329 2384604 2060782 2729948
16713 2729948 1968535 2091454 2603064 2384550 2473718 2646155 2508311 2854678 3337689 3626677
16703 3626677 3579991 3546279 4241083 4699671 4821586 4885508 4557015 4529724 4805111 4331006
16693 4331006 4540221 4722506 4716389 4498324 4864052 4891531 5542582 5061233 5100113 5610100
16683 5610100 5288439 5528942 4895800 4833829 3805521 4827471 4005963 3299250 3564168
16674 3564168 3588206 3318184 3724599 3734153 2963601 4072589 4285377 4695619 4951806 5042096
16664 5042096 4834459 4998293 5336136 5180707 4848003 4487037 4703613 4438179 4470716 4917227
16654 4917227 4096377 4822599 5420376 5201760 4636962 4779990 4809029 3576896 3517989 3376573
16644 3376573 2620289 2942573 2473850 2348267 2301453 2266949 2066976 1856229 1304032 1759805
16634 1759805 1968959 2218561 1893059 1802108 2261659 1722094 2060078 1964442 2121619 1840507
16624 1840507 1726449 1269648 1739396 1860438 1685405 1820737 1957039 1777270 2000843
16615 2000843 2172070 1658130 2251675 1551319 1944131 1539386 1821008 1867417 1896845 2344744
16605 2344744 1775427 1647492 2386199 2368557 2643937 2043670 2018907 2670409 2379848 2117103
16595 2117103 2056555 2195028 2457008 1973370 2058307 2075255 2158274 1773210 2005228 1806886
16585 1806886 2367435 1673804 2452736 1903396 1790970 2080960 1905279 2235145 1812797
16576 1812797 2148345 1862302 1718987 1564211 1627026 1876956 1154561 1385303 1533673 2261106
16566 2261106 1876466 1844369 2365699 1381342 1251238 1635823 1447773 2043281 1534758 1993327
16556 1993327 2167774 2112185 1504330 1713570 1983272 2154081 1844024 1863873 2204245 1706589
16546 1706589 1949455 1929749 2204406 2093715 1748292 2097245 1852541 2170877 2093137 2515484
16536 2515484 2406724 2084627 2435720 2242761 1815435 2286425 2196457 2274548 2522870 2680675
16526 2680675 2580322 2772097 2404577 2456163 2743164 2745642 2935555 2520261 2495437 2558232
16516 2558232 2595829 2721953 2929549 2676596 2711925 2273391 2722587 1899671 1892731 2095708
16506 2095708 2251394 1427316 1731889 1165070 1179004 1785529 1650128 1626098 1834346 1904109
16496 1904109 1683269 2124145 2224833 2508119 2112497 2155521 1676529 1503248 1271544 1088394
16486 1088394 917678 759556 1280976 1366065 1716443 1999111 1954921 2211998 2763735 2607185
16476 2607185 2724617 2353449 2476869 2750774 2680639 2644056 2238595 2162501 1901771 1401504
16466 1401504 1726226 2271460 1882209 2697043 2195877 2474905 2552454 2371155 2739212 2513239
16456 2513239 3091439 3392298 3347526 3555354 3412453 3845072 3973065 3655454 4044291 4035194
16446 4035194 3995220 4300021 4565834 4717793 5049560 5607195 6094339 6473155 6551768 7639820
16436 7639820 7547459 8346465 8978964 9085196 9315698 10271575 10552845 11844423 12463123
16427 12463123 13561699 15277182 17182474 19070817 20145672 21821827 23631350 25620436
16419 25620436 28111052 30515814 33045618 36759598 40355567 45539007 49860974 55134164
16411 55134164 60714412 66019962 71306835 76977220 82547142 88587944 95057519 100824293
16403 100824293 105085165 105905379 106795715 106397486 106230329 107140514 108491047 111015591 114280701
16394 114280701 114683049 113862855 112763076 114075250 119183324 133196793 152975045 165291703
16386 165291703 162796493 150200778 130549407 105604906 79303037 62270904 54808095
16379 54808095 55630677 51575159 37915877 25632732 20857067 21587367 24197335 24215626
16371 24215626 23290407 21740062 20445579 19179029 18620881 17455116 16274389 15344500
16363 15344500 14290745 13332138 12451154 11880928 10779695 9657856 9548551 9022794 8434875
16354 8434875 8391887 8124333 7904505 7659553 6896821 6743232 5444773 4777821 4134506
16345 4134506 3080799 2773703 2184516 1834937 1756368 1416659 866764 937121 658372 779659
16335 779659 171891 488876 278867 656825 261033 550729 604345 604900 1558683 1197042
16325 1197042 1447362 1715070 1658980 1661489 1465285 1886639 2021424 1754034 1431061 1787295
16315 1787295 1805549 1050012 820058 1425982 984120 906806 657061 1284323 1042188 274156
16304 593803 428173 890540 226421 343793 932197 614877 1120324 699101 203696 107196
16294 107196 -117016 324876 467068 204811 297102 796602 57709 213977 645959 224854
16283 1055918 383841 526547 -42537 -263824 84643 -294443 -734348 -600650 -393650 -6636
16272 529790 795496 894081 1697699 2084662 1874644 2302620 2405293 2432732 1727961 1344514
16262 1344514 992204 872047 661492 726544 1012794 217141 217389 -161925 382446 34318
16251 642232 398513 198766 957309 1119270 370241 796763 416267 1233099 906679 1301063
16241 1301063 1608071 2028148 2423877 1926534 2143994 2083486 2636949 2276499 2345139 2048028
16231 2048028 1604782 1471873 1478677 1375410 1140924 1285282 1035529 965112 1425814 981994
16221 981994 1229223 1049238 1327128 1069028 1060498 1000455 1073111 1056009 1066556 883879 824964
16210 824964 1550777 934781 870166 1150855 855245 748212 719857 917845 870918 925360
16200 925360 1304800 1468572 1103349 1171034 1220180 1361606 1332477 884880 886335 1367526
16190 1367526 1082337 1174824 1188230 1745130 1577788 856432 1625424 1843141 2157276 1964958
16180 1964958 1919177 1693795 2013049 2116721 2045104 2213242 2120259 1788308 1918048 1363126
16170 1363126 1600980 1956617 1557049 1760284 1638131 1994548 1364276 1663634 1761976 2055538
16160 2055538 1731606 1564523 1452120 1350900 1461555 1859903 1308717 1600405 1523976 1106180
16150 1106180 1059817 1494521 1063332 1561670 1542791 1636297 1447082 1614710 1462815 1773097
16140 1773097 1875751 1364590 1901705 1778083 1958665 1426391 1174890 1280604 1495119
16131 1495119 1853402 1653901 1105306 1474345 1548109 1093933 1120756 1305390 1657958 1545672
16121 1545672 1056217 1380918 1383511 1451184 1722542 1332794 1367563 1027885 1471827 1424982
16111 1424982 1603166 1547567 1352477 1463918 1457690 1213724 1562429 1684719 1364424 1537040
16101 1537040 2027074 1391069 1431509 1553765 1902369 1572774 1388055 1545852 1743938 1583961
16091 1583961 1455519 1891327 2093692 1844893 1838850 1885631 1590078 1534715 2145409 2089704
16081 2089704 2002456 1886224 2253708 2122783 1986505 2325557 2453853 1885662 2242342 2193628
16071 2193628 1809922 1998005 2361672 2570194 2466310 2927296 2676947 2753295 1991277 2405901
16061 2405901 2574331 2468850 2706446 3113185 2331616 3140169 2918259 2586587 2633700 2767547
16051 2767547 2728210 2769644 2543204 2919277 2914319 3420969 3086955 3485428 2926676 2784155
16041 2784155 2878164 3021379 3318330 2961282 3503839 3265400 3224597 3166431 3296138 3414461
16031 3414461 3522452 3531551 3506064 3552458 3587189 3769959 3489471 3693378 3480003 3464912
16021 3464912 3802191 3543081 3633054 4046598 3872871 3955226 4354698 3963387 3871929 4050822
16011 4050822 4544771 4322562 4475161 4556480 4236145 4742264 4361560 4202234 4556678 4011695
16001 4011695 4357522 4324020 4575207 4352754 4594473 4099206 4171832 4193033 4269952 4301853
15991 4301853 4443994 4125113 4172996 3984162 4037872 3881942 4258462 4075714 4903230 3933070
15981 3933070 3946313 4600509 4493876 4316212 4559714 4861246 4414125 4610746 4580460 4157350
15971 4157350 4371885 4631685 4404782 4369068 4604973 4113761 4095735 4349725 4527180 4828604
15961 4828604 4384137 4319805 3793475 3954382 4578939 4103629 4430512 4571531 4780973 4241233
15951 4241233 4603318 4296084 4541303 4326092 4393497 4703404 4416326 4175571 4284980 4864499
15941 4864499 4360490 4618299 4559722 4402538 5110952 4667389 4745252 4484756 4845328 4571567
15931 4571567 5073746 4770513 5149747 4944732 4847345 5590793 5762682 5634523 5959402 5639569
15921 5639569 5607631 5484287 6125643 6074792 6316045 6266343 7299403 7463591 7240374 7895877
15911 7895877 7684549 8802779 9450487 10178351 11357333 12606536 15050770 18156362 22941909
15902 22941909 29285804 38187941 50593603 64636529 80290929 95065515 108512668
15895 108512668 118671917 126099376 128584264 126137672 118629442 105468398 89516632
15888 89516632 71929694 55426264 41624772 31144379 23738039 18425737 15093435
15881 15093435 12279104 11076757 9343444 8181194 7754817 7258804 6645032 6339605 6075078
15872 6075078 5759439 6050822 5857917 5576245 5428197 5405614 5058072 5088266 4554875 5232778
15862 5232778 4868025 4566884 4440104 4630850 4679567 4762251 4759820 4298768 4200186 4033496
15852 4033496 4100510 4358701 4177211 4073699 4496452 4106860 4492559 4251806 4130661 3905134
15842 3905134 3998428 4203777 4165227 4391080 4097285 4592457 4178853 4234670 4534172 4495273
15832 4495273 4660709 4786897 5126892 4331374 4291570 3942369 4331127 4329904 4358917 4103579
15822 4103579 4802078 4427082 4348100 4594230 4057396 4790534 4881808 4417208 4216299 5002169
15812 5002169 4767382 4297646 4835148 5083670 5456255 4870453 4831364 4832826 5073303 5171970
15802 5171970 5284018 5118658 5387483 5697137 6126900 6738094 6252291 6844005 6846133 8087099
15792 8087099 7956293 7862323 7976579 8123219 8716173 8645590 8794471 8574834 8918876 8916046
15782 8916046 9369292 10595758 10817122 11363029 11486911 12515191 12517988 11968482 12633253
15773 12633253 12218226 12379789 11972669 12080503 11729583 11749610 11458556 12103474 11982695
15764 11982695 11967657 12456953 12615243 13057227 13075843 12875686 13054430 13147483 12338957 12152617
15754 12152617 11407463 11487008 11141213 11004452 10998445 10590523 10507534 10274505 10663272 10908168
15744 10908168 10941272 11302487 11922013 12155877 13349332 13607234 13888586 14602171 14640394
15735 14640394 14736768 14860016 14416377 14386150 14648000 14592989 14760246 15304111 16033233 16599774
15725 16599774 16087705 16124383 16289002 16245643 15823050 15188269 14765235 13644788 14448184
15716 14448184 14351250 14259819 14745741 14214128 13989996 13803581 13568912 12934086 13062576 12124682
15706 12124682 12172329 12507350 13087435 13961520 14352286 15584277 16132507 16286824 17446908
15697 17446908 17099875 17752036 17732215 16709039 16880758 16190418 16212119 15726256 15818285 15300338
15687 15300338 15439637 15806149 15757844 15797173 15596319 15105023 15266506 14431840 14580358 14516301
15677 14516301 13905808 13500012 13416033 12629652 12216930 12423140 11652308 11697495 11152775 11348786
15667 11348786 11816607 12031250 12850423 13831853 14158923 15217966 15870481 16602130 17961746
15658 17961746 18920323 20064129 21476206 22666318 24034497 25437844 26524371 28156355
15650 28156355 29564025 31095532 32475086 33755287 34889754 36209642 37122252 38293715
15642 38293715 39445965 40760542 42759537 44749474 45973293 48185419 49290050 50665335
15634 50665335 51493868 52236594 52001773 51308273 50690139 49518491 48459084 48036423 48076007
15625 48076007 47992242 47569331 47334894 46883808 45978437 44675967 43178728 41426358 39200481
15616 39200481 36199535 34335859 31771233 30772332 28950947 27622118 26457823 25902612
15608 25902612 24628579 23904263 23126030 22297141 21556293 21033998 19995593 19535450 18735187
15599 18735187 18440646 18471388 17683389 17741996 18681924 18332471 19088066 21238634 24972057
15590 24972057 32933888 45103348 59717221 74469634 84065668 91322989 96239765 100388763
15582 100388763 102743517 100179619 87084024 69425257 52196391 36908667 26506828
15575 26506828 20696128 17700170 16123938 14992149 14574783 14200111 13627171 13773661 13748992
15566 13748992 13618902 13299395 13634184 14099022 14199759 14060744 14699134 15235444 17692836
15557 17692836 20084674 26692858 38673231 55299336 75920448 94086836 105510643
15550 105510643 114432449 120789001 125731354 127753532 121827379 102235650 78566980 55260797
15542 55260797 37478918 25511686 19058152 15897128 14088566 13102003 12261467 11390151
15534 11390151 11314998 11351068 11305958 11081595 10871269 11198574 11028731 10718127 10261651 10959453
15524 10959453 10576978 10427416 10142949 9688271 9654006 9799820 9396875 8821321 9680634
15515 9680634 9667280 9422963 10163953 10437422 10238923 10484201 10695623 11042576 11375808 11719148
15505 11719148 11635155 11967256 11362549 11605744 10862086 11017501 10555291 10594717 10626905 10532816
15495 10532816 10321494 10362468 10574976 10622950 11045380 10869547 11679049 11871078 11850648 11581520
15485 11581520 11660020 12212812 12151704 12400097 12687101 12360004 12622968 12930285 12944787 12951611
15475 12951611 12990952 13427002 13398124 13835310 14604475 15774450 17049571 18556152 19123475
15466 19123475 20326098 20875051 20801027 21061351 21398857 20942609 20242451 19155264 18748597
15457 18748597 18615673 18782597 19747816 20271563 21349967 22338128 23961937 24475856 25290728
15448 25290728 25859073 25620828 24910010 24722733 23680547 22580055 22816245 22246161 22086932
15439 22086932 22227747 22249043 22177110 22697842 22528806 22786726 22268353 22012310 21179123 20582395
15429 20582395 19775855 18568676 18049188 17316156 16837390 16708817 16219163 15378850 14683065
15420 14683065 14763194 14215159 14427082 14262288 14023163 14436104 13517123 13253750 14004781
15411 14004781 13727817 13991079 14163796 13856260 13975364 13637122 13964831 13849860 14125727
15402 14125727 14151243 14981707 15033652 15883893 16257754 17328761 16986976 17426962 17463385 17532119
15392 17532119 17840578 16929334 16713293 15792843 15469804 15054555 15681298 15330419 15088271
15383 15088271 15068252 15227142 15014403 15683809 15488209 15151963 14601599 14412601 14897526
15374 14897526 14519939 14537444 15006598 14537363 14455295 14847675 14838044 15034933 15401486 15485858
15364 15485858 16306201 16633044 16686717 16600859 16772995 17301630 17311127 17363143 17205446 17698013
15354 17698013 17949390 18695216 19021679 20208398 21728238 23803130 28583964 35236009
15346 35236009 43635739 52318762 59512399 65358815 69550152 72493424 74320063 74400866
15338 74400866 70871608 62891828 53730237 46410364 40944345 36737212 34977243 33937798
15330 33937798 33455788 33073426 32204004 30949929 29501678 27895673 27332085 26329591 26523484
15321 26523484 26329169 27052792 27598627 28221088 30119651 32590787 36845686 44835379 56269401
15312 56269401 70674862 84096466 96843792 105094689 111830700 115492420 117019854 112923413
15304 112923413 101548601 84930291 66549268 50325621 38623529 30364819 26162715
15297 26162715 23849588 23050086 21693840 20998141 21886745 21609090 22399996 23051865 23481944
15288 23481944 23764055 24021638 24585532 24961337 25255757 25163343 25309046 26567877 29603573
15279 29603573 35689415 42716304 50075523 55133963 59198368 62258730 64082152 65146882
15271 65146882 64989994 59748182 51227057 42109118 34519582 27655508 23781180 22058425
15263 22058425 21111457 19998695 19255432 18412551 18182139 18179054 18345560 18257768 18946363 18973223
15253 18973223 19167918 19758429 20426887 21412798 21813037 21734873 22228629 22100836 21970082
15244 21970082 22210879 21903531 21689908 22373058 21609365 22394311 22665446 23754020 25530738
15235 25530738 27007061 28651340 30126293 31382203 32252305 32913395 32672849 32275742 31096558
15226 31096558 30263779 29039810 27274934 26203350 25409181 25082800 24914117 24800628 24604797
15217 24604797 24944333 24904886 24376675 24256226 24996561 24974396 24683792 23563980 22713238
15208 22713238 22223840 21083106 19869627 18064931 16631420 15157101 14293993 14019247
15200 14019247 13863254 13267581 12927767 12821162 12584900 13052464 13043732 12616603 13408991 13507459
15190 13507459 14468594 14484471 15378467 14828183 15200530 15683463 16086479 16266404 15957031
15181 15957031 16435401 17076355 17258767 17598002 17851177 18274603 18559308 18477631 18753955
15172 18753955 18754292 18496425 18480156 18058229 18199984 17414018 17522304 17016911 16793314 17176378
15162 17176378 16222203 16921148 16685903 17134834 17232862 17426846 17489000 17103613 16703352 16833839
15152 16833839 17408165 17019239 16556960 16590757 16438270 16447565 16199583 16140331 15829826 16747847
15142 16747847 16708159 16826371 17330981 18008823 18379281 18711394 19261321 19500284 19322785
15133 19322785 19645388 19630045 19353592 19403152 19097284 18974076 18546865 17977718 18228825 17916237
15123 17916237 17538915 17362313 16980678 16776288 16449772 15757596 15953606 15264413 15257971 15234879
15113 15234879 14711848 14752532 15155816 15470519 15121115 14565098 14393828 14914916 15079055
15104 15079055 14817612 15477263 15810750 16257479 16458782 16424069 17577420 17847187 19400920
15095 19400920 20304708 20883355 21955057 23346053 25353883 28493134 31469350 35169444
15087 35169444 38960703 42114516 43830197 44685692 46479262 46237085 45309791 43684057
15079 43684057 41661947 38257097 36779710 37004875 38921409 42321067 45495090 48171119
15071 48171119 50828606 52216663 53347106 53577639 53284649 51579435 49796826 50088200
15063 50088200 51486931 55498889 58923766 62310948 66226801 69886409 73338002 78269070
15055 78269070 81018056 80457486 79169490 77614872 78217911 80028652 84082538 87877216
15047 87877216 90877276 92229157 92103539 92408388 92567343 93203727 93949570 92260394 87906949
15038 87906949 84302077 81301565 77931908 74851491 71760922 67562459 64145213 59958865
15030 59958865 58386511 59118417 60198468 60491871 60974904 61331752 62581417 63297572 64077883
15021 64077883 62047635 59932526 58086570 57910046 60837580 66377830 74565843 82309200
15013 82309200 89823524 97504470 104158808 110354792 114862293 117312115 117094556 115656240
15005 115656240 113628181 112872007 114132920 117663066 122978915 129006449 136819194 143162182
14997 143162182 148935350 153846736 156767463 156318601 153029453 146379085 137989017 128355085
14989 128355085 119831716 113854784 110640093 111101766 112485395 116206024 121575808 129334565
14981 129334565 138845208 149995801 162527912 174736318 188267285 203470649 219158316
14974 219158316 233561058 247399260 258017161 264772968 267270494 264785413 257791167
14967 257791167 244932720 228505424 209449022 189349252 169694632 152216243 137446536
14960 137446536 125208804 116704716 110998213 109361455 111248182 117524402 129207794 146120068
14952 146120068 169084357 198304246 232027258 268310971 307191322 348024895 387748487
14945 387748487 423061578 449894232 464225006 466341346 455953813 437568684 416134030
14938 416134030 390315976 358354520 320534621 284286867 254070789 231987865 218159100
14931 218159100 207861423 198067101 186042945 172626384 160026544 147511954 137627310
14924 137627310 130424344 124667566 120680388 115715257 109734155 104573892 98942910 94637272
14916 94637272 89628343 82933750 73201047 62633932 51856165 44955537 38994906 35441494
14908 35441494 33265126 32986507 32804563 32697883 32959186 34160226 34741298 36451733 38956738
14899 38956738 41155793 43299886 47284504 51424477 57278266 63490570 68589347 72590387
14891 72590387 75366351 77730116 79469654 80586839 77670931 71369319 64423606 57979021
14883 57979021 53054710 50713213 48670842 46106865 43578623 41937731 40725783 40833346
14875 40833346 41490919 42871701 44001586 44695699 45485747 46409797 46643227 47893081 48914572
14866 48914572 48565500 48350456 49444517 49787702 51815892 55165033 60210590 68404940
14858 68404940 78228289 89020832 100812306 111118074 119982307 126577203 130030057 128828587
14850 128828587 123354733 114900637 103959366 90712992 77342253 65128943 55720797
14843 55720797 49111593 44160042 41803840 40327896 40098870 38525147 37509352 35749251
14835 35749251 34787153 33605658 32177471 31966017 31391319 30407858 30559886 30455331 30488345
14826 30488345 31374953 32292556 33448550 35173493 37758928 42662016 49996979 59035141
14818 59035141 68270332 76088888 81285295 85549445 88358407 88893241 86666042 79586593
14810 79586593 69419609 57267165 46302563 37013773 30919000 27126529 25458411 24219285
14802 24219285 23637934 23405130 23001975 23453299 24168137 24972912 25676490 25044654 25072492
14793 25072492 25514312 25439603 25403180 24986736 24358420 24158640 23388051 23097296 23287796 23265312
14783 23265312 23988838 24296227 24825318 25208567 26745913 27521865 28165619 29053886 29668136
14774 29668136 30576700 30407310 29870078 29238672 27619164 26027926 24083058 22842113 21843599
14765 21843599 20565888 19900295 19690271 19474231 19864532 19589726 19755539 20253560 20581505
14756 20581505 20809625 21036156 21710381 22630979 24445247 25240719 27088598 28268721 29468450
14747 29468450 29541703 29364460 30293695 30114875 29547674 28520905 28120737 28048823 28026610 29253161
14737 29253161 31104448 33865412 37238632 41536318 48105359 57906176 73364032 95967500
14729 95967500 126777410 164239627 204595680 243216133 278009318 305375611 323697851
14722 323697851 333272884 328244031 308659540 275863536 232740822 185201837 141826934
14715 141826934 105935961 79374990 62696608 52275246 47265459 44219381 42013466
14708 42013466 40198169 37962661 37368046 37228373 36019681 32877760 29030079 25295024
14700 25295024 22569353 20686426 20210284 19780585 20062089 21311199 23311366 25617186
14692 25617186 27768415 28683444 29848469 30224631 31441759 31773369 30589379 27630267
14684 27630267 24647394 22583842 21634745 21262027 22289174 23148784 24267060 25747421
14676 25747421 27128340 28681369 30118527 30628278 29887370 29789710 29353046 29074557 27610139
14667 27610139 27212057 28585025 30980170 35229652 38257738 40290772 41566314 42915489
14659 42915489 44458736 45346225 42353699 35190796 29534911 22499893 18820009 15979819
14651 15979819 15324161 16420688 17784565 21283938 25408067 28908594 31399154 33755067
14643 33755067 35548935 37495192 39242843 39509300 37446916 35595349 33405485 32454458
14635 32454458 32347703 33322919 33602188 34134750 33818963 32727402 30123454 26438683 23049424
14626 23049424 18928520 15348929 12714586 11057007 10403890 8755297 8909550 8833117 9149054
14617 9149054 9175099 9115434 9167240 9258024 8875073 8874316 8415373 8684355 8648934 8255559 8300246
14606 8300246 8396532 8141682 8521065 8968307 9987304 11542618 13829876 16346549 18993794
14597 18993794 22128913 23564865 24961705 25245991 25060078 25035034 23373967 20637358 17264302
14588 17264302 14270374 11724870 9868272 8999815 8760567 8252625 8597430 8362357 8209648
14579 8209648 8814607 8614819 8420009 8615504 8817844 10065787 10313597 11297709 12502795
14570 12502795 12783975 14527371 17273180 22369778 27562904 33234934 37109980 40104421
14562 40104421 43105980 47484232 53828521 60823950 65652335 69354587 71218357 72365259
14554 72365259 73249437 73963437 73826070 71961925 65909633 55561303 45375645 35931951
14546 35931951 30096265 28627175 33114352 41266114 52647684 64525775 76216607 84486426
14538 84486426 89459979 93572197 95554278 94044853 85974379 73902538 59977082 46176959
14530 46176959 35593238 29607719 25569369 24694708 23931546 24044577 23624948 23498237 24354439
14521 24354439 25429851 30166903 36538701 44985380 51519052 57724245 62557696 66336598
14513 66336598 70617984 73215210 71170269 65882089 58214062 51023246 45512908 42544282
14505 42544282 41976784 45044836 49911383 55114167 58721006 60951386 63107103 64783918
14497 64783918 66126152 67293936 65335429 60167268 55629984 50037440 45189904 40227243
14489 40227243 36744062 33660189 31640629 28242239 24147141 19204731 14978007 11531740
14481 11531740 9801359 8279015 7701618 7354383 7263499 7116860 7399782 7394419 8199154
14472 8199154 8182662 10095012 11573222 13369580 14268142 14986232 15977335 16870318 17285583
14463 17285583 17191056 17033793 16140334 15862232 16204943 17359746 18667917 20674180 21820229
14454 21820229 22781219 23021242 22918593 22683075 20564694 18495445 15780404 13640358 12376729
14445 12376729 11796997 11585064 11247335 12084025 12370325 12606564 12959041 13501721 14037618
14436 14037618 14418232 15205782 15259349 15751597 16572025 18339136 21087716 24420179 29083074
14427 29083074 36201539 43082911 49746737 54747333 59744482 62850779 64752236 65004602
14419 65004602 62207970 57078554 49937898 42676294 36115512 30540313 26795792 24384908
14411 24384908 21570701 19805265 17391796 15829841 14624682 13402593 13162593 12808241
14403 12808241 12481985 12067009 12291488 12057676 12133267 12689934 12824616 14141760 15518972
14394 15518972 19341619 24086882 31082471 40688706 52192785 63954980 74670955 83906430
14386 83906430 91007571 96020408 97749759 95761872 88802204 77869088 65170108 52365345
14378 52365345 40796463 32365337 25774870 21526843 18738679 16497470 15421593 14115873
14370 14115873 14231981 14105125 14081338 13532620 13517322 13521078 12850522 12931922 12780795 13188526
14360 13188526 13738038 14153428 14841008 16478541 18312775 21326575 25422496 30800040
14352 30800040 34908685 39453086 42356552 45268324 46115586 46152219 44996296 41399072
14344 41399072 36627513 31551389 26212822 21807494 18256294 16840225 16526414 18673351
14336 18673351 22720112 28157121 34861052 38750489 41338740 43961878 44933926 45960388
14328 45960388 46872126 41280201 33178578 26620324 19512935 15339994 13225045 12339432
14320 12339432 11709941 11213852 11462132 11010665 11700076 11909462 12624777 12547136 14076708
14311 14076708 14699652 15446133 16018557 17383243 18170775 19932713 19706488 20926313 21795351
14302 21795351 22662776 24916753 27007964 29622440 33581067 37971621 43620059 51743199
14294 51743199 61891757 75449371 93570380 117859058 148331340 182304327 218602057
14287 218602057 250787379 276738059 296725406 308911943 313412949 306795356 287438680
14280 287438680 255579440 216361359 176135580 139812808 109522364 86600541 69406311
14273 69406311 57062685 47478120 39836350 34280333 29749440 25327553 22745614 19951995
14265 19951995 17580672 16098851 14903298 13410466 12501048 11715122 10889671 10371527 9868384
14256 9868384 9416483 9096552 8902748 8971257 8591466 7908239 7963346 7652604 7275089 7080976
14246 7080976 7019068 6377379 6523842 6335255 6280130 6199727 5981612 6305622 6486614 6114309
14236 6114309 5784426 5777400 5677017 5207188 5512210 5229831 5005697 4995604 4779672 4493326
14226 4493326 4535228 4245405 4972104 4900502 4920565 4884479 4581043 4798457 5096657 4961394
14216 4961394 5215917 5317979 4725066 5313527 5258734 5343241 5233845 5056864 5923792 6650320
14206 6650320 7250956 7882822 7636009 7905999 8089129 8481399 8423795 7131309 5907716
14197 5907716 5786597 4342176 4179079 4095129 4361587 4282090 4205322 4828751 4643791 4844778
14187 4844778 5040671 4756592 4724470 4628325 4424300 4788649 4410551 4144174 3819446 3693342
14177 3693342 3709467 3744765 4251021 3765312 3970009 3923403 3679502 3809189 4170287 3555348
14167 3555348 3927332 3812492 4066934 3870355 3970241 4093276 4145210 4094467 4393991 4366414
14157 4366414 4547158 4477598 4892059 4777447 4470691 4284504 4011752 4538847 4413325 4480163
14147 4480163 4307423 4185265 4702804 5106204 4829994 5634606 6858744 7785361 9750097
14138 9750097 12802522 14728201 17153384 17821355 19368861 20215547 20684203 20117095 17917226
14129 17917226 14825970 13142939 10499761 8708071 7201144 6630900 6379000 6707504
14121 6707504 7739518 8484188 8913453 9210997 9696841 9875939 10664457 10373539 10287842
14112 10287842 9384985 8542580 7876175 6847080 6054944 6115686 6272392 6501153 6159336
14103 6159336 5846677 5735358 6317218 6173416 7330140 7131706 8109122 9441412 10262403
14094 10262403 10569904 10348147 11090679 11507431 11333033 10282043 9802622 8875069 8514057
14085 8514057 8952792 10328138 11217949 12988708 13049781 14518863 14637914 15290959 14892478
14076 14892478 13693140 12219717 10761087 9058003 7714581 6625429 6555318 5913709
14068 5913709 6043761 5906826 5852727 5976749 6236791 6107821 6614432 7350877 8362553
14059 8362553 9366234 9622618 10486493 10496713 11510277 11845628 11901737 11699941 10959628
14050 10959628 10290449 9996091 9982372 10429228 11313114 12488916 13069042 14232160 15387143
14041 15387143 16191346 16481718 17090913 17186532 17203252 16799298 17268246 16605914 16554773 16245193
14031 16245193 16777614 17898650 18953903 20954706 21929880 24628808 26874809 30295939
14023 30295939 34231574 39474853 45839581 53731514 64237327 79211525 99109907 125978282
14015 125978282 159308489 196179378 232360206 264729805 289403763 307664399 318063061
14008 318063061 318957310 308096168 283091038 245978568 202862962 161742360 126479383
14001 126479383 98705453 77399813 61969401 51099635 42800348 36234333 31460259
13994 31460259 27534238 24653783 22208014 20763345 19107670 18345775 17217269 16358034
13986 16358034 16387235 15809744 15354917 15341470 15118766 15126003 14568814 13267125 13032373 12563012
13976 12563012 12713501 12592962 11813022 10935440 10385385 10221928 9868956 9264049 8352626
13967 8352626 8386143 7168128 7126351 6682027 5952717 6510334 6423514 5555348 5753259 5556698
13957 5556698 5633612 5667899 5382485 5591879 5348920 5361946 5524405 6115062 6521948 6564393
13947 6564393 7437388 8005459 8034318 8912086 9295819 9730626 10964743 12068437 15063706
13938 15063706 20274815 27380193 35344493 44665190 54144199 63101630 70247190 75305364
13930 75305364 77878361 76350825 71158551 63040321 53937621 42862054 31969248 23128993
13922 23128993 16052888 12469720 8766858 7050383 6013599 5849790 5389019 5024333
13914 5024333 4688105 4554938 4401961 4383517 3990231 3910356 4253030 4187997 3968898 3913921
13904 3913921 3955072 4080420 3952411 3821074 3447721 3721022 3601610 3688382 4008992 3908750
13894 3908750 3468400 3975078 4141428 3693271 3546779 4231820 4045048 3912155 4072071
13885 4072071 3864289 4375508 3575188 3979085 3647141 3613792 3528443 3764296 3572719 3485521
13875 3485521 3342783 3907312 3327378 3282763 3744336 3259492 3996265 3802347 3482962 4010939
13865 4010939 4068370 3910018 4161910 4163862 3727934 4049782 3838333 4204934 4341675 3683433
13855 3683433 4067577 3902006 3830889 3956386 4121983 4344166 3995602 3912969 4305604 3903572
13845 3903572 4589370 4317571 4644371 4244342 4244411 4157711 3919340 4042618 3555989 3656048
13835 3656048 3531734 3890766 3567043 3353392 3515542 3220368 3269809 3120633 3172591 3721621
13825 3721621 3655227 3498625 3586758 3909379 3524971 3240711 3829549 3909281 3470924 3524724
13815 3524724 3289891 2972246 3871462 3075713 3328662 3344291 3168051 3044234 3673803 2831722
13805 2831722 3532339 3079538 3285385 3011516 2916493 3423609 3056648 3398639 3598054 3538517
13795 3538517 3932302 3267841 3902760 3437102 3959239 3761426 3525807 2572972 3684255
13786 3684255 3340821 2768289 3604961 3290125 3225308 3163856 3509666 3677809 3680884 3786210
13776 3786210 3694581 3775428 3914096 3111860 3858187 3726061 3733353 3383929 3554036 3861677
13766 3861677 3863286 3411718 3973376 3115988 3488850 3698097 3198335 3394816 3042038 3250273
13756 3250273 3028598 2689079 2681447 3103760 2920047 2537792 3381991 2494163 2684722 3143183
13746 3143183 3171120 3077462 2298910 3244531 2735218 3087596 2976904 2881192 3036948 3156000
13736 3156000 2485872 2906615 2873470 3520708 3847055 3111890 3298030 3358427 3581876 4243420
13726 4243420 3611736 4211495 4451087 4039012 4402391 4041730 4276210 4587896 3963732
13717 3963732 3973388 3995279 3534598 3422632 3125234 2648881 3016979 3191244 3641549 3385624
13707 3385624 3717914 3511335 3645885 3655755 3261334 3591720 3739474 3858491 3622730 3569877
13697 3569877 3576111 4446531 4372768 5216410 5344093 5941822 6316035 6361105 6186148 6346416
13687 6346416 6086083 5386219 4949242 4258662 3973271 3490918 3464599 3361176 3407983 3401720
13677 3401720 3758862 3919630 4009162 3992620 4422328 4212899 4795245 4569436 4468494 5217201
13667 5217201 5877685 6077968 6627106 7316327 7511626 8346202 8728100 8418711 8742969
13658 8742969 8278243 7746171 7285313 6527406 5539003 5622679 5183411 4906819 4341620 4334110
13648 4334110 4312968 3949257 4165136 4169223 3835400 4139810 4241925 4343417 3927499 4204703
13638 4204703 4032978 4447713 4784698 5987481 6015209 6458564 6641011 6451810 7559500
13629 7559500 7252570 7228667 6561081 5684306 5320097 4673562 4102093 3848633 3775746 3697910
13619 3697910 4026981 3325118 2872521 3229401 3037872 3712203 3330031 3273398 3489938 3596607
13609 3596607 4181651 4142506 4367981 4265128 4553650 4401258 4388538 4262855 3861298 3524424
13599 3524424 3862665 3432179 3907947 3859562 3685974 4034348 4322864 3947844 3872448 3886947
13589 3886947 4392582 4094647 4072388 4491033 4295649 3881567 3585844 3239912 3566128 3138987
13579 3138987 2916009 3571044 2753515 3219379 3296829 3282425 3088285 2943811 2635664 3212867
13569 3212867 3147869 3224808 3235197 2976639 3155248 2714754 3221850 3078423 3020017 2874477
13559 2874477 3136166 2784821 2792722 2813848 3106631 2703199 2586815 2976692 3208787 3286243
13549 3286243 2640871 3036842 3287367 3840803 3778327 4042172 4567756 4788721 5253825 5773627
13539 5773627 5690354 5994531 5320778 5796490 5377793 4518467 4230352 3546508 3569805 3848427
13529 3848427 3813654 3995409 4077579 5031288 4899944 4946942 5386469 5371597 5438783 5669638
13519 5669638 5085816 4662549 4327495 3611690 3462637 3523474 3099206 3033813 2659743 3128386
13509 3128386 2929103 2924532 2665165 2691105 2275437 2653053 2696591 2945447 2496947 2673752
13499 2673752 2837389 2884096 3017210 2530160 2765788 2946328 2473551 2871620 2743429 2580718
13489 2580718 2757880 2660986 2794716 2975321 2838974 2466633 2736569 2654448 2688975 2791536
13479 2791536 2728989 2746711 2798058 2631160 2669300 2696258 2716295 2275958 2623610 3164042
13469 3164042 2858480 2372355 3276864 2474088 2496172 2545064 3046224 3013128 3339795 2877772
13459 2877772 3029291 2527584 3364245 3390954 3201971 3674474 3798023 4899693 5036629
13450 5036629 5061952 5327803 5768697 5691989 5504875 5407861 4350628 4458529 3804902 3479447
13440 3479447 2738372 3131491 2660257 2451156 3057562 2600264 2519420 2884260 2926868 2207726
13430 2207726 2904393 2540226 2356123 3326914 2795109 3474628 3779425 3854687 4630480 4628767
13420 4628767 5159259 5410880 4941633 5462301 5498905 5196395 4774237 4445545 3729975 3485925
13410 3485925 3167255 2648193 3043267 3009749 3420049 2709672 2805323 2775846 2969159 3082077
13400 3082077 3192420 2719223 2968107 3450860 3096498 2831293 2914813 3001650 3124306 3225064
13390 3225064 3181258 3620229 4160000 3815851 4502938 4498463 5238317 4850343 5221132 5273603
13380 5273603 5374176 5289572 5627687 4810109 4468636 4238409 3676775 3530788 4099200 3606199
13370 3606199 3724721 3634495 3594634 3509675 3954923 4215254 4044645 4179424 3875156 3571298
13360 3571298 3743776 3903951 3549249 3691053 3394543 4218031 4358035 4572320 4495635 4319639
13350 4319639 4765048 4553080 4808072 4273948 4020648 3595820 3758563 3627838 3769027
13341 3769027 3682729 3780042 3705063 3675660 3685475 3611655 3872477 3436312 3785500 3980756 3779812
13330 3779812 4038062 3509504 3471514 3638148 4170126 3535104 3991115 4017752 4158676 3842984
13320 3842984 4050503 4155325 4214947 4206127 4346903 4923788 5274509 5575189 5384930 5630843
13310 5630843 6098199 5669150 5692163 5831576 5525407 5543500 5492037 5144506 5134221 4845643
13300 4845643 5677124 5760934 6015757 6150695 5998170 6283636 6539966 6590482 6865794 6014218
13290 6014218 5995602 6509560 5872171 5730599 5988845 6019820 5626791 6035909 5780380 6207086
13280 6207086 5633835 6513351 6872680 6437506 6320982 6469846 7149983 6748408 6851385
13271 6851385 6901296 6324101 7030379 7118335 7771426 7599463 7560863 7891056 8278215 8908505
13261 8908505 8812537 9112505 9409732 9801857 10881434 11157434 11596985 11584809 12200825 13369919
13251 13369919 13348579 13609733 14239615 14178024 14242678 14765151 14963650 15620389 14991234 14911987
13241 14911987 15317920 14880084 15276634 15300808 16313594 16183464 16766952 17347201 17658666
13232 17658666 18760568 19811459 20667664 21441811 21914272 23065625 23111797 23961761 24404463
13223 24404463 24475184 24402606 24237342 24350854 23607340 22768114 22430266 22015771 20855731
13214 20855731 20766611 20030644 19403386 19353432 19126120 18765829 18493576 18905328 18956476 18782674
13204 18782674 19081645 19194087 19320822 19188831 19100198 19217673 18530656 18881765 18132474
13195 18132474 18295314 17454864 16901041 16501050 16360051 15710380 15098851 14316004 14226424
13186 14226424 14179335 13264071 13168578 13488994 12573178 12299767 12383850 12395677 12145293 11977269
13176 11977269 11802287 11906238 11562545 11619536 10994836 11405296 10817229 10543410 11490436
13167 11490436 11484024 11419685 11594282 11420083 11825545 12458456 12353152 12977998 13061888 13170702
13157 13170702 13782690 14402149 14509537 15192260 14606514 15019924 14335847 14480774 14495484
13148 14495484 14372922 13804881 13391206 13281927 13315203 13332044 13109898 13421799 12977124 13644000
13138 13644000 12710636 12655024 12164039 11320221 10900922 10486961 9300149 8943921 8432754
13129 8432754 9084931 8951947 9157324 8926050 9350859 9025634 9177269 8470950 9144624
13120 9144624 8692846 8049487 7614788 7583076 7223152 7446344 6833485 6807306 6582615 6458536
13110 6458536 6367917 6607830 6711105 6704795 6587241 6493747 6401975 6230463 6660635 6125477
13100 6125477 6945152 6629896 7085716 7210135 7863624 8570539 9469586 9921362 11010591
13091 11010591 11229186 11519152 11225983 11835740 12105593 11704587 11078516 10845090 10461349
13082 10461349 10690081 10737096 10472442 10440532 10066895 10646402 10313603 10204330 9229619 8055137
13072 8055137 7954623 6666062 6217483 6195761 5564042 5786256 5490836 5591629 4734356
13063 4734356 5063227 5179346 5506135 5327308 5399833 5593679 5717675 6069875 5720524 5959584
13053 5959584 5608288 5436152 5413583 5697140 5052156 5519413 5463927 5150564 5378168 5412436
13043 5412436 5671263 5115311 5114174 5330342 5085682 5776804 5941141 5273433 5381066 5873874
13033 5873874 5780007 5626354 5699249 6240873 6316581 5768592 6197819 6343011 6224127 6482256
13023 6482256 6251731 6330543 6896231 6678245 6538585 6796457 6911381 6996217 7375747 7597889
13013 7597889 7613645 8101216 7865771 7693766 8740257 8879564 8637793 8304457 9285989
13004 9285989 9730246 9864917 9484859 9428297 9693059 10084448 10357035 10816428 10608955 11105103
12994 11105103 11070915 12005790 12379172 12327601 12601836 12935015 13292219 13532264 12976602 13182528
12984 13182528 13696024 13219766 13310488 13278084 13715536 13692909 13616961 13599322 13210655 13247623
12974 13247623 13592154 13431522 12573795 12232821 12420518 12082434 11200649 11512748 11309306
12965 11309306 10971948 10668963 11186415 11031756 10738151 10296208 10967570 10340257 10087996
12956 10087996 10383067 10395253 10102100 10260684 10152788 9622717 9961689 10101235 10188122 9794504
12946 9794504 10332119 9882682 9917782 9967408 10012946 9692986 9934279 10293522 10386927 10257955
12936 10257955 10235139 10112783 10761373 11004512 10840642 11580632 11312804 11608601 11878621
12927 11878621 11785616 11591804 11988106 11616645 11419784 11155052 11368335 11528536 11313426
12918 11313426 11698475 11501139 11676355 11050684 11066793 10834561 10796395 10399382 9585111 9306142
12908 9306142 9575925 9434321 9475114 8927364 9162211 9057611 8644362 8633103 8091874 8264629
12898 8264629 7930869 7787739 7076349 7427247 7583026 7039132 7107019 6898194 6932483 6161415
12888 6161415 6733791 6705889 6696208 5911310 6287279 6067002 6975639 6396536 6550558 6204266
12878 6204266 6087813 6020183 5876096 5850414 5952198 6084420 5496185 5953192 5787841 5722177
12868 5722177 5790263 5568553 5649977 5560165 5730231 5442429 5191911 5406121 5941743 5529660
12858 5529660 4983611 4894669 5805363 5243771 4945830 5568020 4745581 5307913 5480783 5151621
12848 5151621 5615364 5050691 5488155 5361143 5445921 4959359 5286967 4810993 5156031 5387440
12838 5387440 5339359 5546389 5206557 4889049 5378604 5060651 5426411 5332303 5194451 5128125
12828 5128125 5118732 5265906 5154766 5564779 5223168 5053017 5500841 5240378 5126716 5382698
12818 5382698 5527472 5093829 5351567 5484699 5383818 5206861 5196898 5220653 5476409 5444197
12808 5444197 5106349 5014321 5439981 5426754 5334850 5290229 5556410 5501572 5088222 5081139 5451833
12797 5451833 5518381 5697957 5759846 5623293 5413259 5255224 5528696 5849570 5241314 5871541
12787 5871541 5705955 5768484 5826309 5743561 5738464 5685946 5489722 5738742 5538027 5728534
12777 5728534 5307057 5661115 5967850 5703999 5132086 5811958 5847972 5836903 5467835 5334646
12767 5334646 5203638 5646722 5974912 6158941 5447499 5549756 5990477 6017820 5211740 5651478
12757 5651478 5917705 6122430 5792317 6263162 6364911 5938964 6167717 6056847 5991726 5694109
12747 5694109 6397013 6156101 6183754 6352006 5501931 5606056 6063983 6085494 5736924 6412324
12737 6412324 5800242 5600889 5875130 6098712 6251664 6132856 6653878 6276763 6269086 5976246
12727 5976246 6282163 6167266 6382406 6047286 5761745 6139276 6129341 6499439 5940229 6183437
12717 6183437 6133838 6278418 6263985 6222793 6216795 6021514 6481709 6239897 6802781 6682295
12707 6682295 6390783 6403569 6574563 7057489 6924766 6919070 7687499 7900520 7912283 8235824
12697 8235824 7668188 8104084 8249047 7972049 8068207 8413285 9098509 9343316 11128883
12688 11128883 12697890 14442044 14747839 16187800 16711392 17486854 17862861 16742644 15524081
12679 15524081 14328029 12966140 11838287 10929059 10469283 9912026 9116471 9006303 9082726
12670 9082726 8746933 9032955 8687159 9391683 9934903 9637743 10266747 9692238 9756200 9876284
12660 9876284 9186572 9136676 9288921 8718898 8962747 8616868 8450623 8606947 8436304 9254950
12650 9254950 8745087 9438275 9908844 10055792 10630101 11785770 12362316 12735921 13439437
12641 13439437 13598649 14233891 14067132 13420878 13294056 13435003 13026172 12566765 12089219
12632 12089219 11990013 12048544 11647268 11769834 12197861 12564113 12348675 12536224 13041864 13128119
12622 13128119 13508531 13956052 13563139 13714040 13373893 12658568 11921691 11583585 11395596
12613 11395596 11413308 11468700 11676197 12114311 12571528 13247909 14285626 15005650 15607795
12604 15607795 15580641 15709362 15168816 14761577 14115945 13563750 13194557 12102560 11124767
12595 11124767 10405595 9462092 9284775 9596847 9156613 9112101 9488025 10001412 10489096
12586 10489096 10360825 10898572 11657974 12046361 12323937 12868822 13545499 14276051 14961347
12577 14961347 14621600 14970602 14679166 14766978 13997302 13643515 13281194 12486501 12009868
12568 12009868 10456296 10376781 10159233 9369130 9373814 9861875 9789168 9774885 9795963 9812004
12558 9812004 9733889 9869312 10445863 10185193 9550824 9499277 10068205 9302510 9457095 9734484
12548 9734484 9618864 10084043 9785679 9756346 10211915 11032351 10972468 11947714 12215849 12802309
12538 12802309 13143646 13299456 13513955 13197546 13534452 12791502 12326213 11705890 11088785
12529 11088785 10303144 10541665 10510119 10241386 10056438 10210937 9950887 10108335 10673591
12520 10673591 10585733 10376310 10748684 10759994 11069550 11093464 11780967 12839802 13847896
12511 13847896 14719014 16128452 16927522 17362242 18036614 17965780 18723175 17804311 16605896
12502 16605896 14938802 13994717 12764484 12059653 11526721 11429211 11902261 11568711 11062554
12493 11062554 11333783 11712768 11738186 11503540 11616318 12173255 11986708 12489490 12786243
12484 12786243 13165756 13603999 14273998 15616057 15704236 16166795 15754626 16763546 17286193
12475 17286193 16653494 16097298 15462154 14507105 14238471 13712661 13991656 13827827 14149754
12466 14149754 13883527 14025594 14650263 14676096 14944222 15125840 15620523 16393116 17165230
12457 17165230 16833093 17628257 18629478 19224958 19923542 20846709 20907782 22378274 22602234
12448 22602234 23337301 24383100 24250066 24911162 24910631 25468531 25143830 25395504 24930743 24824628
12438 24824628 24360336 25064342 24667665 24580990 24336789 24636223 25238047 25519588 26051047
12429 26051047 26938960 27784565 29248298 30079451 31682667 32437303 34233976 35049253 36319430
12420 36319430 37471396 38654761 39135454 39542823 39823208 40042685 40113396 40202439 39243617
12411 39243617 38897711 38264046 37603209 36464458 35290126 34954179 33502805 32715137 31889876
12402 31889876 30761599 30327426 29590909 29883376 29989490 30263695 30327016 30638994 31503482
12393 31503482 32193475 33464283 33984002 34955201 36620506 36764331 37491055 38229648 38717670
12384 38717670 39116755 38917266 38459871 38485415 38872185 38510041 37906011 37790836 37254254
12375 37254254 37070352 36915399 36714364 36924911 36185340 36499391 36466998 36615893 36782923
12366 36782923 36430851 36674399 36164925 36618394 36580414 36588483 36332496 36801758 35810400 35829866
12356 35829866 35938722 34994995 35497046 35056504 35393270 34672109 34194605 34213465 34022752
12347 34022752 33623723 33426055 32747110 32364910 32543645 32601327 32516720 33889773 33828560 33943116
12337 33943116 35336052 36442437 36369489 37279699 38448027 38979329 39627563 40362505 41580733
12328 41580733 41973089 42578750 43128435 43651777 43498241 44007695 44087414 44398275 44367189 44413532
12318 44413532 43931934 44402987 44353706 44325706 44440635 43931021 44296934 44557605 44500472 45689587
12308 45689587 45466693 46328672 47316802 48129804 48448826 49201190 49801904 49821010 50316914
12299 50316914 49401447 49081221 48073088 46925303 45790972 44412965 42873782 41927247
12291 41927247 41526127 41094965 40820664 39640866 39385823 38414290 37735440 37086322 36133186
12282 36133186 34123665 34012661 32580582 31945406 31064090 30465528 30075940 28833421 29155475
12273 29155475 28927775 28687561 28268447 28222478 28398009 28295260 27986279 27748716 27914444
12264 27914444 27617317 27224876 26955292 26818801 26896203 26650882 26993010 27211789 27552241
12255 27552241 28762138 29508944 30373130 31835385 33519523 34825875 37209036 39442375
12247 39442375 41828714 43833573 46447801 48494942 50953846 52077656 53201326 53958184
12239 53958184 54556511 54365475 53859909 53404074 53047235 52254546 50786687 50697379 50107698
12230 50107698 49289008 48438700 47105254 46275428 44226961 41810576 39583657 37336120
12222 37336120 35485153 32690086 31039762 29044659 27808777 26054577 25464110 24707997
12214 24707997 23732227 23197696 22811517 22031888 21946440 20905673 20408683 19442214 19007787
12205 19007787 19159349 18754621 19370861 19551608 18999332 19584667 19351495 19398326 20297990
12196 20297990 20280333 20532730 21190789 21021509 21961587 22052333 22730436 23492007 23964578 23983264
12186 23983264 25087341 25668984 25536696 25904075 26109614 26097767 26219465 26117463 26163535
12177 26163535 25729359 25381902 24704138 25088124 24319779 24658010 24186199 24193734 24530349 23965514
12167 23965514 24296749 24195465 24536780 24662052 24970273 25606354 26537293 27323797 27870744
12158 27870744 28755869 28949774 29931317 29432540 29651259 29564536 29289966 29607502 28848959
12149 28848959 29578688 30089258 31490286 32429737 34344923 35762748 37445852 39811333
12141 39811333 41083314 42760227 43972548 45881152 47675484 49202279 50831811 53094788
12133 53094788 55874042 58474609 61582218 65476760 69197804 73402019 77375734 81799581
12125 81799581 85864405 88736976 92342916 94004183 95174727 96141044 96271078 95199373
12117 95199373 94788165 93321202 91801872 90567714 89197023 87856726 86443068 85449005
12109 85449005 83925157 83026164 81557572 80392577 79720222 78607217 77798855 77855307 77107796
12100 77107796 77306170 76875246 76454182 75792316 75969107 75269193 74836812 74204618 73135700
12091 73135700 72113467 71343354 71878775 72557190 73693238 75717714 77656437 79203493
12083 79203493 81878509 83525904 84980389 86319721 86263968 86440673 85768896 85631334 85283295
12074 85283295 85315932 84696298 84137158 83301414 81769709 80700707 79044868 76469985 74399689
12065 74399689 71880957 69247152 66775210 64414720 62961368 61236769 60122596 58908733
12057 58908733 58579211 57966093 56299810 55968149 55108420 53993131 52913210 51481571 50574416
12048 50574416 49405749 48008835 47574912 46754662 46056261 44827964 44121264 43092816 41582123
12039 41582123 40747258 39836809 37939396 37235380 36926074 36115606 35871580 35909275 36136489
12030 36136489 37062896 37820704 38297464 39134936 39774696 40086759 39324034 38544267 37668212
12021 37668212 35864845 34115960 32546787 30670810 29870403 28021548 27424963 26211726
12013 26211726 24917896 25152635 24275996 23626200 22954243 22752777 21617142 21320347 20680313
12004 20680313 20365538 20935405 20615831 20798418 21424581 21755240 21705051 21730607 20863855 20708400
11994 20708400 19598450 19485110 19252839 19535008 18450583 18257521 18009369 18569466 18895263
11985 18895263 19129628 19039067 19190200 18348460 18239409 17626833 17716138 16751880 17126305 17126546
11975 17126546 16318617 16645014 16254494 15465409 15017310 14768425 13634116 13235156 12850957
11966 12850957 12274559 12031184 11656270 11290825 11034401 11065108 11315519 11308955 11224245 11428781
11956 11428781 11918426 11695303 12022385 11927295 12112317 12322761 11941563 12578113 12532815 12192198
11946 12192198 12162929 12816257 12633531 13239813 13712094 14545983 15066428 15945485 16408718
11937 16408718 16891772 16848555 17552990 17788402 17879835 18126602 17797092 17368658 17392514 17274630
11927 17274630 16547229 15944256 16005762 16359912 15285298 15065550 14496560 14521104 13940634
11918 13940634 13189763 12939950 12712385 12173017 12127294 11968167 12203293 13403832 16334020
11909 16334020 20824520 26321153 30675574 32716917 34685508 35710114 36800582 37877960
11901 37877960 37566953 30319921 24380817 18140254 13783727 11600640 10529020 10168182
11893 10168182 9620134 10110482 9976592 10253599 10663182 11007025 11924198 12852401 13626930
11884 13626930 14573968 16031348 17118402 18592872 19541166 20020584 20194708 20220510 19731874
11875 19731874 18732876 17769659 16327468 15173940 14035832 13404915 12244444 11303915 10680377
11866 10680377 10063487 9132135 9216773 8562182 8724201 8652042 8557636 8214487 8483713 8503950
11856 8503950 8368065 8380765 8513617 8978429 9379687 9787532 9393862 10327249 10327290 10769906
11846 10769906 11314958 11892240 12079486 13284374 13812945 14103208 15011358 14757220 14786201
11837 14786201 14868325 14433421 14264667 13777917 13324039 12987175 12323733 12077403 12371281
11828 12371281 11475372 12134702 12268604 11728293 10797140 10614861 9878962 9390915 8728488
11819 8728488 7693137 8028209 7527647 7419912 7265307 7036401 7509764 6965309 6866818
11810 6866818 6916118 5969175 6673268 6290298 6233933 6394120 6193070 5776098 6191821 5954350
11800 5954350 6432850 6013659 6158789 5530790 5598676 6181520 6100587 6686313 6357856 6882650
11790 6882650 7548565 7520189 8620211 8689172 9577503 9617336 10077504 10158758 9868781 9594233
11780 9594233 8745926 8083213 7849241 6651929 6250266 5773720 6076197 5732654 5302458
11771 5302458 5239767 5181232 4893994 5109784 4875619 4981134 5261846 4983320 5263218 5147934
11761 5147934 5129183 5208478 5143788 4836708 5067445 4721455 4921961 4916494 4631249 4736639
11751 4736639 4795383 5152155 5135797 4647031 4814828 4894180 5127674 5271148 4608252 4881400
11741 4881400 4867591 4852679 4644453 4376473 4875535 4759494 4519311 4843703 5358061 4971924
11731 4971924 4748158 4528408 4785259 4868724 4975072 4735337 4671636 4389068 4976580 4161542
11721 4161542 4478481 4417940 4871083 4526635 5199455 4666344 5040102 4708927 4614003 4900368
11711 4900368 4586356 4524247 4352988 4620137 4576900 5148453 4620164 4869798 4665711 4970008
11701 4970008 4911171 4961491 5108385 4842672 4880318 5138261 5145316 5207981 5076837 4899925
11691 4899925 4839307 4611733 4864802 4846197 5258746 4179453 5060478 4385577 4519620 4897532
11681 4897532 5107043 5018337 4737590 5062106 5276056 4790594 4785719 4798608 5993297 4802311
11671 4802311 5172647 5351943 5084763 5118272 5023241 4865516 5223168 5188811 5337119 5319273
11661 5319273 4969958 4788005 5152657 5147109 5078311 5197241 5073180 5173167 5524167 5309391
11651 5309391 5345049 4707207 5740991 4857013 5604258 5169227 5309262 5493231 4923289
11642 4923289 5008362 5189781 5301274 5308762 5403607 5218217 5426802 5789171 5591547 5434653
11632 5434653 5456701 5202554 5321037 5698145 5820232 5490120 5893104 5743328 5830525 5427203
11622 5427203 5974775 5511231 5076661 5489716 5419935 5571299 5755762 5280825 5141491 5275927
11612 5275927 5528244 5575661 5379481 5467654 5408772 5676201 5750891 5498081 5609187 6031226
11602 6031226 6079480 6162643 6128825 5828052 6020914 6436509 6422547 6432577 6422721 6008687 6583098
11591 6583098 6626442 5761984 5996400 6306827 6191981 6190052 6203997 5538709 5943186 6272691
11581 6272691 5872090 5793590 6008391 5775462 6208699 5817340 6321125 5856244 6549669 5859294
11571 5859294 6312960 6364232 6200343 6174020 6259493 6639839 5861479 6673184 6115404 5983946
11561 5983946 6516996 6391352 5973094 6246800 5902634 6216070 5943485 6165863 6381823
11552 6381823 5910360 6229229 6190740 5780172 6493419 5473301 6070700 5946992 5897149 5709267
11542 5709267 5787965 5848713 6041703 5684327 5390590 5549351 5968690 6128826 5698366 5764648
11532 5764648 6393256 5798422 5823286 5820776 5804464 6158025 5457549 5870788 6030782 5741650
11522 5741650 6076580 6369836 5573779 5841055 5980883 5972683 6003554 6208183 5775876 6018913
11512 6018913 6197413 5846233 6338033 5946079 5819694 5604771 5412320 6136809 5890937
11503 5890937 5789242 5924344 6510688 6316328 6426717 6263446 6496229 5963261 6458900
11494 6458900 6424214 6511933 6464200 6564031 6318159 6542762 6874146 6626469 6856892 7161734
11484 7161734 6557789 6879100 7076493 6996376 7386715 6785899 7255645 6704873 6911684 7558769
11474 7558769 6967033 7388370 7180062 7122242 7003171 6859712 6865060 6769222 6922262 7131923
11464 7131923 6770971 6246358 6737104 6419667 6292686 6178896 6898118 6492648 6763871
11455 6763871 6697969 6544043 6394219 6791168 6630556 6372285 6795966 7002678 6788418 6774882
11445 6774882 6663231 7044378 6829362 7036459 7094133 6724203 6585597 6970926 7092286 7056709
11435 7056709 7687341 7127750 7652092 7709611 7724067 7737663 7336737 8137639 8579434 8368206
11425 8368206 8536696 8654909 8670129 8467431 8954716 8942178 9563050 9743553 9698935 10167130
11415 10167130 10646353 10818702 10424873 11056131 10738719 11289966 11827242 11803304 12037392
11406 12037392 11929380 13050236 12801281 12806803 13090767 13557194 14334201 13780188 14497456
11397 14497456 14802418 15357795 14994786 15430295 16101293 16376561 16225338 16956986 17388692
11388 17388692 17496048 18135529 18037028 18281771 18567823 18527774 19656945 19841488 19440333
11379 19440333 19780168 20283136 20275801 20516721 20354744 20693470 21123076 20948983 20836961 21521429
11369 21521429 21841615 22462673 22464709 22070818 22585782 22735820 23336019 22994219 23188173 23062629
11359 23062629 23062106 23010791 23502070 23748773 23502843 23432455 23463024 23798659 23638344 23679401
11349 23679401 23388935 23858147 23094826 23026145 23048630 22681230 22711461 22267970 21466584 21468724
11339 21468724 21311822 21061406 21291310 20743465 20591503 20867938 20324690 19745148 19711777
11330 19711777 19544904 19068413 18923064 18697115 18599343 18308750 17988639 17753698 17496130
11321 17496130 17258330 16947893 16250844 16428354 15666776 15859269 15543357 14879423 14683326
11312 14683326 14363917 13887625 13807016 13543822 13087682 13173979 12291162 12460911 12289156 11788994
11302 11788994 11324764 11826089 11110010 10925810 10291870 10815636 10509568 9792438 9480269
11293 9480269 9690932 9965170 9858361 8904309 9162102 9076804 8609700 8689091 8219900 8495629
11283 8495629 8514588 8472507 7977107 8331307 7483679 7625445 7713121 7233696 7390073 7619894
11273 7619894 7418456 7789556 7386285 7214112 7556495 7312105 6739590 7230181 6407144
11264 6407144 6647166 7059537 6691355 6563144 6613373 6563548 7039406 6890719 6393791 6420679
11254 6420679 6540741 6822056 6362706 6184566 6248616 6361926 6856058 6790949 6800654 6842028
11244 6842028 6553008 6266554 6596081 6868681 6652971 6047563 6613891 6678730 6691308 6214281
11234 6214281 6238164 6528616 6396642 6518175 6864684 6829272 7042443 7010438 7907377 8664122
11224 8664122 10398825 12047247 14315403 15019071 15675391 16995321 17021019 17593275 16587379
11215 16587379 15193658 12760660 11115490 9456486 8382475 7524963 7604588 7030091 7064155
11206 7064155 6693091 6419054 6548143 6815873 6596249 7096801 7226303 7247577 7546855 8218720
11196 8218720 9554606 11011250 13099322 14237046 15850632 16245390 16767876 17193257 16728958
11187 16728958 16812428 15345538 12572429 11373034 8649150 7955719 7460296 7118034 6983047
11178 6983047 6588698 7009442 7006588 6629139 7227526 6893781 6589387 6345665 6840693 6926616
11168 6926616 7061622 6534441 7015310 6800986 7085625 6950691 7279643 7125569 6995119
11159 6995119 7413391 7318547 6991949 7128534 7042254 6905376 7579168 7135432 7599760 7354814
11149 7354814 7147981 7483263 7440546 7018638 7268876 7264159 7406886 7801447 7407222 7916293
11139 7916293 7636108 7689331 8079162 7852030 8278012 7741175 7941575 8355763 8086431 7980884
11129 7980884 7571937 8471374 8170222 7868926 8265443 7971141 8675214 8633041 8249497 8219142
11119 8219142 8373009 8015644 8560965 8647316 8351275 8449570 8450400 8970986 8453778 8693460
11109 8693460 8618562 8324064 8772201 8587369 8379254 8334874 8850383 8459884 8720777 8750581
11099 8750581 8645660 8795521 8642362 8996651 8834851 9158988 8707856 8892819 9027441
11090 9027441 8923685 9069570 8413069 9235710 9428722 8545369 9103300 8605441 8807233
11081 8807233 8798176 8840671 8737250 9083595 9136338 9052304 9137264 9415730 9579643 9100345
11071 9100345 9654322 9712237 9526147 9995381 10251796 10306162 10738669 10477759 10322225 11131886
11061 11131886 11278932 11498525 11080683 12015515 11928664 11697486 12377971 12628957 12686464 13054918
11051 13054918 13116404 13108180 13228002 13229019 13691018 13745927 13977490 13953448 14101236 14878412
11041 14878412 14445807 15287953 15692919 15356009 16058433 16613920 17059308 17771896 18591669
11032 18591669 19258286 19121927 19818836 19831669 20452625 21585600 21611964 22284647 22414473
11023 22414473 22642113 22769270 23456514 22957040 23536221 23613686 24376691 24161406 24723269
11014 24723269 25047549 25327746 25779369 26025276 26574267 27051522 28069293 28844441 29727371
11005 29727371 30464550 31060819 31759893 32768362 33195881 33673203 34035466 34853566 35065270
10996 35065270 35365170 35798364 35889640 36197675 36485247 36504122 36144471 36747047 36915155 37197452
10986 37197452 38083338 38381601 38692703 40008431 41067106 42372346 43857657 44845744 46502644
10977 46502644 47277626 47854007 49518330 49680557 49819693 49568807 49504901 49324804 49622337
10968 49622337 50623293 51127109 51618815 53046714 54248480 54882713 56231750 57533643
10960 57533643 59264746 59918648 61827674 63396578 65303630 66857791 68644598 70495662
10952 70495662 72439835 74058916 75622301 76875455 78255780 79125284 79946818 80885239
10944 80885239 82377544 82779251 83885478 85432298 87245812 88964530 91260271 93520548
10936 93520548 95088104 97720316 99867096 101996739 104686744 106727700 108289028 110513911
10928 110513911 112864238 114588192 115997983 117908822 119138577 120184725 121276764 122307186
10920 122307186 122493959 123135711 123145883 123647799 123281793 122413413 122082093 121040774 120366854
10911 120366854 119693575 119410311 119469393 119040007 118813578 119146312 119401204 120023332 120174840
10902 120174840 120813926 121397611 122443645 123540975 124814876 126858805 128120852 130855663
10894 130855663 132292108 134992524 138582509 142270440 146743836 151156112 157158923 163688482
10886 163688482 170847600 179379088 188975130 199956214 211354547 223850806 236594845
10879 236594845 250033222 262885417 274130541 283635426 291218261 295774045 297629920
10872 297629920 296311538 291624966 283640534 274367312 261629950 249413617 235726591
10865 235726591 221763490 207584720 193806657 180780196 168575559 156321946 145828211
10858 145828211 135683932 126227215 117623792 109694764 102542628 95556710 89302948 83854669
10850 83854669 78500377 73868810 69128763 65534633 61203231 58183444 55125662 52212574
10842 52212574 49797011 47299391 44742969 42670204 40829775 39311479 37164239 35872286
10834 35872286 34577544 33256815 32107829 30705705 29715482 28806307 27190625 26333843
10826 26333843 25809143 24594754 23974640 23257540 22501690 22144191 21372512 20771785 20535692
10817 20535692 19586719 19309713 18762054 18013650 17284037 17337884 17184227 16101199 16196076
10808 16196076 16036260 15463205 15099708 14686366 14580943 13865083 13783322 13147895 12811024
10799 12811024 13065215 12676950 12259553 12583101 12283517 11703068 11369396 11180956 11177262 11136022
10789 11136022 10658629 10289699 10306581 9941425 10332567 10016252 10096704 9935768 9423816 9587789
10779 9587789 9233294 9156341 8920579 9042451 8745157 8288620 8097003 8078106 8179048 8077122
10769 8077122 8388428 7851219 7619220 7374048 7721315 7540426 7833232 7575218 8722343
10760 8722343 9995564 9948140 10156170 10162110 10071493 10827544 11108970 10569776 9654984 8557493
10750 8557493 8167021 7935239 7448071 7556667 7597804 7238482 7157566 6833094 6540088 6461889
10740 6461889 6624496 6567442 6226786 6137370 6469954 5971918 7308871 8840707 10071668
10731 10071668 10792948 11581159 11998923 12682160 13408415 13234445 13171164 11351352 9623209
10722 9623209 8577952 7255333 6652725 6317403 6023863 6032343 5490797 5725296 5895813
10713 5895813 5307939 5673194 5587143 5595218 5552908 5436624 5649885 5704422 6404168 7189692
10703 7189692 7753688 8534090 8362434 8505185 8862191 8733547 8981872 7888233 6976962
10694 6976962 6507869 5629194 5348010 5250925 4829344 5311146 4858058 5251178 5502518 5065236
10684 5065236 5516189 4889427 5376889 5176847 5038014 5643990 5226057 5888674 6103833
10675 6103833 5826568 6479668 5999674 6888909 6771132 6841018 6889470 6559936 6322747 6128940
10665 6128940 5529203 5367271 5387165 4660215 5104912 4590540 4133767 4740495 4929647 5195386
10655 5195386 5479187 5694843 5668108 6155467 6199255 6061241 6353909 5961837 6593737 6474343
10645 6474343 5711809 5520872 5523735 5385295 4722587 4733773 3991527 3693205 4303363 3968169
10635 3968169 3555027 3534703 4241718 3927535 3699180 3715363 3774327 3747609 3860600 4058549
10625 4058549 3509268 3623851 4012588 3892790 3825986 3591552 3544261 4026761 3799457 3669913
10615 3669913 3995581 3450163 3963961 3654800 4241930 3615628 3651035 3878007 3693917 4022589
10605 4022589 3634909 3482401 3732814 3157943 3707503 3324251 3648094 3866073 3345982
10596 3345982 3903548 3476306 3720737 3841149 3966187 3961535 3695422 3345250 3384556 3833176
10586 3833176 3299272 3289248 3266011 3132540 3628255 3619209 3686293 4217900 3363615 3597480
10576 3597480 3664471 3747674 3745403 4145084 3580542 3371282 3920088 3788759 3742917 3676425
10566 3676425 3485021 3112474 3360837 3474691 2945203 3392283 3233810 2735394 3774595
10557 3774595 2666455 3016837 3140029 3132213 2808005 3371277 3203211 3103756 2962045 2202452
10547 2202452 3136370 3278874 2872664 3087055 2853831 3216313 3020378 3280458 3504336
10538 3504336 3096192 3628017 2977418 3160148 3013414 2927504 3104860 2900149 2762531 2965768
10528 2965768 3441866 2626221 3285180 2956785 3761492 3408503 3426266 3802619 3784432 4644202
10518 4644202 4698566 5393667 5035186 5400706 5744028 5977777 5749586 5230104 5260650 4445822
10508 4445822 3788010 3834150 3856595 3891733 3488266 3333007 3890398 3439618 3227848 3487981
10498 3487981 3929940 3737631 3890012 3971370 4217257 3818839 4779832 5266117 5322567 5366033
10488 5366033 5843715 5759016 5988935 6630555 6497511 5736379 5375427 5422789 4564532 4693594
10478 4693594 4781393 4338098 3846770 4702719 4475195 4228001 4643473 4561486 4293701 4972554
10468 4972554 4668135 4958179 5493184 5464622 5727062 6223021 6020398 6140590 6271815 5571270
10458 5571270 5910282 5301512 5523882 5483622 5221145 4761987 4635017 5259962 4930242 5001194
10448 5001194 4799688 4958909 4826570 4710093 4933699 4744523 5241542 5261714 5587724 6077662
10438 6077662 6592695 7249682 7826432 7966802 8404151 8410851 8822828 8106157 7078630 7026441
10428 7026441 6071392 5473253 5262699 4822914 4448905 4387668 5094616 4628770 4401281 4791776
10418 4791776 4721036 4208811 4483399 4505209 4541399 4888871 5324955 5354480 6077255 6562438
10408 6562438 6955323 6626343 6952495 7811043 7843457 7613420 7600774 7536570 6798827 6304511
10398 6304511 6776810 6553944 6950182 6842216 7276125 7471636 7526450 7436077 7776851 7969091
10388 7969091 7385435 7749765 7325886 7723320 7569251 7171841 7701883 7250548 7746445
10379 7746445 7968801 8544326 8547205 8810753 8843087 9288172 9300102 9769885 9972464 9909022
10369 9909022 10197427 10375125 11036823 10589947 10508802 10905448 10775683 10402526 10558554 10269117
10359 10269117 9618108 9446436 8856456 8634674 8637069 8504646 8366206 8814086 8486572 8923597
10349 8923597 8995373 8583294 8712204 8970672 9117322 8970476 8616935 8116973 7949365 8569631
10339 8569631 8090011 8831332 9332590 9139975 9776488 9488763 9755612 10225124 9956500
10330 9956500 9915083 9684907 9550164 9355022 8774576 9353357 9131742 9035756 8928613 9346874
10320 9346874 9149371 9334353 9025303 9592478 9181301 9111849 9226555 9447535 9830205 9851930
10310 9851930 10584002 10379902 10950700 11537134 12215470 12084669 12503253 12355959 12828199
10301 12828199 13313198 13040547 12905515 13006730 11970877 12736684 13201459 13418474 13960966
10292 13960966 14961843 16107358 16810271 17533079 19158384 20305896 21230960 22479038
10284 22479038 23690792 25070337 26231312 27532037 28097083 29296239 29755754 31561916
10276 31561916 32156063 32831014 33305856 34006831 35013446 35954601 36861038 37640666 38835409
10267 38835409 40267441 41350506 42516252 44650681 46101897 47662226 49306777 50735025
10259 50735025 52658007 53946679 53899445 55585295 55427709 55123939 54811642 55310654 55144763
10250 55144763 54791698 56173151 56519278 56891183 57826914 57844362 57878585 57128189 56362865
10241 56362865 55116866 52780429 50973999 49060499 46926991 45231650 44377042 42865343
10233 42865343 41615512 40519016 40167755 39489767 38480329 37945785 36868191 35766273
10225 35766273 35274589 34107192 34176877 33654007 32889421 32917928 32729563 32194578 31731400
10216 31731400 31130109 30326182 29432205 28036382 27311081 26304107 24916182 23683229 22162232
10207 22162232 20910243 19893665 18790939 17654899 16173825 15868962 15081344 14518127
10199 14518127 13957513 13025310 12388204 11745153 11551024 11140316 11326435 10241566 10260043
10190 10260043 10425365 9407109 9333560 9490890 9238748 9053090 9220301 9001739 8899873
10181 8899873 8917057 8753829 8373516 8321638 8007446 8170233 7783821 7178272 7888715 8312614
10171 8312614 7470218 7150633 7187908 7144780 7012950 6880990 6247151 6528635 6878636 6547492
10161 6547492 6621369 6807713 6777146 6816363 6432590 6164317 6300122 6306438 6720513 6374972
10151 6374972 6296585 6634420 6853488 6442080 6609493 6593742 6459902 6769961 6331556 5900246
10141 5900246 6112136 6319603 6088949 6318940 6052264 5825676 6041169 5782207 5532079
10132 5532079 5942384 5460099 6010096 5476118 5629349 5532773 5252571 5433155 5281673 5441416
10122 5441416 5088556 5275555 4526177 5199336 5130845 4371699 4922647 4653352 4400179 4921448
10112 4921448 4738310 4408422 4286736 4534077 4509300 4448107 4144869 4122237 3953940 4028087
10102 4028087 4475313 4378686 4608487 4494596 4299484 4612924 3977873 4086073 4355783 3941214
10092 3941214 3869386 4199530 4047134 3749971 4114318 4372020 3723433 4396226 4148724 3936980
10082 3936980 3906659 3986911 3369634 4443270 3677162 3953784 4016648 4356936 4279321 3986439
10072 3986439 3865199 4035491 4112247 4076398 3835755 3900850 4105884 4041888 4447157 4446458 4456277
10061 4456277 4242969 4342310 4086627 4757348 4346102 4179129 4528123 4802308 4277047 4627638
10051 4627638 4567471 4765942 4367551 4775410 4741859 3900788 4411087 4906748 4486847 4532681
10041 4532681 4582691 4697523 4592741 4143945 4564488 4589580 4841874 4360946 4759759 4871828
10031 4871828 4509849 4651044 4386508 4507801 5083796 5264334 4549594 5124366 4579125
10022 4579125 5155404 4627919 4649519 5039828 4243116 4983374 4744181 4673014 3947551 4369294
10012 4369294 4451913 3886515 4398350 4268087 4571269 4406495 4229863 4647104 4142167 4216929
10002 4216929 4404886 4287357 4182600 3815933 4131654 4181782 4365039 4466658 3931835 3696419
9992 3696419 3935455 3952132 3834624 3718200 4078967 4285448 3900824 3647321 3922916 3944167
9982 3944167 3516445 3217103 3192247 3347477 3502352 3492799 3041067 3246659 3103782 3170942
9972 3170942 3061997 3085267 3018633 3185289 3177008 3303238 3099469 3231569 2897475 2933100
9962 2933100 3157623 3107882 2999030 2746531 2758945 2803647 2791032 2952959 2880439 2521958
9952 2521958 2778127 2385775 2447714 2417726 2016239 2283649 2184098 2544182 2476145 2057644
9942 2057644 1937668 1604586 1705785 2354877 1828724 2274807 2060740 2178122 1850706 2039211
9932 2039211 2103019 2188137 1242732 1985693 1710217 1846011 1620122 1925917 1998451 1422408
9922 1422408 1447903 1905238 1617671 1657387 1806121 1886983 1630642 2038364 1642965 1597893
9912 1597893 1828210 2032555 1587487 1776301 1301648 1797392 1345288 1658935 1590214 1422349
9902 1422349 1220944 2145655 1493640 1277822 1628991 1684965 1384811 1268464 1927181 1339738
9892 1339738 1772772 1434022 1552799 1629009 1861441 1160694 1315948 1984505 1640616 1264023
9882 1264023 1914520 1533265 1672670 1409066 1619155 1985619 1437217 1723194 1851803 1143350
9872 1143350 1566273 1499240 1139898 1587009 1483989 1368942 1261689 1289440 1703096 1740113
9862 1740113 1332336 1385851 1510255 1108325 1719803 1118840 1184210 1580055 1533791 1396937
9852 1396937 1775242 1315557 1171628 1788407 1158879 1679044 1759762 1746635 1234835 1317326
9842 1317326 1563539 1590366 1436234 1762078 1182522 1210343 1171807 1710752 1475548 1350914
9832 1350914 1367137 1302309 1356937 1473909 1316001 1843818 975947 2062767 1318117 1676658
9822 1676658 1492473 1886996 1533046 1656385 1668847 1164996 1340889 1391687 1857178 1571407
9812 1571407 1694813 1396021 1575225 1548374 1376621 1615452 1362973 1728449 1287081 1696697
9802 1696697 1373033 1438442 1514761 787967 1652969 1198152 1320716 1301209 1516000 1565705
9792 1565705 1479391 1646470 1566164 1294962 1672383 1387870 1467830 1144219 1587408 1095798
9782 1095798 1067770 1354376 1482819 1083169 1048262 1172961 970760 997238 1858853 1596876
9772 1596876 1437363 1303102 997914 2000879 1449083 1483572 1695073 1453251 1211714 1464086
9762 1464086 1223066 1014437 1034949 1079876 1459963 1595083 1276375 923433 1669844 1133121
9752 1133121 1082376 1395000 1686529 1090562 1535100 1062694 1391909 791318 1431751 1123736
9742 1123736 1368495 1355854 1298910 1077014 1097426 683861 1318948 1357378 839390 1021509
9732 1021509 727679 1105536 1350724 733336 693226 514010 461024 621834 1121123 817853
9722 817853 401237 1358169 965437 1184891 767270 1329255 1255446 1132898 1078633 895053
9712 895053 813287 849439 1043539 1243549 388679 476580 699778 590233 909065 869032
9702 869032 969416 686276 883827 717604 753416 905721 587349 1204365 726391 1032133
9692 1032133 991034 505920 928821 740884 839603 988512 990510 641639 775670 1109481
9682 1109481 626265 861651 791630 863553 1048412 580847 873889 752694 1250530 359465
9671 1219144 229592 865547 341988 865664 836512 583373 773682 1000382 797244 1178412
9661 1178412 796803 797244 905915 1214988 1339896 698367 1085414 918425 785220 642629
9651 642629 756629 906165 1248128 530049 751101 1064899 1014324 611580 1012894 1068630
9641 1068630 731220 752943 903858 685789 981499 1177394 92547 524824 729823 1036224
9631 1036224 817036 792355 978127 952096 999392 661744 457821 877175 849756 363596
9620 656875 853850 838127 811203 1112538 658460 824213 839624 671049 648613 533666
9610 533666 1021761 876446 1172060 951156 939470 1141695 697981 622046 882455 355412
9599 752036 726736 533028 921973 862530 1231516 832531 1083423 752903 499757 1160462
9589 1160462 778956 1514885 780391 490642 682130 1110804 851931 602947 237824 515924
9579 515924 713279 603499 815358 1003391 848945 1116578 529831 949621 951575 481571
9569 481571 797131 921836 670795 684457 1223298 898112 642629 436776 781596 62218
9558 753854 402827 850081 1066036 658774 928903 561542 890570 580314 750717 933525
9548 933525 492545 644005 1058754 681410 663942 546696 1065109 928190 320338 524937
9538 524937 933307 686422 286889 681116 507951 776173 329206 586933 794368 398275
9528 398275 674846 368890 635117 448492 820634 874917 297317 971436 195183 506047
9518 506047 283702 259543 489138 917733 450900 523620 429586 135600 689480 610387
9508 610387 706579 387128 223110 246748 13709 1120546 492663 378691 294750 738906
9498 738906 298494 797600 412212 242592 296386 441796 283020 623217 361476 430297
9488 430297 468157 563843 369119 657706 563866 384207 531182 646683 538833 670891
9478 670891 633607 455873 493026 842954 190008 515197 696275 615332 506407 368236
9468 368236 666797 664109 413307 513394 366689 235531 766256 449304 771755 26357
9457 328142 497994 940963 429420 380572 385475 713173 -109561 302934 429999 697592
9447 697592 556316 1013663 571106 316960 328333 356769 29547 392862 296227 520740
9437 520740 641122 590786 597839 98607 551290 -12619 222829 475013 549708 413799 495856
9426 495856 286597 177351 117108 671964 562989 663330 684116 670825 292086 1167579
9416 1167579 256706 463886 478659 590062 812533 536652 881195 494522 525745 680555
9406 680555 338976 700042 53732 -97181 425400 350600 171208 642194 646209 190101 549725
9395 549725 912118 172792 321754 390196 131669 525434 398156 334018 571148 89236
9384 952526 424394 1024282 330956 869628 -64754 462708 810409 600441 883558 -57256
9373 738673 124240 592301 194925 541944 394598 336714 317948 430249 84309 89681 768554
9362 768554 386153 846557 491564 140374 921845 540140 371976 345177 239205 455983
9352 455983 260829 587175 382612 483634 350701 46121 65825 214330 256392 134945
9342 134945 183711 342131 343478 351648 501013 129363 631017 86405 199051 -19282 159341
9330 227551 183502 114511 553960 484774 630719 603215 390318 611608 337192 -73865 590219
9318 89100 345004 710778 433371 931499 428625 278679 115032 216331 36715 105793
9308 105793 272630 411007 449163 43260 541876 392897 211176 496162 342580 302930
9298 302930 293080 410803 607266 491402 578576 158122 266070 398925 543465 261168
9287 546207 390186 597316 269525 324546 7534 567412 480718 183383 222931 142719 893858
9276 893858 228613 257249 530281 305511 334832 311140 191250 414627 425913 353111 194507
9265 194507 452792 104263 196652 120961 692670 830092 154935 167440 661379 355656
9255 355656 337819 -206228 521485 524375 430598 345715 599622 786058 295835 471337 -106207
9243 364477 188670 472145 130366 31493 473089 306541 -8321 470661 146486 -112330
9232 441563 339408 142971 324626 142236 81516 81676 318109 94155 468386 95345 217355
9221 217355 451628 535602 203939 91754 -107579 365183 371328 747134 -227499 545474
9210 145544 434292 635448 271963 728642 2221 817729 -217735 199111 -39178 402136
9199 504902 467106 431054 413826 314575 285410 -31756 694954 332056 197625 230380 71369
9187 528653 464819 638630 772339 100805 707585 183123 451013 493990 -88971 419616
9176 -43930 -85716 187677 474292 -244416 658969 357186 910536 287842 230715 616290
9166 616290 713983 597501 161187 498150 26596 264985 261254 222560 483444 319382 615462
9155 615462 412554 60449 273168 16012 473406 507004 -159389 931388 860141 545449
9145 545449 659314 258649 408278 395245 282089 204923 104001 133283 83182 590555
9135 590555 835870 840532 99435 65302 257815 15192 381962 -121113 -135604 178863 387840
9124 387840 786035 202112 371637 272558 184305 161335 111171 212155 72750 389286 394504
9113 394504 736061 905028 888667 389313 403818 493407 574471 340024 308281 451134 111739
9101 365908 122173 51039 411015 474720 399051 711953 616075 1044909 206732 347701
9091 347701 -86529 151058 382611 367693 362269 395810 635218 51158 258085 207888 315314
9080 315314 550917 143664 178388 755105 60366 307995 293251 499208 70828 643538
9070 643538 96440 349249 539124 514531 202867 464923 194880 -209105 587475 431985
9060 431985 -399 245314 43381 -168529 509547 189768 377690 286062 -77037 646449 495885
9049 495885 235721 194256 454370 461444 443099 49161 227605 630671 792613 27172 738640
9038 738640 271936 692151 199478 1860 262106 476307 496017 137907 204330 201711 -164249
9026 660656 -16050 715447 -2755 807673 374334 -189275 263030 270739 357922 263137 -56503
9014 262644 239208 546067 477975 421091 541287 309917 180381 166967 895641 285012
9003 601861 176594 227622 462411 283722 206193 560367 295621 351965 357609 141450 605887
8992 605887 134453 220376 349502 699565 -85718 31505 294902 286966 360703 923342 526303
8981 526303 554902 193209 -162359 730842 334104 245971 544999 396545 189639 572659
8971 572659 -2501 457709 194460 496081 50825 240814 550772 304286 453625 820787
8961 820787 263472 228638 129945 84144 641723 188620 -257406 481858 383045 329746 763501
8950 763501 723157 532105 491729 64654 158403 537376 8325 641640 844080 792516 485639
8939 485639 544138 754760 475028 240089 527770 344910 673350 371785 547112 465675
8929 465675 328953 637541 589521 636990 311599 503471 140272 742871 269816 232329
8919 232329 511017 340623 259200 397787 301031 414942 449163 694153 104778 903119
8909 903119 441086 218545 1078410 337781 694211 482161 854740 753957 1013886 496789
8898 674552 794829 726088 876717 617668 468360 987227 952108 1250510 925297 402673
8887 940182 899881 759226 1341935 1087915 689200 653318 1010042 1047456 761528 736974
8877 736974 1001463 858644 692042 1087290 956821 1173854 982727 1165071 940733 901213
8867 901213 1153971 659009 1396420 846227 1218338 727967 985661 932638 1054115 1208409
8857 1208409 1156998 851894 730560 898702 866193 1143060 1003928 984650 959221 844697
8847 844697 667201 558047 787278 661457 954804 943995 1081503 424672 454582 836032
8837 836032 917855 677388 437837 428649 816244 394579 735602 474818 475835 455969 324763
8826 324763 687515 509320 439887 463092 757984 304973 286187 673839 632935 594820 656854
8815 656854 348471 426617 410033 403678 444344 376966 496365 531226 -102269 549579 475844
8804 475844 237416 118451 90963 440811 314417 353976 387183 279519 680351 186754
8793 524026 563043 537753 172740 369990 380880 554321 379371 232694 285226 431472
8783 431472 506588 397824 529024 -5558 -13153 218357 317420 889913 171117 796197 -9864
8771 349090 718063 519335 190944 453359 337640 473524 546537 344019 528914 181326
8760 125816 261656 279163 247802 158907 136399 233697 286839 109491 384618 250778 293675
8749 293675 770815 174028 132203 627669 240809 475138 -427987 20532 130933 16598
8738 256235 190812 -22828 -68797 221680 185893 374444 204838 -125408 -78857 368857 428131
8727 428131 673596 498644 168075 169561 356280 277844 229239 532435 97658 225205 355560
8716 355560 77110 609322 169858 -45603 -70268 553929 -53726 354301 312544 556810 293826
8705 293826 295023 350471 450019 412094 119395 -123911 433961 483791 -8466 58521 377800
8694 377800 387352 367639 4603 45569 183755 11568 391209 826556 111798 316594 110841
8682 144612 518329 647050 -53943 186347 279679 272318 466139 -10853 5093 395090 249507
8671 249507 -269292 311141 275548 466604 612902 390193 640798 26560 160149 225786
8661 225786 267820 37334 68515 322894 453852 -88045 249331 547686 -108704 101503
8650 462726 186352 12253 278321 537245 318170 329947 804731 580012 215159 426492
8640 426492 620210 368862 35591 -75034 370857 853146 58801 165437 323690 -81653
8629 262173 388847 259187 -49368 -213785 -33294 200113 499600 571320 110508 416045
8619 416045 976235 260140 601929 192370 301134 295645 505557 26016 238077 323212
8609 323212 268444 43794 163487 220539 459011 306918 418195 520285 423010 538232
8599 538232 160737 455635 -115318 475884 565612 587422 -179316 201024 194051 277031 280097
8588 280097 571257 165085 92129 233132 290985 623962 -342886 -6552 575935 257835
8577 615449 360496 499097 119119 428699 -115478 376480 286251 49064 622562 -103738
8566 -154670 -73149 261682 397753 534609 126489 90046 232600 210973 297892 321763 210568
8555 210568 -82676 214940 310853 315929 374712 67332 201227 347087 192271 424981 608825
8544 608825 173198 461616 -184285 207951 445264 10028 -21245 -39082 530490 299336
8534 299336 60790 -92081 489556 -52599 249321 62941 234757 330233 60021 193053 317015
8523 317015 173285 258306 113988 -292535 366740 -26739 272092 101459 443075 218191
8512 -19142 355703 421763 -27512 234457 545829 312500 -21477 101143 40436 268186 -86768
8500 127131 152960 223606 429873 101780 55993 283989 652115 38044 264993 375451
8490 375451 513806 226417 126992 247154 213222 258278 -146670 141998 357558 294816
8480 294816 181106 482076 217522 273755 -389951 16093 580504 -7578 -140670 465458
8469 363202 449869 -68563 252637 198025 184689 326291 4761 41522 620331 452386 -209563
8457 266862 -192312 -92317 -180258 -42701 412846 180544 352002 183637 564619 -144350
8446 314602 503619 342120 623371 324067 498337 -11218 502471 -15620 226687 286282
8436 286282 442571 -248187 78534 255916 338261 82686 306045 344972 -180911 172977
8425 -27964 42838 -254795 697371 8984 79526 190440 79693 169227 108165 658518 120980
8413 766324 301507 528116 11212 350714 400435 15125 164978 321570 -182155 53519
8402 505019 376216 21070 514267 204283 380416 -45705 49807 -16368 -5028 158349 313855
8391 313855 189293 283424 305432 453180 313152 261839 -196916 -1109 334626 67246 538327
8380 538327 -165259 228411 -115399 342963 389422 430214 219734 -290789 -168916 285223
8369 422267 -210868 5749 312109 12741 278496 353014 75142 53587 391115 353921 334766
8358 334766 458163 -398995 401338 1991 483490 -211744 118145 -67740 98808 -239971
8347 14537 -229893 95668 127492 97994 350344 -193302 176418 68069 308170 150305 2236
8335 257897 155303 -88832 416202 548025 196970 428895 305722 -51949 157017 259510
8325 259510 47337 -39677 344421 433488 7887 391731 77446 -5058 351753 246717 -71751
8313 -42468 129375 -14816 234890 276821 385131 -114674 768709 1482 180963 282919 285759
8302 285759 462820 613430 -111841 554165 492455 -166391 599012 -83852 -15055 124340
8291 510161 310347 313103 109533 194023 -167838 578175 -93360 -134518 256459 28396 41148
8280 41148 138892 310607 597818 308295 433581 205270 270010 8919 70713 41070 -258660
8268 560896 128753 319922 473125 415004 100659 651249 278982 116 -14641 -175807 239017
8256 128578 -52480 -369542 447685 285525 555755 109945 162652 844795 378745 395948
8246 395948 92639 193060 214068 125621 -419139 358100 445612 406825 37872 -141608 534478
8234 560773 -3185 372012 145955 453426 -40605 16521 9350 545157 340581 -63727 -89397
8223 -89397 210241 203597 471986 421016 411398 160550 861856 672003 193862 272756 706902
8212 706902 77119 416371 160984 -38103 87364 -93950 404571 156171 273517 -76548 46443
8200 78640 281330 581482 210413 8647 -20235 1551 321327 48923 375607 162149 46930
8188 43962 471676 276461 345584 215379 162655 147936 453238 258752 384823 -477656
8177 -66170 263280 -28631 371142 184392 96255 359965 240872 59209 424916 -11199 337089
8165 -6239 -77624 447687 -41818 301733 556660 461547 486315 -37598 146086 188525 17448
8153 417731 397709 155379 435349 -118857 57145 104901 382992 381001 -344058 386776 160481
8141 294640 129569 -114914 247762 488714 571458 297675 251899 246944 254995 -294065 202717
8129 176689 126545 231294 457701 43315 -66134 480225 57039 163417 -257313 308213
8118 180762 316573 150520 -203758 15333 48834 22400 187819 304315 294135 354360 353249
8107 353249 300365 538553 547721 131882 625189 270067 617811 210990 -131161 -296326
8097 -296326 335392 182847 -259460 69518 400017 -94316 -533434 361668 653570 294664
8086 199538 420827 37717 111954 234388 530251 160149 141012 269583 289469 -12173 -9250
8075 -9250 -41849 275709 83653 656763 308915 -50708 3312 332690 389530 161181 482390
8064 482390 638061 426372 509949 -70109 57149 -203055 233941 318919 380473 175485 -77440
8052 -95212 -13518 17358 364681 510069 329109 -163952 767944 -207178 -62307 121234
8041 195692 388487 383194 177456 -189817 -397763 -12479 585350 205505 33285 183890
8031 183890 462590 144298 -1589 505682 119559 413883 250476 323173 1002786 71851
8020 4463 260863 247293 595174 -120759 -138252 246444 741605 291444 236143 14012 337278
8009 337278 -67064 -6348 466872 90929 507645 -166365 404127 76436 131565 205300 -72795
7997 592206 294302 -101057 612390 264367 -82856 -116797 -173450 290702 240842 -46349 159454
7985 171824 -414003 240261 33592 184841 395605 -107737 462075 403307 337211 -225490
7974 800255 -229033 134139 -38564 291843 59050 -92133 672155 47562 34153 553324 386970
7963 386970 124962 914705 461550 -193412 240273 492518 424714 237716 285823 133182
7952 136271 -39504 413867 442844 322749 237009 512545 356571 191915 180752 234037 281283
7941 281283 -96613 43556 -142561 30627 295711 57808 617832 468520 -59168 346129 36041
7929 504591 328535 -176457 180545 457807 249448 51238 32463 -131307 322770 -113917
7918 -47867 143974 102893 -53836 425098 52084 95007 507652 39804 507929 56269 -19749
7906 270388 582900 235857 -24303 -643276 55543 473966 102906 29615 430587 534028
7896 534028 -376892 284202 433959 28896 214916 67576 -100428 122825 348723 406267
7886 406267 399013 58261 200800 355638 160836 39532 -147303 -212596 476621 225919 -170496
7874 186014 -252608 115428 524498 -82197 -96151 269094 425622 466692 263407 266367 386561
7863 386561 -419975 90715 187436 108849 -219896 -166685 108121 565443 183959 263690 244034
7852 244034 -5072 -102272 342154 -127539 586149 194290 213806 317778 -228306 368664
7841 23695 329933 412458 501282 21778 -175096 458878 -4004 300340 118896 -183459 297570
7829 -262536 666217 15548 -119009 49278 259746 314376 171762 429595 143216 404563
7819 404563 147795 -36011 32813 129947 281958 631390 -99344 272881 45859 -18957 242133
7807 10808 281143 464811 -241603 52416 179980 -183993 390891 -233124 -96521 412453
7796 75087 -128361 -264488 -206592 -179621 -289566 425155 135048 135450 543227 -150439 124474
7784 41822 74282 89138 328782 -59510 349250 250739 404963 -95833 543642 281577 -248883
7772 180606 58137 -266298 263245 376708 279991 179030 42242 233023 54990 -544959
7761 426149 427175 158872 -283682 413043 -121415 313665 334877 253620 412712 281496
7751 281496 302605 13826 452190 -29148 134144 199601 20971 569797 339921 -68596 148838
7739 79680 277768 230981 254749 396051 -359414 201783 26611 69114 158706 -79757 -224873
7728 -224873 436093 318046 205129 101944 32940 411519 -145741 173354 34921 282298
7718 282298 18072 319394 80780 -240249 529331 147771 8016 -113853 338962 228411
7708 228411 154238 495985 102967 479889 -113072 62669 -45307 327588 13942 598661
7698 598661 107603 213311 634106 366780 438310 -212364 177624 50020 232563 232298 157243
7687 157243 247008 -22682 462944 110514 148817 13847 155440 323415 81011 513036 61014
7675 -126384 -134774 478220 305821 378032 -123497 226198 449864 358762 353751 297613 247287
7664 247287 197956 -312409 -142924 38671 114029 563506 48517 26997 263749 -143713 133497
7652 -276753 366536 -53216 241074 -38785 234055 141901 166692 237677 32575 127031 542448
7641 542448 -228086 2515 339882 313377 94486 527838 227900 -201202 -463403 -204464
7630 303339 110415 83219 106772 373299 203586 304712 456195 -47654 103407 -196341
7619 256429 -341036 -286646 79253 -31836 97234 489599 373017 -76332 326654 359251 -372070
7607 426014 109303 387211 160261 -52496 266606 38910 570821 291942 286497 -73039 -143053
7596 -143053 -74648 309178 38820 479985 154709 -87958 -107197 112686 358372 316665 182435
7585 182435 208052 42600 34002 -132990 281661 -37379 89856 79530 266602 129957 616799
7574 616799 -36241 229598 208110 270055 644773 591783 142569 58914 37204 48658 -230913
7562 539902 -50271 38889 28282 479257 -33203 284621 339810 391516 104139 600766 37522
7550 -119847 148908 634326 79477 -352488 725113 -107925 104373 366973 276891 443777
7540 443777 424423 -120215 406309 -169768 87339 462288 -363447 38545 334402 36001
7529 85733 164679 1918 113837 -56791 280259 80249 -109265 -28690 -127765 50357 5283 108934
7517 108934 -113034 491280 -77539 473572 205582 66944 36596 306572 197679 400558
7507 400558 158396 -173819 305619 291058 -189658 1362 247049 426515 161486 261488
7497 261488 -63208 -25721 157392 452969 -80393 252010 449406 -185161 199455 296259
7487 296259 78724 366402 -38786 -198296 114373 115826 515113 153327 51080 648629 -56415
7475 8832 -163110 273515 335350 109825 123835 -2200 155520 240646 204558 -176799 201803
7463 411041 505047 4789 438766 515606 -122365 330380 -690063 110185 -324118 178240
7452 -12572 -126965 237636 604207 310096 245050 506507 197240 137443 -481401 -32332
7441 125613 210230 118073 -31379 520660 -117311 254874 375580 -308984 437909 135735
7430 147742 -133764 166458 -196946 -212524 -217305 -46735 -51000 -252261 487443 -171539 475136
7418 223958 27422 -32800 34257 -175999 -161424 177255 486779 138385 119270 -161678 177015
7406 -31696 339350 115403 175681 -56723 -279282 157799 155945 206538 91573 197800 46079
7394 -217275 -105853 -256551 181474 -215519 168056 18700 541553 -177192 507994 394859
7384 394859 178153 -440382 154987 162959 162998 -59566 312194 -54247 259581 437084 4570
7372 616579 555776 -18908 -159340 117250 10821 -186253 -48143 175697 -3776 242533 309574
7361 309574 36669 -152436 50055 -233312 283936 402645 -68548 268352 -73591 -162771 166321
7349 594945 221000 22974 205149 -78491 819484 -153517 -258058 -148168 125765 38812
7338 256054 -136151 103843 431027 360687 232112 47928 426630 329196 -132435 119881
7327 -61359 483912 -38549 -109772 420975 34968 -108853 404056 -30260 330865 596567 285992
7315 183734 52827 -97256 142348 140788 292087 117356 -68340 87851 138556 -330545 -139080
7303 -250841 137906 -2906 77938 252251 134307 -189431 303717 165707 414835 237764
7293 237764 -114053 142359 283818 231267 24312 -105153 373065 625858 -84682 248829
7282 -315106 319505 430506 246906 81040 261836 -3576 -74623 234825 227662 365806 331067
7271 331067 529394 386174 -192430 9555 -171799 152420 -24725 -15069 -70085 578018 240108
7259 233144 446051 215684 225189 470252 138539 12445 199972 -311836 166191 -355838
7248 -109593 -118402 309576 139189 -279602 69041 296892 30935 193658 311346 331651 313409
7237 313409 111961 551770 -55487 30993 -494138 209432 313375 -82700 289246 38012
7226 258446 -297229 298024 217139 242596 -184032 143899 -163662 -21583 142220 222022
7216 222022 -242961 139886 63786 240101 -81201 -324359 -39116 207004 -311478 104200
7205 109704 149310 251609 85344 252204 -41430 59673 -195275 32112 320020 65816 124
7193 -248229 102496 -67028 323747 -38665 136522 -126434 -60025 -84863 256448 -179468
7182 601553 399898 21755 -309800 276562 308257 53081 38663 197560 -2492 -241584 -10600
7170 -38584 577092 337512 623943 -103173 24426 -58500 -187427 189621 434829 -239526
7159 428217 16205 355622 -167274 -276852 357126 458326 46237 155468 75201 143602
7149 143602 -329943 495377 559432 -34652 509403 438690 156512 475208 -41757 368345
7138 53421 339307 33736 -185685 157073 507211 437582 365169 426785 2689 -291813 -260354
7127 -260354 -18345 -334557 -314816 165915 250266 -26005 -47474 32206 -84273 -63379 -16564
7115 -13158 158162 -249164 115475 147559 205311 -80221 60185 -124774 355701 84193 178359
7104 178359 -26766 -87100 179484 11809 -35583 83590 -301624 251354 407762 36487 -172536
7092 359039 -141963 273754 -165929 -166457 597792 -186096 -149376 574025 692796 261928
7081 104943 -118251 -163068 -71288 -29675 272737 85759 -411194 283475 384609 105593
7070 49987 -233103 84637 -143831 -77489 410511 -3527 285303 70323 126856 68872 178949
7059 178949 533 175061 -173403 238047 273691 21492 56869 308807 276367 125325 -170453
7047 -164734 335301 -219456 105218 64391 -30569 -45552 31882 -186036 -240334 465787 125204
7035 412054 195450 -14704 -173778 -192746 486204 -8045 98807 -57112 74374 -239005 407155
7023 231175 172365 279687 767138 -58331 8790 545 -88683 -206546 81128 110461 -327858
7011 -6346 178271 325526 -215748 -190377 256777 -124965 140954 -215643 158660 343538
7001 343538 -129253 504352 200489 -137318 -92507 213778 388332 -5803 89050 239205
6991 239205 -144943 336282 -132106 235669 408277 624315 -181529 6556 419085 -211685
6980 -20639 419747 243983 -283427 317404 225944 -60941 -129692 138473 -219841 -23713 18211
6968 203805 131340 276199 312363 556111 435614 -75634 -27662 136859 431412 38895 377259
6957 377259 -303570 -160626 -486992 98945 61189 58422 195939 104528 -153963 271084 208467
6946 208467 491147 225921 299690 -291269 -179259 -18145 36801 208678 -255228 109592
6935 -46051 25960 364487 -67287 289761 -66749 126671 229570 -7400 221354 331149 399477
6924 399477 782903 -210890 87287 -470684 565466 307710 -248301 425016 302774 -134792
6913 509184 122293 181725 279465 390675 197674 586357 -20375 158506 515602 -211657
6902 738400 -30864 -336362 -26131 80423 66247 -421443 67881 -243144 -39247 -198116 290655
6890 194914 70443 55910 -29944 259289 204878 309296 492873 664070 73299 -21430 71706
6878 -40670 22036 -263183 207951 -161347 114655 328598 258141 -183601 346911 512807
6868 512807 -238400 517582 196843 -139715 -154204 29274 459679 31161 -61182 72655 372418
6857 372418 155411 227658 -121894 -129934 -71426 52608 142088 320449 -110117 -335079 -385250
6846 -385250 341621 -202273 4296 437328 -106019 -6935 441818 142623 -36509 552644 267077
6834 -73757 -162297 -114177 -32949 -50137 523197 -67360 -165515 -400672 -49544 -19321 357753
6822 556107 -373162 172712 184402 169662 97788 250957 -15313 349656 398755 94381 429000
6811 429000 69512 288002 57939 45198 -99449 -24690 14387 172499 -91176 -99591 -9966 251560
6798 139318 -331584 -302988 143711 338018 275085 234101 280172 370118 256609 36473 293283
6787 293283 6574 249025 275945 354615 334648 122262 148216 296730 104721 -141025 443805
6775 140451 -54122 348104 -220609 544418 357571 -524434 189809 191428 120044 549166
6765 549166 320917 69300 117978 169327 190203 218144 249435 -72939 132254 14439 213903
6754 213903 -168587 -59146 -81410 39104 364537 366558 -163853 197488 330705 46175 -143222
6742 428707 312554 -329618 354100 325335 -89388 248121 318078 242957 249255 -138761 18950
6730 -378460 180551 177765 45663 -8551 561349 145731 160541 553026 35018 -204380 -34082
6718 -5908 305105 122289 -192646 386123 273023 -522169 13147 -92001 81501 567519 -176658
6706 86188 15670 206315 64560 -136498 -139199 677880 32564 122626 123820 -79547 257354
6694 279544 -51859 -62377 -27684 -60450 557034 1339 -115140 -557371 284243 267980 -171746
6682 -213557 30266 -391043 197477 286390 253252 277241 -148774 219751 336314 287985 -104749
6670 -8147 292360 30318 183859 135280 251539 -24276 -92808 -22669 -391078 -93783 213454
6658 114407 288062 340055 368685 433316 -5259 -119692 287033 208180 74172 -70501 211103
6646 296805 -334735 197694 299951 56621 37169 553037 411822 399133 -2038 -227759 -199736
6635 -199736 50862 -19201 -286935 -456351 160948 -58489 132186 -120013 -327218 -175253
6625 -175253 -103558 79217 116875 141691 512042 298863 257882 133492 -294652 216304 -349607
$$ [...]
##END NTUPLES=NMR SPECTRUM
##END=
