##TITLE=Coffee green (ROVE100A + 1.5mL buffer 50/50,  450uL extracto + 50uL (D2O+TMS))
without heating, vortex and centrifuged, temperature 0oC.
##JCAMPDX= 6.0         $$ Bruker NMR JCAMP-DX V2.0
##DATA TYPE= NMR SPECTRUM
##DATA CLASS= NTUPLES
##ORIGIN= Bruker BioSpin GmbH
##OWNER= Administrator
$$ 1.72 TOPSPIN		Version 2.1
$$ 2012-05-22 16:16:41.215 -0700  Administrator@X
$$ Compression mode = diff/dup
##.OBSERVE FREQUENCY= 400.131882
##.OBSERVE NUCLEUS= ^1H
##.ACQUISITION MODE= SIMULTANEOUS (DQD)
##.ACQUISITION SCHEME= undefined
##.AVERAGES= 64
##.DIGITISER RES= 22
##SPECTROMETER/DATA SYSTEM= spect
##.PULSE SEQUENCE= noesygppr1d
##.SOLVENT NAME= H2O+D2O
##.SHIFT REFERENCE= INTERNAL, H2O+D2O, 1, 14.97974
##AUDIT TRAIL= $$ (NUMBER, WHEN, WHO, WHERE, PROCESS, VERSION, WHAT)
$$ ##TITLE= Audit trail, TOPSPIN		Version 2.1
$$ ##JCAMPDX= 5.01
$$ ##ORIGIN= Bruker BioSpin GmbH
$$ ##OWNER= Administrator
$$ $$ C:\Bruker\TOPSPIN/data/jwist/nmr/11-coffee-green-quantification-2/311/pdata/1/auditp.txt
$$ ##AUDIT TRAIL=  $$ (NUMBER, WHEN, WHO, WHERE, PROCESS, VERSION, WHAT)
(   1,<2011-11-18 15:43:00.325 -0500>,<Administrator>,<TOPSPIN>,<go>,<TOPSPIN 2.1>,
      <created by zg
	started at 2011-11-18 15:34:05.779 -0500,
	POWCHK enabled, PULCHK disabled,
       configuration hash MD5:
       DA 63 81 1B EF 4C B5 72 B4 DF EA D9 B4 DB 4C 08
       data hash MD5: 64K
       21 3F BA 0B 48 30 11 21 35 B8 EF C2 6E 2A 4B DF>)
(   2,<2011-11-18 15:54:52.513 -0500>,<Administrator>,<TOPSPIN>,<proc1d>,<TOPSPIN 2.1>,
      <Start of raw data processing
       efp LB = 0 FT_mod = 6 PKNL = 1 PHC0 = 0 PHC1 = 0 SI = 32K 
       data hash MD5: 32K
       C9 66 78 07 4F 7F 37 AB 9D A3 50 30 03 54 4C 78>)
(   3,<2011-11-18 15:54:52.888 -0500>,<Administrator>,<TOPSPIN>,<proc1d>,<TOPSPIN 2.1>,
      <pk PHC0 = 21.82434 PHC1 = 0 
       data hash MD5: 32K
       FE 25 01 C1 BD DE 32 BE 3D D9 9C 37 D0 A6 1F AD>)
$$ ##END=
$$ 
$$ $$ hash MD5
$$ $$ 90 35 8E F9 B6 2A BE 99 88 25 E0 AD 40 41 38 E5
##$RELAX= 
##$RELAX= 
##$RELAX= 
##$RELAX= 
##$RELAX= 
$$ Bruker specific parameters
$$ --------------------------
##$DU= <Z:>
##$EXPNO= 311
##$NAME= <11-coffee-green-quantification-2>
##$PROCNO= 1
##$TYPE= <nmr>
##$USER= <jwist>
##$ACQT0= -8.16505617666767
##$AMP= (0..31)
100 100 100 100 100 100 100 100 100 100 100 100 100 100 100 100 100 100
100 100 100 100 100 100 100 100 100 100 100 100 100 100
##$ANAVPT= -1
##$AQSEQ= 0
##$AQ_mod= 3
##$AUNM= <au_prof>
##$AUTOPOS= <>
##$BF1= 400.13
##$BF2= 400.13
##$BF3= 400.13
##$BF4= 400.13
##$BF5= 400.13
##$BF6= 400.13
##$BF7= 400.13
##$BF8= 400.13
##$BYTORDA= 0
##$CFDGTYP= 0
##$CFRGTYP= 9
##$CHEMSTR= <none>
##$CNST= (0..63)
1 1 145 1 1 1 1 1 1 1 1 1 1 1 1 1 1 1 1 1 1 1 1 1 1 1 1 1 1 1 1 1 1 1 1
1 1 1 1 1 1 1 1 1 1 1 1 1 1 1 1 1 1 1 1 1 1 1 1 1 1 1 1 1
##$CPDPRG= <>
##$CPDPRG1= <>
##$CPDPRG2= <>
##$CPDPRG3= <>
##$CPDPRG4= <mlev>
##$CPDPRG5= <mlev>
##$CPDPRG6= <mlev>
##$CPDPRG7= <mlev>
##$CPDPRG8= <mlev>
##$CPDPRGB= <>
##$CPDPRGT= <>
##$D= (0..63)
$$ [...]
##$TP= (0..7)
150 150 150 150 150 150 150 150
##$TP07= 0
##$TPNAME0= <>
##$TPNAME1= <>
##$TPNAME2= <>
##$TPNAME3= <>
##$TPNAME4= <>
##$TPNAME5= <>
##$TPNAME6= <>
##$TPNAME7= <>
##$TPOAL= (0..7)
0.5 0.5 0.5 0.5 0.5 0.5 0.5 0.5
##$TPOFFS= (0..7)
0 0 0 0 0 0 0 0
##$TUNHIN= 0
##$TUNHOUT= 0
##$TUNXOUT= 0
##$USERA1= <user>
##$USERA2= <user>
##$USERA3= <user>
##$USERA4= <user>
##$USERA5= <user>
##$V9= 5
##$VALIST= <valist>
##$VCLIST= <CCCCCCCCCCCCCCC>
##$VD= 0
##$VDLIST= <DDDDDDDDDDDDDDD>
##$VPLIST= <PPPPPPPPPPPPPPP>
##$VTLIST= <TTTTTTTTTTTTTTT>
##$WBST= 2048
##$WBSW= 25
##$XGAIN= (0..3)
0 0 0 0
##$XL= 0
##$YL= 0
##$YMAX_a= 4849399
##$YMIN_a= -1714840
##$ZGOPTNS= <>
##$ZL1= 120
##$ZL2= 120
##$ZL3= 120
##$ZL4= 120
##$ABSF1= 0
##$ABSF2= 0
##$ABSG= 0
##$ABSL= 0
##$ALPHA= 0
##$AQORDER= 0
##$ASSFAC= 0
##$ASSFACI= 0
##$ASSFACX= 0
##$ASSWID= 0
##$AUNMP= <proc_prof1d>
##$AXLEFT= 0
##$AXNAME= <>
##$AXNUC= <1H>
##$AXRIGHT= 0
##$AXTYPE= 0
##$AXUNIT= <>
##$AZFE= 0.1
##$AZFW= 0.1
##$BCFW= 0
##$BC_mod= 0
##$BYTORDP= 0
##$COROFFS= 0
##$CY= 15
##$DATMOD= 1
##$DC= 0
##$DFILT= <>
##$DTYPP= 0
##$F1P= 0
##$F2P= 0
##$FCOR= 0.5
##$FTSIZE= 32768
##$FT_mod= 6
##$GAMMA= 0
##$GB= 0
##$INTBC= 1
##$INTSCL= 1
##$ISEN= 128
##$LB= 0
##$LEV0= 0
##$LPBIN= 0
##$MAXI= 10000
##$MC2= 0
##$MEAN= 0
##$ME_mod= 0
##$MI= 0
##$NCOEF= 0
##$NC_proc= -7
##$NLEV= 6
##$NOISF1= 0
##$NOISF2= 0
##$NSP= 0
##$NTH_PI= 0
##$NZP= 0
##$OFFSET= 14.97974
##$PC= 1
##$PHC0= 21.82434
##$PHC1= 0
##$PH_mod= 1
##$PKNL= yes
##$PPARMOD= 0
##$PPDIAG= 0
##$PPIPTYP= 0
##$PPMPNUM= 2147483647
##$PPRESOL= 1
##$PSCAL= 4
##$PSIGN= 0
##$PYNMP= <proc.py>
##$REVERSE= no
##$SF= 400.13
##$SI= 32768
##$SIGF1= 0
##$SIGF2= 0
##$SINO= 400
##$SIOLD= 32768
##$SPECTYP= <>
##$SREGLST= <1H.CDCl3>
##$SSB= 0
##$STSI= 32768
##$STSR= 0
##$SW_p= 8223.6842105263
##$SYMM= 0
##$S_DEV= 0
##$TDeff= 65536
##$TDoff= 0
##$TI= <>
##$TILT= no
##$TM1= 0
##$TM2= 0
##$TOPLEV= 0
##$USERP1= <user>
##$USERP2= <user>
##$USERP3= <user>
##$USERP4= <user>
##$USERP5= <user>
##$WDW= 1
##$XDIM= 32768
##$YMAX_p= 506340171
##$YMIN_p= -81613335
##$CURPLOT= <Network HP LaserJet P1505>
##$CURPRIN= <$Network HP LaserJet P1505>
##$DFORMAT= <normdp>
##$LAYOUT= <+/1D_H.xwp>
##$LFORMAT= <normlp>
##$PFORMAT= <normpl>
##$SURQMSG= 1
$$ End of Bruker specific parameters
$$ ---------------------------------
##NTUPLES= NMR SPECTRUM
##VAR_NAME=  FREQUENCY,     SPECTRUM/REAL,   SPECTRUM/IMAG
##SYMBOL=    X,             R,               I
##VAR_TYPE=  INDEPENDENT,   DEPENDENT,       DEPENDENT
##VAR_FORM=  AFFN,          ASDF,            ASDF
##VAR_DIM=   32768,         32768,           32768
##UNITS=     HZ,            ARBITRARY UNITS, ARBITRARY UNITS
##FACTOR=    0.250966925370065, 1,           1
##FIRST=     8223.43324360093, 14595,        -360066
##LAST=      0,             30303,           -318826
##MIN=       0,             -81613335,       0
##MAX=       8223.43324360093, 506340171,    0
$$ Real data points
##PAGE= N=1
##DATA TABLE= (X++(R..R)), XYDATA
$$ [...]
$$ plain form
19451 3428771 2756261 2858169 2623597 2319468 2490142 3032318 2705564 2933164 2367777
19442 2367777 2191342 2466236 2276330 2370968 2609234 2557700 2458391 2351747 2477572 2114454
19432 2114454 2074718 2642268 2343221 2182320 2284822 2117481 2602491 2327541 2510574 2498051
19422 2498051 2580255 2577046 2620668 2728129 2036930 1929605 2271893 2362229 2022931 1915027
19412 1915027 2473619 2326523 2445083 2312864 2295752 1955694 2079093 1867975 2135595 2295153
19402 2295153 1727486 2016909 1744719 1624231 2068905 2049259 1803469 2055873 1926392 2043996
19392 2043996 2580782 1650736 2252281 2104393 2432743 2090136 2452590 2114520 2415110
19383 2415110 2099710 2297306 2072736 1953721 1924296 1865389 2125401 2041055 1977766 2030578
$$ packed form
19451C428771o72510J01908k34572l04129J70674N42176l26754K27600n65387
19442B367777j76435K74894j89906R4638K38266n1534r9309j06644J25825l63118
19432B114454l9736N67550k99047j60901J02502j67341M85010k74950J83033j2523
19422B498051Q2204l209M3622J07461o91199j07325L42288R0336l39298j07904
19412A915027N58592j47096J18560j32219j7112l40058J23399k11118K67620J59558
19402B295153n67667K89423k72190j20488M44674j9646k45790K52404j29481J17604
19392B043996N36786r30046O01545j47888L28350l42607L62454l38070L00590
19383B415110l15400J97596k24570j19015k9425n8907K60012q4346o3289N2812
$$ plain form
19373 2030578 1859830 2164052 2260973 1736142 1997471 2189172 1976973 2206258 2200848 1583307
19363 1583307 1848604 2023770 1970596 2262656 1569924 2325100 1923204 1881005 1889828 1644781
19353 1644781 1971529 1744997 2002884 1868480 1612147 1752172 1462510 1909572 1654916
19344 1654916 1290383 1520453 1524787 1591946 1615401 1940981 1992771 2054185 1637031 2080463
19334 2080463 2004259 1917766 1873821 2274063 1638527 1716837 1744028 1822881 2208794 2384571
19324 2384571 2116574 1567783 1706364 1726419 2078645 2107401 1831822 2015351 1743083 1847111
19314 1847111 1766998 1406686 1856478 1485717 1544459 1807575 2055543 1999611 1740644 1804817
19304 1804817 2131659 1589729 1990313 1809721 2110949 2173557 2058084 2044704 1921899 2101202
$$ packed form
19373B030578j70748L04222R6921n24831K61329J91701k12199K29285n410o17541
19363A583307K65297J75166n3174K92060o92732P55176m01896m2199Q823k45047
19353A644781L26748k26532K57887j34404k56333J40025k89662M47062k54656
19344A654916l64533K30070M334O7159K3455L25580N1790O1414m17154M43432
19334B080463p6204q6493m3945M00242o35536P8310K7191P8853L85913J75777
19324B384571k67997n48791J38581K0055L52226K8756k75579J83529k72268J04028
19314A847111q0113l60312M49792l70761N8742K63116K47968n5932k58967O4173
19304A804817L26842n41930M00584j80592L01228O2608j15473j3380j22805J79303
$$ plain form
19294 2101202 1452427 1712126 1879101 1780515 1973630 1582469 2328422 1865200 1632843 1461792
19284 1461792 1576099 1913186 1732722 1755553 1695731 2006029 2181599 2050987 1547985 1732880
19274 1732880 1488001 1885611 1817961 1835905 1816068 1653992 2226957 1521082 2052192 1888950
19264 1888950 2051212 1878705 1807757 2164363 1378186 1809084 1813051 2276949 1752465 1881057
19254 1881057 1890598 1659246 1998460 2008846 1423280 1667908 1668320 1837536 1838824 1966335 2655520
19243 2655520 3252962 3334675 3848923 3764429 3750393 3948661 4066954 3726098 2892588 2597998
19233 2597998 2074291 1719346 1943887 1985092 1741774 1818415 1316779 1462098 1899626 2062921
19223 2062921 1373579 1829439 1578042 1461325 1538707 1673517 1515929 1239322 1578131 1497271
$$ packed form
19294B101202o48775K59699J66975r8586J93115l91161P45953m63222k32357j71051
19284A461792J14307L37087j80464K2831n9822L10298J75570j30612n03002J84895
19274A732880k44879L97610o7650J7944j9837j62076N72965p05875N31110j63242
19264A888950J62262j72507p0948L56606p86177M30898L967M63898n24484J28592
19254A881057R541k31352L39214J0386n85566K44628M12J69216J288J27511O89185
19243B655520N97442Q1713N14248q4494j4036J98268J18293l40856q33510k94590
19233B597998n23707l54945K24541M1205k43318P6641n01636J45319M37528J63295
19223B062921o89342M55860k51397j16717P7382J34810j57588k76607L38809q0860
$$ plain form
19213 1497271 1771242 1185861 1516656 1874757 1503819 1320865 1654828 1389383 1990269
19204 1990269 1763401 1727410 1692568 1295344 1237375 1637023 1401309 1755471 1781702 1581244
19194 1581244 1811133 1826038 1889431 1566330 1717636 1714724 1726469 1590505 1224559 1441462
19184 1441462 1339316 1440675 1095390 1774843 1258448 1731971 1657227 1448633 1719881 1533969
19174 1533969 1499655 1862260 1413649 1604890 1514112 1737419 1693987 1560190 1503815 1676910
19164 1676910 1612087 1496366 1240093 1624666 1702225 1947474 1466001 1393340 1591249 1493150
19154 1493150 1636699 1540325 1359706 1606427 2173528 1265955 1699223 2141345 1727422 2126085
19144 2126085 1652552 2283782 2050940 1715435 1798159 2145357 1982807 1804986 2272767 1914576
$$ packed form
19213A497271K73971n85381L30795L58101l70938j82954L33963k65445O00886
19204A990269k26868l5991l4842l97224n7969L99648k35714L54162K6231k00458
19194A581244K29889J4905O3393l23101J51306k912J1745j35964l65946K16903
19184A441462j02146J01359l45285O79453n16395M73523p4744k08594K71248j85912
19174A533969l4314L62605m48611J91241r0778K23307m3432j33797n6375J73095
19164A676910o4823j15721k56273L84573P7559K45249m81473p2661J97909r8099
19154A493150J43549r6374j80619K46721N67101r07573M33268M42122m13923L98663
19144B126085m73533O31230k32842l35505Q2724L47198j62550j77821M67781l58191
$$ plain form
19134 1914576 2166961 2660227 2517107 3323423 3236173 3543661 3289597 3456804 3356673 3167736
19124 3167736 3644384 3146799 3133514 3252709 3644814 3641460 2810604 3582999 2820587 2783788
19114 2783788 2680719 2071885 2379546 2571878 2389075 2239636 2350130 2223516 2002937
19105 2002937 2145795 2210523 2360733 1823436 2071908 1753380 2534361 2602035 2821934 2187723
19095 2187723 2514183 2572097 2500855 2624510 2552345 2589174 2803513 2356739 2800651 2571125
19085 2571125 2536709 2766387 2393291 2608028 2781049 2566412 2270919 2236965 2883243 2988815
19075 2988815 3011963 3028715 3397036 3304730 3491509 3842419 4457654 5034623 5790512 6734273
19065 6734273 7805719 9726229 10839286 11694442 12148648 12711857 13360826 12816742 11823612
$$ packed form
19134A914576K52385M93266j43120Q06316q7250L07488k54064J67207j00131j88937
19124C167736M76648m97585j3285J19195L92105l354q30856P72395p62412l6799
19114B783788j03069o08834L07661J92332j82803j49439J10494j26614k20579
19105B002937J42858O4728J50210n37297K48472l18528P80981O7674K19899o34211
19095B187723L26460N7914p1242J23655p2165L6829K14339m46774M43912k29526
19085B571125l4416K29678l73096K14737J73021k14637k95493l3954O46278J05572
19075B988815K3148J6752L68321r2306J86779L50910O15235N76969P55889R43761
19065F734273J071446J920510J113057Q55156M54206N63209O48969n44084r93130
$$ plain form
19056 11823612 10914311 9934627 8374246 7538027 6254722 5785309 5230753 5072411 4799913
19047 4799913 5153752 5487384 6508269 8224886 9028246 9751815 10005974 10633151 10353808
19038 10353808 10503532 10347291 9026096 7484319 7209983 5823414 5066478 4371822 4415552
19029 4415552 4480190 4792017 4819824 4576489 4125621 5117368 5326206 5387843 6301407 6475558
19019 6475558 7939817 9472024 11202873 12215174 13707586 14346856 14837172 14716052 14250138
19010 14250138 13145736 11957033 10621898 9627036 8755763 7537749 7136439 7197358 8124976
19001 8124976 8236169 9169160 10257800 11166346 11652970 11608949 11402392 11081897 10245367
18992 10245367 9653300 8334880 6923768 6625271 5595324 5067600 4715711 4881493 4761316
$$ packed form
19056A1823612r09301r79684j560381q36219j283305m69413n54556j58342k72498
19047D799913L53839L33632J020885J716617Q03360P23569K54159O27177k79343
19038A0353808J49724j56241j321195j541777k74336j386569p56936o94656M3730
19029D415552O4638L11827K7807k43335m50868R91747K08838O1637R13564J74151
19019F475558J464259J532207J730849J012301J492412O39270M90316j21120m65914
19010A4250138j104402j188703j335135r94862q71273j218014m01310O0919R27618
19001H124976J11193R32991J088640R08546M86624m4021k06557l20495q36530
18992A0245367n92067j318420j411112k98497j029947n27724l51889J65782j20177
$$ plain form
18983 4761316 5894025 6679109 7775498 8512484 9646236 10308154 10904012 11021643 11444725
18974 11444725 11004040 10551847 9489494 8564673 7808630 6632067 6280570 6255731 5969494
18965 5969494 6228875 6410494 6596630 6795978 7632263 7946631 8872097 9768594 11162323
18956 11162323 12799069 15251883 18155522 20647570 24511508 27849682 31396963 35568404
18948 35568404 40136806 44276240 47615601 49106740 50222190 50022270 48613978 46163171
18940 46163171 43131130 38481457 33872817 28723494 24459146 20004567 17283331 14987636
18932 14987636 12569036 11216917 10047817 8220505 7873102 7082658 6491573 5768852 5813919
18923 5813919 5097399 5607608 4437680 4153648 4429540 4357264 4283014 4171732 4318778 4513786
$$ packed form
18983D761316J132709P85084J096389P36986J133752O61918N95858J17631M23082
18974A1444725m40685m52193j062353r24821p56043j176563l51497k4839k86237
18965E969494K59381J81619J86136J99348Q36285L14368R25466Q96497J393729
18956A1162323J636746K452814K903639K492048L863938L338174L547281M171441
18948C5568404M568402M139434L339361J491139J115450j99920j408292k450807
18940D6163171l032041m649673m608640n149323m264348m454579k721236k295695
18932A4987636k418600j352119j169100j827312l47403p90444n91085p22721M5067
18923E813919p16520N10209j169928k84032K75892p2276p4250j11282J47046J95008
$$ plain form
18913 4513786 4174843 4539101 4299419 4496092 4503009 4347973 4442647 4193555 4248355 4570125
18903 4570125 4788872 4423306 4976382 4978628 5318014 5729012 6581166 6364367 6851400 7302509
18893 7302509 7816888 8497160 9585748 11430968 12776413 14682371 17577681 21651932
18885 21651932 25210830 29593624 34040315 36837296 39891732 41847206 41939968 41307396
18877 41307396 39409090 35921982 32493928 27554343 23577852 19558130 16581086 13542901
18869 13542901 12139585 9884465 8656956 7646129 6947583 5958346 5630028 4988773 4385009
18860 4385009 4098069 3954634 3695822 3740947 2720421 3526507 2988435 2558457 2627064 2913047
18850 2913047 2653470 2763510 2637252 2653193 2414717 2498192 2522891 2291642 2105291 2540914
$$ packed form
18913D513786l38943L64258k39682J96673O917j55036R4674k49092N4800L21770
18903D570125K18747l65566N53076K246L39386M10998Q52154k16799M87033M51109
18893G302509N14379O80272J088588J845220J345445J905958K895310M074251
18885B1651932L558898M382794M446691K796981L054436J955474R2762o32572
18877D1307396j898306l487108l428054m939585l976491m019722k977044l038185
18869A3542901j403316k255120j227509j010827o98546r89237l28318o41255o03764
18860D385009k86940j43435k58812M5125j020526Q06086n38072m29978O8607K85983
18850B913047k59577J10040j26258J5941k38476Q3475K4699k31249j86351M35623
$$ plain form
18840 2540914 2576543 1924764 1934875 2342227 2475261 2028694 2160538 2338171 1889924 2049833
18830 2049833 1535172 1813500 2015732 2494959 1985332 1885257 1762041 1709211 1818300 1665604
18820 1665604 1682359 1678045 1492811 1788681 1838589 1321298 1507537 1157789 1786033 1175461
18810 1175461 1424380 1689290 1281669 1860871 1507086 1575149 1552675 1660621 1778017 1659842
18800 1659842 1324188 1469129 1387793 1691354 2394506 1693852 1633308 1709070 1407723 1544809
18790 1544809 1618549 1853697 1281148 1908099 2158717 2032846 1768182 1893871 2081041 1455029
18780 1455029 1589374 1871285 1966196 1999472 1946349 1631292 1553101 1919748 1677241 2006823
18770 2006823 1990463 1739567 1803041 1920481 2287692 2218389 1924346 2053306 2037344 2391504
$$ packed form
18840B540914L5629o51779J0111M07352J33034m46567J31844J77633m48247J59909
18830B049833n14661K78328K02232M79227n09627j00075j23216n2830J09089j52696
18820A665604J6755m314j85234K95870M9908n17291J86239l49748O28244o10572
18810A175461K48919K64910m07621N79202l53785O8063k2474J07946J17396j18175
18800A659842l35654J44941q1336L03561P03152p00654o0544P5762l01347J37086
18790A544809P3740K35148n72549O26951K50618j25871k64664J25689J87170o26012
18780A455029J34345K81911R4911L3276n3123l15057p8191L66647k42507L29582
18770B006823j6360k50896O3474J17440L67211o9303k94043J28960j5962L54160
$$ plain form
18760 2391504 2085000 1965931 2141429 1574984 1962124 2506946 2401456 1811070 1434099
18751 1434099 1732305 2341533 1628233 1789624 1549956 1732983 1551102 1888183 1693958
18742 1693958 1657628 1874281 1584634 1726504 1499521 1242829 1621769 1610477 1259643 1604473
18732 1604473 1528436 1387773 1350251 1336444 1510679 1009217 1481242 1558644 1455016 1774125
18722 1774125 1466411 1484008 1389858 1927020 1926751 1324117 1546885 1701438 1129617 1190162
18712 1190162 1767365 2091332 1753583 1490886 1321457 1526128 2447853 1667166 1855647
18703 1855647 1625083 1523901 1815209 1627377 1569940 2039547 1469214 1916083 1607219 1714822
18693 1714822 1544489 1994080 1856159 1856751 1619054 1543661 1394991 1801710 1643279 1373328
$$ packed form
18760B391504l06504j19069J75498n66445L87140N44822j05490n90386l76971
18751A434099K98206O09228p13300J61391k39668J83027j81881L37081j94225
18742A693958l6330K16653k89647J41870k26983k56692L78940j1292l50834L44830
18732A604473p6037j40663l7522j3807J74235n01462M72025P7402j03628L19109
18722A774125l07714J7597r4150N37162k69o02634K22768J54553n71821O0545
18712A190162N77203L23967l37749k62697j69429K04671R21725p80687J88481
18703A855647k30564j01182K91308j87832n7437M69607n70333M46869l08864J07603
18693A714822j70333M49591j37921N92k37697p5393j48670M06719j58431k69951
$$ plain form
18683 1373328 1187479 1562507 1633203 1109884 1258555 1372624 1419729 1445259 824266 1563196
18673 1563196 1318008 1885500 1448895 1349961 1298339 1357887 1342666 1325747 1337410 1438547
18663 1438547 1363097 1190729 671821 1211700 1218369 875231 1102460 1177014 957204 1373847
18653 1373847 1623073 1091402 1441892 1261685 1391437 900866 977420 1257406 1470810 1215844
18643 1215844 1267900 1236293 1038770 1271635 1653858 1321765 1124102 1588683 1425441 894197
18633 894197 1185858 1094582 1128537 1499441 1216361 977294 1592446 1282142 1095152 1173253
18623 1173253 1353283 1286395 1581918 1255881 1712842 1278665 1406060 1423735 1502992 1403217
18613 1403217 1204510 1334937 1935839 889634 1581024 1017377 1700708 1282052 1655270
$$ packed form
18683A373328j85849L75028P0696n23319J48671J14069M7105K5530o20993P38930
18673A563196k45188N67492m36605r8934n1622N9548j5221j6919J1663J01137
18663A438547p5450j72368n18908N39879O669l43138K27229P4554k19810M16643
18653A373847K49226n31671L50490j80207J29752m90571P6554K79986K13404k54966
18643A215844N2056l1607j97523K32865L82223l32093j97663M64581j63242n31244
18633H94197K91661r1276L3955L70904k83080k39067O15152l10304j86990P8101
18623A173253J80030o6888K95523l26037M56961m34177J27395J7675P9257r9775
18613A403217j98707J30427O00902H89634O91390n63647O83331m18656L73218
$$ plain form
18604 1655270 1203755 1189850 1166447 1079740 1271983 1059239 1423774 1117828 1792451 1485488
18594 1485488 1648717 1489662 1212538 1388850 1276945 1383346 1545558 1481089 1725310 1485371
18584 1485371 1375174 1558405 1286311 1051835 1428823 1255127 1420900 1542382 1724388
18575 1724388 1237213 1229046 1534837 1077374 1533924 1459777 1372454 1312057 1315934 1384934 1368701
18564 1368701 1320657 1493263 943545 1394802 1458027 1328536 1375272 1388670 1459828 1356517
18554 1356517 1301767 1904785 1105374 1496955 1431398 1367841 701974 1085421 1662969 1122661
18544 1122661 1281789 1613107 1068620 1113461 1472430 1339519 1351445 1185408 1091358 1347412
18534 1347412 960169 1182466 1280055 1247992 1322548 966329 777296 823807 1087246 1333573
$$ packed form
18604A655270m51515j3905k3403q6707J92243k12744L64535l05946O74623l06963
18594A485488J63229j59055k77124J76312j11905J06401J62212o4469K44221k39939
18584A485371j10197J83231k72094k34476L76988j73696J65773J21482J82006
18575A724388m87175q167L05791m57463M56550p4147q7323o0397L877O9000j6233
18564A368701m8044J72606n49718M51257O3225j29491M6736J3398P1158j03311
18554A356517n4750O03018p99411L91581o5557o3557o65867L83447N77548n40308
18544A122661J59128L31318n44487M4841L58969j32911J1926j66037r4050K56054
18534A347412l87243K22297R7589l2063P4556l56219j89033M6511K63439K46327
$$ plain form
18524 1333573 1131684 979255 1111730 897625 975970 1336863 733673 1205626 470994 1018646
18514 1018646 1161638 1211650 1191875 969143 1071776 1067790 1038679 1169331 756393 1163555
18504 1163555 1385752 1153128 493922 1557942 1234074 816445 1355184 1146562 668784
18495 668784 1310347 991902 1129067 1160491 1197039 828815 1289607 1144609 993736 1677462
18485 1677462 1142264 1031840 803174 1252879 1293747 1472460 794827 697336 909210 1506416
18475 1506416 893343 692753 1064483 1534696 1550499 871777 1440961 1251684 1228181 901292
18465 901292 1275460 1165016 1506335 1145162 959190 1466483 971692 1090674 1138323 999312
18455 999312 884539 1332871 1506007 1466769 1166335 1232929 1070562 604078 875195 1289818
$$ packed form
18524A333573k01889j52429J32475k14105P8345L60893o03190M71953D70994N47652
18514A018646J42992N0012j9775k22732J02633l986k9111J30652m12938M07162
18504A163555K22197k32624D93922J064020l23868m17629N38739k08622m77778
18495F68784O41563l18445J37165L1424L6548l68224M60792j44998j50873O83726
18485A677462n35198j10424k28666M49705M0868J78713o77633r7491K11874N97206
18475A506416o13073k00590L71730M70213J5803o78722N69184j89277k3503l26889
18465I01292L74168j10444L41319l61173j85972N07293m94791J18982M7649j39011
18455I99312j14773M48332J73136l9238l00434O6594j62367m66484K71117M14623
$$ plain form
18445 1289818 948029 917497 1095845 1083139 839157 1069165 1228423 844509 1168882 1308180
18435 1308180 1099188 1578764 999790 937504 966391 1130924 835670 1076627 797372 1401601
18425 1401601 1564808 1348558 1580938 660840 1281544 1663680 744961 836494 914131 1625073
18415 1625073 1143548 1205252 1172388 1392813 1085689 902189 1175968 839593 1245592 1110606
18405 1110606 792421 889341 1553852 1539524 766600 1336082 1302829 962189 1452447 1347356
18395 1347356 1156757 1221020 1429471 976692 940757 1529686 1048574 1213759 1156880 1687104
18385 1687104 1203670 1185887 1191481 933024 1424963 1369741 1157762 928477 1389347 1349167
18375 1349167 1293054 890130 1107089 816955 540644 1569911 821449 1054005 1155656
$$ packed form
18445A289818l41789l0532J78348j2706k43982K30008J59258l83914L24373J39298
18435A308180k08992M79576n78974o2286K8887J64533k95254K40957k79255O04229
18425A401601J63207k16250K32380F60840O20704L82136G44961R1533P7637P10942
18415A625073m81525O1704l2864K20425l07124j83500K73779l36375M05999j34986
18405A110606l18185R6920O64511j4328G66600N69482l3253l40640M90258j05091
18395A347356j90599O4263K08451m52779l5935N88929m81112J65185n6879N30224
18385A687104m83434j7783N594k58457M91939n5222k11979k29285M60870m0180
18375A349167n6113m02924K16959k90134k76311J029267p48462K32556J01651
$$ plain form
18366 1155656 1134728 905924 1086911 655408 861166 1059367 825933 1005052 1428260 601846
18355 1128983 888487 1376394 1098503 975013 1233685 1327675 940179 1106911 663727 1220259
18345 1220259 1200300 1102472 1031206 1395220 490783 1115831 1245800 1075837 1274204 1132427
18335 1132427 1344400 1266809 1133881 1364884 915948 995003 799924 914129 1001726 673422
18325 673422 871333 1013053 1523957 995117 1001730 1180049 1293478 1372543 1200541 1365852
18315 1365852 1025914 1319415 848616 1190031 1485290 1382945 793020 1041914 828661
18306 828661 1068588 1012145 1344690 1055612 1324988 943002 1208034 1249842 718332 937615
18296 937615 1481066 1106962 1346125 1430842 1167688 971237 1198910 1499165 1132529 1437804
$$ packed form
18366A155656k0928k28804J80987m31503K05758J98201k33434J79119M23208F01846
18355A128983k40496M87907k77891j23490K58672R3990l87496J66732m43184N56532
18345A220259j9959r7828p1266L64014D90783O25048J29969j69963J98367j41777
18335A132427K11973p7591j32928K31003m48936P9055j95079J14205Q7597l28304
18325F73422J97911J41720N10904n28840O613J78319J13429P9065j72002J65311
18315A365852l39938K93501m70799L41415K95259j02345n89925K48894k13253
18306H28661K39927n6443L32545k89078K69376l81986K65032M1808n31510K19283
18296I37615N43451l74104K39163Q4717k63154j96451K27673L00255l66636L05275
$$ plain form
18286 1437804 1043295 1062964 1022384 1104092 897799 1295094 1209959 1019759 1072778 1077152 1469697
18275 1469697 700476 902706 896231 990191 675466 728706 1141993 1252050 984097 784011
18265 784011 1091226 1190702 1165452 1066530 383819 1336880 949675 1044329 1060757 763003
18255 763003 982002 1101250 1404498 1118161 1416166 1103210 1055836 1001328 1387690 1122138
18245 1122138 968402 1163530 1335421 962248 1291584 1285507 1328817 1052167 1223977 1116566
18235 1116566 927700 434514 1072366 545616 1033054 760914 1492467 1009355 540980
18226 540980 1010091 983163 1031297 840068 802409 672570 592465 1087954 1108694 798724
18216 798724 1017674 968304 1061397 1372561 964114 911753 666087 1240455 1183538 957647
$$ packed form
18286A437804l94509J9669m0580Q1708k06293L97295q5135j90200N3019M374L92545
18275A469697G00476K02230o475R3960l14725N3240M13287J10057k67953k00086
18265G84011L07215R9476k5250r8922C83819R53061l87205R4654J6428k97754
18255G63003K18999J19248L03248k86337K98005l12956m7374n4508L86362k65552
18245A122138j53736J95128J71891l73173L29336o077M3310k76650J71810j07411
18235A116566j88866D34514O37852n26750M87438k72140P31553m83112m68375
18226E40980M69111k6928M8134j91229l7659j29839q0105M95489K0740l09970
18216G98724K18950m9370R3093L11164m08447n2361k45666N74368n6917k25891
$$ plain form
18206 957647 664845 943858 1175632 437942 825761 1166416 1206121 1178458 1251690 1081336
18196 1081336 1325220 1675944 1114194 1065588 1051075 1279858 1228248 998427 767361 1001835
18186 1001835 1038555 1047962 789619 542852 993807 746193 753075 1115550 636170 1007552
18176 1007552 1073412 1101384 1213593 1286568 1066293 1302046 774997 1289946 489365 1005186
18166 1005186 831245 767917 772177 774981 1076674 1445067 942929 787811 932572 1127605
18156 1127605 1023572 981186 1242895 722448 797061 830922 305662 837518 872871 1078840
18146 1078840 561702 794569 688132 1214210 843807 902787 1431866 1443233 995472 547639
18136 547639 858776 1136358 1177602 1398504 1066595 938310 499394 523435 1269414 1226690
$$ packed form
18206I57647k92802K79013K31774D37942L87819L40655L9705k7663P3232j70354
18196A081336K43884L50724n61750m8606j4513K28783n1610k29821k31066K34474
18186A001835L6720R407k58343k46767M50955k47614O882L62475m79380L71382
18176A007552O5860K7972J12209P2975k20275K35753n27049N14949D89365N15821
18166A005186j73941o3328M260K804L01693L68393n02138j55118J44761J95033
18156A127605j04033m2386K61709n20447P4613L3861C05662N31856L5353K05969
18146A078840n17138K32867j06437N26078l70403N8980N29079J1367m47761m47833
18136E47639L11137K77582M1244K20902l31909j28285m38916K4041P45979m2724
$$ plain form
18126 1226690 1085613 1228438 904960 694502 895656 1166683 1210276 887099 785309 673297
18116 673297 709942 714341 1010357 659449 1175163 906162 1399840 1229698 924244 867522
18106 867522 930081 1267170 865533 1335250 1479368 733840 924309 1134960 1572126 1206475
18096 1206475 1283639 842298 1292386 1080595 1217939 1205379 1053712 572857 1474044 648413
18085 1172417 1030647 895103 841817 987364 943267 795787 998212 1193589 477020 1500141
18075 1500141 830765 972579 1330718 473134 1151987 1030281 1020869 948904 1148388 1120155
18065 1120155 698465 1237295 766063 1137937 1203149 1392215 1225600 873762 1012391 759195
18055 759195 1023740 1197617 1239276 1053929 1082534 1048941 805488 1088000 973477 478726
$$ packed form
18126A226690j41077J42825l23478k10458K01154K71027M3593l23177j01790j12012
18116F73297L6645M399K96016l50908N15714k69001M93678j70142l05454n6722
18106H67522O2559L37089m01637M69717J44118G33840J90469K10651M37166l65651
18096A206475P7164m41341M50088k11791J37344j2560j51667m80855R01187F48413
18085A172417j41770j35544n3286J45547m4097j47480K02425J95377D77020J023121
18075A500141o69376J41814L58139D73134O78853j21706r412p1965J99484k8233
18065A120155m21690N38830m71232L71874O5212J89066j66615l51838J38629k53196
18055G59195K64545J73877M1659j85347K8605l3593k43453K82512j14523D78726
$$ plain form
18044 874550 1019556 877613 1152518 595270 924690 278650 1152086 854747 1077834 761239
18034 761239 585754 1037656 850644 1137608 952172 1051531 776945 972408 1619565 858428
18024 858428 1136472 1087033 727941 684077 1397746 590190 974504 1232440 1112905 1070643
18014 1070643 1156121 422419 841255 998587 1203144 758025 858483 904821 750852 1042617
18004 1042617 829183 857720 1365763 968125 875294 689392 600433 1083415 808180 926999
17994 926999 1171312 1002143 1176217 1452052 888433 1199742 1070804 764266 940651 1668709
17984 1668709 897807 989823 1397590 1385452 886190 1041351 547991 766007 599180 1213466
17974 1213466 967806 1282081 1219981 1026838 921838 739735 1095846 618221 868885 972668
$$ packed form
18044H74550J45006j41943K74905n57248L29420B78650Q73436k97339K23087l16595
18034G61239j75485M51902j87012K86964j85436R9359k74586J95463O47157p61137
18024H58428K78044m9439l59092m3864P13669E90190L84314K57936j19535m2262
18014A070643Q5478D22419M18836J57332K04557m45119J00458M6338j53969K91765
18004A042617k13434K8537N08043l97638r2831j85902q8959M82982k75235J18819
17994I26999K44313j69169J74074K75835n63619L11309j28938l06538J76385P28058
17984A668709p70902R2016M07767j2138m99262J55161m93360K18016j66827O14286
17974A213466k45660L14275o2100j93143j05000j82103L56111m77625K50664J03783
$$ plain form
17964 972668 795350 949398 1165243 1057210 1051259 1141795 1044913 957443 1627775 1083441
17954 1083441 1136399 1565342 1012557 1305457 1284830 1062596 981756 892289 1279753 776016
17944 776016 1312101 965170 1073527 1130199 1334501 1114273 1300296 1115362 1234589 801645
17934 801645 1169003 1210334 1654403 1151237 1155681 1420614 755104 1343773 1490378 1717888
17924 1717888 1307167 1321857 1518271 1834021 1393827 1698965 1567094 991788 1000197 1693939
17914 1693939 1490150 1731528 1417218 1373258 1270118 1709074 1122256 1922147 1258063 1479203
17904 1479203 1933104 974378 1247336 1499575 1232683 1540582 1520653 1626236 1205854 1371948
17894 1371948 1614158 1614300 1583425 1738320 1707741 2124252 1651382 2066110 1291581 1856614
$$ packed form
17964I72668j77318J54048K15845j08033n951R0536r6882q7470O70332n44334
17954A083441N2958M28943n52785K92900k0627k22234q0840q9467L87464n03737
17944G76016N36085l46931J08357N6672K04302k20228J86023j84934J19227m32944
17934H01645L67358M1331M44069n03166M444K64933o65510N88669J46605K27510
17924A717888m10721J4690J96414L15750m40194L05138j31871n75306Q409O93742
17914A693939k03789K41378l14310m3960j03140M38956n86818P99891o64084K21140
17904A479203M53901r58726K72958K52239k66892L07899j9929J05583m20382J66094
17894A371948K42210J42l0875J54895l0579M16511m72870M14728p74529N65033
$$ plain form
17884 1856614 1902595 1291737 1408750 2086949 1388254 2144558 2138493 1474180 1987843 1791136
17874 1791136 2132076 2010216 2314386 1979774 2005243 1872618 1067226 1641106 2009626 2258559
17864 2258559 1767555 1681091 1731911 1489290 1779975 1730509 1837238 1824617 1562264 1477037
17854 1477037 1794041 1481146 1782144 1325115 1743357 1795981 1242681 1555955 1496431 1206578
17844 1206578 1549044 1564783 1405881 1237357 1475421 1417443 1392491 1536710 1552364 2093533
17834 2093533 1435007 1557661 1203052 1340469 1336704 1218813 1266142 1750416 1641125 1240825
17824 1240825 1444829 1305831 1283381 1522315 1970885 1417689 1586032 1209860 1331529 1739239
17814 1739239 2038107 1746898 1926783 1488936 2226828 2019090 1727167 1538763 1242878
$$ packed form
17884A856614M5981o10858J17013O78199o98695P56304o065o64313N13663j96707
17874A791136L40940j21860L04170l34612K5469j32625q05392N73880L68520K48933
17864B258559m91004q6464N0820k42621K90685m9466J06729j2621k62353q5227
17854A477037L17004l12895L00998m57029M18242N2624n53300L13274n9524k89853
17844A206578L42466J5739j58902j68524K38064n7978k4952J44219J5654N41169
17834B093533o58526J22654l54609J37417l765j17891M7329M84274j09291m00300
17824A240825K04004j38998k2450K38934M48570n53196J68343l76172J21669M07710
17814A739239K98868k91209J79885m37847P37892k07738k91923j88404k95885
$$ plain form
17805 1242878 1468889 1472293 1438703 1784684 1091292 1944498 1397757 1634520 1427241 1748866
17795 1748866 1494604 2040057 1346146 1530203 1586718 1319925 1540305 1370637 1031577 1378953
17785 1378953 1556922 1047259 1588961 967361 1458895 1131613 1236285 1361470 1143340
17776 1143340 1654250 1390203 1281724 1026800 1193783 1315858 1255433 1458236 1140468 1418743
17766 1418743 1202929 1188584 1626149 1392737 837474 1463560 1645876 1148383 1635604 1515182
17756 1515182 1296743 1499890 1107535 1409032 1148812 1404396 1294032 1159056 1579043
17747 1579043 1265546 1543447 1433266 1125981 1574085 1289465 750475 1732516 1200542
17738 1200542 1564990 1509576 1339447 1183244 1278503 1735793 1285221 1459319 1205139 1512164
$$ packed form
17805A242878K26011L404l3590L45981o93392Q53206n46741K36763k07279L21625
17795A748866k54262N45453o93911J84057N6515k66793K20380j69668l39060L47376
17785A378953J77969n09663N41702o21600M91534l27282J04672J25185k18130
17776A143340N10910k64047j08479k54924J66983J22075o0425K02803l17768K78275
17766A418743k15814j4345M37565k33412n55263O26086J82316m97493M87221j20422
17756A515182k18439K03147l92355L01497k60220K55584j10364j34976M19987
17747A579043l13497K77901j10181l07285M48104k84620n38990R82041n31974
17738A200542L64448n5414j70129j56203R5259M57290m50572J74098k54180L07025
$$ plain form
17728 1512164 1043702 1363446 1383497 1594154 1222858 1138765 1156802 1339746 1164063 1444952
17718 1444952 1516799 1330572 1321578 1500143 1630077 907643 1076171 1559887 1449245 878649
17708 878649 902275 1640889 1644491 573099 1169014 1040701 1274271 762714 1371356 1473015
17698 1473015 1193657 1076289 1301333 1258270 970358 1248612 1338862 1309586 1238199 1057569
17688 1057569 1411150 1823367 1644871 1241153 1370513 1478906 1265541 1065593 1098395 1359207
17678 1359207 1363803 1387136 1429541 1617327 1374655 1609418 1515596 1449014 1301959 1691461
17668 1691461 1278410 1138178 952694 1522680 1355762 1578117 1557132 1387530 1367038 1454773
17658 1454773 1508649 1484020 1318333 1447008 1339530 1509038 1499923 1420016 1573037 1862257
$$ packed form
17728A512164m68462L19744K0051K10657l71296q4093J8037J82944j75683K80889
17718A444952P1847j86227q994J78565J29934p22434J68528M83716j10642n70596
17708H78649K3626P38614L602E73099N95915j28313K33570n11557O08642J01659
17698A473015k79358j17368K25044m3063k87912K78254R0250k9276p1387j80630
17688A057569L53581M12217j78496m03718J29360J08393k13365j99948L2802K60812
17678A359207M596K3333M2405J87786k42672K34763r3822o6582j47055L89502
17668A691461m13051j40232j85484N69986j66918K22355k0985j69602k0492Q7735
17658A454773N3876k4629j65687J28675j07478J69508r115p9907J53021K89220
$$ plain form
17648 1862257 1626893 1388673 1898413 1859908 2082227 1843991 1604129 2230016 1739551 1693025
17638 1693025 1526419 1686601 1725653 1815339 1541066 2110398 1980978 1882739 1907387 1617637
17628 1617637 2125688 2063786 2063526 2136056 2131667 2058730 2488952 2793278 2396767 2326629 2564774
17617 2564774 2890823 2162144 2410665 2027717 2306564 2346455 2740480 2245196 2455278 2944557
17607 2944557 2495781 2786278 2364338 2491444 2566493 2919984 2533503 2433394 2634928 2223948
17597 2223948 2741062 2498919 2621490 2584400 2685478 2670454 2216335 2669705 2486033 2706177
17587 2706177 2731765 2885161 2748745 2769937 2732144 2326853 2525453 2153819 2030234 2402322
17577 2402322 2411941 1987889 2804997 2432031 2626088 2366735 2415868 2386355 2448787 2380536
$$ packed form
17648A862257k35364k38220N09740l8505K22319k38236k39862O25887m90465m6526
17638A693025j66606J60182L9052Q9686k74273N69332j29420r8239K4648k89750
17628A617637N08051o1902k60P2530m389p2937M30222L04326l96511p0138K38145
17617B564774L26049p28679K48521l82948K78847L9891L94025m95284K10082M89279
17607B944557m48776K90497m21940J27106P5049L53491l86481j00109K01534m10980
17597B223948N17114k42143J22571l7090J01078j5024m54119M53370j83672K20144
17587B706177K5588J53396j36416K1192l7793m05291J98600l71634j23585L72088
17577B402322R619m24052Q17108l72966J94057k59353M9133k9513O2432o8251
$$ plain form
17567 2380536 2410837 2291332 2047913 2425247 2306707 2285684 2258431 2213784 2339833 2196460
17557 2196460 2403522 2141188 1948098 2375834 2044051 1980100 2361654 2384012 2101804 2520301
17547 2520301 2406490 2403729 2076476 2064353 2031395 2211857 2441287 2404790 2463050 2170110
17537 2170110 2297721 2476172 2689898 2273950 2438671 2171829 2107229 2337268 2408282 2061171
17527 2061171 2667745 2527430 2387699 2454181 2013729 2471270 2071622 2276232 2049619 2278858
17517 2278858 2656804 2513734 2698918 3127894 3069931 3050560 2988231 3260341 3000346 3529239
17507 3529239 3428648 3646570 3747767 3694851 3885380 4028574 3706545 3955273 3837106 3761235
17497 3761235 3895925 5103672 4712904 5093158 6099816 6695266 7635408 8398086 9250939
$$ packed form
17567B380536L0301j19505k43419L77334j18540k1023k7253m4647J26049j43373
17557B196460K07062k62334j93090M27736l31783o3951L81554K2358k82208M18497
17547B520301j13811k761l27253j2123l2958J80462K29430l6497N8260k92940
17537B170110J27611J78451K13726m15948J64721k66842o4600K30039P1014l47111
17527B061171O06574j40315j39731O6482m40452M57541l99648K04610k26613K29239
17517B278858L77946j43070J85184M28976n7963j9371o2329K72110k59995N28893
17507C529239j00591K17922J01197n2916J90529J43194l22029K48728j18167p5871
17497C761235J34690J207747l90768L80254J006658N95450R40142P62678Q52853
$$ plain form
17488 9250939 11489395 15052491 21461586 32384845 46778257 63563505 79099193 90626072
17480 90626072 98588094 102315562 103095712 100381235 93951715 82950491 69419056 55268171
17472 55268171 45295011 40957701 43595748 52870598 66225431 80019883 91933028 100054141
17464 100054141 104082462 105503357 102464445 95846514 85321081 71632251 55596532
17457 55596532 40301782 28578804 20677531 15772246 12789051 10432321 9247758 8342514
17449 8342514 7981983 7650130 7007383 7113995 7477009 7686635 8069899 8173828 8389753
17440 8389753 8629811 7910931 8174367 7720258 7295600 6514406 7052807 6856746 6945502 6987565
17430 6987565 7343754 7409230 7544334 8061339 7274685 6961217 7369092 6767289 6360132 6092976
$$ packed form
17488I250939K238456L563096O409095J0923259J4393412J6785248J5535688J1526879
17480I0626072P962022L727468P80150k714477o429520j1001224j3531435j4150885
17472E5268171r973160m337310K638047R274850J3354833J3794452J1913145Q121113
17464A00054141M028321J420895l038912o617931j0525433j3688830j6035719
17457E5596532j5294750j1722978p901273m905285k983195k356730j184563r05244
17449H342514l60531l31853o42747J06612L63014K09626L83264J03929K15925
17440H389753K40058p18880K63436m54109m24658p81194N38401j96061Q8756M2063
17430F987565L56189O5476J35104N17005p86654l13468M07875o01803m07157k67156
$$ plain form
17420 6092976 5511259 5387119 4851518 4725465 4304553 5173798 5157784 4679195 4845835 5202947
17410 5202947 4726433 4643969 4710174 4936032 5116620 5144291 5282248 6560202 6326302 6582734
17400 6582734 6946974 6596009 6675356 6818461 7138961 7460214 7815794 8114197 8686866 9327817
17390 9327817 9828869 10978883 11715901 12734568 13658800 13777743 14142909 15150069 14623583
17381 14623583 14786720 14627372 14381641 13425100 12681940 12777276 12765383 12062074 12632330 12772143
17371 12772143 13367736 13894311 14741669 15622276 16551161 17118540 18467160 18050094 18309348
17362 18309348 18322039 18304756 17668721 17694237 17660206 17114619 16736765 17165871 17467808 17487799
17352 17487799 18156927 19088070 19361276 20716241 21541178 22902364 24370736 25625308 26729056
$$ packed form
17420F092976n81717j24140n35601j26053m20912Q69245j6014m78589J66640L57112
17410E202947m76514q2464O6205K25858J80588K7671J37957J277954k33900K56432
17400F582734L64240l50965P9347J43105L20500L21253L55580K98403N72669O40951
17390I327817N01052J150014P37018J018667R24232J18943L65166J007160n26486
17381A4623583J63137j59348k45731r56541p43160R5336j1893p03309N70256J39813
17371A2772143N95593N26575Q47358Q80607R28885N67379J348620m17066K59254
17362A8309348J2691j7283o36035K5516l4031n45587l77854M29106L01937J9991
17352A7487799O69128R31143K73206J354965Q24937J361186J468372J254572J103748
$$ plain form
17343 26729056 27485305 28423739 28718399 28351217 28554268 28003670 26931594 26455439 25793722
17334 25793722 25558206 25657101 25260142 25466437 26005615 26783090 27431643 28208655 29397944
17325 29397944 29468737 30943881 30909692 31509069 31304376 30475662 29428888 28753796 28204745
17316 28204745 27014104 26324930 24932103 23408807 22851295 22458220 21551772 21151229 21044537
17307 21044537 21383022 21579708 22535112 23444060 24327826 24971672 25533567 26306088 25971092
17298 25971092 26707718 26108803 25373378 24738184 23432170 22336632 21387269 20272932 19223904
17289 19223904 18449310 17751141 17970695 17409054 17364289 17575011 17859728 17481673 17379726
17280 17379726 16597843 16222812 16001250 15047556 13794822 12556651 12474677 10992998 10716657
$$ packed form
17343B6729056P56249R38434K94660l67182K03051n50598j072076m76155o61717
17334B5793722k35516R8895l96959K06295N39178P77475O48553P77012J189289
17325B9397944P0793J475144l4189N99377k04693q28714j046774o75092n49051
17316B8204745j190641o89174j392827j523296n57512l93075r06448m00543j06692
17307B1044537L38485J96686R55404R08948Q83766O43846N61895P72521l34996
17298B5971092P36626n98915p35425o35194j306014j095538r49363j114337j049028
17289A9223904p74594o98169K19554n61641m4765K10722K84717l78055j01947
17280A7379726p81883l75031k21562r53694j252734j238171q1974j481679k76341
$$ plain form
17271 10716657 9990016 9650151 8566512 8772710 7869135 7676180 7434644 6964767 6649533
17262 6649533 6568944 6164667 6725875 6059597 6140332 6237230 6143269 6102240 6153914 5858774
17252 5858774 5762281 5449910 6034760 5673321 5436509 5233519 5609255 4968027 5016940 5262084
17242 5262084 5302663 5355534 4796251 5298767 4884028 5078211 4883713 4954643 4864548 4537537
17232 4537537 4890635 5002861 4547197 4747458 5174739 5413259 5496232 5275925 5536958 5450349
17222 5450349 4603333 5111717 5478874 4965383 5077707 4867199 5064964 5020339 5516949 5649441
17212 5649441 5393097 5393700 6048759 5719072 5746760 5911595 6690696 6927065 7017877 6976113
17202 6976113 7083819 6809442 6936926 6549725 6637888 5738382 5485968 5393421 5158380 4721072
$$ packed form
17271A0716657p26641l39865j083639K06198r03575j92955k41536m69877l15234
17262F649533q0589m04277N61208o66278Q0735R6898r3961m1029N1674k95140
17252E858774r6493l12371N84850l61439k36812k02990L75736o41228M8913K45144
17242E262084M0579N2871n59283N02516m14739J94183j94498P0930r0095l27011
17232D537537L53098J12226m55664K00261M27281K38520Q2973k20307K61033q6609
17222E450349q47016N08384L67157n13491J12324k10508J97765m4625M96610J32492
17212E649441k56344O03O55059l29687K7688J64835P79101K36369R0812m1764
17202F976113J07706k74377J27484l87201Q8163q99506k52414r2547k35041m37308
$$ plain form
17192 4721072 4630893 4399684 4422906 4711705 4706773 5208803 4425318 5041110 4793544 4704051
17182 4704051 4389295 4459251 3729684 3545453 3226585 3520595 3200433 3047446 3400627 4045335
17172 4045335 3430869 3726223 3471974 3217943 3194831 3377491 3745620 3710420 3753331 3556671
17162 3556671 3448519 3599844 4101390 3998746 3946785 3997330 3732112 4189902 3931588 3851848
17152 3851848 3755835 4136223 3908411 3708775 3738157 4121679 3479766 3541698 3555444 3866320
17142 3866320 3347451 4168799 4294075 4528277 4441406 4022348 3779341 4279524 3948409 4630221
17132 4630221 3971589 3488076 3507947 4062746 3575905 3566674 3654161 3842635 3800879 3769111
17122 3769111 3829133 3774034 4295423 3823459 3974299 3664569 3816485 3820822 3916917 3797265
$$ packed form
17192D721072r0179k31209K3222K88799m932N02030p83485O15792k47566q9493
17182D704051l14756O9956p29567j84231l18868K94010l20162j52987L53181O44708
17172D045335o14466K95354k54249k54031k3112J82660L68129l5200M2911j96660
17162C556671j08152J51325N01546j02644n1961N0545k65218M57790k58314p9740
17152C851848r6013L80388k27812j99636K9382L83522o41913O1932J3746L10876
17142C866320n18869Q21348J25276K34202q6871m19058k43007N00183l31115O81812
17132D630221o58632m83513J9871N54799m86841r231Q7487J88474m1756l1768
17122C769111O0022n5099N21389m71964J50840l09730J51916M337R6095j19652
$$ plain form
17112 3797265 3008460 2885475 2854937 3223399 2809530 3187373 3350246 2881748 2792256 2536168
17102 2536168 2543704 2400141 2685070 2408381 2449841 2356395 2333082 2995270 2347439 2541109
17092 2541109 2424715 1980383 2391569 2367252 2286043 2473476 2270605 2476940 2555984 1655244
17082 1655244 2160385 2074688 2399489 2128634 2375793 1801925 2236233 2053324 2166716 2092047
17072 2092047 2470914 2467837 2303251 1931351 2280162 1952827 2274253 2210493 1912065 1992056
17062 1992056 1865377 1676723 2130057 1741277 1910924 1911922 2259056 2452719 1934511 2185859
17052 2185859 1983814 2046718 2757675 2233390 1985648 2289363 1900620 1995842 2033024 2467500
17042 2467500 2159017 2043787 1918136 2321896 2408740 2367430 2300198 2348393 2149156 2513167
$$ packed form
17112C797265p88805j22985l0538L68462m13869L77843J62873m68498q9492k56088
17102B536168P536j43563K84929k76689M1460r3446k3313O62188o47831J93670
17092B541109j16394m44332M11186k4317q1209J87433k02871K06335P9044r00740
17082A655244N05141q5697L24801k70855K47159n73868M34308j82909J13392p4669
17072B092047L78867l077j64586l71900L48811l27335L21426o3760k98428P9991
17062A992056j26679j88654M53334l88780J69647R98L47134J93663n18208K51348
17052B185859k02045O2904P10957n24285k47742L03715l88743R5222L7182M34476
17042B467500l08483j15230j25651M03760Q6844m1310o7232M8195j99237L64011
$$ plain form
17032 2513167 2390095 2395897 2397991 2717417 2504696 1974566 2222514 2083843 2303063 2440392
17022 2440392 2165721 2195859 2031866 2007238 1391699 1794096 2267351 1816695 2110774 1967592
17012 1967592 1824040 1793350 2031851 1968568 2400071 2756964 2132218 1864227 1893397 2041308
17002 2041308 2637855 1763317 2103052 2082920 2426465 1893759 2365530 2257277 2342168 2256554
16992 2256554 2545563 1746432 2068571 2316383 1563588 2417644 2528633 2283115 1923643
16983 1923643 2302690 2062405 2050922 2186940 2222563 2318460 2136067 2766920 2825882 2572867
16973 2572867 2754653 2536674 2716306 2867881 3050806 3490893 3669868 3747668 4300204 4268293
16963 4268293 4830873 4968828 4828698 5474130 4633634 5458286 5254234 5074585 5269440
$$ packed form
17032B513167j23072N802K094L19426k12721n30130K47948j38671K19220J37329
17022B440392k74671L0138j63993k4628o15539M02397M73255m50656K94079j43182
17012A967592j43552l0690K38501o3283M31503L56893o24746k67991K9170J47911
17002B041308N96547q74538L39735k0132L43545n32706M71771j08253Q4891q5614
16992B256554K89009p99131L22139K47812p52795Q54056J10989k45518l59472
16983A923643L79047k40285j1483J36018L5623R5897j82393O30853N8962k53015
16973B572867J81786k17979J79632J51575J82925M40087J78975P7800N52536l1911
16963D268293N62580J37955j40130O45432q40496Q24652k04052j79649J94855
$$ plain form
16954 5269440 5550797 5458055 5454999 5247811 5157250 5160687 4503040 4660015 4333405 4170731
16944 4170731 4390790 3478407 3995561 3463283 3393356 3350813 3174822 2884229 2688210 2831701
16934 2831701 2598865 2938118 2474865 2514570 2466978 2597798 2820310 2232938 2325464 2530620
16924 2530620 1910690 2491142 2255808 1926016 1892199 1712195 2497182 2014809 2035085 2092694
16914 2092694 2338527 1599265 1644460 1685423 1716450 1525146 1470468 1754892 1848112 1496920
16904 1496920 1978821 1682241 1833274 1604944 2113328 1666335 1480206 1422047 1904131 1509177
16894 1509177 1442738 1731708 1788577 1675430 1480793 1598588 1577817 1847364 1210356 1307494
16884 1307494 1621223 1544853 1642450 1718929 2001426 1706404 1666338 2202634 1660697 1938840
$$ packed form
16954E269440K81357r2742l056k07188r0561L437o57647J56975l26610j62674
16944D170731K20059r12383N17154n32278o9927m2543j75991k90593j96019J43491
16934B831701k32836L39253m63253L9705m7592J30820K22512n87372R2526K05156
16924B530620o19930N80452k35334l29792l3817j80004P84987m82373K0276N7609
16914B092694K45833p39262M5195M0963L1027j91304n4678K84424R3220l51192
16904A496920M81901k96580J51033k28330N08384m46993j86129n8159M82084l94954
16894A509177o6439K88970N6869j13147j94637J17795k0771K69547o37008R7138
16884A307494L13729p6370R7597P6479K82497k95022m0066N36296n41937K78143
$$ plain form
16874 1938840 1708890 1928837 1595962 1658631 2038303 2287908 2050826 1416359 2257638 2475868
16864 2475868 1636581 2173574 1869500 2153802 1864545 1676192 1804526 2581621 1790440
16855 1790440 2065980 1759834 2044447 1744520 1754908 1431459 2061154 1955212 1848011 1647295
16845 1647295 1362781 1733573 1555954 1855600 1956799 1523868 1322382 2026118 1493224
16836 1493224 1726646 1637733 1527409 1690997 1864482 1819447 2010409 1891527 2212885 1606751
16826 1606751 1921160 1647392 2179645 1993997 1588598 1404642 1804258 1923174 1873743 2465972
16816 2465972 2162646 2363528 2275500 2475717 2322835 2139937 2074319 1792050 2281863 2415521
16806 2415521 1917152 2499411 2341599 2209520 2192584 2387222 2284306 2164045 1887261 2078741
$$ packed form
16874A938840k29950K19947l32875O2669L79672K49605k37082o34467Q41279K18230
16864B475868q39287N36993l04074K84302k89257j88353J28334P77095p91181
16855A790440K75540l06146K84613k99927J0388l23449O29695j05942j07201k00716
16845A647295k84514L70792j77619K99646J01199m32931k01486P03736n32894
16836A493224K33422q8913j10324J63588J73485m5035J90962j18882L21358o06134
16826A606751L14409k73768N32253j85648m05399j83956L99616J18916m9431N92229
16816B465972l03326K00882q8028K00217j52882j82898o5618k82269M89813J33658
16806B415521m98369N82259j57812j32079j6936J94638j02916j20261k76784J91480
$$ plain form
16796 2078741 1868877 1530056 1466955 2074914 1497535 1777623 1481696 1657782 1252512 1246954
16786 1246954 1587803 1734879 1385534 1306850 1382842 1187728 671180 1413238 859831 1115023
16776 1115023 1144491 1584549 1505306 1494255 1692269 1373257 999503 1681223 1598347 1722168
16766 1722168 1859780 1590745 1811099 1458844 2267545 1295633 1706076 1587155 1688839
16757 1688839 1891863 1838226 1826272 1225221 1585163 1794474 1702082 1673719 1561543 1421221
16747 1421221 1419311 1662944 1004161 1761911 1752301 1711203 1706525 1477682 1623438 1581915 1945797
16736 1945797 1734004 2038842 1330623 1425902 1892196 2057159 1696801 1956400 1972863 1451771
16726 1451771 1522312 1841756 1692093 1806104 2019521 2301198 2038711 2263792 1827933 1945788
$$ packed form
16796B078741k09864l38821o3101O07959n77379K80088k95927J76086m05270n558
16786A246954L40849J47076l49345p8684P5992j95114n16548P42058n53407K55192
16776A115023K9468M40058p9243j1051J98014l19012l73754O81720q2876J23821
16766A722168J37612k69035K20354l52255Q08701r71912M10443j18921J01684
16757A688839K03024n3637j1954o01051L59942K09311r2392k8363j12176j40322
16747A421221j910K43633o58783P57750r610m1098m678k28843J45756m1523L63882
16736A945797k11793L04838p08219R5279M66294J64963l60358K59599J6463n21092
16726A451771P0541L19444j49663J14011K13417K81677k62487K25081m35859J17855
$$ plain form
16716 1945788 1926024 1968417 2404318 2105048 1903410 2115621 2355605 2419259 2499422 2304496
16706 2304496 2735343 3251757 3579213 3568338 3595660 3938835 3701226 3965357 3891096 3785044
16696 3785044 3661835 3112000 2943284 3654396 3619022 3491070 3616887 3689818 3617392 3304056
16686 3304056 3992430 3992451 3956496 3805478 3400610 2936305 2913580 3099283 2453861 2379853 2598983
16675 2598983 2568686 2600138 2214222 2475510 2705782 2832241 3220128 3918457 3893542 4572320
16665 4572320 4169611 4054475 3791987 3981630 3545495 3722974 4048770 3585526 3856348
16656 3856348 4008826 3988711 4153383 4028249 4456334 3734327 3491731 3672079 3130063 2867270
16646 2867270 2391081 2558809 1803201 1651987 2027098 2055049 1421992 1638803 1143886 1701040
$$ packed form
16716A945788j9764M2393M35901k99270k01638K12211K39984O3654Q0163j94926
16706B304496M30847N16414L27456j0875K7322L43175k37609K64131p4261j06052
16696C785044j23209n49835j68716P11112l5374j27952J25817P2931p2426l13336
16686C304056O88374K1l5955j51018m04868m64305k2725J85703o45422p4008K19130
16675B598983l0297L1452l85916K61288K30272J26459L87887O98329k4915O78778
16665D572320m02709j15136k62488J89643m36135J77479L25796m63244K70822
16656C856348J52478k0115J64672j25134M28085p22007k42596J80348n42016k62793
16646B867270m76189J67728p55608j51214L75111K7951o33057K16811m94917N57154
$$ plain form
16636 1701040 1739293 1269753 1226356 1425662 1514456 1681442 1644173 1326157 1237829 1555986
16626 1555986 1208652 1301556 1306519 1331391 1120016 828225 1428988 1244151 1225410 734537
16616 734537 1697726 1633026 1622730 1590715 1580825 1892308 1779821 1492895 2124068 1720725
16606 1720725 1492289 2039837 1483056 1888474 1703647 1626497 1758755 2226835 2057759 1738493
16596 1738493 1935248 1802400 1810136 1663823 1701158 1798764 2168833 1928391 1816551 1913861
16586 1913861 1548650 1143442 1842500 1245740 1359776 1283314 1341287 1243500 1582737 1584199
16576 1584199 1307414 1378209 1279267 1458775 979141 1658280 1685843 1168471 1205296 1482167
16566 1482167 1240020 1879773 908942 1694826 1522263 1369047 1092846 1094958 1189816 830342
$$ packed form
16636A701040L8253m69540m3397J99306Q8794J66986l7269l18016q8328L18157
16626A555986l47334R2904M963K4872k11375k91791O00763j84837j8741m90873
16616G34537R63189o4700j0296l2015r890L11483j12487k86926O31173m03343
16606A720725k28436N47548n56781M05418j84827p7150J32258M68080j69076l19266
16596A738493J96755j32848P736j46313L7335R7606L70069k40442j11840R7310
16586A913861l65211m05208O99058n96760J14036p6462N7973r7787L39237J462
16576A584199k76785P0795r8942J79508m79634O79139K7563n17372L6825K76871
16566A482167k42147O39753I08942P85884j72563j53216k76201K112R4858l59474
$$ plain form
16556 830342 942983 731285 1080152 321976 611898 577359 455776 282686 410242 696290
16546 696290 120336 331340 1030646 735553 855051 1117430 1030528 659977 977234 1135339
16536 1135339 965979 550456 658299 728735 782969 471129 564083 -32709 404764 317043
16526 317043 474703 690710 348036 839734 585398 763078 541503 1231957 653761 693848
16516 693848 1217300 591637 1298053 777017 880405 498836 479721 825525 755253 655471
16506 655471 784137 1444468 1321325 1343272 1227094 1719940 1854138 1510910 1944533 1531390
16496 1531390 1762316 1796443 1944466 2038106 2381018 1901857 1738353 2444675 2222258 1698435
16486 1698435 1781009 1516993 2110192 2186739 1983635 2293967 1965930 1738391 2115811 2082774
$$ packed form
16556H30342J12641k11698L48867C21976K89922l4539j21583j73090J27556K86048
16546F96290A20336K11004O99306k95093J19498K62379q6902l70551L17257J58105
16536A135339j69360m15523J07843P0436N4234l11840R2954c2709D04764q7721
16526C17043J57660K16007l42674M91698k54336J77680k21575O90454n78196M0087
16516F93848N23452E91637P06416n21036J03388l81569j9115L45804p0272r9782
16506F55471J28666O60331j23143K1947j16178M92846J34198l43228M33623m13143
16496A531390K30926L4127J48023R3640L42912m79161j63504P06322k22417n23823
16486A698435Q2574k64016N93199P6547k03104L10332l28037k27539L77420l3037
$$ plain form
16476 2082774 2198488 2270974 1960610 1886615 2171717 2583332 2435227 2487437 2342184 2715965
16466 2715965 2500756 2612358 2341791 2205141 2914454 3105794 3616005 3181675 3322589
16457 3322589 3594355 3611463 3498027 3448631 3972524 3767245 3832892 3982080 3621536 4192359
16447 4192359 3961684 4099142 4165499 4115787 5493347 5415427 5683108 6626967 7039588 7327858
16437 7327858 7153147 7813418 7566367 7709944 7053387 7123147 7358436 7047918 7044685 7858790
16427 7858790 9205313 10891162 12721117 15360873 18397942 21112459 24427639 27011286
16419 27011286 30371925 33507416 36849061 40236263 43594900 46849802 50672839 55254732
16411 55254732 61068389 66665918 72672947 78399792 84134721 90110711 95958234 102405585
$$ packed form
16476B082774J15714P2486l10364p3995K85102M11615j48105N2210j45253L73781
16466B715965k15209J11602k70567j36650P09313J91340N10211m34330J40914
16457C322589K71766J7108j13436m9396N23893k05279O5647J49188l60544N70823
16447D192359k30675J37458O6357m9712J377560p7920K67681R43859M12621K88270
16437G327858j74711O60271k47051J43577o56557O9760K35289l10518l233Q14105
16427G858790J346523J685849J829955K639756L037069K714517L315180K583647
16419B7011286L360639L135491L341645L387202L358637L254902L823037M581893
16411E5254732N813657N597529O007029N726845N734929N975990N847523O447351
$$ plain form
16403 102405585 109401400 115568275 122036736 127977499 132471862 133515625 132080366 128271464
16395 128271464 123330622 118519726 115507224 117796330 130330627 150105423 168472169
16388 168472169 176553177 175713769 169136833 158396826 142849724 126631409 115256835
16381 115256835 107836571 98777460 76731307 38425215 -11042121 -56718545 -81613335
16374 -81613335 -81585401 -67122892 -48451900 -31080642 -17976621 -8848817 -3287881 132078
16365 2055871 2308975 2923864 2951056 3590758 4084850 4229766 4122598 4065544 3185008 2728881
16355 2728881 3065472 2291467 1766244 1896896 1824025 1368202 1076313 1230973 1210787 1149840
16345 1149840 1246024 1964013 2473849 3367304 3617368 3609041 4010279 3422158 2880891 2763664
$$ packed form
16403A02405585O995815O166875O468461N940763M494363J043763j435259l808902
16395A28271464m940842m810896l012502K289106J2534297J9774796J8366746
16388A68472169Q081008q39408o576936j0740007j5547102j6218315j1374574
16381A15256835p420264r059111k2046153l8306092a1042121m5676424k4894790
16374h1613335K7934J4462509J8670992J7371258J3104021h848817c287881A32078
16365B055871K53104O14889K7192O39702M94092J44916j07168n7054q80536m56127
16355B728881L36591p74005n25223J30652p2871m55823k91889J54660k0186o0947
16345A149840R6184P17989N09836Q93455K50064q327M01238n88121n41267j17227
$$ plain form
16335 2763664 2216042 1837670 879791 299258 -133374 -372334 -533328 -627717 -61549 -233140
16325 -233140 -75766 -35832 351908 718117 257009 712673 321260 697091 604968 127185
16314 646737 1021237 524320 834034 570629 795707 1344876 925041 1630667 1488907 1288596
16304 1288596 1507162 1849885 1361155 1494136 1325702 1602370 1367800 1570773 1778009
16295 1778009 1848311 2006060 1857187 1350992 2025416 1848590 1336514 1913301 1244423 1317689
16285 1317689 1449721 1677042 1343439 1251126 1131862 1209934 861668 915855 1312491 1242186
16275 1242186 1332772 2159039 1718092 2379284 3047640 3140496 3388801 3093310 2740299 3151977
16265 3151977 2566373 2050930 2547374 2238164 1935536 1656295 1634261 1720565 1400950 1634732
$$ packed form
16335B763664n47622l78372H79791B99258a33374k38960j60994r4389f1549j71591
16325b33140g5766c5832C51908L66209B57009M55664C21260L75831r2123A27185
16314F46737L74500m96917L09714k63405K25078N49169m19835P05626j41760k00311
16304A288596K18566L42723m88730J32981j68434K76668k34570K02973K07236
16295A778009P0302J57749j48873n06195O74424j76826n12076N76787o68878P3266
16285A317689J32032K27321l33603r2313j19264P8072l48266N4187L96636p0305
16275A242186R0586Q26267m40947O61192O68356R2856K48305k95491l53011M11678
16265C151977n85604n15443M96444l09210l02628k79241k2034Q6304l19615K33782
$$ plain form
16255 1634732 1448092 1590614 1368686 1615012 1373219 1832196 1749722 1901243 1791686 2063388
16245 2063388 1809410 1921959 2479341 2444205 2884085 2835031 2909984 2970907 3014028 2655943
16235 2655943 2483443 1921504 1838532 1674173 1402863 1492562 1610455 1505772 1268418 1482473
16225 1482473 1013583 1776819 1395902 2085165 1685320 1632735 1409037 1276209 1621395 1500168
16215 1500168 1548241 1565698 1371695 1452454 1758870 1487256 1280164 767778 1329878 1182350
16205 1182350 1409283 1486206 1584881 1608130 1313768 1451831 1781028 1356657 1431418 1659974
16195 1659974 1631769 1588153 1198450 1322140 1688917 1312450 1943363 2248819 1580929 2171909
16185 2171909 1978043 1811045 1768108 2049746 2142199 2018648 2052946 1872188 1988659 2269466
$$ packed form
16255A634732j86640J42522k21928K46326k41793M58977q2474J51521j09557K71702
16245B063388k53978J12549N57382l5136M39880m9054P4953O0923M3121l58085
16235B655943j72500n61939q2972j64359k71310Q9699J17893j04683k37354K14055
16225A482473m68890P63236l80917O89263l99845n2585k23698j32828L45186j21227
16215A500168M8073J7457j94003Q0759L06416k71614k07092n12386N62100j47528
16205A182350K26933P6923R8675K3249k94362J38063L29197m24371P4761K28556
16195A659974k8205m3616l89703J23690L66777l76467O30913L05456o67890N90980
16185B171909j93866j66998m2937K81638R2453j23551L4298j80758J16471K80807
$$ plain form
16175 2269466 1915615 2321032 2326322 2217626 2049863 1905343 1699502 2131415 2104126 1973809
16165 1973809 1946478 1894141 2155569 1971979 1449296 1993146 1530082 1554942 1510869 1256154
16155 1256154 2223605 1818410 1944750 1731846 1707792 2064536 1750904 1795962 1695238 2189746
16145 2189746 1719577 1776434 2432793 2556277 2425727 1917102 2333540 2219023 2087479 1525892
16135 1525892 2073325 1553674 1787657 1939117 1400496 1578443 1563710 2032303 1658100 1978196
16125 1978196 1909698 1834357 1546973 1984628 1964265 1911162 2332660 2035826 1786704 1914966
16115 1914966 1576950 1662902 1582775 1958939 1781479 2000303 2001855 1644279 1768099 1693471
16105 1693471 1672846 1930641 1912386 1561640 1869006 2113239 1780136 1686599 1954177 2102582
$$ packed form
16175B269466l53851M05417N290j08696j67763j44520k05841M31913k7289j30317
16165A973809k7331n2337K61428j83590n22683N43850m63064K4860m4073k54715
16155A256154R67451m05195J26340k12904k4054L56744l13632M5058j00724M94508
16145B189746m70169N6857O56359J23484j30550n08625M16438j14517j31544n61587
16135A525892N47433n19651K33983J51460n38621J77947j4733M68593l74203L20096
16125A978196o8498p5341k87384M37655k0363n3103M21498k96834k49122J28262
16115A914966l38016Q5952q0127L76164j77460K18824J552l57576J23820p4628
16105A693471k0625K57795j8255l50746L07366K44233l33103r3537K67578J48405
$$ plain form
16095 2102582 2100651 2216970 1697282 1997541 2443782 1903050 2041760 2144589 2144713 2443147
16085 2443147 1891432 2239134 2115160 1954537 1891165 2446840 2500814 2312547 2292928 2059141
16075 2059141 2647688 2086156 2158239 2602074 2489206 2436132 2737930 2624054 2493883 2390486
16065 2390486 3100344 2687887 2827139 3127182 2840168 2697072 2605937 3260951 2761889 3174029
16055 3174029 2394018 3300665 2604793 3139171 2855784 3044180 2630469 3163425 3106919 3143255
16045 3143255 3191189 2792341 3285168 3196665 3219062 2866704 3292936 2572717 3246959 2561115
16035 2561115 3958077 3087899 2891272 3168852 3630136 3517935 3878778 4050255 3542769
16026 3542769 4118329 3747752 3449173 3570485 3519382 3644622 3842959 3978968 4326458 4353031
$$ packed form
16095B102582j931J16319n19688L00259M46241n40732J38710J02829J24K98434
16085B443147n51715L47702j23974j60623o3372N55675N3974j88267j9619k33787
16075B059141N88547n61532P2083M43835j12868n3074L01798j13876j30171j03397
16065B390486P09858m12457J39252L00043k87014j43096r1135O55014m99062M12140
16055C174029p80011R06647o95872N34378k83387J88396m13711N32956n6506L6336
16045C143255M7934l98848M92827q8503K2397l52358M26232p20219O74242o85844
16035B561115J396962q70178j96627K77580M61284j12201L60843J71477n07486
16026C542769N75560l70577k98579J21312n1103J25240J98337J36009L47490K6573
$$ plain form
16016 4353031 3729496 4342410 4019652 3831236 4268415 4422921 4543382 4022012 4186899
16007 4186899 4487042 4432199 4435983 4253826 4147068 4659201 4170527 4546991 4491230 4027906
15997 4027906 4533130 4418393 4550902 4760531 4596823 4112461 4245918 4532665 4049169
15988 4049169 4337403 4332143 4461771 4378953 4711136 4635973 4609656 4695801 4655498 4724496 4745871
15977 4745871 4623328 4915571 5027041 4627962 4570706 4994887 4857509 4866333 4532785 4321899
15967 4321899 4711388 4539290 4451650 4170530 4327760 4325689 4423222 4525919 4561877 4286256
15957 4286256 4731539 4444432 4394839 4404408 4260501 4461237 4966687 4791380 4962459 4586393
15947 4586393 4876263 4641067 4675858 4507813 4714686 4951172 5070265 4604882 4911946 5082943
$$ packed form
16016D353031o23535O12914l22758j88416M37179J54506J20461n21370J64887
16007D186899L00143n4843L784j82157j06758N12133m88674L76464n5761m63324
15997D027906N05224j14737J32509K09629j63708m84362J33457K86747m83496
15988D049169K88234n260J29628q2818L32183p5163k6317Q6145m0303O8998K1375
15977D745871j22543K92243J11470l99079n7256M24181j37378Q824l33548k10886
15967D321899L89489j72098q7640k81120J57230k071R7533J02697L5958k75621
15957D286256M45283k87107m9593R569j43907K00736N05450j75307J71079l76066
15947D586393K89870k35196L4791j68045K06873K36486J19093m65383L07064J70997
$$ plain form
15937 5082943 4754505 4673457 4946403 5194838 4969062 5128914 5129561 5469672 5110246 5052759
15927 5052759 5433083 5307129 5742028 6114508 6484745 5933162 6427310 6181952 6663576
15918 6663576 6617447 7042379 7750242 7497332 8177526 8530694 9200385 9544009 11055600
15909 11055600 12277357 13623859 16093641 19293838 23695674 30764319 40128983 52148534
15901 52148534 67197098 81591409 95059035 106332192 113537776 118020651 117478043 113227377
15893 113227377 105050563 93166653 79043280 63887345 50379353 39366603 30555354
15886 30555354 24261923 19317045 15994582 13276304 11609290 10312131 9098640 8522866
15878 8522866 7570394 6952138 6874477 6662674 6130622 6091058 6130939 5654144 5791280 5656317
$$ packed form
15937E082943l28438q1048K72946K48435k25776J59852O47L40111l59426n7487
15927E052759L80324j25954M34899L72480L70237n51583M94148k45358M81624
15918F663576m6129M24932P07863k52910O80194L53168O69691L43624J511591
15909A1055600J221757J346502K469782L200197M401836P068645R364664J2019551
15901E2148534J5048564J4394311J3467626J1273157P205584M482875n42608m250666
15893A13227377q176814j1883910j4123373j5155935j3507992j1012750q811249
15886C0555354o293431m944878l322463k718278j667014j297159j213491n75774
15878H522866r52472o18256p7661k11803n32052l9564L9881m76795J37136j34963
$$ plain form
15868 5656317 5597605 5478926 5464673 5150281 5272152 4536725 4110329 4887007 5021660 4587160
15858 4587160 4516487 4294059 4520700 4788539 4421051 4398170 4401299 4004273 4050729 4879078
15848 4879078 4244787 4312388 4053098 3959091 4151233 4538582 4357454 4019654 4157897 4427111
15838 4427111 4265135 4518933 4380907 4630146 4649483 4525477 5233401 4379117 4899203 4799602
15828 4799602 4450065 4484285 4366918 4482190 4407655 4754179 4329474 4549746 4385565 4214354
15818 4214354 4341013 4476412 4469161 4576400 4492370 4717286 4845111 5020372 4750311 4901765
15808 4901765 5124085 4925303 5187917 5126696 4765303 5567260 5116305 5915673 5734501 5775393
15798 5775393 6457429 6606809 6916722 7251695 6961181 7808228 7408075 7431273 7562331 7541138
$$ packed form
15868E656317n8712j18679j4253l14392J21871p35427m26396P76678J34653m34500
15858D587160p0673k22428K26641K67839l67488k2881L129l97026M6456Q28349
15848D879078o34291O7601k59290r4007J92142L87349j81128l37800J38243K69214
15838D427111j61976K53798j38026K49239J9337j24006P07924q54284N20086r9601
15828D799602l49537L4220j17367J15272p4535L46524m24705K20272j64181j71211
15818D214354J26659J35399p251J07239q4030K24916J27825J75261k70061J51454
15808D901765K22320j98782K62614o1221l61393Q01957m50955P99368j81172M0892
15798E775393O82036J49380L09913L34973k90514Q47047m00153K3198J31058k1193
$$ plain form
15788 7541138 7643748 7600319 7942926 8105500 8992034 9282775 9366581 9863602 10295327 10069851
15778 10069851 11375359 10804646 10686635 10310792 10479834 10467220 10535725 10339601 10656710
15769 10656710 10129139 10482285 10515768 10940692 11405154 11124149 11652015 11659859 11270786 11243782
15759 11243782 11465330 11227676 10910460 11162614 10719107 10486520 10255966 10261442 10141871 10289037
15749 10289037 10409107 10543272 10757624 9985336 10363819 10513537 11931525 12259268 12683770
15740 12683770 13203234 13482792 13911929 14209774 14542546 14052184 14252767 13929831 14125053
15731 14125053 14475642 14979716 15149513 15495827 15434027 15569802 15795495 15306981 14917288
15722 14917288 14604822 14452922 13572556 13245050 13322000 13470775 13491291 13391871 13002801 13253316
$$ packed form
15788G541138J02610m3429L42607J62574Q86534K90741Q3806M97021M31725k25476
15778A0069851J305508n70713j18011l75843J69042j2614O8505j96124L17109
15769A0656710n27571L53146L3483M24924M64462k81005N27866P844l89073k7004
15759A1243782K21548k37654l17216K52154m43507k32587k30554N476j19571J47166
15749A0289037J20070J34165K14352p72288L78483J49718J417988L27743M24502
15740A2683770N19464K79558M29137K97845L32772m90362K00583l22936J95222
15731A4125053L50589N04074J69797L46314o1800J35775K25693m88514l89693
15722A4917288l12466j51900q80366l27506P6950J48775K0516r9420l89070K50515
$$ plain form
15712 13253316 12662286 12853684 12214739 11894250 11889149 11886579 11990738 12124979 13132042 13685762
15702 13685762 14161438 14444512 14777788 15041581 14827976 14849143 14946265 14870790 14742790 14265016
15692 14265016 13882200 14146638 13869328 14092561 13975542 13124418 13076716 13156452 12950623 12690039
15682 12690039 12373599 12047595 12418151 11857269 11733654 11460729 10954872 11257372 11006603
15673 11006603 10633651 10717792 10830752 10742584 10985617 11121742 11681309 12218961 12720193 13235933
15663 13235933 14642828 15130124 16358235 17178570 18219347 19671979 20425200 21445099
15655 21445099 22884516 24427896 25706933 26809625 28443949 29518526 30757509 31820473
15647 31820473 33189627 34172824 35216315 36145729 37362849 39215551 41226332 43122648
$$ packed form
15712A3253316n91030J91398o38945l20489n101k570J04159J34241J007063N53720
15702A3685762M75676K83074L33276K63793k13605K1167R7122p5475j28000m77774
15692A4265016l82816K64438k77310K23233j17019q51124m7702P9736k05829k60584
15682A2690039l16440l26004L70556n60882j23615k72925n05857L02500k50769
15673A1006603l72952Q4141J12960q8168K43033J36125N59567N37652N01232N15740
15663A3235933J406895M87296J228111Q20335J040777J452632P53221J019899
15655B1445099J439417J543380J279037J102692J634324J074577J238983J062964
15647C1820473J369154R83197J043491R29414J217120J852702K010781J896316
$$ plain form
15639 43122648 44971325 46539584 47294783 48985063 49119537 49817667 48881781 47924885 47669239
15630 47669239 46966477 46592291 47020662 46392768 46364260 46445056 45832007 45080516 43531228
15621 43531228 42472819 40515458 38530468 36118046 34176248 32254727 30273771 29422017
15613 29422017 27775886 26456941 25896210 25092052 24076413 22785746 22256681 21753168 21354985
15604 21354985 20016969 18937695 19128399 18809077 18343996 18083585 18163350 18111379 18162737
15595 18162737 18891250 19754311 21602473 25914195 35278473 52245791 71557597 86998664
15587 86998664 97268932 104326592 107908225 108596050 105716446 99472803 87792338 70678892
15579 70678892 52650139 37360929 28652160 23385199 19912132 17550400 15708080 15488759
$$ packed form
15639D3122648J848677J568259P55199J690280J34474O98130r35886r56896k55646
15630D7669239p02762l74186M28371o27894k8508Q0796o13049p51491j549288
15621D3531228j058409j957361j984990k412422j941798j921521j980956q51754
15613B9422017j646131j318945n60731q04158j015639j290667n29065n03513l98183
15604B1354985j338016j079274J90704l19322m65081k60411P9765n1971N1358
15595A8162737P28513Q63061J848162M311722R364278J6967318J9311806J5441067
15587H6998664J0270268P057660L581633O87825k879604o243643j1680465j7113446
15579G0678892j8028753j5289210q708769n266961l473067k361732j842320k19321
$$ plain form
15571 15488759 14912750 14941065 14713780 14668953 14950587 14260013 14942006 15053008 15699102 15517671
15561 15517671 16028312 16999388 18655036 21591017 27838318 42083444 66721536 92541482
15553 92541482 110457746 123518070 130938673 134718526 134537028 129855683 119037668 102626116
15545 102626116 79250228 55629325 37925989 27123530 22043567 18080551 15803127
15538 15803127 13498046 12145023 11997258 10978608 11128403 11041670 11165481 10528246 10377374
15529 10377374 10985033 10221720 10442181 10154739 10212232 9547068 9419132 9325990 8817920 8885755
15519 8885755 9326446 9391776 9306188 9021276 9778061 9810112 9756277 10062311 9582724 10197584
15509 10197584 10646072 10319297 11068765 10636832 10451065 10647585 10243586 10186763 10108766 9594258
$$ packed form
15571A5488759n76009K8315k27285m4827K81634o90574O81993J11002O46094j81431
15561A5517671N10641R71076J655648K935981O247301J4245126K4638092K5819946
15553I2541482J7916264J3060324P420603L779853j81498m681345j0818015j6411552
15545A02626116k3375888k3620903j7703336j0802459n079963l963016k277424
15538A5803127k305081j353023j47765j018650J49795q6733J23811o37235j50872
15529A0377374O07659p63313K20461k87442N7493o65164j27936r3142n08070O7835
15519H885755M40691O5330q5588k84912P56785L2051n3835L06034m79587O14860
15509A0197584M48488l26775P49468m31933j85767J96520m03999n6823p7997n14508
$$ plain form
15499 9594258 9912379 9586832 9920181 9622983 9917904 10086639 9836365 10486479 10455470 10556596
15489 10556596 10494318 11065612 11269942 11171261 11561026 11646512 11806082 12047357 11902078 12066300
15479 12066300 12418168 12176797 12551216 12646940 12163781 12861545 13419743 14154070 15449842
15470 15449842 16839654 17765476 18890088 19808395 20352030 19932209 20336030 19849451 19157853
15461 19157853 18421619 17904662 17616742 17732017 18150008 18815868 20140299 21308335 21492459
15452 21492459 22705371 23000694 22913558 22627441 22199147 21577319 20670324 20066678 19278073
15443 19278073 19274256 19099125 19378604 19435655 19766041 20179085 20393388 19925818 20111992 20233926
15433 20233926 19247711 18842451 18807382 17700774 17212893 16858516 15910908 15493952 15407618
$$ packed form
15499I594258L18121l25547L33349k97198K94921J68735k50274O50114l1009J01126
15489A0556596o2278N71294K04330r8681L89765Q5486J59570K41275j45279J64222
15479A2066300L51868k41371L74419R5724m83159O97764N58198P34327J295772
15470A5449842J389812R25822J124612R18307N43635m19821M03821m86579o91598
15461A9157853p36234n16957k87920J15275M17991O65860J324431J168036J84124
15452B1492459J212912K95323q7136k86117m28294o21828r06995o03646p88605
15443A9278073l817j75131K79479N7051L30386M13044K14303m67570J86174J21934
15433B0233926r86215m05260l5069j106608m87881l54377r47608m16956q6334
$$ plain form
15424 15407618 15220210 14958954 14173865 14028823 13853383 13775313 13316761 13253692 12808084 13002250
15414 13002250 12803437 12481506 12598257 12822440 12680536 13042121 12855118 12787155 12550840
15405 12550840 12862214 13023627 13496095 13953238 13803038 14341409 14482528 14655649 14871156
15396 14871156 14990276 15447339 14925200 14795714 13808324 13923869 13006636 13007398 13275314 12899776
15386 12899776 13212503 12675961 12199007 12580329 12729020 12550986 12621358 12369548 12892392
15377 12892392 12602744 11504961 11847855 11985961 11979267 11847705 11971066 12176758 12478309
15368 12478309 12781163 12992708 12923104 13206362 13406581 13640897 13820778 13409038 14034249
15359 14034249 13663184 13732770 14137306 14557770 14637212 15091783 15796551 16596520 18483103
$$ packed form
15424A5407618j87408k61256p85089j45042j75440p8070m58552o3069m45608J94166
15414A3002250j98813l21931J16751K24183j41904L61585j87003o7963k36315
15405A2550840L11374J61413M72468M57143j50200N38371J41119J73121K15507
15396A4871156J19120M57063n22139j29486r87390J15545r17233P62K67916l75538
15386A2899776L12727n36542m76954L81322J48691j78034P0372k51810N22844
15377A2892392k89648j097783L42894J38106o694j31562J23361K05692L01551
15368A2478309L02854K11545o9604K83258K00219K34316J79881m11740O25211
15359A4034249l71065O9586M04536M20464P9442M54571P04768P99969J886583
$$ plain form
15350 18483103 20100982 24963985 32562775 43957928 54457428 62061794 67781495 70792390
15342 70792390 72924575 72303066 69820990 65285212 57941343 49432803 41255223 35924580
15334 35924580 32394445 31422730 29567924 29518226 28265415 27053636 26277663 25096068 24420501
15325 24420501 23922383 24575957 24705628 24670631 25510328 25856886 26320906 27915010 29921919
15316 29921919 35558085 45256784 61097409 78922772 96412743 109154243 118215348
15309 118215348 122873304 123626866 120235617 113135353 100393822 83771605 65956851 50133041
15301 50133041 38255036 31430448 26885126 25026531 23177314 22070618 21876053 21633755
15293 21633755 21860026 22568454 22575021 23360597 23387728 23784719 24135974 24444178 24037597 24496955
$$ packed form
15350A8483103J617879M863003P598790J1395153J0499500P604366N719701L010895
15342G0792390K132185o21509k482076m535778p343869q508540q177580n330643
15334C5924580l530135r71715j854806m9698j252811j211779p75973j181595o75567
15325B4420501m98118O53574J29671l4997Q39697L46558M64020J594104K006909
15316B9921919N636166R698699J5840625J7825363J7489971J2741500R061105
15309A18215348M657956P53562l391249p100264j2741531j6622217j7814754j5823810
15301E0133041j1878005o824588m545322j858595j849217j106696j94565k42298
15293B1633755K26271P08428O567P85576K7131L96991L51255L08204m06581M59358
$$ plain form
15283 24496955 24886367 26752185 30658825 37647610 48103132 56514541 62008280 66506110
15275 66506110 68704112 69271674 68526588 65031059 59830240 51242278 41641970 33400555
15267 33400555 27890836 24588688 22152759 21599637 20053617 19178889 18252587 18155632 17970336
15258 17970336 18234252 18535610 18246817 18590134 18901288 19359113 19450204 19878528 20768969
15249 20768969 20566282 20381584 20283194 19874080 19435944 19463803 19179598 19175690 19063211 19150342
15239 19150342 20448604 21130999 22142847 23472817 25468871 26032269 26996204 28168681
15231 28168681 27005590 26995151 26301460 25299891 24353883 23579056 22239641 21821294 21404173
15222 21404173 20995319 20719216 21056264 21182325 21632796 22071782 22102716 22300378 22457654
$$ packed form
15283B4496955L89412J865818L906640O988785J0455522Q411409N493739M497830
15275F6506110K198002N67562p45086l495529n200819q587962r600308q241415
15267C3400555n509719l302148k435929n53122j546020q74728r26302r6955j85296
15258A7970336K63916L01358k88793L43317L11154M57825R1091M28324Q90441
15249B0768969k02687j84698r8390m09114m38136K7859k84205l908j12479Q7131
15239A9150342J298262O82395J011848J329970J996054N63398R63935J172477
15231B8168681j163091j0439o93691j001569r46008p74827j339415m18347m17121
15222B1404173m08854k76103L37048J26061M50471M38986L0934J97662J57276
$$ plain form
15213 22457654 22047589 22251850 21760221 21392005 20293792 19482112 18238470 16779768 16110200
15204 16110200 14975622 14001295 13343955 12715476 12348458 12177924 11487769 11807079 11716656
15195 11716656 12108538 12589096 12868678 14028066 13248624 14139814 14019769 14114374 14274520
15186 14274520 14161105 14598518 14560021 15206025 15036381 15383711 15789935 16433078 16721776
15177 16721776 16534412 16995858 17077310 17637027 17333246 17578824 17176639 17286759 16856883
15168 16856883 16805281 16586346 16967594 16653064 16630357 16247775 16396791 16817310 16959463 16567081
15158 16567081 16869142 16817267 16627552 16827780 16561095 17054477 16246761 16321932 16232165 16314671
15148 16314671 16033642 16060060 15741297 15609668 15663778 15693622 16289931 15826829 16910037 17093620
$$ packed form
15213B2457654m10065K04261m91629l68216j098213q11680j243642j458702o69568
15204A6110200j134578r74327o57340o28479l67018j70534o90155L19310r0423
15195A1716656L91882M80558K79582J159388p79442Q91190j20045R4605J60146
15186A4274520j13415M37413l8497O46004j69644L47330M06224O43143K88698
15177A6721776j87364M61446Q1452N59717l03781K45578m02185J10120m29876
15168A6856883n1602k18935L81248l14530k2707l82582J49016M20519J42153l92382
15158A6567081L02061n1875j89715K00228k66685M93382q07716P5171q9767Q2506
15148A6314671k81029K6418l18763j31629N4110K9844N96309m63102J083208J83583
$$ plain form
15138 17093620 17043009 17404324 17122227 17587247 16775511 17898861 17196354 16947395 17031098
15129 17031098 16925989 16889699 17245347 16833810 16560103 16555708 16482823 16151134 16193889 15687333
15119 15687333 15922962 15432332 15801274 15025770 15297385 14890956 15004801 15076341 14681276
15110 14681276 14589287 15100738 15003946 14726204 15279164 15323194 15640911 15682700 15953366 16539243
15100 16539243 16499059 17169062 18046834 18650326 19453829 19931740 20674331 21915634 24631630
15091 24631630 27125398 31855424 36137958 39927748 42306161 44166140 45081529 44887273
15083 44887273 44425381 43068782 40811287 38291469 35963472 34625202 35373905 38422132
15075 38422132 42377456 46589999 49349229 52184337 53147988 53201537 53332280 52492315 51142486
$$ packed form
15138A7093620n0611L61315k82097M65020q11736J123350p02507k48959Q3703
15129A7031098j05109l6290L55648m11537k73707m395p2885l31689M2755n06556
15119A5687333K35629m90630L68942p75504K71615m06429J13845P1540l95065
15110A4681276r1989N11451r6792k77742N52960M4030L17717M1789K70666N85877
15100A6539243m0184O70003Q77772O03492Q03503M77911P42591J241303K715996
15091B4631630K493768M730026M282534L789790K378413J859979R15389j94256
15083D4887273m61892j356599k257495k519818k327997j338270P48703L048227
15075C8422132L955324M212543K759230K835108R63651N3549J30743q39965j349829
$$ plain form
15066 51142486 49468227 50064801 53875286 58736869 63014477 66839205 69510610 72868074
15058 72868074 76178087 79172013 81444772 82021961 80121909 79016629 79218012 81625197
15050 81625197 86141058 90398003 93580437 94773733 94530337 94331863 95187808 95913038 95391013
15041 95391013 93385861 90531412 85808917 81391628 77417756 74704810 70738307 66303224
15033 66303224 62109742 59628966 59581895 61278887 63225162 64467579 65745307 65974791
15025 65974791 66054263 65505513 64888340 62957733 61066420 59268178 59703464 63596805 69988394
15016 69988394 78085110 86203957 93796240 101152160 106286958 111246016 113631915 115402876
15008 115402876 114273322 112617432 109957106 109478868 110489257 114663243 121428904 129711537
$$ packed form
15066E1142486j674259N96574L810485M861583M277608L824728K671405L357464
15058G2868074L310013K993926K272759N77189j900052j105280K01383K407185
15050H1625197M515861M256945L182434J193296k43396j98474Q55945P25230n22025
15041I5391013k005152k854449m722495m417289l973872k712946l966503m435083
15033F6303224m193482k480776m7071J696992J946275J242417J277728K29484
15025F5974791P9472n48750o17173j930607j891313j798242M35286L893341O391589
15016F9988394Q096716Q118847P592283P355920N134798M959058K385899J770961
15008A15402876j129554j655890k660326m78238J010389M173986O765661Q282633
$$ plain form
15000 129711537 139153776 148357681 157126929 163357622 166743605 168863576 167742231 164090341
14992 164090341 157420316 150917621 145258287 142419057 144586643 150050074 158220190 169011606
14984 169011606 182425420 198088061 214393108 230625191 245309452 256496796 263140259
14977 263140259 265701852 264899040 259646542 250041858 236685428 220494217 202368943 184314780
14969 184314780 166280496 150325420 136045891 123620617 113878826 104968910 97821148
14962 97821148 92804967 89472873 87734197 88856263 92218795 99221388 110033605 127227755
14954 127227755 151665050 181607410 215870931 255864499 299454355 343866526 387096599
14947 387096599 429949722 469207913 496208979 506340171 501690013 485436797 462557577
$$ packed form
15000A29711537R442239R203905Q769248O230693L385983K119971j121345l651890
14992A64090341o670025o502695n659334k839230K167586N463431Q170116J0791416
14984A69011606J3413814J5662641J6305047J6232083J4684261J1187344O643463
14977B63140259K561593q02812n252498r604684j3356430j6191211j8125274j8054163
14969A84314780j8034284j5955076j4279529j2425274r741791q909916p147762
14962I7821148n016181l332094j738676J122066L362532P002593J0812217J7194150
14954A27227755K4437295K9942360L4263521L9993568M3589856M4412171M3230073
14947C87096599M2853123L9258191K7001066J0131192m650158j6253216k2879220
$$ plain form
14940 462557577 434694681 403631381 370330347 334059937 298083338 267189090 244952025
14933 244952025 229110778 218076836 205581352 191702081 176457966 161186242 148648081
14926 148648081 137753198 131539497 128382210 124929816 120664951 115880870 110450725 104461430
14918 104461430 97854662 90703138 82490266 73006071 61569591 51087871 43000533 37679654
14910 37679654 33908558 31506062 29884249 29123104 29172839 29415951 29998148 30556972 32592955
14901 32592955 34108368 36155783 38656256 43393530 49060833 57399853 64746547 69867200
14893 69867200 73961596 75340056 76419871 76548088 74632398 70497210 64525637 56716078
14885 56716078 49467284 44733965 42073612 39902942 38524132 37761455 36309280 35730585
$$ packed form
14940D62557577k7862896l1063300l3301034l6270410l5976599l0894248k2237065
14933B44952025j5841247j1033942j2495484j3879271j5244115j5271724j2538161
14926A48648081j0894883o213701l157287l452394m264865m784081n430145n989295
14918A04461430o606768p151524q212872r484195j1436480j0481720q087338n320879
14910C7679654l771096k402496j621813p61145M9735K43112N82197N58824K035983
14901C2592955J515413K047415K500473M737274N667303Q339020P346694N120653
14893F9867200M094396J378460J079815J28217j915690m135188n971573p809559
14885E6716078p248794m733319k660353k170670j378810p62677j452175n78695
$$ plain form
14877 35730585 36407867 37488981 38582636 39872211 40305090 40580971 41262347 41730748 42614017
14868 42614017 42820114 42837526 43219968 43030649 43778798 45364340 49221289 57032744 66612870
14859 66612870 79078359 92064574 105869064 118938896 129235481 134632749 136646782
14852 136646782 134019055 126636813 115821688 102460262 88700390 74782599 62277906
14845 62277906 52578505 45312197 41292431 37818451 36338609 35165028 34354222 33312863
14837 33312863 32130252 31446567 30525642 30098683 29787634 29232333 28518652 28653616 29024452
14828 29024452 29165755 29750166 30686781 31951057 34383787 37023063 43068544 53304382
14820 53304382 64279985 75953186 83761443 89467274 93132531 93135135 91599432 86405695
$$ packed form
14877C5730585O77282J081114J093655J289575M32879K75881O81376M68401Q83269
14868D2614017K06097J7412L82442j89319P48149J585542L856949P811455R580126
14859F6612870J2465489J2986215J3804490J3069832J0296585N397268K014033
14852A36646782k627727p382242j0815125j3361426j3759872j3917791j2504693
14845F2277906r699401p266308m019766l473980j479842j173581q10806j041359
14837C3312863j182611o83685r20925m26959l11049n55301p13681J34964L70836
14828B9024452J41303N84411R36615J264276K432730K639276O045481J0235838
14820E3304382J0975603J1673201P808257N705831L665257K604j535703n193737
$$ plain form
14812 86405695 78100802 67886293 55498813 44504242 35948168 30364936 27026589 25610358
14804 25610358 23779551 23258143 23181614 22866541 23532349 23455322 23980270 24089121 24019778 23781203
14794 23781203 23735913 23220905 23354114 22952234 22542474 21726237 22211212 21690182 21441546
14785 21441546 22101185 21707300 22247508 22803591 23339665 25084800 26256704 27082165 28314680
14776 28314680 28631167 29426555 29341787 28821871 28054826 26386378 25039554 23073920 21337944
14767 21337944 20625476 20108270 20018158 18936066 19353463 19300265 19289461 19496013 19470713 19730385
14757 19730385 20269556 20081242 20934336 21283593 23372520 24442227 25323153 26621290 27243965
14748 27243965 27526464 27683472 27903043 27940315 27759232 26738225 27479864 27020445 28000208
$$ packed form
14812H6405695q304893j0214509j2387480j0994571q556074n583232l338347j416231
14804B5610358j830807n21408p6529l15073O65808p7027N24948J08851o9343k38575
14794B3781203m5290n15008J33209m01880m09760q16237M84975n21030k48636
14785B1441546O59639l93885N40208N56083N36074J745135J171904Q25461J232515
14776B8314680L16487P95388q4768n19916p67045j668448j346824j965634j735976
14767B1337944p12468n17206r0112j082092M17397n3198j0804K06552k5300K59672
14757A9730385N39171j88314Q53094L49257K088927J069707Q80926J298137O22675
14748B7243965K82499J57008K19571L7272j81083j021007P41639m59419R79763
$$ plain form
14739 28000208 29833635 31937603 34762305 38303124 43559060 50522534 62049082 80162285
14731 80162285 108560871 148240533 194044584 242449882 287875741 324444119 348896914
14724 348896914 359953042 358596073 343452986 314423153 273849663 226893629 179056667
14717 179056667 136302845 101756620 77129261 60989439 50282038 43567802 38901361
14710 38901361 35183493 32333950 29890574 28449702 27277411 25992342 24892353 22971297
14702 22971297 21338885 20025987 19069108 18129233 17641387 18171250 18526891 19288326 20188918
14693 20188918 20078855 19971111 19838367 20376775 20482188 20263992 19748570 19328096 18497849
14684 18497849 18871880 18539537 19419955 20011204 20504194 21587536 23483793 25174172 26817909
$$ packed form
14739B8000208J833427K103968K824702L540819N255936O963474J1526548J8113203
14731H0162285K8398586L9679662M5804051M8405298M5425859L6568378K4452795
14724C48896914J1056128j356969j5143087k9029833m0573490m6956034m7836962
14717A79056667m2753822l4546225k4627359j6139822j0707401o714236m666441
14710C8901361l717868k849543k443376j440872j172291j285069j099989j921056
14702B2971297j632412j312898r56879r39875m87846N29863L55641P61435R00592
14693B0188918j10063j07744j32744N38408J05413k18196n15422m20474q30247
14684A8497849L74031l32343Q80418N91249M92990J083342J896257J690379J643737
$$ plain form
14675 26817909 28212803 28387898 28562927 27224290 26697746 26183202 23991183 22564367 20896618
14666 20896618 22023041 22600421 22704183 22906430 23214741 23304770 22708882 22313839 21368901
14657 21368901 19347825 17906961 16033958 14281330 13796733 14047301 14198642 14122596 16393888
14648 16393888 17983651 19371562 20952189 22067054 22954566 23548321 24145052 24854030 24909842
14639 24909842 25282060 26406783 27501987 29352703 30851264 30920736 31301157 30744918 28155218
14630 28155218 25901211 23140303 19874405 17452501 14108954 12242673 9951164 9566085
14622 9566085 9016100 8650508 8886954 9064806 8729264 8925103 8933343 8648394 8324610 8051844
14612 8051844 8322641 8414327 7839950 8150045 7611335 7730292 7556285 8414403 8288576 9009074
$$ packed form
14675B6817909J394894J75095J75029j338637n26544n14544k192019j426816j667749
14666B0896618J126423N77380J03762K02247L08311R0029n95888l95043r44938
14657B1368901k021076j440864j873003j752628m84597K50568J51341p6046K271292
14648A6393888J589763J387911J580627J114865Q87512N93755N96731P08978N5812
14639B4909842L72218J124723J095204J850716J498561O9472L80421n56239k589700
14630B8155218k254007k760908l265898k421904l343547j866281k291509l85079
14622I566085n49985l65592K36446J77852l35542J95839Q240k84949l23784k72766
14612H051844K70797R1686n74377L10095n38710J18957j74007Q58118j25827P20498
$$ plain form
14602 9009074 10422996 12427919 14870271 17511296 19976705 21593108 22028779 22431988
14594 22431988 22412078 21010839 19692951 17523806 14738978 12444031 10415398 9443587
14586 9443587 8266167 8538212 8507264 8068806 8047783 8299640 8091996 8316484 8078204 8780790
14576 8780790 9187234 9151397 10377834 11051262 11549598 12388347 12853412 13707655 16507884
14567 16507884 18692688 20760615 22272433 23916159 25361714 28188842 33734864 42704105
14559 42704105 53784752 62725051 68768983 72907085 75090292 75579936 74426604 70155254
14551 70155254 62877004 53226347 42732738 33719176 29056145 29079364 34624103 45732801
14543 45732801 57911052 69295204 77817417 82900383 86032485 86538199 84287436 77984310
$$ packed form
14602I009074J413922K004923K442352K641025K465409J616403M35671M03209
14594B2431988j9910j401239j317888k169145k784828k294947k028633r71811
14586I443587j177420K72045l0948m38458k1023K51857k07644K24488k38280P02586
14576H780790M06444l5837J226437O73428M98336Q38749M65065Q54243K800229
14567A6507884K184804K067927J511818J643726J445555K827128N546022Q969241
14559D2704105J1080647Q940299O043932M138102K183207M89644j153332m271350
14551G0155254p278250r650657j0493609r013562m663031K3219N544739J1108698
14543D5732801J2178251J1384152Q522213N082966L132102N05714k250763o303126
$$ plain form
14535 77984310 68753594 57206389 45010427 35268360 29338730 25297592 23847351 23071098
14527 23071098 22718198 21961172 21231960 20526561 20906662 21652608 27084068 34230158 43352185
14518 43352185 50862523 56966025 61415584 63997910 65685948 65733921 63928710 60421800
14510 60421800 54165037 47250660 43390384 41441282 42660747 46731455 53051874 59000563
14502 59000563 63304110 65611650 67870587 69415520 68275422 65852214 61617241 56301923
14494 56301923 49561537 43172745 37007630 32520599 28484662 25224861 22475844 20532284
14486 20532284 17737279 14922940 11809613 10115565 9083171 8291533 7949191 7197181
14478 7197181 7324104 7379668 7257560 7627380 7957962 9049615 10303094 12047347 13661708
$$ packed form
14535G7984310r230716j1547205j2195962r742067n929630m041138j450241p76253
14527B3071098l52900p57026p29212p05399L80101P45946N431460P146090R122027
14518D3352185P510338O103502M449559K582326J688038M7973j805211l506910
14510F0421800o256763o914377l860276j949102J219465M070708O320419N948689
14502E9000563M303547K307540K258937J544933j140098k423208m234973n315318
14494E6301923o740386o388792o165115m487031m035937l259801k749017j943560
14486B0532284k795005k814339l113327j694048j032394p91638l42342p52010
14478G197181J26923N5564j22108L69820L30582J091653J253479J744253J614361
$$ plain form
14469 13661708 14996589 15193952 16282716 16139453 15511702 15450278 15429487 14742364 14872845
14460 14872845 15826313 17230565 19247884 19798824 21241849 22002229 21525832 21268626 20127794
14451 20127794 18202951 15903475 13918443 12578409 11445521 11279838 11235767 11598035 11997919
14442 11997919 11613068 11949085 12945476 13179146 13711832 14449546 15000140 15312047 15894693
14433 15894693 17176103 18750791 21243874 25762419 32668851 40721753 49217653 56520565
14425 56520565 61603539 65562209 67726453 68484911 66228330 62521509 56509050 49379929
14417 49379929 41605718 35308645 30172887 26670589 23297514 20935716 19217756 17174941
14409 17174941 14879056 14009123 13248002 12555942 12481104 12119210 12082993 12157201 12202952 12873369
$$ packed form
14469A3661708J334881J97363J088764j43263o27751o1424k0791o87123J30481
14460A4872845R53468J404252K017319N50940J443025P60380m76397k57206j140832
14451B0127794j924843k299476j985032j340034j132888j65683m4071L62268L99884
14442A1997919l84851L36017R96391K33670N32686P37714N50594L11907N82646
14433A5894693J281410J574688K493083M518545O906432Q052902Q495900P302912
14425E6520565N082974L958670K164244P58458k256581l706821o012459p129121
14417D9379929p774211o297073n135758l502298l373075k361798j717960k042815
14409A7174941k295885q69933p61121o92060p4838l61894l6217P4208M5751O70417
$$ plain form
14399 12873369 13207871 13443490 15204679 16783303 20525867 26239191 35076425 47508426
14391 47508426 61790059 75734656 87526253 96722942 102437504 105260617 104328828 99252923
14383 99252923 90609581 78456296 65066040 51378498 40959664 31859419 26085407
14376 26085407 21771168 18520872 16304601 15531445 14369081 13687728 13569704 13476270 12708802
14367 12708802 12688578 12473990 12567246 11876787 11737968 12054078 13362651 13360134 14350271 16250231
14357 16250231 19431879 22366621 27970631 33783419 39913175 44108620 47286929 49076334
14349 49076334 49533120 48241503 45736561 41662505 36685377 30616255 25334260 21366358
14341 21366358 17907847 16439597 15264615 17258719 22605191 29940996 34648753 38142176
$$ packed form
14399A2873369L34502K35619J761189J578624L742564N713324Q837234J2432001
14391D7508426J4281633J3944597J1791597R196689N714562K823113r31789n075905
14383I9252923q643342j2153285j3390256j3687542j0418834r100245n774012
14376B6085407m314239l250296k216271p73156j162364o81353j18024r3434p67468
14367A2708802k0224k14588R3256o90459j38819L16110J308573k517R90137J899960
14357A6250231L181648K934742N604010N812788O129756M195445L178309J789405
14349D9076334M56786j291617k504942m074056m977128o069122n281995l967902
14341B1366358l458511j468250j174982J994104N346472P335805M707757L493423
$$ plain form
14333 38142176 40725162 42041097 42223536 41341110 39007764 35127369 29672638 22480950
14325 22480950 17847947 14764982 13520025 13234975 11988819 12019462 12388227 12494256 13224680
14316 13224680 13455643 14284357 15929013 16980585 18580075 19926975 20994850 23412040
14308 23412040 25282057 27767693 29935972 33050627 36709025 42174866 48102367 56672981
14300 56672981 68612227 83146074 103064256 130398534 163096237 199578273 234826606
14293 234826606 264522744 286110176 299212245 303336550 298334765 283613524 258992930
14286 258992930 225251211 188224765 152099336 121885481 97890296 79452993 64667994
14279 64667994 55091378 46337694 39171687 34441284 30417087 27368362 24346870 22279178
$$ packed form
14333C8142176K582986J315935J82439q82426k333346l880395n454731p191688
14325B2480950m633003l082965j244957k85050j246156L0643L68765J06029P30424
14316A3224680K30963Q28714J644656J051572J599490J346900J067875K417190
14308B3412040J870017K485636K168279L114655L658398N465841N927501Q570614
14300E6672981J1939246J4533847J9918182K7334278L2697703L6482036L5248333
14293B34826606K9696138K1587432J3102069M124305n001785j4721241k4620594
14286B58992930l3741719l7026446l6125429l0213855k3995185j8437303j4784999
14279F4667994r576616q753684p166007m730403m024197l048725l021492k067692
$$ plain form
14271 22279178 19985377 18451399 16840776 15247535 14055434 12871547 12316710 11092686
14263 11092686 10974432 10309074 9925355 8982643 9119287 8605738 9046405 8352580 8448252
14254 8448252 7697394 7755845 7502758 7733178 7781234 7357584 7180123 6986749 6482558 6569363
14244 6569363 5835781 6006011 5874678 5573962 5577304 5782751 5584060 5391960 5654249 5111061
14234 5111061 5367841 5570464 4783317 4605466 4486204 4709062 4915419 4725916 4732182 4815807
14224 4815807 4855494 4799043 4888054 4630860 5027992 5179432 4965208 4913171 5048265 4456036
14214 4456036 5133164 4925193 4836585 4766488 4921319 6295555 7223851 7515680 8109660 8107528
14204 8107528 8590755 8216729 7654593 7431093 6851986 6202370 5132038 4588843 4472799
$$ packed form
14271B2279178k293801j533978j610623j593241j192101j183887n54837j224024
14263A1092686j18254o65358l83719r42712J36644n13549M40667o93825R5672
14254H448252p50858N8451k53087K30420M8056m23650j77461j93374n04191Q6805
14244F569363p33582J70230j31333l00716L342K05447j98691j92100K62289n43188
14234E111061K56780K02623p87147j77851j19262K22858K06357j89503O266Q3625
14224D815807L9687n6451Q9011k57194L97132J51440k14224n2037J35094n92229
14214D456036O77128k07971q8608p0097J54831J374236R28296K91829N93980k132
14204H107528M83227l74026n62136k23500n79107o49616j070332n43195j16044
$$ plain form
14195 4472799 4197532 4036176 4228040 4217091 4452024 4421655 5148381 4485458 5226862 4784310
14185 4784310 4892871 4359901 4327637 4097289 3685483 3647844 3808804 3858466 3669931 3858797
14175 3858797 3976012 4264584 4250568 3834731 3673312 4472428 4171487 3854297 3661832 4676264
14165 4676264 3596245 4309225 4291432 3687502 4499312 3914000 4096771 5022376 4193141
14156 4193141 4415060 4717844 3951198 4627962 4234695 4621489 4953160 4451580 4257135
14147 4257135 4784832 4463876 5407243 4967561 6058014 6954783 8922377 11357184 13912245
14138 13912245 16104311 17694077 18622230 19557372 19593891 19060024 18022297 15900346 13440487
14129 13440487 11482513 10017129 8288581 7200173 6776636 5958173 6551332 7376403 7775792
$$ packed form
14195D472799k75267j61356J91864j0949K34933l0369P26726o62923P41404m42552
14185D784310J08561n32970l2264k30348m11806l7639J60960M9662j88535J88866
14175C858797J17215K88572j4016m15837j61419P99116l00941l17190j92465J014432
14165D676264j080019P12980j7793o03930Q11810n85312J82771R25605q29235
14156D193141K21919L02784p66646O76764l93267L86794L31671n01580j94445
14147D257135N27697l20956R43367m39682J090453Q96769J967594K434807K555061
14138A3912245K192066J589766R28153R35142L6519n33867j037727k121951k459859
14129A3440487j957974j465384j728548j088408m23537q18463N93159Q25071L99389
$$ plain form
14120 7775792 8842190 9163669 9658486 9650376 9575344 9079166 8940586 8224698 7331714 6582718
14110 6582718 5966286 5982111 5678075 5834165 6280472 5254244 5849238 6128767 5711037
14101 5711037 6091378 7138381 7616470 8539222 9421032 10023179 10176318 11236970 10844051
14092 10844051 11163636 9995948 10137798 8491615 8871584 8243917 9242471 10819263 12039732
14083 12039732 13382818 13559225 14270836 14472562 14367787 13473133 12527864 11457697 9777474
14074 9777474 8803021 7746994 6939779 6527206 6488311 6472182 6187874 6268049 6299661 6629538
14064 6629538 6572280 7215903 7642716 9060340 10048845 10460049 10938255 11335946 11934236
14055 11934236 12136701 12033802 12142066 11519856 10754893 10969808 11611147 12443904 12783272
$$ packed form
14120G775792J066398L21479M94817q110p5032m96178j38580p15888q92984p48996
14110F582718o16432J5825l04036J56090M46307j026228N94994K79529m17730
14101E711037L80341J047003M78089R22752Q81810O02147J53139J060652l92919
14092A0844051L19585j167688J41850j646183L79969o27667R98554J576792J220469
14083A2039732J343086J76407P11611K01726j04775q94654r45269j070167j680223
14074I777474r74453j056027q07215m12573l8895j6129k84308Q0175L1612L29877
14064F629538n7258O43623M26813J417624R88505M11204M78206L97691N98290
14055A1934236K02465j02899J08264o22210p64963K14915O41339Q32757L39368
$$ plain form
14046 12783272 14164576 15124513 16489824 17611146 18459303 19408751 20348556 20617399 21869434
14037 21869434 21067725 21720817 22132904 23614433 25380353 26980789 29708210 33141556
14029 33141556 37695975 44302680 51586976 61172167 74082443 91810977 115869903 146749323
14021 146749323 183721636 222184848 256747476 284317072 302548291 311983435 312024762
14014 312024762 301850244 280840424 250264798 212450779 173606710 137739172 110293265
14007 110293265 88544252 71767574 58733321 49271293 41492642 35628469 31234491
14000 31234491 27319245 24175565 21461340 19821989 17808968 16515112 15440766 14886708
13992 14886708 14190112 14102505 13700142 13424117 13406747 13527876 13759240 13250179 12995050 13534803
$$ packed form
14046A2783272J381304R59937J365311J121322Q48157R49448R39805K68843J252035
14037B1869434q01709O53092M12087J481529J765920J600436K727421L433346
14029C3141556M554419O606705P284296R585191J2910276J7728534K4058926L0879420
14021A46749323L6972313L8463212L4562628K7569596J8231219R435144M1327
14014C12024762j0174518k1009820l0575626l7814019l8844069l5867538k7445907
14007A10293265k1749013j6776678j3034253r462028p778651n864173m393978
14000C1234491l915246l143680k714225j639351k013021j293856j074346n54058
13992A4886708o96596q7607m02363k76025j7370J21129K31364n09061k55129N39753
$$ plain form
13982 13534803 12981051 12689238 12325197 12046782 11808115 11806260 11411639 10825894 10543119 9953222
13972 9953222 9197095 9108213 8533527 7735831 7649147 6440377 6806473 6357772 5874835 5556181
13962 5556181 6177393 5401831 5237933 5756985 5064947 4883129 4687408 5540417 5621091 5471343
13952 5471343 5359312 5615792 6303817 7342036 7226306 8022925 8117815 8233751 8750531
13943 8750531 9588888 9849640 11305847 14293688 19857865 26846629 35181075 44978687
13935 44978687 54516829 62741904 69391933 72780597 73404035 70785630 65694280 58173796
13927 58173796 49393429 39467735 30849295 22706077 15824633 11956012 9529482 7171802
13919 7171802 6696124 5690449 4904030 5273380 4560627 4635923 4158794 4346153 3958366
$$ packed form
13982A3534803n53752k91813l64041k78415k38667j855l94621n85745k82775n89897
13972I953222p56127q8882n74686p97696q6684j208770L66096m48701m82937l18654
13962E556181O21212p75562j63898N19052o92038j81818j95721Q53009Q0674j49748
13952E471343j12031K56480O88025J038219j15730P96619R4890J15936N16780
13943H750531Q38357K60752J456207K987841N564177O988764Q334446R797612
13935D4978687R538142Q225075O650029L388664O23438k618405n091350p520484
13927E8173796q780367r925694q618440q143218o881444l868621k426530k357680
13919G171802m75678j005675p86419L69350p12753P5296m77129J87359l87787
$$ plain form
13910 3958366 4521518 4163841 3809650 3823512 3863986 3965518 4037592 3684755 3775026 3983072
13900 3983072 3933005 4208195 3967408 3979307 3933984 3549685 3745373 3579392 3755020 3626727
13890 3626727 4272568 4161477 3689294 3939178 4015735 4098411 3814376 3974501 3622823 3948851
13880 3948851 3603566 3271751 2937792 3536254 3562940 3908839 3199152 3644942 3650764 4021270
13870 4021270 3471975 3999453 3757806 4081258 4139927 3916312 3506412 3809469 3838579 3968256
13860 3968256 3811122 4147903 3708436 3899785 4000494 3976830 3444804 3634245 4001623 4063634
13850 4063634 3549782 3810098 3720496 4137115 4215838 4362905 3992474 4215021 4291408 4005435
13840 4005435 4171339 3488802 3808658 3752158 3701629 3270735 3359239 3445643 3450344 3236949
$$ packed form
13910C958366N63152l57677l54191J3862M0474J01532P2074l52837R0271K08046
13900C983072n0067K75190k40787J1899m5323l84299J95688j65981J75628j28293
13890C626727O45841j11091m72183K49884P6557Q2676k84035J60125l51678L26028
13880C948851l45285l31815l33959N98462K6686L45899p09687M45790N822L70506
13870D021270n49295N27478k41647L23452N8669k23615m09900L03057K9110J29677
13860C968256j57134L36781m39467J91349J00709k3664n32026J89441L67378O2011
13850D063634n13852K60316q9602M16619P8723J47067l70431K22547P6387k85973
13840D005435J65904o82537L19856n6500n0529m30894Q8504Q6404M701k13395
$$ plain form
13830 3236949 3267422 3557291 3205953 3449725 3371312 3284357 3435215 3720015 3577261 4026713
13820 4026713 3624993 3523438 3328173 3354066 3681866 3121559 3606708 3048103 3321527 3395083
13810 3395083 2881674 3201801 3418260 3010551 3326509 2788000 3289978 3183806 3450003
13801 3450003 3292191 3141506 3302945 3517832 3477517 3266334 3320170 3555618 3519646 3656168
13791 3656168 2811563 3297408 3445889 3525212 3077637 3305516 3111557 2974573 3175514 3226353
13781 3226353 3377282 3121919 3081320 2799001 3298494 3013830 2725360 3195843 2932302 3446778
13771 3446778 3057768 3018091 3193950 3385755 2945233 2895352 3520274 2966696 2762393 3583288
13761 3583288 2611195 3267165 2855363 2487555 2893298 3146672 2714023 2676610 2579896 3007380
$$ packed form
13830C236949L0473K89869l51338K43772p8413q6955J50858K84800j42754M49452
13820D026713m01720j01555j95265K5893L27800n60307M85149n58605K73424P3556
13810C395083n13409L20127K16459m07709L15958n38509N01978j06172K66197
13801C450003j57812j50685J61439K14887m0315k11183N3836K35448l5972J36522
13791C656168q44605M85845J48481P9323m47575K27879j93959j36984K00941N0839
13781C226353J50929k55363m0599k82319M99493k84664k88470M70483k63541N14476
13771C446778l89010l9677J75859J91805m40522m9881O24922n53578k04303Q20895
13761C583288r72093O55970m11802l67808M05743K53374m32649l7413r6714M27484
$$ plain form
13751 3007380 2966129 2183108 2318128 3324531 2753781 2754495 2657300 2833756 2961399 3322045
13741 3322045 2959054 3211817 2941063 3078037 3353362 3255880 3781306 3512732 3702569 3779544
13731 3779544 3861235 4583861 4331681 4478635 4392688 4570177 4291046 3987457 4014966 3448325
13721 3448325 3611217 3729301 3250235 3179473 2933835 2987664 3048519 2814797 3268180 2872816
13711 2872816 3737819 2950354 3303975 3192114 3681455 3329578 3188709 3534407 3307454
13702 3307454 3329893 2900693 3151559 4015042 4042576 4249346 5136624 5465198 6213715 6822065
13692 6822065 6685082 6560491 6217549 6125892 5825376 5504328 4591526 3961914 3959495 3304428
13682 3304428 3489711 3308556 3595072 3557026 3870872 3850930 3740685 3698197 4160546 4224519
$$ packed form
13751C007380m1251p83021J35020J006403n70750P14r7195J76456J27643L60646
13741C322045l62991K52763k70754J36974K75325r7482N25426k68574J89837P6975
13731C779544Q1691P22626k52180J46954q5947J77489k79131l03589K7509n66641
13721C448325J62892J18084m79066p0762k45638N3829O0855k33722M53383l95364
13711B872816Q65003p87465L53621j11861M89341l51877j40869L45698k26953
13702C307454K2439m29200K50866Q63483K7534K06770Q87278L28574P48517O08350
13692F822065j36983j24591l42942r1657l00516l21048r12802o29612k419o55067
13682C304428J85283j81155K86516l8046L13846j9942j10245m2488M62349O3973
$$ plain form
13672 4224519 4575780 4700168 4845709 5505109 5954261 6085264 7677841 8004916 8228686
13663 8228686 8618355 8756084 8832720 8928846 8371801 7443863 6994475 6289420 6073892 5422196
13653 5422196 5420805 4408917 4669057 4371953 4052448 3683537 4026766 4157541 4113841 3896172
13643 3896172 4219949 3864530 4010320 4530536 4478956 4413740 4962777 5861253 6126043 6708896
13633 6708896 6545282 7324432 7021935 7366550 6834603 6575433 5952961 4980936 4357035
13624 4357035 3909976 3826739 3610305 3072007 3928887 3486158 3553174 3638863 3825426 3355161
13614 3355161 3636221 3958426 3818001 3910468 3897914 3961337 3946076 4560428 4148558 4048495
13604 4048495 4364398 3933960 3759114 3576614 3850260 4300375 3706041 3784903 3953256 3807925
$$ packed form
13672D224519L51261J24388J45541O59400M49152J31003J592577L27075K23770
13663H228686L89669J37729P6636R6126n57045r27938m49388p05055k15528o51696
13653E422196j391j011888K60140k97104l19505l68911L43229J30775m3700k17669
13643C896172L23777l55419J45790N20216n1580o5216N49037Q98476K64790N82853
13633F708896j63614P79150l02497L44615n31947k59170o22472r72025o23901
13624D357035m47059q3237k16434n38298Q56880m42729O7016Q5689J86563m70265
13614C355161K81060L22205j40425R2467j2554O3423j5261O14352m11870j00063
13604D048495L15903m30438j74846j82500K73646M50115n94334P8862J68353j45331
$$ plain form
13594 3807925 4220346 4400570 4487756 4014194 4391230 4065295 3614579 4147132 4295410 3751270
13584 3751270 3510875 3695976 3360373 3286434 3102807 3321266 3096023 3319342 3781211 3203824
13574 3203824 3209741 2887107 3193729 3330782 3291427 3019311 2984614 2802111 3190156 3007964
13564 3007964 2902519 2738252 3056725 2972900 3014622 3218918 2686164 3243653 2770506 2757513
13554 2757513 3397959 3380485 3537687 2880590 3111968 3217572 3180962 3190346 3845756 4412758
13544 4412758 4643376 5069489 4943470 4788411 5306025 4899340 5180907 5185080 4826769 4023194
13534 4023194 3800641 3763410 3231074 3650198 3464420 3496779 3583113 4229956 4269598 4857247
13524 4857247 4853073 5071084 4779415 5089675 4721299 4215781 4240769 3585222 3376887 3134321
$$ packed form
13594C807925M12421J80224Q7186m73562L77036l25935m50716N32553J48278n44140
13584C751270k40395J85101l35603p3939j83627K18459k25243K23319M61869n77387
13574C203824N917l22634L06622J37053l9355k72116l4697j82503L88045j82192
13564C007964j05445j64267L18473q3825M1722K04296n32754N57489m73147j2993
13554B757513O40446j7474J57202o57097K31378J05604l6610R384O55410N67002
13544D412758K30618M26113j26019j55059N17614m06685K81567M173l58311q03575
13534D023194k22553l7231n32336M19124j85778L2359Q6334O46843L9642N87649
13524D857247m174K18011k91669L10260l68376n05518K4988o55547k08335k42566
$$ plain form
13514 3134321 2902557 2628173 2554670 2749981 2668780 2459859 2549328 2811052 2850614 2529413
13504 2529413 2599907 2733436 2533862 2422006 2534868 2611200 3147318 2003138 2491850 2369025
13494 2369025 2734711 2936864 2671446 2657411 3029433 2577693 2549119 2462430 3008962 2495003
13484 2495003 2812906 2815169 2800473 3097914 2625821 2601957 2632423 2337546 2533644 2549539
13474 2549539 2483802 2431755 2578264 2758212 2774954 2409136 2132974 2721503 3411053 2752223
13464 2752223 2809731 2666910 2625267 2614050 2446580 2890502 2979868 2918135 3038845 3479849
13454 3479849 4144572 4598721 4442017 4630506 4403402 4529052 4888837 5105838 4321686
13445 4321686 4269785 4134294 3506463 3419126 3014365 2960188 2448649 2378794 3006949 3088151
$$ packed form
13514C134321k31764k74384p3503J95311q1201k08921Q9469K61724L9562l21201
13504B529413P0494J33529j99574j11856J12862P6332N36118j144180M88712j22825
13494B369025L65686K02153k65418j4035L72022m51740k8574q6689N46532n13959
13484B495003L17903K263j4696K97441m72093k3864L0466k94877J96098J5895
13474B549539o5737n2047J46509J79948J6742l65818k76162N88529O89550o58830
13464B752223N7508j42821m1643j1217j67470M43922Q9366o1733J20710M41004
13454C479849O64723M54149j56704J88489k27104J25650L59785K17001p84152
13445D321686n1901j35491o27831q7337m04761n4177n11539o9855O28155Q1202
$$ plain form
13435 3088151 2868916 2074373 2964340 2711076 3004553 2616374 2946427 2958990 2958166 3233047
13425 3233047 3561302 3487616 4286432 4302798 4594678 5193156 5146215 4620878 4638227 4975077
13415 4975077 4428724 4482981 4021577 3307441 3266122 2891040 2633362 2995855 3008621 2763373
13405 2763373 2897380 2585186 2792636 3103153 3052185 2650334 3063360 2972287 2731482 2747253
13395 2747253 2937093 3193630 3065331 3150967 3233177 3426809 3562555 3587819 4057490 4065007
13385 4065007 4686819 5020915 5382567 4985985 5545746 4548287 4906358 4585809 4469279
13376 4469279 4343819 3674471 3485778 3387862 3372183 3482671 4081855 4513930 4186033 4092242
13366 4092242 4138382 4060532 4136270 4146285 3824200 3356528 3661933 3167673 3950903 3308437
$$ packed form
13435C088151k19235p94543Q89967k53264K93477l88179L30053J2563q24K74881
13425C233047L28255p3686P98816J6366K91880N98478m6941n25337J7349L36850
13415D975077n46353N4257m61404p14136m1319l75082k57678L62493J2766k45248
13405B763373J34007l12194K07450L10517n0968m01851M13026r1073k40805J5771
13395B747253J89840K56537j28299Q5636Q2210J93632J35746K5264M69671P517
13385D065007O21812L34096L61652l96582N59761r97459L58071l20549j16530
13376D469279j25460o69348j88693r7916j5679J10488N99184M32075l27897r3791
13366D092242M6140p7850P5738J0015l22085m67672L05405m94260P83230o42466
$$ plain form
13356 3308437 3450082 4044725 4907823 4158990 4164460 4239788 4183936 4462812 4361124 4413539
13346 4413539 3857516 3683137 3263941 3244574 3612128 3771993 3542088 3432085 3387736 3538896
13336 3538896 3814146 3781905 3604856 3590900 3849439 3864491 3747337 3502942 3656173 3632289
13326 3632289 3944882 3881125 3496337 3972906 4021695 3672138 3898642 4042693 4283822 4192886
13316 4192886 4729981 4438259 5083001 5229599 5917678 5594108 5878190 5928143 5393578 5145476
13306 5145476 5000462 4648134 4907362 4919637 5068857 4832881 5186931 5857768 5621619 5936143
13296 5936143 6191839 6204305 6180146 5717348 5448825 5690196 5626462 5235631 5105670 5353731
13286 5353731 5400479 5138700 5559806 5520910 5295538 5485015 5600593 5447972 5658170 5783729
$$ packed form
13356C308437J41645N94643Q63098p48833N470P5328n5852K78876j01688N2415
13346D413539n56023j74379m19196j9367L67554J59865k29905j10003m4349J51160
13336C538896K75250l2241j77049j3956K58539J5052j17154k44395J53231k3884
13326C632289L12593o3757l84788M76569M8789l49557K26504J44051K41129r0936
13316D192886N37095k91722O44742J46598O88079l23570K84082M9953n34565k48102
13306E145476j45014l52328K59228J2275J49220k35976L54050O70837k36149L14524
13296E936143K55696J2466k4159m62798k68523K41371o3734l90831j29961K48061
13286E353731M6748k61779M21106l8896k25372J89477J15578j52621K10198J25559
$$ plain form
13276 5783729 5423228 6114001 6048557 6086438 6162693 6888311 6107203 6735070 6670348 6444281
13266 6444281 7215796 7214021 7058862 7405970 7834310 8120636 8359123 8626850 8656532 8840984
13256 8840984 9340338 9369713 9642300 9710246 9912530 10206616 10210043 10068625 10618589 10527956
13246 10527956 10315677 10446054 11077618 10980666 10824044 10522403 11045927 11400941 12080085
13237 12080085 11903034 12581762 13370699 13393281 13490053 14124786 14237030 14534065 14879664 14983477
13227 14983477 15128789 15202415 14924914 14962783 14600302 14308015 14146242 13939826 14090054 13408885
13217 13408885 13313553 13026706 13250413 12612514 13083613 12986927 12796790 12967714 13177550 13001668
13207 13001668 13306007 12856829 13517566 13483968 13034143 13292627 13131195 12650866 12510751
$$ packed form
13276E783729l60501O90773o5444L7881P6255P25618p81108O27867o4722k26067
13266F444281P71515j775j55159L47108M28340K86326K38487K67727K9682J84452
13256H840984M99354K9375K72587O7946K02284K94086L427j41418N49964r0633
13246A0527956k12279J30377O31564r6952j56622l01641N23524L55014O79144
13237A2080085j77051O78728P88937K2582R6772O34733J12244K97035L45599J03813
13227A4983477J45312P3626k77501L7869l62481k92287j61773k06416J50228o81169
13217A3408885r5332k86847K23707o37899M71099r6686j90137J70924K09836j75882
13207A3001668L04339m49178O60737l3598m49825K58484j61432m80329j40115
$$ plain form
13198 12510751 12113170 11994991 12057316 11596807 11633749 11422276 11039481 11659931 10836646 10598216
13188 10598216 10715014 11047872 10453109 11093279 10412967 10732244 10561713 10724515 9960903
13179 9960903 10275296 10290412 10224694 10355166 9481849 9944072 9922601 9743531 9952482 9885104
13169 9885104 10044330 9889342 10471573 10469657 10676975 10626830 11645991 11230932 11825854 11964682
13159 11964682 12841041 12515123 13241652 14012089 14038231 13928147 14482792 14016344 13924155 13481219
13149 13481219 12990843 12962100 12579007 12670117 12595943 13722999 12974204 12877170 12571895 11942619
13139 11942619 11809687 11525249 10801739 10143057 9319497 8854377 8556939 8518189 8142818
13130 8142818 8449365 7759202 8326607 8390196 8022752 7714497 8280398 8190356 8120319 7804025
$$ packed form
13198A2510751l97581j18179O2325m60509L6942k11473l82795O20450q23285k38430
13188A0598216J16798L32858n94763O40170o80312L19277j70531J62802p63612
13179I960903L14393J5116o5718J30472q73317M62223k1471j79070K08951o7378
13169I885104J59226j54988N82231j916K07318n0145J019161m15059N94922J38828
13159A1964682Q76359l25918P26529P70437K6142j10084N54645m66448r2189m42936
13149A3481219m90376k8743l83093R1110p4174J127056p48795r7034l05275o29276
13139A1942619j32932k84438p23510o58682q23560m65120k97438l8750l75371
13130H142818L06547o90163N67405O3589l67444l08255N65901r0042p0037l16294
$$ plain form
13120 7804025 7276428 7078472 7033908 7170760 6798630 6839306 6117059 6160390 6140146 5920369
13110 5920369 6347006 6290770 5888604 6514496 6611962 6314577 6014540 6403366 6677337 6949272
13100 6949272 6676375 7539867 8234552 8862031 9526557 10391917 10746704 11523404 11898840
13091 11898840 12098762 11672700 11104860 11671574 11789600 11315313 10797773 10982639 10599871
13082 10599871 11103804 11174723 11261549 10566703 10362867 10220962 9268724 8695704 7681427
13073 7681427 6734676 7335432 6185106 6280665 6060027 5322681 5430837 5847958 5199649
13064 5199649 5415195 5201619 5521189 5493520 5304534 5444867 6010052 5656538 5763843 6085164
13054 6085164 5960112 5935171 6022044 5758970 5823549 5380158 5424611 5511914 5323056 5287409
$$ packed form
13120G804025n27597j97956m4564J36852l72130M0676p22247M3331k0244k19777
13110E920369M26637n6236m02166O25892R7466k97385l00037L88826K73971K71935
13100F949272k72897Q63492O94685O27479O64526Q65360L54787P76700L75436
13091A1898840J99922m26062n67840N66714J18026m74287n17540J84866l82768
13082A0599871N03933P0919Q6826o94846k03836j41905r52238n73020j014277
13073G681427r46751O00756j150326R5559k20638p37346J08156M17121o48309
13064E199649K15546k13576L19570k7669j88986J40333N65185l53514J07305L21321
13054F085164j25052k4941Q6873k63074O4579m43391M4453Q7303j88858l5647
$$ plain form
13044 5287409 5194104 5128526 5830488 5506153 5831968 5540369 5223315 5606371 6229998 5360421
13034 5360421 5759674 5691721 5845135 6041361 6276219 6197138 6448284 6423855 6622369 6445763
13024 6445763 6651075 6777238 7255283 6785162 6942829 6846637 7641257 7362369 7477375 7780903
13014 7780903 8244955 7594509 7842003 8252863 8372781 8047329 8713692 8932899 9765994
13005 9765994 9590980 9603623 9800376 9765559 9860568 10089359 10509197 10872054 10881209 11279244
12995 11279244 11538997 11641153 12094413 12248558 12551956 12302678 12720168 12293193 13071061
12986 13071061 12910529 12614927 12632108 12863494 12872288 12492946 13272069 12935407 12647814 12527705
12976 12527705 12330210 12180692 12020112 11832235 11690278 11907672 11582854 11220475 11217017 10542799
$$ packed form
13044E287409r3305o5578P01962l24335L25815k91599l17054L83056O23627q69577
13034E360421L99253o7953J53414J96226K34858p9081K51146k4429J98514j76606
13024F445763K05312J26163M78045m70121J57667r6192P94620k78888J15006L03528
13014G780903M64052o50446K47494M10860J19918l25452O66363K19207Q33095
13005I765994j75014J2643J96753l4817R5009K28791M19838L62857R155L98035
12995A1279244K59753J02156M53260J54145L03398k49278M17490m26975P77868
12986A3071061j60532k95602J7181K31386Q794l79342P79123l36662k87593j20109
12976A2527705j97495j49518j60580j87877j41957K17394l24818l62379l458o74218
$$ plain form
12966 10542799 10861064 10416416 10767903 10514916 10618158 10122818 9823255 10181202 10260447
12957 10260447 9728969 9706865 10201323 9876756 9821177 9986367 9712073 9771947 9813584 9732575
12947 9732575 9863217 9592654 9910729 9995981 9984142 10243788 9709775 9764648 10202330 9690715
12937 9690715 9924113 9910001 10166016 10844585 10702608 10760941 11163637 11348684 11109185 11502949
12927 11502949 11131113 10949180 10632512 11143906 10817010 10786353 11202145 11154612 10710723 11024023
12917 11024023 11258530 10669246 10311006 10383396 9942676 9413910 8996826 8788837 8874802 9021876
12907 9021876 8693452 8250208 7995393 8105005 7856963 7858972 7939843 7614888 7326805 7063642
12897 7063642 6963106 7355838 6849439 6672850 6352597 6690769 6481199 6787265 6698281 6071177
$$ packed form
12966A0542799L18265m44648L51487k52987J03242m95340k99563L57947P9245
12957A0260447n31478k2104M94458l24567n5579J65190k74294N9874M1637q1009
12947I732575J30642k70563L18075Q5252j1839K59646n34013N4873M37682n11615
12937I690715K33398j4112K56015O78569j41977N8333M02696J85047k39499L93764
12927A1502949l71836j81933l16668N11394l26896l0657M15792m7533m43889L13300
12917A1024023K34507n89284l58240P2390m40720n28766m17084k07989Q5965J47074
12907I021876l28424m43244k54815J09612k48042K009Q0871l24955k88083k63163
12897G063642j00536L92732n06399j76589l20253L38172k09570L06066q8984o27104
$$ plain form
12887 6071177 6133331 6419943 6483922 6454702 5740123 6419389 5833144 5761286 5601079 5753981
12877 5753981 5994270 5919488 5498390 6091191 5385490 5888975 5252034 5809898 5690398 5011334
12867 5011334 5285928 5421966 5383855 5590518 4799906 4785676 5528533 5059730 4966226 5217655
12857 5217655 5299802 5290194 5308607 5084723 5104842 5450386 4953082 5006290 5056762 5098975 5499309
12846 5499309 4953044 5382341 5423497 5098077 5054721 5418588 5300662 5545066 5500815 5289935
12836 5289935 5099192 5204377 5099392 5499533 5254272 5273936 5078523 5311007 5225600 5051278
12826 5051278 5136409 4876834 5019449 5184324 4889374 5461085 4995900 5010191 5314592 5172813
12816 5172813 5170198 4508567 5148937 4857056 5323100 5014206 5124202 5026967 5399171 5200822
$$ packed form
12887F071177O2154K86612O3979k9220p14579O79266n86245p1858j60207J52902
12877E753981K40289p4782m21098N92801p05701N03485o36941N57864j19500o79064
12867E011334K74594J36038l8111K06663p90612j4230P42857m68803r3504K51429
12857E217655Q2147r608J8413k23884K0119L45544m97304N3208N0472M2213M00334
12846E499309n46265M29297M1156l25420m3356L63867j17926K44404m4251k10880
12836E289935j90743J05185j04985M00141k45261J9664j95413K32484q5407j74322
12826E051278Q5131k59575J42615J64875k94950N71711m65185J4291L04401j41779
12816E172813k615o61631O40370k91881M66044l08894J09996r7235L72204j98349
$$ plain form
12806 5200822 4647038 5626961 4957969 5242908 5220830 5059243 5365497 5139890 5509459 5456401
12796 5456401 4992305 6111173 5839932 5629951 5248641 5508170 5530522 5455790 5458047 5513889
12786 5513889 5778801 5251761 6099290 5272540 5654646 5364211 5387611 5516635 5453355 5965106
12776 5965106 5842838 5635992 5327010 5449167 5833130 5713913 5544642 5646456 5563297 5736417
12766 5736417 6348594 5877492 5922776 6082994 5804068 6200183 5647423 5903110 5864574 5383280
12756 5383280 6204834 6001460 5844890 6274855 5657905 5926694 5889665 6157943 5768282 5696801
12746 5696801 6228770 5847950 6040470 5559998 5754420 5836107 5600938 5897256 6002492 6050014
12736 6050014 5693187 5588207 6019217 5914669 6141009 5998682 5894026 6071520 5909761
$$ packed form
12806E200822n53784R79923o68992K84939k2078j61587L06254k25607L69569n3058
12796E456401m64096J118868k71241k09981l81310K59529K2352p4732K257N5842
12786E513889K64912n27040Q47529q26750L82106k90435K3400J29024o3280N11751
12776E965106j22268k06846l08982J22157L83963j19217j69271J01814q3159J73120
12766E736417O12177m71102M5284J60218k78926L96115n52760K55687l8536m81294
12756E383280Q21554k03374j56570M29965o16950K68789l7029K68278l89661p1481
12746E696801N31969l80820J92520m80472J94422Q1687k35169K96318J05236M7522
12736F050014l56827j04980M31010j04548K26340j42327j04656J77494j61759
$$ plain form
12727 5909761 6003480 5803826 5862404 5944772 5862689 5562376 5958824 6356988 6282690 6201090
12717 6201090 5939584 5981323 6028680 5756870 6152413 6384921 5894850 6492652 6051025 6102188
12707 6102188 6182625 6516185 6734329 7424604 6804471 7639054 7463808 7348096 7827871 7733887
12697 7733887 7737700 7847352 8166800 8445673 8706411 9347469 10686617 12545613 14122678
12688 14122678 15534590 16252273 16482007 17114650 16958965 16260569 15204036 14229015 12909327
12679 12909327 11404516 10627258 9640397 9260105 9177212 8671293 8931475 8880894 8699586
12670 8699586 8711445 9042510 8938172 9497414 9420255 9608419 9645816 9276094 9092462 9530862
12660 9530862 9324860 9072444 9003371 8405274 8513088 9099886 9049576 9706629 9552718 10201714
$$ packed form
12727E909761R3719j99654N8578Q2368q2083l00313L96448L98164p4298q1600
12717F201090k61506M1739M7357k71810L95543K32508m90071N97802m41627N1163
12707F102188Q0437L33560K18144O90275o20133Q34583j75246j15712M79775r3984
12697G733887L813J09652L19448K78873K60738O41058J339148J858996J577065
12688A4122678J411912P17683K29734O32643j55685o98396j056533r75021j319688
12679A2909327j504811p77258r86861l80292q2893n05919K60182n0581j81308
12670H699586J1859L31065j04338N59242p7159J88164L7397l69722j83632M38400
12660I530862k06002k52416o9073n98097J07814N86798n0310O57053j53911O48996
$$ plain form
12650 10201714 10815660 11242413 11568411 12590174 12541537 12182536 12830103 13051441 13143453
12641 13143453 12651709 12463235 12700633 11973790 11973233 11893101 11933515 11623720 11709074 11544308
12631 11544308 11817866 12056765 12337371 12853662 13374832 13337592 13667241 13861295 13585272
12622 13585272 13397426 12679382 12310760 11631363 11260732 10831149 10077483 10046464 10628093
12613 10628093 10674641 11556980 11993750 12482282 13438193 14401520 15058027 15299628 15481628
12604 15481628 15571384 14890844 14262568 13810436 12901771 11882273 11474116 10456040 10278327
12595 10278327 9819923 9767655 9786729 9489950 9906264 10117195 11381421 11232688 11221714 11949902
12585 11949902 11835264 12120869 12534917 12864322 13215620 13595471 13635135 13612436 13351758 13347711
$$ packed form
12650A0201714O13946M26753L25998J021763m8637l59001O47567K21338R2012
12641A3143453m91744j88474K37398p26843n57q0132M0414l09795Q5354j64766
12631A1544308K73558K38899K80606N16291N21170l7240L29649J94054k76023
12622A3585272j87846p18044l68622o79397l70631m29583p53666l1019N81629
12613A0628093M6548Q82339M36770M88532R55911R63327O56507K41601J82000
12604A5481628Q9756o80540o28276m52132r08665j019498m08157j018076j77713
12595A0278327m58404n2268J9074k96779M16314K10931J264226j48733j0974P28188
12585A1949902j14638K85605M14048L29405L51298L79851L9664k2699k60678m047
$$ plain form
12575 13347711 12932665 12929035 12821897 11989620 11319157 10998029 10274550 10402905 10104024 9663570
12565 9663570 9603229 9813154 9739488 9611994 9518221 10004910 9754560 9669441 9625673 9849000
12555 9849000 9673157 9580446 9151102 9467814 9128693 9632197 9622519 9480630 9799212 10218607
12545 10218607 9829667 10170996 10483236 11541353 12080873 12135122 12759591 13250377 13120242
12536 13120242 13086726 12906828 12849782 12225034 11304366 10544631 10013047 9880116 9706818 9689597
12526 9689597 9467716 9579785 9313144 9531703 9917142 9929238 10111000 10541823 10043783 10798695
12516 10798695 10675259 11094065 11849310 13786950 14992754 16784061 17090539 17617009 17785310
12507 17785310 17557442 17383401 16910589 15925763 14799153 13118160 11709058 11050093 10788334
$$ packed form
12575A3347711m15046l630j07138q32277o70463l21128p23479J28355k98881m40454
12565I663570o0341K09925p3666j27494r3773M86689k50350q5119m3768K23327
12555I849000j75843r2711m29344L16712l39121N03504r678j41889L18582M19395
12545A0218607l88940L41329L12240J058117N39520N4249O24469M90786j30135
12536A3120242l3516j79898n7046o24748r20668p59735n31584j32931j73298j7221
12526I689597k21881J12069k66641K18559L85439J2096J81762M30823m98040P54912
12516A0798695j23436M18806P55245J937640J205804J791307L06478N26470J68301
12507A7785310k27868j74041m72812r84826j126610j680993j409102o58965k61759
$$ plain form
12498 10788334 10775698 10569099 10671788 10281820 10362125 10396484 10536111 11148605 10482490 10718209
12488 10718209 10087566 11093731 11036746 11651288 12259623 12880567 13740344 14545315 15073124
12479 15073124 14556266 15611041 14789091 14962490 14414927 13220081 12317947 12103671 11882018
12470 11882018 11259928 11231863 11322818 11587725 11583462 12066548 11181652 11854286 12082450 12354490
12460 12354490 12652512 12734075 13282475 13566207 13285645 14082289 14585581 14820903 15096039
12451 15096039 16008925 15798467 16482338 16256070 16778766 16406583 17274694 16724680 17184823
12442 17184823 16996404 17104237 17176800 16794836 17052373 16963176 17076844 16870220 17469150 17921378
12432 17921378 17962566 18569652 18648733 19771103 19861141 21255832 21492846 22982379 23413095
$$ packed form
12498A0788334j2636k06599J02689l89968Q0305L4359J39627O12494o66115K35719
12488A0718209o30643J006165n6985O14542O08335O20944Q59777Q04971N27809
12479A5073124n16858J054775q21950J73399n47563j194846r02134k14276k21653
12470A1882018o22090k8065R0955K64907m263M83086q84896O72634K28164K72040
12460A2354490K98022Q1563N48400K83732k80562P96644N03292K35322K75136
12451A5096039R12886k10458O83871k26268N22696l72183Q68111n50014M60143
12442A7184823j88419J07833P2563l81964K57537q9197J13668k06624N98930M52228
12432A7921378M1188O07086P9081J122370R0038J394691K37014J489533M30716
$$ plain form
12423 23413095 24307322 24386817 24916738 25189918 25694809 26057523 26013715 26080647 26655509 26287655
12413 26287655 25955444 26117598 25519290 25568117 25227939 24540348 23685547 23624094 23251057 23454317
12403 23454317 23281406 22903112 23142273 23319936 23521420 23868138 23824521 24807693 24989434
12394 24989434 25079794 26680862 27437176 27801121 28491967 29405416 30337966 30983484 31087281
12385 31087281 31652943 31645891 32113801 32139551 32376431 32161435 32592177 32599471 32076684 32411525
12375 32411525 32732724 32887141 32829241 32994464 32959065 33344750 33197571 33246236 33184540 33538641
12365 33538641 33735111 33955192 33564970 33138581 33117628 33338818 32701549 33001173 32896232
12356 32896232 32645362 32749678 32483055 32515619 32686629 32304177 31950141 31879857 31114016 30885197
$$ packed form
12423B3413095Q94227P9495N29921K73180N04891L62714m3808O6932N74862l67854
12413B6287655l32211J62154n98308M8827l40178o87591q54801o1453l73037K03260
12403B3454317j72911l78294K39161J77663K01484L46718m3617R83172J81741
12394B4989434R0360J601068P56314L63945O90846R13449R32550O45518J03797
12385C1087281N65662p052M67910K5750K36880k14996M30742P294n22787L34841
12375C2411525L21199J54417n7900J65223l5399L85685j47179M8665o1696L54101
12365C3538641J96470K20081l90222m26389k0953K21190o37269K99624j04941
12356C2896232k50870J04316k66623L2564J71010l82452l54036p0284p65841k28819
$$ plain form
12346 30885197 30488185 30565496 30588694 30858144 31267449 31354581 32419991 32814133 33853952
12337 33853952 34065952 34930324 36075078 36821261 37444604 38468382 39085533 39747081 40243197
12328 40243197 40937188 41345146 41698644 42370542 42434851 42587879 42352256 42512178 42706012
12319 42706012 42328135 42510906 42642210 42664793 42395996 42828378 43173251 43320574 43694140
12310 43694140 43946260 44507718 45368818 46270495 47291864 48326897 48531136 48762266 48685003
12301 48685003 47935063 47964155 46962947 45863503 45320432 44053083 43227871 41892443 41621813
12292 41621813 40981130 40503866 39810500 39075120 38266062 37341546 36417275 34815500 34379133
12283 34379133 33038788 31923442 31337878 30303123 29251750 28884792 28145489 27430381 27435291
$$ packed form
12346C0885197l97012P7311K3198K69450M09305Q7132J065410L94142J039819
12337C3853952K12000Q64372J144754P46183O23343J023778O17151O61548M96116
12328D0243197O93991M07958L53498O71898O4309J53028k35623J59922J93834
12319D2706012l77877J82771J31304K2583k68797M32382L44873J47323L73566
12310D3694140K52120N61458Q61100R01677J021369J035033K04239K31130p7263
12301D8685003p49940K9092j001208j099444n43071j267349q25212j335428k70630
12292D1621813o40683m77264o93366p35380q09058r24516r24271j601775m36367
12283C4379133j340345j115346n85564j034755j051373l66958p39303p15108M910
$$ plain form
12274 27435291 27060729 26679295 26618609 27235480 26397980 26567665 25815727 25775257 26041095 25511904
12264 25511904 25339872 25853717 25777879 25275989 25465251 26190456 26214466 27395491 27635272
12255 27635272 28879136 30234842 31493736 33245281 35005120 37242672 38864987 41501936
12247 41501936 43218850 45534897 47734316 49340946 51261691 51981964 52363681 53161851
12239 53161851 52930506 52703200 52230391 51417225 50697696 50259311 49807896 49416585 48133373
12230 48133373 47205314 46326199 44531602 42718447 40757155 38499239 36126260 33729260
12222 33729260 32203271 30024805 28607411 27174606 26416077 24963564 24413485 24207929
12214 24207929 22934416 22687293 21943313 21213143 20680120 20691819 20060799 19662714 19040557
$$ packed form
12274B7435291l74562l81434o0686O16871q37500J69685p51938m0470K65838n29191
12264B5511904j72032N13845p5838n01890J89262P25205K4010J181025K39781
12255B7635272J243864J355706J258894J751545J759839K237552J622315K636949
12247D1501936J716914K316047K199419J606630J920745P20273L81717P98170
12239E3161851k31345k27306m72809q13166p19529m38385m51415l91311j283212
12230D8133373r28059q79115j794597j813155j961292k257916k372979k397000
12222C3729260j525989k178466j417394j432805p58529j452513n50079k05556
12214B4207929j273513k47123p43980p30170n33023J1699o31020l98085o22157
$$ plain form
12205 19040557 19162373 18968205 19092337 18913935 18823963 19206557 19169928 19373780 19761764 19715684
12195 19715684 19956342 20028038 20586266 20750217 21100332 22299505 22222777 22472797 22987190
12186 22987190 23344670 23508083 23773243 23963468 24098051 23788406 24315860 24087296 23456887
12177 23456887 23794252 23834872 23079809 22814898 23108156 23106775 22955795 23189368 23110836 23513715
12167 23513715 22846402 23267796 23857359 24458917 25309653 26109815 26768366 27093229 27856811
12158 27856811 28194396 28338620 28570107 28332365 28509031 28311749 28241257 28864795 28600101
12149 28600101 29267402 30150049 32082586 33058243 34421908 36091516 36988017 38860718 39960350
12140 39960350 41399568 42336653 44383017 45570637 47268957 49110432 51535774 54136378
$$ packed form
12205A9040557J21816j94168J24132j78402q9972L82594l6629K03852L87984m6080
12195A9715684K40658P1696N58228J63951L50115J199173p6728K50020N14393
12186B2987190L57480J63413K65160J90225J34583l09645N27454k28564o30409
12177B3456887L37365M0620p55063k64911K93258j381j50980K33573p8532M02879
12167B3513715o67313M21394N89563O01558Q50736Q00162O58551L24863P63582
12158B7856811L37585J44224K31487k37742J76666j97282p0492O23538k64694
12149B8600101O67301Q82647J932537R75657J363665J669608Q96501J872701J099632
12140C9960350J439218R37085K046364J187620J698320J841475K425342K600604
$$ plain form
12132 54136378 56801880 60465847 64190934 68212222 72333744 76096034 79066690 82204817
12124 82204817 84212371 86230508 86541244 87035408 86752974 85761306 84301286 82779266 81341607
12115 81341607 79392351 77402829 75664801 73702446 71817321 70332190 68989724 67346755
12107 67346755 65721986 63949636 63346228 62777375 62713499 62643003 62934604 62744935 63011376
12098 63011376 63077873 62783545 62718838 62241693 61382865 61363527 59913533 59365555 60086405 61001954
12088 61001954 62183748 63378553 65039834 66728509 67848823 69017992 69512125 69984827
12080 69984827 70508068 70009557 69971301 69450709 70049551 69861003 69989779 69637332 69751011
12071 69751011 68048416 66948300 65576026 64366124 62171470 59839445 58205163 56224616
$$ packed form
12132E4136378K665502L663967L725087M021288M121522L762290K970656L138127
12124H2204817K007554K018137L10736M94164k82434r91668j460020j522020j437659
12115H1341607j949256j989522j738028j962355j885125j485131j342466j642969
12107F7346755j624769j772350o03408n68853o3876p0496K91601j89669K66441
12098F3011376O6497k94328o4707m77145q58828j9338j449994n47978P20850R15549
12088F1001954J181794J194805J661281J688675J120314J169169M94133M72702
12080F9984827N23241m98511l8256n20592N98842j88548J28776l52447J13679
12071F9751011j702595j100116j372274j209902k194654k332025j634282j980547
$$ plain form
12063 56224616 54131459 52622178 51504998 50215283 49872747 48945717 48033381 47317671 46185015
12054 46185015 45300454 43936938 43057902 41846604 41079845 40140438 39664021 39262280 38306113
12045 38306113 38426699 37530864 36346652 35767183 35088978 34412081 33641500 32194876 31483294
12036 31483294 31116900 30718529 30787507 31393479 31689796 32655028 33576623 34098515 34647644
12027 34647644 35357908 35437293 34501664 33972158 33313812 31773779 30453605 28282937 27749519
12018 27749519 26652362 25942285 25042835 23982056 23252704 23079091 22546338 22216137 21394310
12009 21394310 20464755 20226246 20459329 19561387 19049395 19908429 19564992 20188005 20717975
12000 20717975 21179081 20743670 20584258 20289007 19714522 19709559 19090093 18545919 18497499 18649875
$$ packed form
12063E6224616k093157j509281j117180j289715l42536r27030r12336p15710j132656
12054D6185015q84561j363516q79036j211298p66759r39407m76417m01741r56167
12045C8306113J20586q95835j184212n79469o78205o76897p70581j446624p11582
12036C1483294l66394l98371O8978O05972K96317R65232R21595N21892N49129
12027C4647644P10264P9385r35629n29506o58346j540033j320174k170668n33418
12018B7749519j097157p10077q99450j060779p29352j73613n32753l30201q21827
12009B1394310r29555k38509K33083q97942n11992Q59034l43437O23013N29970
12000B0717975M61106m35411j59412k95251n74485m963o19466n44174m8420J52376
$$ plain form
11990 18649875 18504214 18539412 18466059 18336754 18387177 18247563 17970393 17510615 17238614 16745840
11980 16745840 15930519 15944567 15338048 15603486 15044487 14932790 14519109 14452494 13980939 13636046
11970 13636046 12730037 12966966 12276334 11827372 11657386 11363195 11646592 11081390 10885796
11961 10885796 11136204 11423392 11074755 11824079 11672031 12178072 12281631 11959318 12318838
11952 12318838 12299392 12237967 12439009 12504387 12399326 12654073 13073803 13031382 13378797 13773325
11942 13773325 14716413 14966284 15041732 16582170 15983251 16306910 16804766 17110785 17402669
11933 17402669 16861840 16990502 16437174 16233786 15731423 15845700 15319271 15136811 14622666
11924 14622666 14359121 14596260 13533820 13404948 12767516 13121006 12811455 12138208 11767180
$$ packed form
11990A8649875j45661L5198p3353j29305N0423j39614k77170m59778k72001m92774
11980A6745840q15321J4048o06519K65438n58999j11697m13681o6615m71555l44893
11970A3636046r06009K36929o90632m48962j69986k94191K83397n65202j95594
11961A0885796K50408K87188l48637P49324j52048N06041J03559l22313L59520
11952A2318838j9446o1425K01042O5378j05061K54747M19730m2421L47415L94528
11942A3773325R43088K49871P5448J540438n98919L23659M97856L06019K91884
11933A7402669n40829J28662n53328k03388n02363J14277n26429j82460n14145
11924A4622666k63545K37139j062440j28872o37432L53490l09551o73247l71028
$$ plain form
11915 11767180 11994386 11900449 12368065 13000134 16105140 23751300 31959056 37043700 39760215
11906 39760215 41463858 42730986 42382963 41415830 38907079 33622794 27209439 19359664
11898 19359664 14506991 12658304 11162880 11049380 10494052 10645390 9784355 10901059 10693855
11889 10693855 10888736 11859199 12648935 13884537 15175918 16537639 17009540 18099130 19424747
11880 19424747 19512586 19676698 19065095 18656257 17807405 16378328 15705909 14830262 13357402
11871 13357402 13299731 11495361 10508657 10635243 9704989 9238047 9315645 8824967 8548522
11862 8548522 8509623 8672801 8788661 8388640 8896260 8541695 8312889 9149867 8665866 8827774
11852 8827774 9433660 9699522 10265986 10472049 10888004 11763213 12181901 13281923 13683872
$$ packed form
11915A1767180K27206r3937M67616O32069L105006P646160Q207756N084644K716515
11906C9760215J703643J267128l48023r67133k508751n284285o413355p849775
11898A9359664m852673j848687j495424j13500n55328J51338q61035J116704k07204
11889A0693855J94881R70463P89736J235602J291381J361721M71901J089590J325617
11880A9424747Q7839J64112o11603m08838q48852j429077o72419q75647j472860
11871A3357402n7671j804370r86704J26586r30254m66942P7598m90678k76445
11862H548522l8899J63178J15860m00021N07620l54565k28806Q36978m84001J61908
11852H827774O05886K65862N66464K06063M15955Q75209M18688J100022M01949
$$ plain form
11843 13683872 14506583 14303523 14669287 14794953 14921284 14579604 14114186 13715447 13344166
11834 13344166 12967464 12092283 11964287 11894277 11884351 11557474 11667896 11681475 11215513 11028118
11824 11028118 10147001 9384698 8884233 8109433 8101371 7455110 7694489 7602094 7621638 7665396
11814 7665396 7126809 7074495 7050522 7179153 6240995 6070417 6104074 6536926 6580002 6191030
11804 6191030 6194483 5951440 5655817 6192996 6122660 6140819 5689984 6191775 5697368 5903726
11794 5903726 5703497 6402244 6619375 7075055 7802622 8268349 9141246 9400139 9565204
11785 9565204 9717136 9558174 9408735 9181125 8734018 7923884 7429020 6319723 6258021
11776 6258021 5517472 5741018 5741293 5168732 5021585 5155856 5373264 5504494 5449522 5013852
$$ packed form
11843A3683872Q22711k03060L65764J25666J26331l41680m65418l98739l71281
11834A3344166l76702q75181j27996p0010r926l26877J10422J3579m65962j87395
11824A1028118q81117p62303n00465p74800q062o46261K39379r2395J9544M3758
11814G665396n38587n2314k3973J28631r38158j70578L3657M32852M3076l88972
11804F191030L453k43043k95623N37179p0336J8159m50835N01791m94407K06358
11794E903726k00229O98747K17131M55680P27567M65727Q72897K58893J65065
11785I565204J51932j58962j49439k27610m47107q10134m94864j109297o1702
11776F258021p40549K23546K75n72561j47147J34271K17408J31230n4972m35670
$$ plain form
11766 5013852 5051725 4907092 4961354 4925667 4976871 4626084 5081915 4881490 5289131 4717337
11756 4717337 5408428 4777662 5040409 4587454 4565596 4856359 5067165 4883331 4954991 4754370
11746 4754370 5013980 4479557 4890788 4570126 4694862 4964524 4667331 4646648 4547384 4802796
11736 4802796 4994221 4627969 4436410 4468208 4416877 4538604 5050981 4748912 4755746 4993593
11726 4993593 4677504 4810421 4327512 4243362 4843470 4425597 4773856 4714133 4478877 4796846
11716 4796846 4183849 4532317 4623547 4666673 4473035 4620704 4589065 5141974 4767086 4675250
11706 4675250 4835046 4447951 4985291 4872494 4972091 4376023 4885739 5134636 4587318 4618018
11696 4618018 4998955 4608965 4748552 4630639 5003928 4150778 4382018 4657686 4379647
$$ packed form
11766E013852L7873j44633N4262l5687N1204l50787M55831k00425M07641n71794
11756D717337O91091o30766K62747m52955k1858K90763K10806j83834P1660k00621
11746D754370K59610n34423M11231l20662J24736K69662k97193k0683r9264K55412
11736D802796J91425l66252j91559L1798n1331J21727N12377l02069O834K37847
11726D993593l16089J32917m82909q4150O00108m17873L48259n9723k35256L17969
11716D796846o12997L48468R1230M3126j93638J47669l1639N52909l74888r1836
11706D675250J59796l87095N37340j12797R9597n96068N09716K48897n47318L0700
11696D618018L80937l89990J39587j17913L73289q53150K31240K75668k78039
$$ plain form
11687 4379647 5073428 4378269 4517655 4803516 4478581 4239905 4704857 5195157 4638327
11678 4638327 4837416 4855357 4647612 4246828 5058923 4703159 5017842 4608494 5087773 4975764
11668 4975764 5017414 4887570 5131023 5006146 4992181 4886210 4603808 4737235 4818810 4624466
11658 4624466 5407760 4819327 5035556 4449056 5111706 5060805 4545615 5196175 5073880 5155623
11648 5155623 4788166 5377303 5166315 5118972 5161292 4976059 4818813 5237738 5296977 4842500
11638 4842500 4517217 5063851 4684429 4659331 4875717 5140808 4970587 5172878 5085850 4733287
11628 4733287 4930005 5410770 5302707 5652512 5120475 4828061 4878370 5318854 4902469 5274471
11618 5274471 4835680 4876190 4855125 5307129 4930096 4853304 5627557 5152368 5209370 5129736
$$ packed form
11687D379647O93781o95159J39386K85861l24935k38676M64952M90300n56830
11678D638327J99089J7941k07745m00784Q12095l55764L14683m09348M79279j12009
11668D975764M1650j29844K43453j24877j3965j05971k82402J33427Q1575j94344
11658D624466P83294n88433K16229n86500O62650n0901n15190O50560j22295Q1743
11648E155623l67457N89137k10988m7343M2320j85233j57246M18925N9239m54477
11638D842500l25283N46634l79422k5098K16386K65091j70221K02291q7028l52563
11628D733287J96718M80765j08063L49805n32037k92414N0309M40484m16385L72002
11618E274471m38791M0510k1065M52004l77033p6792P74253m75189N7002p9634
$$ plain form
11608 5129736 5252381 5531819 5373966 5302771 5168332 5697746 5596562 5237667 5643402 5607148
11598 5607148 5437735 5953523 5550032 5189581 5775933 5597364 5546260 5656691 5509889 5621461
11588 5621461 5199096 5215420 5104351 5651616 4961422 5841292 5773576 5739401 5406313 5451931
11578 5451931 5376045 5108695 5623199 5314620 5787979 5927101 5611882 5592458 5760005 5744545
11568 5744545 5445513 5866319 5296288 5666907 5357000 5671242 5605604 5663908 5451506 5753989
11558 5753989 5673835 5733563 5162271 5431102 5339374 5474651 5457471 5462955 5045879 5289565
11548 5289565 5632845 5048403 5285661 5583882 5294140 5095535 5238862 5121823 5276162
11539 5276162 5332451 5502604 5299828 5466687 4979763 5359843 5092863 5100536 4818119 5156276
$$ packed form
11608E129736J22645K79438j57853p1195j34439N29414j01184l58895M05735l6254
11598E607148j69413N15788m03491l60451N86352j78569n1104J10431j46802J11572
11588E621461m22365J6324j11069N47265o90194Q79870o7716l4175l33088M5618
11578E451931p5886k67350N14504l08579M73359J39122l15219j9424J67547j5460
11568E744545k99032M20806n70031L70619l09907L14242o5638N8304k12402L02483
11558E753989q0154N9728n71292K68831r1728J35277j7180N484m17076K43686
11548E289565L43280n84442K37258K98221k89742j98605J43327j17039J54339
11539E276162N6289J70153k02776J66859m86924L80080k66980P673k82417L38157
$$ plain form
11529 5156276 4988833 5195278 5316208 5624190 5166794 5849636 5027640 5217089 5443294
11520 5443294 5189595 5426768 4887728 4983722 5338231 5648849 5464639 4829963 5315760 5577025
11510 5577025 5267372 5621529 5071334 5182641 4898761 5298022 5108477 5137299 4972469 5209113
11500 5209113 5004752 5089756 5363228 4963593 5323149 5418107 5396922 5161082 5684460 5323661
11490 5323661 5260447 5637574 5175531 5647256 5731044 5425937 5712822 5652436 5523575 5863675
11480 5863675 5651376 5728409 6022216 5213280 5311808 5357252 5314485 6109599 5616532 5481552
11470 5481552 5053224 5210804 5626424 5445076 5763685 5426562 5715147 4929172 5546187
11461 5546187 5686304 5308892 5508921 5507902 5279548 5541750 4922479 5059827 5300697 5665643
$$ packed form
11529E156276j67443K06445J20930L07982m57396O82842q21996J89449K26205
11520E443294k53699K37173n39040R5994L54509L10618j84210o34676M85797K61265
11510E577025l09653L54157n50195J11307k83880L99261j89545K8822j64830K36644
11500E209113k04361Q5004K73472l99635L59556R4958k1185k35840N23378l60799
11490E323661o3214L77127m62043M71725Q3788l05107K86885o0386j28861L40100
11480E863675k12299P7033K93807q08936R8528M5444m2767P95114m93067j34980
11470E481552m28328J57580M15620j81348L18609l37123K88585p85975O17015
11461E546187J40117l77412K00029j019k28354K62202o19271J37348K40870L64946
$$ plain form
11451 5665643 5145860 4837423 5344917 5388155 5352485 5452354 5442798 5804829 5345209 5970614
11441 5970614 5154005 5395089 5110168 5888724 5386113 5651328 6204609 5850578 5900887 5884516
11431 5884516 5857966 6164459 5826623 6109807 6107050 6423882 6592555 6036517 6605859 6657886
11421 6657886 6980925 6836961 6747328 7096597 7293062 6883887 7188191 7345682 7564303 7720312
11411 7720312 7909194 7886501 7511455 8252331 7930000 8051703 8452626 8307488 9471579
11402 9471579 9057335 8977098 9167646 9234929 9356176 9557595 9394739 9894343 10146844 10082176
11392 10082176 10320245 10970884 10487840 10786447 11503151 11095802 11188238 11237264 11194898 11203901
11382 11203901 11644252 12123595 12156713 11973638 12289090 12452437 12149545 12254935 12802569
$$ packed form
11451E665643n19783l08437N07494M3238l5670R9869r556L62031m59620O25405
11441E970614q16609K41084k84921P78556n02611K65215N53281l54031N0309j6371
11431E884516k6550L06493l37836K83184k757L16832J68673n56038N69342N2027
11421F657886L23039j43964q9633L49269J96465m09175L04304J57491K18621J56009
11411G720312J88882k2693l75046P40876l22331J21703M00923j45138J164091
11402I471579m14244q0237J90548O7283J21247K01419j62856M99604K52501o4668
11392A0082176K38069O50639m83044K98607P16704m07349R2436M9026m2366R003
11382A1203901M40351M79343L3118j83075L15452J63347l02892J05390N47634
$$ plain form
11373 12802569 12185442 12908275 12736663 12481483 12827857 12905784 12837701 13272220 13124586 13187226
11363 13187226 13334830 13330435 13237216 12866292 13344897 13328514 13372761 13789986 13284067 13671579
11353 13671579 13189305 13318351 13331277 13021163 13420434 12945028 12888421 12503481 12496463 12451708
11343 12451708 12615311 12046383 12365760 12406346 11963749 11617405 12249685 12340963 11310831
11334 11310831 11358492 11359851 11534301 10969126 11396238 11325167 10515156 10621712 10814088 10906070
11324 10906070 10309233 10026425 9996929 10192622 9928019 9549371 9615349 9548923 9372660 8916784
11314 8916784 8808514 8846789 8595108 8559734 8481252 7722496 8089845 7874149 7275110 7854896
11304 7854896 7918139 7389378 7294127 6970923 7133793 7012343 6904206 6732282 6768581 6491122
$$ packed form
11373A2802569o17127P22833j71612k55180L46374P7927o8083M34519j47634O2640
11363A3187226J47604m395r3219l70924M78605j6383M4247M17225n05919L87512
11353A3671579m82274J29046J2926l10114L99271m75406n6607l84940p018m4755
11343A2451708J63603n68928L19377M0586m42597l46344O32280R1278j030132
11334A1310831M7661J359J74450n65175M27112p1071q10011J06556J92376R1982
11324A0906070n96837k82808k9496J95693k64603l78648O5978o6426j76263m55876
11314H916784j08270L8275k51681l5374p8482p58756L67349k15696n99039N79786
11304G854896O3243n28761r5251l23204J62870j21450j08137j71924L6299k77459
$$ plain form
11294 6491122 6565394 6481897 6513898 6518013 6033943 6359471 6273856 5848283 5858070 6080600 5517857
11283 5517857 5945251 5736922 5907400 5462868 5503151 5142530 5278662 5460965 5333801 5662424
11273 5662424 5440294 5447656 5354186 5343103 5207322 5260058 5036924 4985770 5540828 5205181
11263 5205181 4859503 4804397 4945075 5133392 4834240 5197003 5307434 5158280 4797790 5294931
11253 5294931 4973175 5177841 4945136 4988261 4709850 5461332 5052420 4861395 4397671 4823230
11243 4823230 5215879 4771998 5001534 4980380 5114362 4886458 4884518 4991399 5276032 4968733
11233 4968733 4917723 5095985 4953448 5218063 5681434 6046673 5884445 7120833 8667233
11224 8667233 10726994 12341991 12703259 14027912 14585315 14536592 13746204 13425202 12125528
$$ packed form
11294F491122P4272q3497L2001M115m84070L25528q5615m25573R787K22530n62743
11283E517857M27394k08329J70478m44532M0283l60621J36132J82303j27164L28623
11273E662424k22130P362r3470j1083j35781N2736k23134n1154N55058l35647
11263E205181l45678n5106J40678J88317k99152L62763J10431j49154l60490M97141
11253E294931l21756K04666k32705M3125k78411P51482m08912j91025m63724M25559
11243D823230L92649m43881K29536k1154J33982k27904j940J06881K84633l07299
11233D968733n1010J78262j42537K64615M63371L65239j62228J236388J546400
11224H667233K059761J614997L61268J324653N57403m8723p90388l21002j299674
$$ plain form
11215 12125528 10756399 9300725 7622472 6649360 6268255 5889053 5754071 5344044 5336177
11206 5336177 5432056 5441716 5194629 5206967 5158099 5960509 5638550 5729534 6856099 7463114
11196 7463114 9250806 11079724 12716931 13393323 13720901 14386901 14462579 13798846 13469719
11187 13469719 12088516 10248791 8222623 7172230 6602637 6048936 5509498 5377794 5622136
11178 5622136 4981135 5405907 5098380 5312963 5129150 5407413 5185660 5202236 5384269 5354218
11168 5354218 5134302 5370444 5349368 5556324 5347231 5298859 5697955 5053745 5495264 5796610
11158 5796610 5424420 5555335 5963122 5245429 5137127 5152083 5698946 5147657 5150264 5284944
11148 5284944 5646383 6211241 5390817 5549551 5312439 6033894 5845720 5558033 5645319 5611751
$$ packed form
11215A2125528j369129j455674j678253r73112l81105l79202j34982m10027p867
11206E336177R5879R660k47087J2338m8868Q02410l21959R0984J126565O07015
11196G463114J787692J828918J637207O76392L27578O66000P5678o63733l29127
11187A3469719j381203j839725k026168j050393n69593n53701n39438j31704K44342
11178E622136o41001M24772l07527K14583j83813K78263k21753J6576J82033l0051
11168E354218k19916K36142k1076K06956k09093m8372L99096o44210M41519L01346
11158E796610l72190J30915M07787p17693j08302J4956N46863n51289K607J34680
11148E284944L61439N64858q20424J58734k37112P21455j88174k87687Q7286l3568
$$ plain form
11138 5611751 5675932 5794926 6030091 5795151 6174474 5909256 5893143 5757732 5856949 5947428
11128 5947428 5916477 6414940 6221667 6385971 6336484 6254426 6244743 5841835 6154871 5888201
11118 5888201 6485178 6603286 6686818 5975328 6103965 6429580 6487062 6249948 6250339 6529698
11108 6529698 6764400 6267742 6006165 6267176 6667026 6782246 6504206 6797597 6437920
11099 6437920 6354347 6827355 6420813 6417192 6637811 6992271 6371709 6345295 6387292 6049919
11089 6049919 6513755 6323356 6417492 6397719 6089126 6888633 6272991 6387187 6462236 6386603
11079 6386603 6034128 6689015 6534887 6493691 6543970 7004871 6283031 6893995 6797124 6906247
11069 6906247 6841939 7208618 7261759 6921313 7175818 7048930 7335671 7637021 7998176 7879455
$$ packed form
11138E611751O4181J18994K35165k34940L79323k65218j6113j35411R9217R0479
11128E947428l0951M98463j93273J64304m9487q2058r683m02908L13036k66670
11118E888201N96977J18108Q3532p11490J28637L25615N7482k37114L91K79359
11108F529698K34702m96658k61577K61011L99850J15220k78040K93391l59677
11099F437920q3573M73008m06542l621K20619L54460o20562k6414M1997l37373
11089F049919M63836j90399R4136j9773l08593P99507o15642J14196P5049p5633
11079F386603l52475O54887j54128m1196N0279M60901p21840O10964r6871J09123
11069F906247o4308L66679N3141l40446K54505j26888K86741L01350L61155j18721
$$ plain form
11059 7879455 7773080 8072668 8203069 8548190 8517454 7907764 8446708 8594860 8628227 8395412
11049 8395412 8812083 8386368 8517297 8969422 9120974 9294868 8975697 9464258 10026940
11040 10026940 9854417 9827907 9971503 10514920 11028747 10525189 10914078 11216953 11117157 11813882
11030 11813882 11864880 11705819 12265789 12376138 12165525 12208368 12857047 12464702 12463269 13000588
11020 13000588 12970172 13355468 13314548 13868736 13855089 13861575 14308699 14674626 15010187 15307502
11010 15307502 15702528 15968049 16641562 16368098 17074808 17192961 17299719 17857096 17690365
11001 17690365 18219747 18371852 18177655 18343374 18662979 18300115 18774733 18608632 18848852
10992 18848852 18963973 19183777 19628767 19799745 19964038 20622531 20411997 21308349 21962780
$$ packed form
11059G879455j06375K99588J30401L45121l0736o09690N38944J48152L3367k32815
11049H395412M16671m25715J30929M52125J51552J73894l19171M88561N62682
11040A0026940j72523k6510J43596N43417N13827n03558L88889L02875r9796O96725
11030A1813882N0998j59061N59970J10349k10613M2843O48679l92345j433N37319
11020A3000588l0416L85296m0920N54188j3647O486M47124L65927L35561K97315
11010A5307502L95026K65521O73513k73464P06710J18153J06758N57377j66731
11001A7690365N29382J52105j94197J65719L19605l62864M74618j66101K40220
10992A8848852J15121K19804M44990J70978J64293O58493k10534Q96352O54431
$$ plain form
10983 21962780 22571046 23482328 24631057 25064072 25581256 26241182 26363489 26725022 27079832
10974 27079832 26530952 27015827 26986405 26524976 27457385 27704842 27647430 28825832 29416045
10965 29416045 30025894 31167726 31944634 32711470 33546239 34357026 35705970 37098440 37377200
10956 37377200 38324306 39581275 40819195 41900388 41933511 43281755 43628952 43952490 44398825
10947 44398825 44563105 45048167 45109782 46029925 46513984 47714273 49066193 50106615 50978524
10938 50978524 52241170 53263413 54300276 55657329 56378240 57372768 58252711 59141106 59590082
10929 59590082 60462873 60321995 60963146 61277720 61187069 61511921 61419415 61800428 61401968 61020997
10919 61020997 61272674 60917185 60857546 60507226 59628004 59674137 59410287 60016823 59841690 60123464
$$ packed form
10983B1962780O08266R11282J148729M33015N17184O59926J22307L61533L54810
10974B7079832n48880M84875k9422m61429R32409K47457n7412J178402N90213
10965B9416045O09849J141832P76908P66836Q34769Q10787J348944J392470K78760
10956C7377200R47106J256969J237920J081193L3123J348244L47197L23538M46335
10947D4398825J64280M85062O1615R20143M84059J200289J351920J040422Q71909
10938E0978524J262646J022243J036863J357053P20911R94528Q79943Q88395M48976
10929E9590082Q72791j40878O41151L14574r0651L24852r2506L81013l98460l80971
10919F1020997K51677l55489n9639l50320q79222M6133k63850O06536j75133K81774
$$ plain form
10909 60123464 60050039 60548647 60566884 60883696 61421319 62672152 62957368 63937386 64907160
10900 64907160 65793813 67611192 68603912 70382793 72147218 74271389 76444765 79650972
10892 79650972 82664134 86156432 90669096 95594433 100663062 106677780 113704085 120315297
10884 120315297 126915885 133936431 140450839 145121324 149415401 152167345 152738750 152399970
10876 152399970 150162050 146849144 143120377 136908334 131035595 124526855 118607907 112062046
10868 112062046 105593894 99635991 94266111 88999470 83373846 78730608 74384741 69987920
10860 69987920 65311171 61241674 57704851 54166951 51497897 48524180 45621797 42701718
10852 42701718 40958750 38655318 37098064 34980357 33493825 31453136 30008392 28717005
$$ packed form
10909F0123464p3425M98608J8237L16812N37623J250833K85216R80018R69774
10900F4907160Q86653J817379R92720J778881J764425K124171K173376L206207
10892G9650972L013162L492298M512664M925337N068629O014718P026305O611212
10884A20315297O600588P020546O514408M670485M294077K751944N71405l38780
10876A52399970k237920l312906l728767o212043n872739o508740n918948o545861
10868A12062046o468152n957903n369880n266641n625624m643238m345867m396821
10860F9987920m676749m069497l536823l537900k669054k973717k902383k920079
10852D2701718j742968k303432j557254k117707j486532k040689j444744j291387
$$ plain form
10844 28717005 27992664 26469606 25470697 24243030 23351464 21939300 21776438 20820608 20339594
10835 20339594 19244864 18774243 17803264 17344130 17357122 16305697 16118582 15561576 15157045
10826 15157045 14673442 14253278 13474730 13808641 13151063 12889352 12690472 12578580 12224372
10817 12224372 11773381 11620802 11504015 11665631 11273956 11028686 10752977 10533796 10348686
10808 10348686 9974073 9356560 9629468 9486535 9340320 9185455 8747048 8862037 8725674
10799 8725674 8674915 8586261 8274102 8166588 8425111 7958423 7735043 7683622 7433404 7370648
10789 7370648 7288660 7514463 7623067 7413810 7187622 7160983 7564983 7124787 7107878 6797927
10779 6797927 6364348 6155773 6633259 6229368 6398739 6561459 6366998 5809380 5762407 5890801
$$ packed form
10844B8717005p24341j523058r98909j227667q91566j412164j62862r55830m81014
10835B0339594j094730m70621r70979m59134J2992j051425j87115n57006m04531
10826A5157045m83603m20164p78548L33911o57578k61711j98880j11892l54208
10817A2224372m50991j52579j16787J61616l91675k45270k75709k19181j85110
10808A0348686l74613o17513K72908j42933j46215j54865m38407J14989j36363
10799H725674n0759q8654l12159j07514K58523m66688k23380n1421k50218o2756
10789G370648q1988K25803J08604k09257k26188k6639M04000m40196j6909l09951
10779F797927m33579k08575M77486m03891J69371J62720j94461n57618m6973J28394
$$ plain form
10769 5890801 6174871 5621398 6240951 5748762 5742886 5801887 6139410 5622229 6052170 5667243
10759 5667243 5484073 5291628 6105634 5767379 5572432 6174608 6043872 5742302 5951542
10750 5951542 6014169 5700415 5575802 5669219 5720048 5571456 5267506 4609129 5066338 5194716
10740 5194716 4762859 4831343 4816623 4469336 4184370 4755430 4735190 5072426 4700038 4839802
10730 4839802 4771831 4967568 5226567 5672678 5037822 5137845 5356368 4859592 5076374 5074389
10720 5074389 4726471 4381692 4852374 4453593 4692490 4633977 4577580 4899285 4682318 4202696
10710 4202696 4274863 4313295 4433315 4303091 4232743 4274093 4793381 4579229 4223497 4670802
10700 4670802 4626552 4762265 4131831 3776699 4169070 4125246 4482987 4044335 4376940 4527228
$$ packed form
10769E890801K84070n53473O19553m92189n876N9001L37523n17181M29941l84927
10759E667243j83170j92445Q14006l38255j94947O02176j30736l01570K09240
10750E951542O2627l13754j24613R3417N0829j48592l03950o58377M57209J28378
10740E194716m31857O8484j4720l47287k84966N71060k0240L37236l72388J39764
10730D839802o7971J95737K58999M46111o34856J00023K18523m96776K16782j985
10720E074389l47918l44779M70682l98781K38897n8513n6397L21705k16967m79622
10710D202696P2167L8432J20020j30224p0348M1350N19288k14152l55732M47305
10700D670802m4250J35713o30434l55132L92371m3824L57741m38652L32605J50288
$$ plain form
10690 4527228 4208500 4137085 4703098 4254022 4079605 4397924 4090449 4581545 4419650 4389390
10680 4389390 4802325 4956262 4632401 5231979 5379138 5931700 5805007 6023034 5912370
10671 5912370 5580148 5592443 5378214 5276548 5102951 4832854 4559628 4178605 3663849 3873196
10661 3873196 3873173 3998360 4475636 4449159 4890841 4692108 4669144 5115277 5341295 5482337
10651 5482337 5476147 6110599 5653609 5685225 5828537 5645990 4971539 4779725 4186293 4068642
10641 4068642 3935006 3865585 3749020 3270114 2993364 3249809 3458931 3154930 3484185 3168104
10631 3168104 2607757 3399320 3157238 3232988 2832834 2955567 3187788 3022119 2920371 2846666
10621 2846666 3187462 2842879 3008121 3117828 2492982 3905613 3419918 3259134 3054662
$$ packed form
10690D527228l18728p1415N66013m49076j74417L18319l07475M91096j61895l0260
10680D389390M12935J53937l23861N99578J47159N52562j26693K18027j10664
10671E912370l32222J2295k14229j01666j73597k70097k73226l81023n14756K09347
10661C873196k3J25187M77276k6477M41682j98733k2964M46133K26018J41042
10651E482337o190O34452m56990L1616J43312j82547o74451j91814n93432j17651
10641D068642j33636o9421j16565m78906k76750K56445K09122l04001L29255l16081
10631C168104n60347P91563k42082P5750m00154J22733K32221j65669j01748p3705
10621B846666L40796l44583J65242J09707o24846J412631m85695j60784k04472
$$ plain form
10612 3054662 3193546 3295180 3229744 2682264 2865078 3100153 3230134 2980663 3467083 3106751
10602 3106751 3047843 3209361 3415825 3284399 3389322 2635756 2891990 3118061 3015097 3123085
10592 3123085 3110574 3137842 3619815 3009833 3561891 2736742 3157694 2862654 2822333 3196249
10582 3196249 2962480 2904927 2984056 3459007 3031941 2974560 3600032 2968249 3296918 3539095
10572 3539095 3774299 3466401 3411226 3158319 3444548 2976339 3412984 2829226 2933787 2808112
10562 2808112 3081332 3100661 2979439 3061236 2828933 2910653 2803077 2588913 2807016 2483043
10552 2483043 2911485 2675681 3272682 2800197 2554304 2971399 2528004 2627463 2745543 2498215
10542 2498215 2839550 2891028 2925951 3080551 2807652 2877629 2897448 2907390 2946148 3140972 2790448
$$ packed form
10612C054662J38884J01634o5436n47480J82814K35075J29981k49471M86420l60332
10602C106751n8908J61518K06464j31426J04923p53566K56234K26071j02964J07988
10592C123085j2511K7268M81973o09982N52058q25149M20952k95040m0321L73916
10582C196249k33769n7553P9129M74951m27066n7381O25472o31783L28669K42177
10572C539095K35204l07898n5175k52907K86229m68209M36645n83758J04561j25675
10562B808112K73220J9329j21222Q1797k32303Q1720j07576k14164K18103l23973
10552B483043M28442k35804N97001m72485k45893M17095m43395R9459J18080k47328
10542B498215L41335N1478L4923J54600k72899O9977J9819R942L8758J94824l50524
$$ plain form
10531 2790448 2735285 2621349 2704290 3258520 3156327 3032409 2636004 3020717 3396551 3342685
$$ packed form
10531B790448n5163j13936Q2941N54230j02193j23918l96405L84713L75834n3866
$$ [...]
##END NTUPLES=NMR SPECTRUM
##END=
