##TITLE=Coffee green (ROVE100B + 1.5mL buffer 50/50,  450uL extracto + 50uL (D2O+TMS))
without heating, vortex and centrifuged, temperature 0oC.
##JCAMPDX= 6.0         $$ Bruker NMR JCAMP-DX V2.0
##DATA TYPE= NMR SPECTRUM
##DATA CLASS= NTUPLES
##ORIGIN= Bruker BioSpin GmbH
##OWNER= Administrator
$$ 1.72 TOPSPIN		Version 2.1
$$ 2012-05-22 16:14:09.122 -0700  Administrator@X
$$ Compression mode = diff/dup
##.OBSERVE FREQUENCY= 400.13188198
##.OBSERVE NUCLEUS= ^1H
##.ACQUISITION MODE= SIMULTANEOUS (DQD)
##.ACQUISITION SCHEME= undefined
##.AVERAGES= 64
##.DIGITISER RES= 22
##SPECTROMETER/DATA SYSTEM= spect
##.PULSE SEQUENCE= noesygppr1d
##.SOLVENT NAME= H2O+D2O
##.SHIFT REFERENCE= INTERNAL, H2O+D2O, 1, 14.97969
##AUDIT TRAIL= $$ (NUMBER, WHEN, WHO, WHERE, PROCESS, VERSION, WHAT)
$$ ##TITLE= Audit trail, TOPSPIN		Version 2.1
$$ ##JCAMPDX= 5.01
$$ ##ORIGIN= Bruker BioSpin GmbH
$$ ##OWNER= Administrator
$$ $$ c:\Bruker\TOPSPIN/data/jwist/nmr/11-coffee-green-quantification-2/201/pdata/1/auditp.txt
$$ ##AUDIT TRAIL=  $$ (NUMBER, WHEN, WHO, WHERE, PROCESS, VERSION, WHAT)
(   1,<2011-11-17 18:47:23.607 -0500>,<Administrator>,<TOPSPIN>,<go>,<TOPSPIN 2.1>,
      <created by zg
	started at 2011-11-17 18:38:28.919 -0500,
	POWCHK enabled, PULCHK disabled,
       configuration hash MD5:
       DA 63 81 1B EF 4C B5 72 B4 DF EA D9 B4 DB 4C 08
       data hash MD5: 64K
       D1 87 73 9D 69 05 95 47 DC 0A DA A5 36 31 68 96>)
(   2,<2011-11-17 18:48:36.513 -0500>,<Administrator>,<TOPSPIN>,<proc1d>,<TOPSPIN 2.1>,
      <Start of raw data processing
       efp LB = 0 FT_mod = 6 PKNL = 1 PHC0 = 0 PHC1 = 0 SI = 32K 
       data hash MD5: 32K
       69 17 34 F5 56 56 81 03 B1 DE 35 D8 D3 DC 3C 53>)
(   3,<2011-11-17 18:48:36.888 -0500>,<Administrator>,<TOPSPIN>,<proc1d>,<TOPSPIN 2.1>,
      <pk PHC0 = 22.97791 PHC1 = 0 
       data hash MD5: 32K
       63 9D FD CD 9B 8F BC 6F 16 D1 DE 16 53 A1 52 5C>)
$$ ##END=
$$ 
$$ $$ hash MD5
$$ $$ B4 B9 CE DC AE 88 88 2F 35 40 42 56 35 5F 78 97
##$RELAX= 
##$RELAX= 
##$RELAX= 
##$RELAX= 
##$RELAX= 
$$ Bruker specific parameters
$$ --------------------------
##$DU= <Z:>
##$EXPNO= 201
##$NAME= <11-coffee-green-quantification-2>
##$PROCNO= 1
##$TYPE= <nmr>
##$USER= <jwist>
##$ACQT0= -8.21068234075746
##$AMP= (0..31)
100 100 100 100 100 100 100 100 100 100 100 100 100 100 100 100 100 100
100 100 100 100 100 100 100 100 100 100 100 100 100 100
##$ANAVPT= -1
##$AQSEQ= 0
##$AQ_mod= 3
##$AUNM= <au_prof>
##$AUTOPOS= <>
##$BF1= 400.13
##$BF2= 400.13
##$BF3= 400.13
##$BF4= 400.13
##$BF5= 400.13
##$BF6= 400.13
##$BF7= 400.13
##$BF8= 400.13
##$BYTORDA= 0
##$CFDGTYP= 0
##$CFRGTYP= 9
##$CHEMSTR= <none>
##$CNST= (0..63)
1 1 145 1 1 1 1 1 1 1 1 1 1 1 1 1 1 1 1 1 1 1 1 1 1 1 1 1 1 1 1 1 1 1 1
1 1 1 1 1 1 1 1 1 1 1 1 1 1 1 1 1 1 1 1 1 1 1 1 1 1 1 1 1
##$CPDPRG= <>
##$CPDPRG1= <>
##$CPDPRG2= <>
##$CPDPRG3= <>
##$CPDPRG4= <mlev>
##$CPDPRG5= <mlev>
##$CPDPRG6= <mlev>
##$CPDPRG7= <mlev>
##$CPDPRG8= <mlev>
##$CPDPRGB= <>
##$CPDPRGT= <>
##$D= (0..63)
$$ [...]
150 150 150 150 150 150 150 150
##$TP07= 0
##$TPNAME0= <>
##$TPNAME1= <>
##$TPNAME2= <>
##$TPNAME3= <>
##$TPNAME4= <>
##$TPNAME5= <>
##$TPNAME6= <>
##$TPNAME7= <>
##$TPOAL= (0..7)
0.5 0.5 0.5 0.5 0.5 0.5 0.5 0.5
##$TPOFFS= (0..7)
0 0 0 0 0 0 0 0
##$TUNHIN= 0
##$TUNHOUT= 0
##$TUNXOUT= 0
##$USERA1= <user>
##$USERA2= <user>
##$USERA3= <user>
##$USERA4= <user>
##$USERA5= <user>
##$V9= 5
##$VALIST= <valist>
##$VCLIST= <CCCCCCCCCCCCCCC>
##$VD= 0
##$VDLIST= <DDDDDDDDDDDDDDD>
##$VPLIST= <PPPPPPPPPPPPPPP>
##$VTLIST= <TTTTTTTTTTTTTTT>
##$WBST= 2048
##$WBSW= 25
##$XGAIN= (0..3)
0 0 0 0
##$XL= 0
##$YL= 0
##$YMAX_a= 5021863
##$YMIN_a= -1784602
##$ZGOPTNS= <>
##$ZL1= 120
##$ZL2= 120
##$ZL3= 120
##$ZL4= 120
##$ABSF1= 0
##$ABSF2= 0
##$ABSG= 0
##$ABSL= 0
##$ALPHA= 0
##$AQORDER= 0
##$ASSFAC= 0
##$ASSFACI= 0
##$ASSFACX= 0
##$ASSWID= 0
##$AUNMP= <proc_prof1d>
##$AXLEFT= 0
##$AXNAME= <>
##$AXNUC= <1H>
##$AXRIGHT= 0
##$AXTYPE= 0
##$AXUNIT= <>
##$AZFE= 0.1
##$AZFW= 0.1
##$BCFW= 0
##$BC_mod= 0
##$BYTORDP= 0
##$COROFFS= 0
##$CY= 15
##$DATMOD= 1
##$DC= 0
##$DFILT= <>
##$DTYPP= 0
##$F1P= 7.96369860252503
##$F2P= 6.10713083015723
##$FCOR= 0.5
##$FTSIZE= 32768
##$FT_mod= 6
##$GAMMA= 0
##$GB= 0
##$INTBC= 1
##$INTSCL= 1
##$ISEN= 128
##$LB= 0
##$LEV0= 0
##$LPBIN= 0
##$MAXI= 10000
##$MC2= 0
##$MEAN= 0
##$ME_mod= 0
##$MI= 0
##$NCOEF= 0
##$NC_proc= -7
##$NLEV= 6
##$NOISF1= 0
##$NOISF2= 0
##$NSP= 0
##$NTH_PI= 0
##$NZP= 0
##$OFFSET= 14.97969
##$PC= 1
##$PHC0= 22.97791
##$PHC1= 0
##$PH_mod= 1
##$PKNL= yes
##$PPARMOD= 0
##$PPDIAG= 0
##$PPIPTYP= 0
##$PPMPNUM= 2147483647
##$PPRESOL= 1
##$PSCAL= 0
##$PSIGN= 0
##$PYNMP= <proc.py>
##$REVERSE= no
##$SF= 400.13
##$SI= 32768
##$SIGF1= 0
##$SIGF2= 0
##$SINO= 400
##$SIOLD= 32768
##$SPECTYP= <>
##$SREGLST= <1H.CDCl3>
##$SSB= 0
##$STSI= 32768
##$STSR= 0
##$SW_p= 8223.68421052631
##$SYMM= 0
##$S_DEV= 0
##$TDeff= 65536
##$TDoff= 0
##$TI= <>
##$TILT= no
##$TM1= 0
##$TM2= 0
##$TOPLEV= 0
##$USERP1= <user>
##$USERP2= <user>
##$USERP3= <user>
##$USERP4= <user>
##$USERP5= <user>
##$WDW= 1
##$XDIM= 32768
##$YMAX_p= 383480293
##$YMIN_p= -45532411
##$CURPLOT= <Network HP LaserJet P1505>
##$CURPRIN= <$Network HP LaserJet P1505>
##$DFORMAT= <normdp>
##$LAYOUT= <+/1D_H.xwp>
##$LFORMAT= <normlp>
##$PFORMAT= <normpl>
##$SURQMSG= 1
$$ End of Bruker specific parameters
$$ ---------------------------------
##NTUPLES= NMR SPECTRUM
##VAR_NAME=  FREQUENCY,     SPECTRUM/REAL,   SPECTRUM/IMAG
##SYMBOL=    X,             R,               I
##VAR_TYPE=  INDEPENDENT,   DEPENDENT,       DEPENDENT
##VAR_FORM=  AFFN,          ASDF,            ASDF
##VAR_DIM=   32768,         32768,           32768
##UNITS=     HZ,            ARBITRARY UNITS, ARBITRARY UNITS
##FACTOR=    0.250966925370066, 1,           1
##FIRST=     8223.43324360094, 62324,        -185813
##LAST=      0,             -180316,         -538002
##MIN=       0,             -45532411,       0
##MAX=       8223.43324360094, 383480293,    0
$$ Real data points
##PAGE= N=1
##DATA TABLE= (X++(R..R)), XYDATA
$$ [...]
22996 804577 869850 876884 859156 992137 1088543 765005 648957 817665 826761 698994 990366
22985 990366 931349 712301 700257 744683 776536 593241 694247 613561 815260 954270
22975 954270 861413 885454 1251217 1079475 792210 716713 1252641 1268499 680331 1054921
22965 1054921 1162598 1009731 1111368 1390807 1085777 1036424 1417670 1003417 1440486 1191252
22955 1191252 1070540 1579053 1493261 1108135 1363798 1263687 1787908 1961486 1920775 2293870
22945 2293870 2986614 3652677 4630033 5956440 7271117 9152758 11144553 13072349 15019558
22936 15019558 17125844 19544495 21641043 22547127 23884709 24406268 24587364 24129801 23527911
22927 23527911 21852679 20304677 18310493 15618080 13989477 11749584 10343862 8463632
22919 8463632 7060613 6133244 5663117 5424068 4631389 5439108 5793772 6898007 8135348
22910 8135348 9469199 10972961 13401440 16029348 19185472 21883248 25231758 28670260
22902 28670260 31284952 34121794 35812034 38024775 38991498 39914683 39657334 38511201
22894 38511201 37322797 35262310 32413329 30093477 27499380 25597522 22066527 19358033
22886 19358033 17170124 15469091 13904571 12921629 12965787 12601294 12687782 13005964 13490326
22877 13490326 14320566 15412941 16097797 16757031 17728586 18090793 18277154 18277375 18308490 18005706
22867 18005706 17558525 16384161 15396974 14832186 13298703 11895530 10598779 9504448
22859 9504448 8187928 6999617 6446762 5618635 4796920 4338505 3851141 3327850 3199445
22850 3199445 2630357 2381479 2007658 1870396 2369407 1854365 1717562 1745852 1418449 1616656
22840 1616656 1420435 1651307 1415754 1478187 933163 1172967 1043726 1081820 1388320 1642388
22830 1642388 1161010 838601 854718 1078324 1020239 1275006 1153032 940995 1165432 1184491
22820 1184491 1156548 872139 391280 584914 813176 814968 822912 523609 906635 789785
22810 789785 964012 815237 374723 1034684 1145924 894684 807711 1058176 858574 765408
22800 765408 906455 966386 820145 1133876 1717968 756048 476751 775465 610361 386185
22790 386185 841845 567466 681519 958247 669831 307627 709795 510845 596097 731327
22780 731327 757466 757148 634688 1172325 648333 218710 576628 907710 325148 644026
22770 644026 732527 679683 385383 661968 574645 612782 799844 652439 866013 970674
22760 970674 683987 681507 471538 672603 585173 581795 831222 883228 836024 419618 347140
22749 347140 825079 446034 427091 672553 692767 156311 426298 419264 495807 876438
22739 876438 345993 798492 622017 525873 810763 709153 691847 887805 759568 -165427
22728 293000 802072 756334 877018 744867 1022677 269839 683880 396200 1085225 403300
22717 717993 683889 456762 964924 486652 501219 806575 841194 898552 739621 402234
22707 402234 627610 576986 912835 645695 1233917 663298 625173 536812 186979 761597
22697 761597 143376 444573 253486 318310 335327 963342 689369 531926 173928 831414
22687 831414 898160 605360 439500 646040 921183 757714 714054 489780 690798 911585
22677 911585 598896 485899 474476 398255 896156 646167 593707 1177859 671431 176574
22666 664294 157054 725104 1029436 1069789 834372 813609 405139 712193 794070 724076
22656 724076 1021259 772287 544738 935689 335339 391830 196583 457102 586473 926400
22646 926400 746700 761729 305592 501883 556870 401047 634431 465419 1016017 1011315
22636 1011315 955177 613127 688192 593324 611946 176341 754335 953837 745852 533355
22626 533355 424650 557732 538285 847358 869834 768898 857485 743389 706678 823746
22616 823746 617637 773137 776453 482038 739328 692025 772002 787081 828860 796161 968265
22605 968265 1089856 856459 1014830 702229 876644 909885 505976 453600 603569 876290
22595 876290 945402 895673 1146454 1458147 925628 822138 1434540 846785 1623980 1143277
22585 1143277 1158945 1159622 1370515 919782 978218 1010192 1005081 1187713 959873 966240 918193
22574 918193 1247418 522774 890104 1198829 875472 793047 817431 488065 862551 1167930
22564 1167930 893699 451697 472789 820545 774928 1305428 971459 813917 873871 1130839
22554 1130839 931514 1068039 1056688 1106824 822511 1263186 939517 941071 838343 1232920
22544 1232920 1163497 747083 1028398 406411 1062092 1307461 851815 1143598 1190775 912960
22534 912960 734496 1181481 792461 838685 958557 560572 1133240 295252 815164 1245258
22524 1245258 1031162 626147 900199 757148 659065 868110 258527 836223 899474 719228
22514 719228 936313 766063 1211845 1082358 659754 1204488 733213 1110921 810220 1452720
22504 1452720 1072323 1107282 1491658 817184 683574 1258590 996315 964146 1468715 931436
22494 931436 1016633 1007142 1078906 909166 1107427 1329143 1092382 1538115 923554 1002956
22484 1002956 1043145 1222019 1263644 847262 943160 1072684 1028547 1135314 1014558 501750
22473 1082906 778485 665113 879177 1126857 926017 669839 1041525 592231 1010130
22464 1010130 911968 1113969 1127336 1297251 1103189 819241 769249 692266 718597 425470
22454 425470 813312 829993 1103363 1103320 927746 848697 1068912 895352 663514 1153075 874872
22443 874872 1102682 618171 655864 457263 1108815 893591 1036255 450591 1073372 1230228
22433 1230228 969696 1163368 209548 780594 1137776 861893 1164422 612432 1078856
22424 1078856 1379686 1009351 1080033 1000401 1055418 1079243 819109 832999 982344 1225876
22414 1225876 626568 1029732 1052132 694859 765535 815638 1282591 1361133 964577 1011980
22404 1011980 1148344 661804 1158482 1221509 1239160 1072994 1091938 800604 951748 813671
22394 813671 1234851 965724 1336487 993629 1094159 1157500 795004 1180900 730091 584016
22384 584016 1004397 1063188 912534 1143386 1415010 1183925 1073079 1035800 1091490 1230183
22374 1230183 1091114 778951 842582 978900 1052096 815365 1515252 773140 828804 572161
22364 572161 1223378 718680 916462 1063210 862576 698465 1238503 759272 873526 475087
22354 475087 1154480 966554 964186 923823 883874 1095835 1136178 1159857 676137 1374578 1080974
22343 1080974 1591601 1142982 822948 677453 826266 1315865 1123061 363747 1193687
22334 1193687 1050317 1033342 1543971 2253375 2081064 2062110 2091095 2014326 2676969 2408462
22324 2408462 2506202 2357247 2317409 2304586 1739685 1290869 1060441 1592069 1339597 768929
22314 768929 1234688 1320573 1110374 1346911 1565694 1334485 1166799 1543582 998994 1378784
22304 1378784 1131629 1368414 1409800 1150871 1602032 1188888 1167583 1263822 1141095 1246752
22294 1246752 1360643 1303895 1070350 1584757 1187438 1197564 1366735 1259797 1062693 1212430
22284 1212430 1286893 868684 1515953 1489616 1495223 1166698 1145813 1257802 1210255 1645339
22274 1645339 1547761 1606423 1805515 1326839 1254909 1440249 1814991 1363874 1387333 1547100
22264 1547100 1798064 1235367 1458926 1504172 1794351 1334186 1349898 1215259 1510615 1356510
22254 1356510 1182774 1534859 975285 1701521 1363981 1446711 1244937 1361171 1474418 1418293
22244 1418293 1333503 993714 1931802 1731476 1741094 1387031 1766234 1541971 1619746 1665472
22234 1665472 1347049 1742168 1822997 1502912 1530805 1580377 1788522 1722859 1832574 1750055
22224 1750055 1789292 1486694 1845668 1259821 1590218 1161643 1109353 1189242 1755333 1856653
22214 1856653 1516485 1253720 1296786 1872544 1237747 1600502 1430154 1313077 1485318 984409
22204 984409 1708331 1407532 757240 1196434 878741 1540662 1019914 1312808 1662483 857384
22194 857384 1564398 1483824 991856 1517296 1158208 1417915 1319370 1051120 827823 1174446
22184 1174446 1516206 1489689 1647270 983699 1397733 1383988 1320446 1534178 1588349 1764174
22174 1764174 1338453 1373889 1486308 1260075 1546010 1460476 1234572 1708760 1275430 1387418
22164 1387418 1386729 1476545 1578988 1442034 1534556 1331600 1245239 1348270 1457124 1141282
22154 1141282 1337654 1144521 1255147 970459 1150407 795761 1398987 1484862 1313726 1439147
22144 1439147 1515427 1137111 1230120 1464258 1460585 1623043 1202650 1584012 1427724 1577636
22134 1577636 1713537 1274027 1013180 1376304 1219792 1578696 1206745 939579 1385142
22125 1385142 1547482 1523527 1034042 1096179 1191114 1289989 1476728 1277593 1430772 1405943
22115 1405943 1417979 1062022 1424357 1470007 1025940 1450768 927437 1390454 1192533 1601748
22105 1601748 1226070 1378919 940430 1590550 1448467 1485447 1176878 1283359 1528940 950114
22095 950114 1598988 1315228 1479878 1417316 1082893 1551660 1853602 1439029 1401638 1516531
22085 1516531 1607976 1239105 1352285 1414267 1267709 1409680 1255341 1401761 1644482 1340437
22075 1340437 1568218 1361504 1398733 1549993 1266474 1464412 1539514 1447148 1770481 1781456
22065 1781456 2037401 1628107 2047173 1496833 1073645 1690084 1589646 1424242 1498336 1841147
22055 1841147 1964256 1841703 1671798 1758971 1400201 1947612 2123380 1427282 1639237 1508650
22045 1508650 1989829 1569256 1603589 1441425 2023866 1950414 1686326 1396842 1305500 1545267
22035 1545267 1835749 1771345 1652554 1714562 1702990 1725543 1529257 1575706 2016300 1555997
22025 1555997 1713349 1451762 1643326 1198682 1499445 1863149 1661904 2182601 2276757 1797367
22015 1797367 1486599 2109565 1869176 1881260 1987779 1582275 1567630 2086456 1871247 1423399
22005 1423399 1991923 1816064 1650311 1661459 1988533 1568008 1543140 1292055 1874665 1218401
21995 1218401 1554496 1658471 1716372 1905823 1848177 1552206 1174324 1949020 1599482 1812618
21985 1812618 1675440 1730261 2146832 1965571 1728592 1731033 1812626 1868959 1788360 1398326
21975 1398326 1838585 1734658 1947349 1434900 1888755 1666349 1764605 1366900 1714162 1593151
21965 1593151 1954639 1928667 1744087 1657179 1818547 1953898 1868128 1741729 1805518 1838657
21955 1838657 1456407 1488309 1762851 1562162 1560160 2154492 1882774 1664118 1495837 1692095
21945 1692095 1829773 1566803 1460815 1731570 2008369 1511396 1426802 2226367 1870349 1506143
21935 1506143 1484234 1711213 1682525 1839227 1308567 1466580 2007933 1586711 1640623 1557193
21925 1557193 1764113 1599593 1762581 2163674 2352885 1377508 1259000 1795465 1686041
21916 1686041 1881194 1320320 1375675 1461593 1637683 1805216 1572897 1899800 1850385 2355324
21906 2355324 1358720 1635598 2116864 1848456 1839173 1693133 1841703 1833444 1126561 1680087
21896 1680087 1731221 1836361 1572902 1383395 1683374 1944064 1540037 1987375 1636802 1592834
21886 1592834 1869041 1452637 1797348 1453851 1766535 1607085 1926304 1858899 1661978 1690768
21876 1690768 2077616 1829172 1935852 1814129 1536302 1715319 2043369 1680844 1664206 1462259
21866 1462259 2030195 1759730 1747602 2064693 1860675 1831733 1444903 2177605 2410230 1755281
21856 1755281 1739714 1977894 1921097 1518391 1915124 1610849 1762444 1764654 1508159 1763889
21846 1763889 1557194 1238927 1700077 1687706 1734415 1926771 1521324 1792920 1606392 1492015
21836 1492015 1622295 1016728 1712543 1666097 1506966 1737441 1461419 2042590 1572064 1491901
21826 1491901 1889722 1304424 1506546 1521356 1952077 1801594 1479534 1886026 2086569 1395626
21816 1395626 1651901 736625 1373348 1735648 1639287 1979114 1291701 1635156 1424917 1781815
21806 1781815 1462094 1838648 1943567 1530957 1778901 1617697 1423668 1658455 1854532
21797 1854532 1695719 1276591 1203691 1176034 1365502 1536664 1728029 1219008 1949574 1550454
21787 1550454 1789415 1102814 1660333 1328976 1457866 1655250 1577020 1597170 1439746 1854911
21777 1854911 1717689 1454238 1812559 1306999 1615918 1543276 1515060 1772569 1493216 1657674
21767 1657674 1438210 1331049 1869163 1968380 1837731 1791488 1667918 2211186 1818265 1842613
21757 1842613 2237588 1750856 2108509 2438355 1837856 2570947 2479564 2395274 2398127 2353332
21747 2353332 2080645 2861254 2760183 3212313 3407510 3389735 4104146 4391391 4786338 5215595
21737 5215595 6240015 7181427 7878358 8948207 9616466 10970799 11620006 12000970 12880243
21728 12880243 12687113 12998880 12536722 12006753 11466849 10835998 9816129 9159665 8607759
21719 8607759 7979698 7877370 7817012 7957651 8083505 8430158 9363818 9801676 10499725 11098558
21709 11098558 12096576 13547435 14769509 15475894 16296036 17576039 17852119 18892349 19054453
21700 19054453 18978724 18942701 18622313 17951421 17167015 16422474 15462627 13751798 12937668
21691 12937668 12286753 10506677 9532960 8986232 8545867 7513332 7788318 7428094 6971416
21682 6971416 7497671 8173472 8298207 9434975 9971996 9433440 10640003 11644452 11637988
21673 11637988 12003988 12184283 11957935 11650547 11409977 10111214 9143572 7897740 7736187
21664 7736187 6700788 5864584 5720427 4594892 4519314 3795110 3567215 3508657 3087102
21655 3087102 2998498 2620550 2981706 2838441 2695285 2713392 2918654 2577421 2472368 2603777
21645 2603777 2026858 1982500 2257547 2365501 2010553 2220820 1994924 1567512 2734165
21636 2734165 1952559 2104981 2063895 1817236 1837911 1918918 2176196 2015612 1979275 1988579
21626 1988579 1604163 1297341 1872896 1661745 2004313 1525779 1533450 1767058 1928270 1695168
21616 1695168 2037782 1800613 1658444 1843231 1955497 1921258 1180805 1622814 1857788 1605593
21606 1605593 1337367 1699946 1876552 1755918 2077808 1639340 1274223 1273286 2175220 1528165
21596 1528165 1378430 1192352 1404663 1730201 1772372 1736175 1366237 2173766 1717076 1517252
21586 1517252 1808174 1839954 1459264 2095428 1286393 1709338 1578527 2027733 1802602 1296051
21576 1296051 1553706 1671096 1470212 1689030 1537078 1651029 1796934 1700127 1720187 1367902
21566 1367902 1581146 1513490 1375268 1576732 1212637 1494223 1686479 1403085 1782538 1598885
21556 1598885 1712699 1605571 1801932 1664152 1649522 1473011 1073789 1909860 2463516 1779796
21546 1779796 1659019 1353189 1847270 1610293 1616603 1785635 1792369 1501872 1696712 2043441
21536 2043441 2096258 1454653 1656303 1525222 1812882 2081933 1938877 1884582 2082991 1189833
21526 1189833 1522229 1984868 2207421 1617053 1699833 1732470 1892099 2067187 2294278 2336823
21516 2336823 2301447 2305448 2480811 2361807 2094988 2174552 2092288 1973476 1591560 2377315
21506 2377315 1952510 2001075 1952324 2062770 1823506 1978894 1836784 1419910 1468484 1718432
21496 1718432 1772857 2134888 1972627 1876638 2070482 2083241 1926343 1961725 2293084 2148873
21486 2148873 1861513 2070284 2114508 2201171 1857626 1820250 1918129 2341791 2283940 2485618
21476 2485618 1921129 1925584 2061902 2177538 2050798 2059041 2711539 1616089 2340813 2380884
21466 2380884 1396021 2378968 2280631 2095429 2255214 2200070 2427568 1576116 1757466 1714033
21456 1714033 1706700 1872988 1728671 2036373 2253320 2222469 2124018 1593074 2069330 2017470
21446 2017470 2366775 1836470 1758871 1924861 1712626 1821685 2147471 1983069 2072830 1660901
21436 1660901 2051613 2294244 2355689 1914051 2087619 1928896 2091930 2018822 2330606 1679461
21426 1679461 1992754 2054159 1940467 1865133 1903229 2297649 2429035 2144681 1617258 2287992
21416 2287992 1810622 1831092 1452501 2207172 1798800 1858990 1264106 1971116 1793248 2089400
21406 2089400 1639845 2097888 1885263 1763791 1958592 1998104 2007928 1766101 2085736 2022095
21396 2022095 1798116 1572966 1606859 1515234 1680159 2213320 2073619 1813304 2384324 1663937
21386 1663937 1999908 1980061 1930868 1957503 1878050 2020579 2175287 2130027 1783636 2203220
21376 2203220 1957832 2060951 1943231 2086939 2103613 2707436 2177409 2547284 1844680 2006364
21366 2006364 1814551 1883491 2679944 2167777 2141749 1881838 2306674 1933021 2430646 2514545
21356 2514545 2012480 2454991 2375230 1843623 2386354 2130078 1689538 2061407 2306651 2236505
21346 2236505 2889452 2477846 1987245 2170679 2534087 2364226 2291231 2209393 2336921 2331563
21336 2331563 1904984 2383700 2427351 2108598 2675811 2497902 2547336 2860538 2722484 2989270
21326 2989270 2670846 2230844 3065101 2569461 2732050 2547508 2638422 2530473 3170420 2679115
21316 2679115 2660117 2581231 3173324 3096551 2850291 2586083 2928261 2893574 2717700 2585240
21306 2585240 3057281 3519828 3157141 3281049 3653984 3347114 3462098 3160892 3616811
21297 3616811 3547890 3784363 3818736 3709847 4152012 4019494 4053730 4147466 3980143 4774798
21287 4774798 4531351 4496011 4818138 5045438 5407277 5654992 5878359 5666760 5502213 5711224
21277 5711224 6269468 6501545 7068906 7204676 7465217 7924436 8363767 8828900 9187634
21268 9187634 9692223 10505517 11389723 12265096 12978098 14071614 15213539 15899938 17538244
21259 17538244 19045189 20707065 22943681 24572871 26703973 29632175 32571973 34986130
21251 34986130 38250407 41530364 44088190 47750515 50150246 52642209 54063510 55170772
21243 55170772 55203715 55251112 54215221 52580067 50850459 47581982 44701536 42279057 38531111
21234 38531111 35429795 32355685 29039144 26970376 25043254 22542734 20385151 18597371
21226 18597371 17175468 15598303 14584581 13747775 11975131 11802102 10786603 9852197
21218 9852197 10104040 9220635 9020786 8252618 7739155 7639001 7184044 6484032 6738660
21209 6738660 6551956 6536538 6254529 5635151 5547496 5207701 5158630 5068273 5065078 4824514
21199 4824514 4813471 4459637 4540847 3912259 4220496 3623732 3469333 3447418 3550058 3530529
21189 3530529 3568168 3429286 3427748 3475344 2895592 3041077 3285476 3344972 3190535 2908777
21179 2908777 2970401 3006598 2915366 2558798 3138386 2551017 2351942 2522957 2652119 2855894
21169 2855894 3095721 2852030 2643549 2630507 2257916 2229382 2753859 2306713 2647480 2948220
21159 2948220 2828718 2641252 2707338 2543839 2726296 2713870 2511630 2996164 2768292 2806722
21149 2806722 2324850 2466350 2510980 2469667 2365529 2757665 2774665 2525883 2807573 2967695
21139 2967695 2854995 2660655 2989917 2672110 2954385 2396738 2491986 2740324 2947334 2616709
21129 2616709 2461877 2394055 2879232 2105926 2676006 2696543 2500490 2858889 3111140 2623190
21119 2623190 2699310 2502989 2522735 2496307 2461517 2056704 1972281 2323509 2680422 1945479
21109 1945479 2125417 1911595 2364752 2008500 2031906 2353889 2080077 2055781 1788708 2450048
21099 2450048 2402086 2523263 2360117 2516913 2563230 2066252 2497901 2422182 2582270 2535574
21089 2535574 2596793 2678726 2223168 2800917 3072368 2935939 2697409 2532911 3087278 3310460
21079 3310460 2769236 2707924 2865150 3272122 3099254 3224737 2866006 2520166 2748221 2641426
21069 2641426 2865064 2632772 3158792 2648644 2557773 2646444 3493492 2659928 2539647 3078530
21059 3078530 2791406 3423084 3189494 2951374 3115563 3301729 2885392 3600225 4228490
21050 4228490 4349304 4388507 3751789 4537435 4638097 4634063 4595867 5054491 4938435 4348499
21040 4348499 4356969 4022125 3646857 3506031 3416644 3828607 3670803 2850967 3208412 2620792
21030 2620792 3573269 3055899 3065006 2951032 2892875 2975689 2995160 3032941 2803849 2848779 3149900
21019 3149900 2805651 3020905 2593276 2866764 3001035 3227404 2792214 3209137 2418358
21010 2418358 3398514 3047216 3120889 2628288 3007092 2980554 2893288 3172488 3619257 3258728
21000 3258728 3643279 4160459 4618689 4209719 5011904 6500273 7319715 8212703 8835632
20991 8835632 9701754 10662652 11178537 11375008 11025249 10879778 10333166 9960508 9091599
20982 9091599 8557169 8004913 7935061 7484420 7370970 6909892 6702586 6601502 5857920 5790918
20972 5790918 5419707 4962955 4916538 4495401 5007206 4740063 4934072 4892530 5288504 5572122
20962 5572122 5859155 6188383 6564291 8323693 9356718 10963741 12063233 13266766 14320205
20953 14320205 14973177 15352025 15612773 15377451 14683807 13321739 12060328 10830365 9025771
20944 9025771 7692641 7450290 6434307 6316370 5906388 5995135 5815006 5771766 6195401
20935 6195401 6300904 6600538 7336259 8266564 8536118 9874727 10859422 11987071 13211370
20926 13211370 13812489 14743491 16032609 16721604 16753030 17466873 16419287 16231673 15337265
20917 15337265 14956764 14357439 13347714 12867119 12572797 12112040 11481096 11963465 12929907
20908 12929907 14482471 15527578 18859407 21898560 25813449 30172011 34075007 37743085
20900 37743085 40688040 43240558 44976123 45913676 45842614 44299005 41885433 38958513
20892 38958513 35537704 32203744 29923777 26960461 25499338 23399076 21854465 19766924
20884 19766924 17673591 15369805 13100514 11215129 9737094 8585826 7541067 6923520
20876 6923520 6825766 6411435 6114726 5737087 6072026 5991310 5579770 5718777 5557169 5481306
20866 5481306 5603324 5812877 6002170 6463625 7479293 8407000 8834954 9819025 10517412
20857 10517412 11179041 11488413 12389015 12342572 12344581 12714533 11904615 11413521 10959995 10779235
20847 10779235 10842805 11611545 12614329 14591617 16935529 19370860 24337001 27968341
20839 27968341 31819871 36236233 39973323 42391361 43833621 44652137 43831804 42033322
20831 42033322 38634793 34556172 29943212 24885647 20133121 16997963 14222764 11919075
20823 11919075 10926904 9805103 8826685 7824389 7447098 7068776 6212203 6366340 5473278
20814 5473278 5538052 5257430 5346060 4755759 4849989 4804740 4847203 3914727 4194288 4730336
20804 4730336 4428642 4007543 3813318 3893237 3730762 3878305 3999805 3567850 3530877 3540597
20794 3540597 3983621 3291330 3615107 4089865 3628940 3144874 3573455 3302816 3771298
20785 3771298 3691304 3650607 3603894 3638923 3704922 4105990 3603518 3906332 4236608 3619164
20775 3619164 3844061 4208089 3734409 4531372 4050658 3614712 3588635 3921673 3381103 3566456
20765 3566456 3354665 3011809 3130754 3387588 3439882 3043039 2615222 2977654 3009638 2755593
20755 2755593 2546652 3095539 3297828 2704011 2736504 3231874 3071579 3108651 3169305 3545736
20745 3545736 3447696 3553992 4047471 3889256 3796484 3729949 3910063 4378853 3778734 3471973
20735 3471973 3584289 3507420 3316689 2944592 3320244 3422069 3341150 2896577 2834258 2897751
20725 2897751 3204222 2570188 2706496 2696707 2923478 2658706 2882225 3395333 2839628 2822906
20715 2822906 2843874 2695170 3072345 2744782 2914130 2880661 2868163 2580541 2583627 3339386
20705 3339386 3422892 2949101 3140615 2996285 3478041 3668826 3311259 3634467 3564110 3058217
20695 3058217 3436373 3720875 3361171 3701852 3934932 3918151 3575001 3561267 3054540 3697264
20685 3697264 3851708 3974045 3640858 3720449 3830596 4065964 4305494 3786915 4219871 4317755
20675 4317755 3843991 4468178 4968120 4653231 4442545 5053192 4712299 5130643 5130024 5468461
20665 5468461 5468124 5286422 5234730 5160618 4959734 4783094 4403430 4873390 4161287 4145298
20655 4145298 4303165 3911808 3682284 3916302 3444772 3688207 3891616 4033480 4504642
20646 4504642 4040981 4138206 4081105 4243949 4038354 4426085 4627594 4777103 5188197 5090489
20636 5090489 4786726 4764976 4731271 4730053 4944906 4231650 3970538 3339744 4144891 3793190
20626 3793190 3613601 3336715 3834344 2990182 3429457 3756736 3422204 3525246 3287806
20617 3287806 3587739 4091601 4248862 3773775 4156385 4050840 4266399 4199970 4233760 4285439
20607 4285439 4343883 4190715 3941655 4351732 4356529 4453402 3887827 4003729 4157075 3748006
20597 3748006 3896018 3757583 3819332 3482655 3277849 3383078 3484013 3677812 3443278 3748230
20587 3748230 3696650 3364132 3677523 3613296 3880743 3734791 3840482 4408086 4391010 3720471
20577 3720471 4202433 4183900 3943888 3740408 4140450 4136839 3657910 3937391 3545314 3507250
20567 3507250 3507982 3449650 3556598 3055552 3110040 3010656 2900079 3358759 3217527 3418532
20557 3418532 2809723 3207898 3235080 3214293 3659925 3130370 3474704 2958814 3527859 3618875
20547 3618875 3393041 3479176 3414510 3380971 3861935 3423523 3595771 3307491 3392752 3203467
20537 3203467 2976410 3407684 3346225 3736652 3631033 3556709 3891192 4133972 4146369 4616544
20527 4616544 4244945 4979511 5080283 5324447 5729528 5462166 5726682 5351865 4965575
20518 4965575 4990593 4955052 4921857 4821626 4475086 4358478 3922161 3538632 3433437 3996726
20508 3996726 3589593 3673733 3079886 3926325 3572195 4183101 3593838 4094520 3812178 4088661
20498 4088661 4354847 4399579 4978165 4597870 4238924 4540293 5183555 5010909 5218584 4718140
20488 4718140 4363704 4548980 4184649 3967256 3997846 3808102 3717622 3790480 3524193 3313371
20478 3313371 3180268 3218421 3398669 3471452 3783330 3139483 3568490 3131382 3387847 3527796
20468 3527796 3185840 4343797 3914314 3875117 4116675 3869244 3800043 4203727 4539282 4048477
20458 4048477 4290693 4042017 4645550 4204434 4683879 4231342 4492724 3752288 3458450
20449 3458450 4139215 4330919 4074946 4301203 3771744 3773767 3853059 4114496 3688044 4110487
20439 4110487 3927268 3927186 3558892 3997292 3687989 3803036 3951651 4026548 4093357 3999543 3734960
20428 3734960 3570207 3407645 3833515 3481762 3523268 3726716 3808365 3869399 3526405 4118548
20418 4118548 3720375 3670828 4017533 3912839 3859192 4139343 4004574 3940897 4332634 4099889
20408 4099889 3973815 4226676 4146388 4052698 3680355 3944188 4092504 4122478 4190407 3706250
20398 3706250 3566980 3267798 3910781 3995364 4024229 4096397 4047093 4226375 3679425 3595460
20388 3595460 4271406 3455455 3866633 3356296 3620036 3168881 3316654 3520711 3490413 3615921
20378 3615921 3115027 3540887 3645112 4010445 3987255 3447477 3399993 3908504 4456765 4488076
20368 4488076 4211050 4008623 4632960 4046914 3964862 3969004 4109943 3959902 4014744 3853546
20358 3853546 3419831 3815867 3846965 4488059 3284632 4059645 3302988 3789576 3130522
20349 3130522 3564636 3441899 3808672 3950566 3364392 4164448 3731191 3895213 3729800
20340 3729800 4303952 4439978 4216973 3770822 4488861 4162979 4230685 4241848 4328596 3903342
20330 3903342 4367956 4354003 3740579 3936982 3570907 3726534 3763861 4000386 3177149 3896336
20320 3896336 3878494 4001139 3795550 3739579 3371553 3704388 3651720 3680063 3788149 3918379
20310 3918379 3682675 3972131 3255997 3845938 3892722 3900305 3984866 3741784 3673281 4649676
20300 4649676 4143372 4619897 4627827 4702083 4855245 4658314 4923090 4723541 4899572 4703088
20290 4703088 4435060 4928570 4594223 4394819 4532900 4303318 4083409 4256176 4429660
20281 4429660 4458788 4788877 4755231 4999517 4767870 4930720 5455867 5776551 6162494 5771611
20271 5771611 5926597 6470685 6197193 6366834 7018864 6940771 6524198 7287713 7697716 7260526
20261 7260526 7644554 7313710 7240158 8327354 7797781 7725542 7366177 7147579 7219068 6799849
20251 6799849 6682686 6980066 6794273 6922780 6126442 5927885 5763279 5647159 5639794 5554172
20241 5554172 5448054 5489383 5438187 5009740 5255124 5917140 6151594 6515322 5889402 5877964
20231 5877964 5956772 6610835 6213562 6920637 6556595 6629540 6881949 6710751 6586507 6348783
20221 6348783 7114188 7602444 8090223 8696639 9524763 10900372 11942357 12916817 14234083
20212 14234083 15470007 16774813 18163040 19015126 19938966 21457270 22140267 22387148 21886441
20203 21886441 21610585 20557173 20030279 19354696 18106056 16936739 15214018 12865593
20195 12865593 12032828 10617003 8977652 8279416 7792347 7198505 6951028 6810239 5935931
20186 5935931 5787243 5913759 5445292 5336024 5721401 5355221 5251198 5224983 5312440 5515941
20176 5515941 5295895 5664604 5646817 5912343 5675138 6084005 5929464 6236303 6526827 6917651
20166 6917651 6962673 7556020 8535368 9475337 10598817 11891768 13758493 15562280 17293258
20157 17293258 18897386 20352868 21702410 22601902 23804330 25637953 25865988 26257207
20149 26257207 25827419 25295204 24910351 24481465 23659719 22230000 20762237 18591450 17105244
20140 17105244 15247770 13366067 12530781 11357392 11010126 10634402 9887134 9791674 9672925
20131 9672925 9664001 9789302 10288808 11097336 11247601 11784949 12114638 12821950 13782955 15176583
20121 15176583 16505500 17769675 19480588 21975957 24634142 27763988 31013841 34519516
20113 34519516 38719048 42660846 46462769 49351828 53131920 56266255 59466572 61855880
20105 61855880 63246867 63879963 64032081 62698209 61594595 59933436 57677937 54670619
20097 54670619 51227039 46477582 42404333 37921953 34199523 30506948 27747516 25046289
20089 25046289 22425467 20974829 19014953 17597907 16368740 15309918 14913199 13890524
20081 13890524 13835829 13341516 13533830 13435140 13783343 14234023 14629486 15720586 16277402
20072 16277402 17562312 18621575 19956490 20644017 21654765 22660584 23300416 23868435
20064 23868435 24623629 24204333 22973821 23223934 22457054 21793313 20621410 19707044 18829535
20055 18829535 17441814 16040662 14671224 13444633 12215837 11748352 11746163 10835718 10545130
20046 10545130 10060172 9616872 9945759 10914626 11114863 11357141 12672625 12745341 13953224
20037 13953224 14706374 15714303 17151493 17925483 19003729 20030507 20340649 21696882
20029 21696882 22790239 24378723 26054461 27576508 29318179 30191844 31718288 32589493
20021 32589493 33318141 34319440 34891540 34829344 34389391 33611296 32551271 31274783 29883861
20012 29883861 28491900 26888319 25505507 23479047 21671116 20316577 18949486 16943709
20004 16943709 15819484 15289252 14638222 13818692 14020296 14571744 14893669 15777374 17554187
19995 17554187 18833935 20836806 23076705 25443622 27207894 29798618 31994955 34095507
19987 34095507 35534678 37147355 37962559 38233275 38104669 36896713 35334199 34447039 32856460
19978 32856460 30854941 28527098 26224199 23993592 21433019 18686190 16000606 14398827
19970 14398827 12620247 11251147 10291645 9555154 8509723 8778308 7620415 7824378 7324234
19961 7324234 7170984 6712059 6712068 6925889 7110982 6554453 6146189 6117598 6001448 5928170 5749601
19950 5749601 5587298 5721372 5631185 5484118 5611486 5237772 5458614 5522472 5475984 5327647
19940 5327647 5379571 5159427 5628588 5875314 5800177 5597867 5497472 5381372 5209443 5663615
19930 5663615 5846947 5401237 5410154 5873019 6137338 5359083 5881108 5454242 5497427 5606812
19920 5606812 5268286 5574295 5158229 5423445 5645448 5352619 5084242 5348977 5285146 5492875
19910 5492875 5276782 4779559 4852549 4914530 4557563 5153487 4801817 4687944 4292780 4956544
19900 4956544 5013874 4930308 4930091 4678571 5598634 5107057 5502372 5140490 5269391 4836454
19890 4836454 5327844 5876298 5041130 5477117 5714462 5585819 5535823 5247306 5730264 5603410
19880 5603410 5612231 5823760 5976260 5528548 5847141 5717244 5419856 5822306 5834065 6271297
19870 6271297 5624917 6320307 6076320 6313306 6525208 6099894 6388378 6096323 6779491
19861 6779491 6343566 6732701 6667027 6519071 6636529 6893005 6781165 6689951 6714937 6534857
19851 6534857 7319539 6648838 6735448 6532745 6821503 6816134 7106411 7208165 7418995 7311767
19841 7311767 7353313 7832809 7473429 7365587 7377382 7796575 7788988 8302467 7688189 8529806
19831 8529806 8353870 8399636 8589302 8521085 9007646 8814444 9526366 9333435 9729746 10026251
19821 10026251 9975453 10599179 11144143 11218773 11653097 11742564 12779393 13675693 14651376 15471834
19811 15471834 16836599 18472278 20429242 21638597 22876400 24551766 25984485 26768243
19803 26768243 28417507 28870911 29357688 30658224 31324794 32234911 34757968 36811800 39038455
19794 39038455 41218239 44252687 47034661 48881546 50826822 51969045 52175551 51218919
19786 51218919 50399513 48804614 46759279 44542192 42321245 40222234 38480567 37764846
19778 37764846 37455908 36132509 35816696 35180956 34833557 33956102 33198005 32740256 32050794
19769 32050794 31150388 31016359 30857259 30398428 31012113 31679266 33165841 33946252 36139420
19760 36139420 37843672 38920660 40773961 41195283 40906902 40929062 40144936 38815245 37267184
19751 37267184 35114130 33416525 30582510 29275261 27316007 25669263 24276819 22557506
19743 22557506 21397211 19951054 18169295 16685605 15906784 13981033 13124294 12180055
19735 12180055 11778953 11340050 10947812 10061306 10317437 9470282 9385191 8957753 8671316
19726 8671316 8235541 8513617 7864922 7636822 7611304 7609218 7821909 7211089 7560628 7147324
19716 7147324 6774046 6868397 7037826 6706853 6790593 7118921 7280921 6478341 6540910 6640880
19706 6640880 6653873 6696393 6669898 6686590 6912073 6790595 6687951 7017764 6810724 6727309
19696 6727309 6756564 6525591 6444393 7051043 6683312 6367976 6487814 6250401 6491906 6183588
19686 6183588 5935351 5808454 5891498 6343994 5876717 6355306 6323842 6174851 5726796 6380406
19676 6380406 6406603 6137912 5767154 6194382 6189964 6094761 6037476 5863045 6019288 5787423
19666 5787423 5550995 5520638 5672731 5834232 5661398 5781647 5516652 5457825 5932571 5855353
19656 5855353 5450036 5249915 5719231 5271882 5562991 5529695 5326793 5618052 5319891 5573359
19646 5573359 5299389 5153445 5538523 5640414 5444417 5639243 5073108 5459250 4909291
19637 4909291 5317241 5228788 5711489 4999671 5481187 5516547 5224920 5092111 4945937 4833243
19627 4833243 4980902 4835820 5062726 5105919 5165667 5270364 4893602 4979949 5539485 5226009
19617 5226009 4689914 5253065 5353879 5052509 4792214 4776667 5287520 4838749 4688060 4793793
19607 4793793 5012028 4618520 4262681 4983014 4434717 4524396 4676221 4734137 4507842 5071354
19597 5071354 4496131 4084072 4086546 4176543 4006999 4003541 4022925 4219907 3914617 3913995 4146138
19586 4146138 4250323 4284262 4131031 4340747 4408794 4232878 4706983 4100055 4155215 4578107
19576 4578107 4207553 4257677 4005831 4680843 4148782 4242228 4542076 4314381 4392821 4339376
19566 4339376 4469713 4442934 4595751 4460293 4607198 4493065 4423956 4335058 4500781 4409158
19556 4409158 4171773 4530541 4351809 4084072 4562435 4722670 4702330 4906501 4577760 4469429
19546 4469429 4681188 4325596 4096174 4576159 4081804 4281758 4376579 4028100 4610888 3945268
19536 3945268 4301142 4591748 4499107 4114422 4501632 4289916 3906106 4333932 4266961 4322586
19526 4322586 4307123 4156151 3670237 3939613 4516133 4284430 4065424 4361211 4182822 4026686
19516 4026686 4338041 4471633 4121207 4217207 4245983 4258008 4051420 4112079 4263758 3725073
19506 3725073 3312534 4026881 3892465 3512423 3622233 3956994 3859113 4225876 3690886 4389807
19496 4389807 3622442 3612411 3988819 3608303 3770864 3837295 3530835 3829447 3406392 3433264
19486 3433264 3812546 3836255 3883806 3939853 3639290 3837880 3429286 3650350 3494200 3316615
19476 3316615 3398970 3717461 3731575 3734011 3873834 4037206 3722299 3319597 3630531 3964020
19466 3964020 3797106 3395213 3517782 3490068 3430884 3094408 3676517 3479212 3054166 3056441
19456 3056441 3414831 2983785 3186513 2711167 3051994 3003588 3185112 3207295 2730966 2925706
19446 2925706 2889735 3165349 2584622 3029703 2740358 2732467 2557470 2630521 2938701 2981598
19436 2981598 3055747 3018079 2823772 3383491 2905623 3178359 3233585 3195712 2923734 2740107
19426 2740107 2540522 2796436 2430203 3024810 3160878 2377633 2923333 3155340 2926941
19417 2926941 3135618 2649322 2323753 2233519 2491892 2587733 2468468 2433144 2346138 2923033
19407 2923033 3079582 2406689 1980491 2588744 2142030 2365063 2287366 2474542 2734823 2290072
19397 2290072 2436810 2259369 2242790 2120054 2515153 2482490 2504952 2297624 2513018 2310544
19387 2310544 2470618 2289962 2385964 2184537 2194445 1622174 2600646 2658535 2057462 2569262
19377 2569262 2699522 1986880 2085490 2517434 2359523 2144054 2637342 2256909 2158728 2421907
19367 2421907 2389058 1995098 2080295 2521466 2149140 2015683 2514765 2043658 1815798 2403695
19357 2403695 2713854 1889720 2442625 2502011 1901865 2666189 2321536 2026989 2095686 2283674
19347 2283674 2247868 2263866 1723134 2153620 1683044 2262423 1778132 2057023 1832548 2240445
19337 2240445 2169305 2127928 1795745 1763984 1881782 2137001 1803885 2136975 1834077 2123303
19327 2123303 2069117 2217064 2219245 2003005 2560860 2486966 2345849 2218339 1718635 2326217
19317 2326217 2496248 2293227 2225485 2590615 2205471 2037446 2079965 2340492 2026211 2040239
19307 2040239 2147696 2574590 2134206 1798294 1919736 2001159 2301998 1873123 1798694 2125326
19297 2125326 2175040 1627911 1793190 1688107 2391572 2306457 2070968 2344501 2278959 2730257
19287 2730257 1980024 2257220 2031144 2345633 2449829 2376220 2278344 2136162 2381051 2274935
19277 2274935 2094259 2286653 1841311 1953251 2298740 1765211 1624481 2038561 2025556 2217941
19267 2217941 1973753 1935084 1738006 2014104 2111173 2191112 1535579 2177347 2438413 1844730
19257 1844730 2036731 2144900 2556205 2843291 2052950 2781286 2034620 1997399 2474095 1773774
19247 1773774 2461915 1991106 2199277 2236689 2390918 2747772 3195063 3439053 3687966 3885612
19237 3885612 3408606 3886243 3948801 3772636 3363172 2975869 2264011 1988382 2072894 1959965
19227 1959965 2093246 2001143 1384264 1647472 1545153 2068003 1451210 2103717 1988335 1981528
19217 1981528 1274566 1963582 1914434 1935504 1313135 2134651 1833260 1957268 2104200 1471079
19207 1471079 1790917 1890789 1899804 1982232 2100993 1580127 1614237 2033275 1704171 1404257
19197 1404257 1827560 1513095 1442494 1717365 1596927 1925353 1584955 1881195 1572415 2018078
19187 2018078 2154296 1566325 1715781 1687961 1979060 1906749 1900693 1940616 1645350 1651324 1283250
19176 1283250 1760656 1722528 1779774 1568991 1722260 1786836 1905971 1662827 1671714 2135780
19166 2135780 2134425 1759818 1937337 1807399 1739854 1477411 1740313 1942975 1785070 2018595
19156 2018595 1171228 1881533 1721127 2512288 1614902 1666400 1780701 1930107 2169817 1557230
19146 1557230 1765091 1641950 1926556 1553082 2230608 1702881 1954900 1756514 1797086 1821644
19136 1821644 2242930 1812714 1900817 2008846 1964514 2612299 1910092 1673644 2074808 2163714
19126 2163714 2008099 2193957 2284696 1826793 2635600 2384220 2608374 2538095 3627956 3414672
19116 3414672 3441518 3627587 3617914 4101709 4032058 4187799 4495690 4695741 4550306 4148251
19106 4148251 4268019 3337707 4150011 3713303 2954099 3192171 2780630 2475506 2674459
19097 2674459 2038437 2653391 2685835 2598073 2476205 2601982 2601489 2919873 2158341 2437076
19087 2437076 2927608 2565717 2378480 2521824 3109455 2958978 2805369 2948293 2542295
19078 2542295 2523294 2589341 3094061 2701308 2776491 3016577 3124262 3035492 3007521 2849349
19068 2849349 3004054 3086474 2739701 3107250 3127341 3629758 2929090 3732438 3555184 3668601
19058 3668601 3378050 4240597 4386557 4845680 5259415 6070532 7284180 8548858 9975725
19049 9975725 11320900 12330362 12233199 12169496 12496343 12790518 12308269 11307972 10325206
19040 10325206 8938873 7206742 6396689 5744814 5439996 6634971 6584175 7715388 7729761
19031 7729761 8727983 9537077 9513604 10319664 9971659 10049206 9658417 9457291 7516041 6747383
19021 6747383 5643282 4783026 4913531 4859285 4362972 4170820 4445742 4275252 4402222
19012 4402222 4218217 4448734 4508525 4757080 5136889 6238159 6572940 7579653 8948068
19003 8948068 10261328 11351142 12544563 13682756 14648090 15003734 15370450 15084925 14697013
18994 14697013 14121363 12602728 10776470 9169689 8798772 8638292 9290563 9371697 9668598
18985 9668598 10506476 10771327 11295055 11272724 11669357 11188742 10265647 10084292 8330097
18976 8330097 6992371 5956307 5811876 5733518 5763622 6172452 7184219 8398223 9012264
18967 9012264 9350507 9995309 9663697 10697120 10380808 10631801 9602595 8901487 7541051
18958 7541051 6817964 6239789 5865114 5216579 5154981 5527504 5634353 5599776 6115813 6052644
18948 6052644 6340761 6559580 7718842 7726086 8565903 9546979 11190222 13658354 15762514
18939 15762514 18540603 21802742 25482671 29153241 33985069 38514856 42686990 46255579
18931 46255579 48329544 49747613 49533078 48225361 46457337 43004277 38743851 34328699
18923 34328699 28395441 23838743 19540920 15902027 13571298 11328816 10391429 8889647
18915 8889647 7969272 6859927 6354815 5891354 5687640 4893263 5029405 4690545 4813379
18906 4813379 4364404 4735020 4365548 4324597 4040314 3647009 3963961 3986299 3802066 4278298
18896 4278298 3789603 4669207 4134291 4194920 3869159 3852649 4050344 4568368 4594884 4494622
18886 4494622 4707320 5021032 5206909 5923178 5520047 5880490 6220019 6838364 7844996
18877 7844996 8885042 9742279 11684388 13462444 16139606 19385239 23771735 27535830
18869 27535830 31424706 34233210 37304219 38419306 39640944 39669935 38372519 35413412
18861 35413412 31645094 27606198 23257516 18612282 15237136 12804065 10513142 9064444
18853 9064444 8038298 6832859 6435619 4886094 4742719 4567482 4613482 3863348 3680562
18844 3680562 3968764 3179301 3138721 3025020 3096559 2651938 3166676 2351406 2513443 2851857
18834 2851857 2354790 2470190 2507925 2246088 2075803 2014987 2362645 2012356 2264384 2494073
18824 2494073 2127415 1879335 2234569 2136413 2257841 1901180 2240425 1850659 2128767 1742106
18814 1742106 1849118 1756723 1839204 1707167 1879049 1629144 1854801 1433098 1786154 1687063
18804 1687063 1334067 1784661 1907041 1828777 1831699 1931049 1995973 1743906 1492501 1424422
18794 1424422 1844073 1809156 1702514 1795731 2151320 1838192 1764021 1877486 2062593 1809082
18784 1809082 1715868 1840860 1832933 1651364 1565569 1851360 1975816 1506115 1854747 1585023
18774 1585023 1871101 2094368 1803728 1984822 1832653 1978803 2047994 1738614 1679795 1338677
18764 1338677 2274468 1557147 1869407 1602259 1713778 1789909 2332833 1855840 1592807 2095515
18754 2095515 2134961 2103673 1972563 1807991 1338844 1864198 2133799 2165151 1723824 2134701
18744 2134701 1755291 1863880 2017094 1895646 2064727 1512906 1502097 1756895 1497872 1410010
18734 1410010 1224001 1145121 1765210 1678671 1515011 1953338 1680140 1832852 1883765 1681614
18724 1681614 1687743 1574084 1716421 1464325 1864283 1704317 1319451 1632326 1568485 1462079
18714 1462079 1469539 1487667 1782766 1618009 1669558 1415658 1441880 2062907 1662932 1982087
18704 1982087 1341076 1420585 2058895 1402239 1844972 1784169 1537243 1480687 1802349 1430492
18694 1430492 1911117 1571589 1889428 1651187 1328729 1754756 1966206 1855267 1779535 1945644
18684 1945644 1709998 1833430 1830404 1706609 2075520 1768775 1469754 1971386 1855500 2121733
18674 2121733 1675159 1471962 1770320 1496147 1729835 1943502 1242278 1639061 1538420
18665 1538420 1466304 1320640 1269341 1725151 1396308 1440786 1833484 1634575 1584024 1587838
18655 1587838 1452469 1111264 1392859 1197115 1483713 1648693 1402973 1419042 1315956 1734375
18645 1734375 959567 824948 1599241 1212799 1239961 1293947 1781205 1599775 1532196 1474928
18635 1474928 1302012 1609282 1309913 1546616 1335638 1075286 1678110 1371935 1390650 1422651
18625 1422651 1490647 1778179 1236612 1908831 2202627 1460984 1190540 1126045 1279833 1525674
18615 1525674 1956295 1688481 1441366 1842131 1939232 1786116 1576296 1688532 1978638 1767042
18605 1767042 1689664 1706717 1663632 1440814 1865144 1366187 1669810 1923187 1806985 1554454
18595 1554454 1948163 1748550 1867604 1746884 1793111 1682803 2011553 2545797 1824223 1721874
18585 1721874 1735714 1469641 1533093 1854008 1819955 1609577 1613278 1836631 1801724 1521867
18575 1521867 1527280 1108970 1586920 1311453 1720841 953085 1179257 1932905 1344897 1444451
18565 1444451 1547344 1884438 1015053 1584438 1374368 1443652 1429316 1420458 1543494 1349559
18555 1349559 1235246 1343982 1281165 1632104 1746716 1553324 1378282 1447508 1311877 1108995
18545 1108995 1506817 1597226 1429926 1325363 1280593 1456555 1792459 1621117 1632549 1376268
18535 1376268 1373967 1470577 1113311 1267720 1263472 1150001 1363246 1262411 1507152 916711
18525 916711 1381361 1435740 1389233 1576651 1476427 1152616 917617 1371394 1464176 1017263
18515 1017263 1522026 1570411 1124552 1491743 944697 780007 1477934 1063838 951561 1300574
18505 1300574 1091812 1427474 1181302 1528775 1238606 1247879 1101298 1330633 1375909 1071701
18495 1071701 1685651 1041910 1220049 1133548 1802420 854514 785139 867102 1535480 1348806
18485 1348806 1143612 1004076 1109630 1327067 925496 1071748 1251856 987464 629945
18476 629945 1230263 1122861 1532186 1091162 1623266 903012 1106614 1685195 1284679 1176950
18466 1176950 929113 1664659 1570722 1300251 1090026 826317 1224657 1221602 1395705 1216581
18456 1216581 1508199 1224886 1105255 1441021 1226856 1544468 1041362 1197532 1105523 1424087
18446 1424087 1071597 1222051 1251277 1241598 1567128 1494346 1331385 1713535 1242233 1421420
18436 1421420 861493 996957 1000127 1337607 1513397 1203389 1231582 1178179 1443499 1524904
18426 1524904 1157212 759316 1279613 1646848 1324940 1042013 1253732 1236588 1357110 1616957
18416 1616957 1332454 1347517 1318523 1472474 1790983 1841547 1824478 1380225 1347949 1528057
18406 1528057 1794279 1554989 1431212 1137593 1119885 1120802 1134228 1132938 1275672 1335487 1433692
18395 1433692 1398578 1066915 1446115 1586252 1796011 1399696 1566300 1361189 1348533 1256458
18385 1256458 1180593 1472311 1575107 1274838 1088822 1355349 1541524 1191676 1387600 1240682
18375 1240682 1532078 972161 1212129 1496135 706775 838314 1067333 957769 1042680 857052
18365 857052 638650 1106596 948132 868959 1029280 1319787 1015179 1058225 1050010 1325608
18355 1325608 1057669 1301150 1411045 1988033 1134126 1375727 1591801 1437878 1023183
18346 1023183 1224131 1560256 1441373 1484073 1241116 1398339 708778 1267583 1749473 1016461
18336 1016461 1360894 1047814 838919 775446 1611021 1222277 640084 945182 923529 1497291
18326 1497291 1152281 759656 1471866 1036098 968091 922183 986902 1289669 1132340 1382523
18316 1382523 1011456 1420469 930994 1500342 1209761 1592087 1201796 1239824 1005239 1562999
18306 1562999 1173799 1115611 1339385 1258498 1529304 708428 1684896 1211590 1277430 1157380
18296 1157380 1140476 1277476 1666640 1211865 1227531 1027526 1095924 1342122 1632532 1016594
18286 1016594 1060221 1147541 1517311 958436 1033325 1679737 1333388 1457504 1712304 1441803
18276 1441803 1576324 1710075 1493791 1392939 1733244 987255 1221546 1382052 1453088 1149047
18266 1149047 735467 1344435 817153 994947 832559 1393081 1252483 1024514 1274368
18257 1274368 1147288 1164177 1058890 1583230 1419715 1446675 747886 1589260 1695430 1334517
18247 1334517 1370449 1303283 1355377 1137259 1176302 1068495 1636282 1633755 1229913 1631562
18237 1631562 1390906 903849 1526721 950383 1244308 1299327 1365029 982471 1347222 1012104
18227 1012104 1708216 1253715 1472348 1625258 1311424 994013 972484 892152 1099004 621119
18217 621119 829112 1301626 1369324 1536663 1137704 1513862 1176836 1052631 1357079 1138131
18207 1138131 1162620 1376580 1611076 1236742 1111710 1156901 1187352 1147310 936151 1151921
18197 1151921 1444592 1226882 966688 1574419 1067104 1325186 1322448 1253509 1059011 1294538
18187 1294538 1359706 1625843 1028447 783275 1357854 1002413 1621341 1015561 1153042 1444051
18177 1444051 1055218 704261 1477599 1141376 997187 1431472 724222 1306629 830890
18168 830890 1191241 1714563 1034123 1197745 911651 965936 1260940 1072006 700720 1036172
18158 1036172 1247892 1012065 558953 1214748 1176891 1238743 871285 952709 1331980 950509
18148 950509 712480 1233712 807714 579483 1328190 1342140 758804 1088121 1178710 1228438
18138 1228438 752876 1087807 1536036 1164038 835821 734883 1086865 1137934 990675 1193049
18128 1193049 1226644 1065215 982072 1020016 1144039 1228020 1088656 1145279 1442656 734229
18118 734229 1045530 1197250 978736 1091567 1530872 1100643 1184344 1524658 1524416 1477871
18108 1477871 1315559 1073749 1308278 1315482 1297588 1499418 996526 915847 755475 1187823
18098 1187823 1137415 1260411 1628527 1246872 1234014 1281208 1430921 1402826 906286 1441440
18088 1441440 830283 853490 1303111 1016106 1161044 910679 979017 1171818 1237378 1300011
18078 1300011 630547 1547783 1048523 958417 905071 1136462 808663 1163416 1158819 1179712
18068 1179712 990959 1161930 1117201 1244066 1272715 863053 979093 1261955 1113952 749452
18058 749452 1504888 1255874 1080041 1231734 828194 1094990 1435322 899093 1260251 1306460
18048 1306460 1547442 1204735 996723 1245336 715532 895148 1067837 1114908 1114406 1139611
18038 1139611 944169 1211044 1261006 676538 1148345 1446432 961834 883175 711794 1254454
18028 1254454 1295150 1748426 1009481 935731 802453 1014314 1019685 1093737 1172707 758868
18018 758868 1122497 894930 989554 1064146 1083268 1260866 973388 1039201 1064047 1055942 811550
18007 811550 985840 947951 1001256 1142965 1253495 401805 1188675 1199348 1264465 1364062
17997 1364062 1419700 1194657 1482278 870936 1073597 880987 1204893 999629 1356775 1012402
17987 1012402 760111 1493774 1142515 1196267 773276 1204974 816995 1287771 1248817 793242
17977 793242 1159496 1031335 1006542 1549658 1076283 1316708 1164594 1123943 1408049 1256199
17967 1256199 1176836 1425230 1315917 1494748 1305975 1603345 1142909 1466834 1279212 1030769
17957 1030769 1224496 1008822 1257601 1461763 1015900 1309561 1486926 1599768 1149305
17948 1149305 792804 1421555 1170541 1412823 704656 1305693 1077175 1576716 1414857
17939 1414857 1307520 1091530 1180598 1619617 1335844 1461095 1454143 1111282 1783669 1241186
17929 1241186 1300539 1822095 1821205 1464797 1549537 1402262 1548226 1348264 1775748 1428740
17919 1428740 1069622 1374623 1819004 1469677 1474577 1428198 1623481 1242049 1521069 1712745
17909 1712745 1405232 1530982 1693932 1702986 1008289 1588713 1559068 1522988 2020046 1821428
17899 1821428 1395626 1433709 1518561 1832353 1654220 1530552 1715008 1764662 1665487 1919085
17889 1919085 1540414 1811155 1744391 1304868 1832895 1900940 1784984 1569909 1773913 2010747
17879 2010747 1819700 2010000 1422539 1750770 1616841 2029752 2008236 1869820 2040419 2118697
17869 2118697 1971668 1929915 2201634 1521816 1850747 1674036 1978077 1881479 1833863 1932089
17859 1932089 1669681 2023183 1536413 2055876 1696583 1906339 1818784 1943960 2001135 1398053
17849 1398053 1898586 2075563 1916306 1928810 1746059 1857294 1832059 1436930 1551284 1754536
17839 1754536 1874041 1616106 1920235 1647541 1503463 1750503 1368652 2006902 2017149 1401949
17829 1401949 2013383 1682329 1901721 1839576 1929665 1657138 1535109 2126842 1748347 1605312
17819 1605312 1665495 1800626 1978444 1914869 2120367 1679479 2058060 1989860 1873459 1993643
17809 1993643 1955010 1466368 1847663 1870021 1663164 1666445 1569215 1715268 1627724 1580565 2081004
17798 2081004 1767267 1550745 1661969 1527366 1805869 1632956 1442524 2149818 1746117
17789 1746117 1557900 1315949 1546643 1357964 1385872 1485482 1453812 1536682 1732523 1162300
17779 1162300 1690917 1503869 1104084 1072362 1065391 1655019 1641448 1444341 1887228 1587347
17769 1587347 1626757 1442524 1188203 1670868 1104953 1574607 1159403 1746820 1618723 1612074
17759 1612074 1281231 1771763 1511568 1566363 1405907 1322144 1753764 1481011 1348524 1326484
17749 1326484 1616151 1334894 1476526 1493170 1272183 1968405 1312707 1362489 1428874 1666201
17739 1666201 1491461 1332960 1668602 1088024 1388819 1936918 1454131 1696752 1365389
17730 1365389 1664476 1285281 1636902 1896641 1678301 1465514 1225984 1493237 1251109
17721 1251109 1481205 1491100 1593560 1663395 1495461 1153876 1690019 1951593 1705944 1185348
17711 1185348 1081338 1302567 1192602 1630975 1785779 1295436 1415228 1518032 1166777
17702 1166777 1287502 1143161 1528555 1165264 1859750 1421200 1735385 1249742 1959437
17693 1959437 1549953 912854 2063991 1445309 1471795 1482120 1313804 1523113 1745963 1616904
17683 1616904 1997555 1846100 1443954 1422427 1603520 1379967 1227305 1758135 1879787 1740363
17673 1740363 1596016 1538155 1491747 1549136 1220669 1479865 1333993 1501848 1853699 1506450
17663 1506450 1690386 1892803 1890888 1579403 1488432 1573842 1752206 1632301 1584351 1343178
17653 1343178 2192690 1975241 1680622 1831298 1797881 2141566 1321108 1620711 2050456 1961716
17643 1961716 1974081 1445755 1488403 2089603 2250730 1580519 2200602 2212511 2356629 2626520
17633 2626520 1990641 2307257 1657412 2209932 2488113 2513397 2214750 2565768 2680840 3068509
17623 3068509 2679497 2343900 2629443 2302536 2463419 2638220 3006312 2656927 2900535
17614 2900535 3017170 2729078 2709473 2871139 2454819 3346650 2692512 2938303 3139175 2900090
17604 2900090 2951613 2762151 2895612 2900224 2465439 2972589 3072085 2671542 3202042 2827734
17594 2827734 3110257 2964882 3041367 3147712 2816398 2450483 2723925 2759085 3132714 2568210
17584 2568210 3156194 2569214 2792332 2372039 2637928 2606233 2999858 2822014 2220870 2621968
17574 2621968 3017297 2873798 2463283 2780734 2748928 2623214 2634876 2647723 2234288 2300258
17564 2300258 2659334 2380301 2740570 2358908 2330070 2151218 2227269 2788735 2380337 2278333
17554 2278333 2340449 2609652 2241705 2485732 2592056 2258908 2420647 2737119 2461791 2220651
17544 2220651 2201080 2634412 2604552 2622832 2261756 2375420 2573646 2476930 2964488 2471021
17534 2471021 2657415 2608621 2868697 2689767 2767088 2691954 2467254 2502693 2628720 2928853
17524 2928853 2860376 2726077 2431386 2823533 2209030 2882727 3015541 2584273 2626285 2606013
17514 2606013 2940370 3075760 3125571 3284980 3507129 3336679 3521010 3483221 3811051 3963864
17504 3963864 3750889 3934131 3852610 4048298 3727982 4043803 3818881 3913343 4516789 4534543
17494 4534543 4953527 5012726 5566190 6305538 5777745 6929119 7744665 9327143 10883873
17485 10883873 14137469 20038526 28455970 38868863 48838857 57367604 63233324 68560687
17477 68560687 71170234 73132314 72830370 69739709 62759057 52731970 42307598 34679084
17469 34679084 32252684 34809450 41986350 50062605 58757121 64821252 69299628 72465689
17461 72465689 73389316 73522664 70734044 64532786 54626405 41885057 30533184 21136548
17453 21136548 15777568 11984837 9941497 9142343 8528699 7683428 7427979 7412919 7293954
17444 7293954 7607164 7833521 8316505 8835302 9151345 8624799 8838449 9408935 8906634
17435 8906634 8731917 7911293 7568716 7688387 7371592 7472061 7366663 8051998 7895631
17426 7895631 7865563 7632593 8195893 7821605 7881044 7400409 7438243 6331686 6126927 6112046
17416 6112046 5766341 5186379 5881268 5278605 5354336 5783170 5612111 5069102 5514490 4850461
17406 4850461 5935957 5554967 5758481 6088274 6456406 6710453 6849273 7434676 7359837
17397 7359837 7242116 8631308 8173648 8683874 8821819 8911387 9212868 9993431 10605776
17388 10605776 11271576 11671728 12716328 14020668 14395572 14992735 15241722 15921476 15699245
17379 15699245 16141114 15399596 14805043 14351929 14058586 13324002 13252594 13256691 13443736 14043610
17369 14043610 14566875 15735620 16291927 17358285 17971099 18373354 18638321 19399114 19647797
17360 19647797 20226707 19840015 19735774 18777710 19595593 18620782 19039800 18923307 19272535
17351 19272535 19649120 20289578 20800083 21928922 22866782 23957033 25158338 26502540 27523186
17342 27523186 28879683 29550850 29902598 30560918 30470927 30162778 29810792 29295155 28579487
17333 28579487 27875836 27178611 26666059 26973196 27518651 28668794 28879035 30183104 31419369
17324 31419369 32788119 33703269 34717937 35960707 35685011 36494056 35994413 35478092 34972663
17315 34972663 34215114 32931080 31677499 30844631 29981257 29210845 28417154 27707495 27068699
17306 27068699 26984810 27263893 27085683 28614091 29255539 29846074 30714251 30964807 31843135
17297 31843135 32336102 32347168 32542974 32287058 31604583 30276505 29624153 28229256 27446578
17288 27446578 26493778 26043088 24999565 24108307 24204871 23125184 23048914 22259903 21605451
17279 21605451 21348616 20855338 19780731 19206480 17999866 16685607 15643140 14896607 13995457
17270 13995457 13730447 12978948 12296687 11539357 11670722 11227443 11053151 10850139 10678627
17261 10678627 9711812 9948536 9313760 9440162 8831844 8695178 8885932 8740665 9064593
17252 9064593 8641328 8662107 8761067 8329840 8424529 8178287 7595160 7884599 7969726 7691092
17242 7691092 7516217 7355757 7200135 7072230 6988809 7202629 6749724 6606415 5765254 6570491
17232 6570491 6490681 6120030 6551239 6118364 6095196 6308032 6485295 6337436 6502060 6830436
17222 6830436 6939853 6852552 6404357 7003956 7434201 6814071 6895422 6711038 6922204 6981712
17212 6981712 7190984 6951594 7259600 7120978 7156611 7399193 7815665 8018177 7913049 8279347
17202 8279347 9028262 8909386 7930624 8015158 7999630 8181629 7828057 7584869 6647091 6550498
17192 6550498 6018974 6249908 5971667 5844940 5888111 6216945 5517392 5457090 6226594 6015913
17182 6015913 5889580 5488492 5740215 4794808 5254302 4532239 4224338 4362303 4826266
17173 4826266 4615976 4552031 4137684 4549895 4544595 4598892 4398504 4455013 4755429 4737349
17163 4737349 4707149 4742728 4996598 5175232 5329226 4805406 5284467 5013589 5641487 5179008
17153 5179008 5400579 5584016 5883874 5218730 5694100 5433595 5592820 5365936 5121889
17144 5121889 4887605 5050758 5299635 4608491 4859992 4917764 5127217 4876062 5182303 5442563
17134 5442563 5334681 5352436 5155456 5016554 5160997 5152253 4795240 5332236 5304630 5480131
17124 5480131 5911577 5918888 6592984 6206539 6462925 7021409 6222256 6421688 5956164 5854403
17114 5854403 6107009 5413886 5114378 5007044 4862175 4329437 4189054 4202748 4480506 3580608
17104 3580608 3536616 3370525 3052656 3476186 3439725 2812110 3129009 2684420 2976334 2727421
17094 2727421 2906788 2940366 2826169 2587937 3154397 2758589 2880857 2179282 2829477 2339014
17084 2339014 2691040 2654164 2914552 2761568 2872396 2545696 2692571 2384296 2660650 2957018
17074 2957018 2807624 2628693 2262803 3098585 2424888 2403084 2493379 2497289 2734609 2643797
17064 2643797 2623019 2370453 2623887 2476094 2272664 2752213 2488771 2246930 2584770 2925425
17054 2925425 2290246 2571129 2207314 2257244 2219360 3059450 2538155 1708128 2973573 2333265
17044 2333265 2627426 3364837 2680110 2492201 2753776 2714646 2558248 2751851 3009749 2775569
17034 2775569 2890355 2951009 2966008 2714625 2380557 2559716 2688063 2653087 2394610 2715811
17024 2715811 2622539 2850274 2700278 2399145 2978697 2559163 2792885 2579509 2485179 2713472
17014 2713472 2078439 2581109 2624500 2345502 2677416 2479804 3212073 2333169 2649808 2423059
17004 2423059 2561661 2451342 2842947 2972804 2642324 3085408 2554048 2622480 2266840 2385377
16994 2385377 2280708 2766580 2418392 2699487 2989676 2896890 2756305 2359720 3042810 2696532
16984 2696532 2865575 2581023 2541280 2176776 2519197 2956751 2552063 2523299 2863364 3467288
16974 3467288 2790570 3126808 3691261 3204880 3435124 3743935 3866747 3925304 4185708 4320804
16964 4320804 5052527 4855792 5244645 5411758 5380967 5269788 5373992 5857891 5928698 5715522
16954 5715522 6398779 5984894 6095006 5951617 6280775 6126485 6042342 5870161 5629447 5166559
16944 5166559 5182492 5066698 4764550 4582519 4469652 3791161 4318208 3796042 3826529 3448333
16934 3448333 3418745 3229477 3135677 2459936 2788976 3002761 3038117 2836455 2418683 2717064
16924 2717064 2989064 3433082 2598944 2240749 2732071 2153574 2397972 2442169 2662954 2453443
16914 2453443 1880135 2276780 2609016 2481212 2339662 2435871 2052375 1960567 2460348 2035451
16904 2035451 2362797 2396893 1970818 2089757 1874315 2239330 2075177 1973619 2239830 2198898
16894 2198898 1805638 1718941 1829598 2151056 2427435 1725294 1889904 2034496 1683800 1841905
16884 1841905 2104123 1985639 2117805 2020223 1810413 2158123 2090119 1627431 2044966 1808670
16874 1808670 1908621 2345750 1759978 1785179 1739593 2253512 1850194 1952926 2423358 2248025
16864 2248025 2452422 2385743 1819118 2146961 2298411 2186289 2046069 2372089 2311076 2525545
16854 2525545 1954176 2577178 2459764 2657546 2262761 2178351 2400823 2122960 2343518 1810884
16844 1810884 1568436 1283497 1640015 2038326 2201192 2036734 2087551 1971746 1869548 1788730
16834 1788730 1766894 1952594 1568450 2082944 2031722 1898488 2064129 1765752 2073013 2106070
16824 2106070 2035313 2152111 2579848 2271936 2933729 2157067 2518824 2551057 2575901 3320062
16814 3320062 2621451 3010784 3022772 3079645 2693644 2638072 2964228 2822232 2649757 3076650
16804 3076650 2792030 2748072 2927600 2471718 2911786 2668861 2497907 2600440 2445588 2459864
16794 2459864 2700709 2551830 1996334 2563177 1952498 2005030 1805999 2037372 2352821 1569464
16784 1569464 2253993 2051394 1722593 1679298 2045870 1288081 1534139 1959757 1537536 1944670
16774 1944670 1660565 1605761 1640483 2214005 1501100 1473708 1654676 1642809 1654676 1974360
16764 1974360 1507587 1869405 2133444 1823228 1675539 1021198 1475057 1425260 1738190 1568338
16754 1568338 1732666 1967944 1887474 2125954 1789094 2054841 1720839 1990738 2024870 1684477
16744 1684477 2056681 2177025 1886927 1840668 1938954 1919371 1690008 2105503 1612011 1508510
16734 1508510 2147544 1787946 1977313 1646781 2043449 2024662 1790733 1488735 1813368 2172113
16724 2172113 2188506 1903001 1895729 2469408 2034193 2047070 2108652 2212970 2412555 2766963
16714 2766963 2090331 2405124 2316863 2659771 2711202 2415106 2289816 2743373 2542655 2652755
16704 2652755 3185890 3370456 3707419 3787137 4118971 3886328 3744050 4146292 4092262 3656459
16694 3656459 4200732 3629382 3980632 3435628 3600199 3790371 3988733 4050333 4095649 3991515
16684 3991515 4428055 4400486 4448216 4231374 4057463 3955095 3350846 3270239 3733518 3116099
16674 3116099 3032438 3312046 3058008 2994770 3014734 3406239 3024371 3274291 3863422 3462860
16664 3462860 4175823 4092145 4343011 4479264 4201911 3794665 3820469 3940941 4030494 3828304
16654 3828304 3633911 3928117 3493095 3904150 4120435 3963577 3473880 4070911 2945689
16645 2945689 3007157 2465982 2598303 2359044 1664489 1860098 1452406 1548297 1220819 1381537
16635 1381537 1657903 1496056 2034598 1335265 1983535 2081067 1887655 1755488 1493319 1785720
16625 1785720 1355923 1655945 1842134 1867281 2105698 1983112 1633368 1402761 1373125 991967
16615 991967 1444183 1652887 1356104 1398487 1447464 1493864 1751373 1762792 1742843 1632629
16605 1632629 1537128 1457663 1940349 2172328 2198005 2300959 2048754 2343741 2280108 2191780
16595 2191780 2216134 2490200 2274711 2382362 2551316 2837762 2840021 2516112 2055163 2026847
16585 2026847 1933012 2046254 2110488 1973491 2062719 1777634 1862881 1887114 1587751 1881843
16575 1881843 1581090 1810919 1903947 1187813 1742418 1594131 1708744 1437409 1671527 1875868
16565 1875868 1305725 1789902 1812346 1701527 1838159 1585749 1868751 2069394 1609176 1742961
16555 1742961 1615743 1522647 1936905 1731991 1121908 1703084 1741565 1703074 2121142 1396595
16545 1396595 1994860 1914374 1578318 1835665 1549144 1917546 1964746 1823382 1483462 1917311
16535 1917311 1327674 1588069 820499 1539027 1623827 1121958 1439507 954982 1295497 1120860
16525 1120860 1209536 1462098 1197518 1222462 1369472 1711208 1407460 1425699 1172769 1479055
16515 1479055 2069315 962763 1554180 1658184 1221311 1639039 1709016 1372138 1850880 1395813
16505 1395813 1503655 1481033 1605990 1455026 1325911 1399883 1877427 1870310 1294633 1558895
16495 1558895 1195867 1490783 1537402 1797986 2110239 1838612 2282820 2231775 2028665 2345996
16485 2345996 1819644 1758196 2151133 1812375 1683622 1667736 1792965 1590366 1747347 1821038
16475 1821038 2606938 2260398 2225967 2353086 2786838 2120622 1736298 1884933 1989659 1759530
16465 1759530 1475844 1309612 1225725 1087896 1653058 1719921 2042574 1946529 2325685 2501463
16455 2501463 2653404 3029619 3162813 3372606 3643960 4019431 3911134 4361449 4150546
16446 4150546 4702244 4609319 4335346 4497477 4759792 4434715 4531647 5178369 5316845 5900716
16436 5900716 5722429 6653250 6580152 7052445 7458925 8008940 9122650 9956828 10602255
16427 10602255 11816308 13136164 14974394 16299636 17001462 19066948 21581308 22960954
16419 22960954 25008458 27225931 30490578 33137592 35983337 39586685 42757272 46439569
16411 46439569 50380955 54841492 58847334 63717030 68467702 73786314 79282760 85124816
16403 85124816 90725793 95440223 98231493 99274012 99292622 98498616 96790808 94703312
16395 94703312 92091978 93554970 100497911 115553632 138089358 161692362 174975125
16388 174975125 169910747 152934451 130671677 108170548 86916404 69134839 50209764
16381 50209764 28964185 8712268 -9117978 -27082932 -40632729 -45532411 -40079244 -25641202
16373 -25641202 -9719229 1320204 7565721 9162400 9324509 7785773 6618837 6322080
16365 6322080 5619742 6450879 6178665 5758591 5703907 5511251 4978110 4377424 4267963 3917166
16355 3917166 3176951 2993820 2619996 2555653 2660200 2245935 1671886 1179040 1248523 785347
16345 785347 430148 104939 366271 -165160 241254 -357049 -193154 -564403 286600 736033
16335 736033 563268 1136710 1089797 1226957 1544088 1995258 1812194 2404128 1726484 2229058
16325 2229058 1525931 1415189 1298019 988467 1833051 1222428 1612238 1203957 1263247 1355163
16315 1355163 1552905 1441080 1901942 1699943 1813291 2078344 2038657 2162951 2146628 2054632
16305 2054632 2269870 2401380 2220942 2294961 2384973 1706433 1940824 1383651 1262924 1472711
16295 1472711 1415014 1356745 1646649 1578755 1814015 1876262 1560034 1680309 1519885 874027
16285 874027 1133839 1389517 746602 728012 393427 454357 747382 173142 578578 323879
16275 323879 332968 831420 897258 1685488 1599821 1668676 1777859 2176363 2307583 2455251
16265 2455251 2025464 2285747 2476470 2004404 1695642 1639753 1727080 1265421 1502939 1688800
16255 1688800 1227652 1434063 1248691 1439352 1266787 1432699 1556458 1256518 1767229
16246 1767229 1468078 1975256 948645 1692265 1560531 1369545 1764718 2129055 2326381
16237 2326381 2799121 2091723 2502292 2254249 2636432 2025730 2189412 1915562 1251805
16228 1251805 1861413 1202899 1151054 941273 1278812 940210 1002632 1359198 852883 1264282
16218 1264282 1344414 1108535 1549948 1301009 1714457 1333700 1208629 1678674 1572176 1403736
16208 1403736 1226339 1054522 1017132 1193421 1603614 1418876 1550421 1780819 1629846 1542924
16198 1542924 1553109 1575604 1983581 1290213 1683622 1559973 1504798 1756725 1994717 1290495
16188 1290495 1620863 1550503 1888806 1696385 1727098 1958442 1813440 1721976 1666173 1666184 1511167
16177 1511167 1606590 1718360 1874562 2100779 2175347 2075848 1809735 2200724 1666669 2011374
16167 2011374 1933133 1680618 1574764 2071265 1687014 1473684 1866403 1517563 1520334 1694414
16157 1694414 1564764 1586987 1651001 1364514 1399318 1230750 1480132 1166620 1627195 1228792
16147 1228792 1743604 1511443 1281115 1757318 1510446 1669057 1887131 1522338 2440466
16138 2440466 1598319 1981762 2071770 1537671 1619448 1632960 1538352 1358190 2026673 2046038
16128 2046038 2013301 1821112 2397679 1731807 1776004 1979086 2034865 1100663 1908430 1954639
16118 1954639 1991905 1998331 2117893 1867797 1653017 1312044 1933254 1868755 1495452 1856308
16108 1856308 2061676 1653672 1523650 1808202 1465244 1642038 1537916 1504218 1866527 1709463
16098 1709463 1829482 2221767 2703740 2080805 1703056 2253510 2213576 2195019 2438973 2006091
16088 2006091 2240934 1609847 1970364 2043374 2161269 2418444 2491757 2338196 2750171 2143543
16078 2143543 2222133 2126552 2509760 2782094 2430730 2777295 2591622 2621861 2607173 2779728
16068 2779728 2662354 2850033 2883970 2915925 2914018 3152967 3041034 3208225 3379421 3251863
16058 3251863 3113241 3204659 2884797 3186454 3335795 3361308 3364788 3351142 2993804 3146168
16048 3146168 3254912 2795058 3369188 2979299 3324292 3390327 3362686 3643756 3492105 3779154
16038 3779154 3872982 3234262 4149596 3543094 3967277 4031950 3398218 3673668 3769974 4178534
16028 4178534 3852794 3695726 4022392 3913605 4227968 4047369 4043408 3732913 3979621 4257532
16018 4257532 4555831 3994909 4185240 4254766 4403563 4703022 4484662 4784413 4623236 4885318
16008 4885318 4743190 4938482 5074736 4752426 4794275 4775749 5113353 4474831 4520119 4481041
15998 4481041 4430373 4566409 4659076 4320096 4368115 4610297 4555052 4808052 4549439 4132028
15988 4132028 4576231 4856287 4775049 4519689 4659716 4861769 5117261 4545375 5241850 4710741
15978 4710741 4632398 4717882 4680106 4680418 5133119 5243574 4900617 4709215 4669629 4770818 4847555
15967 4847555 4716829 4305451 5224247 4542790 4747163 4517070 4621330 4651977 4767417 4530489
15957 4530489 4319004 4080890 4676200 4565396 4432635 4621066 4358243 4642643 4630284 4588239
15947 4588239 4912883 4763243 4578275 5301611 4607807 4567722 5026045 4646311 5164254 4856153
15937 4856153 4732186 5537283 4746024 5011538 4812460 5052620 5202149 5464449 5758033
15928 5758033 5605220 5137782 5961573 5551954 5536318 6197876 6433341 6052393 6221806 6228282
15918 6228282 6918514 6971081 7187320 7251645 7879693 8148596 8802409 9442066 9598206 11038440
15908 11038440 12056452 13289795 15678167 18119280 22099649 26475121 33351839 42356840
15900 42356840 53977195 66178360 79009118 90473724 100032640 107305333 111169931
15893 111169931 112755489 110821093 104842461 96066662 83569108 69425489 55233435
15886 55233435 42930294 33362382 26317483 20416415 17256987 14160770 13045305 11100662
15878 11100662 10094116 9173917 8140334 8071246 7268199 6923267 6874938 6511824 6534952
15869 6534952 5936311 6005505 6290913 5390956 5788684 5904026 5723963 5438449 5524610 5396688
15859 5396688 5369250 4674217 5247219 5282340 5240050 4956378 5060651 4733243 4948787 5081910
15849 5081910 5062125 5010066 4690422 4914676 5095175 4607658 4976012 4582651 4955247 4683270
15839 4683270 4950800 4630719 4915103 4913898 4579777 4821209 4771020 5002339 4691953 4334066
15829 4334066 5549113 5018616 4717326 4716797 4957266 4857527 4771659 4868344 4683265 5102058
15819 5102058 4804952 5034344 4629512 4509276 5171624 5370943 4960423 5484845 5239564
15810 5239564 5938212 5220756 5626354 5469391 6064643 5368037 5205177 5505323 5421610 5564019
15800 5564019 6126768 5684785 6323123 6122822 6838943 6835447 7089963 7542393 7579604 7928104
15790 7928104 8047752 7938518 7845485 7988423 8069527 8504363 8694635 8724855 9223705 8812455
15780 8812455 10012841 9879197 10151109 10805742 10966061 11235458 10816727 11221115 11395033
15771 11395033 11075095 10906794 10695182 10655148 10399060 10509191 10168918 10760753 11202777
15762 11202777 10960879 11535927 11781795 11415446 11605541 11333595 10969059 10978662 10556193 10268595
15752 10268595 10351636 9953382 10470220 10460184 10080624 10830616 10645340 10772662 10666378 11467449
15742 11467449 11869830 12190529 12583642 13102294 13019019 13862116 14114829 14332139 14285997 14080867
15732 14080867 14264021 14633357 14565595 15006318 15400045 15239441 15730348 15676421 16062315 15868601
15722 15868601 15413278 15595706 14744004 14361112 14146977 13707014 14209128 13580729 13730531
15713 13730531 14100393 13786739 13584067 13289506 12980524 12723136 12664156 12270792 11860838
15704 11860838 12468369 13317826 13095025 14074399 14507324 14291202 14664539 14936522 15157592
15695 15157592 14864518 15435980 15026247 14628478 14902909 14891740 14944133 14704282 14669031 14134012
15685 14134012 14056196 14551912 14005889 13832972 13346730 14116634 14074154 13931232 13188220 13486731
15675 13486731 13156228 12641902 12386041 12032904 12462270 12014734 12158909 12433860 12282191
15666 12282191 12950185 13212879 13275445 14258105 14844788 15932100 17118956 17890824 18838045
15657 18838045 19813328 21930128 22288531 23567919 25465853 26710336 28426790 29640772
15649 29640772 31107761 32179049 34108714 34960216 35698908 37311099 38427013 39643256
15641 39643256 40681974 42195256 43787275 45407720 47305921 48084661 49230512 50240049
15633 50240049 50060984 50135678 49728552 48799177 48609308 47662596 47654846 47271156 46836877 46731777
15623 46731777 46086951 45219064 44151504 42830740 41270127 39925881 37111308 35109057
15615 35109057 32799900 30741950 29943652 28421786 26837879 26053705 25499948 24257253
15607 24257253 24009182 22652825 22036948 21471015 20775726 20463705 19667336 19222667 19162375
15598 19162375 18587561 19149926 18950514 18610550 18948869 19849393 20672719 22658915 27393814
15589 27393814 36681297 48997430 59566438 66707189 72093845 76167131 79137582 80639385
15581 80639385 80521129 78213190 70739313 56694512 41479651 29109744 22981584 19878582
15573 19878582 18324797 16847065 16367824 15419037 15674247 15159984 15396948 15398065 15550458
15564 15550458 15098414 15502739 15460071 15775220 15829795 16427233 17501414 18592550 21635509
15555 21635509 28786663 42886310 59260245 72077345 80947429 87554740 92134175 95990551
15547 95990551 98126027 96678668 92775534 80832431 61029213 40815732 28180433
15540 28180433 20935768 16846609 15388079 14237684 12657873 12561681 12257003 12130746 12272997
15531 12272997 12192974 11701270 12221072 11667377 12120127 11382116 11540018 11207830 11091959
15522 11091959 10746117 10763816 10876219 9740872 9975032 10167475 10274492 10235541 10359664
15513 10359664 10595673 10627537 10992266 11221451 11246750 11256943 11509350 11837651 12009822 12262141
15503 12262141 11843263 11970064 11600965 11690074 11291958 11005779 11107654 11043499 10941875 11094465
15493 11094465 11310668 11105131 11979512 11548587 11971302 11660834 12006711 11734598 12480893
15484 12480893 12860462 13100530 13112882 13983508 13258844 13889120 14085138 13946662 14373048
15475 14373048 14578384 14838552 15172804 15268574 16242709 17079040 18398437 19485439 20899485
15466 20899485 21798451 22502262 22612075 22883629 22568858 22365184 22264858 21537906 20552398
15457 20552398 20816138 20751507 21295588 21908726 22624934 23781091 24669941 25581073 25760566
15448 25760566 26387734 26039763 25494888 25120708 24614123 24150357 23644636 23219657 23705111
15439 23705111 23505170 24325302 24062025 24637930 24690814 24441673 24356380 23903032 23548163 22780735
15429 22780735 21791255 21152461 20203657 19554627 19451761 18280898 17759214 17091241 16451908
15420 16451908 16339611 16468400 15245244 15106036 14757680 14379114 14209309 13905497 13948867
15411 13948867 13903135 13933858 13950576 13632325 13295297 13566180 13512914 13771228 13833910 14336077
15401 14336077 14088054 15163143 15348018 15165503 15705736 16439808 16228502 15920087 15937514
15392 15937514 16280747 15790101 15511910 15195834 15181984 14678158 14494997 14633817 14436654
15383 14436654 14323985 15038861 14949920 14833910 15046213 14603539 15039736 14255241 14389639
15374 14389639 14345278 13759206 13906752 13801683 14252260 13995535 14091255 14574138 14723921 14702793
15364 14702793 15656096 15360674 15372234 16410068 16106509 16436625 16264427 16918084 16943255
15355 16943255 16553673 17162565 17602772 17643115 18440074 19678724 20756819 23588143 28450557
15346 28450557 35440234 42684728 47894764 52492370 55555584 57873678 59522946 60212459
15338 60212459 59744568 57616619 52061115 45657028 38839190 34801326 33427950 32137831
15330 32137831 32143534 31222752 30851502 30443299 29641403 28012716 27054545 26245809 25755954
15321 25755954 25741551 25524895 25865711 26409181 27750100 29095527 31656561 36987869 45667783
15312 45667783 56872479 67813954 77054741 83862609 88698062 91803222 93743433 93638465
15304 93638465 89039588 80526919 67956186 52210432 40203519 31587995 27261098 24588877
15296 24588877 23115519 22332726 22537556 22356738 23015457 22639201 22879764 22891615 22742707
15287 22742707 23164118 23622442 23933410 23592426 23972165 24267924 24710668 26164640 30015556
15278 30015556 36165458 41988686 46255551 49402793 51625456 53381053 53558775 55007639
15270 55007639 53560516 50989778 44709380 36750854 30688418 26285045 24273376 23119038
15262 23119038 22294283 21589212 21498830 20739744 20384275 20721623 19947770 20288282 20469966
15253 20469966 20338604 21283477 21504986 22742038 23674181 23953672 24051844 23604758 23761985
15244 23761985 23395093 23479225 23899780 24102830 23119934 22813975 23456025 23700612 24908544
15235 24908544 26072396 27709821 28483810 29604927 30854236 30202214 30658562 30903519 30392251
15226 30392251 29183776 28133358 26700272 25732929 24601527 23939664 23646674 23948190 24639552
15217 24639552 24682981 24566707 24534941 24915855 25158390 25766478 25782800 24574194 24536056 23866605
15207 23866605 22171459 21272114 20246453 18978387 17325044 16466717 15348362 14898424
15199 14898424 14191413 14134800 13739280 13517449 12855388 13440296 13371824 14202908 14005151 14736334
15189 14736334 15658323 15617709 15862492 16102792 16610933 17069940 16868566 17040801 16920050
15180 16920050 17230460 18502641 18081242 18210516 18986615 19145828 19738554 20091495 19360789
15171 19360789 19547565 19183341 19211979 18675425 18127257 18080171 18315515 18502935 18787915 18300793
15161 18300793 18902479 18440427 18770983 18676804 19076908 18681106 19517611 19159293 18786554
15152 18786554 18662654 18861797 19246041 18639478 18619673 18328725 18250475 18270361 18117611 17783932
15142 17783932 18885176 18599336 18780843 19058787 19565510 19464617 20078259 20754434 20886215
15133 20886215 21085523 20756103 20710482 20816504 20932834 20581586 20121882 20424478 20115299
15124 20115299 19711697 19760932 19549019 19297158 19178977 18685261 18313500 18116065 17968421
15115 17968421 17407654 17314077 17432520 16931433 16911325 17087221 16833169 17320575 16826030 16930005
15105 16930005 16404363 16729651 16838048 17236269 17448399 17690150 18396543 18311973 19392759
15096 19392759 19687657 20949780 21459880 22260203 23678351 25083643 27033739 30181010
15088 30181010 32833770 35638449 37935066 39688104 40932018 41753763 42447031 41935112
15080 41935112 41447211 40059478 38029506 36108686 35235982 35859576 38366595 40945313
15072 40945313 43071144 44847467 46059849 47495907 48722310 48900890 48829734 48631157 48344247
15063 48344247 49284473 51184131 53826364 55840005 58335041 60919682 64982099 67888988
15055 67888988 71591511 74138253 75290601 73299493 72129787 72682594 74852018 78482149
15047 78482149 81391865 82646586 82403717 81737386 82078077 82795215 83845105 83285930 82054803
15038 82054803 79255934 75035613 71606150 68618419 66786906 64345659 61392256 57882035
15030 57882035 56398345 56510123 56267172 56396013 56689952 56819304 57554629 58083955 58504391
15021 58504391 58596508 58500473 56889690 55475492 56274010 59486590 64544767 69953011 74231712
15012 74231712 79178002 82344367 85460611 88374350 90118809 90826144 90884296 89509417
15004 89509417 87989857 87747496 88845142 91445402 93908616 98038642 101802009 105457710
14996 105457710 109790906 113183437 117494785 123022377 128663771 134424847 139546332 143039530
14988 143039530 147265346 151406359 155430228 158393622 161521397 162578878 160941051 159715668
14980 159715668 157991655 158436295 160367985 164522163 169287152 177414282 186802341 197312228
14972 197312228 208477548 219439002 228471558 235458368 241006797 243152088 241879976 237195686
14964 237195686 228833057 218046240 205241015 190607966 176718950 163908645 152481566
14957 152481566 144277789 139283839 137131397 139369037 147867023 160887170 178385669 200393105
14949 200393105 226171222 254755516 283108263 311805136 340722610 365535104 379980467
14942 379980467 383480293 378625945 368247567 353459108 334374188 312760530 289006090
14935 289006090 261070338 232050686 206959051 190709419 180248890 172972814 165685024
14928 165685024 155403523 143822368 132371271 122905108 115823071 111651766 107597610
14921 107597610 103443341 98284394 93307587 87858167 83546564 78801577 75243735 70397791
14913 70397791 63134128 54179457 45730363 39543838 35842155 33404387 32653421 32298593
14905 32298593 32572711 32533874 32605649 33682108 34237562 35937435 36553608 39080581 41890911
14896 41890911 45930074 50738702 54911495 58758227 61276058 63274351 64301343 66489245
14888 66489245 67716228 66971100 64510316 59562367 53194226 48013749 44737664 43071258
14880 43071258 42286823 41382951 39485199 38114621 38645114 39054080 39701200 40682985 41283936
14871 41283936 42009329 42372835 43203907 43816869 44602766 45615410 45794668 45733356 46210407
14862 46210407 46815915 49335270 53243774 58541567 65389473 73310529 81426572 90605508
14854 90605508 98088773 103176838 106810612 108067995 106770043 102519810 95025973 86388213
14846 86388213 76532143 66990031 57718083 50399613 45347278 42793842 40780347 39768516
14838 39768516 38625587 37926998 36643243 35880887 35252399 34669537 34315869 34269850 33763538
14829 33763538 32954131 32603756 33029690 33441482 33740306 34167361 35778427 37178025 40283532
14820 40283532 46529284 53105100 61041017 66821275 71186388 74129230 76119943 76422563
14812 76422563 76180041 73454066 67929169 59155296 49545717 40167463 33542437 29875314
14804 29875314 27870442 26450579 25869444 25348742 25366946 25112434 26222320 26351266 26222248
14795 26222248 26135686 25599335 25713012 25237159 25510600 25403470 24927445 24772852 24013585
14786 24013585 23529559 23876096 23506435 23625526 23822887 24615291 24896019 25283158 26541448
14777 26541448 27404483 28097923 28649397 29054657 29024193 29641769 28678211 28259762 26895147
14768 26895147 25806535 24235732 22670324 22194909 21488575 21231396 20713380 20481923 20742633
14759 20742633 20940189 20889470 21087204 21557214 21452463 21926431 22709944 23140874 24579157
14750 24579157 25845061 26383749 26948869 27163601 27242511 27269828 27218002 27318486 27363586 26814798
14740 26814798 26166408 26263908 26859165 28254101 29895484 32790487 35928193 40462298 46493634
14731 46493634 56069834 72376840 94884007 122924531 153691329 184388420 212206285
14724 212206285 233057053 248771916 258088506 260607908 254117440 237504862 209040347
14717 209040347 175343461 139378759 105829963 78760387 60448749 49845341 43505397
14710 43505397 39002764 35465138 33184710 31124928 30113829 29205127 28399988 27527848
14702 27527848 26138607 23676097 20887341 19861625 18778915 18778436 18478988 19348462 19811766
14693 19811766 20460648 20194370 21063440 21597822 21650674 22360439 22549575 22539151 21819851 21412170
14683 21412170 20702311 20238048 20668074 21239873 22484731 23171147 24252781 26451387 27681600
14674 27681600 28688579 29243595 29093887 29117805 27938644 27355033 26937709 25410774 24783201
14665 24783201 24256852 24965482 25323421 24779966 25488068 25679802 26247844 25949344 26319896
14656 26319896 25437154 23337871 19853602 16964608 15455749 14606913 14931568 15202055 17042397
14647 17042397 19365606 20985909 22167070 23424466 24127638 25286457 26251377 27458764
14639 27458764 29051888 30513169 30138829 30306920 31060285 31929396 33078477 32818592 33323243
14630 33323243 32170392 30624606 28073500 24700794 21548370 18488288 14970936 12603478
14622 12603478 10872350 9635837 9823124 9836556 9984419 10275245 9965304 9847233 9709748
14613 9709748 9859440 9816054 9833490 9943285 9877519 9857312 9119863 9204361 8848769 9097283
14603 9097283 9737501 9794336 11110591 13732093 15215535 18198749 20424582 22494105 22898873
14594 22898873 24480384 25175663 24598808 23934487 22119698 20081587 16935622 13673856
14586 13673856 11441214 10250675 9512636 9275564 8771420 9303030 9061840 9524776 8900637
14577 8900637 9435194 9436885 9317816 9710923 9475876 10287039 10822728 11216053 12588290 13436204
14567 13436204 15597878 18684082 21608976 23102980 24935571 27066072 29299533 32871928
14559 32871928 38184526 45880758 51636101 54746276 55633159 55838699 57333873 57675030
14551 57675030 57793338 55625791 51401567 44471087 35874372 28395854 25782683 26855396
14543 26855396 32833707 41452274 49988363 57426578 62737255 66885110 69366272 70725186
14535 70725186 70219924 67862946 61991992 53005640 42311913 33936122 28355295 25406693
14527 25406693 24276846 23792222 23779132 23950290 23758205 23250834 23501313 25420544 28935696
14518 28935696 34783173 39591881 42946592 46370618 49238316 51733962 54130936 55532731
14510 55532731 55921317 53293406 47869403 43297017 39246305 39067700 40736022 45188228
14502 45188228 48763055 52436293 54145386 55205753 56278549 56943962 56919077 56578605 55337465
14493 55337465 51890706 46758843 40546242 36343690 33104348 29671566 26013271 23375059
14485 23375059 22014662 19568444 16378979 12902511 10567324 9335566 8941766 8508824
14477 8508824 7924122 8017938 8742385 8720315 8898275 9758278 10815459 12223389 13995868
14468 13995868 15453418 15899090 16252700 16502861 17377562 17577310 18143994 17563796 17033771
14459 17033771 17066906 17686209 19061268 19666156 20961337 21846667 23166394 23226986 23095814
14450 23095814 21908751 20828443 17976694 15220496 13065946 12046928 11334271 11060098
14442 11060098 11662009 11769328 12092981 12563003 13091117 12906066 13742787 13995615 14340263
14433 14340263 15427784 15781053 16612367 18695074 20798916 25179330 29930372 35448894
14425 35448894 40681128 44418281 47813196 50459650 52570670 53640385 52564540 50518042
14417 50518042 46341057 40798462 35302145 29839857 26551013 23807650 22268214 20368150
14409 20368150 18558224 17049763 15570375 14091881 13395630 12566533 12588602 12119857 11834054
14400 11834054 11553002 12090609 12505438 12664110 13640816 14674025 16268104 19863029 24666182
14391 24666182 32132722 40607780 49959418 58045003 64569566 70026913 73970410 76824155
14383 76824155 77487789 75164559 69337758 60963910 50941527 40681707 32661392 26566510
14375 26566510 22815181 19689511 17487439 16609545 16088919 15307913 14545223 14389334 14313889
14366 14313889 13758698 13765436 13764195 13032862 13330718 13203923 12973223 13498442 14209910 14956837
14356 14956837 17072725 18412433 21927909 25496226 28672543 31895861 34591217 36178105
14348 36178105 37218188 38089390 38119997 36405706 33520748 30371803 25917639 22222243
14340 22222243 18667897 17012761 16176269 17058178 21016003 28179642 34468783 37889558
14332 37889558 40345969 42640605 44007659 45421282 45863651 44950176 42163727 34227821
14324 34227821 24694153 17412356 14636699 13610697 12544757 12156466 12498992 12531166 12439222
14315 12439222 12607460 13168426 14673684 14878739 15716945 16493845 17289486 18213438 18903205
14306 18903205 20391385 21293018 22240398 23002064 23942720 25828062 27422403 30073704 33399178
14297 33399178 37257463 42099840 47691665 54895136 64250054 76049972 91371716 110442672
14289 110442672 134748321 163996631 196219757 226270920 252123553 271133380 283483485
14282 283483485 289785418 290238987 284017156 270488866 250296510 222082114 189580004
14275 189580004 157419750 128751865 105121206 86680920 72636657 60691480 51728437
14268 51728437 44423305 38532412 33862099 29928292 26609347 23599428 21967170 19712564
14260 19712564 18428596 16927636 15369891 14500010 13805498 13226545 12877332 12612355 11944726
14251 11944726 11055895 11219958 10809487 10535594 9820799 9399174 9105584 8483137 8840805
14242 8840805 8980377 8119977 8000632 8327541 7855072 7791881 7674594 7973235 7648787 6940631
14232 6940631 7186585 7040272 6767435 6292990 5742417 6068201 5881216 6001589 5950569 5448052
14222 5448052 5770890 5216555 5328636 5717383 5349006 5693201 6460532 6087335 6580583
14213 6580583 5822161 6272771 6088138 6262651 6310119 7112423 8580956 9127118 9413721
14204 9413721 9637990 9625558 9429105 9979544 9810786 9546898 8563268 7998481 6248310
14195 6248310 5583869 5491692 5440722 5095692 5707714 5398338 5787674 5675049 6556698 5951924
14185 5951924 5567802 5434137 5110215 5292939 4896140 5049116 4465722 4845509 4688527
14176 4688527 4146761 4830944 4845293 4644404 5811115 5987677 5807682 6588471 6182071
14167 6182071 6605310 6347364 6475580 6173388 6356980 5938162 5626965 5122736 5020878
14158 5020878 4983626 5114409 5177265 4767158 4992808 5534314 4673971 5262301 4742136 4572130
14148 4572130 5006327 4832679 5339411 5194035 5144710 5638102 6191159 7051424 8442264
14139 8442264 10961288 12907909 14851909 16028131 17418066 18983423 19282473 20025662
14131 20025662 19526652 18110294 16129004 13496336 10438459 10053111 8775584 7320429
14123 7320429 6982496 6874406 7158415 8200794 8863774 9308375 9433608 10066959 10366549
14114 10366549 10099214 10132793 9921681 9244943 7900869 6621921 6093947 6165537 6199404
14105 6199404 6394818 5955429 6212687 6416102 6568664 6172110 6770640 8047072 8853439
14096 8853439 9262193 10262756 10771297 11398217 11769083 11696266 11561069 11649640 10620794
14087 10620794 10156682 9182944 9744562 10975797 12004267 13151624 13881121 14967780 15714257
14078 15714257 15223480 15756125 15253916 15128048 13211478 11379967 9960920 8421053 7942642
14069 7942642 7416450 6977733 7069473 6912374 6769500 7244299 7362694 7963713 8067945 9249898
14059 9249898 10045152 10126638 10583935 11219388 11697296 12279699 12267997 12462764 12605748 12178207
14049 12178207 11575030 11329945 12116097 13016809 13533434 14501164 15802726 17184587 17873824
14040 17873824 19368321 20314769 20736360 20392850 21005055 20731441 20386415 20608513 20416873
14031 20416873 20724043 21670621 22139887 24349230 25819764 28384493 30620257 33734504
14023 33734504 37828791 42747661 48556528 55844701 64514164 76467919 91393586 112157679
14015 112157679 137958900 169487614 203400446 235376658 261761941 281246434 292860823
14008 292860823 298562012 297747492 290577081 275530329 252838695 221600393 186424198
14001 186424198 151654903 122491681 99377143 81143879 67471634 57059492 48398481
13994 48398481 42083929 37437400 33403678 29741871 27436937 25843748 24509134 23227058
13986 23227058 22602187 21207396 20944854 20608854 20264468 19962509 19598846 19175480 18410011
13977 18410011 17971773 17735569 17031447 16525573 15513713 14075657 13758219 12940937 11928996
13968 11928996 11040134 10246247 9197504 8520836 8812735 8120870 8003383 7366870 7287419
13959 7287419 7475155 6975199 6755875 6677876 6133738 6029327 6323976 6500105 6488327 6908245
13949 6908245 7667995 8046033 8222148 8281808 9159296 8780766 9210993 9789211 10592606 11580081
13939 11580081 12635184 15317947 19566187 25486600 32204001 40143087 47691956 55244520
13931 55244520 61199565 65313363 68398589 68522187 65808180 60584161 53328261 44727581
13923 44727581 35653858 26629676 19189664 13920376 11184136 8897236 7449967 6767527
13915 6767527 6202022 5301647 5485438 5025488 4818018 4957789 5028299 4434301 4780161 4394512
13905 4394512 4282164 4566682 4568073 4120720 4405181 4350126 4324723 4340215 4025666 4160217
13895 4160217 4053982 4177149 4176269 4507599 4474077 5020249 4130550 4402367 4618517 4380075
13885 4380075 4846155 4189322 4233879 4460162 4882072 4345003 4282072 4492014 3620643 4517233
13875 4517233 3926893 4079835 3916379 3794538 3696016 3998748 3485515 3992602 4771404 4028552
13865 4028552 4157570 4472110 4137785 4041602 4403443 4507872 4002800 4508843 4215723 4138706
13855 4138706 3836660 3813875 4376394 4008180 4322606 4582415 4231065 4714435 4318856 4718068
13845 4718068 4823934 4381739 4822519 4515843 4685299 4142302 4402555 4338319 4164159 3319426
13835 3319426 3423877 3490368 3447256 3647356 3464008 3262206 3402714 3206978 3476035 3343401
13825 3343401 3371197 3461772 3667415 3852754 3358312 3510219 3850197 3598299 3346049 3656822
13815 3656822 3791014 3361331 3561033 3456386 3716756 3475976 3198960 3189292 3439612 2997290
13805 2997290 3479928 3194728 3577387 3370385 3415556 3947142 3426943 3279186 3709821 3737555
13795 3737555 3711741 3975852 3924451 3925895 4188636 3748968 3531649 3801320 3617124 3752301
13785 3752301 3296170 3833608 3565157 3808054 3357326 3373264 3122374 3429340 3338353 3766153
13775 3766153 3772262 3691837 3847794 3841994 3165182 3770891 3460522 3779877 3763593 3755052 3880313
13764 3880313 3416634 3757881 4085417 3815738 4166071 3900897 3550205 3304049 3422121
13755 3422121 3502233 3277613 3386048 3339764 3510960 2936616 2867418 3327679 3143071 3198979
13745 3198979 3222497 3321615 3031381 3074567 2676113 2932447 3023289 2870119 2975105 3006918
13735 3006918 3415963 3631509 3302296 3575910 2783890 3327389 3472487 3737623 3849040
13726 3849040 3769765 3505998 4540160 4626764 4540977 4858226 4395989 4534083 4676622 4529623
13716 4529623 4325341 3770405 3717914 3369393 3511004 3442012 3642436 3092415 4023073 3598728
13706 3598728 3964738 3659541 3552403 3784143 3829921 3438078 3622341 3722752 3986934 4492441
13696 4492441 4623601 4873128 5829248 6175450 7150074 6940450 6904507 7379756 6950834 6959664
13686 6959664 6779673 5736839 5525235 4489554 4691186 3939715 4031591 4515772 4144083
13677 4144083 4125166 4016848 4041852 4328210 5131235 4858768 5203539 5299584 5606548 6314162
13667 6314162 6126931 6856422 7394002 8642737 9214599 9266354 9563479 9825888 9724040
13658 9724040 9190013 9575722 9148211 8474445 7527079 6629977 5988036 5997654 5441915 4552535
13648 4552535 5254503 4822322 4349309 4529931 4389068 4304962 4611329 4352879 4284020 4691463
13638 4691463 4883894 4942257 5528593 6350724 6962408 7721561 8192297 8056652 7824340 7955549
13628 7955549 8056670 8038282 7492382 6481998 5734093 5196102 4678511 4220646 3846669
13619 3846669 4149132 3754169 3213556 3652315 3638600 3416054 3805686 3697519 4163226 4340449
13609 4340449 4480605 5200301 4969302 4873960 5652598 5288245 4686618 4816277 4854815 4264386
13599 4264386 4575443 3929173 3966292 4167170 4040237 4327398 4920966 4712642 4757746 4946278
13589 4946278 5256403 4716311 4848462 5311611 4687505 4663101 4640189 3978917 3472496 3724301
13579 3724301 3476277 3653323 3206447 3381570 3795905 3359209 3164833 3461787 3225246
13570 3225246 3183031 3092487 3133430 3009654 3545827 3215266 3661373 3927897 3214605 3391526
13560 3391526 3377404 3364826 3479710 3411111 3123783 3235832 3395370 3201511 3217237 3971927
13550 3971927 3266301 3259352 3813416 4006899 3365735 4059640 4469951 5167009 5794671 6487029
13540 6487029 6636823 6479409 6926676 7347823 6956189 6712386 6694460 5986313 4910189
13531 4910189 4977588 4081700 4181035 4352120 4902664 5199522 5543621 6209063 6674219 6923697
13521 6923697 6242212 6747143 6387107 6456882 6512908 5416434 4556734 3663345 3886059 3535122
13511 3535122 3482429 3000294 3262583 2693305 2632807 2598957 2612635 2620030 2860335 2444669
13501 2444669 2849445 2944806 2770739 3102816 2739786 2733130 3036559 2577957 3002175 2836592
13491 2836592 2670663 2773425 2955016 3013426 3312445 2686344 2541546 2890636 2673023 3167238
13481 3167238 3204455 3079589 3100343 2535739 3208092 2726556 3021041 3067172 2590768 2873511
13471 2873511 3178831 3034973 2881438 3068833 2579443 3317249 2987858 3123684 2533630
13462 2533630 3035897 2851286 2770517 3076249 3386064 3271831 3269638 3800300 4174184 4682599
13452 4682599 5201470 5553170 6143840 6649946 6294154 7291201 7146048 6605714 6445081
13443 6445081 5990512 4899655 4225246 3835000 3819666 3502667 3010191 3306777 3634597
13434 3634597 3116779 2906388 3011685 3368202 3145017 3220240 2858742 3579693 3462762 3780997
13424 3780997 4345861 4717872 5113200 5714323 6726924 6503096 6868599 6534254 6872308
13415 6872308 6614186 6220774 5943244 5170452 4597906 3833968 3368783 3133436 2942305
13406 2942305 3211692 3582386 3595475 2708565 3367624 3061385 2997990 3058830 2939667 3240753
13396 3240753 3375362 3319362 3417120 3127114 3395689 3265051 3876442 4202888 3731434 3909304
13386 3909304 4576284 4837925 5751006 6047917 6193021 6312741 6205398 6006408 6136487
13377 6136487 5711048 5438626 4806748 4729942 4397260 3885982 3718379 3843839 4101314 4041171
13367 4041171 4135716 4557440 4185400 4444959 4600823 4060355 3984835 4727077 4437222 4502307
13357 4502307 4596465 4032166 3879071 4685245 4619696 4935336 5503383 5533367 5666847 5177373
13347 5177373 5145900 5177041 4674324 4677287 4063996 4186721 3710378 3820530 3914114 3429675
13337 3429675 4500023 4184821 3755089 3616034 3904909 4074219 4062562 3862853 4138085
13328 4138085 4147818 3532122 3990381 4169596 4066729 4038049 3719349 4191373 4265775 4358555
13318 4358555 4197793 4257017 4902359 4879530 5610876 5293779 5828422 5699440 6164101 6467956
13308 6467956 6263563 6088591 6174555 5908379 5983149 5715368 5606079 5703702 6083727 6482828
13298 6482828 6236238 6469968 6677903 6594753 6870022 7083486 6741052 6793224 6261457 6430684
13288 6430684 5881045 6585910 6203212 5974694 6134231 5906262 5944391 6529979 6252694 6515052
13278 6515052 5898753 6512601 6392489 6383007 6853991 6788055 6731733 6637221 7233085 6842761
13268 6842761 7041264 7624575 7432702 7398260 7726426 8212328 8110721 8252658 8565035 9009342
13258 9009342 9744601 9913297 10338392 10343752 10708937 11475463 11505430 12146370 12149139 12886692
13248 12886692 12777367 12734852 13064152 12876220 13209078 12821775 13224912 13341147 13510481
13239 13510481 13727916 13931496 13857619 14453403 14290165 14657404 15222251 15400194 16117720
13230 16117720 16910309 17306504 17869818 18919414 19007868 20124862 19656322 20127757 20172337
13221 20172337 19508912 19513116 19373649 18665513 18225016 17967152 17961417 17409723 17288907 16239668
13211 16239668 16178356 16279290 16450741 16290734 16274299 16060762 16040480 16296426 16259102 15853187
13201 15853187 16803762 16554674 16181356 16350861 15957208 15810166 15498571 14771649 14113517
13192 14113517 14249256 13754348 13855176 13453700 12755170 13039000 12609046 12300461 11804252
13183 11804252 12115640 11586707 11483053 11618424 11233198 11179094 10905419 10614186 10689574 10354090
13173 10354090 10697123 10742614 10367241 10516515 10558306 10199478 10577114 10311841 10668227 11114381
13163 11114381 10871870 11798147 11511553 12328607 12024858 12613102 12967933 13239201 13392421
13154 13392421 13165826 13168907 13098479 12566934 13141365 12815192 12413694 12545858 12431629 11780810
13144 11780810 11863317 12100177 11972244 11867113 11440629 11252734 11304081 10660484 10374401 9493593
13134 9493593 9668932 9070383 8709141 8431386 8024000 7895440 8057266 8168745 8801674
13125 8801674 8731763 8161150 8661051 8589710 8146474 8181741 7628485 7611775 7324217 6971408
13115 6971408 6519284 6725536 6281627 6805575 6721104 6392014 6273358 6141807 6539817 6290596
13105 6290596 6253272 6143804 6353255 6407636 6093013 6811710 6477574 6937169 7100639 7607449
13095 7607449 8503231 9002079 9405407 10075309 10481825 11103172 10960255 10834051 10678442
13086 10678442 10543635 10673608 10322782 9770132 10443593 9785930 10030551 9713631 9560863
13077 9560863 9247713 9288112 8837627 7869289 7414141 7103188 6378962 6559394 5844732 5658674
13067 5658674 5766521 5423473 5520857 5460778 5782233 5551012 5605139 5177804 6010703 6100447
13057 6100447 6130298 6335054 6334912 6135979 6201563 6204044 5903363 6204194 6253304 6003099 5595741
13046 5595741 5230494 5434769 5133983 5738858 5584099 5278300 5116741 5694534 5534177
13037 5534177 5710293 5505725 5987407 5950192 5802398 5655320 6392733 5821960 6210674 6284429
13027 6284429 6046901 6490001 6898732 6807065 6894681 6589477 6782091 7228341 7217362 6884113
13017 6884113 7409258 7554738 7213687 7550869 7890110 7875236 8028329 8081430 8176282 8772402
13007 8772402 9026742 8906920 9061923 9372333 9851919 9798291 9625366 10418080 10344378 10488860
12997 10488860 10241464 10760946 10495059 11186455 11488708 11530726 11342621 11949702 12477189
12988 12477189 12292079 11893597 12241383 12123734 12363381 12465482 11822170 12160353 12074342
12979 12074342 12176043 12480521 11633031 12386601 11934668 11849994 12395285 11582483 11045360
12970 11045360 11175363 10829189 10920448 10767531 10369506 10741950 10552744 10626864 10669591 10280588
12960 10280588 10195203 10255897 10248771 10291026 9977318 10160828 10081716 9888357 9570990 9915347
12950 9915347 9683565 9954796 9767732 9660939 9818563 9782722 9924706 9465201 9730772 10200246
12940 10200246 9606019 9918107 10086488 9658495 9935238 9792554 10181485 10444582 10517307
12931 10517307 10933692 10920292 10600724 10625384 10657024 10970597 11135558 10863253 10724645 10803090
12921 10803090 10337585 10429800 10514063 10610514 10871008 10718123 10392703 10164669 10687681 10109474
12911 10109474 9640768 9054179 9525352 8975759 8694937 8661759 8344410 8568639 8375252
12902 8375252 7910516 7878240 7803775 7564706 7543725 7273303 7016929 6925701 7107015 6848814
12892 6848814 7085629 7026191 6860313 6303324 6447939 6329228 6617520 6182496 6233135 6417771
12882 6417771 5497546 6085853 6093950 6479401 6462724 6134807 5833507 6053556 6426144 5933786
12872 5933786 6194614 5562676 5666188 5505480 5613984 5955173 6123935 5818934 5333238
12863 5333238 5561931 5504925 5561900 5532833 5455781 5474077 5291505 5455097 5375934 5322335 5292806
12852 5292806 5190019 5188249 5154147 5380406 5146997 5760702 5491666 5787399 5754544 5606179
12842 5606179 5324482 5704617 5917062 5295047 5742891 5551872 5783649 5641924 5945608
12833 5945608 5607465 5533129 5956849 5583919 5835268 5921503 5641936 5468968 5759769 5355567
12823 5355567 5661336 5889612 5560586 5344064 5502366 5640836 5472056 5706467 5331567
12814 5331567 6020217 5531238 5439336 5323465 5899580 5381167 5604685 5473490 5416073 5589922
12804 5589922 5701932 5920531 5835854 5719541 5622756 5700153 6041533 6099833 5795154 6467407
12794 6467407 5755153 5794702 6131699 6225758 5644687 6430167 6152394 6159165 6157857 5939424
12784 5939424 5634344 6192396 6490964 6123285 6524163 6655248 6435935 6332261 6033339
12775 6033339 5820273 5790465 6162956 6080230 5810224 5843636 6080602 6156713 6196524 6316902
12765 6316902 6228769 6907626 6441727 6146671 6797058 6733363 6449324 6500363 6671643 6585776
12755 6585776 6217592 6583449 6696259 6365945 6730469 6200383 6143425 6283938 6714912 6141989
12745 6141989 5974768 6296610 5961120 6394430 6267586 6573057 6686823 6484996 6534815 6597478
12735 6597478 6744355 6837783 6628827 6229943 6942870 6741882 6303990 6393172 6588899 6331553
12725 6331553 6456829 7025729 6481134 6007450 6905405 6719025 6891389 6703288 6533585
12716 6533585 6015954 6628892 6583824 6731944 6359292 6597549 6840766 6649356 7049205 7322546
12706 7322546 7346544 7049075 7141508 7661346 7668623 8053756 8305669 7878689 8137398 8851179
12696 8851179 8854283 8782093 9063175 9047321 9265733 9670123 10528590 12347604 14079359 15146861
12686 15146861 15945258 16992018 16804280 17300764 17131760 16890485 16244681 14458971 12402486
12677 12402486 10831365 10547276 10098222 9467447 8927165 9609602 9301159 9303786 9679722
12668 9679722 9454133 9751998 9479238 10478176 9897638 10632635 10711557 10536395 10288496 9769461
12658 9769461 9566206 9927145 9511393 9332009 9226556 9215493 9373969 9433111 10013744 10663328
12648 10663328 11178196 11229066 11691691 11865128 11997733 12397746 12724190 12544022 12682398
12639 12682398 12732478 12118378 12325502 12592614 12658462 13080133 12511481 12387559 12975342 12392365
12629 12392365 12666256 12957917 13696844 13454522 13500014 13925867 13003306 13337470 13479338
12620 13479338 12831106 12701110 12218672 11599016 10895647 10568290 11039484 10254067 10795014
12611 10795014 11419780 11513764 12625454 13292593 13973955 15523521 16058659 16305710 16652872
12602 16652872 16304912 15896177 15576485 14509900 14330120 13089922 12180167 11839277 10394698
12593 10394698 10304658 10108101 9866200 10088135 10206309 10738231 11028608 10910055 11644349
12584 11644349 11457384 11662649 11631368 12165735 12493082 13064664 13304519 13604092 13781721
12575 13781721 13809303 14504145 14005808 14112101 13555885 12824586 12315554 11832924 10639224
12566 10639224 10016013 9699922 9902978 9885444 9596031 10444022 10564861 10191534 10067863
12557 10067863 10094966 10175566 10102325 10056861 9576408 10061395 10008259 10066206 10151921 10285786
12547 10285786 10112086 9977443 9736582 10395622 10687298 11275747 11918696 12711152 12892301
12538 12892301 13215865 13924549 13801905 14314262 14017755 13596258 13562767 12622399 11880575
12529 11880575 11391338 10469746 10280717 10193939 10309950 10546930 10518621 10578956 10510160 10393374
12519 10393374 10718513 11217910 11384130 11382837 11419089 12268302 12473041 14404012 15689948
12510 15689948 16704730 17749389 18618595 18797709 19837044 19665220 19697277 18766215 17765471
12501 17765471 15884397 14565860 13519375 12292942 12007697 12365490 11828573 11549218 11334496
12492 11334496 12022109 11681166 12171066 11595129 11709463 12072754 11874672 12206016 13036800
12483 13036800 13320091 14427075 15293309 15621785 16137993 16525957 16739780 16900525 17076120
12474 17076120 16919365 16506089 15390656 14648257 13807289 13555920 12906792 12744954 13267488
12465 13267488 12886070 13307804 13568591 14066750 13984360 14579233 14704855 15097578 15204103
12456 15204103 15186724 16075010 16134114 16830422 17197604 18246062 18465320 19032576 20089779
12447 20089779 20586860 20513164 21377718 21277895 21942694 22395962 22345439 22601302 22094475 22222329
12437 22222329 21955041 22232082 22583573 22202076 22301939 22762380 22424451 22908530 23576890
12428 23576890 23969419 24817650 25129924 26145140 27061196 27877875 28928758 29192235 30414741
12419 30414741 30573742 32091812 32647182 33732438 33718635 34401755 35016282 35314110 34986841
12410 34986841 34981044 34404915 33932577 33280903 32640579 32229919 31456384 30465412 29808878 29601842
12400 29601842 29416737 29481160 29469555 29490347 29552022 29801068 30362194 30807004 31144227 32542856
12390 32542856 32904232 33749696 34612707 35365724 36285783 36510281 36920072 37426776 37303214
12381 37303214 37671884 37797129 37911329 37314880 37270947 36652791 36994388 36968377 37107272 36444663
12371 36444663 36035925 36467737 35502880 35868996 35586231 35979806 35143421 34997941 34867755
12362 34867755 35451368 34939343 34707827 35121757 34865686 34292622 34757762 33884514 34377780
12353 34377780 33956326 34128911 33990859 33707811 33766459 32801515 32768428 32694869 32133083 32144856
12343 32144856 32374890 32725846 32889044 33410551 33253684 34387078 35334824 36301431 36570527
12334 36570527 37338329 38488891 38647693 39358928 39677452 40211204 40979480 41666821 41401729
12325 41401729 41819921 42824657 42679683 42289634 42446450 42756432 42865608 42882947 42576392
12316 42576392 42699624 42587558 42582043 42655709 42548359 43030794 43429452 43776860 44342696 44955907
12306 44955907 45488406 46692363 46982019 47506290 47850943 47967782 47884748 47215750 46926741
12297 46926741 46019609 44930778 44492297 42943714 42571285 41443709 40786034 39974498 39392292
12288 39392292 38815929 38936475 38095513 37754942 36717872 35247749 33794322 32849013 31917526
12279 31917526 31207826 30313577 29311715 29236374 28992673 28806783 28289201 28251578 27929255
12270 27929255 27858896 28080525 28059816 27731089 27390147 27739274 27259551 27487385 26565681 27370035
12260 27370035 26875350 27381662 27336741 28191226 28242297 29552886 29690488 31379940 32822906
12251 32822906 34491225 36057257 37873003 40348433 42282086 44209692 46230464 48590256
12243 48590256 50210369 51488133 52103598 53238062 53051959 53780588 52916396 53268081 51872119
12234 51872119 51481572 50110240 50046188 49716469 48532887 48077301 46731846 45194911 44060407
12225 44060407 42014919 39926875 37535466 35275736 33473646 31611173 29880231 28200617
12217 28200617 27370401 26451439 25374130 25080983 24474244 23939513 23579401 23188639 22454818
12208 22454818 22573473 22123812 21474745 20700761 21243328 20513094 20474064 20787866 20795182 21334121
12198 21334121 21257121 21231317 21151513 21223707 21807172 21716644 22448692 22626061 22972657 23413013
12188 23413013 23781760 24276393 24682404 25054023 25636058 25371657 25900415 26182088 26111251
12179 26111251 26364672 26310946 25879338 25578598 25904894 25516954 25121712 25566084 25419388
12170 25419388 25097623 25084054 25353463 24704621 25440531 25933092 25940665 27087654 27584797 27973060
12160 27973060 28543276 29849357 30068021 30603077 31409880 31381781 31667851 32097253 31764590
12151 31764590 31587747 31384021 31711699 32298284 33243125 34645868 36256843 37405151 39755929
12142 39755929 40931776 42419027 43859578 45147859 46768349 48343086 49480571 51631578
12134 51631578 53046934 55462990 58082788 60489260 63809398 66719328 71037067 74779583
12126 74779583 77716416 81410396 84290863 86523775 88399676 89358985 90318705 90339862 89610240
12117 89610240 88783530 87920000 85721068 84287404 82528914 81084474 79395157 78441269
12109 78441269 77455625 76383067 75025205 73949272 72800477 71566149 71360624 71439442 71468478
12100 71468478 71580140 71369076 71537357 71369759 71328989 71488002 71097702 70609513 70004660
12091 70004660 69369229 69075178 68667379 69208631 70666591 71612457 73568935 74656407 76757624
12082 76757624 77900196 79708033 80765660 80816824 80507769 79733924 79150705 78556098 78487111
12073 78487111 78252154 77864670 76569822 75565298 73964318 72560715 70615786 69011376
12065 69011376 66617332 64437510 62523243 60745743 58573039 56913000 55801086 55304113
12057 55304113 54468804 53555303 52617689 51998886 51303429 50515857 48598516 47958555 46771440
12048 46771440 46135340 45703555 44719652 43960961 43105945 42426296 41686678 41076202 39890320
12039 39890320 39317483 38107076 37204114 36515074 35923199 35154143 35054557 34769606 34916969
12030 34916969 35652516 36040489 36854241 37402028 37795867 37568672 37441882 36637547 36553896
12021 36553896 35481914 33608451 32671391 30852586 29922067 28689515 27870275 27569175 26610387
12012 26610387 26030403 25841755 25013059 24478891 24389582 23955378 23391645 23085378 22774077
12003 22774077 22422913 22253387 22710871 23157340 23664308 23641026 23443515 23196310 23315156
11994 23315156 22704613 22558075 22088793 22139104 21561916 21440807 21006264 20723666 20049708
11985 20049708 20587817 20656282 20722436 19738918 19392910 19249418 18436632 18075645 17354538 16949813
11975 16949813 16706754 16566747 16487812 15759226 15165571 15287681 14170696 14093401 13644926
11966 13644926 13415811 12906436 12548483 12853060 12447019 12269387 12513333 12254224 12753857
11957 12753857 12617397 12953362 13226256 13493524 13124872 14019996 13685906 14340700 14135445
11948 14135445 14319848 14412236 14656820 14387199 14780028 14819389 15167869 15852878 16373798 17393333
11938 17393333 17770088 18425336 18389658 18417441 18916646 18355475 18927449 18872215 18143830 18231905
11928 18231905 17479740 17615155 16887680 16522391 16573737 15945181 15759075 15051604 14596933
11919 14596933 14153474 14133476 13892789 13071407 13080184 12968476 13464020 13742266 13286134 14790033
11909 14790033 17983278 23722831 26737559 29327095 30429400 31883025 32425173 33343590
11901 33343590 32583105 32483098 29487967 23724410 17534324 14371752 12429998 12113781
11893 12113781 11857918 11571318 11529565 12084801 11834031 12633037 12914973 14068256 15357260
11884 15357260 16350030 17679688 18481620 19724070 19930173 21240012 21810011 22275816 22045710
11875 22045710 21337666 20281626 18561038 17344972 16578854 15300899 14186100 13412159
11867 13412159 12241384 11420368 11217683 10956168 10004453 10121482 10218860 9584720 9823435
11858 9823435 9522986 9709008 9974904 9620882 9852181 10081844 10365812 10532102 10622619 11743322
11848 11743322 11512406 11900151 12771770 13180027 13837224 14501398 15242849 16135120 16473711
11839 16473711 16890545 16513248 16494535 16407899 15656819 15383585 15096854 14875096 14173776 13957784
11829 13957784 13608774 13167355 13194239 12812240 13078862 12731800 12316626 11320497 10531399
11820 10531399 9744907 9318039 9010964 8376466 8880664 8422221 8400135 8368635 8206766 7803432
11810 7803432 7548704 7612868 7427389 7197338 7017851 7192202 7011684 6979917 6969778 6820524
11800 6820524 6929827 7046032 6517748 6780630 6467670 6952882 6755425 6713096 7315504 7328523
11790 7328523 7931041 8375432 9183090 9766129 10438445 10155691 10632890 10610172 10875638 10648520
11780 10648520 10160432 9653847 8972940 8037302 7442903 6887485 6629424 6826403 6330955
11771 6330955 6405676 5992551 6445093 6312034 5740684 6588588 5810256 5891426 5618859 5517037
11761 5517037 5997284 5940346 4941774 5320406 5342806 5688557 5561599 5930905 5712088 5048618
11751 5048618 5057020 5487823 5692987 5799614 5848245 5285502 5327591 5038827 4942569 5383618
11741 5383618 5910407 5504171 5510370 4985262 5341219 5291278 5649505 5243248 5542968 5573339
11731 5573339 5195737 5074424 5391457 5531705 4972926 5110914 5348678 5099512 4982674
11722 4982674 5021248 5235699 5059296 5361904 4874696 5014421 4998282 4942136 5097991 5028666
11712 5028666 5085544 4820740 5275837 4863560 5364258 4931337 5074970 5277001 5694361 5481766
11702 5481766 5395352 5117704 5458240 5353258 5675463 5150703 5692722 5151833 5291099 5095176
11692 5095176 5260861 5540793 5072018 5354822 5730611 5059223 5336594 5252424 5583692 5530133
11682 5530133 5111939 5135389 5238654 5525845 5671572 5548092 5371107 5290649 6189102 5527722
11672 5527722 5819567 5316064 5922468 5703509 5508657 5540768 5968414 5814407 5563891 5673684
11662 5673684 5367549 5206182 5876422 5679879 5307035 5966470 5955511 5791849 5764246 5556943
11652 5556943 5755566 5934156 5784278 5612560 5612005 5601608 5761413 5849881 5854595 5614700 5120437
11641 5120437 5702709 6124635 6039955 6037654 5521267 5967864 5822343 5930277 5884619 6230753
11631 6230753 5786172 6429008 6032946 5814168 6023485 6016877 6232817 5889085 6276573 6379846
11621 6379846 6259688 6522171 6185602 6031951 5904000 5994060 5775508 6335239 5943669 6109765
11611 6109765 6155008 5951293 6186241 5992531 6174473 6709419 6472248 6226370 5971189 6069294
11601 6069294 6955454 6549373 6759911 6701282 6930998 7100537 6802729 7177769 7256541 6941560
11591 6941560 7009927 6934578 6707075 6864564 6433276 6660883 7095208 6648386 6560656 6323494
11581 6323494 6727569 6791007 6460408 6616281 6319313 6382878 6634163 6769520 7000175 6924303
11571 6924303 6891987 6786045 6804573 7064432 6960241 6673800 7050812 6501673 7232896 6704980
11561 6704980 6902011 6649581 6563614 6362492 6514377 6798223 6911440 6540793 6353486 6859327
11551 6859327 6841417 6720403 6723376 7039707 6928419 6252387 6376923 6634016 6617686 6346129
11541 6346129 6549229 6115390 6570725 6392288 6600422 6275246 6067399 6653684 5462463
11532 5462463 6644286 6433972 6109297 6435420 6001206 6204793 6413200 6323340 6404904 6534922
11522 6534922 6356071 6196627 6213009 6228128 6357385 6397103 6226145 6129583 6355982 6200041
11512 6200041 6661173 6538631 6833871 6627031 6554563 6316375 6660773 6716665 6396739 6487645
11502 6487645 6465282 6337995 7014748 6581872 6571615 6657728 6480871 6637787 6440020 6138445
11492 6138445 6542750 6901547 6718981 6739601 7134856 6653459 6359980 6976120 7203036 6822623
11482 6822623 7073486 7295385 7181399 7195110 6929913 7014633 7167284 7456983 6945536 7135061
11472 7135061 6918011 7323927 7323186 7492289 6791587 6887295 7413375 7271864 6981296 7017424
11462 7017424 6664430 6649912 6652451 6417362 6695944 6890223 7101772 6875385 6981612 6358780
11452 6358780 7086562 7009237 6502959 6997966 6359145 6777928 7235188 6672758 6926127 6652153
11442 6652153 6843716 7002870 7150874 7164172 6788632 7230781 7061866 6787505 7561679 7119895
11432 7119895 7316563 7813925 7305746 7465086 7671531 7761960 7972906 8026040 7986461 8163964
11422 8163964 8619333 8424743 8803878 8679707 8818473 8663522 9238811 8925947 9347641
11413 9347641 9816867 9666436 9846859 10319212 10084138 10504468 10803017 10783852 11255983 11449133
11403 11449133 11376780 11565718 12103144 11845364 12252839 11772747 12745321 12452399 13133179
11394 13133179 13564599 13563218 14116605 13621394 13999727 14492944 14404842 14894306 15237112 15576074
11384 15576074 15992423 15605450 16114253 16301566 15824117 16510994 16839055 16688635 17410111
11375 17410111 16952750 18086717 17415705 18117348 18239461 17865289 18077745 18328749 18547985
11366 18547985 18703446 19004726 19237561 19045307 18833445 18933131 18973715 19392890 19346778 19720415
11356 19720415 19430922 19588002 19327262 19666115 19450739 19091049 19104486 19045789 19600070 19022349
11346 19022349 19321633 18826103 18771478 18700781 18554581 18671933 18622621 17879595 17891770 17648558
11336 17648558 17733544 17895073 17532821 17299615 17301066 16999183 17000259 16966259 16476805 16481440 16103510
11325 16103510 15305827 15681690 15164601 15622827 14997865 14542535 14973938 14341842 14004740
11316 14004740 13885831 13549770 13056827 13001872 12952544 12892650 12289960 12259676 11906360 11739841
11306 11739841 11547457 11080794 10467717 10778696 11059256 10679105 10353064 10248767 9946705
11297 9946705 9620743 9938157 9593155 9671981 9514679 9370151 9071215 9062462 9135737 8875211
11287 8875211 8337710 8497834 8331780 8391551 8268821 7540204 7668050 7904952 7756199 7806490
11277 7806490 7141816 7209352 7065548 7308113 7170398 7464272 7088500 7410455 6694835 7116595
11267 7116595 6823969 6723114 6437562 6981496 6841853 7067619 6899672 7216756 6747253
11258 6747253 6655899 6206127 6983142 6618990 6304398 7257537 6628842 6831479 6194245 6122635
11248 6122635 6296163 6557530 6245270 6325554 5727243 6273228 6686675 6381071 6402511 6658856
11238 6658856 5903016 6419884 6260123 6242814 6696558 6647540 6036906 6339473 6921398 7001911
11228 7001911 7075596 7125831 7591895 8342140 10005100 12149645 13600834 14516932 15728463
11219 15728463 16817740 17068108 17419781 16594760 16610989 15862554 13003626 10434979 8908060
11210 8908060 7813011 7491716 7089436 7205808 6845347 6551766 7032405 7332038 6522282
11201 6522282 6641245 6781731 6831228 7332094 7860944 8591765 10408946 12161616 13959333
11192 13959333 15438952 15801068 16130685 16723848 17458797 17200152 16118331 15212795 12967879
11183 12967879 9902395 8540161 7257542 7815414 7166135 6940349 6905045 6643253 6974553
11174 6974553 6429572 6301988 6168272 7088784 6730593 6467539 6901392 6021611 6672035
11165 6672035 6717326 7057261 6480185 6428957 6673592 7093534 6423615 6629921 6993771 6806308
11155 6806308 7173664 6665145 7072012 6900115 7012951 7059161 7054262 6974196 6770551 6990506
11145 6990506 6814303 7011956 7363482 7443618 6975197 7125079 7038580 7116079 7509936 7675588
11135 7675588 7186889 7369977 7093031 7150564 7055322 7219420 7346813 7408777 7480897 7661137
11125 7661137 7324190 8065293 7781661 8028047 7936830 7911351 8096720 7645925 8019024 8077524
11115 8077524 7854294 7941332 8217361 7929142 7770939 8285749 7702805 7930653 8283076 7701867
11105 7701867 7960192 8265280 8560692 8325524 7980516 8360663 8410759 8127982 7961548 7928206
11095 7928206 7830951 8426083 8002990 8518716 8157107 7950174 8371020 8451140 7868677 8205046
11085 8205046 8284800 8044977 8392140 8392731 8391701 8234579 8421468 8595799 8456319 8797731
11075 8797731 8621212 8650099 8674544 8444669 8316140 8786427 8697186 9060109 8844491 9146025
11065 9146025 10006954 9327278 9317576 9337411 9589261 10013795 10234619 10437474 10659722 10713426
11055 10713426 10538161 11105813 11301979 11467759 11122188 11294794 11468456 11913620 11752464
11046 11752464 11817335 12128963 12189445 12543972 12828314 12827795 12609158 12895253 13282273 14123030
11036 14123030 13894606 14267412 15039054 15363597 15300928 15548448 16572048 16305907 17029281
11027 17029281 17522301 17460642 17711022 17936708 18330376 18385683 18024715 18366105 18724806 19029185
11017 19029185 18992173 19220379 19913162 19805393 20057260 20820680 20878274 20642571 21488854 22019084
11007 22019084 22693976 23033785 23679706 24230330 24851325 25448071 25590918 26079712 26527250
10998 26527250 27123073 27390946 27345169 28087686 27934071 28316055 28415566 28411832 28232216 29093338
10988 29093338 29255215 29533775 29884650 30076394 30740670 31196655 32650697 33431462 34663245
10979 34663245 35503232 36148350 37205967 38164690 39106897 38896069 39868437 39937396 39729728
10970 39729728 39766874 40335350 40974293 41110598 42284116 43821970 44084576 45633912 46601314
10961 46601314 46956485 48486099 49930067 51284029 52182770 53468642 54747957 56608619
10953 56608619 58362398 59397749 60637496 61874588 62731832 63147824 64217732 65265394
10945 65265394 65621990 66451268 66899315 67637140 68646701 69938558 71724371 73376579 74585594
10936 74585594 76606980 78194125 79611351 81393995 83848551 84707552 86503270 87991738
10928 87991738 88778049 90616481 91195186 92304491 93072965 94128920 94587957 94489368 95030780
10919 95030780 94794026 95132846 95174713 94527484 94721106 94029725 93576758 92948770 92757240
10910 92757240 92581948 91970430 92102457 91845628 92219926 92548344 92841898 93095189 93491381
10901 93491381 94598254 94896497 95760694 96830027 98619465 99605005 101564636 103045571
10893 103045571 105248977 107587923 110719717 114175276 117428621 121631647 127243894 132250713
10885 132250713 138685670 146008099 153948598 162622562 172136905 182113836 191491133 200806163
10877 200806163 209420353 216846420 222346119 225780627 227445460 227028420 224351544 219243287
10869 219243287 212805313 204518231 195265734 185575340 176190421 166603580 155731351 146870223
10861 146870223 138075286 129967687 121531930 114197412 107102533 100075369 94319747 88214555
10853 88214555 83342503 78434959 73303117 69599649 65618333 61754875 58537191 55378746
10845 55378746 52242128 50168956 47509264 44579057 43105527 40936956 39450225 37668778
10837 37668778 36337595 34470737 32917375 31421832 30984248 29873283 28530063 27831157
10829 27831157 26101987 25510522 24508117 24136834 23089935 22110832 21785266 21243868 20701495
10820 20701495 20077977 19510572 18788337 17741647 17935586 17677846 17410141 17290708 16603165
10811 16603165 16201943 15875554 15458032 15486709 15133403 14506196 14447468 13734153 13761009 13440323
10801 13440323 13251176 12961001 12189952 12175393 12310514 12108218 11832190 11190840 11305693
10792 11305693 11287651 10808212 10607952 10326843 10267352 10892811 10365455 10338695 9968067 9724649
10782 9724649 10079370 9973739 9874518 9820250 9454702 9266626 9302160 8617719 8818851 8827086
10772 8827086 8442002 9142987 8830658 8606434 8482569 8224342 7635097 8168597 7400419
10763 7400419 8282640 8033056 7263367 7565161 7840625 7684931 7447785 7372478 7424335 7484284
10753 7484284 7907495 7005356 7861892 7978536 7671458 7453910 7339944 7374210 7903622 7920505
10743 7920505 7199756 7294358 6615596 6536381 6561759 6546816 6736123 6725394 6470492 6473146 6271435
10732 6271435 6542770 6753371 6782706 6497995 6457975 6966564 6737233 6588801 6756003 6662413
10722 6662413 6835838 6729388 6646320 6381699 6307120 6115335 6316821 5846247 6187692 5674786
10712 5674786 6138198 6235512 5800368 5634102 5816086 5961489 5767980 6154478 6137859 6236663
10702 6236663 6170691 6112687 6225232 5703026 5960437 5892045 6016729 5864639 6012206 5251903
10692 5251903 5454460 5700455 5500682 5994283 5755794 5952929 6012002 5974284 5607537 5801008
10682 5801008 5997739 5383754 6030794 6020754 5622396 6470779 6632915 6850617 7161539 7635123
10672 7635123 7646066 8035364 8136330 8155217 8009284 7365718 7356556 7021209 6749653 5987055
10662 5987055 5893909 6194283 5924584 5465744 5444612 5199428 4995976 5940022 6057700 6141148
10652 6141148 6663189 6732606 7228298 7281607 7529324 7786037 7491136 7631198 7119552 6404266
10642 6404266 6362835 6313047 5502040 5502047 4372957 4239396 4618326 4858059 4128904 4383631
10632 4383631 3850950 4289144 4573710 4371388 4466828 4089238 4324967 4219602 4197559 4314660
10622 4314660 3750702 4144903 3938301 4052757 4339893 4137381 3836397 4344349 4042556
10613 4042556 4066003 4028011 3778714 4156181 3642513 4211260 4138513 4268692 4254235 3717054
10603 3717054 4120820 3993067 4015030 3830125 4170731 4100284 4159439 4099858 4205264 3642089
10593 3642089 4265509 4618541 4235746 3620548 3817152 4040199 4043230 3950378 3821515 3514432
10583 3514432 3575100 3681448 4229015 3444421 4360146 3510748 3722680 3574802 3658943 3658131
10573 3658131 4264719 3956178 3989561 4140499 4118610 3995896 3819279 4281732 4225454 4135593
10563 4135593 3594088 4028235 4098744 4148163 3602517 4332089 3731451 3293097 3448862 3637472
10553 3637472 3654088 3512466 3304554 3996483 3620579 3217364 3351076 3158223 2885060 3410212
10543 3410212 3531983 3833451 3416579 3743723 3421278 3549082 2888487 3360773 3157208
10534 3157208 3360878 3114659 3594985 3396833 3309368 3645629 3506688 3495503 3401253 3640689
10524 3640689 3660269 3594228 3682849 4156256 4238972 5048085 5523800 5421622 6166907 6449053
10514 6449053 6218428 6512786 6609892 6343228 6449107 5756821 4964194 4530544 4038031 3926792
10504 3926792 4108829 3769458 3834075 3567645 3616343 4226017 4420142 4290527 4151671 4175255
10494 4175255 4205233 4317209 4745603 5388897 5863518 6098922 6419041 6777647 6775982 6853485
10484 6853485 7223666 7175043 7059504 6246251 5689249 5384501 4787837 5171949 5030868 4477297
10474 4477297 4832552 4482502 4257536 4751250 4205179 4477938 4923863 5275429 5204385 5785827
10464 5785827 6025369 6367632 6188469 6756693 6242436 6347402 6624047 6450554 5815837
10455 5815837 5738104 5389125 4870021 4881392 4995288 5200157 5239710 5019228 5005688 5093114
10445 5093114 5168471 4479700 5004198 5148786 5554477 5479679 5971617 6666309 6988164 8309613
10435 8309613 8427973 8758349 9181760 9383172 9173130 8966412 7940995 7315744 7088403
10426 7088403 5470701 5695073 5101882 4796370 4954731 5443739 4930144 4876283 4862087 4966894
10416 4966894 4787977 5111692 4752548 4758176 5901911 5733462 6276197 6380057 7183710 7232006
10406 7232006 7770979 8019926 8203134 7905672 7751543 7914213 7155160 6527466 6191257
10397 6191257 6003288 6263888 6950342 6777744 6880535 7486220 7868861 7549880 7660550
10388 7660550 8000027 7975786 7751191 7631054 7683850 7584042 7384208 7479136 7560725 7575045
10378 7575045 7747890 8096017 8732765 8699570 8660452 9161139 10041359 9801263 10825636 10684232
10368 10684232 10507188 10681692 11056535 11596698 11673060 11684455 11218049 11366131 10899679 10118121
10358 10118121 10094470 9919708 9076872 8846131 9019175 9078347 9481405 9172534 9037390 9393939
10348 9393939 9114514 9566769 9290607 9148729 9387689 9237598 8869490 8416540 8682567
10339 8682567 9352176 9022722 9282163 9532653 10255523 10247032 10135600 10203112 10656368 10616767
10329 10616767 9960702 10382839 9857445 9698162 9947698 9497071 9351326 9499189 9545262
10320 9545262 9956306 8981759 9390055 9692873 9708130 9589264 9669292 9482249 9419855 9852889
10310 9852889 10330123 10755879 11009422 11361210 11824515 12218293 11899299 12233578 11713407
10301 11713407 12515439 12530706 12804527 12842052 12436964 11947202 12744185 12804392 13283839 13930156
10291 13930156 14449234 15021982 15879173 16654602 17596390 18079256 19034480 19916439 20564290
10282 20564290 21970915 22407708 23026985 23722138 24679365 25640187 26065433 26244072 27287957
10273 27287957 28069546 28837041 29362872 29611082 30508472 31867656 32635522 33380811 34541772
10264 34541772 35820382 37187156 38510609 39958039 40400862 41285139 42477694 43285298
10256 43285298 42914501 42918638 43232594 43062949 42784571 43247149 43623456 43920653 44925544
10247 44925544 45003409 45308378 45318085 45372325 45244608 44168052 43878457 42670219 40775566
10238 40775566 39540049 38295425 36709019 36455751 34896978 34605014 34089354 33355979 32511896
10229 32511896 31605460 31006663 30893109 29750429 29633801 28985132 28383599 28349065 27581531
10220 27581531 27779845 27761621 26746208 26908534 26115798 25951660 25174678 24403395 23458344
10211 23458344 22876407 21628610 20082552 19765430 18460749 17286775 16913598 16107223 15526989
10202 15526989 14947730 14239631 13804390 13548054 13022443 12610422 11925592 11165762 11026582
10193 11026582 10997541 10541546 10366341 10179737 9969470 9521160 10008490 9667673 9267222
10184 9267222 9589990 9212291 9241975 9238587 8640813 8620776 8873722 8507018 8531313 8344258
10174 8344258 8578196 7898021 8147071 7547609 8019650 7569946 7461381 7643514 7473768
10165 7473768 6973552 7224057 7739040 7334171 7115137 7257420 7021463 6754238 6905075
10156 6905075 7097330 7015761 6937259 6878032 6789288 7128241 7042196 6713545 6499309 6854893
10146 6854893 6695888 6311265 6570978 6498254 6364471 6638673 6599261 6427377 6085863 6527176
10136 6527176 6646520 6266429 5838599 6556300 6104612 6154956 6000649 5382564 5734822 5534343
10126 5534343 5877995 5499851 5633680 5511176 5479791 5520606 5388252 5292217 5072095 5328992
10116 5328992 5257437 5018425 5267220 4858934 5018750 4887312 4743936 4799839 4249776 4811851
10106 4811851 4555277 4592148 4887759 4710866 4592271 4847286 4517274 5084287 4614311 4706931
10096 4706931 4753871 4466120 4071534 4473501 4262202 4578588 4106532 4457442 4262134 4042840
10086 4042840 4186268 4249972 4342881 4177033 4439117 4000728 4092952 4365744 4358058 4063023
10076 4063023 4323585 4119352 4481679 4310566 4397356 4521001 4301148 4758351 4062023 4759483
10066 4759483 4553146 4327530 4827498 4482395 4234714 4370382 4890645 4684932 4701667 4740455
10056 4740455 4743216 4879665 4773318 4869534 5040545 4746405 5028371 4815103 5072637 4941437
10046 4941437 4851617 4825125 4884740 4989935 4772900 4979394 4843680 4739986 4626235 5119541
10036 5119541 4758511 4922450 5040478 5154527 4840942 5081149 4874150 4816470 4881532 5173897
10026 5173897 5000726 4956483 4665182 4969810 5026534 5066523 4754175 4538259 4681417 4587065
10016 4587065 4846273 4644336 4718480 4452867 4383855 4707313 4508996 4788071 4365705 4742813
10006 4742813 4108855 4248635 4554713 4180577 4414405 4549496 4085477 4493442 3972218
9997 3972218 4141225 3628014 4244880 4342775 4432051 4412666 3776220 3927385 3967971 3936382
9987 3936382 4070765 4116076 3498731 3882677 3898384 3508114 3874812 2926099 3680632 2740202
9977 2740202 3097775 3013783 3394373 3056912 3581441 3428427 2960707 3219289 3114998 3401568
9967 3401568 2971076 2816873 3072475 3060684 3011916 2817314 3172345 2939672 3446349 2887808
9957 2887808 2965375 2801321 2860355 2692533 2783808 2600611 2514973 2494572 2990379 2427132
9947 2427132 2739421 2837257 2405321 2015911 2270465 2128669 2357552 2797799 2510581 1972989
9937 1972989 1994868 2306914 2572141 1937972 2398333 2307701 2104463 2024590 1689093 2253931
9927 2253931 2552215 1778634 1923688 2106608 2138548 2017447 2129651 2022296 1647742 1935674
9917 1935674 1986907 1931387 1994979 1715657 1842904 1828843 1843390 1223095 1785485 1957731
9907 1957731 1537680 2044222 1910848 2134499 1629185 1455534 1547108 2207908 1996082 2028122
9897 2028122 1603351 1552778 1565192 1564891 1559279 1654688 1849752 1526601 1395037 1936672 2048227
9886 2048227 1402994 2105591 1895858 1127397 1745905 1960312 1569897 1565938 1571085 1859175
9876 1859175 1034235 1663939 1845145 1875888 2295149 2287253 1769627 1243855 2009689 1663233
9866 1663233 1580156 1881519 1622696 1645837 1945419 1648475 1846158 1951934 1465932 1641766
9856 1641766 1408384 1670150 1345258 1781671 1440606 1642408 1839190 1416030 1560415 1314473
9846 1314473 1377308 1625784 2423819 2098872 1345028 1579601 1599536 1654199 1712428 1963544
9836 1963544 1703571 2090530 2099740 1522389 1369061 1277962 1392767 1513966 1559016 1410029
9826 1410029 1618615 1277195 1635999 1342037 1876377 1770983 1747410 1635059 1400181 1821965
9816 1821965 1600770 1383060 1462545 1958143 1392553 1580728 1471508 1558814 1489330 1450017
9806 1450017 1840926 1905868 1846419 1486051 1323146 1198790 1696822 1764452 1268863 1565987
9796 1565987 1829273 1180665 1485791 1610237 1885853 1606850 1625973 1495296 1153271 1509897
9786 1509897 1556909 1673733 1395167 1561102 1434202 1764368 1270822 1703943 1900438 1285300
9776 1285300 1471306 2201388 1568044 1520830 1794549 1454796 1664810 1624000 1233220 2072026
9766 2072026 1514810 1632664 1571658 1500781 1170562 1802617 1598205 1357144 1603608 1365436
9756 1365436 1720398 1243320 1532855 1281268 1664821 1571610 1052095 1186248 1464296 1194947
9746 1194947 1436978 1638095 1146586 1252220 1252026 1242114 1377880 1676770 1508276 1420808 1191363
9735 1191363 867585 945375 1151131 889133 934248 964827 846980 921531 1515521 1117705
9725 1117705 867496 875788 787661 1468305 1522177 916191 999479 855110 875427 660048 812533
9714 812533 909446 1306921 1098988 734474 1186881 855487 709919 1228271 716611 1011017
9704 1011017 1312156 605266 1054676 1152315 1125171 1153596 1023028 993819 709036 726069
9694 726069 715834 974168 864632 923418 890725 1051295 1019676 718402 602304 587113 736840
9683 736840 1171359 1115760 755421 852957 752679 433968 923446 1040336 879418 642617
9673 642617 556386 265495 1176725 940477 1105093 997196 821368 912564 861667 1232498
9663 1232498 1121824 1102507 994901 1040568 1214602 1088592 407444 1081263 1006287 916866
9653 916866 945480 857388 722148 736799 803582 1252483 566677 880225 1226966 442376
9642 644493 429491 736553 926866 1065908 951226 833419 1273157 459151 905003 875577
9632 875577 994569 1063168 485654 789320 854595 894811 501069 1194877 1114129 1095244 683221
9621 683221 1292408 869193 566036 875994 1212734 893596 942401 651395 1003324 544529
9611 544529 666814 1011670 939205 677402 557869 908084 799376 1195937 1304337 847341
9601 847341 793415 924399 1324112 766312 725783 1196854 934498 985518 815820 996084
9591 996084 1121315 330438 842379 1386886 683249 866789 812244 1092561 853870 663574
9581 663574 1128372 907238 774462 680662 580512 963981 978085 297443 934467 1065414
9571 1065414 549078 1176429 987840 838351 545771 329166 901275 1361916 721188 732863
9561 732863 768926 594679 943518 1024441 1052473 958752 581037 1332370 1020396 952575 509964
9550 509964 237448 586780 710545 980546 1043666 1108231 1003295 1156319 864585 306845
9539 811181 601058 726346 957559 579108 839875 913998 728504 871518 813634 761000
9529 761000 772558 774537 736372 736378 713597 820597 871176 934827 609730 881667 589886 539608
9517 539608 904993 558905 518537 461046 401363 916027 534991 520155 692431 1079973
9507 1079973 1001083 230694 680752 540898 509470 904048 279890 232294 710420 857525
9497 857525 507554 259121 625417 1048050 254546 378175 428701 604034 244267 83295
9486 358889 497322 565382 380327 903977 884484 772689 642388 655249 844598 680420
9476 680420 312314 574033 482707 805360 453710 1004155 551693 527290 671164 484387
9466 484387 430123 501828 582879 412117 291193 660126 -23168 402923 162294 388542
9456 388542 691898 421850 493086 636909 448985 724458 490446 787458 834997 180928
9445 503188 747666 863569 625479 613210 492825 570322 695373 681276 351979 269661
9435 269661 403754 389558 381335 361366 481404 674013 528854 331690 740382 342666
9424 471601 651256 611582 518673 371909 294845 1083757 438238 630498 694477 574772
9414 574772 29765 754255 713978 897770 -101602 435067 850165 -120305 284354 513365
9404 513365 834512 530018 490222 642970 696685 690497 350025 414453 442803 158606 74688
9392 649107 516924 364546 565888 1164822 507229 589868 690444 364275 647590 623949
9382 623949 1057637 528184 682586 1006061 651748 762918 878855 447471 387942 128802
9371 599021 184399 311923 464723 359741 665981 446102 238775 755706 385486 466334
9361 466334 265903 330056 522920 391715 694006 511111 800971 409993 532580 629657
9351 629657 345070 746637 516644 658654 748644 282069 252213 231002 137423 622877
9341 622877 500511 398909 500980 352801 951225 458000 331498 47849 58208 591621
9331 591621 388230 337803 867068 178583 548456 580487 336077 503047 100262 106303
9321 106303 303754 83495 569555 11050 -24895 301286 452338 148821 376654 551575
9311 551575 -136626 381285 386739 211838 385459 301035 585770 458565 477494 1057893
9301 1057893 296711 661465 647957 286116 279299 657313 261449 323064 406583 348205 39389
9289 327183 402445 541204 321842 438415 758011 394872 269877 261219 153699 120831
9279 120831 11730 455508 818031 245648 766474 527169 591874 653879 278704 552664
9269 552664 833404 546931 251684 855531 264421 920456 350369 543659 282499 155693
9259 155693 470843 -256714 313184 179399 13755 626911 343537 558832 352556 289969
9249 289969 177024 751987 363022 535844 471101 259263 463005 520467 726243 332387
9238 334970 199122 700980 230850 715374 87485 274512 203388 800533 335729 482543
9228 482543 311672 398166 216182 393272 930776 406990 957270 569369 621325 159369
9217 543246 548120 135772 477511 237421 748732 683810 201052 196438 511805 400685 726619
9206 726619 388977 539314 473005 579500 415514 300522 550949 997225 824309 670622
9196 670622 389679 516475 309178 460327 57760 776493 493017 185038 270433 287462
9186 287462 83732 326341 491396 452436 134381 530496 158441 137806 -11128 327027
9175 739350 -35757 -38441 527482 520036 488397 417122 596960 551624 274164 -111429 274821
9163 268976 452427 413316 365985 643573 605584 387737 443729 529127 308920 99147 592839
9152 592839 331103 333791 456525 243681 545401 733149 838307 426309 264647 361336
9142 361336 84238 659412 722392 598516 162397 105766 323663 89023 340267 445385
9132 445385 370459 514720 163081 282192 411973 186475 552215 557358 531738 743309
9122 743309 299962 144717 588226 386260 692391 630237 383779 166007 211336 589307
9112 589307 629829 220421 317455 282259 412465 44504 620668 153393 723753 357363
9101 223603 532496 235589 -104671 838848 258571 698583 765874 177880 796652 190939
9090 393659 -75142 239189 597655 505811 167458 180940 464864 413911 456608 579749 97582
9078 22077 1177881 402026 110249 335593 -45135 172933 162800 70738 383521 855384
9068 855384 14905 -274148 274356 680215 271523 253149 779217 575657 115871 -5477
9057 414495 495802 105065 598365 214644 647631 877815 395442 65112 -36256 426872
9046 620569 295806 213950 286088 297502 454688 331800 573567 396458 242532 187491
9036 187491 163227 146464 541197 583321 131122 491852 563419 715359 309980 108522
9025 462476 267357 612009 905460 320603 486142 425229 446929 614311 414003 523853
9015 523853 281819 330161 615158 269658 434681 45370 406974 348360 722101 571978
9005 571978 149537 -282515 641458 283053 606685 465027 651392 270246 95727 834838
8995 834838 457248 335871 -302548 115109 713528 55221 576650 637906 477719 161941
8984 119490 301007 658026 460032 382063 377774 -23616 389631 78363 340366 412088 510156
8973 510156 288420 206635 675398 -334847 757341 134923 430780 832515 634730 341042
8963 341042 -160446 308135 565136 407986 316637 578870 832457 652516 198400 617047
8953 617047 448755 546845 835672 282740 354540 39530 538325 324925 237916 114171
8942 174102 216907 737050 913300 -298871 1028284 394615 607144 201994 511373 733488
8932 733488 50573 1066465 314046 433646 424683 1237830 431679 409196 504404 613267
8922 613267 39583 850648 567345 479049 494582 479693 387639 117716 342366 564717 495154
8911 495154 314931 721188 250592 880496 725965 1160873 810356 532786 927516 867631
8901 867631 703363 867097 912030 823939 447217 528940 923565 565842 1150892 702291
8891 702291 697653 761834 669120 933357 959598 916245 611674 1129404 1171216 1360145 1013448
8880 1013448 787845 1281717 1258071 1090464 951253 850438 953501 1162603 1248683 713461
8870 713461 1139150 860131 1003602 904646 788952 888754 1061941 1283029 893205 1266517
8860 1266517 773753 749844 1055865 1104278 1119440 1153160 609750 846350 829429 646197
8850 646197 864528 472907 903385 316982 791469 887440 1110747 903311 978526 1241371
8840 1241371 439023 270763 140380 879261 639830 415505 653758 1006219 670100 538110
8830 538110 631862 112585 198167 767864 427691 584577 895704 646906 658142 641605
8820 641605 501023 572074 375547 687015 363933 692261 442819 -183575 557924 466013
8810 466013 729233 427068 699058 445951 604418 434121 58928 538631 117331 407674
8800 407674 514117 343958 504017 902189 347484 1057129 333202 80389 825895 375666
8789 604968 590454 576698 238731 474187 324185 118329 143069 -9238 239633 375750 239155
8778 239155 279176 505232 300482 744921 -79167 508314 246868 609493 363380 561458
8768 561458 411788 141217 170838 534909 64949 420200 425189 466057 240888 55350 506315
8757 506315 140457 108097 490479 692021 528764 736420 268848 543608 535328 682483
8747 682483 -253735 323247 79319 -53863 520450 564078 467385 338539 475247 187898
8736 -132902 2110 76011 476510 430681 631055 278254 78854 -21963 40058 606088 651527
8725 651527 328289 339428 10147 236282 467162 333472 362556 338261 226331 398027
8715 398027 558853 112840 193994 753483 440747 310164 75155 178439 14933 471345
8705 471345 389922 43691 -21871 812006 391241 457402 -80635 225530 152747 286267 100577
8693 426362 417825 261673 467277 480262 -201507 320648 390049 466120 428317 -15044 223873
8681 305739 854960 216669 16974 528226 534232 631791 164333 84701 642247 -15344 652793
8669 342201 20576 2757 663683 -356151 256928 248176 158678 203867 442084 62456 619754
8658 619754 95922 -430187 65642 577270 336872 60826 -30282 310713 263508 87382 99791
8647 99791 190581 145295 414375 341606 476762 585315 77737 525437 330948 589359 585405
8636 585405 409831 10830 544364 447644 132138 -237505 171292 494928 -12569 622005
8625 341313 323051 178203 206437 168981 457389 101798 42998 720158 208081 482149
8615 482149 622847 467596 354412 374071 378170 291991 -46960 357720 59845 164044 177952
8604 177952 720806 210578 210492 -47863 252076 79253 378748 246601 110674 406303 529563
8593 529563 240511 306718 695484 6186 506126 -251540 -44272 19761 254512 113017 317331
8582 317331 513584 352645 -43155 430107 -7242 266738 365843 357239 300099 719733 154073
8570 668733 387053 304050 729867 435887 477702 -105783 210900 207440 208426 -15784 -229950
8559 -229950 356830 46105 567263 150224 771 351845 480010 323298 489832 313274
8549 313274 246112 525579 138712 532285 499332 537790 195028 364023 -92859 -5293 401956
8537 545920 257894 560381 521951 344377 120321 844 592427 357325 366937 633755 331808
8526 331808 -76537 500187 -142280 122112 584635 379301 178344 159495 405888 343522
8516 343522 -181334 554430 98875 325919 -172306 398763 194876 297453 98291 487177
8506 487177 398616 457148 341920 239101 557783 396015 121567 203436 429200 244198
8496 244198 -127817 513041 636610 674112 346204 419726 237725 180428 310595 642571
8486 642571 319532 31846 518855 572957 792745 492640 -351662 697989 520126 50492
8475 381556 93813 205973 257980 -169967 -73233 303117 454897 -38073 -280309 255601
8464 284260 81451 190283 80584 -139843 332437 428846 343673 144866 268178 466863
8454 466863 55312 37360 351262 -36425 203207 499814 319461 -43026 -61995 371822 76767
8442 221449 -119814 523607 282944 179851 528405 169423 208491 -1995 -76304 166528
8431 75855 -317311 405838 -509274 441459 64124 328107 383212 240704 142122 378360
8421 378360 282084 386631 304583 273264 420750 -226499 479806 623915 151913 87739
8411 87739 60859 -153823 179787 -144954 -132299 313876 941061 229432 181265 213625 555176
8400 555176 -219559 2801 275451 366325 23958 338237 -113247 406018 200143 449339
8390 449339 262580 97161 230744 330094 708871 -196939 170322 293933 418406 -287279
8379 10924 -223685 69622 230322 183450 219896 -57653 284910 262352 -81607 156728 321231
8368 321231 230991 361485 463121 266444 262259 36996 -101196 287512 375128 1121240 273130
8356 317654 479265 251178 -5026 636753 540755 299366 832435 -715984 373007 397092
8346 397092 247784 293747 479657 276817 -132897 -166967 124893 217731 329833 205112
8336 205112 238975 -107631 306332 349173 904641 -234434 211036 627971 -61426 -28464
8325 569769 299016 138008 469561 165742 253690 -107845 63305 610950 448602 168849
8314 366781 201490 216331 78600 282473 244444 146099 220711 -106480 368738 194206 -175595
8302 725729 -112241 94604 585427 -161014 216715 296040 274343 330578 404599 -45209 63404
8290 29271 254224 182270 494900 -13358 -99394 297994 561798 212753 378381 236051
8280 236051 125344 795359 83911 -159011 56103 292714 107167 423546 484496 385819
8270 385819 219693 159735 -475488 369257 61409 336448 -159458 -177523 -54890 374893
8259 472603 4496 -39172 297095 411014 -31547 745786 90180 335238 281023 180575 43665
8247 67676 316426 483872 433857 317511 62990 129434 245412 218436 120938 209135 508595
8236 508595 344601 -151129 -253603 441370 2370 75495 257611 -295188 129956 194427
8226 194427 75233 382404 113070 524816 -55900 505746 524063 276859 216475 427232
8216 427232 645442 -189728 394299 128395 -108767 -68589 24159 653711 180651 241933
8206 241933 666472 166257 301455 158709 26751 270447 441595 313318 59164 174619
8196 174619 61141 -70388 293870 363655 293635 410007 303700 86646 124618 102691 3408
8184 318560 282730 262103 415559 137109 -83277 443894 405959 -67107 584398 396593 110286
8172 70340 236475 254289 628836 112126 311708 73630 -242134 344525 68441 192035
8162 192035 216961 202919 234617 301276 364870 208309 -207841 189090 366028 162170 -171045
8150 175614 468888 209808 432950 354633 220741 533498 -92038 490963 223917 23216
8139 370713 76578 -72796 -34649 194712 381550 579341 327556 344779 -172894 277229
8128 483788 248067 213329 131060 352319 512342 158725 -110609 347208 -179203 366153
8117 267244 19628 129596 702218 599140 192698 -68014 161678 167441 297893 -412697
8106 26159 624897 147157 -154038 59654 354723 -270602 558288 636597 -35574 580339
8095 -159562 486437 50048 502985 -50813 186060 50323 -7484 161259 297568 242203 349738
8084 349738 241859 515634 -132653 -10410 463124 698337 145453 49685 264919 63779
8073 392231 515000 458389 794724 153781 49475 -102792 59054 374556 239131 -552237
8062 222543 19384 510965 233963 285411 -19206 266425 146141 431959 237840 375408
8052 375408 -90681 -76893 257916 -64762 -191157 67145 244165 146272 580266 136039 366882
8041 366882 556169 402240 443545 249280 -93250 194130 330320 457654 -277083 122589
8030 171702 118186 105230 -103809 -109695 480627 -282982 57689 -121806 396541 236024 576881
8019 576881 -80175 230962 837744 371193 145205 212868 -344851 527970 286091 375357
8009 375357 -197210 406342 248293 453261 -35052 -74921 760747 295288 514497 419554
7999 419554 172554 -22589 130775 167989 313137 98388 968576 128091 459660 -62882
7988 -99140 30934 371143 17072 753363 54593 100366 35317 -196470 245197 285923 239898
7977 239898 145918 300132 222013 818787 61742 305621 454081 208012 243071 326471 211848
7966 211848 24550 414928 -305636 -158996 517925 520940 -72151 -243458 277295 103496
7955 -55353 -206869 107856 131334 483080 487868 -62998 214535 -125058 585955 106750 -143383
7943 273850 197027 465829 161358 444273 455608 161690 323538 296391 521109 -145553
7932 -575428 446918 16273 212885 -344524 547605 -40693 -44471 271852 147571 -287160
7921 310019 -90551 117144 422703 181606 -37598 170989 482385 348449 287555 -145492
7910 366511 348444 273848 20141 120815 -38312 121384 157147 199549 -211679 249700 -183572
7898 216090 547457 305304 -121785 244996 -245525 288610 -122338 206698 8738 -35111
7887 391481 39246 93491 -384878 314313 221604 -193453 215701 96243 442638 634178
7877 634178 19945 -103412 -93407 506492 290474 -453466 64655 554263 -47381 414138
7866 233116 107653 385712 -20553 310315 -445789 563507 369400 299174 807339 389974
7855 -111528 524910 16807 613025 109917 357039 -219240 -203978 -131102 57764 138706 209049
7844 209049 9784 -66789 -87465 -499891 402729 7233 -77328 30804 402677 303340 71306
7832 202061 355721 429259 163896 244968 -106603 698177 85196 59571 -244518 -167622 174299
7820 255245 274842 365768 -125226 138380 372455 316104 227548 68991 61634 570001 -40989
7808 306529 107942 85741 -277619 167597 82346 482584 364884 489790 97616 601667
7798 601667 123738 24764 617837 137335 397891 -235182 247921 17386 76706 255573
7788 255573 -38947 167012 319177 522948 181291 211415 259991 532061 -125446 -269229
7778 -269229 87290 -27643 465722 432887 -49498 380558 336216 -341906 314113 188435 118414
7767 118414 340068 90838 -509228 146184 422404 -39759 -211925 163922 190811 144433
7757 144433 290728 -211935 196204 66391 278840 51383 139592 215720 40487 182493 276340
7746 276340 -508825 -237191 112622 -81157 536083 262 402847 343371 323174 535934 -110058
7734 267851 321408 431733 480158 432222 -49167 102548 222463 521778 442876 574130 146941
7722 30105 -155939 544193 476128 75537 -116865 190362 -236914 281790 162297 349655
7712 349655 -136775 -88095 186761 248829 101165 156319 134525 307429 313752 632613 506834
7701 506834 261837 408544 29662 291294 111152 91332 -102801 490007 237183 78524
7690 139150 154879 20713 -101781 524392 52739 243680 413017 -109062 -24871 -355939
7680 -355939 151120 332538 52520 -38341 43889 156790 453804 107271 377655 346205
7670 346205 50446 158591 262598 514120 594951 12091 232947 -13522 453406 -216486
7659 -105012 -191872 40964 61680 21857 131892 23011 458428 -6873 158565 -219775 -55827
7647 396919 -274513 83339 57611 346937 -86992 -57801 232400 -52600 -436111 396327 100708
7635 -54346 -458554 -274203 465635 63332 309425 -125634 38176 -2680 620353 62325 12883
7623 467472 -16579 187385 94965 298458 359141 -32283 588682 84452 96638 98792 188305
7612 188305 111286 171187 342292 -12886 -10871 82487 260754 -144367 317782 528084 108094
7600 26622 381606 303397 482209 137942 73617 -109794 263780 605426 -233271 481340
7589 -167876 -344154 209309 238225 279348 -249434 -177091 -198184 129150 585853 146593
7578 36986 -104780 41783 190324 -82388 47426 132260 325972 363362 357585 203132 176042
7567 176042 257338 58177 367173 -164570 -70862 471244 -109708 203869 339307 287807
7557 287807 -206984 -50959 -192192 389553 778286 -40235 84616 7399 290278 369648 -207018
7545 295175 82986 334500 291699 251337 -363534 -348569 345038 133213 101726 326278 89246
7533 416615 30017 -316462 118747 350100 7454 -156604 -107281 446373 126719 222361 38217
7521 148052 53891 -104634 -33970 182560 307508 180671 -221451 236495 296695 474 -200628
7509 211883 160841 95355 197050 -587262 200871 183811 95873 265750 -376699 -62877 298701
7497 -127443 284526 180573 218922 101022 -52162 356758 107051 271745 116280 -22063
7486 135234 17818 -120975 220350 -138646 -97031 82678 519635 324776 208637 525898
7476 525898 146621 238938 151698 144896 188397 174186 197796 -66857 111096 66749 410950
7465 410950 -76416 118698 643026 248014 -86273 -307854 -310750 -128505 -33829 442458 218189
7453 295870 332580 319817 408514 200199 -151482 526459 126336 432379 304306 384006
7443 384006 358176 331813 178329 328425 50752 187461 324649 84087 -76859 -29300 -43246
7432 -43246 -59081 40014 452610 -130779 -142461 348410 558313 177595 530439 -49154 -476765
7421 -476765 -255114 94480 3447 327686 277566 585205 -166108 -66790 262248 13155 111815
7410 111815 -44821 32207 231399 163940 232529 69734 203357 -29905 -26938 494514 321742
7399 321742 263137 -104728 165826 -225186 -66206 406022 502128 306804 557553 166761
7388 -129797 -209721 -120125 196353 138528 154352 14088 -192312 -18177 461733 -107064 12582
7376 353238 57584 537585 332189 65272 -242563 -129881 -315631 266280 -82609 -78617 86900
7364 -180395 594550 -47111 69783 360504 360928 454881 -103639 -110827 308973 45201 125118
7353 125118 131987 270933 405406 -153149 -260824 180233 375686 369620 -311745 332184
7342 -24443 2103 90811 -216125 -66845 104229 -55528 433936 86633 345280 598544 159805
7330 197235 -135524 -216927 -83195 284378 41310 340394 564218 34645 71849 359731 265653
7319 265653 629527 -2691 -78165 25306 135852 92837 338968 -253531 -113187 57666 -145975
7307 48252 140452 -68676 258543 -345102 -64150 -409753 -303439 -127658 206232 285517 64594
7295 378499 92233 10200 53417 362253 131598 19730 72715 258758 179323 130285 151031
7284 151031 -12103 -81154 -140129 21755 344663 -245563 272517 275035 120948 343277 60485
7272 -335939 -135554 194735 73654 454599 408860 76724 202717 392457 208559 788535
7262 788535 -109708 204738 -142613 625948 -102176 592365 91900 413445 -69569 51301
7251 22309 127547 393517 -135796 55854 419136 -136895 -308 309222 -39700 160013 -107919
7239 48086 -4776 76531 125540 40937 140989 -386538 227774 247464 -2928 5601 51267 407486
7227 407486 262207 -152528 112787 332963 211068 358023 187684 372952 -11375 -202908
7217 -202908 42553 -145228 503746 413314 582207 79674 342690 385365 -46107 -399219 11371
7205 -62156 452743 -98101 -12833 310607 650367 -384202 262335 -128464 389901 203901
7195 203901 45459 402773 188956 -184365 -19805 25115 318926 -290251 -231222 -145157 100355
7183 53604 -79703 138718 204387 -109911 -170253 -174200 51812 379135 25387 -41709 107913
7171 -191185 20133 45874 365217 -3159 -86409 110077 340543 104842 -2846 183325 -194109
7159 298340 28560 69916 -144177 182397 370110 298296 156829 196682 50528 205912 -29426
7147 8998 66223 256013 416179 -214043 55573 162207 428416 344226 201296 -80019 -132893
7136 -132893 294783 44218 343476 122803 139244 63222 137067 76616 210381 -327587 -176003
7125 -176003 238446 -18517 5724 228598 -7125 -30443 -47761 -115956 349871 -87469 -318169
7114 -318169 571272 -214036 50701 235951 -24372 183662 255448 349804 297660 262138 220972
7103 220972 387475 -112644 239847 -301027 333888 -50401 66454 67079 85287 -178781 -120833
7092 -120833 177029 331251 86565 -27498 155062 133985 328755 -34653 478470 431790 318654
7081 318654 220408 92380 36206 196544 117427 201084 -67694 336125 -37703 369375 123368
7069 294064 391523 -265298 328557 42043 -73941 -224467 78575 262799 296256 83511 -160031
7057 585397 553602 258775 325120 31145 532120 152818 321115 32083 -314268 519652
7046 465466 -83019 781535 287462 -20682 -10452 258128 343843 -126726 47804 96284 -432365
7034 411304 310521 -232563 -111739 40238 207342 -200126 -353239 51561 114140 -59518
7023 153501 198145 489792 -245910 -748 232871 -83390 201144 190262 -119900 116504 45409
7011 542959 235631 39613 -25121 159947 40864 224150 177410 -132538 730312 -56795 138996
6999 632206 -133016 -167994 61251 -69660 152739 317953 -266528 230142 184398 174528 -60228
6987 390934 -419589 -52081 -279909 -46864 134191 63257 18235 -240452 -204644 -230066 280883
6975 187009 135732 -33863 -77494 561359 348663 19248 187286 -25543 8154 -210206 137379
6963 -30321 138909 55633 275615 -125102 -288858 -50788 187446 -57231 -164225 251303
6952 377625 75920 194222 -114202 -90288 -203089 226653 194634 177170 202679 101082 230358
6941 230358 122962 188089 -97206 178019 152009 377431 332882 132998 -111322 383745
6930 104375 79774 215241 247160 502875 82169 253421 65383 258215 239451 294793 -30334
6918 116368 118807 -112960 458416 195359 -613578 -137578 -40549 479172 173674 340172
6908 340172 -460438 165972 -323874 -28900 180804 25293 416825 -37673 143066 135908 179362
6897 179362 166869 107732 113271 -11660 56536 83229 321376 324606 134802 398795 -200245
6885 27186 341079 142040 176562 -142194 216787 250576 -146031 -171432 51522 -175148 452235
6873 114294 284245 -294529 -164379 -149586 501738 129115 263969 -42378 710902 -172899
6862 -395605 84651 -317311 297689 259146 33846 484894 -67160 43053 435704 -10774 58104
6850 -128981 167746 -40238 281975 312283 182818 210812 22932 202325 -16037 352281 -233844
6838 120947 230077 286364 537974 -124104 260894 -112809 546735 -103949 -223093 424916
6827 -169655 605640 122632 376608 -17207 286384 205597 -53791 200526 -460003 -104134
6816 272991 -90930 241687 375626 -329475 -230453 24078 595551 587858 449931 127204 -170431
6804 20381 -42615 112137 -10076 447501 389711 125451 183068 1619 142237 398329 -212280
6792 317151 577003 -201903 407814 -448180 -83960 405897 254377 285721 174595 186481
6782 186481 13809 118831 109185 63874 549381 -287438 497008 -156349 78643 145489 205268
6771 205268 120034 -146104 -307597 91239 -124412 70272 -110257 457992 -11935 412773
6760 245959 221626 -124557 426941 -7294 75369 -143823 -64428 -290620 146661 -60469 55099
6748 -315498 324961 24328 -302876 56694 484418 -228379 -212241 115370 462277 123460
6737 -111632 -71170 -268740 626613 111567 423821 108247 -534733 -223163 -313464 -270540
6727 -270540 296564 -34804 189486 -137683 135193 -30599 345206 -216981 265238 -222401
6716 416262 58952 26220 -47943 -56329 26471 -32427 -67606 100668 359208 -139291 171747
6704 -219439 288349 101363 217615 377328 232814 294258 213039 32540 -248484 247832
6693 6063 -19590 53386 -5755 190458 357312 148606 414903 -233638 -5520 310475 212350
6682 212350 234695 -17712 100196 239289 58967 523714 -18374 439120 407498 115946 367514
6671 367514 5261 60759 382776 -8144 -117084 -114083 464381 -301446 255445 160018 16686
6659 279452 42959 176181 340101 -226481 -30062 519427 -312005 68098 182499 100597
$$ [...]
##END NTUPLES=NMR SPECTRUM
##END=
