##TITLE=Coffee green (ROVE100C + 1.5mL buffer 50/50,  450uL extracto + 50uL (D2O+TMS))
without heating, vortex and centrifuged, temperature 0oC.
##JCAMPDX= 6.0         $$ Bruker NMR JCAMP-DX V2.0
##DATA TYPE= NMR SPECTRUM
##DATA CLASS= NTUPLES
##ORIGIN= Bruker BioSpin GmbH
##OWNER= Administrator
$$ 1.72 TOPSPIN		Version 2.1
$$ 2012-03-16 08:00:05.979 -0800  Administrator@X
$$ Compression mode = diff/dup
##.OBSERVE FREQUENCY= 400.13188198
##.OBSERVE NUCLEUS= ^1H
##.ACQUISITION MODE= SIMULTANEOUS (DQD)
##.ACQUISITION SCHEME= undefined
##.AVERAGES= 64
##.DIGITISER RES= 22
##SPECTROMETER/DATA SYSTEM= spect
##.PULSE SEQUENCE= noesygppr1d
##.SOLVENT NAME= H2O+D2O
##.SHIFT REFERENCE= INTERNAL, H2O+D2O, 1, 14.97969
##AUDIT TRAIL= $$ (NUMBER, WHEN, WHO, WHERE, PROCESS, VERSION, WHAT)
$$ ##TITLE= Audit trail, TOPSPIN		Version 2.1
$$ ##JCAMPDX= 5.01
$$ ##ORIGIN= Bruker BioSpin GmbH
$$ ##OWNER= Administrator
$$ $$ C:\Bruker\TOPSPIN/data/jwist/nmr/11-coffee-green-quantification-2/371/pdata/1/auditp.txt
$$ ##AUDIT TRAIL=  $$ (NUMBER, WHEN, WHO, WHERE, PROCESS, VERSION, WHAT)
(   1,<2011-11-18 17:18:57.779 -0500>,<Administrator>,<TOPSPIN>,<go>,<TOPSPIN 2.1>,
      <created by zg
	started at 2011-11-18 17:10:03.232 -0500,
	POWCHK enabled, PULCHK disabled,
       configuration hash MD5:
       DA 63 81 1B EF 4C B5 72 B4 DF EA D9 B4 DB 4C 08
       data hash MD5: 64K
       C9 20 01 6E 65 F5 F9 7F BC 9F FD 11 C3 FD 8E 3D>)
(   2,<2011-11-18 17:20:16.529 -0500>,<Administrator>,<TOPSPIN>,<proc1d>,<TOPSPIN 2.1>,
      <Start of raw data processing
       efp LB = 0 FT_mod = 6 PKNL = 1 PHC0 = 0 PHC1 = 0 SI = 32K 
       data hash MD5: 32K
       1A C5 E8 B5 57 D6 06 2A 7F 90 D7 53 87 C1 55 95>)
(   3,<2011-11-18 17:20:16.935 -0500>,<Administrator>,<TOPSPIN>,<proc1d>,<TOPSPIN 2.1>,
      <pk PHC0 = 22.14294 PHC1 = 0 
       data hash MD5: 32K
       0A 26 6A 1A 59 00 F4 73 F7 75 09 67 0E A6 06 FC>)
$$ ##END=
$$ 
$$ $$ hash MD5
$$ $$ 26 6C 1D 02 D3 C8 65 7E 90 46 61 0A 41 E4 77 95
##$RELAX= 
##$RELAX= 
##$RELAX= 
##$RELAX= 
##$RELAX= 
$$ Bruker specific parameters
$$ --------------------------
##$DU= <Z:>
##$EXPNO= 371
##$NAME= <11-coffee-green-quantification-2>
##$PROCNO= 1
##$TYPE= <nmr>
##$USER= <jwist>
##$ACQT0= -8.18042376280013
##$AMP= (0..31)
100 100 100 100 100 100 100 100 100 100 100 100 100 100 100 100 100 100
100 100 100 100 100 100 100 100 100 100 100 100 100 100
##$ANAVPT= -1
##$AQSEQ= 0
##$AQ_mod= 3
##$AUNM= <au_prof>
##$AUTOPOS= <>
##$BF1= 400.13
##$BF2= 400.13
##$BF3= 400.13
##$BF4= 400.13
##$BF5= 400.13
##$BF6= 400.13
##$BF7= 400.13
##$BF8= 400.13
##$BYTORDA= 0
##$CFDGTYP= 0
##$CFRGTYP= 9
##$CHEMSTR= <none>
##$CNST= (0..63)
1 1 145 1 1 1 1 1 1 1 1 1 1 1 1 1 1 1 1 1 1 1 1 1 1 1 1 1 1 1 1 1 1 1 1
1 1 1 1 1 1 1 1 1 1 1 1 1 1 1 1 1 1 1 1 1 1 1 1 1 1 1 1 1
##$CPDPRG= <>
##$CPDPRG1= <>
##$CPDPRG2= <>
##$CPDPRG3= <>
##$CPDPRG4= <mlev>
##$CPDPRG5= <mlev>
##$CPDPRG6= <mlev>
##$CPDPRG7= <mlev>
##$CPDPRG8= <mlev>
##$CPDPRGB= <>
##$CPDPRGT= <>
##$D= (0..63)
$$ [...]
##$TP= (0..7)
150 150 150 150 150 150 150 150
##$TP07= 0
##$TPNAME0= <>
##$TPNAME1= <>
##$TPNAME2= <>
##$TPNAME3= <>
##$TPNAME4= <>
##$TPNAME5= <>
##$TPNAME6= <>
##$TPNAME7= <>
##$TPOAL= (0..7)
0.5 0.5 0.5 0.5 0.5 0.5 0.5 0.5
##$TPOFFS= (0..7)
0 0 0 0 0 0 0 0
##$TUNHIN= 0
##$TUNHOUT= 0
##$TUNXOUT= 0
##$USERA1= <user>
##$USERA2= <user>
##$USERA3= <user>
##$USERA4= <user>
##$USERA5= <user>
##$V9= 5
##$VALIST= <valist>
##$VCLIST= <CCCCCCCCCCCCCCC>
##$VD= 0
##$VDLIST= <DDDDDDDDDDDDDDD>
##$VPLIST= <PPPPPPPPPPPPPPP>
##$VTLIST= <TTTTTTTTTTTTTTT>
##$WBST= 2048
##$WBSW= 25
##$XGAIN= (0..3)
0 0 0 0
##$XL= 0
##$YL= 0
##$YMAX_a= 4975701
##$YMIN_a= -1779069
##$ZGOPTNS= <>
##$ZL1= 120
##$ZL2= 120
##$ZL3= 120
##$ZL4= 120
##$ABSF1= 0
##$ABSF2= 0
##$ABSG= 0
##$ABSL= 0
##$ALPHA= 0
##$AQORDER= 0
##$ASSFAC= 0
##$ASSFACI= 0
##$ASSFACX= 0
##$ASSWID= 0
##$AUNMP= <proc_prof1d>
##$AXLEFT= 0
##$AXNAME= <>
##$AXNUC= <1H>
##$AXRIGHT= 0
##$AXTYPE= 0
##$AXUNIT= <>
##$AZFE= 0.1
##$AZFW= 0.1
##$BCFW= 0
##$BC_mod= 0
##$BYTORDP= 0
##$COROFFS= 0
##$CY= 15
##$DATMOD= 1
##$DC= 0
##$DFILT= <>
##$DTYPP= 0
##$F1P= 0
##$F2P= 0
##$FCOR= 0.5
##$FTSIZE= 32768
##$FT_mod= 6
##$GAMMA= 0
##$GB= 0
##$INTBC= 1
##$INTSCL= 1
##$ISEN= 128
##$LB= 0
##$LEV0= 0
##$LPBIN= 0
##$MAXI= 10000
##$MC2= 0
##$MEAN= 0
##$ME_mod= 0
##$MI= 0
##$NCOEF= 0
##$NC_proc= -7
##$NLEV= 6
##$NOISF1= 0
##$NOISF2= 0
##$NSP= 0
##$NTH_PI= 0
##$NZP= 0
##$OFFSET= 14.97969
##$PC= 1
##$PHC0= 22.14294
##$PHC1= 0
##$PH_mod= 1
##$PKNL= yes
##$PPARMOD= 0
##$PPDIAG= 0
##$PPIPTYP= 0
##$PPMPNUM= 2147483647
##$PPRESOL= 1
##$PSCAL= 4
##$PSIGN= 0
##$PYNMP= <proc.py>
##$REVERSE= no
##$SF= 400.13
##$SI= 32768
##$SIGF1= 0
##$SIGF2= 0
##$SINO= 400
##$SIOLD= 32768
##$SPECTYP= <>
##$SREGLST= <1H.CDCl3>
##$SSB= 0
##$STSI= 32768
##$STSR= 0
##$SW_p= 8223.68421052631
##$SYMM= 0
##$S_DEV= 0
##$TDeff= 65536
##$TDoff= 0
##$TI= <>
##$TILT= no
##$TM1= 0
##$TM2= 0
##$TOPLEV= 0
##$USERP1= <user>
##$USERP2= <user>
##$USERP3= <user>
##$USERP4= <user>
##$USERP5= <user>
##$WDW= 1
##$XDIM= 32768
##$YMAX_p= 477229251
##$YMIN_p= -103808670
##$CURPLOT= <Network HP LaserJet P1505>
##$CURPRIN= <$Network HP LaserJet P1505>
##$DFORMAT= <normdp>
##$LAYOUT= <+/1D_H.xwp>
##$LFORMAT= <normlp>
##$PFORMAT= <normpl>
##$SURQMSG= 1
$$ End of Bruker specific parameters
$$ ---------------------------------
##NTUPLES= NMR SPECTRUM
##VAR_NAME=  FREQUENCY,     SPECTRUM/REAL,   SPECTRUM/IMAG
##SYMBOL=    X,             R,               I
##VAR_TYPE=  INDEPENDENT,   DEPENDENT,       DEPENDENT
##VAR_FORM=  AFFN,          ASDF,            ASDF
##VAR_DIM=   32768,         32768,           32768
##UNITS=     HZ,            ARBITRARY UNITS, ARBITRARY UNITS
##FACTOR=    0.250966925370066, 1,           1
##FIRST=     8223.43324360094, 25265,        -648990
##LAST=      0,             -73038,          -372525
##MIN=       0,             -103808670,      0
##MAX=       8223.43324360094, 477229251,    0
$$ Real data points
##PAGE= N=1
##DATA TABLE= (X++(R..R)), XYDATA
$$ [...]
19442B466235N88988p37418O04601j85464j19090m1812J83874o57374P04937o12634
$$ 2466235 3055223 2317805 2922406 2736942 2617852 2576040 2759914 2102540 2807477 2194843
19432B194843J98085R6036K08454K87500n29231k96907L1683J22821K8295K44446
$$ 2194843 2392928 2488964 2697418 2984918 2455687 2158780 2190463 2313284 2341579 2586025
19422B586025m47418M73732n0582J1969n8935l95844L67240j63686K13971j7573
$$ 2586025 2138607 2612339 2561757 2573726 2514791 2118947 2486187 2322501 2536472 2518899
19412B518899k67618l38770L84550j48384M54735j80011k13898L4238n7889K34575
$$ 2518899 2251281 1912511 2297061 2148677 2603412 2423401 2209503 2243741 2185852 2420427
19402B420427K21673k66599o18876K26135J68817K20079o8473m60733J60798L06183
$$ 2420427 2642100 2375501 1756625 1982760 2151577 2371656 2303183 1842450 2003248 2309431
19392B309431n48505L03083K10114j84476l0006N9920j30834O62803q12110n0180
$$ 2309431 1760926 2064009 2274123 2089647 2059641 2119561 1988727 2651530 1839420 1789240
19382A789240M69600k86252l0147J15958n3166L36766j45134q0555q1184j19111
$$ 1789240 2258840 1972588 1942441 2058399 2005233 2341999 2196865 2116310 2035126 1916015
19372A916015K29028j74301K02868k58622k39682o817N03451o2866l06897K38429
$$ 1916015 2145043 1970742 2173610 1914988 1675306 1668489 2171940 2109074 1802177 2040606
19362B040606k12444n20174P25760p6796j50011J42298J65133j34624l2977P2860
$$ 2040606 1828162 1307988 2033748 1956952 1806941 1949239 2114372 1979748 1946771 2019631
19352B019631k10111N83354j6838p36339K74581n49215L47446j8587p5636k6491
$$ 2019631 1809520 2392874 2376036 1639697 1914278 1365063 1712509 1693922 1618286 1591795
19342A591795J17395O5323L51253p34230P9592k40472L34052Q22953n60040p5370
$$ 1591795 1709190 1774513 2125766 1391536 1471128 1230656 1564708 2387661 1827621 1752251
19332A752251j58172K41400j04250k83022L71542J22365M24082m65708L27774
$$ 1752251 1594079 1835479 1731229 1448207 1819749 1942114 2366196 1900488 2228262
19323B228262m90789L10708j17169L27696j88290J50804m40295L1305r0672L78272
$$ 2228262 1737473 2048181 1931012 2258708 2070418 2221222 1780927 1812232 1721560 2099832
19313B099832p55590O10161r4198k08516J85479P3261j57899J01138l3023Q7868
$$ 2099832 1344242 1954403 1860205 1651689 1837168 1910429 1752530 1853668 1820645 1908513
19303A908513l30755K50615P5386o04609J55049Q23308m94469N35045n54375P2385
$$ 1908513 1577758 1828373 1903759 1299150 1454199 2277507 1783038 2318083 1763708 1836093
19293A836093L7962M98406m48411J88253m13131k7602L06623J72948j37670k47123
$$ 1836093 1874055 2372461 1924050 2112303 1699172 1671570 1978193 2151141 2013471 1766348
19283A766348l6547p5373j2228L65294L78567k16337j61596P0286n85401N21813
$$ 1766348 1729801 1654428 1642200 2007494 2386061 2169724 2008128 2078414 1493013 2014826
19273B014826J09754k9418r2632L18822k62552q9273k13970K08234k58927M17727
$$ 2014826 2124580 2095162 2002530 2321352 2058800 1969527 1755557 1963791 1704864 2122591
19263B122591l72363M70798j87865j76067l07663N67480l15280J20667N6427l04240
$$ 2122591 1750228 2221026 2033161 1857094 1549431 2116911 1801631 1922298 1978725 1674485
19253A674485q2203M45952L3773m18214O24160k97477l98945k5381L25408l8620
$$ 1674485 1592282 2038234 2072007 1653793 2277953 1980476 1581531 1556150 1881558 1842938
19243A842938J46582M02592L10472J02720R5286J10989K04269l98217M19665k852
$$ 1842938 1989520 2392112 2702584 2805304 2900590 3011579 3215848 2817631 3237296 3234444
19233C234444o89117O2440l80168l56750p7598K44217m46885j3336J99971n27271
$$ 3234444 2545327 2607767 2227599 1870849 1793251 2037468 1590583 1577247 1777218 1249947
19223A249947M86844Q64k37839L88659k44589K00100k1602O6225k86647j58981
$$ 1249947 1736791 1737655 1499816 1888475 1643886 1843986 1822384 1888609 1601962 1442981
19213A442981K9609K88042R690k44647M1149j08333l25094K42470O7548K57719
$$ 1442981 1472590 1760632 1770322 1525675 1566824 1458491 1133397 1375867 1443415 1701134
19203A701134K99773k06614N6480j76317J97260k65489J38704K3839m66422M35786
$$ 1701134 2000907 1794293 1850773 1674456 1871716 1606227 1744931 1768770 1302348 1738134
19193A738134k58732l37401P55626l74259M72854n44584M32422l23775j10616
$$ 1738134 1479402 1142001 1897627 1523368 1996222 1451638 1884060 1560285 1449669
19184A449669J11593L52971n96549K44074N74127q10074L35953k5278n24569J59842
$$ 1449669 1561262 1914233 1317684 1561758 2135885 1325811 1661764 1636486 1111917 1271759
19174A271759j99780L47272L13233l58298N9113M70513o22971M97227m92555J80184
$$ 1271759 1071979 1419251 1732484 1374186 1433299 1903812 1280841 1778068 1285513 1465697
19164A465697P7945j8613l2956q9723P07450p49808P23458n50062L14529m02585
$$ 1465697 1543642 1525029 1492073 1402350 2109800 1359992 2083450 1533388 1847917 1445332
19154A445332j6126J68943M25616k35518N318o6205m2074J59144k22445K8290
$$ 1445332 1429206 1598149 2023765 1788247 1793565 1727360 1685286 1844430 1621985 1650275
19144A650275L15632j04654L4458q13941Q45793m7724k48568O3786J80924k77679
$$ 1650275 1965907 1861253 1895711 1081770 1927563 1879839 1631271 1695057 1875981 1598302
19134A598302L48305n2210L33627P2577p21633O59899J49737K50510M01659k72300
$$ 1598302 1946607 1894397 2228024 2300601 1578968 2238867 2388604 2639114 3040773 2768473
19124B768473M64752K5222K08342l1143J29052J12321M50591m77750q5579L24339
$$ 2768473 3233225 3258447 3466789 3435646 3564698 3677019 4127610 3649860 3564281 3888620
19114C888620k91982j50117j1672o5110k26128J9161n70060l7455k76422J04583
$$ 3888620 3596638 3446521 3434849 3369739 3143611 3162772 2592712 2555257 2278835 2383418
19104B383418R6323n2827K24989n65365K47300j76138L30480k06561J89373j92734
$$ 2383418 2479741 2426914 2651903 2086538 2333838 2157700 2488180 2281619 2470992 2278258
19094B278258L21271l55782K75163l07789P5464K09077l46560L97868O3237k40740
$$ 2278258 2599529 2243747 2518910 2211121 2286585 2495662 2149102 2546970 2610207 2369467
19084B369467k2383L4364Q25589j013705L84037Q4947M9951K09214j86934j48584
$$ 2369467 2347084 2381448 3207037 2193332 2577369 2662316 2712267 2921481 2734547 2585963
19074B585963N28976r8836j59381Q1618K25126n53638M54868k43128M38468L03657
$$ 2585963 3114939 3016103 2856722 2938340 3163466 2609828 3064696 2821568 3260036 3563693
19064C563693L99290j1429R02877M82189J068619O82394J360068J574748J069520
$$ 3563693 3962983 3951554 4854431 5336620 6405239 7087633 8447701 10022449 11091969
19055A1091969M75630R24473L05034l16578L18972n33986o47343j471039j037052
$$ 11091969 11567599 12492072 12797106 12480528 12799500 12265514 11618171 10147132 9110080
19046I110080j628337p99034n48837n57851o50534R59479J59137P70920J349884
$$ 9110080 7481743 6682709 6133872 5576021 4925487 5884966 6044103 6815023 8164907
19037H164907Q63693J025120m47228M32293N01655o45980m86755j79388j450791
$$ 8164907 9028600 10053720 9606492 10038785 10540440 9894460 9407705 9228317 7777526
19028G777526n76380j467833l56548r30591J62865l32568L40958l4002M71618
$$ 7777526 7201146 5733313 5376765 4446174 4609039 4276471 4617429 4583427 5055045
19019E055045q81547N29033N53959k00292R35149O86245M83080J627266J483421
$$ 5055045 4173498 4702531 5256490 5056198 5991347 6677592 7160672 8787938 10271359
19010A0271359J410598J286973P13821J142898N36353j80164J47146j199876p30357
$$ 10271359 11681957 12968930 13682751 14825649 15362002 15181838 15328984 14129108 13398751
19001A3398751j179475j577828j327909j231670o89580M66729J40893P76979J103349
$$ 13398751 12219276 10641448 9313539 8081869 7392289 7859018 7999911 8776890 9880239
18992I880239Q73811J96341L90536j88175J80020l94966m33780j078011j394286
$$ 9880239 10754050 10950391 11340927 11152752 11332772 10937806 10504026 9426015 8031729
18983H031729n32549j336083k37700l80331j77126L4434K13268R91572O35416
$$ 8031729 7499180 6163097 5925397 5545066 5367940 5402374 5615642 6607214 7242630
18974G242630J767308L32637J72723J109379m24315J24871M03262m93830j172031
$$ 7242630 9009938 9342575 9515298 10624677 10200362 10325233 10728495 10234665 9062634
18965I062634k81849j650890k78639n28964n98672j03585J17666j89339Q13051
$$ 9062634 8780785 7129895 6851256 6322292 5723620 5620035 5737701 5548362 6361413
18956F361413J25609K91832L99210P72082Q74936J184254J520364J731043J929569
$$ 6361413 6487022 6778854 7178064 7950146 8825082 10009336 11529700 13260743 15190312
18947A5190312L187100K798527L147249L799451M122194L584946M751312L421657
$$ 15190312 18377412 21175939 24323188 28122639 32244833 35829779 40581091 44002748
18939D4002748L080080J568913O64600p57876o02000j873730l648785m422782
$$ 44002748 47082828 48651741 49316341 48558465 47956465 46082735 42433950 38011168
18931C8011168m110725m821891m857597l419429l155585k576067k309376j675438
$$ 38011168 33900443 29078552 24220955 20801526 17645941 15069874 12760498 11085060
18923A1085060j574255j225858q13305q35573j59787o44001j54383n76045j32754
$$ 11085060 9510805 8284947 7471642 6636069 6476282 5832281 5677898 5101853 4969099
18914D969099n03595l5005J17734l86976K07515k70414l11359M41052j8390j94316
$$ 4969099 4465504 4430499 4548233 4161257 4368772 4098358 3786999 4228051 4209661 4015345
18904D015345j6775N0299J77126n02628L12058K39102K5889k0418L09370k88160
$$ 4015345 3998570 4048869 4225995 3723367 4035425 4274527 4300416 4279998 4589368 4301208
18894D301208K05476K20879N85851l09881M32204M86243L96561P11756L33398
$$ 4301208 4506684 4727563 5313414 5003533 5435737 5921980 6318541 7030297 7363695
18885G363695J331609K93767J744618J787284J897485L127046L169687L519566
$$ 7363695 8695304 8989071 10733689 12520973 14418458 17545504 20715191 24234757
18877B4234757M226125M281925K953565K941057J125301L51535k29489j020753
$$ 24234757 28460882 32742807 35696372 38637429 39762730 40114265 39884776 38864023
18869C8864023l170723l320623m564159l654181m408951k950821k533928k762325
$$ 38864023 35693300 32372677 27808518 24154337 19745386 16794565 14260637 11498312
18861A1498312j405709j539913j121293q30847p33222p96246m29923n54328p4364
$$ 11498312 10092603 8552690 7431397 6600550 5867328 5071082 4641159 4086831 4012467
18852D012467K52612r17257N14566m08723n41607j29665J51771M4089L1429n93488
$$ 4012467 4265079 3347822 3862388 3453665 2912058 2782393 2934164 2978253 3009682 2416194
18842B416194n6286L20963l34729k48342K21531k15700N91589l64911j50544k28662
$$ 2416194 2359908 2680871 2346142 2097800 2319331 2103631 2695220 2330309 2179765 1951103
18832A951103M22564j89224l27907L59577l44191O0706L40405m31583M3342J90033
$$ 1951103 2373667 2184443 1856536 2216113 1871922 1932628 2273033 1841450 1884792 2074825
18822B074825k70598p9825j43884l9425N06962o03441K60600L18856n6814j13577
$$ 2074825 1804227 1724402 1580518 1541093 2048055 1444614 1705214 2024070 1967256 1853679
18812A853679j71187j48969j17058R2391K69448m98101K89745k37070L96294k07040
$$ 1853679 1682492 1533523 1416465 1508856 1778304 1280203 1569948 1332878 1729172 1522132
18802A522132M8151K12407l52068n6752l9095N2856o5401Q56844m46609m96402
$$ 1522132 1570283 1782690 1430622 1373870 1334775 1387631 1322230 2179074 1732465 1236063
18792A236063K51450P554J25622M00444o32931N46885m99619K37672l05448O94464
$$ 1236063 1487513 1495067 1620689 2021133 1388202 1935087 1435468 1673140 1367692 2062156
18782B062156k05474R5363r1104k9562j93594M10825n15863M13451j26880j52947
$$ 2062156 1856682 1952045 1860941 1831379 1637785 2048610 1532747 1946198 1819318 1666371
18772A666371k57636K47732M42390j24856j4784J93778l02857j62265K88921k24372
$$ 1666371 1408735 1656467 2098857 1974001 1959217 2152995 1850138 1687873 1976794 1752422
18762A752422l60974J68760K83879l66424L15875l63191N73755k42311L07291
$$ 1752422 1391448 1560208 1844087 1477663 1793538 1430347 2004102 1761791 2069082
18753B069082o71701N67745n13481M02905Q1743l29226j44951K96854n8293M3107
$$ 2069082 1397381 1965126 1451645 1854550 1936293 1607067 1462116 1758970 1700677 1743784
18743A743784k04054n2017J05102J7679n77289J253599A069398N80735L17791
$$ 1743784 1539730 1487713 1592815 1610494 1033205 2286804 1069398 1650133 1967924
18734A967924p33507N15304k89048R7548k71777J65116o3523J98617j64408K50226
$$ 1967924 1234417 1749721 1460673 1558221 1286444 1451560 1388037 1586654 1422246 1672472
18724A672472j42329J16029k81823K46078n90636L74700L5103j07661j95521k33505
$$ 1672472 1530143 1646172 1364349 1610427 1019791 1394491 1429594 1321933 1126412 892907
18714H92907N72115j9226j487J59917L3420n42883M19991n27907N07158L7542
$$ 892907 1465022 1445796 1444309 1604226 1637646 1094763 1514754 986847 1494005 1531547
18704A531547L58474j06459j3572o19051L38267J47894L12574J17189r4675o64973
$$ 1531547 1890021 1783562 1769990 1150939 1489206 1637100 1949674 2066863 1972188 1307215
18694A307215L30912j49287J11871m17540J032545r56586M64217q1571K62893
$$ 1307215 1638127 1488840 1600711 1183171 2215716 1259130 1723347 1641776 1904669
18685A904669P3893l14016j0651o670k72034K35943l80131P24388m82414m34779
$$ 1904669 1978562 1664546 1653895 1647225 1375191 1611134 1231003 1955391 1472977 1038198
18675A038198K77485J48622l88073K37429r7840L52379m65499j52604K04649J81600
$$ 1038198 1315683 1464305 1076232 1313661 1215821 1568200 1102701 950097 1154746 1336346
18665A336346K95183k43049n3252M11173n00183J1763Q1112l5172J17208j11286
$$ 1336346 1631529 1388480 1335228 1746401 1246218 1257981 1339093 1303921 1421129 1309843
18655A309843l25018K24181l84733P57953l61203J02423j19026j07632K23499
$$ 1309843 984825 1209006 824273 1582226 1221023 1323446 1204420 1096788 1320287
18646A320287J65734L9055l11533k5148q826P65584F45080L82328L0038K38224
$$ 1320287 1486021 1525076 1213543 1188395 1179569 1945153 645080 1027408 1057446 1295670
18636A295670L72255n17496M97136j28519O8534l63133O15539n04744J40086m5690
$$ 1295670 1667925 1150429 1647565 1519046 1587580 1224447 1839986 1335242 1475328 1429638
18626A429638K39129J5797k68956k05396R26771m81695k89167l91208P36395K08857
$$ 1429638 1668767 1684564 1415608 1210212 2136983 1655288 1366121 974913 1711308 1920165
18616A920165k54331j69908q8725R00008n89593l1655n90705K79279L7744m34624
$$ 1920165 1665834 1495926 1407201 2307209 1717616 1685961 1095256 1374535 1412279 977655
18606I77655M74002J46253l54127P81349k98177J08721j72755j33252Q0472K20008
$$ 977655 1451657 1597910 1243783 2025132 1726955 1835676 1662921 1529669 1610141 1830149
18596A830149P1164o12579M45989l17814k3121J9276m70819N22738j9741L42173
$$ 1830149 1901313 1288734 1734723 1416909 1393788 1413064 942245 1464983 1445242 1787415
18586A787415k83704m81522K07383K85869n9090j42007l7782K23559r6443j43966
$$ 1787415 1503711 1022189 1229572 1515441 1456351 1314344 1276562 1500121 1403678 1259712
18576A259712K25441L81232j56478J04242j67281l35453J30588l00382n3069J89744
$$ 1259712 1485153 1866385 1709907 1814149 1646868 1311415 1442003 1141621 1088552 1278296
18566A278296M98310k02444q4367K91702m39950N69549j92565o24821N6169M85704
$$ 1278296 1776606 1574162 1489795 1781497 1341547 1911096 1718531 1093710 1149879 1635583
18556A635583n28692j20021K27310M23359p3025m36977J63558N26623j33503o85383
$$ 1635583 1106891 986870 1214180 1637539 1564514 1127537 1291095 1817718 1684215 998832
18546I98832K72018K46522j24999j25440L08115l30582l82639Q31569j41914l16520
$$ 998832 1270850 1517372 1392373 1266933 1575048 1244466 861827 1693396 1551482 1234962
18536A234962l00674L75678J15207j83275k61475M62341J24669n27953L72804
$$ 1234962 934288 1309966 1425173 1241898 980423 1442764 1567433 1039480 1412284
18527A412284m93079L71839j63475j03552M76033k08867K68043k71891j75829
$$ 1412284 919205 1291044 1127569 1024017 1500050 1291183 1559226 1287335 1111506
18518A111506j93206M29292p566n00805L53123l91416m8475q9422L83403q834
$$ 1111506 918300 1347592 1340026 839221 1192344 800928 752453 663031 1046434 1037600
18508A037600J48423j15670O7393l1920N0257k13449R552L53471j14148K9908
$$ 1037600 1186023 1070353 1137746 1105826 1156083 942634 952186 1305657 1191509 1221417
18498A221417R6507M3378j10428l78683K2722N88243E31787O74073k32324J41329
$$ 1221417 1317924 1361302 1250874 872191 894913 1483156 531787 1205860 973536 1114865
18488A114865R8709j79861M66310o31027K80980l46683K65616j68157K05982K54981
$$ 1114865 1213574 1033713 1500023 868996 1149976 803293 1068909 900752 1106734 1361715
18478A361715k47565j51918K83737L54014o32266j62594N91316l57418N00021
$$ 1361715 1114150 962232 1245969 1599983 967717 805123 1396439 1039021 1539042
18469A539042n12263j4727K33017O6836K01710p47739J93693k40993L77223p1669
$$ 1539042 1026779 1012052 1245069 1311905 1513615 765876 959569 718576 1095799 1024130
18459A024130L45627l05111L96193q2918m17247O10800G72244N70820J33376n85165
$$ 1024130 1369757 1064646 1460839 1377921 960674 1571474 772244 1343064 1476440 891275
18449H91275R1675K80638K9720j6188J6802j8699k7302J38804k98935M44793j51206
$$ 891275 982950 1263588 1293308 1277120 1293922 1275223 1247921 1386725 1087790 1532583 1381377
18438A381377E67166P99680l32247L47062K95412m08286l55829k11810L54297
$$ 1381377 567166 1366846 1034599 1381661 1677073 1268787 912958 701148 1055445
18429A055445o7812Q0027J62300J5380K28550J44962k87915j12837K72338j60360
$$ 1055445 987633 1067660 1229960 1245340 1473890 1618852 1330937 1218100 1490438 1330078
18419A330078q9794J30635q2205L73190l81886K43159j63188L7688M60895l69457
$$ 1330078 1240284 1370919 1288714 1661904 1280018 1523177 1359989 1397677 1858572 1489115
18409A489115j37740k70983m93444N26522J67522J04273o31116M22090j26686
$$ 1489115 1351375 1080392 586948 1113470 1280992 1385265 754149 1176239 1049553
18400A049553R509J13459R2545K7786K07183r9155l56899K01477J90494j75525
$$ 1049553 1059062 1172521 1265066 1292852 1500035 1400880 1043981 1245458 1435952 1260427
18390A260427L06325E70982P65914J08734j14779J57306n96477Q79246m87825
$$ 1260427 1566752 570982 1336896 1445630 1330851 1488157 891680 1770926 1283101
18381A283101r5627J40024j98792k83560O14116J72725m24954J9654o04578M69902
$$ 1283101 1187474 1327498 1128706 845146 1459262 1631987 1207033 1226687 622109 1092011
18371A092011J83130j78774L9125l8241j60281L82545j55591j04573L49858P9647
$$ 1092011 1275141 1096367 1135492 1097251 936970 1319515 1163924 1059351 1409209 1488856
18361A488856l92848l8984J05943D56233N93000o1017L51340J44191E76723L44237
$$ 1488856 1096008 1057024 1162967 456233 1049233 988216 1339556 1483747 576723 920960
18351I20960r634J17679l73127O44091l72667L47947n23068L51377J26779k40154
$$ 920960 911326 1029005 655878 1299969 927302 1275249 752181 1103558 1230337 990183
18341I90183J97604k146J91076j17076j78898J4564j10451K91268j64119M40427
$$ 990183 1187787 1185641 1376717 1259641 1080743 1095307 984856 1276124 1112005 1552432
18331A552432l83006P436j31940K15687L81757n08687j08370l05602N18484k55354
$$ 1552432 1169426 1176862 1044922 1260609 1642366 1133679 1025309 719707 1238191 982837
18321I82837j94050K39488L96001m33854K53274j61725J02800J67295P8308r7518
$$ 982837 788787 1028275 1424276 990422 1243696 1081971 1184771 1352066 1430374 1332856
18311A332856J8186J607M78609o78788J04834L11202K17895o04145n7653K38604
$$ 1332856 1351042 1352649 1831258 1152470 1257304 1568506 1786401 1182256 1124603 1363207
18301A363207J07777n56065L60966l78468K18704J09081Q1j42082r1816L02425
$$ 1363207 1470984 914919 1275885 897417 1116121 1225202 1225283 1083201 991385 1293810
18291A293810R2480j10816K10038m45974L23903J77758G06144O74788J45825k13646
$$ 1293810 1386290 1275474 1485512 1039538 1363441 1541199 706144 1380932 1526757 1313111
18281A313111j8337M7194k19387K19978p7876n17705O21023J73454o53398l0548
$$ 1313111 1294774 1341968 1122581 1342559 1264683 746978 1368001 1541455 888057 857509
18271H57509L49318o1174j66311M48486J6637n29652j89329Q67032m44988E43912
$$ 857509 1206827 1145653 979342 1427828 1444465 914813 725484 1592516 1147528 543912
18260A432075l09094D84790Q43684N4172r4743j19388l84577J94879O4538J99141
$$ 1432075 1122981 484790 1328474 1382646 1287903 1168515 783938 978817 1043355 1242496
18250A242496k91377O11718n13840N93254l13444K42763k34922M8618J21777G25289
$$ 1242496 951119 1562837 1048997 1642251 1328807 1571570 1336648 1385266 1507043 725289
18239A230695J6915k25234K82300j87103K82689j88830J50143J81347m95848l7089
$$ 1230695 1247610 1022376 1304676 1117573 1400262 1211432 1361575 1542922 1047074 1009985
18229A009985l27851M42449M6413j05448L60559l19621k84428M71183k73463r4292
$$ 1009985 682134 1124583 1170996 1065548 1426107 1106486 822058 1293241 1019778 925486
18219I25486Q5653J18158k84497J85589C79146L86880K14013J01464k86616j22620
$$ 925486 1011139 1129297 844800 1030389 379146 766026 980039 1081503 794887 672267
18209F72267Q40273m68296O236J5672M62883k93374l80931m2526N36438o3604
$$ 672267 1512540 1044244 1050480 1066152 1529035 1235661 854730 812204 1348642 1285038
18199A285038m00597k32870O01066k65451N82924n72925M29007o15992L84074
$$ 1285038 884441 651571 1252637 987186 1570110 997185 1426192 810200 1194274
18190A194274J8204j12950l74745O89815m65960l07703L62996J39121m43912N29695
$$ 1194274 1212478 1099528 724783 1414598 948638 640935 1003931 1143052 699140 1228835
18180A228835D88710N64788L89338k24905j78104N66902o74859q5732N01023j8231
$$ 1228835 488710 1053498 1442836 1217931 1039827 1606729 931870 846138 1347161 1328930
18170A328930k73266k05198N698J27931j8255J82987l68723j2527M51847l41632
$$ 1328930 1055664 850466 856164 984095 965840 1148827 780104 767577 1219424 877792
18160H77792L6169L4605r7292m1213M18095l52340k68503Q90462j09313m09226
$$ 877792 913961 948566 851274 810061 1228156 875816 607313 1497775 1388462 979236
18150I79236P30543G80771K95905O3852O154j16945k40999P43381m70924p9035
$$ 979236 1709779 780771 1076676 1140528 1146682 1029737 788738 1532119 1061195 982160
18140I82160L93563m32642K42591j14948n7689K04273l08846L02553O1213n67907
$$ 982160 1375723 943081 1185672 1070724 1013035 1217308 908462 1211015 1272228 704321
18130G04321j86856M75465j37919N113j63327J41509L75204j33855K13050k72766
$$ 704321 517465 992930 855011 860124 696797 838306 1213510 1079655 1292705 1019939
18120A019939k26930N06264m99469k18119N70420K10671J51136F65995R16199
$$ 1019939 793009 1299273 799804 581685 1152105 1362776 1513912 665995 1582194
18111A582194j38102l43141N62039l28781k03522M787k02658K61620K4921k019
$$ 1582194 1444092 1100951 1662990 1334209 1130687 1135474 932816 1194436 1219357 1217338
18101A217338K05771m42605m2517J85674p878J81570J31744j93799E97809P09939
$$ 1217338 1423109 980504 937987 1123661 1115783 1297353 1429097 1235298 597809 1307748
18091A307748j05983q3968m5695l78668L21248J37705k57399R9848K21957R7304
$$ 1307748 1201765 1117797 1072102 693434 1014682 1152387 894988 994836 1216793 1314097
18081A314097o15811O31420l55143o8324j08819L33440j69978N09352n50424j9599
$$ 1314097 698286 1329706 974563 906239 797420 1130860 960882 1470234 919810 900211
18071I00211M03339k62504K32182l64737M1502l41144O63529l19791K58307m97755
$$ 900211 1303550 1041046 1273228 908491 949993 608849 1272378 952587 1210894 713139
18061G13139N34033n14703L31559J1365k25207K22317j42439k76165L84494q5301
$$ 713139 1247172 732469 1064028 1075393 850186 1072503 930064 653899 1038393 953092
18051I53092L59052j85333n04724P26199n53470J54451J47885l10985R9751k31426
$$ 953092 1312144 1126811 622087 1348286 794816 949267 1097152 786167 885918 654492
18041F54492L14942M70209l16453J44930o18894L26891j04716N11943o40737O68323
$$ 654492 969434 1439643 1123190 1268120 649226 976117 871401 1383344 742607 1410930
18031A410930F76118N73892l4166l58038N9042C03794P07362l90265K00050q2771
$$ 1410930 676118 1250010 1215844 857806 916848 303794 1011156 620891 820941 738170
18021G38170L52601L47808o89460K30486K2203K04012M77659n69474k0429m39306
$$ 738170 1090771 1438579 749119 979605 1001808 1205820 1683479 1114005 1093576 654270
18011F54270K74039l3096K67223j66811K59429j85396N826J20459K48499l60180
$$ 654270 928309 895213 1162436 995625 1255054 1069658 1075484 1195943 1444442 1084262
18001A084262j58936K4788k58915N28846m9068j36527J48634p623N4574k30619
$$ 1084262 925326 950114 691199 1220045 1170977 1034450 1183084 1175461 1230035 999416
17991I99416K59333K28115E74179K11726l1191P24898o27172J71003J58390j48806
$$ 999416 1258749 1486864 574179 785905 754714 1479612 852440 1023443 1181833 1033027
17981A033027M76072D54756N26969k90825M73495J8414k17833O4796Q3141k59066
$$ 1033027 1509099 454756 981725 690900 1164395 1182809 964976 1029772 1112913 853847
17971H53847L12454m47407L63906j6644l04860L03608J03856N56862n50288k51169
$$ 853847 1166301 718894 1082800 1066156 761296 1064904 1168760 1725622 1175334 924165
17961I24165K82490j99556L56599k71248j40466M54759p2062M4264l52975k88297
$$ 924165 1206655 1007099 1363698 1092450 951984 1406743 1334681 1378945 1025970 737673
17951G37673M80520l51968L9057L18484p3868J35317k60558j86797L32919j60673
$$ 737673 1218193 866225 905282 1223766 1149898 1285215 1024657 837860 1170779 1010106
17941A010106L23409o4604p4439N9491k52939M48450j60757l64424K77781J99881
$$ 1010106 1333515 1268911 1194472 1253963 1001024 1449474 1288717 924293 1202074 1401955
17931A401955m09556L49487K29283k10554q1247J52598k01725K53374l41161M31619
$$ 1401955 992399 1341886 1571169 1360615 1279368 1431966 1230241 1483615 1142454 1574073
17921A574073n59320O83517m15723J50755L13283q48260O14204k20991M60063
$$ 1574073 1014753 1698270 1282547 1433302 1746585 898325 1512529 1291538 1751601
17912A751601n29948J70330L6962M27266m52649L65972L2051k35856L09332p0451
$$ 1751601 1221653 1391983 1428945 1856211 1403562 1769534 1801585 1565729 1875061 1804610
17902A804610L1073l42844l14694L8340N9286K65253J52428J12782j46206M17578
$$ 1804610 1835683 1492839 1178145 1216485 1275771 1541024 1693452 1806234 1660028 2077606
17892B077606o61640m6001K48027J71638j99231K87958q9589M20488o82332M11451
$$ 2077606 1415966 1369965 1617992 1789630 1590399 1878357 1788768 2209256 1526924 1938375
17882A938375r9296M6194J47248l81525L80156m99409K02854K91469o06063P42196
$$ 1938375 1839079 1885273 2032521 1650996 2031152 1531743 1734597 2026066 1420003 2162199
17872B162199j64501k22261L53978n96303K68372o4932K3693K1831j15399L7263
$$ 2162199 1997698 1775437 2129415 1533112 1801484 1736552 1760245 1782076 1666677 1703940
17862A703940j81166O49377l29438L9271J07816l78594P5225L9630k12349J44583
$$ 1703940 1522774 2172151 1842713 1881984 1989800 1611206 1686431 1726061 1513712 1658295
17852A658295J98567k39075n23519l1477N27211L0203N0701k87519L01412R9621
$$ 1658295 1856862 1617787 1094268 1062791 1590002 1620205 1670906 1383387 1684799 1784420
17842A784420j84158k10702K22515j48543n0501J05664J81565l24632o109N16261
$$ 1784420 1600262 1389560 1612075 1463532 1413031 1518695 1700260 1375628 1369519 1885780
17832A885780p60866L24421K46565l4378o01998M50706K64766l12914l86908J15337
$$ 1885780 1124914 1449335 1695900 1661522 1059524 1510230 1774996 1462082 1075174 1190511
17822A190511L16342q0613L95650l14390l6431J90520j84902O42651n56567P1196
$$ 1190511 1506853 1426240 1821890 1507500 1471069 1661589 1476687 2119338 1562771 1633967
17812A633967K52782K33741n75038J04267L98588j48997P8960p03985M48342p69928
$$ 1633967 1886749 2120490 1545452 1649719 2048307 1899310 1978270 1274285 1722627 952699
17802I52699P09237r1627N83099n3953j85121j21419J78451j90018j6009o02344
$$ 952699 1661936 1570309 2153408 2099455 1914334 1792915 1971366 1781348 1765339 1162995
17792A162995Q86269k05323n72356J56381q1486l36468L26605J27295J93844k97512
$$ 1162995 2049264 1843941 1271585 1427966 1346480 1010012 1336617 1463912 1657756 1360244
17782A360244k92506M42584K52798l97210P8065l9457k09835N20624j91722m27230
$$ 1360244 1067738 1510322 1763120 1365910 1443975 1404518 1194683 1715307 1523585 1096355
17772A096355j69950M22763K65685l44985P14216o50027P9881J34437l18721K34408
$$ 1096355 926405 1349168 1614853 1269868 1984084 1334057 1413938 1548375 1229654 1464062
17762A464062R1939N543M4598J30477k37062L82483n58480r0336L62022j91779
$$ 1464062 1556001 1561544 1606142 1736619 1499557 1882040 1323560 1233224 1595246 1403467
17752A403467q0079k03473J37243J66591m02459O9081O8940N2021L12444k31771
$$ 1403467 1323388 1119915 1257158 1423749 1021290 1090371 1159311 1211332 1523776 1292005
17742A292005r3242M87813j78426j1293n1207N8106k7017J77888k52401K17651
$$ 1292005 1198763 1686576 1508150 1496857 1445650 1503756 1476739 1654627 1402226 1619877
17732A619877j11663l46753M78406q0374p4109J1576J50731m10194J4185J40663
$$ 1619877 1508214 1161461 1639867 1559493 1485384 1496960 1647691 1237497 1251682 1392345
17722A392345k0289j65508J49621Q2467L29025j71213m22507K28644j41341k18568
$$ 1392345 1372056 1206548 1356169 1438636 1767661 1596448 1173941 1402585 1261244 1042676
17712A042676K93113j3811l4009N7987j92565L24558K14089j54156n66734j14962
$$ 1042676 1335789 1321978 1287969 1345956 1153391 1477949 1692038 1537882 971148 856186
17702H56186P64126K22469o28366L62350o17358P61741o7741K14924m57551Q7849
$$ 856186 1620312 1842781 1214415 1576765 959407 1721148 1653407 1868331 1410780 1498629
17692A498629j6379J16049j01425K20182l64610J15588j8240n28150O10350j95758
$$ 1498629 1482250 1598299 1496874 1717056 1352446 1468034 1449794 921644 1531994 1336236
17682A336236L96807m83516j15593M58599j20634J21910L62211n85756k35695
$$ 1336236 1733043 1249527 1133934 1592533 1471899 1593809 1956020 1370264 1134569
17673A134569k60540N53520P273m3977l52924O77379j70954j93493L53576n26939
$$ 1134569 874029 1427549 1434822 1390845 1037921 1715300 1544346 1350853 1704429 1177490
17663A177490Q7668K29175q1225j21831J60917J8061M31273r3746l04319K05549
$$ 1177490 1265158 1494333 1413108 1291277 1452194 1470255 1901528 1807782 1503463 1709012
17653A709012R1034q6309m75653P79292R0804l38929j79758J55144K39807l19112
$$ 1709012 1800046 1713737 1238084 2017376 2108180 1769251 1589493 1744637 1984444 1665332
17643A665332M00408j79743l01926j7506l5977O39326J13948m06278p1026j83693
$$ 1665332 2065740 1885997 1584071 1566565 1530588 2169914 2283862 1877584 1806558 1622865
17633A622865N76999j63887J95360l39428J77837K47220m43984J92006L61021
$$ 1622865 2199864 2035977 2231337 1891909 2069746 2316966 1872982 2064988 2426009
17624B426009L285j94318j94715K72958J2117K58265j3668o91644R54898n34403
$$ 2426009 2429294 2234976 2040261 2313219 2325336 2583601 2569933 1878289 2833187 2298784
17614B298784K53215M61297k67919k91296M09503r9232k76396L84952l28007Q5569
$$ 2298784 2551999 3013296 2745377 2454081 2863584 2764352 2487956 2872908 2544901 2630470
17604B630470K35831n35307J041956m63899k78033M90934o45818L80184m72791
$$ 2630470 2866301 2330994 3372950 2909051 2631018 3121952 2476134 2856318 2383527
17595B383527J93585R493L16011l03289K28727J98110q0158n65791K35644l42344
$$ 2383527 2577112 2586605 2902616 2599327 2828054 3026164 2946006 2380215 2615859 2273515
17585B273515L36370R9817O7766J17814m09844M0902J55741K33049j09311l57560
$$ 2273515 2609885 2709702 2777468 2895282 2485438 2526340 2682081 2915130 2805819 2448259
17575B448259K67740j01326k66224L41324m16379J29422n47900N42472K54441
$$ 2448259 2715999 2614673 2348449 2689773 2273394 2402816 1854916 2397388 2651829
17566B651829o09365N52015J57825m27346K92742k56521J48736l1575o3903L65984
$$ 2651829 2042464 2594479 2752304 2324958 2617700 2361179 2509915 2478340 2414437 2780421
17556B780421k89541m61311K5659K87763J5270j63946K12241J84804k47637J2000
$$ 2780421 2490880 2029569 2055228 2342991 2358261 2194315 2406556 2591360 2343723 2355723
17546B355723J48671l04994L31919k46948J90409k21207j7267L28278L06963m74612
$$ 2355723 2504394 2199400 2531319 2284371 2474780 2253573 2236306 2564584 2871547 2396935
17536B396935J20405l96476L28094M19712o00491K12043j41690M17692m76829
$$ 2396935 2517340 2120864 2448958 2868670 2268179 2480222 2338532 2756224 2279395
17527B279395M25516k42975L6272L14026Q1254o45249Q39105l09776R1455k09369
$$ 2279395 2704911 2461936 2498208 2812234 2893488 2248239 3087344 2777568 2869023 2659654
17517B659654p6824k41661M13410n7069L85726J21628M78847n740P20662l61895
$$ 2659654 2582830 2341169 2754579 2697510 3083236 3204864 3683711 3677971 4398633 4036738
17507D036738L23492M0191L56121j56549J28580L4454p4964n4554J63656l17182
$$ 4036738 4360230 4400421 4756542 4599993 4728573 4763027 4688063 4633509 4797165 4479983
17497D479983K67510j44295M84104O44142l3776O11440N55632Q99555L83254Q08274
$$ 4479983 4747493 4603198 5087302 5731444 5697668 6309108 6864740 7764295 8147549 8955823
17487H955823J417490K520846L740011P349472J0604282J4882004J4382331J2130341
$$ 8955823 10373313 12894159 16634170 23983642 34587924 49469928 63852259 75982600
17479G5982600Q452160N198503L357448J180254j947186m869875r721522j1582897
$$ 75982600 84434760 89633263 92990711 94170965 92223779 87353904 77632382 66049485
17471F6049485j1685969r738083l120287K860941R284900J2117059J1681928Q784896
$$ 66049485 54363516 44625433 41505146 44366087 53650987 65768046 77449974 86234870
17463H6234870N957884K654262J050332j853687n513572q682862j2381890j4774831
$$ 86234870 92192754 94847016 95897348 94043661 88530089 79847227 67465337 52690506
17455E2690506j3569369j1386813p395834m946749l396438j856741j161043j075909
$$ 52690506 39121137 27734324 20338490 15391741 11995303 10138562 8977519 7901610
17447G901610n08205J87124n53628O52822L48543L88316m91553R98492j81377
$$ 7901610 7393405 7580529 7026901 7679723 8028266 8416582 7925029 8923521 8742144
17438H742144j43370k22843K3973n05450l09145L37382k76630k91836j17859K739
$$ 8742144 8598774 8375931 8399904 7894454 7585309 7922691 7646061 7354225 7236366 7239105
17428G239105M54421l33322K26040K93155m67285L51047q2266o91977p48467l62175
$$ 7239105 7693526 7360204 7586244 7879399 7412114 7763161 7680895 6988918 6240451 5878276
17418E878276L30578o36260k62457j02524l78919J8870L22945j42762l49186J68406
$$ 5878276 6208854 5572594 5310137 5207613 4828694 4847564 5170509 5027747 4678561 4846967
17408D846967O19097k08743L32127R802J14986K00464L14301M16475L80539J06995
$$ 4846967 5466064 5257321 5589448 5599250 5714236 5914700 6229001 6645476 7026015 7133010
17398G133010q7035L73634P43346o7089q1571J25598N70277l41188J150313K18630
$$ 7133010 7045975 7419609 8162955 8095866 8014295 8139893 8710170 8368982 9519295 9737925
17388I737925P18841J318489N51702P28424O80967J536771j05056O16120k076
$$ 9737925 10456766 11775255 12326957 13055381 13736348 15273119 15168063 15784183 15782107
17379A5782107j058181M38151m08038o63202k03822l30765m64524M36816K87682
$$ 15782107 14723926 15162077 14754039 14090837 13887015 13556250 13091726 13528542 13816224
17370A3816224K38266M30259Q49137J05909J029518R94779J114448K53360K16456
$$ 13816224 14054490 14484749 15333886 15439795 16469313 17464092 18578540 18831900 19048356
17361A9048356j13206L83406j22038M2063r35261M77505k19172K06026J42493
$$ 19048356 18935150 19318556 19196518 19238581 18303320 18780825 18561653 18767679 18910172
17352A8910172n02652J072596K40395O37017R03964J068314Q77845J548332J057047
$$ 18910172 18407520 19480116 19720511 20357528 21261492 22329806 23207651 24755983 25813030
17343B5813030Q58227J530236O83753P42528J26087N75667m24757o31985m91752
$$ 25813030 26671257 28201493 28885246 29627774 29753861 30329528 29904771 29272786 28781034
17334B8781034l58957o5720j076704n5072M47806M17442P48338O48154M56345
$$ 28781034 28422077 28356357 27279653 27224581 27672387 28089829 28838167 29486321 29942666
17325B9942666J425319Q56088R89569Q05921J84462M84755p67064j70570o22207
$$ 29942666 31367985 32224073 33213642 34019563 34204025 34688780 33921716 33751146 33128939
17316C3128939j085129m05522j455044r72223j486497j188349n16638j245313
$$ 33128939 32043810 31638288 30183244 29211021 27724524 26536175 26019537 24774224
17308B4774224k67213l92260m37129O57949L79386R40389Q51131R54413O70672
$$ 24774224 24507011 24114751 23677622 24335571 24714957 25655346 26506477 27460890 28131562
17299B8131562L43898O60473Q34651k98226n20362o28081j087454j065884j207135
$$ 28131562 28475460 29135933 29970584 29672358 29151996 28523915 27436461 26370577 25163442
17290B5163442j336329j217582j230322m66679o48888n98595r22240k20910K35104
$$ 25163442 23827113 22609531 21379209 20912530 20263642 19665047 18742807 18521897 18757001
17281A8757001K34725o37586o8137q9057j105909m09488o54631r55546p13749
$$ 18757001 18991726 18354140 18286003 18196946 17091037 16681549 16026918 15071372 14357623
17272A4357623j192538q01024j85260r36812j098248M59442j550030M75068n77903
$$ 14357623 13165085 12364061 12178801 11241989 10143741 10603183 9053153 9528221 8950318
17263H950318j82477k83342q09824j5230m72587l1236J8461J23787m3297l0013
$$ 8950318 8767841 8484499 7674675 7659445 7186858 7155622 7174083 7297870 7254573 7224560
17253G224560p96177N36491m65182m9074J39879n19122L39275k42717k32867N0262
$$ 7224560 6428383 6964874 6499692 6450618 6590497 6071375 6410650 6167933 5935066 5985328
17243E985328n26430J52740k36245K8884m1550k0077P0349r7613k40813k57983
$$ 5985328 5458898 5611638 5375393 5404277 5362727 5342650 5412999 5315386 5074573 4816590
17233D816590Q45479n65468L66624k71159L84352m51497K25149M49729n49924
$$ 4816590 5662069 5096601 5463225 5192066 5576418 5124921 5350070 5799799 5249875
17224E249875Q92346o05102N55650q092L7280l19333p2901L89982l56958j45188
$$ 5249875 6142221 5537119 6092769 6084677 6121957 5802624 5729723 6119705 5762747 5617559
17214E617559P9643Q8165P4368l89268R9444J85484N76442l03632N8348L01869
$$ 5617559 5697202 5785367 5859735 5470467 5569911 5755395 6331837 6028205 6086553 6388422
17204F388422J10350N21167j8559M076J6895j93907K73470o75836M44820o60648
$$ 6388422 6498772 7019939 7001380 7005456 7022351 6828444 7101914 6426078 6870898 6210250
17194F210250n02573n90900m73664K55806j06820l1964N35254n64769K33455m41238
$$ 6210250 5707677 5116777 4643113 4898919 4792099 4760135 5295389 4730620 4964075 4522837
17184D522837k2088q0247p915K76915k31994k01571n30440j89533L93801j24306
$$ 4522837 4500749 4420502 4412587 4689502 4457508 4255937 3725497 3535964 3929765 3805459
17174C805459L20242l23105K32460r4941n3556k08079M81233m32023N72815j45438
$$ 3805459 4125701 3802596 4035056 3940115 3886559 3678480 4159713 3727690 4300505 4155067
17164D155067K0507j60044M9577K97714q5616j04874M01206j83080J4708J49416
$$ 4155067 4175574 4015530 4065107 4362821 4277205 4172331 4573537 4390457 4405165 4554581
17154D554581L30383P7877l0508J4474k74211k5236p3453L64308k83328L28164
$$ 4554581 4884964 4962841 4932333 4946807 4672596 4647360 4573907 4938215 4654887 4983051
17144D983051k77993j73074k20130J41767N4742K86724k53680l89799L42694Q50571
$$ 4983051 4705058 4531984 4311854 4453621 4508363 4795087 4541407 4151608 4494302 5344873
17134E344873n32940N3139K2676J64922M10n42481M31950k45073L27576K23735
$$ 5344873 4811933 4865072 4887748 5052670 5053080 4510599 4942549 4697476 5025052 5248787
17124E248787J70619J42751Q46m23716R28226k33671m6691r80710O66119n25561
$$ 5248787 5419406 5562157 5563003 5139287 6067513 5833842 5787151 4806441 5472560 4946999
17114D946999K30060m84242o6708l6623j51799o79459r5094o90284R12135l28029
$$ 4946999 5177059 4692817 4626109 4589486 4437687 3758228 3663134 2972850 3884985 3556956
17104C556956p7668m55588N24019l02508p87176J29594L9764O1641N2014j47882
$$ 3556956 3479288 3023700 3547719 3245211 2458035 2587629 2627393 2689034 2741048 2593166
17094B593166Q4940l00770L20697n0797Q3888k56712R6069m44187M94684k05384
$$ 2593166 2678106 2377336 2698033 2647236 2731124 2474412 2570481 2126294 2620978 2415594
17084B415594j9498J00173K22710k71078l46249j77324J026119q16159K37148
$$ 2415594 2396096 2496269 2718979 2447901 2101652 1924328 2950447 2134288 2371436
17075B371436K82450l45039L33060j79096M79078k64963k94550n2290L7633L00251
$$ 2371436 2653886 2308847 2641907 2462811 2941889 2676926 2382376 2330086 2367719 2667970
17065B667970k32039N02419r05317L48031l9569J89343J31236l31525N67585k13974
$$ 2667970 2435931 2938350 2033033 2381064 2341495 2530838 2662074 2330549 2898134 2684160
17055B684160K76127j51003k6108L9462M02618l73499M01393k52693q23983P64388
$$ 2684160 2960287 2809284 2783176 2822638 3225256 2851757 3253150 3000457 2176474 2940862
17045B940862m36594L15506K77977l81874k85609Q19066k68243K88710L81743
$$ 2940862 2504268 2819774 3097751 2715877 2430268 3249334 2981091 3269801 3651544
17036C651544o06895J6719M84622p96755M34376m43029L21821m40526N6831K93919
$$ 3651544 3044649 3061368 3545990 2749235 3183611 2740582 3062403 2621877 2678708 2972627
17026B972627k7406n44397l2328M35993k54981K68935j90047m16495J6926J94904
$$ 2972627 2945221 2400824 2368496 2804489 2549508 2818443 2628396 2211901 2228827 2423731
17016B423731j25128o17887K85330N16865P8698L7246m86554R6072M11908m23978
$$ 2423731 2298603 1680716 1966046 2482911 2561609 2598855 2112301 2208373 2620281 2196303
17006B196303M44450L2788r6266l21275L11970J03509l17138K82527k11978j32803
$$ 2196303 2640753 2673541 2577275 2256000 2567970 2671479 2354341 2636868 2424890 2292087
16996B292087L39172m08887J72936m6444J20932r7952n8216J74119l10620K47248
$$ 2292087 2631259 2222372 2395308 2348864 2469796 2371844 2313628 2487747 2177127 2424375
16986B424375K16425l57227M8625L76220k57589K52555q1697j12382K21145k87531
$$ 2424375 2640800 2283573 2332198 2708418 2450829 2703384 2621687 2509305 2730450 2442919
16976B442919K44344r0586L13573M62211j4041l13083J40830L21542k34254P57958
$$ 2442919 2687263 2596677 2910250 3372461 3358420 3045337 3186167 3507709 3273455 4031413
16966D031413Q8992J342L33717q5723K53353K87842Q8663L91361K8034N11995
$$ 4031413 4120405 4121747 4455464 4369741 4623094 4910936 4999599 5390960 5418994 5930989
16956E930989p1551K12953j00010M49814m37016n8992L436o7546j70358K78538
$$ 5930989 5859438 6072391 5972381 6422195 5985179 5926187 5929623 5862077 5691719 5970257
16946E970257o70820M51R4402q20109j64254m69325k46390j50683K6802N3711
$$ 5970257 5299437 5299888 5394290 4574181 4409927 3940602 3694212 3543529 3570331 3624042
16936C624042k97847j22944J25528j09247o63472N21295m9040k88113k15188M52171
$$ 3624042 3326195 3203251 3328779 3219532 2556060 3077355 3028315 2740202 2525014 2977185
16926B977185j82153L07631l77054j75556k56513J13975P54625n25553k82063
$$ 2977185 2795032 3102663 2725609 2550053 2293540 2407515 3162140 2636587 2354524
16917B354524P8910j43650L23112j95834j05441K68432m13244l7566j31364J39551
$$ 2354524 2433434 2289784 2612896 2417062 2311621 2580053 2166809 2129243 1997879 2137430
16907B137430j04920n605K04749j46571o27480J01204P89104k11867l80626K93524
$$ 2137430 2032510 2026905 2231654 2085083 1457603 1558807 2347911 2136044 1755418 2048942
16897B048942j41272K20005K50828q04785N46963o76290N99124m1249q2154N59236
$$ 2048942 1907670 2127675 2378503 1573718 2120681 1444391 2043515 2002266 1920112 2479348
16887B479348n41411m5471L3270l24213L17411l79412L49803j10166J72594m1593
$$ 2479348 1937937 1892466 1925736 1601523 1918934 1539522 1889325 1779159 1951753 1910160
16877A910160k23223M6125O57438o62470K41922K99924k85992J11803J15248o0756
$$ 1910160 1686937 1733062 2390500 1728030 1969952 2269876 1983884 2095687 2210935 2150179
16867B150179j29913J29119l77702N63789n35435P33091n12064K90778Q7308r831
$$ 2150179 2020266 2149385 1771683 2335472 1800037 2533128 2021064 2311842 2399150 2389319
16857B389319q7370k9408k06107L03731J45398n6654k55838k08032K97803r0350
$$ 2389319 2301949 2272541 2066434 2370165 2515563 2458909 2203071 1995039 2292842 2202492
16847B202492j45866J22913l33290J05357L13391o97725R5649L48464k60732j83652
$$ 2202492 2056626 2179539 1846249 1951606 2264997 1567272 1662921 2011385 1750653 1567001
16837A567001P25729l31512Q1812p6185N21035q9347n6529m09720j15527L68868
$$ 1567001 2292730 1961218 2043030 1966845 2487880 2398533 2342004 1932284 1816757 2185625
16827B185625K83414k9147k15896K08213K10143j81725l92669R99879l59190R6084
$$ 2185625 2469039 2439892 2223996 2432209 2642352 2460627 2067958 3067837 2708647 2804731
16817B804731L32087k256k79588N76876q5730N64595n91343L67371J9094j00436
$$ 2804731 3136818 3134562 2854974 3431850 3346120 3910715 3319372 3686743 3705837 3605401
16807C605401j90898j72548n8444O02153n81075p5269J43794M57660k32742J84773
$$ 3605401 3414503 3241955 3183511 3785664 3204589 3129320 3273114 3730774 3498032 3682805
16797C682805j29421n24168k83187O05345l62150L8240o66036J57156p2669o83014
$$ 3682805 3553384 3029216 2746029 3351374 2989224 3027464 2361428 2518584 2445915 1762901
16787A762901n1489M29877J7832j68021j91344j19027l64414O13088Q9967j77263
$$ 1762901 1711412 2141289 2159121 1991100 1799756 1680729 1316315 1929403 2019370 1842107
16777A842107l25541j5427M0659N24710m41512k30952j05678Q0015L41023J83531
$$ 1842107 1516566 1501139 1541798 2066508 1624996 1394044 1288366 1368381 1709404 1892935
16767A892935k34182N679L0419r866K05134l14310J7283K15474L145M71024l08868
$$ 1892935 1658753 1664432 1694851 1684985 1890119 1575809 1593092 1808566 1811711 2282735 1973867
16756A973867j03026m98006P03602n52455K04418j36908Q4130L51411m92344M62964
$$ 1973867 1870841 1372835 2076437 1523982 1728400 1591492 1675622 2027033 1534689 1997653
16746A997653l17466J58867k06682M38502m72632p7663L54361j33604O65658l45945
$$ 1997653 1680187 1839054 1632372 2070874 1598242 1520579 1874940 1741336 2406994 2061049
16736B061049o07256N73583p6988L47119l71587L20342m36612K86841m98796M80564
$$ 2061049 1453793 2027376 1950388 2297507 1925920 2246262 1809650 2096491 1597695 2078259
16726B078259J04120l20846J45025j33888M95441k30352L2648J96186o86M87056
$$ 2078259 2182379 1861533 2006558 1872670 2368111 2137759 2170407 2366593 2365907 2852963
16716B852963m21092J97797m35752O74239p39394L44580n4169P79647j40486r6783
$$ 2852963 2431871 2629668 2193916 2868155 2128761 2473341 2419172 3198819 3058333 2961550
16706B961550K14865K24411j51625L77500K80115J09755L47454j71282J48713
$$ 2961550 3176415 3400826 3249201 3626701 3906816 4016571 4364025 4192743 4341456
16697D341456j92912l0472k01824M002n77986O46843r0477n4125K36506p0038
$$ 4341456 4148544 4118072 3916248 3920250 3342264 3989107 3898630 3844505 4081011 4010973
16687D010973P54346p01512N48710Q4362j97934j78712j60457l09003q7841J98017
$$ 4010973 4765319 4063807 4612517 4696879 4498945 4320233 4159776 3850773 3762932 3960949
16677C960949k00718l18544J90780m13000l18304N43674r5527m40654M73875J74330
$$ 3960949 3760231 3441687 3632467 3219467 2901163 3444837 3349310 2908656 3382531 3556861
16667C556861k75823Q00509L64351j33618o6692o0585M715n5948k32492K32349
$$ 3556861 3281038 4081547 4445898 4312280 4245588 4185003 4189718 4133770 3901278 4133627
16657D133627j42422k86052M07842k83105J102J99341r3140k59863M23710l29639
$$ 4133627 3991205 3705153 4112995 3829890 3830992 4030333 3937193 3677330 4101040 3771401
16647C771401J13970j31634m51656p9456P334n71867k74771j60073P0629p26273
$$ 3771401 3885371 3753737 3302081 3222625 3229959 2658092 2383321 2223248 2293877 1567604
16637A567604O71444k15703j0518L92691K8048k72503R9158j3947p02247R26107
$$ 1567604 2239048 2023345 2012827 2405518 2433566 2161063 2260221 2246274 1544027 2470134
16627B470134n37712l40997M54371J31055J64342r49106R70644o91575N00601
$$ 2470134 1932422 1591425 2045796 2176851 2341193 1392087 2362731 1671156 2171757
16618B171757j13227j87672J78930l22899l3128Q47573l54670K08300l81797J12585
$$ 2171757 2058530 1870858 2049788 1726889 1693761 2541334 2186664 2394964 2013167 2125752
16608B125752j51628P1420R151l66078K54755J95796N71804k95440o9460Q17220
$$ 2125752 1974124 2045544 2054695 1688617 1943372 2139168 2710972 2415532 2346072 3163292
16598C163292n04882N6363q5871m21344M93339J14417j30825J98335m95276M39350
$$ 3163292 2658410 2714773 2628902 2207558 2700897 2815314 2684489 2882824 2387548 2826898
16588B826898j53055j46044k76036L74609l04893M36923j049495R59026n64171
$$ 2826898 2673843 2527799 2251763 2626372 2321479 2758402 1708907 2667933 2103762
16579B103762O4436M26617l30393j77738K33062m64679k37192N7700J58834N61559
$$ 2103762 2168198 2594815 2264422 2086684 2319746 1855067 1617875 1675575 1834409 2395968
16569B395968o46154M96304J63682m12472j43757J76159k41813l23136M60067
$$ 2395968 1749814 2246118 2409800 1997328 1853571 2029730 1787917 1464781 1924848
16560A924848K01550O2877k85911J99061K78809J56033n91840l11316K50167J4487
$$ 1924848 2126398 2189275 1903364 2102425 2381234 2537267 1945427 1634111 1884278 1898765
16550A898765J03108K98073q42852R7740K73616K60090n54358O43184l48973L83851
$$ 1898765 2001873 2299946 1457094 1554834 1828450 2088540 1534182 2177366 1828393 2212244
16540B212244o3717k0309l51167j9788K22701L04977n26410m00371N69202K1361
$$ 2212244 2148527 2128218 1777051 1757263 1979964 2284941 1758531 1358160 1927362 1948723
16530A948723l67222j79243Q70531n59435j15011L44571n05173O44433j48057
$$ 1948723 1581501 1402258 2272789 1713354 1598343 1942914 1437741 2082174 1934117
16521A934117L82688m43227J59261k16687M92077o1181l53419O3034M47476J70892
$$ 1934117 2316805 1873578 2032839 1816152 2308229 2247048 1893629 1956663 2404139 2575031
16511B575031k76588J09906m434j19981L59117J52011k39280k60360M96984J90905
$$ 2575031 2298443 2408349 2403915 2283934 2643051 2795062 2555782 2295422 2792406 2983311
16501B983311k17700J5901J00268o3435k78746O0172J87513l16131M15731l15254
$$ 2983311 2765611 2781512 2881780 2818345 2539599 2599771 2787284 2471153 2886884 2571630
16491B571630N22006k06033l42167O45081J96572j07512M30770k43461N0671k15618
$$ 2571630 3093636 2887603 2545436 3190517 3387089 3279577 3710347 3466886 3517557 3301939
16481C301939K75691N968J38578J6331l21318j64065L56157j65282k27461j39308
$$ 3301939 3577630 3583598 3722176 3738507 3417189 3253124 3609281 3443999 3216538 3077230
16471C077230r2841Q3132l33879K7448J52758m1947j29576J11662L60195J18243
$$ 3077230 2984389 3067521 2733642 2761090 2913848 2871901 2742325 2853987 3214182 3332425
16461C332425k14251J61780K38630M83145l6721k49739K92228j34839L29180j09109
$$ 3332425 3118174 3279954 3518584 4001729 3965008 3715269 4007497 3872658 4201838 4092729
16451D092729J33250K28490j97089N89481j00809O42065K60225k34000N89070
$$ 4092729 4225979 4454469 4257380 4846861 4746052 5388117 5648342 5414342 6003412
16442F003412K41261k71346K39426P0020k81185L87764k82559k74011L78808J08835
$$ 6003412 6244673 5973327 6212753 6282773 6001588 6389352 6106793 5832782 6211590 6320425
16432F320425M51126l25520r1574M14241P29792L19521O62244J142738J600450
$$ 6320425 6771551 6446031 6354457 6768698 7498490 7818011 8480255 9622993 11223443
16423A1223443K029036K016030K797329K492687K404432L036865K803097L094713
$$ 11223443 13252479 15268509 18065838 20558525 22962957 25999822 28802919 31897632
16415C1897632L203009L472049L129879L877553L926600L748148M550438M209615
$$ 31897632 35100641 38572690 41702569 45580122 49506722 53254870 57805308 62014923
16407F2014923N214957N000449N436284N644115N014059M429856M216736L404661
$$ 62014923 67229880 72230329 77666613 83310728 88324787 92754643 96971379 100376040
16399A00376040M239083L892152L950897J536642m71713j375696j76857N339646
$$ 100376040 104615123 108507275 112458172 113994814 113523101 112147405 111970548 117310194
16391A17310194J3086143K0651044K3662250J3554469q33119j2875340j8277014
$$ 117310194 130396337 151047381 174709631 188264100 187430981 174555641 156278627
16384A56278627k0798474k2483655k0222563j5761704j4949568k1759556H620995
$$ 156278627 135480153 112996498 92773935 77012231 62062663 40303107 8620995
16376c5639238m3816667k4352765N882776K5382495K8939736K0704194i197064
$$ -35639238 -79455905 -103808670 -97925894 -72543399 -43603663 -22899469 -9197064
16368a316941C376486K210749O99112N10362k89952j57297M26285J33517K72335
$$ -1316941 3376486 5587235 6286347 6796709 6506757 6349460 6775745 6909262 7181597
16359G181597J31676n52781p03992q90220j040608k92760o24328l26305Q5571
$$ 7181597 7313273 6760492 6056500 5166280 4125672 3832912 3208584 2882279 2967850
16350B967850k35915L9311q9040n5722R38996p42280O95032l97945O80372l53374
$$ 2967850 2731935 2771246 2682206 2626484 3565480 2823200 3518232 3120287 3800659 3447285
16340C447285K54910j96086m74577j51287l50157o88535k73377l68763j29674
$$ 3447285 3702195 3506109 3031532 2880245 2530088 1841553 1568176 1199413 1069739
16331A069739C76434N71614j56210k02210K28203C91950J84909j24833j20237
$$ 1069739 376434 948048 791838 589628 817831 391950 576859 452026 331789
16322C31789p9156J6308M12700m8618l11144M21596J41217j09901j7944N29989
$$ 331789 252633 268941 681641 633023 321879 743475 884692 774791 756847 1286836
16312A286836E88655L35360K7202J31660R9470m5997K53206n40316M56830j3156
$$ 1286836 588655 924015 951217 1082877 1182347 1136350 1389556 849240 1306070 1292914
16302A292914k59014K68462K20553l53948k30808M77319F10027J08080K40389
$$ 1292914 1033900 1302362 1522915 1168967 938159 1415478 610027 718107 958496
16293I58496r5012n2975J10691k91383K83108l39710M33836k9835J63094K18552
$$ 958496 863484 810509 921200 629817 912925 573215 1007051 977216 1140310 1358862
16283A358862m47598K54297P32765o76912L53760k3159k07031N29170M29057q12571
$$ 1358862 911264 1165561 1898326 1221414 1575174 1552015 1344984 1874154 2303211 1490640
16273A490640Q75440R2132k65580j1477M2722J15403J76817k68781J19248R2385
$$ 1490640 2366080 2458212 2192632 2181155 2223877 2339280 2516097 2247316 2366564 2458949
16263B458949n76713L14775m21849K14526j50146k3463L8248j31860k27206l4773
$$ 2458949 1882236 2197011 1775162 1989688 1839542 1816079 1854327 1722467 1495261 1460488
16253A460488m00161O79212l10961J55493n51378L15774K57954j66152N6062M27448
$$ 1460488 1060327 1739539 1428578 1584071 1032693 1348467 1606421 1440269 1496331 1923779
16243A923779j85518K0932R7636L52046j93840M23154l53247K56156J01731K66264
$$ 1923779 1738261 1759193 1856829 2208875 2015035 2438189 2084942 2341098 2442829 2709093
16233B709093n09819K66948k27909m5104k41191k83533j79077k2242K61301j59488
$$ 2709093 2199274 2466222 2238313 2193209 1952018 1668485 1489408 1467166 1728467 1568979
16223A568979J74063K80530n68244M68033P9743k87047j5234J76858k77530L21872
$$ 1568979 1743042 2023572 1455328 1923361 2003104 1716057 1700823 1877681 1600151 1922023
16213A922023o1847j75934L74409k6937l39106Q5779O96815p58527L10036L0747
$$ 1922023 1860176 1684242 2058651 2031714 1692608 1778387 2475202 1716675 2026711 2057458
16203B057458j26869q407o6841k05806J60027l6460j82958J92520k66382J86280
$$ 2057458 1930589 1922182 1855341 1649535 1809562 1773102 1590144 1782664 1516282 1702562
16193A702562Q2489L9966O3356o02639P9882K05850o8686L27999m51411j15999
$$ 1702562 1785051 1825017 1888373 1285734 1365616 1571466 1502780 1830779 1379368 1263369
16183A263369K52369K70867J38122J96047o23752M5853N08587n04302N5214N14142
$$ 1263369 1515738 1786605 1924727 2120774 1497022 1542875 2051462 1547160 1602374 2116516
16173B116516l32928K16365k23985j6087K50326j88958l7286M380j96507J74646
$$ 2116516 1783588 1999953 1775968 1759881 2010207 1821249 1783963 1788343 1591836 1766482
16163A766482J9556l5024j06782L25175n3723K68249n93091L26900k12847J40365
$$ 1766482 1786038 1751014 1644232 1969407 1915684 2183933 1590842 1917742 1704895 1845260
16153A845260k50910M85314n10908L02325M3457K32187m2705K13453j39156J55338
$$ 1845260 1594350 2079664 1568756 1871081 1914538 2146725 2104020 2317473 2178317 2333655
16143B333655j94402J55380q1591J26942J75077j30147k37034j61198K2198m06814
$$ 2333655 2139253 2294633 2213042 2339984 2515061 2384914 2147880 1986682 2008880 1602066
16133A602066N90750k50553J54803l26956O02625m52083q395M17323l04011k79225
$$ 1602066 2192816 1942263 2097066 1770110 2372735 1920652 1912257 2329580 2025569 1746344
16123A746344L93660m427m56971O06649l55517K26624m13375K23109j22608l72561
$$ 1746344 2140004 2135577 1678606 2285255 1929738 2156362 1742987 1966096 1843488 1470927
16113A470927Q32482r01299L35195j54326N34908o9587o7553n5324l17301L65353
$$ 1470927 2303409 1402110 1737305 1582979 2117887 2048300 1980747 1925423 1608122 1973475
16103A973475L04142j95921j82853O76167o49106L85952M3951K17094M4409o96540
$$ 1973475 2277617 2081696 1898843 2575010 1925904 2311856 2355807 2572901 2617310 1920770
16093A920770N44171J99888l54835J8786O438q7149j43083j1097N7438L71470
$$ 1920770 2464941 2664829 2309994 2328780 2335218 2248069 2104986 2093889 2151327 2522797
16083B522797j85686J75333o22606N68487k19402J59490j20096k38075j03588
$$ 2522797 2337111 2512444 1889838 2458325 2238923 2398413 2278317 2040242 1936654
16074A936654O06692K53389j7787j21008K15532m31739l2443J8548O47002l52144
$$ 1936654 2543346 2796735 2778948 2657940 2873472 2441733 2409290 2427838 3074840 2722696
16064B722696J9670k08944M96160o2111J04714j63976O02673o35855J17458Q79323
$$ 2722696 2742366 2533422 3029582 2967471 3072185 2908209 3510882 2875027 2992485 3871808
16054C871808m72654j60684k37677N9886K08147l33708L47867J45895O6185j41259
$$ 3871808 3399154 3238470 3000793 3060679 3268826 2935118 3282985 3428880 3495065 3353806
16044C353806Q9975l2594j9649L9614K92216O3037k23953N8717j28554q8746K81222
$$ 3353806 3443781 3411187 3391538 3431152 3723368 3786405 3562452 3621169 3492615 3403869 3685091
16033C685091J35521M50305j43652l98059J90943l46832L17326j38671n7517J7655
$$ 3685091 3820612 4270917 4127265 3729206 3920149 3573317 3890643 3751972 3694455 3712110
16023C712110L09184K35622j96887k36846K60750K57409J35021N34493o05083
$$ 3712110 4021294 4256916 4060029 3823183 4083933 4341342 4476363 5010856 4405773
16014D405773L05484k15461P5667K31368m67137R8890j68038K18164L46094k55704
$$ 4405773 4711257 4495796 4571463 4802831 4335694 4434584 4266546 4484710 4830804 4575100
16004D575100m6541K79137k90819L09130L097j41666r5563O1291L81205l52008
$$ 4575100 4528559 4807696 4516877 4826007 4829104 4687438 4591875 4653166 5034371 4682363
15994D682363M16873n7595l34774k51250L29163k06320R013m7540L03226j20111
$$ 4682363 5099236 5041641 4706867 4455617 4784780 4578460 4587473 4539933 4843159 4723048
15984D723048J65297j83569K03680M40949p42179K03765K2888l5273P9433R23893
$$ 4723048 4888345 4704776 4908456 5349405 4607226 4810991 4833879 4798606 4878039 5801932
15974E801932p56669m58681O46438j47260j78684l65712J90972l87878N58196
$$ 5801932 5045263 4586582 5233020 5085760 4907076 4541364 4732336 4344458 4902654
15965D902654L5881j19915J24004m37327p6202L9448N9526k31996M52831M73155
$$ 4902654 4938535 4818620 4942624 4505297 4429095 4468543 4528069 4296073 4748904 5222059
15955E222059m93955M7578l28583J45821J66647k09281J78038j11444K23948j36374
$$ 5222059 4728104 4775682 4447099 4592920 4759567 4550286 4728324 4616880 4840828 4704454
15945D704454J35480q4661k22884r8242O47237j93919j83042K36104m12331M87406
$$ 4704454 4839934 4755273 4532389 4434147 5081384 4887465 4704423 4940527 4528196 5015602
15935E015602k93115N50328r8387K53199q58899N93122J97421j08524J08158O52940
$$ 5015602 4722487 5272815 5174428 5427627 4568728 5161850 5359271 5250747 5358905 6011845
15925F011845q70288Q81741l87320J73104M5033R0453P32631k17804N46418k03693
$$ 6011845 5141557 6023298 5635978 5809082 5854115 5944568 6677199 6459395 7005813 6802120
15915F802120N83194L53705m38026J005127P40104K35442P52258R12404J571854
$$ 6802120 7385314 7739019 7300993 8306120 9046224 9281666 10033924 10946328 12518182
15906A2518182J085955K686460L910711N220637P253587J0294888J2478609J4137360
$$ 12518182 13604137 16290597 20201308 25421945 32675532 42970420 55449029 69586389
15898F9586389J3819745J2715501J0144906O066125L565499p6099l959223p543480
$$ 69586389 83406134 96121635 106266541 112332666 115898165 115822066 111862843 104319363
15890A04319363j0919841j3792136j3940535j3943477j1639913q707972p028731
$$ 104319363 93399522 79607386 65666851 51723374 40083461 31375489 24346758
15883B4346758m779023l324208k990010j489613j844261l97729j267116o69561
$$ 24346758 19567735 16243527 13253517 11763904 9919643 9521914 8254798 7585237
15875G585237j70931m64269o14043P2619n9139m63784r8796k91698n996O8832
$$ 7585237 7414306 6950037 6335994 6408613 6349474 5885690 5786894 5495196 5489200 5558032
15865E558032m47319O9129L74482o24908N14886j89854n65393j73887P01873o68845
$$ 5558032 5110713 5179842 5554324 4929416 5444302 5254448 4689055 4515168 5217041 4548196
15855D548196J13887M17133j85288o2391O4649l66400o6073Q6370j537j92877
$$ 4548196 4662083 5079216 4893928 4831537 4896186 4529786 4463713 4550083 4548546 4355669
15845D355669j69687K04931j82669k67540M69416k28069J08062J44053k6143L39008
$$ 4355669 4185982 4390913 4208244 3940704 4410120 4182051 4290113 4434166 4408023 4747031
15835D747031l17637N93133k04448k85258N71334K35094j25623J07441n55051
$$ 4747031 4429394 5022527 4818079 4532821 5104155 5339249 5213626 5321067 4766016
15826D766016K01302o66600N33421O7796k58101K63036J79411m07493o2690J16985
$$ 4766016 4967318 4300718 4834139 4901935 4643834 4906870 5086281 4678788 4616098 4733083
15816D733083n1841J05987p5747p4456O01365l6766o1752j31944Q0026J26969
$$ 4733083 4681242 4787229 4711482 4637026 5238391 5201625 5139873 5007929 5087955 5214924
15806E214924k85969J23596K29075K86273j90611L22799q8861J00391J822P80470
$$ 5214924 4928955 5052551 5281626 5567899 5377288 5700087 5611226 5711617 5713439 6493909
15796F493909J02611N10686R3167L04885J38137l4372P92116m29770N75697l75248
$$ 6493909 6596520 7107206 7200373 7505258 7643395 7609023 8401139 7971369 8547066 8171818
15786H171818o10284M45670L38574N30626j87528N66312K81428P81983l07368
$$ 8171818 7561534 8007204 8345778 8876404 8688876 9255188 9536616 10318599 10011231
15777A0011231R70702K8688o6364J82123J11933l18697m36749J69519l57685K23249
$$ 10011231 10981933 11010621 10944257 11126380 11238313 10919616 10482867 10652386 10294701 10517950
15767A0517950R4824K44108L80663K24828j29003K45585j29702j59937K28062
$$ 10517950 10612774 10856882 11237545 11462373 11333370 11578955 11449253 11289316 11517378
15758A1517378j47410K42608l79038k16383J42804k74121q4676m69643m83597
$$ 11517378 11369968 11612576 11233538 11017155 11159959 10885838 10801162 10331519 9847922
15749I847922O41613n18379k02294K54215P21336K65402L93744L26041M65413
$$ 9847922 10489535 9971156 9768862 10023077 10744413 11009815 11403559 11729600 12195013
15740A2195013M47062R73097L4637J86349J041183j07625k746p55990M98820J08311
$$ 12195013 12642075 13615172 13649809 13836158 14877341 14769716 14766970 14010980 14509800 14618111
15730A4618111K89363O81335K44227K02897k54014L91665k84553p0917j17887
$$ 14618111 14907474 15588809 15833036 16035933 15781919 16173584 15889031 15818114 15700227
15721A5700227o04221k44049n40321K6568m06999k83696j65030J62042K57058
$$ 15700227 15096006 14851957 14311636 14338204 13931205 13647509 13482479 13644521 13901579
15712A3901579p88559O8721j76431m17775L27833j055777K10198L00038N7030
$$ 13901579 13113020 13181741 13005310 12587535 12915368 11859591 12069789 12369827 12426857
15703A2426857Q72016J64797M27114M65190J111496k43211J132079n66535K93297
$$ 12426857 13298873 13463670 13890784 14355974 15467470 15224259 16356338 15789803 16083100
15694A6083100q26322J9306l29653M09520J83441l12522j90695K94063k06361
$$ 16083100 15256778 15276084 14946431 15355951 15539392 15226870 15036175 15330238 15123877
15685A5123877M5347K18111l56559k39641l28313L54808n78465Q2086k16841k55456
$$ 15123877 15169224 15387335 15030776 14791135 14462822 14817630 14239165 14321251 14104410 13848954
15675A3848954o01426P0999q17963L43925m88778K42367l79431M8866m57903J043943
$$ 13848954 13247528 13318527 12500564 12844489 12355711 12598078 12218647 12267513 11809610 12853553
15665A2853553M8182O61907J034899Q74043M31727R86410L12956J295564J334475
$$ 12853553 12901735 13563642 14598541 15472584 15904311 16890721 17203677 18499241 19833716
15656A9833716O39524J677269J114766J468267J496351J458313J538915J214902
$$ 19833716 20473240 22150509 23265275 24733542 26229893 27688206 29227121 30442023
15648C0442023J783111J429308R85222J456801R18696J414304J165901J418271
$$ 30442023 32225134 33654442 34639664 36096465 37015161 38429465 39595366 41013637
15640D1013637J574207J820050J362423K016308J213833J253042R40462j25019
$$ 41013637 42587844 44407894 45770317 47786625 49000458 50253500 51193962 51068943
15632E1068943J83904o84153K38565j168113m20293m09940J96248o47074k11581
$$ 51068943 51252847 50568694 50807259 49639146 49218853 48808913 49005161 48358087 48146506
15623D8146506q31319o51163m24866j509235j442532k003987k568308j867396
$$ 48146506 47315187 46664024 46239158 44729923 43287391 41283404 38715096 36847700
15615C6847700k359906j535984k085328q62231j899399q36252j460813l68314
$$ 36847700 34487794 32951810 30866482 30004251 28104852 27268600 25807787 25439473
15607B5439473r21400p67924o74600q57639o49208k87229m55700p08270o89380
$$ 25439473 24518073 23750149 23075549 22217910 21568702 21281473 20825773 20117503 19428123
15598A9428123p7776N5047k3351k33994K97319N43285P84619K776010M947847
$$ 19428123 19350347 19405394 19382043 19148049 19445368 19988653 20773272 23549282 28497129
15589B8497129J1300040J8356640J6523676J0533447O594367M885403K617250
$$ 28497129 39797169 58153809 74677485 85210932 91805299 96690702 99307952
15582I9307952L91969j243766n223795j1387689j5041889j6878836j3434096q693879
$$ 99307952 99699921 98456155 93232360 81844671 66802782 49923946 36489850 27795971
15574B7795971n115563l191863j255771j369237n38112k186o78755L11950r0756
$$ 27795971 22680408 19488545 18232774 16863537 16325425 16323239 15644484 15956434 15865678
15565A5865678R7942L41008L24075m5888p0010R11636J47406M48660K172069L372816
$$ 15865678 15963620 16304628 16628703 16582815 16512805 17424441 17571847 18020507 20192576 23565392
15555B3565392Q399200J7415356K4669199J9719796J3069764P998822N492319
$$ 23565392 31964592 49379948 74049147 93768943 106838707 114837529 120329848
15548A20329848K951555Q20k242528r475824j6536098k0599600k1104071j7063200
$$ 120329848 123281403 123282223 121039695 111563871 95027773 74428173 53324102 36260902
15540C6260902r196179o130098l069618k078226j895564q54907l9019n05459j57120
$$ 36260902 27064723 20934625 17865007 15786781 13891217 13036310 12997291 12491832 12334712
15531A2334712k47710j08709l72309L21830o94338j02317j0464j09827m69717
$$ 12334712 12087002 11978293 11605984 11927814 11233476 11131159 11120695 11010868 10541151
15522A0541151P79997j044116l86852k5812K1368Q29529o97177J27902j51055
$$ 10541151 11321148 10277032 9890180 9864368 9885736 10715265 10018088 10145990 9994935
15513I994935M72457j35405L60227L90115l08044L36198L249J65907k04895O27535
$$ 9994935 10467392 10331987 10692214 11082329 10774285 11110483 11113732 11279639 11074744 11702279
15503A1702279J26417k53459j92605k81686k34906j82939L4875l41637j55123
$$ 11702279 11828696 11575237 11382632 11100946 10866040 10683101 10717976 10376339 10221216
15494A0221216K21256K63226j94972L35641L54649j19901k85312N21388k13433
$$ 10221216 10442472 10705698 10510726 10846367 11201016 11081115 10795803 11317191 11103758
15485A1103758L75044K79841O04624J84544j10972o4861L93316j7740K35418J28034
$$ 11103758 11478802 11758643 12363267 12547811 12436839 12371978 12765294 12747554 12982972 13111006
15475A3111006q68934R86255M20998K20221O69669P83292R20202J504259M84817
$$ 13111006 12242072 13228327 13649325 13869546 14539215 15322507 16242709 17746968 18231785
15466A8231785J463201K01195N79759L19857l42575K7709n05134p83671o88618
$$ 18231785 19694986 19896181 20475940 20795797 20453222 20480931 19975797 19192126 18503508
15457A8503508L22318J56444Q95150P0814R84604P83268P21798J79663O92194
$$ 18503508 18825826 18982270 19877420 19948234 20932838 21716106 22437904 22617567 23309761
15448B3309761J98114Q6771k72936m65097n92471k29793l08357Q91706m03855
$$ 23309761 23507875 23594646 23321710 22856613 22264142 22034349 21725992 22617698 22213843
15439B2213843J27091K59508J82723K84407J61506L54246l81136l71911p78771
$$ 22213843 22340934 22600442 22783165 23067572 23229078 23583324 23202188 22830277 22051506
15430B2051506p01017r39827m81390o48805j04230q88200m43130o26214q82762
$$ 22051506 21350489 20410662 19929272 19280467 19176237 18288037 17844907 17218693 16335931
15421A6335931j03468q78365k0278o76279m83454n39469p13365J33190o04971
$$ 16335931 16232463 15354098 15333820 14657541 14174087 13634618 12921253 13054443 12449472
15412A2449472j24668J7684M36958o36475k53946Q71505l1484m19905K01627j66358
$$ 12449472 12324804 12342488 12779446 12142971 11889025 12760530 12729046 12309141 12510768 12344410
15402A2344410M82666j65770M91257M0911N55925L71680M51896n0674j45581k80559
$$ 12344410 12827076 12661306 13152563 13193474 13749399 14121079 14572975 14522301 14376720 14096161
15392A4096161P01578m61114l9536k87498j94942k44936k28049J1938o368N40753
$$ 14096161 14797739 14336625 14297089 14009591 13814649 13569713 13341664 13353602 13347234 13887987
15382A3887987m44284o0776K89807J11881j15995k61295j53702k59865K67176
$$ 13887987 13443703 13382927 13672734 13784615 13668620 13407325 13253623 12993758 13260934
15373A3260934l03926M85105o6221O6452k95428m0380L72931L28358k5811N44008
$$ 13260934 12957008 13442113 13375892 13442344 13146916 13106536 13479467 13807825 13782014 14326022
15363A4326022j66825O50775M21015l48493L43115J09573L17866k20394J50373
$$ 14326022 14159197 14809972 15230987 14882494 15225609 15335182 15653048 15432654 15583027
15354A5583027K62309M04386J06347J079945M74162J604632K593333N706717R217241
$$ 15583027 15845336 16249722 16356069 17436014 17910176 19514808 22108141 27814858 37032099
15345C7032099R926721Q342692N550826L453044K942830Q96761M36147j557641
$$ 37032099 46958820 55301512 60852338 64305382 67248212 68144973 68581120 67023479
15337F7023479m350690o429618p550075p363207n399779l474165j517353j173547
$$ 67023479 62672789 56243171 48693096 41329889 35930110 32455945 30938592 29765045
15329B9765045j016524n01259n82423p72572j307522l71831m17794J49850k31751
$$ 29765045 28748521 28247262 27664839 26892267 25584745 25212914 24795120 24944970 24713219
15320B4713219M39351l40666M48624R79466K137765K974979O657891J1593043
$$ 24713219 25152570 24811904 25260528 26239994 28377759 31352738 38010629 49603672
15312D9603672J5864532J6599442J3041812R447777N633413L191669R70890j988116
$$ 49603672 65468204 82067646 95109458 104557235 110190648 113382317 114353207 112365091
15304A12365091o584912j0861807j5124992j6785968j4838879j0225382p227247
$$ 112365091 105780179 94918372 79793380 63007412 48168533 37943151 30715904
15297C0715904l400746j915462j731146j82078o59236j89470K5374k73053N34545
$$ 30715904 27315158 25399696 23668550 23486472 22827236 22637766 22663140 22390087 22924632
15288B2924632m49644N6349N74438l88626M33389O3150P74241M03454K679357
$$ 22924632 22474988 22531337 23105775 22717149 23150538 23213688 23987929 24391383 27070740
15279B7070740N031817Q021151R147150O653433M429566J971305K342896M20058
$$ 27070740 32102557 40123708 49270858 55924291 60353857 62325162 64668058 65088116
15271F5088116o78320j666290o209512o656630q536842p645268m795119l095869
$$ 65088116 64409796 62743506 56533994 49877364 41340522 33695254 28900135 25804266
15263B5804266j827984r88122j643176j93697m30318q96859m93031O90677n19890
$$ 25804266 23976282 22988160 21344984 21151287 20720969 19824110 19331079 20021756 19501866
15254A9501866J61466j65137J98112L76865M14068K84976Q91964L01029L1051
$$ 19501866 19663332 19498195 19696307 20073172 20487240 20772216 21664180 21965209 21996260
15245B1996260p26760M71110m3496k89384o0945J87198l41800J1573N44824L91058
$$ 21996260 21269500 21740610 21697114 21407730 21346785 21533983 21192183 21203756 21748580 22139638
15235B2139638Q80050J290571J108988R81822Q88475j54971K40503n33010R9187
$$ 22139638 23019688 24310259 25419247 26401069 27289544 27134573 27375076 26842066 26941253
15226B6941253j004332p49810q22880q95772j127102p14123Q7664j43033O00785
$$ 26941253 25936921 25187111 24364231 23468459 22341357 21627234 21714898 21571865 22172650
15217B2172650j4715L91015M78791K93462M31160N8895J318r59604L00781o33535
$$ 22172650 22157935 22548950 23027741 23321203 23752363 23811258 23812576 22852972 23153753 22520218
15207B2520218j249522j058567j025940j411814j289696n34722j275470o53983
$$ 22520218 21270696 20212129 19186189 17774375 16484679 15949957 14674487 14020504
15199A4020504n8300k53591o16131J50523l42870M20237N53j16246Q10385r7613
$$ 14020504 13962204 13708613 13092482 13243005 12900135 13320372 13320925 13204679 14015064 13917451
15189A3917451O56435M35856N66543o9162L78851M7035K08392J54868K81259m50587
$$ 13917451 14573886 15009742 15576285 15507123 15885974 15933009 16141401 16296269 16577528 16126941
15179A6126941N67153K28501M83606K39398K49351j30362P20147J39145J80675
$$ 16126941 16694094 16922595 17406201 17645599 17894950 17764588 18484735 18623880 18804555
15170A8804555l98959j91904k83590k91269j39675l79863M29136j15936K93407
$$ 18804555 18405596 18213692 17930102 17638833 17499158 17119295 17548431 17432495 17725902
15161A7725902l69611K16470M29370q4258M22329n17408K16005O99805l10414
$$ 17725902 17356291 17572761 18002131 17917873 18340202 17822794 18038799 18738604 18428190
15152A8428190j54623J9077m3992J60960j99001o64625L9736j02671L77732p5027
$$ 18428190 18273567 18292644 18248652 18409612 18210611 17545986 17585722 17483051 17860783 17785756
15142A7785756J36298Q41036k46481M53264K01614j49498M58365l46910K86098
$$ 17785756 17922054 18763090 18516609 18969873 19171487 19021989 19480354 19133444 19419542
15133A9419542P22717r22805L69712l041m74656J66551l17402j09462J45559k6375
$$ 19419542 20142259 19219454 19589166 19586125 19111469 19278020 18960618 18851156 18996715 18970340
15123A8970340l87667k96833m00822k76884J87426o48788l17934O5197k31057
$$ 18970340 18582673 18285840 17885018 17608134 17795560 17146772 16828838 16894035 16662978
15114A6662978m02030J61748q5693J6276q78284L59509k17010K81343J68467m5393
$$ 16662978 16260948 16422696 16337003 16353279 15474995 15834504 15617494 15898837 16067304 16021911
15104A6021911J19664m4031R05572p4278O40501L22680N78222M2442J211003N81633
$$ 16021911 16141575 16097544 17003116 16928838 17569339 17892019 18470241 18512683 19723686 20305319
15094B0305319J129543L52310J857343O28297K455741L077669M658712L823669
$$ 20305319 21434862 21787172 23644515 24272812 26728553 29806222 34464934 38288603
15086C8288603L314142J724027J333575M01420Q17199p91651n50114j652466k345977
$$ 38288603 41602745 43326772 44660347 45061767 45878966 45087315 44537201 42884735 40538758
15077D0538758k013396p43759J395601K815749L229198L340175K285084J188107
$$ 40538758 38525362 37781603 39177204 41992953 45222151 48562326 50847410 52035517
15069E2035517J529041R8316O12600o98820p04768j50795J733884L310309M057347
$$ 52035517 53564558 53662874 54275474 53576654 52871886 52721091 54454975 57765284 61822631
15060F1822631K555911K853449L021442L355517L298476L580474K275046J37175
$$ 61822631 64378542 67231991 70253433 73608950 76907426 80487900 82762946 82900121
15052H2900121j530236j477502J30593K806774L728728L772075J573798Q11778
$$ 82900121 81369885 79892383 80022976 82829750 86558478 90330553 91904351 92716129
15044I2716129l03081q18744J231080J153281m25666k214855l554040m609701
$$ 92716129 92413048 91594304 92825384 93978665 93552999 91338144 87784104 83174403
15036H3174403l939801l491167l317763l585264l572958l187457j995814J76370
$$ 83174403 79234602 75743435 72425672 68840408 65267450 62079993 60084179 60260549
15028F0260549K570333P37858L90371K52267l00232O70904n9697K67604k053947
$$ 60260549 62830882 63568740 63959111 64211378 63911146 64582050 64522353 64789957 62736010
15019F2736010j170736r24232J36798M019654O463302P212563N461388N944378
$$ 62736010 61565274 60641042 60777840 64797494 71260796 78473359 83934747 89879125
15011H9879125N411648M878983L796086K864156J455289p03229m45115j232952
$$ 89879125 95290773 100169756 103965842 106829998 108285287 107582058 107136943 105903991
15003A05903991r11147J462110J501604L711631N364577P061266R631616R536014
$$ 105903991 104992844 106454954 107956558 111668189 117032766 124094032 133725648 143261662
14995A43261662Q897679P695311N863491M419527J505110j45309k199010l428211
$$ 143261662 152159341 159854652 165718143 170137670 171642780 171497471 169298461 165870250
14987A65870250l383878k425407j028700K89304L828135O953029R818415J2565069
$$ 165870250 162486372 160060965 159032265 159321569 163149704 170102733 179921148 192486217
14979A92486217J3491601J3359235J2896575J0790686Q499775O045475L707536
$$ 192486217 205977818 219337053 232233628 243024314 251524089 257569564 261277100
14972B61277100p65826m717172p874627j1118095j3930279j6508938j7126784
$$ 261277100 260511274 255794102 247919475 236801380 222871101 206362163 189235379
14965A89235379j6460078j5901026j4343098j2339004j0220425q036458n976029
$$ 189235379 172775301 156874275 142531177 130192173 119971748 111935290 105959261
14958A05959261l182898r99795L005136N501228J0595792J6307534K3424374K7761108
$$ 105959261 102776363 101776568 104781704 110282932 120878724 137186258 160610632 188371740
14950A88371740L1935075L7317608M0236590L9772509L9215020L9723803L4094743
$$ 188371740 220306815 257624423 297861013 337633522 376848542 416572345 450667088
14943D50667088K1216332N345831o131806j5280167k0628883k2856942k6804666
$$ 450667088 471883420 477229251 471097445 455817278 435188395 412331453 385526787
14936C85526787l1562288l3959611l3976111k9716956k1435203j4772130j2101870
$$ 385526787 353964499 320004888 286028777 256311821 234876618 220104488 208002618
14929B08002618j1866481j3679318j4385180j4393603j2846397q419050n280081
$$ 208002618 196136137 182456819 168071639 153678036 140831639 132412589 127132508
14922A27132508l536538l885101n171876n964783n785127n320911n697023n946879
$$ 127132508 123595970 119710869 114538993 108574210 102789083 97468172 91771149 85824270
14914H5824270p581333r044725j0249422j0026386p589333m787082l436806k338387
$$ 85824270 78242937 69198212 58948790 48922404 41333071 36545989 33109183 30770796
14906C0770796j075780n03575N6750O08927Q26211N98129J519385J626672K123229
$$ 30770796 29695016 29191441 29248191 29857118 30683329 31281458 32800843 34427515 36550744
14897C6550744L018417N285093O502572P679330N704718L987647K350348J256136
$$ 36550744 39569161 44854254 51356826 59036156 64740874 68728521 71078869 72335005
14889G2335005M90570k88617j841251m891478o219755p075818o151985m365489
$$ 72335005 72825575 72536958 70695707 65804229 59584474 52508656 46356671 41991182
14881D1991182k204254j834200j465666o70727m30475J20996O85967J177285J568043
$$ 41991182 39786928 37952728 36487062 35816335 35385860 35506856 36192823 37370108 38938151
14872C8938151L52572J21591O41534M26539J127704J420769J77238P43009j06761
$$ 38938151 39290723 39412314 40053848 40480387 41608091 43028860 43206098 43949107 43842346
14863D3842346O4403J325436K389897N023517P404748J0291053J1041220J1896943
$$ 43842346 43906749 45232185 47622082 52645599 60050347 70341400 81382620 93279563
14855I3279563J2071426J1245962Q293446L569226J131007k754027n681813r492345
$$ 93279563 105350989 116596951 124890397 128459623 129590630 126836603 121154790 111662445
14847A11662445j1671000j1913517j2926578j1627363q749143p039139m270959
$$ 111662445 99991445 88077928 75151350 63523987 54774844 47735705 43464746
14840D3464746k848285j302331j345058j256772j168533j163918n31259q30506
$$ 43464746 40616461 39314130 37969072 36712300 35543767 34379849 33848590 33018084
14832C3018084k88875j79045q61352K35481l01747K63663R45833J053814P53343
$$ 33018084 32729209 32550164 31688812 31924293 31622546 31886209 32832042 33885856 34639199
14823C4639199J723855K062030M216429P475408R496738J0097738R530268N247598
$$ 34639199 36363054 38425084 42641513 50116921 59613659 69711397 79241665 84489263
14815H4489263L463877K099914m37875j753430m051092p204416r825660j1729647
$$ 84489263 87953140 90053054 89615179 87861749 83810657 76606241 66780581 55050934
14807E5050934j0728837p899185m962803k894197k174526o94479j428646k86542
$$ 55050934 44322097 36422912 31460109 28565912 26391386 25696907 24268261 23981719
14799B3981719n43106M63652l45030J71281J10557o07593q94998j12629K43559
$$ 23981719 23438613 23902265 23557235 23728516 23839073 23231480 22336482 22223853 22467412
14790B2467412o57152q31079J09912j10123k67309J87009k51589L02187J23618
$$ 22467412 21810260 20979181 21089093 20978970 20711661 20898670 20647081 20949268 21072886
14781B1072886m0862N46477R54481J466355J122166Q68721J05322j06316J273600
$$ 21072886 21032024 21578501 22532982 23999337 25121503 25990224 26095546 25989230 27262830
14772B7262830p79974p3691o65439r35931j754580j219211j381949o94365j04280
$$ 27262830 26482856 26409165 25743726 24807795 23053215 21834004 20452055 19757690 19653410
14763A9653410m52784j99137L03245k46214M53333O7705K35391M01698l1465j93760
$$ 19653410 19200626 19001489 19304734 19058520 19511853 19579558 19814949 20216647 20185182 19991422
14753A9991422J499259J31032Q31582O99564Q9949P33101L35301K41635m39122
$$ 19991422 21490681 21621713 22453295 23152859 23242808 23975909 24311210 24552845 24113723
14744B4113723N27407j90278k13172N14569j97691M42238R10505K174535J681956
$$ 24113723 24641130 24450852 24237680 24752249 24554558 24996796 25907301 28081836 29763792
14735B9763792L191877L554039N415679Q044100J1656639J9832372L0113407L8165825
$$ 29763792 32955669 36509708 41925387 49969487 61626126 81458498 111571905 149737730
14727A49737730M2435421M2513299L8622169K9181116J9123837R034471L7283
$$ 149737730 192173151 234686450 273308619 302489735 321613572 330648043 330685326
14720C30685326j2162854k3840150l4356292m2074885m3420912m0426865l3750876
$$ 330685326 318522472 294682322 260326030 218251145 174830233 134403368 100652492
14713A00652492k4149293j6585496j0778492p757815n106553m001509k932698
$$ 100652492 76503199 59917703 49139211 41381396 36274843 32273334 29340636
14706B9340636j972166k169547l46249j247521j014209j827628j156203q52039
$$ 29340636 27368470 25198923 24852674 23605153 22590944 20763316 19607113 18755074
14698A8755074q87704m52312j9215j83030n26613Q02543Q5947o22512K54911M17575
$$ 18755074 17867370 17415058 17395843 17212813 16686200 17488743 17574690 16952178 17207089 17624664
14688A7624664K31492r4448L8901K69562N70245k24738k81244L64173R42850K34558
$$ 17624664 17856156 17761708 17800609 18070171 18640416 18415678 18134434 18498607 19441457 19676015
14678A9676015J017531P64847J448585J319916J839176K41210j02285j186484
$$ 19676015 20693546 21458393 22906978 24226894 26066070 26307280 26204995 25018511
14670B5018511J34164n44772j528381j200303j028719j209723j071182L62943
$$ 25018511 25152675 24607903 23079522 21879219 20850500 19640777 18569595 18932538
14662A8932538m95494K31013l01365J4952j10281j88480q51681j021984r25640
$$ 18932538 18437044 18668057 18366692 18381644 18271363 18082883 17231202 16209218 15283578
14653A5283578j359380p36554o03864P7170N67330M40623J015824K73002J424102
$$ 15283578 13924198 13187644 12583780 12660950 13228280 13668903 14684727 14957729 16381831
14644A6381831L40341N63972O10202J203187K36620J472839Q43885J048674J278299
$$ 16381831 16722172 17286144 17896346 19099533 19336153 20808992 21652877 22701551 23979850
14635B3979850Q76795J573794J6309K12018o33181n89852j210579k453527j920803
$$ 23979850 24856645 26430439 26446748 26658766 26025585 25435733 24225154 21771627 19850824
14626A9850824k604248k195294k017690j735813j304272n44089l84395j09549
$$ 19850824 17246576 15051282 13033592 11297779 9993507 9449418 9065023 8955474
14618H955474K18790J28531L90966o83080n09856O27255j26506k85287K4058J00301
$$ 8955474 9174264 9302795 9693761 9010681 8500825 9128080 9001574 8716287 8740345 8840646
14608H840646m33131L92752q79506K24147l4181k95894P00999P92355J207570
$$ 8840646 8407515 8800267 7920761 8144908 8110727 7814833 8515832 9308187 10515757
14599A0515757K417020K480430J795473J140711J205623L30945M38690n61355
$$ 10515757 12932777 15413207 17208680 18349391 19555014 19885959 20324649 19763294
14591A9763294n52509j633799j676883k532875j707556j430283j149271m59590
$$ 19763294 19210785 17576986 15900103 13367228 11659672 10229389 9080118 8620528
14583H620528l37732N16018L10383r93119P29156j33118l54066O10189N38247
$$ 8620528 8282796 8798814 9109197 8116078 8845234 8712116 8358050 8968239 9506486
14574I506486k23793M20242L99521K62142Q58894N36832N27929L27695K099507
$$ 9506486 9282693 9702935 10102456 10364598 11223492 11760324 12288253 12615948 14715455
14565A4715455J485145J009247J416609J189662J473933L141927O417823R289741
$$ 14715455 16200600 17209847 18626456 19816118 21290051 24431978 30849801 40139542
14557D0139542J0921497P241611M465081K996356J913146N55434r27628j708977
$$ 40139542 51061039 58302650 62767731 65764087 67677233 68232667 67305039 65596062
14549F5596062o311594p399170r292153q320749m429028Q51429O067490J0440730
$$ 65596062 59284468 51885298 42593145 34272396 29843368 30694797 36762287 47203017
14541D7203017J0406535P152977N687305L683380J128408K02748j920642m309106
$$ 47203017 57609552 64762529 70449834 74133214 75261622 75464370 73543728 69234622
14533F9234622p416254r838040j0797396q026512n481033l152409k130219j16106
$$ 69234622 61818368 51980328 41182932 33156420 27675387 24522978 22392759 22276653
14525B2276653n73255M8293p07247p0503R78016J212717M891630P298411P675711
$$ 22276653 21703398 21751691 21044444 20973941 21951957 23164674 28056304 35354715 43030426
14516D3030426M846245L919577L089990K061768J169307R89827j189706k258129
$$ 43030426 47876671 51796248 54886238 56948006 58117313 59107140 57917434 55659305
14508E5659305o249866n515984m536643j067936J178223M867855O891642M579431
$$ 55659305 49409439 43893455 39356812 38288876 39467099 44334954 51226596 55806027
14500E5806027L461143J215877J452722J189202r11229j395968l913407m902102
$$ 55806027 59267170 60483047 61935769 63124971 62213742 60817774 56904367 52002265
14492E2002265o715887p240373n536944m546545l180684l514856k078607j942812
$$ 52002265 45286378 38046005 32509061 27962516 24781832 21266976 19188369 17245557
14484A7245557j942862k198944j602760j654183j220535l04153l78602j67884
$$ 17245557 15302695 13103751 11500991 9846808 8626273 8322120 7943518 7775634
14476G775634k22033J57616K86974m0441P01815L08418K036436J071171J149348
$$ 7775634 7553601 7711217 7998191 7957750 8659565 8967983 11004419 12075590 13224938
14467A3224938N17602O04132M14896l53137L38118J23845o28625N45007j84261
$$ 13224938 13742540 14346672 14761568 14408431 14746549 14870394 14241769 14786776 14602515
14458A4602515M69481J598716Q42443R19555M84908K82088M74483p80518j122430
$$ 14602515 15071996 16670712 17513155 18432710 18917618 19199706 19674189 18893671 17771241
14449A7771241j110941j816472j574159j648455k22409q35511N5795M77869K43291
$$ 17771241 16660300 14843828 13269669 11621214 11398805 10563294 10619089 11096958 11340249
14440A1340249K67145L45897O02057O43166M87695k29266P89627L40773J178664
$$ 11340249 11607394 11953291 12555348 13198514 13686209 13456943 14246570 14587343 15766007
14431A5766007O60731K398259K833113M791766P069849P648835P169287O112006
$$ 15766007 16426738 18824997 21658110 26449876 33519725 41168560 48337847 54449853
14423E4449853L598604K551807J993600M58467j146969l563449n688762o671731
$$ 54449853 58048457 60600264 62593864 63052331 61905362 58341913 52653151 45981420
14415D5981420p211606o303948m588390l546473k727960j758743j952085j813218
$$ 45981420 38769814 32465866 27877476 24331003 21603043 19844300 17892215 16078997
14407A6078997j164420j555385j74923l11116q14816m37728M01727j96535M97425
$$ 16078997 14914577 13359192 13184269 12873153 12058337 11620609 12022336 11825801 12323226
14398A2323226L50154R76048M50329J489351K233143L583260O102506R859475
$$ 12323226 12673380 13649428 14099757 15589108 17822251 21405511 27508017 37367492
14390C7367492J1833700J3533328J1716499R421755O511471M687659J889588p18679
$$ 37367492 49201192 62734520 74451019 83872774 90384245 95071904 96961492 96242813
14382I6242813m799651p558323j0629467j2511462j2176324j0195090q211425
$$ 96242813 91443162 83884839 73255372 60743910 48567586 38372496 30161071
14375C0161071n276106l923610k502934k425043j245810l69279q7415q21176l32786
$$ 30161071 24884965 20961355 18458421 16033378 14787568 14418289 14330874 13509698 13176912
14366A3176912l56708O43074o74887l80154K8828K06052K12411K49137J051979
$$ 13176912 12820204 13463278 12788391 12408237 12437065 12643117 12855528 13104665 14156644
14357A4156644J217643J142467L510920L381961N587282N161295M946805K877554
$$ 14156644 15374287 16516754 20027674 23409635 28996917 34158212 39105017 41982571
14349D1982571K280657J895488m32116m50451k491947l501706m777633m737334
$$ 41982571 44263228 46158716 45726600 45276149 42784202 39282496 34504863 29767529
14341B9767529n010060m351835k663312j900785O32248K642764O144763O015114
$$ 29767529 24757469 20405634 17742322 15841537 16473785 19116549 25261312 31276426
14333C1276426L939958J843912J971542R27260l34324M2614j282861l875452n296667
$$ 31276426 35216384 37060296 39031838 39959098 39624774 39667388 38384527 34509075 29212408
14324B9212408n719160n187326l335382j362888l88027o76031l85549K94238K68620
$$ 29212408 23493248 18305922 14970540 13607652 13219625 12543594 12158045 12452283 12720903
14315A2720903L26805Q69102O93096O51869Q55844J242421R67484R41301J268569
$$ 12720903 13047708 13916810 14609906 15261775 16117619 17360040 18327524 19268825 20537394
14306B0537394J280479J824104J700074K160411K869143L199542M175753N489579
$$ 20537394 21817873 23641977 25342051 27502462 30371605 33571147 37746900 43236479
14298D3236479O377913Q357337J0300222J4191309J8931955K3650392K9901104
$$ 43236479 49614392 57971729 68271951 82463260 101395215 125045607 154946711
14291A54946711L4043577L3084700K8467716K1302490J4597907O246407p47515
$$ 154946711 188990288 222074988 250542704 271845194 286443101 292689508 291941993
14284B91941993q032343j6063383k3809571l1885233l5131132l3155639k7852861
$$ 291941993 283909650 267846267 244036696 212151463 177020331 143864692 116011831
14277A16011831k1814660j7551242j2863849j0627048p943214o502548n136280
$$ 116011831 94197171 76645929 63782080 53155032 45211818 38709270 33572990
14270C3572990l844360l741341k748965j961742k620897j549412j752623j324082
$$ 33572990 29728630 25987289 23238324 21276582 18655685 17106273 15353650 14029568
14262A4029568q91806n18203q22227o66951m84634m94976j50452q61778J1529
$$ 14029568 13137762 12619559 11797332 11130381 10645747 10150771 10000319 9138541 9150070
14253I150070p29378l17699J06352l69124O5500m01014j35396k46456l05410n55015
$$ 9150070 8420692 8102993 8209345 7840221 7905721 7504707 7369311 7122855 6817445 6262430
14243F262430J9366J96182m75405l3135M5100k0665l63226k02452m01919l5107
$$ 6262430 6281796 6477978 6002573 5969438 6014538 5993873 5630647 5428195 5026276 4991169
14233D991169J26304L9881J66647k96814l15316l1798l57231K73812r2164K94914
$$ 4991169 5117473 5157354 5324001 5027187 4711871 4680073 4322842 4596654 4504490 4799404
14223D799404r74183Q74198l9702J74233L61136J3415m42130O87894j66196J56457
$$ 4799404 3825221 4699419 4659717 4833950 5195086 5208501 4766371 5454265 5288069 5444526
14213E444526m8249O04959n70052J01628k44328O44570J097702O44106J79899
$$ 5444526 5396277 6001236 5431184 5532812 5288484 5933054 7030756 7674862 7854761
14204G854761O14865r6716K10643o09208Q8201K5310r74693j073279j037049n79038
$$ 7854761 8469626 8372910 8583553 7974345 8062546 8087856 7113163 6039884 5002835 4423797
14194D423797J13495m9600l68980N57376m48133L45954N0957M30961l09187m71755
$$ 4423797 4537292 4487692 4118712 4676088 4227955 4573909 4624866 5055827 4746640 4274885
14184D274885J47119M76455k98118j29522J55828k18193k52132j8832N59524l91297
$$ 4274885 4422004 4898459 4600341 4470819 4626647 4408454 4156322 4137490 4697014 4305717
14174D305717k0272J14369L27911P46846k64105l74073k7286l10521k49474K2661
$$ 4305717 4285445 4399814 4727725 5474571 5210466 4836393 4809107 4498586 4249112 4271773
14164D271773l5275L99829m96674O3027L87337l66564J0574M7673M80137k16721
$$ 4271773 4236498 4636327 4139653 4202680 4590017 4223453 4234027 4281700 4761837 4545116
14154D545116J69135k36828K18510o40454L51608M07471k26897r7978k6048L07869
$$ 4545116 4714251 4477423 4695933 4055479 4407087 4814558 4587661 4489683 4463635 4771504
14144D771504Q6350N99511m39142J183552J327786J840314K441658K235019J833159
$$ 4771504 4857854 5457365 5018223 6201775 7529561 9369875 11811533 14046552 15879711
14135A5879711Q02926J027314J057894l819m19000j313573j672533k222678k399093
$$ 15879711 16682637 17709951 18767845 18764026 18345026 17031453 15358920 13136242 10737149
14126A0737149j787921j294312j018242n58436l09165M30739M68268Q61162N69326
$$ 10737149 8949228 7654916 6636674 6078238 5769073 6199812 6668080 7529242 8098568
14117H098568k68284M00920K70419m16155M96822m43737m27572j086786n05785
$$ 8098568 7830284 8231204 8501623 8085468 8582290 8138553 7710981 6624195 6118410
14108F118410m58091k72350j69420l61941R1879N11489p7891P680K38861Q4302
$$ 6118410 5660319 5387969 5218549 4856608 4948487 5459976 5382085 5389765 5628626 5712928
14098E712928J181109J022891J130858k13798J005957j33650M81757J68237k19291
$$ 5712928 6894037 7916928 9047786 8833988 9839945 9706295 10188052 10356289 10136998
14089A0136998m58345n59868o78076k56085j62471R30787P36888J360404L61295
$$ 10136998 9678653 9118785 8440709 8184624 8022153 8952940 9689828 11050232 11411527
14080A1411527j94869M40719J26418K2223j69378j110565p36036q01408j506693
$$ 11411527 11216658 11657377 11783795 11806018 11636640 10526075 9790039 8988631 7481938
14071G481938l14817q65897m4558M35933n72746l2532j47478J27104P47430j98970
$$ 7481938 7167121 6301224 6256666 6692599 6119853 6087321 5939843 6066947 6814377 6615407
14061F615407K44091J208757Q36612P66640J9911M46293O01421J96178R9900J10921
$$ 6615407 6859498 8068255 8904867 9671507 9691418 10137711 10739132 10935310 11035210 11146131
14051A1146131o1240p638r6791l90209L88687N90422Q83411Q86840R58640Q15318
$$ 11146131 11084891 11077253 10980462 10590253 10978940 11569362 12452773 13339613 14298253 15113571
14041A5113571J490060R19393M85062J146785k0235L9403Q00695M14114M82374
$$ 15113571 16603631 17523024 18008086 19154871 19134636 19174039 19974734 20388848 20871222
14032B0871222K67864J280302Q94774J890207K475728L580394L784463M658062
$$ 20871222 21139086 22419388 23314162 25204369 27680097 31260491 35044954 39703016
14024C9703016N396813Q339643R994399J2551704J7082648K3242126K9924042
$$ 39703016 45099829 53439472 63433871 75985575 93068223 116310349 146234391
14017A46234391L4581414L5635604L1980027K4260957J6439095Q999667J426463
$$ 146234391 180815805 216451409 248431436 272692393 289131488 298131155 299557618
14010B99557618o450507j3624607k2818688l1095855l6220340l5826456l0134905
$$ 299557618 293107111 279482504 256663816 225567961 189347621 153521165 123386260
14003A23386260k4241902j8829864j3911102j1400275q761607o413653n405868
$$ 123386260 99144358 80314494 66403392 55003117 46241510 39827857 34421989
13996C4421989m577044l209480k022843k783144j598183j510231j289734n49878
$$ 34421989 29844945 26635465 24612622 21829478 20231295 18721064 17431330 16881452
13988A6881452n49884q8009o95622P81474K59157R57797Q62857P42096Q29391
$$ 16881452 16331568 16243559 15547937 16329411 16588568 17546365 18409222 19151318 19980709
13979A9980709j04489R0486n19192k95285r42702m41271k005236j627720j366718
$$ 19980709 19876220 19966706 19447514 19152229 18209527 17768256 15763020 14135300 12768582
13970A2768582j543946l45697r41605r39518p42146m11112r07725r9319N792o65253
$$ 12768582 11224636 10878939 9937334 8997816 8255670 7844558 6936833 6837514 6843306 6178053
13960F178053j99496j70070n96068l51951K70967m5267L63405k92479N26692j87441
$$ 6178053 5978557 5808487 5212419 4860468 5131435 5086168 5449573 5157094 5683786 5496345
13950E496345j56046N25948N88757N17616L09416M37381l34560L29742Q95698
$$ 5496345 5340299 5866247 6455004 6972620 7282036 7719417 7384857 7714599 8610297
13941H610297J86146J134024R45464L737673L813964N634802O876391O308126
$$ 8610297 8796443 9930467 10875931 14613604 18427568 24062370 30938761 37246887
13933C7246887O880467N575536M476388K403510K20855j433953l787271n663405
$$ 37246887 44127354 49702890 54179278 56582788 56803643 55369690 51582419 45919014
13925D5919014p242985o890584p295464o033472m711389l317143k272255r53695
$$ 45919014 38676029 31785445 24489981 18456509 13745120 10427977 8155722 7202027
13917G202027j287639l90948o22728Q843l87284N163m19512L5703o4926M6000
$$ 7202027 5914388 5523440 4900712 4909555 4522271 4527434 4107922 4143625 4078699 4124699
13907D124699j29732m38836O00418k31793o8627J99434o78272K71021O7275L1544
$$ 4124699 3994967 3556131 4156549 3924756 3856129 4055563 3377291 3648312 3715587 3747131
13897C747131j44547j48820j01523Q64325j23003n32564M75485j38082K9493R9673
$$ 3747131 3602584 3453764 3352241 4216566 4093563 3560999 4036484 3898402 3927895 4027568
13887D027568J89333k62158k47854l00557L38665K31951l48096l82563L68577
$$ 4027568 4216901 3954743 3706889 3406332 3744997 3976948 3628852 3246289 3614866
13878C614866O5939K88489j106747N17649j23327K76992j73688j07119K35019
$$ 3614866 3680805 3969294 2862547 3380196 3256869 3533861 3360173 3253054 3488073
13869C488073P0424J88663L06808m94715J57829K040j96021p2679J54948K41127
$$ 3488073 3558497 3747160 4053968 3559253 3717082 3719122 3523101 3450422 3605370 3846497
13859C846497j73577j39475j56667M09401l85909M02637J05627J50760k45423
$$ 3846497 3672920 3533445 3376778 3786179 3400270 3802907 3908534 4059294 3813871
13850C813871n9762J61638k39474J79759L97940k85073L62M4920j28738k15233
$$ 3813871 3754109 3915747 3676273 3856032 4253972 3968899 3969261 4014181 3885443 3670210
13840C670210L87399j91518m97284R0777j05394m38451M66315l29673J96962j49507
$$ 3670210 4057609 3866091 3368807 3459584 3354190 2915739 3382054 3052381 3249343 3099836
13830C099836j76998K14767m4018L27442l17802K3547P9051Q7137j30822J28850
$$ 3099836 2922838 3137605 3093587 3421029 3103227 3126774 3205825 3292962 3162140 3290990
13820C290990j05427J32460L30473j54707j91738j47512N9855L16207m75235K01125
$$ 3290990 3185563 3318023 3648496 3493789 3302051 3154539 3214394 3530601 3055366 3256491
13810C256491j25046j90549k2572K681J64447k44052M28472k02821j05866N26405
$$ 3256491 3131445 2940896 2918324 2921005 3085452 2841400 3269872 3067051 2961185 3487590
13800C487590l74497j01714J12800O5987K75754p0231R9888L15693m14999L15283
$$ 3487590 3113093 3011379 3124179 3190166 3465920 3395689 3495577 3811270 3396271 3711554
13790C711554l76127l87591O29957n15374J21279K96671q5058k48382l03197J1421
$$ 3711554 3335427 2947836 3577793 3062419 3183698 3480369 3395311 3146929 2843732 2855153
13780B855153M8546n3435q0762r0283L05712q3215L61503P7195O9835k89495K55809
$$ 2855153 2903699 2850264 2769502 2679219 2984931 2901716 3263219 3340414 3410249 3120754 3376563
13769C376563k3785k4672J9473L17856l72917j4079K22774N51246l29802m84180
$$ 3376563 3352778 3328106 3347579 3665435 3292518 3278439 3501213 4052459 3722657 3238477
13759C238477j64327J60079k2556P5165M51551p46424K03228o9102K47260q94704
$$ 3238477 3074150 3234229 3211673 3286838 3738389 2991965 3195193 3126091 3373351 2478647
13749B478647O29379l85057l01963O28745m22175M68584o35209J37814N28683
$$ 2478647 3108026 2722969 2421006 3049751 2627576 3096160 2460951 2598765 3127448
13740C127448k38193l66419L74417j93038k02255N00820P7136L9337M14540m3736
$$ 3127448 2889255 2522836 2897253 2704215 2501960 3002780 3079916 3119253 3533793 3490057
13730C490057J55597r4011R7515J90768L09321L66638O1242n30295L92328m56321
$$ 3490057 3645654 3551643 3649158 3839926 4149247 4515885 4577127 4046832 4439160 3982839
13720C982839K5476j34000l75209k96648N123K98397m86230J0895O3385K49924
$$ 3982839 4008315 3874315 3499106 3202458 3207581 3505978 3019748 3030643 3094028 3343952
13710C343952m12449Q2619J91837l15141L02463K87436l43200M30560o9627K58556
$$ 3343952 2931503 3014122 3205959 2890818 3193281 3480717 3137517 3568077 3498450 3757006
13700C757006n09105L29370l63295N69292J9137L56539J158518L63261M07129
$$ 3757006 3247901 3577271 3213976 3783268 3802405 4158944 5317462 5680723 6087852
13691F087852j08737O08700r1771n09499j06135J90112o91184p43695k20642n73924
$$ 6087852 5979115 6587815 6496044 5986545 5880410 6070522 5379338 4635643 4415001 3841077
13681C841077J13137n61150L66968L43325k73959r5232O54513L22782k11090J02833
$$ 3841077 3954214 3393064 3760032 4103357 3829398 3734166 4388679 4711461 4500371 4603204
13671D603204k60087P00644l10753K91359K93183J047092M14091M70370N96353
$$ 4603204 4343117 5043761 4733008 5024367 5317550 6364642 6778733 7249103 7845456
13662G845456M50336n18103M29749M24997j41811m72157l12003n76747p43464
$$ 7845456 8295792 7777689 8207438 8632435 8490624 8018467 7706464 7129717 6386253
13653F386253Q4007q67816m28579J34459p89794M60047r40490M97100l15341L82205
$$ 6386253 6470260 5602444 5173865 5308324 4518530 4978577 4038087 4535187 4219846 4602051
13643D602051p09940L44667N29101p00330L17077J20105J76649L10008J690J066840
$$ 4602051 3892111 4236778 4765879 4065549 4382626 4502731 4679380 4989388 4991078 6057918
13633F057918N57378M37546L01087J0519l04131N483j16813m79454q28361m21545
$$ 6057918 6615296 7052842 7353929 7364448 7060317 7065800 6948987 6469533 5641172 5219627
13623E219627n15733p75031j99633J24934K37838n30642L09085m00862N22953
$$ 5219627 4703894 3928863 3729230 3854164 4092002 3561360 3870445 3469583 3992536
13614C992536n76479o26J27889L71222O19883J78419M23346n50892K92860o78847
$$ 3992536 3416057 3415431 3543320 3914542 4534425 4712844 5136190 4585298 4878158 4199311
13604D199311P75534q5143K16024j79305l78120k02317Q7683p77845M55438P7666
$$ 4199311 4974845 4889702 5105726 4926421 4548301 4345984 4433667 3655822 4111260 4188926
13594D188926j12501R00644l27315J65320M12036l97571L08000R5065j68480k28554
$$ 4188926 4076425 4977069 4649754 4815074 5227110 4829539 5137539 5232604 5064124 4835570
13584D835570M659j12212q96430J2215m6047l83006j72943R1168M28022m71577
$$ 4835570 4840229 4728017 3831587 3843802 3797755 3414749 3241806 3332974 3760996 3289419
13574C289419o3129J52494l53065j80931O28209Q6726m03892q9041M23286k50329
$$ 3289419 3226290 3378784 3025719 2844788 3472997 3559723 3155831 3066790 3490076 3239747
13564C239747j44345N31173m29204n1001N39264l65442Q5623K51092N4734o89693
$$ 3239747 3095402 3626575 3197371 3146370 3685634 3320192 3405815 3656907 3711641 3021948
13554C021948M01574n68533L79989j61083j08535j60315P90739m8701k26922J55564
$$ 3021948 3423522 2854989 3234978 3073895 2965360 2805045 3595784 3547083 3320161 3475725
13544C475725O24952R54547Q41071r4783J04203O30871K80269Q4740n10481J86130
$$ 3475725 4100677 5055224 5896295 5801512 5905715 6536586 6816855 6901595 6391114 6577244
13534F577244n98528j076152l46958J30754p37209j16655O2075M46544N53219
$$ 6577244 5978716 4902564 4555606 4686360 3949151 3832496 3894571 4341115 4894334
13525D894334O78319K29872P70046j23144j45521L72046l35692o3939l80617o72632
$$ 4894334 5572653 5802525 6572571 6449427 6303906 6675952 6340260 6276321 5895704 5223072
13515E223072j91042n57769j248754J4320j15539L33152k85324m13428p8169K02042
$$ 5223072 5032030 4474261 3225507 3239827 3124288 3457440 3172116 2758688 2680519 2882561
13505B882561j3640k82588L19693j30533m0387m54862N24439k53943M58155j62647
$$ 2882561 2868921 2586333 2906026 2775493 2735106 2280244 2804683 2550740 3008895 2846248
13495B846248o13907J30055J0246K48364n4733J69713k38571K6111j01314K21222
$$ 2846248 2232341 2362396 2372642 2621006 2566273 2735986 2497415 2523526 2422212 2643434
13485B643434L81493l13770j70762J75287K06733n357k6638K86063l81654m60722
$$ 2643434 3024927 2711157 2540395 2715682 2922415 2917058 2890420 3176483 2794829 2334107
13475B334107j43880N99314L53507o47044L46715p10634M59777J58120l27751
$$ 2334107 2190227 2789541 3143048 2496004 2842719 2132085 2591862 2749982 2422231
13466B422231K30334j30783j31773M71890j86590l54236O02486J32573J06862
$$ 2422231 2652565 2521782 2390009 2861899 2675309 2321073 2923559 3056132 3162994
13457C162994k95176M47130j92184L84941K21033J414429P47002k09867P03214
$$ 3162994 2867818 3314948 3122764 3507705 3728738 5143167 5890169 5680302 6383516
13448F383516n98710P53769k35577j75076m79384K12773j364004l18444n67759
$$ 6383516 5784806 6538575 6302998 6127922 5648538 5861311 4497307 4178863 3611104
13439C611104J0472p57336K27585q102j36637p3434k16838L06898l68775Q44226
$$ 3611104 3621576 2864240 3091825 3083723 2947086 2873652 2656814 2963712 2594937 3439163
13429C439163q13859M95465p16654M63512P5053N54808R21780O82327M7462R10498
$$ 3439163 2625304 3120769 2404115 2867627 2942680 3497488 4419268 5101595 5149057 6059555
13419F059555J20188Q8681j5288K00605j59726o51318r3249o41294q66404k73836
$$ 6059555 6179743 6268424 6253136 6453741 6294015 5642697 5549448 4908154 4041750 3767914
13409C767914o58284N50868r10547L90013K14356m23907n27991L52351k37837
$$ 3767914 3109630 3660498 2749951 3139964 3354320 2930413 2402422 2754773 2516936
13400B516936M57590k54411N22630l69533L2531o5237J71941k52929K20934J22089
$$ 2516936 2974526 2720115 3242745 2873212 2905743 2840506 3012447 2759518 2980452 3102541
13390C102541K1980J18844M94479j38938O32441K56301M72074L95693o3963J20547
$$ 3102541 3124521 3243365 3737844 3598906 4231347 4487648 4959722 5355415 5291452 5411999
13380E411999M93709l31426m9856j94125j79747L046r23299l5195k69511r9205
$$ 5411999 5905708 5574282 5524426 5330301 5150554 5153600 4230301 4195106 3925595 3826390
13370C826390l58684L09970j84318K01597L54613j07060q2275k3289J13155K02640
$$ 3826390 3467706 3777676 3593358 3794955 4149568 4042508 3960233 3936944 4050099 4252739
13360D252739J5560k39000j83684L69319l04322j3349M79439O61692j016498O23779
$$ 4252739 4268299 4029299 3845615 4214934 3910612 3897263 4376702 5038394 4021896 4645675
13350D645675J9550M4404R4195L216m07067k65000l28050k07107m67905L84277
$$ 4645675 4665225 4709629 4803824 4807040 4399973 4134973 3806923 3599816 3131911 3516188
13340C516188k98623L94278J88539k15136O3973J42773o46503K10025K27293k64299
$$ 3516188 3217565 3611843 3800382 3585246 3649219 3791992 3145489 3355514 3582807 3318508
13330C318508M15936l10073m64296O64769k66253J68216K22643l90385L56183
$$ 3318508 3734444 3424371 2960075 3624844 3358591 3526807 3749450 3359065 3715248
13321C715248j58963J57750K01841l30100O8915Q31371j97244O80166j37941J54504
$$ 3715248 3556285 3714035 3915876 3585776 3654691 4486062 4288818 4968984 4831043 4985547
13311D985547R04818n54729J45054M44037k40207o7276k25848l73404l99938L6548
$$ 4985547 5890365 5335636 5480690 5924727 5684520 5617244 5391396 5017992 4618054 4654602
13301D654602M86527j45304Q63203j73260k11715O74944p600m02460j19209M35001
$$ 4654602 5141129 4995825 5859028 5685768 5474053 6148997 6141397 5738937 5619728 6054729
13291F054729l9742J05696r55932J77426l7309k70437j2995L7133l61970N58694
$$ 6054729 6014987 6120683 5164751 5342177 5304868 5034431 5021436 5058569 4696599 5255293
13281E255293m72650R36253m23155M82881l43218J33163Q4717l40578N23675J34571
$$ 5255293 4782643 5718896 5295741 5778622 5435404 5568567 5653284 5312706 5836381 5970952
13271E970952P341l31924J162473o17517J36013N52873o17973J211611j3976o360
$$ 5970952 5978293 5646369 6808842 6191325 6327338 6880211 6262238 7473849 7459873 7453513
13261G453513J97622N99747j64266L99251O97956K28323N18157P5280M41124R5668
$$ 7453513 7651135 8250882 8086616 8485867 9183823 9412146 9930303 10005583 10446707 10542375
13251A0542375Q9445k78530M53073L23345J85087n284K4415l19063k71165M33673
$$ 10542375 10631820 10353290 10806363 11129708 11314795 11309511 11333926 11014863 10743698 11177371
13241A1177371N41067N893L55055N20578R880J020616k29909O47128J046833p2950
$$ 11177371 11718438 11724331 12079386 12599964 12609844 13630460 13400551 14047679 15094512 15021562
13231A5021562P23994L44286L59866O13948k17867K72128l12194K59212n399o38847
$$ 15021562 15745556 16089842 16449708 17063656 16845789 17117917 16805723 17064935 17059536 16420689
13221A6420689J00623q35918K88539o83122r4490j30074p5269L67863o43097o1982
$$ 16420689 16521312 15685394 15973933 15290811 15196321 15066247 14990978 15358841 14715744 14653762
13211A4653762K92183m06075l0932k2705K03603P6322L71104k13244J32087l33966
$$ 14653762 14945945 14539870 14508938 14486233 14689836 14766158 15137262 14924018 15056105 14722139
13201A4722139Q5915M5814p33790o99771M09634l65477k51269m73419o47569K86850
$$ 14722139 14808054 14853868 14120078 13420307 13829941 13464464 13213195 12739776 12092207 12379057
13191A2379057l49182j56614L13540o15514j56639K44608o73844K22388L10509
$$ 12379057 12029875 11873261 12186801 11571287 11414648 11659256 10985412 11207800 11518309
13182A1518309l30318k05825J49327k78863l94991N63455l03407P2495k9837N237
$$ 11518309 11187991 10982166 11131493 10852630 10457639 11021094 10717687 10790182 10760345 10765582
13172A0765582o5904J87046r3131J07203K8544K73508Q8864l24134K36717M01089
$$ 10765582 10699678 10886724 10793593 10900796 10929340 11202848 11291712 10967578 11204295 11605384
13162A1605384Q58755J75646N04784O14656k97336O57905o6918Q87557O50712
$$ 11605384 12464139 12639785 13144569 13759225 13461889 14119794 14052876 14940433 15591145
13153A5591145r3193N6731P371k57844j25050k92842j25528n86324K23583p79697
$$ 15591145 15497952 15554683 15562054 15304210 15179160 14886318 14760790 14174466 14398049 13618352
13143A3618352J75418K23833l24489N11844n76865l65525J41445m48330j018314
$$ 13618352 13793770 14017603 13693114 14204958 13628093 13262568 13404013 12955683 11937369
13134A1937369l33313m73555q78974m74317k14684j59120K71418L9477j46274
$$ 11937369 11604056 11130501 10251527 9777210 9562526 9403406 9674824 9714301 9568027
13125I568027L28873l8937j04159r7629o97179J70611o91354P6140p62622N3822
$$ 9568027 9896900 9857963 9753804 9656175 8958996 9129607 8438253 8514393 7751771 7805593
13115G805593p74201m55934Q45455n57377l81415L90447p68423N60397J32489
$$ 7805593 7031392 6575458 7420913 6863536 6482121 6872568 6104145 6664542 6797031
13106F797031n57371L43827n03026k24204O71488l5052j69840O61214k22881L39761
$$ 6797031 6239660 6583487 6080461 5856257 6527745 6492693 6322853 6984067 6761186 7100947
13096G100947M63774J049148M23762J372971N56151L47674M40288m5972M3993
$$ 7100947 7564721 8613869 9037631 10410602 10966753 11314427 11754715 11708743 11752736
13087A1752736Q3584j13823k32061n30856n06482K34584n27r6856L15023m26972
$$ 11752736 11836320 11722497 11490436 10959580 10453098 10687682 10687155 10590299 10905322 10478350
13077A0478350k56914o19052p6486k41928n52059r13261r89620n90485l66388
$$ 10478350 10221436 9602384 9525898 9283970 8731911 7818650 6829030 6238545 5872157
13068E872157m11487j29371j24303l39438K89941o63276R3906K37028l24116O05707
$$ 5872157 5460670 5331299 5206996 4867558 5157499 4494223 4588129 4825157 4501041 5106748
13058E106748L96492l6788M42596r0756L92587n04044l67466M10694L1474n75995
$$ 5106748 5503240 5466452 5909048 5818292 6210879 5706835 5339369 5750063 5781537 5205542
13048E205542O8615k23585L77983j080930O21184n00256J82315M62288j043685
$$ 5205542 5274157 5050572 5428555 4347625 4968809 4468553 4650868 5113156 4069471
13039D069471N40487R6683K55135l1613J89490o90807N5299M14406L37431J22733
$$ 4069471 4609958 4706641 4961776 4930163 5119653 4428846 4484145 4898551 5235982 5358715
13029E358715K0974q5149M03173J1191k80113J81509q7647J03518Q7925J99343
$$ 5358715 5379689 5294540 5697713 5708904 5428791 5610300 5522653 5626171 5714096 5913439
13019E913439m32445L78516n13283J288077p01330Q30472j70096j15774p3325
$$ 5913439 5480994 5859510 5346227 6634304 5932974 6763446 6593350 6477576 6404251
13010F404251M5712P98098j96165J10347O41605n262N1228k62783N53572j49052
$$ 6404251 6449963 7248061 7051896 7162243 7803848 7798586 7849814 7587031 8140603 7991551
13000G991551P37524J97627K93350l12058R59329r905K87369P90280M74954N37660
$$ 7991551 8729075 8926702 9220052 8907994 9867323 9857418 10144787 10935067 11410021 11947681
12990A1947681j73585L06591M89936o5144N259P33773L04177l45483M48482k51430
$$ 11947681 11774096 12080687 12570623 12505479 12510738 13244511 13548688 13203205 13651687 13400257
12980A3400257K23215K23687L5232K56534M32227J77650l37981k25276K29570
$$ 13400257 13623472 13847159 13882391 14138925 14571152 14748802 14410821 14185545 14415115
12971A4415115n16492k01678m41081L36751k07462j48178l38963M9847k33699
$$ 14415115 13898623 13696945 13255864 13592615 13385153 13236975 12898012 12947859 12714160
12962A2714160P6992n51609l36617K86053j44322o04198J64117j68749m22497
$$ 12714160 12791152 12239543 11902926 12188979 12044657 11440459 11604576 11435827 11013330
12953A1013330n3854j72312k4892J9662k0662k98912n72103J55551Q02643j055819
$$ 11013330 10959476 10787164 10762272 10781934 10761272 10462360 9890257 10045808 10848451 9792632
12943I792632L32686l18352J08582l73259N04188j79027K7013K1538L25895r3209
$$ 9792632 10125318 9806966 9915548 9542289 10046477 9867450 9894463 9916001 10241896 10148687
12933A0148687O09192L24130L9485j07719N20218m14265Q35507m37911K85718
$$ 10148687 10757879 11082009 11121494 11013775 11533993 11119728 11955235 11517324 11803042
12924A1803042j35279j27613k36468N17134K35727L95944j33051j16130l02717
$$ 11803042 11667763 11540150 11303682 11820816 12056543 12452487 12319436 12203306 11900589
12915A1900589k34812L39903m7572J64529n30124n99526k37981N9257l58113K70885
$$ 11900589 11665777 12005680 11958108 12122637 11592513 10992987 10755006 10814263 10456150 10727035
12905A0727035k21659k86865m20833M07764n78851q1258k74543l5580o65950k40418
$$ 10727035 10505376 10218511 9797678 10205442 9626591 9545333 9270790 9235210 8569260 8328842
12895H328842M1747k12027R8091q0539o99587N54432l00480n14369J07222m53548
$$ 8328842 8370589 8158562 8256653 8176114 7476527 8030959 7730479 7216110 7323332 6869784
12885F869784M90495j24962k70138P2122l58910Q8130n89313M04255N284l85469
$$ 6869784 7360279 7235317 6965179 7037301 6678391 6766521 6177208 6581463 6586747 6201278
12875F201278r6993j03523k1021j46349k06124k85279N76122r3386k12170L04634
$$ 6201278 6104285 6000762 5979741 5833392 5627268 5341989 5918111 5824725 5612555 5917189
12865E917189k58649J58311l11840k29330K22336R7832k55607J04253J36716m17273
$$ 5917189 5658540 5816851 5505011 5275681 5498017 5595849 5340242 5444495 5581211 5163938
12855E163938L56448k64663J54762l08026r2124K87749l38478J82270k73499K38721
$$ 5163938 5520386 5255723 5410485 5102459 5010335 5298084 4959606 5141876 4868377 5107098
12845E107098K29516m31447M92027o41500N96423j17884J936R9782l83962j00376
$$ 5107098 5336614 4905167 5397194 4755694 5352117 5234233 5236169 5335951 4951989 4851613
12835D851613P05676k50226K78690j96382K39025l57821J76819M78629q28976
$$ 4851613 5557289 5307063 5585753 5389371 5628396 5270575 5447394 5926023 5097047
12826E097047O10042k94616n59569M73537k70799L07883O6979q7898L14676l88509
$$ 5097047 5707089 5412473 4852904 5326441 5055642 5363525 5430504 5342606 5657282 5268773
12816E268773j95151K61699j69701l10247K7797O28423o2749k6527l56773o2597
$$ 5268773 5073622 5335321 5165620 4855373 4883170 5511593 5448844 5422317 5065544 5002947
12806E002947N08972k42006N0187J08245n7714K04311M21557n89618j65308N90303
$$ 5002947 5511919 5269913 5320100 5428345 5370631 5574942 5996499 5406881 5241573 5831876
12796E831876Q0922j63654m88854P50315n22114J10515k75553N37300L08730m33765
$$ 5831876 5912798 5749144 5260290 6010605 5488491 5599006 5323453 5860753 6169483 5735718
12786E735718j19653n4885K95035k36421K19652j0868j03850q878K78757m69900
$$ 5735718 5616065 5561180 5856215 5619794 5839446 5828578 5724728 5715850 5994607 5524707
12776E524707m57040O80524l89327K57972k13445k25448P22100m62601M34392
$$ 5524707 5067667 5748191 5358864 5616836 5403391 5177943 5900043 5437442 5871834
12767E871834K13905M3221j83241J24135l6600l86262M22459M50954o56904O05129
$$ 5871834 6085739 6128960 5945719 6069854 6033254 5646992 6069451 6520405 5863501 6468630
12757F468630m75905L60505O6416m47523j11119O3303k41979J19821L38262j88394
$$ 6468630 5992725 6353230 6419646 5972123 5861004 5924307 5682328 5802149 6140411 5952017
12747E952017j26784J11541j11437M43448o20964J97677K65033L7325j41408J09683
$$ 5952017 5825233 5936774 5825337 6268785 5647821 5845498 6110531 6147856 6006448 6116131
12737F116131M44437m56325k65920N23968Q5143K32669l29350l03331M31213Q0407
$$ 6116131 6560568 6104243 5838323 6362291 6447434 6680103 6350753 6047422 6478635 6559042
12727F559042r7646l74875k49605L86524n65753Q52804k03371j08319K23531n33635
$$ 6559042 6461396 6086521 5836916 6223440 5657687 6510491 6307120 6198801 6422332 5888697
12717E888697L08549k34882K48428o06235N63142L58789j66887K76265k55103
$$ 5888697 6197246 5962364 6210792 5604557 6167699 6526488 6359601 6635866 6380763
12708F380763J19029J5393J33540l22557O56777k0716l67629O72098M59766j68644
$$ 6380763 6499792 6515185 6648725 6326168 6982945 6962229 6594600 7266698 7726464 7557820
12698G557820P0578l80291Q60123m03358J29250M4861J98106N36181J052338J349388
$$ 7557820 7628398 7248107 8108230 7704872 7834122 7878983 8077089 8613270 9665608 11014996
12688A1014996R78310K262445J115089L09694M68904N93052n14907n05173k51135
$$ 11014996 11993306 14255751 15370840 15680534 16149438 16742490 16227583 15722410 15471275
12679A5471275r55121j834968j154617j444907o75188j14013m66843K67216p23126
$$ 15471275 14516154 12681186 11526569 10081662 9406474 9292461 8825618 9092834 8369708
12670H369708K72457K68130j38989N40245N20911m11092q6140J85669M60949n58594
$$ 8369708 8642165 8910295 8771306 9311551 9832462 9421370 9335230 9520899 9981848 9423254
12660I423254J38912n59806M02808m06784k91083J90577m1514J16740O5766j54401
$$ 9423254 9562166 9002360 9405168 8998384 8707301 8897878 8856364 8973104 9038870 8884469
12650H884469R25628J023009n8726O00674N42977O74700O7284P56638k18606j7172
$$ 8884469 9810097 10833106 10774380 11375054 11918031 12592731 12660015 13416653 13198047 13180875
12640A3180875l9184j31948Q6357k59841k70726n3253O80740m81104q3957l05007
$$ 13180875 13141691 13009743 13096100 12836259 12565533 12512280 13193020 12711916 12627959 12322952
12630A2322952m38569P01714K21201L17767j2132N17257Q5866j96326J49206l19303
$$ 12322952 11884383 12586097 12807298 13125065 13112933 13630190 13716056 13519730 13668936 13349633
12620A3349633K38905m27941j015320j77232r09467o77221q7771M98074p7223
$$ 13349633 13588538 13160597 12145277 11968045 11058578 10381357 10293586 10791660 10714437
12611A0714437M58474R80314N05534O75630J185198J607285N49609M18646L11919
$$ 10714437 11172911 12153225 12658759 13334389 14519587 16126872 16676481 17095127 17407046
12602A7407046m36507J99j101195j318140l87138j483259n89773p88300j115319
$$ 17407046 16970539 16970738 15869543 14551403 14164265 12681006 12091233 11302933 10187614
12593A0187614n98604O21212J61367n22733K12382O28945J40711P1603O05747
$$ 10187614 9589010 10210222 10371589 9848856 10061238 10690183 10830894 10902497 11508244
12584A1508244K73147M46288L77220q8784O83530P36905o3131M46153j11903K756
$$ 11508244 11781391 12227679 12604899 12516115 13199645 13936550 13873419 14319572 14207669 14210425
12574A4210425L50624l16192o45279r3893j6155q47628o92346j051595o91922
$$ 14210425 14561049 14244857 13599578 13505685 13489530 12641902 11949556 10897961 10206039
12565A0206039j34089q52932o3396N67220n0548O49012j006480L62195k01220
$$ 10206039 10071950 9219018 9155622 9722842 9672294 10321306 9314826 9677021 9475801
12556I475801M78283j79422k47914j15821R9033l50520J56122o6110J58516N99420
$$ 9475801 9954084 9774662 9526748 9410927 9509960 9159440 9315562 9249452 9407968 10007388
12546A0007388n22315K00135q4130M51824L68607N53783P67174L12942M71148
$$ 10007388 9485073 9685208 9601078 10052902 10421509 10975292 11742466 12055408 12526556
12537A2526556k56844Q9651L26772q3028k37411l67718O0880l12081j446000j4693
$$ 12526556 12269712 12359363 12686135 12603107 12365696 11997978 12058858 11746777 10300777 10286084
12527A0286084r14862K91769L80764o13775N30375p3125M14888m70109N72686
$$ 10286084 9371222 9662991 10043755 9429980 9960355 9887230 10302118 9832009 10404695
12518A0404695J2711M3057K34164o7785M83083N05068P41066J448835J509655
$$ 10404695 10417406 10460463 10694627 10626842 11109925 11614993 12356059 13804894 15314549
12509A5314549M30517Q51655r6767P76495j70785J8455j012673j100541n44214
$$ 15314549 15745066 16596721 16499954 17276449 17105664 17124119 16111446 15010905 14466691
12500A4466691j598658n76498r27133J65060m83352K6637l31691p1237M64965
$$ 14466691 12868033 12291535 11364402 11529462 11046110 11072747 10741056 10669819 11134784
12491A1134784l84698K93469n40146N13957m34557L30973J50030Q71804K1189
$$ 11134784 10750086 11043555 10503409 11017366 10582809 10913782 11063812 11935616 11956805
12482A1956805J326158J99906J212235L96082l27880j26252N89032k13938j3799
$$ 11956805 13282963 13482869 14695104 15091186 14763306 14637054 15226086 15012148 14998349
12473A4998349p59002j36275n76533m84771r68756M21029k33892J60696O9746
$$ 14998349 14239347 14103072 13526539 13041768 12073012 12494041 12260149 12420845 12490591
12464A2490591J5062m01303P98066k48709L45888N66783m0741N10378r8519J050420
$$ 12490591 12505653 12104350 12902416 12653707 12999595 13566378 13525637 14036015 13937496 14987916
12454A4987916j30904J34059R38146R03578K25128J17344Q49782l5759Q11936
$$ 14987916 14857012 14991071 15929217 16832795 17057923 17175267 18025049 17989290 18801226
12445A8801226N81162j85562R23408n29313k47560L30605L50917k60591O7290
$$ 18801226 19382388 19196826 20120234 19590921 19343361 19673966 20024883 19764292 19831582
12436A9831582k14153k20384K46299r1600R49096l87560L86330P52115N16238
$$ 19831582 19617429 19397045 19643344 19551744 20500840 20113280 20499610 21251725 21767963
12427B1767963N13693N04848J173301P10962K15882J453722P39762J019881L52946
$$ 21767963 22281656 22786504 23959805 24670767 24886649 26340371 27080133 28100014 28452960
12418B8452960K81014J339036M27267K24678O13793j68550K81022q70164L75032
$$ 28452960 28733974 30073010 30500277 30724955 31338748 31170198 31451220 30581056 30956088
12409C0956088r83842K99689o12119r13447l10323o02276l10024q61671j80519
$$ 30956088 29972246 30271935 29659816 28746369 28436046 27833770 27523746 26662075 26481556
12400B6481556Q5474n46176O9806K25034O00326K30919K60347Q77162N02742J017922
$$ 26481556 26567030 26020854 26090660 26315694 26916020 27146939 27407286 28284448 28787190 29805112
12390B9805112J138587K94759J104776P48515O91931M54357K38361P07921k1777
$$ 29805112 30943699 31238458 32343234 33091749 33783680 34238037 34476398 35184319 35162542
12381C5162542M07503j02441j77785q2779J45090M8068n92464M41211j81087k49464
$$ 35162542 35570045 35467604 35289819 35207040 35352130 35400198 34807734 35248945 35067858 34818394
12371C4818394M55088q51451O45912l40432k46926q1945N9119P74039o31309j16944
$$ 34818394 35273482 34422031 35067943 34727511 34480585 34398640 34457759 35231798 34600489 34483545
12361C4483545p23928P49273p5220n21135J18061J66591l06533L91109l89090
$$ 34483545 33759617 34508890 34433670 33912535 34030596 34197187 33890654 34281763 33892673
12352C3892673m6588k08753K44054p34659m50767k33749j92400n54791r4249O21070
$$ 33892673 33846085 33637332 33881386 33146727 32695960 32462211 32269811 31715020 31620771 32241841
12342C2241841o7570K87494J95699Q13009O39503M05492Q59382J183954O10109
$$ 32241841 32174271 32461765 32657464 33470473 34109976 34515468 35374850 36558804 37168913
12333C7168913N17593K07767J535530M34709M16064Q92986P61715j41460Q62826
$$ 37168913 37686506 37894273 39429803 39864512 40280576 41173562 41935277 41793817 42656643
12324D2656643K46130R5075N51790R51N9251p6504m65662L18776j48679O40477
$$ 42656643 42902773 42997848 43549638 43550589 43609840 43533336 43067674 43386450 43237771 43878248
12314D3878248l65876j1352o7268L97737N2991Q90693N15122N11440K06698J150713
$$ 43878248 43512372 43501020 43433752 43831489 43884480 44775173 45290295 45801735 46008433 47159146
12304D7159146P83838O35273N26232L30148l27551j19114J49538j227225j244048
$$ 47159146 47942984 48578257 49104489 49434637 49107086 48987972 49137510 47910285 46666237
12295D6666237m94453j367734j196475n98960j083420p81406N9633j284257o76378
$$ 46666237 46171784 44804050 43607575 43008615 41925195 41143789 41203422 39919165 39242787
12286C9242787l50771o75166p95197j537811p26591j423642j003231q69786r42742
$$ 39242787 38892016 38216850 37421653 35883842 35157251 33733609 32730378 31860592 30917850
12277C0917850j246384K48666j255685l90731K01308m47658m35596K61227n26045
$$ 30917850 29671466 29920132 28664447 28273716 28475024 28027366 27591770 27852997 27326952
12268B7326952N1470p3109k26435m11666J25976p3499l47916M66331n49097L89921
$$ 27326952 27378422 27305313 27078878 26667212 26793188 26719689 26371773 26838104 26289007 26678928
12258B6678928l11207N35508R05837O83248Q06392J385157J349177J286543J394249
$$ 26678928 26367721 26903229 27809066 28492314 29298706 30683863 32033040 33319583 34713832
12249C4713832K171008K039476J742032K380136K925311K662207J301016J620347
$$ 34713832 36884840 38924316 40666348 43046484 45971795 48634002 49935018 51555365
12241E1555365J214285J399905L22709L69848l26325o67026m82770r53723M39080
$$ 51555365 52769650 54169555 54492264 54862112 54535787 53868761 53385991 52432268 52871348
12232E2871348p41934j024182r72870o55626j173745j091606j475381j936563
$$ 52871348 52129414 51105232 50132362 49476736 48302991 47211385 45736004 43799441
12224D3799441k090148k753698k393894j635248k586594j569718k075293j004198
$$ 43799441 41709293 38955595 36561701 34926453 32339859 30770141 28694848 27690650
12216B7690650p36354n95080j037665p95183q49184p14184k62566o40375o01157
$$ 27690650 26954296 26359216 25321551 24526368 23677184 22963000 22700434 22060059 21458902
12207B1458902p8351q33967R8895p43074n63929N66269l21707J50372M41648p40259
$$ 21458902 21380551 20546584 20645479 19902405 19338476 19904745 19583038 19733410 20175058 19434799
12197A9434799P12330O21601Q449o69224J55196R01553N18295K64645M33495O98422
$$ 19434799 20147129 20768730 20777179 20107955 20263151 21164704 21682999 21947644 22381139 23079561
12187B3079561J71214M15047M81134K87927j92088O76629k78706K74498j24011
$$ 23079561 23250775 23665822 24146956 24434883 24242795 24919424 24640718 24915216 24791205
12178B4791205m42744M87472N5076k61919l95017n11094J21929k92696j13179
$$ 24791205 24348461 24835933 24891009 24629090 24234073 23722979 23844908 23552212 23439033
12169B3439033J01667J28305k62903J27740N41743J3905O65456L51548J348623
$$ 23439033 23540700 23669005 23406102 23533842 24075585 24089490 24754946 25106494 26455117
12160B6455117N39992R77771K97842J61711M91045P32589m52318K67966L0171
$$ 26455117 26995109 27972880 28270722 28432433 28923478 29656067 29203749 29471715 29501886
12151B9501886k93404L68469j71151O71086N94085J312880J769701J557617J529463
$$ 29501886 29208482 29576951 29405800 30076886 30670971 31983851 33753552 35311169 36840632
12142C6840632J852937J347486J036495K063641J400178J493404K382987P74829
$$ 36840632 38693569 40041055 41077550 43141191 44541369 46034773 48417760 49192589
12134D9192589K340244J939603K569481K659775L241747L531380M108902L615109
$$ 49192589 51532833 53472436 56041917 58701692 61943439 65474819 69583721 73198830
12126G3198830M198391L487339L388791K392672K264386J184262J172919N43663
$$ 73198830 77397221 80884560 84273351 86666023 88930409 90114671 91287590 91831253
12118I1831253j042281r14226j432250j624145j761625k180007j908463j918528
$$ 91831253 90788972 89874746 88442496 86818351 85056726 82876719 80968256 79049728
12110G9049728j818415j895245k111115j217907k070109j857802j185103q30170
$$ 79049728 77231313 75336068 73224953 72007046 69936937 68079135 66894032 66063862
12102F6063862l21107k51667J94575O85400J60972o3357k70621j98402M15771
$$ 66063862 65742755 65491088 65685663 66371063 66532035 66468678 66198057 65999655 66415426
12093F6415426n78758j235205n108p35236L82384R7521L74924J477845J292126
$$ 66415426 65836668 64601463 64596355 63861119 64243503 64341024 64715948 66193793 67485919
12084F7485919J013840J337800J235054J259741J405647O7426N04442J9997k93783
$$ 67485919 68499759 69837559 71072613 72332354 73738001 73805427 74309869 74329866 74036083
12075G4036083M32380j96654O7546m36670m58787n51983j001789j250076k019433
$$ 74036083 74468463 74271809 74339355 73902685 73443898 72891915 71890126 70640050 68620617
12066F8620617j472512j769113k329038k148249k048429j226036j770841j135566
$$ 68620617 67148105 65378992 63049954 60901705 58853276 57627240 55856399 54720833
12058E4720833j205641j538356q87504j055957j189593r18039j136188p78320
$$ 54720833 53515192 51976836 51089332 50033375 48843782 47925743 46789555 46011235
12050D6011235j298983q96909j106811k60213r90960o88946r85767k97252l94699
$$ 46011235 44712252 43815343 42708532 42448319 41457359 40768413 39782646 39485394 39090695
12041C9090695n60865j561566j25272r84848o00832r51734j019253p88043m81959
$$ 39090695 38529830 36968264 36842992 35858144 35257312 34305578 33286325 32498282 32016323
12032C2016323M22926L60547J76880Q72027P72256N96540P95671j9084N08410
$$ 32016323 32439249 32799796 32976676 33848703 34620959 35217499 36013170 35994086 36502496
12023C6502496l23400j463418m84700j746066j123290j200581k022783j270925
$$ 36502496 36179096 34715678 34230978 32484912 31361622 30161041 28138258 26867333
12015B6867333q22119k13619j082532r14522n66791r89807m50413o21896j044432
$$ 26867333 26045214 25831595 24749063 23834541 23267750 22277943 21827530 21205634 20161202
12006B0161202J28181m50714j67304l67954O07935J22509R791R22916n38158J85303
$$ 20161202 20289383 19838669 19671365 19303411 19911346 20033855 20043646 20966562 20428404 20613707
11996B0613707l92359N05844o83298o53186L14700l95862k85686Q9551M94571
$$ 20613707 20221348 20727192 20043894 19390708 19705408 19309546 19023860 19113411 19607982
11987A9607982m57405n75506L66351k34242q43023K41050m15486l60176l02013
$$ 19607982 19150577 18575071 18941422 18707180 17864157 18105207 17689721 17329545 17027532
11978A7027532l83654m13497o00378k20095k96318K20563q83372o7097m0783j335787
$$ 17027532 16643878 16230381 15630003 15409908 15113590 15334153 14450781 14383684 14342901 13007114
11968A3007114N15593j179081j58213l64162j93583j9295J71239j030582M82838
$$ 13007114 13522707 12343626 12185413 11821251 11627668 11608373 11779612 10749030 11231868
11959A1231868J77588J45019J7086M16746J24443q5867L04652L4578l3008j51786
$$ 11231868 11409456 11554475 11571561 11988307 12112750 12026883 12331535 12366113 12333105 12181319
11949A2181319L56480m46955N32340o4577R3680K90145R8939K62285K64970J423071
$$ 12181319 12537799 12090844 12623184 12558607 12652287 12942432 13041371 13303656 13568626 14991697
11939A4991697K4809M24455Q67124n67907J034947N12108k13892l30365N88705
$$ 14991697 15016506 15440961 16308085 15740178 16775125 17287233 17073341 16742976 17331681
11930A7331681j45187r75651N79450q20008K54694p39381m06438m07601l12461
$$ 17331681 17186494 16210843 16790293 15970285 16224979 15485598 15079160 14671559 14359098
11921A4359098k27094k2788m67498n42948l07919l00603m04723l17151j42725
$$ 14359098 14132004 14109216 13641718 13098770 12790851 12490248 12085525 11768374 11625649
11912A1625649M79929J42375P13685L329415P874204O604042L206235J262558
$$ 11625649 12105578 12247953 12961638 16291053 24165257 30769299 33975534 35238092
11904C5238092J534454P18541O39038r51239j236438m984714m898178n805018
$$ 35238092 36772546 37491087 38130125 37178886 35942448 30957734 26059556 20254538
11896B0254538n153081k284921j385761p89927L07317o81939J34525O6136Q06028
$$ 20254538 15101457 12816536 11430775 10640848 10948165 10266226 10400751 10466887 11272915
11887A1272915p4460J199101J094792P04348J123985R56704Q09447J047658N69948
$$ 11272915 11198455 12397556 13492348 14196696 15320681 16277385 17086832 18134490 18704438
11878A8704438M25467L0549p9801j257111P9955j707410q62431p93700p26418
$$ 18704438 19129905 19160454 19080653 17823542 17903497 16196087 15333656 14539956 13813538
11869A3813538j285909n29676p75902o43871l94289k05949o67179m17049j72355
$$ 13813538 12527629 11997953 11222051 10578180 10183891 9977942 9310763 8893714 8721359
11860H721359M39752m72627K18817n33804M91151O4147r4301N3050k81732P32390
$$ 8721359 9161111 8688484 8907301 8373497 8864648 8928795 8834494 8887544 8605812 9338202
11850I338202K97160M07579L75103k08682J037728M08242M10090K38141R76589
$$ 9338202 9635362 10042941 10418044 10209362 11247090 11655332 12065422 12303563 13280152
11841A3280152R22956K75492k63871L74130q18811K62601l61155n97036J49177
$$ 13280152 14203108 14478600 14214729 14588859 13770048 14032649 13671494 13074458 13223635
11832A3223635q44497k46099l4637k08866L5593l6584p40814L37153p04097J60140
$$ 13223635 12379138 12133039 12098402 11889536 11925129 11888545 11147731 11484884 10780787 10940927
11822A0940927j006811l75754n78225o78658k75173l04394l45156k04426j68445
$$ 10940927 9934116 9558362 8980137 8301479 8026306 7721912 7376756 7172330 7003885
11813G003885N2248N1537j01433j56508j44992K46939n11498J30232j94848k33095
$$ 7003885 7056133 7107670 7006237 6849729 6704737 6951676 6440178 6570410 6375562 6142467
11803F142467j2329n44016O90028k52607J49359j76098M2413K03785l42847J69411
$$ 6142467 6130138 5586122 6276150 6023543 6172902 5996804 6039217 6243002 5900155 6069566
11793F069566M73679Q925J82102N34315K94804m3315Q29984O38620K28510K48064
$$ 6069566 6543245 6552170 6734272 7268587 7563391 7520076 8350060 8988680 9217190 9465254
11783I465254m90306K64044J54852o02249o45459k13757q63181n03024p74037
$$ 9465254 8974948 9238992 9393844 8791595 8146136 7932379 7069198 6566174 5792137
11774E792137K84946L3147j21232m91430j51830J78482r6605j97881j62154J2936
$$ 5792137 6077083 6110230 5988998 5497568 5345738 5524220 5427615 5229734 5067580 5080516
11764E080516K30299r8776l18205M15999k02722R0695k06413j05726j43111J11428
$$ 5080516 5310815 5212039 4893834 5309833 5107111 5197806 4991393 4885667 4742556 4853984
11754D853984J85580r6534J52713Q6992m97398J59923J01496j85307Q0400J54677
$$ 4853984 5039564 4943030 5095743 5182735 4685337 4845260 4946756 4761449 4841849 4996526
11744D996526M17563r30677K4892O778n7546M60472l77151L232K27736L48600
$$ 4996526 5414089 4483412 4508304 4515082 4457536 4918008 4540857 4544089 4771825 5120425
11734E120425k94228J31049k85403L3424L06739l88034m97578N82819l96163J04690
$$ 5120425 4826197 4957246 4671843 4705267 5012006 4623972 4126394 4709213 4313050 4417740
11724D417740M17793l58192Q3930K72819l30538k35763J87511J96391J01950j78270
$$ 4417740 4835533 4477341 4561271 4834090 4503552 4267789 4455300 4651691 4753641 4575371
11714D575371j20030M38192k09489J12663j21635J74632m54093J63317K72441
$$ 4575371 4455341 4893533 4684044 4796707 4675072 4849704 4395611 4558928 4831369
11705D831369j96988N56699n45382j69614J011K74292j18579P9919L41084j01423
$$ 4831369 4634381 5191080 4645698 4476084 4477095 4751387 4632808 4712727 5053811 4952388
11695D952388L63913p92258j42952M21671l01375K50826j67927M1461K89499k02784
$$ 4952388 5316301 4524043 4381091 4802762 4501387 4752213 4584286 4625747 4915246 4712462
11685D712462r6398M0189J91763j9462J55695L80619n53970J19819K4529J52066
$$ 4712462 4616064 4656253 4848016 4828554 4984249 5364868 4810898 4930717 4955246 5107312
11675E107312k83758p5685J25980K07498o8839j07864L7424M1494K50488K8959
$$ 5107312 4823554 4747869 4873849 5081347 5012508 4904644 4942068 4983562 5234050 5263009
11665E263009l0376k74185o1387O23459j67451o6193M1881j99362K4040J24798
$$ 5263009 5232633 4958448 4897061 5520520 5353069 5286876 5328757 5129395 5153435 5278233
11655E278233q7958l4625J654R6602k55455J57044J29732l02785K97727m3314
$$ 5278233 5190275 5155650 5157304 5253906 4998451 5155495 5285227 4982442 5280169 5236855
11645E236855j89677l58193L19857Q1988l76073N72735K90622m88012j84504p0954
$$ 5236855 5047178 4688985 5008842 5090830 4714757 5287492 5578114 5090102 4905598 4834644
11635D834644P04644k07191l99933P23529l19814R32932o76489j32240J97k13775
$$ 4834644 5539288 5332097 4932164 5655693 5335879 6268811 5592322 5460082 5460279 5246504
11625E246504K01070N222K32297j67596j15697q7916J24289l35041k28673P73821
$$ 5246504 5447574 5452796 5685093 5517497 5401800 5313884 5438173 5103132 4874459 5648280
11615E648280l26535Q160k83178J25843L92070n40822q5401N61401o79023K64252
$$ 5648280 5321745 5329905 5046727 5172570 5564640 5023818 4938417 5499818 4820795 5085047
11605E085047J04176O00013q6523M52899l17344N2591Q294J65391n85616J189302
$$ 5085047 5189223 5789236 5702713 6155612 5838268 5890859 5899153 6064544 5478928 6668230
11595F668230p41031Q55511o70605k78755M64621n21129M99405l10376k02924
$$ 6668230 5927199 6782710 6112105 5833350 6297971 5776842 6276247 5965871 5762947
11586E762947j27914J52966J84693l14677O3059K80593p08482N64567m60316Q98548
$$ 5762947 5635033 5787999 5972692 5658015 5721074 6001667 5293185 5857752 5397436 6295984
11576F295984o88251L45867K09324k26758L62778j93199m2340J42733j01035M5815
$$ 6295984 5607733 5953600 6162924 5936166 6298944 6105745 6063405 6206138 6105103 6150918
11566F150918K94776k17122p2993K9795k54861m56354P27942m34393M75146p96513
$$ 6150918 6445694 6228572 6155579 6185374 5930513 5474159 6202101 5767708 6242854 5446341
11556E446341N63216J40391k91936l85242L78285O6334j00441j36007J64245K54170
$$ 5446341 6009557 6149948 5858012 5472770 5851055 5917389 5816948 5680941 5845186 6099356
11546F099356l14445q3277K48146k96633O5318L11733m33159L13966j43633j23254
$$ 6099356 5784911 5701634 5949780 5653147 5718465 6030198 5597039 5911005 5767372 5644118
11536E644118N87697n58512R3621K4397o43048O53285l4115n6139Q2811k32520
$$ 5644118 6231815 5673303 5766924 5791321 5148273 5801558 5767443 5711304 5794115 5561595
11526E561595K10912l05085J11327p8826L36510J45725m92406l17596L27605J22981
$$ 5561595 5772507 5467422 5578749 5499923 5836433 5982158 5489752 5172156 5499761 5622742
11516E622742J57093K82204l03499L34921m09231L66978r3282N2229m60569M60579
$$ 5622742 5779835 6062039 5758540 6093461 5684230 6051208 5957926 6010155 5549586 6010165
11506F010165l59327O9976M40863l43409Q9538K68686o64251L30404N58526n65123
$$ 6010165 5650838 5720814 6161677 5818268 5907806 6176492 5512241 5842645 6401171 5836048
11496E836048n4093j54417P72256n94969n7457N52309k89580j68815M35645K34815
$$ 5836048 5781955 5627538 6399794 5804825 5747368 6299677 6010097 5841282 6276927 6511742
11486F511742k27860R4482l24755M7356K50233n73450N36363m61637M04172k67500
$$ 6511742 6283882 6378364 6053609 6100965 6351198 5777748 6314111 5852474 6256646 5989146
11476E989146j43074M96753l78810k8270N85971n07741J92230j38174m53116N14776
$$ 5989146 5846072 6342825 5964015 5935745 6521716 6013975 6206205 6068031 5614915 6129691
11466F129691j25570L18596p46227J75183P5248J93458J68737j61083m36536J46902
$$ 6129691 6004121 6322717 5576490 5751673 5826921 6020379 6189116 6028033 5591497 5738399
11456E738399J24160q721K2947n76319L81676o1672J81121J96816j02659J67466
$$ 5738399 5862559 5853838 5876785 5300466 5682142 5620470 5801591 5998407 5895748 6063214
11446F063214L32757n60214K19713o3211O0356O50970m92584l82092L21828j85840
$$ 6063214 6395971 5835757 6055470 5992259 6052615 6703585 6211001 5828909 6150737 5964897
11436E964897L60963l57525M38497J8701j90673L60675K85353J27182l71965R4801
$$ 5964897 6325860 5968335 6406832 6425533 6234860 6595535 6880888 7008070 6636105 6730906
11426F730906L21806Q39126m32864J93903k76193qK36581k405P33917m9630k40414
$$ 6730906 7052712 7891838 7458974 7652877 7376684 7376676 7613257 7610852 8344769 8295139 8054725
11415H054725J21778K37590J22164j72972L07904P10282o23117N73764J85790
$$ 8054725 8176503 8414093 8536257 8363285 8671189 9381471 8758354 9332118 9517908
11406I517908K77273l74447M02584J83582L97609r2806K90915L82315M06714L03153
$$ 9517908 9795181 9420734 9823318 10006900 10404509 10311703 10602618 10984933 11391647 11694800
11396A1694800l02952L03655o8210O72021m82229R98914K9475k2691K7476N69826
$$ 11694800 11391848 11695503 11627293 12299314 11817085 12815999 12845474 12822783 12850259 13420085
11386A3420085K03072K89963R1519j11311N92655o16706J43739O03479n0496K30888
$$ 13420085 13623157 13913120 14004639 13893328 14485983 13869277 14013016 14616495 14565999 14796887
11376A4796887N71697k57704n2346m3663M07809n757Q6081O25548l49045J08163
$$ 14796887 15368584 15110880 15058534 15014871 15422680 15416923 15503004 16128552 15779507 15887670
11366A5887670P21632j89179j71298M7681J34902j51710J69778J83395j65468
$$ 15887670 16609302 16420123 16248825 16296506 16431408 16279698 16449476 16632871 16467403
11357A6467403k8096L17316n42999M40620J70823n85769M6060j54027M99246l63891
$$ 16467403 16439307 16756623 16213624 16654244 16825067 16239298 16285358 16131331 16630577 16266686
11347A6266686m58210k8702L5886j62989R601n23273k58916J10726L47783k52616
$$ 16266686 15808476 15779774 15815660 15652671 15662272 15138999 14880083 14990809 15338592 15085976
11337A5085976l57077K42232n81304m5890j76402o2611j48435o7527j90760q04721
$$ 15085976 14728899 14971131 14389827 14343937 14167535 14104924 13956489 13888962 13698202 12893481
11327A2893481J72053j09078j16002l78805k33507K38601l4617m16525L8668n32703
$$ 12893481 13065534 12956456 12840454 12461649 12228142 12466743 12432126 12015601 12054269 11521566
11317A1521566k62392n25169M8514k32169p3346j53449k07768j51840j91640k59934
$$ 11521566 11259174 10734005 10782519 10550350 10477004 10323555 10115787 9963947 9772307 9512373
11307I512373j02507J86014n36833k96796M70035m64861m71072o0347j58493P0464
$$ 9512373 9409866 9595880 9059047 8762251 9232286 8767425 8296353 8236006 8077513 8147977
11297H147977k27228l9222p9902m92056L81053p53843K40336J49744m36378K57057
$$ 8147977 7920749 7881527 7801625 7309569 7690622 6936779 7177115 7326859 6890481 7147538
11287G147538o59080K14878j10344J0155j99538q9387k66837M33136k75377J90681
$$ 7147538 6488458 6703336 6592992 6603147 6403609 6314222 6047385 6480521 6205144 6395825
11277F395825l79908M08563l34900j76253J01815l54252K6057J73529m96889L8274
$$ 6395825 6015917 6424480 6089580 5913327 6015142 5660890 5686947 5860476 5363587 5401861
11267E401861M17862J59043p29318M71506R712k17432p7794j57673L99740O9476
$$ 5401861 5819723 5978766 5249448 5720954 5730666 5513234 5435440 5277767 5677507 5746983
11257E746983l72060J723k17517J12894j33624K12414j41851o7256k50292L68510
$$ 5746983 5374923 5376646 5159129 5272023 5138399 5350813 5208962 5141706 4891414 5259924
11247E259924j27625O37229r64676P99810j66895l5319k08579J31134k74506K78514
$$ 5259924 5132299 5769528 4804852 5604662 5437767 5402448 5193869 5325003 5050497 5329011
11237E329011l71599P55955J20826j99253k77779Q0947r0521K08674P7699K87778
$$ 5329011 4957412 5713367 5834193 5634940 5357161 5438108 5347587 5556261 5633960 5921738
11227E921738P7025N33380K24311J221907K085657J699211Q11070M76997Q72832
$$ 5921738 5998763 6532143 6756454 7978361 10064018 11763229 12574299 13051296 13924128
11218A3924128N8692L4469m6152k35813j151181j510132k220430j385907n81141
$$ 13924128 13982820 14017289 13971137 13735324 12584143 11074011 8853581 7467674 6886533
11209F886533p4601k21438n08796k37223Q836q8911K03823K82382j001219O63753
$$ 6886533 6811932 6590494 6081698 5844475 5853311 5764400 5968223 6250605 5249386 5913139
11199E913139K46259J98154K42058P58855J212330J743010J292007J067745J286449
$$ 5913139 6159398 6357552 6599610 7358465 8570795 10313805 11605812 12673557 13960006
11190A3960006j27412L98255j40066j4410o36642j230036j662877j902328j156500
$$ 13960006 13832594 14230849 14090783 14076373 13439731 12209695 10546818 8644490 7487990
11181G487990n55549o79555l44087K36959J07100m48492j76719K10096l14513
$$ 7487990 6932441 6252886 5908799 6145758 6252858 5804366 5627647 5837743 5523230
11172E523230N2619M6357p7632J8330n2053L11607k69572K23059M0579k21048
$$ 5523230 5575849 5622206 5544574 5562904 5510851 5822458 5552886 5775945 5816524 5595476
11162E595476Q2792K69037L30966o68534J9423m8876m5808N88909l99901k7978
$$ 5595476 5678268 5947305 6278271 5609737 5629160 5580284 5534476 6123385 5723484 5695506
11152E695506L05922J45796J12735O7271j44633k46999O31760k07748m59992J6558
$$ 5695506 6001428 6147224 6259959 6327230 6182597 5935598 6567358 6359610 5899618 5916176
11142E916176L97254l7449M35737j51692J71790k66783k17632r8808M71768k1104
$$ 5916176 6313430 6275981 6711718 6560026 6731816 6465033 6247401 6148593 6620361 6599257
11132F599257o3022m12811J74753P67753l76223J67682m09736J86286J36178l2276
$$ 6599257 6536235 6123424 6298177 7065930 6689707 6857389 6447653 6633939 6770117 6737841
11122F737841L6743j04366j12972O29531j06645k91691M70152j54794J1850J2935
$$ 6737841 6774584 6670218 6557246 7186777 7080132 6788441 7258593 7103799 7115649 7128584
11112G128584m41208J22221J43140N26526o41774N72082k50046k43281k22124
$$ 7128584 6687376 6809597 6952737 7479263 6837489 7409571 7159525 6916244 6694120
11103F694120N57605l97687j17157L58470J03679j1421l17483J24766K57699k1220
$$ 6694120 7251725 6854038 6736881 7095351 7199030 7187609 6870126 6994892 7252591 7231371
11093G231371j45866Q3009J37735j71109L22036k80020O68919p89939j52601k36580
$$ 7231371 7085505 7168514 7306249 7135140 7457176 7177156 7846075 7056136 6903535 6666955
11083F666955L88698l80410M44460j08280K90071M2014L94435l81205J41759L37506
$$ 6666955 7055653 6675243 7119703 7011423 7301494 7343508 7737943 7356738 7498497 7836003
11073G836003m99489J97684K03484L32784J13092N623J9485M34415Q8163n88820
$$ 7836003 7336514 7534198 7737682 8070466 8183558 8189181 8208666 8643081 8731244 8142424
11063H142424N02604l1588L74451m31954N67525M01137J12356J55506k36523J74363
$$ 8142424 8645028 8613440 8987891 8555937 9123462 9524599 9636955 9792461 9555938 9730301
11053I730301K42326j62330M36202k24280M05824K3256K19024m54688M76414O10889
$$ 9730301 9972627 9810297 10246499 10022219 10428043 10451299 10670323 10215635 10692049 11302938
11043A1302938l53910j15655M25297L11616j58547P72939K70962M21480j49034
$$ 11302938 10949028 10833373 11258670 11570286 11411739 12184678 12455640 12877120 12728086
11034A2728086M11018M76527M37773j54256o8719P53133k00826M03854l66585
$$ 12728086 13139104 13615631 14053404 13899148 13830429 14583562 14382736 14786590 14420005
11025A4420005N90954K51773m91057Q00496R3125o4009M82032j91580K68879j981
$$ 14420005 15010959 15262732 14771675 15572171 15665296 15601287 16083319 15891739 16160618 16158637
11015A6158637Q87964P487N96244j81254J361256j3226K43944J44283M39279J153084
$$ 16158637 17046601 17054088 17650332 17469078 18830334 18817108 19061052 19205335 19644614 20797698
11005B0797698j27444Q43619K86530M5877J33449J80008Q968O81857J42488J2002
$$ 20797698 20670254 21513873 21800403 21846280 21979729 22159737 22168705 22850562 22993050 23005052
10995B3005052K9848J12306K85105R8947k51079P10476O27681L20666k71307N97358
$$ 23005052 23034900 23147206 23432311 23531258 23280179 23990655 24618336 24939002 24667695 25265053
10985B5265053O11763K57335Q94295O02129J947463N94452J233817P15901N11208
$$ 25265053 25876816 26134151 27028446 27630575 29578038 30172490 31406307 32122208 32633416
10976C2633416L47120J055034L08981M94063n69633N50398m11421L91844N48159
$$ 32633416 32980536 34035570 34344551 34838614 34268981 34819379 34407958 34799802 35347961
10967C5347961Q39941Q08176K63396J459550J274190J223213O35605J129303J064602
$$ 35347961 36187902 36996078 37259474 38719024 39993214 41216427 41852032 42981335 44045937
10958D4045937J269078J457687J011158J543404J541107J564919J089479Q12857
$$ 44045937 45315015 46772702 47783860 49327264 50868371 52433290 53522769 54335626
10950E4335626J239001M19974J058097O75257M84209K24098J459228J67432M34128
$$ 54335626 55574627 55994601 57052698 57727955 58212164 58436262 59895490 60062922 60497050
10941F0497050J115606J475094J537197J079768J521155J526916J837826Q94543
$$ 60497050 61612656 63087750 64624947 65704715 67225870 68752786 70590612 71485155
10933G1485155J545113J073155J144772P41705J205244L91788J293821k2614N68795
$$ 71485155 73030268 74103423 75248195 75989900 77195144 77586932 78880753 78858139 79426934
10924G9426934k48735J86958L11210l59021j00098p93131k75276K71068q65078
$$ 79426934 79178199 79365157 79676367 79317346 79217248 78424117 78148841 78419909 77554831
10915G7554831j22000k21805R6158k87812K99615k35028o4659L09228L32145L75399
$$ 77554831 77432831 77211026 77307184 77019372 77318987 77083959 77019300 77328528 77660673 78036072
10905G8036072M85338Q32339R48969R90480O32104J174419J325481K130265J291123
$$ 78036072 78521410 79353749 80302718 81293198 81925302 83099721 84425202 86555467 87846590
10896H7846590J721202K328936L112584K997523K885690L968234M391319N310156
$$ 87846590 89567792 91896728 95009312 98006835 100892525 104860759 109252078 114562234
10888A14562234N771929O865741P182744Q054114Q132481Q142302Q920574P410351
$$ 114562234 120334163 127199904 134382648 142436762 150569243 158711545 167632119 175042470
10880A75042470O650145N724910L031331K623048k71776j846093l645206n354893
$$ 175042470 181692615 187417525 190448856 193071904 192800128 190954035 187308829 181953936
10872A81953936o227686o969716q545189q053682q524455q355274p267531p339958
$$ 181953936 175726250 168756534 160211345 152157663 143633208 135277934 128010403 120670445
10864A20670445q030154o458533o161901o092176n724768m835912n242004m654557
$$ 120670445 112640291 106181758 100019857 93927681 88202913 83367001 78124997 73470440
10856G3470440m342272m278176l791164l682454l102868k673013l020084k771343
$$ 73470440 69128168 64849992 61058828 57376374 54273506 51600493 48580409 45809066
10848D5809066k491222k241143k646964j605683j175013k037192j732613j656421
$$ 45809066 43317844 41076701 38429737 36824054 35649041 33611849 31879236 30222815
10840C0222815o97281q28875j518340r18495j744495o60353j166175n34294r32444
$$ 30222815 29525534 28696659 27178319 26259824 24515329 23854976 22688801 22154507 21222063
10831B1222063l48068j288552k20380n30193r18519j02901n11917j099681j27127
$$ 21222063 20873995 19585443 19365063 18834870 17916351 17813450 17301533 16201852 16074725
10822A6074725l11745n50750m70281k16113m69536o4740o13387Q9899m76395j08860
$$ 16074725 15762980 15212230 14741949 14525836 14056300 13991560 13378173 13468072 12991677 12882817
10812A2882817m64749J51274j83687q35428K20415m86266k43819l90332K24022
$$ 12882817 12418068 12569342 12385655 11550227 11770642 11284376 11040557 10650225 10874247
10803A0874247j32386k03413k10385l47491P6205k53655q9543p72507L83687k14265
$$ 10874247 10741861 10538448 10328063 9980572 10056777 9803122 9713579 8941072 9324759 9110494
10793I110494K20160n55586k85838j82393P4356L31381j42065L16098p61476j50402
$$ 9110494 9330654 8775068 8489230 8306837 8381193 8712574 8570509 8886607 8125131 7974729
10783G974729J70732K9856p99884J051384j337879N86174k18473m29401K26302
$$ 7974729 8145461 8175317 7375433 8426817 7088938 7675112 7456639 7027238 7253540
10774G253540j06636l58k80990k62086m7884L18348j31006o85121k73962M22386
$$ 7253540 7146904 7146546 6865556 6603470 6555586 6873934 6742928 6057807 5783845 6206231
10764F206231q6930n7693J24661N6491L13887j09732j66221k354k90850k14695
$$ 6206231 6119301 6061608 6186269 6242760 6556647 6446915 6280694 6278340 5987490 5772795
10754E772795O04976m21224R9700L58647l0459L44318r73103L59173l50724J97695
$$ 5772795 6377771 5956547 6056247 6414894 6384435 6728753 5755650 6114823 5764099 5961794
10744E961794K841L36404k19842o16602j33848M24099m20604M6195j17181j67806
$$ 5961794 5964635 6301039 6081197 5464595 5330747 5754846 5334242 5380437 5263256 5095450
10734E095450j96707K73719o8827M49398j20908m58640P65070j66889K22893l13525
$$ 5095450 4898743 5172462 5103635 5553033 5432125 4973485 5738555 5571666 5794559 5481034
10724E481034m47446O41624L5012L21876m64674n68340l13622N89019j50157m07622
$$ 5481034 5033588 5675212 5710224 6032100 5567426 4999086 4685464 5274483 5124326 4716704
10714D716704Q2185K37304J45667K1582o06051L34152o4056q6854L01879k82020
$$ 4716704 4798889 5036193 5181860 5203442 4597391 4931543 4867487 4780633 5082512 4800492
10704D800492J35506m98043N81266K3675k87409L09395j54561k75421J67895k7553
$$ 4800492 4935998 4437955 5019221 5042896 4755487 5064882 4910321 4634900 4802795 4775242
10694D775242q1333J34276m74254K24226K8787L34533n04417J05480M62174p1303
$$ 4775242 4693909 4828185 4353931 4578157 4606944 4941477 4437060 4542540 5004714 4933411
10684D933411p46986M73915K66747R5713l72327j55776L76755J14718L18205n32391
$$ 4933411 4186425 4660340 4927087 5022800 4650473 4494697 4871452 4986170 5304375 4771984
10674D771984m7026R81496j96425K98913k63308k50975K4435j72781m68023R5689
$$ 4771984 4724958 5706454 5510029 5808942 5545634 5294659 5319094 5146313 4678290 4773979
10664D773979l95272J82521m2061p14847P16727m46617l637k70622L3339L02200
$$ 4773979 4378707 4561228 4519167 3804320 4521047 4074430 4070793 3800171 3833510 4135710
10654D135710M03315n52267P59795J2238J71413m29178R74522n8794j43103l77594
$$ 4135710 4539025 3986758 4746553 4758791 4930204 4501026 5475548 5416754 5273651 4896057
10644D896057O09892j280826J74808L22724o00010j65694m9802j17462j99005
$$ 4896057 5505949 4225123 4399931 4722655 4122645 3956951 3907149 3789687 3590682
10635C590682l61900j30908N64595k24261J86605p4750m56594K27140J33242J36380
$$ 3590682 3228782 3097874 3662469 3438208 3624813 3550063 3093469 3320609 3453851 3590231
10625C590231k33984O9479L6768J33856p39820M42216J57032l10184L95234q7866
$$ 3590231 3356247 3425726 3462494 3596350 2856530 3298746 3455778 3145594 3540828 3452962
10615C452962l24476j87098N83664p1433m25679L25494M36071m69980k09704J21483
$$ 3452962 3128486 2941388 3525052 3453619 3027940 3353434 3789505 3319525 3109821 3231304
10605C231304k9121M60086o1551j40179L4993j50656n766K56687k98968K69268
$$ 3231304 3202183 3662269 3600718 3460539 3495532 3344876 3339110 3595797 3296829 3566097
10595C566097n52079P10673o318l76166l43502J35330l11117K70728j66964J58537
$$ 3566097 3014018 3724691 3718373 3342207 2998705 3134035 2822918 3093646 2926682 3085219
10585C085219Q49171n25206n28959N43096l82021O29849m61984k8951L35977j29791
$$ 3085219 3934390 3409184 2880225 3423321 3041300 3671149 3209165 3180214 3516191 3386400
10575C386400k49956N96525K98326n99784K08386K14940M87n98875J79970R8020
$$ 3386400 3136444 3732969 4031295 3431511 3639897 3854837 3855324 3256449 3436419 3534439
10565C534439R9901n51482P01319m01097r2425j61834L94410l34959O0547l45844
$$ 3534439 3634340 3082858 3784177 3383080 3290655 3128821 3523231 3188272 3248819 2902975
10555B902975P1409j74240O3444j59200J03810K5449j52909j68491J39683J29073
$$ 2902975 2974384 2800144 2863588 2704388 2808198 2833647 2680738 2512247 2651930 2781003
10545B781003R9794j06902L16824j69489n85844N78165r820l93226K50423J8674
$$ 2781003 2880797 2773895 3090719 2921230 2335386 2913551 2903731 2510505 2760928 2779602
$$ [...]
##END NTUPLES=NMR SPECTRUM
##END=
