##TITLE=Coffee green (ROVE100D + 1.5mL buffer 50/50,  450uL extracto + 50uL (D2O+TMS))
without heating, vortex and centrifuged, temperature 0oC.
##JCAMPDX= 6.0         $$ Bruker NMR JCAMP-DX V2.0
##DATA TYPE= NMR SPECTRUM
##DATA CLASS= NTUPLES
##ORIGIN= Bruker BioSpin GmbH
##OWNER= Administrator
$$ 1.72 TOPSPIN		Version 2.1
$$ 2012-05-22 16:17:42.512 -0700  Administrator@X
$$ Compression mode = diff/dup
##.OBSERVE FREQUENCY= 400.13188198
##.OBSERVE NUCLEUS= ^1H
##.ACQUISITION MODE= SIMULTANEOUS (DQD)
##.ACQUISITION SCHEME= undefined
##.AVERAGES= 64
##.DIGITISER RES= 22
##SPECTROMETER/DATA SYSTEM= spect
##.PULSE SEQUENCE= noesygppr1d
##.SOLVENT NAME= H2O+D2O
##.SHIFT REFERENCE= INTERNAL, H2O+D2O, 1, 14.97969
##AUDIT TRAIL= $$ (NUMBER, WHEN, WHO, WHERE, PROCESS, VERSION, WHAT)
$$ ##TITLE= Audit trail, TOPSPIN		Version 2.1
$$ ##JCAMPDX= 5.01
$$ ##ORIGIN= Bruker BioSpin GmbH
$$ ##OWNER= Administrator
$$ $$ C:\Bruker\TOPSPIN/data/jwist/nmr/11-coffee-green-quantification-2/381/pdata/1/auditp.txt
$$ ##AUDIT TRAIL=  $$ (NUMBER, WHEN, WHO, WHERE, PROCESS, VERSION, WHAT)
(   1,<2011-11-18 17:32:29.216 -0500>,<Administrator>,<TOPSPIN>,<go>,<TOPSPIN 2.1>,
      <created by zg
	started at 2011-11-18 17:23:34.622 -0500,
	POWCHK enabled, PULCHK disabled,
       configuration hash MD5:
       DA 63 81 1B EF 4C B5 72 B4 DF EA D9 B4 DB 4C 08
       data hash MD5: 64K
       87 BE 59 4B 5D 21 AA 2C 5C 1A 09 23 B1 B0 54 D5>)
(   2,<2011-11-18 17:33:27.122 -0500>,<Administrator>,<TOPSPIN>,<proc1d>,<TOPSPIN 2.1>,
      <Start of raw data processing
       efp LB = 0 FT_mod = 6 PKNL = 1 PHC0 = 0 PHC1 = 0 SI = 32K 
       data hash MD5: 32K
       C7 76 F8 4F F6 21 3B 30 60 CC 41 27 E1 AB ED 09>)
(   3,<2011-11-18 17:33:27.497 -0500>,<Administrator>,<TOPSPIN>,<proc1d>,<TOPSPIN 2.1>,
      <pk PHC0 = 22.47253 PHC1 = 0 
       data hash MD5: 32K
       4E 72 1F BD DE B9 21 9A B3 FA 18 9F 57 33 9A AC>)
$$ ##END=
$$ 
$$ $$ hash MD5
$$ $$ BB E5 56 90 AA B5 F5 7A 42 E8 4F CB 99 13 0C 8A
##$RELAX= 
##$RELAX= 
##$RELAX= 
##$RELAX= 
##$RELAX= 
$$ Bruker specific parameters
$$ --------------------------
##$DU= <Z:>
##$EXPNO= 381
##$NAME= <11-coffee-green-quantification-2>
##$PROCNO= 1
##$TYPE= <nmr>
##$USER= <jwist>
##$ACQT0= -8.17975531651648
##$AMP= (0..31)
100 100 100 100 100 100 100 100 100 100 100 100 100 100 100 100 100 100
100 100 100 100 100 100 100 100 100 100 100 100 100 100
##$ANAVPT= -1
##$AQSEQ= 0
##$AQ_mod= 3
##$AUNM= <au_prof>
##$AUTOPOS= <>
##$BF1= 400.13
##$BF2= 400.13
##$BF3= 400.13
##$BF4= 400.13
##$BF5= 400.13
##$BF6= 400.13
##$BF7= 400.13
##$BF8= 400.13
##$BYTORDA= 0
##$CFDGTYP= 0
##$CFRGTYP= 9
##$CHEMSTR= <none>
##$CNST= (0..63)
1 1 145 1 1 1 1 1 1 1 1 1 1 1 1 1 1 1 1 1 1 1 1 1 1 1 1 1 1 1 1 1 1 1 1
1 1 1 1 1 1 1 1 1 1 1 1 1 1 1 1 1 1 1 1 1 1 1 1 1 1 1 1 1
##$CPDPRG= <>
##$CPDPRG1= <>
##$CPDPRG2= <>
##$CPDPRG3= <>
##$CPDPRG4= <mlev>
##$CPDPRG5= <mlev>
##$CPDPRG6= <mlev>
##$CPDPRG7= <mlev>
##$CPDPRG8= <mlev>
##$CPDPRGB= <>
##$CPDPRGT= <>
##$D= (0..63)
$$ [...]
##$TP= (0..7)
150 150 150 150 150 150 150 150
##$TP07= 0
##$TPNAME0= <>
##$TPNAME1= <>
##$TPNAME2= <>
##$TPNAME3= <>
##$TPNAME4= <>
##$TPNAME5= <>
##$TPNAME6= <>
##$TPNAME7= <>
##$TPOAL= (0..7)
0.5 0.5 0.5 0.5 0.5 0.5 0.5 0.5
##$TPOFFS= (0..7)
0 0 0 0 0 0 0 0
##$TUNHIN= 0
##$TUNHOUT= 0
##$TUNXOUT= 0
##$USERA1= <user>
##$USERA2= <user>
##$USERA3= <user>
##$USERA4= <user>
##$USERA5= <user>
##$V9= 5
##$VALIST= <valist>
##$VCLIST= <CCCCCCCCCCCCCCC>
##$VD= 0
##$VDLIST= <DDDDDDDDDDDDDDD>
##$VPLIST= <PPPPPPPPPPPPPPP>
##$VTLIST= <TTTTTTTTTTTTTTT>
##$WBST= 2048
##$WBSW= 25
##$XGAIN= (0..3)
0 0 0 0
##$XL= 0
##$YL= 0
##$YMAX_a= 4912654
##$YMIN_a= -1743717
##$ZGOPTNS= <>
##$ZL1= 120
##$ZL2= 120
##$ZL3= 120
##$ZL4= 120
##$ABSF1= 0
##$ABSF2= 0
##$ABSG= 0
##$ABSL= 0
##$ALPHA= 0
##$AQORDER= 0
##$ASSFAC= 0
##$ASSFACI= 0
##$ASSFACX= 0
##$ASSWID= 0
##$AUNMP= <proc_prof1d>
##$AXLEFT= 0
##$AXNAME= <>
##$AXNUC= <1H>
##$AXRIGHT= 0
##$AXTYPE= 0
##$AXUNIT= <>
##$AZFE= 0.1
##$AZFW= 0.1
##$BCFW= 0
##$BC_mod= 0
##$BYTORDP= 0
##$COROFFS= 0
##$CY= 15
##$DATMOD= 1
##$DC= 0
##$DFILT= <>
##$DTYPP= 0
##$F1P= 0
##$F2P= 0
##$FCOR= 0.5
##$FTSIZE= 32768
##$FT_mod= 6
##$GAMMA= 0
##$GB= 0
##$INTBC= 1
##$INTSCL= 1
##$ISEN= 128
##$LB= 0
##$LEV0= 0
##$LPBIN= 0
##$MAXI= 10000
##$MC2= 0
##$MEAN= 0
##$ME_mod= 0
##$MI= 0
##$NCOEF= 0
##$NC_proc= -7
##$NLEV= 6
##$NOISF1= 0
##$NOISF2= 0
##$NSP= 0
##$NTH_PI= 0
##$NZP= 0
##$OFFSET= 14.97969
##$PC= 1
##$PHC0= 22.47253
##$PHC1= 0
##$PH_mod= 1
##$PKNL= yes
##$PPARMOD= 0
##$PPDIAG= 0
##$PPIPTYP= 0
##$PPMPNUM= 2147483647
##$PPRESOL= 1
##$PSCAL= 4
##$PSIGN= 0
##$PYNMP= <proc.py>
##$REVERSE= no
##$SF= 400.13
##$SI= 32768
##$SIGF1= 0
##$SIGF2= 0
##$SINO= 400
##$SIOLD= 32768
##$SPECTYP= <>
##$SREGLST= <1H.CDCl3>
##$SSB= 0
##$STSI= 32768
##$STSR= 0
##$SW_p= 8223.68421052631
##$SYMM= 0
##$S_DEV= 0
##$TDeff= 65536
##$TDoff= 0
##$TI= <>
##$TILT= no
##$TM1= 0
##$TM2= 0
##$TOPLEV= 0
##$USERP1= <user>
##$USERP2= <user>
##$USERP3= <user>
##$USERP4= <user>
##$USERP5= <user>
##$WDW= 1
##$XDIM= 32768
##$YMAX_p= 448053430
##$YMIN_p= -150273209
##$CURPLOT= <Network HP LaserJet P1505>
##$CURPRIN= <$Network HP LaserJet P1505>
##$DFORMAT= <normdp>
##$LAYOUT= <+/1D_H.xwp>
##$LFORMAT= <normlp>
##$PFORMAT= <normpl>
##$SURQMSG= 1
$$ End of Bruker specific parameters
$$ ---------------------------------
##NTUPLES= NMR SPECTRUM
##VAR_NAME=  FREQUENCY,     SPECTRUM/REAL,   SPECTRUM/IMAG
##SYMBOL=    X,             R,               I
##VAR_TYPE=  INDEPENDENT,   DEPENDENT,       DEPENDENT
##VAR_FORM=  AFFN,          ASDF,            ASDF
##VAR_DIM=   32768,         32768,           32768
##UNITS=     HZ,            ARBITRARY UNITS, ARBITRARY UNITS
##FACTOR=    0.250966925370066, 1,           1
##FIRST=     8223.43324360094, 285277,       -579044
##LAST=      0,             71709,           -495939
##MIN=       0,             -150273209,      0
##MAX=       8223.43324360094, 448053430,    0
$$ Real data points
##PAGE= N=1
##DATA TABLE= (X++(R..R)), XYDATA
$$ [...]
19447B536200P4333K80107m26559K71464n67194L37585J88635k70981J1101j84804
19437B249887j52652K66094M70024n36958m45485Q93592m37839k12039L54487
19428B449111j42824j43501J61260j21835n0893J71100m8132m8187p1111p0382
19418B084606K36980j97450j19575J79339l7286K26928m88325J29434R4524k4030
19408B085145J39445R9243k66922M5567K76030k36266O4343k46784j74037L47950
19398B133714J59721m18654N3648J17733k6201k0272q4885k10428o041N94480
19388B292815K05808l27119k43846J68704r8086K42127k54541k78927N08818L4452
19378B250205l16437P2175l11095M05239l13466N2313O8864K14891m13947r3099
$$ plain form
19447 2536200 2610533 2890640 2464081 2735545 2168351 2505936 2694571 2423590 2434691 2249887
19437 2249887 2097235 2363329 2833353 2296395 1850910 2744502 2306663 2094624 2449111
19428 2449111 2306287 2162786 2324046 2202211 2151318 2322418 2274286 2226099 2154988 2084606
19418 2084606 2321586 2124136 2004561 2183900 2146614 2373542 1885217 2014651 2109175 2085145
19408 2085145 2224590 2323833 2056911 2102478 2378508 2142242 2206585 1959801 1785764 2133714
19398 2133714 2293435 1874781 1928429 2046162 2019961 1999689 1914804 1704376 1698335 2292815
19388 2292815 2498623 2171504 1927658 2096362 1998276 2240403 1985862 1706935 2215753 2250205
19378 2250205 1933768 2005943 1694848 2100087 1786621 1838934 1907798 2122689 1708742 1615643
19368A615643N97018k66490J68752m30570l43519M79266K18106m08151m5777M57479
19358B041757o00517L81817L53321n6550m12231J55836j22227N2967k61765L65435
19348A897843n98240L99278O42o02491R97093k73762k08865r584j01804L30728
19338A830838j4106j02086k40377L2774l5537l80028O38879j52625M23630p86184
19328A215178J267009m56564j58802J83966o10674L64375j78928k04260M61749
19319A883049k83363J58402n5284L84364n82503J67724L92264l43746k18578P67870
19309B270199l91736m28964K11406K51383l98523M27103m53919K7672q475O9297
19299A575443R9398q5799J62890j98565N14497l28829l27609J90702N54003n68152
$$ plain form
19368 1615643 2212661 1946171 2114923 1684353 1340834 1820100 2038206 1630055 1584278 2041757
19358 2041757 1441240 1823057 2176378 2119828 1707597 1863433 1741206 1794173 1532408 1897843
19348 1897843 1299603 1698881 1699523 1097032 2094125 1820363 1611498 1601914 1500110 1830838
19338 1830838 1816732 1714646 1474269 1507043 1471506 1091478 1730357 1577732 2001362 1215178
19328 1215178 2482187 2025623 1866821 2050787 1440113 1804488 1625560 1421300 1883049
19319 1883049 1599686 1758088 1702804 2087168 1504665 1672389 2064653 1720907 1502329 2270199
19309 2270199 1878463 1449499 1660905 1912288 1513765 1940868 1486949 1514621 1506146 1575443
19299 1575443 1674841 1589042 1751932 1553367 2067864 1739035 1411426 1602128 2156131 1587979
19289A587979R0392n16021Q42577j83700j09186R3252O5381k16674m4897K9434
19279A638537J82438j90828K4903K67823n03121N9900L38266k91141L33368L22956
19269B183101o70510L20710m7798M4216M66389p81480J99863L33355m9338k47673
19259A750835L68165k01110J76373m78132J29726l98314K4084K24068M44003K8799
19249B068497k31328l00026M19963k62145Q0915K31733J76210P70800K76362r6621
19239C134360k37760J96101m32981P11001l40003o02111K44675k97170m37012
19230A939100M08819p32856J92046l49662L31636N5110j40522l30546L59205p5347
19220A656983k66989K48296K42493q62171K79547K61195l4565K54145r5294l54358
$$ plain form
19289 1587979 1678371 1162350 2004927 1821227 1712041 1805293 1870674 1654000 1609103 1638537
19279 1638537 1820975 1630147 1655050 1922873 1419752 1479652 1817918 1526777 1860145 2183101
19269 2183101 1512591 1833301 1785503 1829719 2296108 1514628 1714491 2047846 1998508 1750835
19259 1750835 2119000 1917890 2094263 1616131 1745857 1347543 1371627 1595695 2039698 2068497
19249 2068497 1837169 1537143 1957106 1694961 1775876 2007609 2183819 2954619 3230981 3134360
19239 3134360 2896600 3092701 2659720 3370721 3030718 2428607 2673282 2376112 1939100
19230 1939100 2347919 1615063 1807109 1457447 1789083 1844193 1703671 1373125 1732330 1656983
19220 1656983 1389994 1638290 1880783 1018612 1298159 1559354 1524789 1778934 1683640 1329282
19210A329282P9550K18741l77647Q08347m54922j86001j72728K40680J69522l3687
19200A621137j21158J61785Q2172n81612K36590J71739K82590n90122L87472p3503
19190A577090J75106m1139o33300P94621m42348n5128J9532L1010m6325P5077
19180A454196R5306k26132L97349Q5123l79517J99347j84365M48145p55401L28061
19170A462112M0525M4783j30858k28803L60757r2243K8681k95307J14319N40M49776
19159A754282n52958M06852n3564L42221n12486k52365O57992j62081m2524j21561
19149A463808J44778Q6639q1260o19951K80800M87462l25543O68254k96427l76931
19139A431629N10760m32217M54183N9527m19023N29401m92672R02465J06652q7294
$$ plain form
19210 1329282 1408832 1627573 1249926 2058273 1603351 1417350 1244622 1485302 1654824 1621137
19200 1621137 1499979 1661764 1743936 1162324 1398914 1570653 1853243 1263121 1650593 1577090
19190 1577090 1752196 1711057 1077757 1872378 1430030 1374902 1394434 1425444 1379119 1454196
19180 1454196 1549502 1323370 1720719 1805842 1426325 1625672 1441307 1889452 1134051 1462112
19170 1462112 1502637 1547420 1416562 1187759 1548516 1456273 1484954 1189647 1303966 1304506 1754282
19159 1754282 1201324 1608176 1554612 1896833 1384347 1131982 1789974 1627893 1585369 1463808
19149 1463808 1608586 1695225 1613965 994014 1274814 1762276 1436733 2104987 1808560 1431629
19139 1431629 1942389 1510172 1964355 2023882 1604859 2134260 1641588 2544053 2650705 2563411
19129B563411L12274J39075N58630J11249R5503K84463J72136l74118L31660M49776
19119D644059p77879J68696J3964Q7558o39028K28299J68804m79182l97674l46016
19109B671601j74222n4741j50353J77185m42473j10828K63004J76774j11834M9653
19099B293766O1415K02986l31060L21118k65114K2900P3926m3383K56902j43162
19089B450294L49276n7638J88561m88200O6683R4880l62039M19338r2321J34471
19079B703305K5604J73728M18182l90416r3527J08055K91863l08073J50682n47
19069C078856K68141J46090N56750N76665Q62929J224492P55762K286749J557609
19060A1314043J603512J140112K6926J156370K11496k41083p75165r61771j783699
$$ plain form
19129 2563411 2875685 3014760 3573390 3684639 3780142 4064605 4236741 3862623 4194283 4644059
19119 4644059 3866180 4034876 4048840 4136398 3497370 3725669 3894473 3415291 3017617 2671601
19109 2671601 2497379 2442638 2292285 2469470 2026997 1916169 2179173 2355947 2244113 2293766
19099 2293766 2355181 2558167 2227107 2548225 2283111 2306011 2379937 2336554 2593456 2450294
19089 2450294 2799570 2741932 2930493 2442293 2508976 2603856 2241817 2661155 2568834 2703305
19079 2703305 2728909 2902637 3320819 2930403 2836876 2944931 3236794 2928721 3079403 3078856
19069 3078856 3346997 3493087 4049837 4626502 5489431 6713923 7469685 9756434 11314043
19060 11314043 12917555 14057667 14084593 15240963 15452459 15211376 14436211 13474440 11690741
19051A1690741r12632j521596j205138o02414r62126n07863m74353P78705O18332
19042F901656J564412J038302J340734J208587M62240N29091m58408j93303j320734
19033A1072577o73861j477010j230294o65580r05318q10969j53168k79892n04981
19024D371504L15847k33213K12775j86822P46611l46096Q51232P04321J219516
19015G655675Q52049J811649J925673J453163J254635O74448L12775O7346k50386
19006A5757027j043969j276678j108616j641083j516642p56284J07616K61295
18998H782666J292355J101743R35843M67387R47994J60289l8630j079655n75738
18989A1994254j035529j077243j492609j527128n98135j92776p90668K78008o2624
$$ plain form
19051 11690741 10778109 9256513 8051375 7448961 6486835 5978972 5504619 6283324 6901656
19042 6901656 8466068 9504370 10845104 12053691 12515931 13045022 12586614 12393311 11072577
19033 11072577 10398716 8921706 7691412 7025832 6120514 5309545 5156377 4876485 4371504
19024 4371504 4687351 4454138 4666913 4480091 5226702 4880606 5731838 6436159 7655675
19015 7655675 8507724 10319373 12245046 13698209 14952844 15627292 15940067 16007413 15757027
19006 15757027 14713058 13436380 12327764 10686681 9170039 8413755 8521371 8782666
18998 8782666 10075021 11176764 12112607 12579994 13527988 13688277 13649647 12569992 11994254
18989 11994254 10958725 9881482 8388873 6861745 6263610 6070834 5280166 5558174 5495550
18980E495550R22739J084214J404008J516509J000379M21883P03183j18K29995
18971A2778342n09234q82586j289617p63171j382234m80738p80069L2489l46033
18962F377149j88841M90917l20358M72160J61528N61856R26814P57823J638187
18953A0877235J045948K074038L104231L707982L118758M308460M917988N717722
18945C8872362N179792N550588L721954K978463J318447J09908j856636k576969
18937E3297909m589174m709366n489035n878068n204404m930257l648607k971914
18929A5877084k612687j737466j764391j433192n02949q91498p24557o88692j50162
18920E371490m07582l57209M640n91890K58826j00847m9093k44298L31443k66828
$$ plain form
18980 5495550 6418289 7502503 8906511 10423020 11423399 11845282 12548465 12548347 12778342
18971 12778342 12269108 11386522 10096905 9333734 7951500 7470762 6690693 6723182 6377149
18962 6377149 6188308 6679225 6358867 6831027 6992555 7554411 8481225 9239048 10877235
18953 10877235 11923183 13997221 17101452 20809434 23928192 28236652 33154640 38872362
18945 38872362 44052154 49602742 53324696 56303159 57621606 57731514 55874878 53297909
18937 53297909 48708735 43999369 38510334 32632266 27427862 22497605 18848998 15877084
18929 15877084 13264397 11526931 9762540 8329348 7826399 6934901 6210344 5521652 5371490
18920 5371490 4963908 4606699 4611339 4019449 4278275 4177428 4128335 3884037 4215480 3948652
18910C948652M0060l8423k88147K05567Q3780m8024p23617J085458k13981j36806
18900C914519N27798L29945l96198P03760N8324K46026K44410L39693M94377K83003
18890F745657P40737Q80565J541196P25412K135361K624623L074102M111491M654803
18881B7233947N705974M582280M037962L174327K419234K96458o63391k737231
18873D4049560l685192m256543m259570n068048m731843m077215l490130k019136
18865A2461883k230466j327575j813372k44480m01409o99043q00244m94781o30049
18856C820464J7087k43735j22582o11445j88076M79655j74218n09583r7490J57271
18846B527348l34600M08356J27234l25338l48143P07155q36716j41508j5618N04332
$$ plain form
18910 3948652 3988712 3950289 3662142 3867709 3951489 3903465 3179848 4265306 4051325 3914519
18900 3914519 4442317 4772262 4376064 5079824 5138148 5384174 5628584 5968277 6462654 6745657
18890 6745657 7486394 8366959 9908155 10633567 12768928 15393551 18467653 22579144 27233947
18881 27233947 32939921 37522201 41560163 44734490 47153724 47450182 46786791 44049560
18873 44049560 40364368 36107825 31848255 26780207 22048364 17971149 14481019 12461883
18865 12461883 10231417 8903842 7090470 6845990 6444581 5745538 4945294 4450513 3820464
18856 3820464 3837551 3593816 3471234 2859789 2671713 3151368 2977150 2467567 2370077 2527348
18846 2527348 2192748 2601104 2728338 2403000 2054857 2762012 1925296 1783788 1768170 2272502
18836B272502k69237k91890q7361K02100N96459j010930j18272N62034j5956j54747
18826A684702j54672Q9467O2696J6539L38063j36488k83222k83551j85843M09644
18816A557335j58493M56271m26712K16080p7956o4855L88N0618k8084k69298M0515
18805A295809n2022M06239q6621j26789L6109J15801Q1289j91063M70667l46600
18795A602819k57408K98837m28168J24185j27709M02740n9446R9706m43962P18488
18785A930082m05466K01219j77359J19456M4695K31072l69634L34021J88929l92069
18775A704946l59004P38314l05174K23523J1033l39012P38977o68269K5278J96886
18765A967498K29061J41648q58394L66903L47564Q7493l27532j715m42105J78326
$$ plain form
18836 2272502 2003265 1711375 1624014 1826114 2422573 1411643 1293371 1855405 1839449 1684702
18826 1684702 1530030 1619497 1682193 1698732 2036795 1900307 1617085 1333534 1147691 1557335
18816 1557335 1398842 1855113 1428401 1644481 1566525 1501670 1502058 1552676 1524592 1255294 1295809
18805 1295809 1243787 1650026 1563405 1436616 1472725 1588526 1669815 1478752 1949419 1602819
18795 1602819 1345411 1644248 1216080 1340265 1212556 1615296 1555850 1655556 1211594 1930082
18785 1930082 1524616 1725835 1548476 1667932 1712627 1943699 1574065 1908086 2097015 1704946
18775 1704946 1345942 2084256 1779082 2002605 2013638 1674626 2413603 1745334 1770612 1967498
18765 1967498 2196559 2338207 1479813 1846716 2194280 2281773 1954241 1952526 1510421 1688747
18755A688747M08967k27152n83915P15152n59783O59029n75126k5093K67070j63164
18745A604732j1879l4130L92720j16424m23008j1552J48080O7625o93370K43868
18735A166662J69545J09236J51745M83177n33069K87775l3939l65851P6316K49638
18725A761235l6383j56935K45824l56834M68107n09060K44846o9662j62576m93480
18715I35082Q16456K61167j08692p77985M77553k84737J76504J5137K61394j92142
18705A579737o0286L99271j75399j48897K16665j43751J42838O1155j46291L05395
18695B030437l46118K15288Q8788o27550K27973J22842m2845K48859m17775J52029
18685A651928k23565k56977O82872m76360J76867K87654n89909J76490K48485
$$ plain form
18755 1688747 2097714 1870562 1286647 2001799 1442016 2101045 1525919 1500826 1767896 1604732
18745 1604732 1592853 1558723 1951443 1835019 1412011 1400459 1548539 1616164 922794 1166662
18735 1166662 1336207 1445443 1597188 2080365 1547296 1835071 1801132 1435281 1511597 1761235
18725 1761235 1724852 1567917 1813741 1456907 1925014 1415954 1660800 1591138 1428562 935082
18715 935082 1751538 2012705 1904013 1126028 1603581 1318844 1495348 1510485 1771879 1579737
18705 1579737 1519451 1918722 1743323 1594426 1811091 1667340 1810178 1871333 1725042 2030437
18695 2030437 1684319 1899607 1988395 1360845 1588818 1711660 1668815 1917674 1499899 1651928
18685 1651928 1428363 1171386 1854258 1377898 1554765 1842419 1252510 1429000 1677485
18676A677485m8457L3019l81522m46801M93937l64138N68535o13962R02354o96667
18666A123783Q8450J32443m87456J53582K86502o4006m6078J72657j82063J32011
18656A309825m1659l37379J14624J81357J54443Q6509o13262K81113M24440j08283
18646A451728M3604R1590j99460P6014J17666j28913l15600K37674J68065k44261
18636A298107M96608q21453N09115q8710P205L62402n25905K14817J21654k65837
18626A308003n3766P5559p4718Q6337p5475M61797n9781j35841M7650p6812J86880
18615A689833l0196M0135k5856n21863K73649l8849L5113M91852j98045n9487
18605A656286j04686k1504K2810l21854J43268K81585j14714l07137J92927k43257
$$ plain form
18676 1677485 1629028 1662047 1280525 833724 1327661 963523 1532058 918096 1820450 1123783
18666 1123783 1212233 1344676 857220 1010802 1297304 1233298 1187220 1359877 1177814 1309825
18656 1309825 1268166 930787 1045411 1226768 1381211 1467720 854458 1135571 1560011 1451728
18646 1451728 1495332 1586922 1387462 1463476 1581142 1452229 1136629 1374303 1542368 1298107
18636 1298107 1794715 973262 1482377 1393667 1400872 1763274 1237369 1452186 1573840 1308003
18626 1308003 1254237 1329796 1255078 1341415 1265940 1727737 1667956 1532115 1579765 1502953 1689833
18615 1689833 1659637 1699772 1673916 1152053 1425702 1386853 1421966 1913818 1715773 1656286
18605 1656286 1551600 1530096 1552906 1231052 1374320 1655905 1541191 1234054 1426981 1183724
18595A183724L01232J1100L57590p22973L16626k83340O48323n20069m14617M16053
18585A293649j32953M66132l49608k20725K90062K51738m34559N27537l76526
18576A314747K15156l95002J60003J58048n12115L04567j26211K58056Q3026j1238
18566A449037k1416n18581M66532O96930p61636K70898n18342J63300k560O768
18556A230930M38327p8075k83964J28994J4019q930K81832k3193k11715P51537
18546B239762A056463P00588o99038J70899N13770p46159K38235L7239r8230p9710
18536A094057k01862o5922N41060l10398l81847O08518j01667J5612j48444m6828
18526A002279M76776E54356O61761j60924j99401L73142m63595L71598j00389
$$ plain form
18595 1183724 1484956 1496056 1853646 1130673 1447299 1163959 1812282 1292213 877596 1293649
18585 1293649 1160696 1626828 1277220 1056495 1346557 1598295 1163736 1691273 1314747
18576 1314747 1529903 1134901 1294904 1452952 940837 1245404 1119193 1377249 1460275 1449037
18566 1449037 1427621 909040 1375572 2072502 1310866 1581764 1063422 1226722 1224162 1230930
18556 1230930 1669257 1591182 1307218 1436212 1450231 1441301 1723133 1699940 1488225 2239762
18546 2239762 1056463 1757051 1058013 1228912 1742682 996523 1234758 1271997 1173767 1094057
18536 1094057 892195 826273 1367333 1056935 675088 1283606 1181939 1197551 1049107 1002279
18526 1002279 1479055 554356 1216117 1055193 855792 1228934 765339 1136937 1036548
18517A036548J51064j79791K50752j56347k65984N3390j98012l446L64172m67768
18507E84578L11079O67380o57010K89442l00642M55768j07194q5802j60424Q3532
18497A080707M9298j60775L07680m82076J84807L83644m21843k45881R48671m58095
18487A186137k60703J10462k43984M42399j71335L7502k65502J20204L17099l03670
18477I68609j50846J81202J49905J43034p7033j78023L10375n32486L47150Q2033
18467A243920k2931J6663j47108j08631k33115L44946J84894m25094q1602L00073
18457A072015K57129O372o7546j60548J53611E74460L57874M82646l55293k12157
18447H47530N01677q5807l05634K1113J7140J77749j10286m85033L36771j88809
$$ plain form
18517 1036548 1187612 1007821 1258573 1102226 836242 889632 691620 688174 1052346 584578
18507 584578 895657 1563037 906027 1195469 894827 1350595 1243401 1157599 997175 1080707
18497 1080707 1130005 969230 1276910 794834 979641 1363285 941442 695561 1644232 1186137
18487 1186137 925434 1035896 791912 1234311 1062976 1100478 834976 955180 1272279 968609
18477 968609 817763 998965 1148870 1291904 1214871 1036848 1347223 814737 1161887 1243920
18467 1243920 1220989 1237652 1090544 981913 748798 1093744 1278638 853544 771942 1072015
18457 1072015 1329144 1335516 1267970 1107422 1261033 574460 932334 1414980 1059687 847530
18447 847530 1349207 1263400 957766 978879 996019 1173768 1063482 578449 915220 726411
18437G26411J87011K01058J75666k41491K04994m72615M46861k20857j88431N99085
18427A417692j78037p15k97034j02585O7629L7371Q9259l17585L30587O19648
18417A666230l71862l1154O471o22817P77443o58592M63729o4647l3853l65793
18407G65155K02383k927k53253L55736M5547M8581n73333M31546j34209R66226
18397A851452q75069J16207O0121Q3736N81803p60268J02710m4110J63715j07789
18387A172508j92157k26866K70694M84892n07495J74641j80097M3922K10898l57773
18377H93167M23003l78769K89428l86025O8466B07531K77055P79651l67237j05291
18367G91709J25575K02425C16990P94289k84544J25755p7536Q9022J06679j73450
$$ plain form
18437 726411 913422 1114480 1290146 1048655 1253649 781034 1227895 1007038 818607 1417692
18427 1417692 1239655 1238940 941906 839321 906950 944321 1033580 715995 1046582 1666230
18417 1666230 1294368 1263214 1269685 646868 1424311 765719 1229448 1164801 1130948 765155
18407 765155 967538 964611 711358 1067094 1112641 1161222 587889 1019435 885226 1851452
18397 1851452 976383 1092590 1152711 1236447 1818250 1057982 1160692 1116582 1280297 1172508
18387 1172508 980351 753485 1024179 1509071 1001576 1176217 996120 1040042 1250940 893167
18377 893167 1316170 937401 1226829 840804 909270 207531 484586 1264237 897000 791709
18367 791709 917284 1119709 316990 1111279 826735 952490 874954 963976 1070655 897205
18357H97205K04282R865n1865k4928K76771j47189j81953K09731L3526l52746
18347H72699J10574J28313J1592J69715p7152k78230j30306L83740k23382l04135
18337F63428P48300k66020J70451l79231m3794K55192j17879L04154l27565N500
18327A012536j7509l26635p4600N33012k39566J71258n7877j36591L5377J02422
18317A001827N4915k61742M71905m06393P2509k30773J04018K83391L9869M11067
18307A540593m67853J56419n96573K19738J78366j02266M75136l0909m28173J485
18297I45963J5263K04962N7249k91658P2654K50177q1798j80398k36415L70716
18287A126715L08789k22895m2056J02910k578R0088E83791M52382M22897o2559
$$ plain form
18357 897205 1101487 1111352 1059487 1034559 1311330 1164141 982188 1191919 1225445 872699
18347 872699 983273 1111586 1123178 1292893 1215741 937511 807205 1190945 967563 663428
18337 663428 1411728 1145708 1316159 936928 893134 1148326 1030447 1334601 1007036 1012536
18327 1012536 995027 668392 593792 1126804 887238 1058496 1000619 864028 899405 1001827
18317 1001827 1056742 795000 1266905 860512 933021 702248 806266 1089657 1129526 1540593
18307 1540593 1072740 1229159 632586 852324 1030690 928424 1403560 1372651 944478 945963
18297 945963 961226 1166188 1223437 931779 1004433 1254610 1172812 992414 755999 1126715
18287 1126715 1435504 1212609 1170553 1273463 1270885 1360973 583791 1036173 1459070 1396511
18277A396511m85779J79716j21357N6918K24672k85896J39748K333R9755o7051
18267A139570L26008n39835j09668m9019L15320m77128L94826k78116M64356n00800
18257F85514M68056j0124k7452k07021P1551q9395k88658Q26504k10777n5773
18247A162425j46570J80728J209L64963E73038Q21349R0169j97197L7775J94143
18237A519277k37035m50777k25766L34411l84124Q23701l50328k73623N47523
18228A303259l46426P0396l32672L36628k5670k509k21452J88951k6997M6168
18218I89676K35674l08436K80206j81889Q4988L07439m40057m3858K58284J56253
18208A338280k48347M6643l57945K31720k7213j22357K00477M82320n66545j20776
$$ plain form
18277 1396511 910732 1090448 969091 1026009 1250681 964785 1104533 1106866 1206621 1139570
18267 1139570 1465578 925743 816075 767056 1082376 605248 1000074 721958 1186314 685514
18257 685514 1153570 1143446 1115994 908973 980524 891129 602471 1428975 1218198 1162425
18247 1162425 1015855 1196583 1197792 1562755 573038 1394387 1484556 1287359 1325134 1519277
18237 1519277 1282242 831465 605699 940110 555986 1379687 1029359 755736 1303259
18228 1303259 956833 1027229 694557 1031185 1005515 1003006 781554 970505 943508 989676
18218 989676 1225350 916914 1197120 1015231 1100219 1407658 967601 923743 1182027 1338280
18208 1338280 1089933 1136576 778631 1010351 983138 860781 1061258 1543578 977033 856257
18198H56257J24004J27831j69193K90045j37596L1633L24493j74090F27809Q1799
18188G09608N90588m04250J49307j83660l6421L99147l69358R4992l49541J95013
18178G95425J81475J22295k63945l0151O9425j23323R4873M49976n86814J65230
18168H74466J51167J77882j24629k26926J9579Q8525K67466m23501J61333P1077
18158A036439j54380k38048K64619J82945J43049n09588j2286K54249M2475l82154
18148F27320O68266r3357k72331M9642q5059M8309L07807j22669m10201M23045
18138A140772l44188M9295K00690j5429k61234R3154L8490J44624j72984k50738
18128F22452N43016j13610J75203m14330L46210j05908D52585K65065j17342Q14755
$$ plain form
18198 856257 980261 1108092 938899 1228944 1091348 1122981 1447474 1273384 627809 709608
18188 709608 1300196 895946 1045253 861593 825172 1224319 854961 949953 600412 795425
18178 795425 976900 1099195 835250 805099 874524 751201 846074 1296050 709236 874466
18168 874466 1025633 1203515 1078886 851960 871539 960064 1227530 804029 965362 1036439
18158 1036439 882059 644011 908630 1091575 1234624 725036 712750 966999 1009474 627320
18148 627320 1295586 1202229 929898 979540 894481 942790 1250597 1127928 717727 1140772
18138 1140772 796584 845879 1046569 1031140 769906 863060 901550 1046174 873190 622452
18128 622452 1165468 1051858 1227061 812731 1158941 1053033 452585 717650 600308 1415063
18118A415063m25060L2981j39731O5259j82703j43789M01371N8911l7459l36891
18108G07952K86106K78087l33115D40154K66854M14565l98206J57326J19804j7497
18098I83000k55392K57575j76501K64312m98669L96549Q4747L66427l94759k08704
18088H18585N11895F57138N73153l81032l0824r0269J82587k34810L35074j25885
18078H85132J02256p1767K41232j09101l32167J78441l69997O24067j13260o7718
18068I67118j34959L37429m11272K26071j21570C71921M41513M3961J07459K67945
18058A232799L4874k82129m44636N8169M89887j67946k08210K73034j18025R8823
18048I66640N0061n8281j76170l2744k46035K5036A96734J102123l09624n3010
$$ plain form
18118 1415063 990003 1022984 883253 948512 765809 622020 1023391 1082302 1044843 707952
18108 707952 994058 1272145 939030 440154 707008 1121573 723367 880693 1000497 983000
18098 983000 727608 985183 808682 1072994 574325 970874 1055621 1422048 1027289 818585
18088 818585 1330480 657138 1230291 849259 818435 728166 910753 675943 1011017 885132
18078 885132 987388 915621 1156853 1047752 715585 894026 524029 1148096 1034836 967118
18068 967118 832159 1169588 758316 984387 862817 371921 813434 857395 964854 1232799
18058 1232799 1267673 985544 540908 599077 1088964 921018 712808 985842 867817 966640
18048 966640 1016701 958420 782250 749506 503471 528507 196734 1298857 989233 936223
18038I36223k70301C29224M73286L16296K30906m42745L526R5771L6726o1458
18028I81532j96717j53062K16075l5789j09163j93282P77511l06791k45899M59993
18018A194408n22678O40855m62121M6234k31987K06187J3518K2531C44073L89505
18008G33578l6963K69427m52420O00483L17934E33771L29123M0470L52796m29437
17998H26723P5446j8158P82231E72929J74608J38136J93541E25673K02233K90774
17988A018680j79422L4744M04816J49406k04575k1120j65400k82520O9464j24297
17978F99776Q45663p26763J87092m67293O68239n87919L23025M83865n23548D19245
17967A014563M13080l25579R5662n42144J42815J71166j1498J72094L6343k30795
$$ plain form
18038 936223 665922 329224 802510 1118806 1349712 906967 910493 1006264 1042990 981532
18028 981532 784815 631753 847828 812039 702876 509594 1287105 980314 734415 1194408
18018 1194408 671730 1312585 850464 896698 664711 870898 884416 906947 344073 733578
18008 733578 696615 966042 513622 1114105 1432039 533771 862894 903364 1256160 826723
17998 826723 902169 884011 1666242 572929 747537 885673 1079214 525673 727906 1018680
17988 1018680 839258 874002 1278818 1428224 1223649 1202529 1037129 754609 824073 699776
17978 699776 1545439 818676 1005768 538475 1206714 618795 941820 1425685 902137 419245
17967 1014563 1427643 1102064 1197726 655582 798397 969563 958065 1130159 1166502 935707
17957I35707L75746m65914L81493m54498K96783j12211J84836J45225m02692L51857
17947A236332n92020K06844K33364J49464J23276l71073r8191J66197J89242k30478
17937A012957M98817k77105O4531k33567J68517J66826R7647K03480p21961K62475
17927A242617P1725L67602j57859m82007N08062l79209K12187j5788K81006Q1436
17917A729772O8971l70009k0466j03432K50637J11758l30968J83477l38415J59755
17907A341080M65217j23760K5165k81912L46365k55127m2476J23906K35916o5036
17897A769338J09339l37417K1843M3541j20093K73704M04015l92112k43434R99602
17887B528326q37570L63554k51222L26437l92588K12672k16714P3149J65835N0134
$$ plain form
17957 935707 1311453 845539 1227032 772534 1069317 957106 1141942 1287167 884475 1236332
17947 1236332 644312 851156 1084520 1233984 1357260 986187 887996 1054193 1243435 1012957
17937 1012957 1511774 1234669 1299200 1065633 1234150 1400976 1498623 1702103 980142 1242617
17927 1242617 1314342 1681944 1524085 1042078 1550140 1170931 1383118 1367330 1648336 1729772
17917 1729772 1798743 1428734 1408268 1304836 1555473 1667231 1336263 1519740 1181325 1341080
17907 1341080 1806297 1682537 1707702 1425790 1772155 1517028 1474552 1598458 1834374 1769338
17897 1769338 1878677 1541260 1563103 1606644 1486551 1760255 2164270 1772158 1528724 2528326
17887 2528326 1690756 2054310 1803088 2129525 1736937 1949609 1732895 1806044 1971879 2022013
17877B022013j32655j16726O1219K50607L02882r70303P68896k9233M22907r15085
17867A664522M84649p6044j78428K82691l86112j31667j18845N3142M61624k36022
17857A819510J19296L51752n88262R4112j682J71447l47589R4298N4183m99301
17847A267764L94411p3637r4921k61197K17866j3121K30605J04168k94483J58684
17837A636139K13828j72565l95773J65843J50377K31474j85373m88691L72158
17828A527417k37307R2747o5052M83871n65829J54762M3696j9747L54547m10377
17818A358728L3832K84704j27526j36343J66949J26458l90753P38978k01102M590
17808A858515j48064j22146M07078l89020R6821n33267N35784q24314O78271L18061
$$ plain form
17877 2022013 1889358 1772632 1833851 2084458 2387340 1417037 2185933 2156700 2579607 1664522
17867 1664522 2149171 2073127 1894699 2177390 1791278 1659611 1540766 1593908 2055532 1819510
17857 1819510 1938806 2290558 1702296 1796408 1794726 1966173 1618584 1712882 1767065 1267764
17847 1267764 1662175 1588538 1493617 1232420 1450286 1437165 1667770 1771938 1477455 1636139
17837 1636139 1849967 1677402 1281629 1447472 1597849 1829323 1643950 1155259 1527417
17828 1527417 1290110 1382857 1317805 1801676 1235847 1390609 1434305 1414558 1769105 1358728
17818 1358728 1392560 1677264 1549738 1413395 1580344 1706802 1316049 2055027 1853925 1858515
17808 1858515 1710451 1588305 1995383 1606363 1703184 1169917 1705701 881387 1559658 1877719
17798A877719j01353l9208J94006j9283j82333l48833J11712j3176J1937m93197
17788I97991Q602L17635k96702L49147l43072P9452j18703J36375K22467l6627
17778A316565L28564l06139j79728M95023m89859K55748j84937j32976N1588m72125
17768F81724P83355q0567K09255l65149J14016o3760M54077q58847N34429L590
17758A412123j48378K05970l4168l21701K01128j24933L8716J69713k59757L02940
17748A441653k95207L4511L61505m04915L79605n19124K44759j07022M342L78699
17738A518806n04576N35424K42305n02184N93618o59804J6149j7178m2388P7902
17728A258074M54016n24256k42065K11491K79572j58406m46603M48410q2317L32348
$$ plain form
17798 1877719 1776366 1737158 1931164 1911881 1729548 1380715 1492427 1479251 1491188 997991
17788 997991 1006593 1324228 1027526 1376673 1033601 1113053 994350 1130725 1353192 1316565
17778 1316565 1645129 1338990 1159262 1654285 1164426 1420174 1235237 1102261 1153849 681724
17768 681724 1465079 1384512 1593767 1228618 1342634 1278874 1732951 874104 1408533 1412123
17758 1412123 1263745 1469715 1435547 1113846 1314974 1190041 1228757 1398470 1138713 1441653
17748 1441653 1146446 1180957 1542462 1137547 1517152 998028 1242787 1135765 1140107 1518806
17738 1518806 1014230 1549654 1791959 1289775 1883393 1223589 1239738 1222560 1180172 1258074
17728 1258074 1712090 1187834 945769 1157260 1436832 1278426 831823 1280233 1197916 1530264
17718A530264k12779p3811K6030o09237N33728j65513R5592J66393K22264m59014
17708A053917J16418K58734Q7416k67502q5709J28615l6974J9729K32896n65140
17698I42400M72276q0636j0253l68142j6878J29587L27243L7363l18143N1109
17688A165926k67404J13750K84332R2107o1089m94515P45231J0933l19569l5872
17678A233830M03407K2208R4084k79061N99214r91056K35574l11588P6127M94137
17668A576876j94842j40455M0422J43611J4165j13069K67523J14900l94382K14123
17658A528872N8952J90856l91036L00031J7424j22575k07117J29009m28702O68436
17648A744150j14549k62463O1102j50311J89692j08409P361M69117k73541r4611
$$ plain form
17718 1530264 1317485 1243674 1269704 660467 1194195 1028682 1124274 1290667 1512931 1053917
17708 1053917 1170335 1429069 1516485 1248983 1163274 1291889 1254915 1274644 1507540 942400
17698 942400 1414676 1334040 1323787 955645 938767 1068354 1395597 1432960 1114817 1165926
17688 1165926 898522 1012272 1296604 1388711 1327622 833107 1578338 1589271 1269702 1233830
17678 1233830 1637237 1659445 1753529 1474468 2073682 1082626 1318200 1006612 1082739 1576876
17668 1576876 1382034 1241579 1282001 1425612 1439777 1326708 1594231 1709131 1314749 1528872
17658 1528872 1587824 1778680 1387644 1687675 1705099 1582524 1375407 1504416 1075714 1744150
17648 1744150 1629601 1367138 1428240 1277929 1467621 1359212 1366573 1835690 1562149 1467538
17638A467538K53980k31639J01338K9131Q8967M68839k58914J40461K51958q09519
17628A502140K50719O37998r5406j30542L80976l97106N95079o82476K87050j72136
17618B176296m02208J088636j44745k54542J99190m39862L04708j09370Q202N56144
17608B982449l39312r7604n1144K4663M08824q82330Q50234l93627M30056k46856
17598B685353n39143N49917l0574J31634r9557k91200j12138N50769j32239l19789
17588B393033M3810j26261J98471M9953K91934k83753m09784L50828q8739j23794
17578B295698M87745n81791L70327M818l98434N43777j28001j86746j27529J0043
17568B289907L98426j28210m98218m5004L01905K02801n70966L09115J50712K93595
$$ plain form
17638 1467538 1721518 1489879 1591217 1620348 1709315 2178154 1919240 2059701 2311659 1502140
17628 1502140 1752859 2390857 2295451 2164909 2545885 2148779 2743858 2061382 2348432 2176296
17618 2176296 1774088 2862724 2717979 2463437 2662627 2222765 2527473 2418103 2426305 2982449
17608 2982449 2643137 2545533 2494389 2519052 2927876 2045546 2895780 2502153 2932209 2685353
17598 2685353 2146210 2696127 2665553 2797187 2697630 2406430 2294292 2845061 2712822 2393033
17588 2393033 2436843 2310582 2509053 2559006 2850940 2567187 2157403 2508231 2419492 2295698
17578 2295698 2783443 2201652 2571979 2576797 2178363 2722140 2594139 2407393 2279864 2289907
17568 2289907 2688333 2560123 2061905 2016901 2318806 2521607 1950641 2259756 2410468 2704063
17558B704063n59132J30694m0361o0238N29567r97044J11225M61142J72726p44989
17548A707653M05571m21973L72602Q41869o43763j74598O16921p88818K54166
17539B169630L83775O2414k21811O6201K79959k77685n90771M49127J22674m18006
17529B025507J36602m15221Q03137k58514J84521K71229k60084K49975n29541
17520B207611J70404J53843L2044J25729k17711k86638O95670K9831L02602j93728
17510C019657L5774L51477J98511l20021O0003J72267J94256r7052j24947L79843
17500C869768L3496J81189m67366L95737J33715N60349j38104M10291O77774K48129
17490E904978P61825O19916J350611J471921J933236N446282P303536J1652905
$$ plain form
17558 2704063 2144931 2275625 2235264 2175026 2704593 1707549 1818774 2279916 2452642 1707653
17548 1707653 2113224 1691251 2063853 2905722 2261959 2087361 2704282 1915464 2169630
17539 2169630 2553405 2615819 2394008 2460209 2740168 2462483 1871712 2320839 2443513 2025507
17529 2025507 2162109 1746888 2550025 2291511 2476032 2747261 2487177 2737152 2207611
17520 2207611 2378015 2531858 2563902 2689631 2471920 2185282 2880952 2910783 3213385 3019657
17510 3019657 3055431 3406908 3605419 3285398 3345401 3517668 3711924 3614872 3489925 3869768
17500 3869768 3903264 4084453 3617087 4012824 4146539 4706888 4568784 4979075 5656849 5904978
17490 5904978 6666803 7286719 8637330 10109251 12042487 17488769 24792305 36445210
17482C6445210J3448021J3724862J1360807P671543N150160J431411j222342m333205
17474H3676467p670445r306255j0143290r365941n965228j198125M688526R288964
17466E4004673J2293887J0700531P692206M580798K108646r10709m490752p640561
17458G8338719r602483j1887769j1766111j1235245q655591n890329m573287k790528
17450A1937376j801081j093017m57273m32438M9200k67876L07459M68846M32845
17441I144041J61097M51208J67482N79580p96637l15627j24156k56574n24446
17432H485968n15877O28836m14897Q16441J43827K01343j33562l40933L83530
17423I254676m35533m71023J29724q50051q57036l01559l18532n84478Q6291J26701
$$ plain form
17482 36445210 49893231 63618093 74978900 82650443 87800603 89232014 88009672 83676467
17474 83676467 76006022 66699767 56556477 47190536 41225308 40027183 44715709 54004673
17466 54004673 66298560 76999091 84691297 89272095 91380741 90470032 85979280 78338719
17458 78338719 68736236 56848467 45082356 33847111 25191520 19301191 14727904 11937376
17450 11937376 10136295 9043278 8586005 8153567 8202767 7934891 8242350 8711196 9144041
17441 9144041 9305138 9756346 9923828 10503408 9706771 9391144 9266988 9010414 8485968
17432 8485968 7970091 8598927 8184030 9000471 9144298 9345641 9212079 8871146 9254676
17423 9254676 8819143 8348120 8477844 7627793 6770757 6469198 6150666 5566188 5652479 5779180
17413E779180m29943P9511q0171K80522n43196M56634J04304K24441q7002Q5912
17403E870192P35018j83935k3863P32282j7508J79597k69425M94482M19204l2157
17393G903887M5995O45683n0081J611482K48078J050089P55906J324389Q18111
17384A4353539J279017K61650N71922l33082N7713M0609p70883j71129p26237
17375A4563119k19865n63745l63436O06818J31344R36260J02540R49763J623266
17366A7766064K15120J202385k80345O16246M93605N5986L32978m70191r239o57172
17356A9265437k1904n24588K58480l41783K92360N74605J119632J25318J095085
17347B1842642J711124R49044J568760J586959J255336Q17144J320648O41216
$$ plain form
17413 5779180 5349237 5428748 5348577 5629099 5085903 5542537 5646841 5871282 5784280 5870192
17403 5870192 6605210 6421275 6397412 7129694 7112186 7291783 7022358 7516840 7936044 7903887
17393 7903887 7949882 8595565 8545484 10156966 10405044 11455133 12211039 13535428 14353539
17384 14353539 15632556 15894206 16466128 16133046 16190759 16231368 15460485 15289356 14563119
17375 14563119 14343254 13779509 13416073 14022891 14154235 15090495 15193035 16142798 17766064
17366 17766064 17981184 19183569 18903224 19519470 20013075 20069061 20402039 19931848 19922609 19265437
17356 19265437 19243533 18718945 18977425 18635642 18928002 19502607 20622239 20747557 21842642
17347 21842642 23553766 24502810 26071570 27658529 28913865 29731009 31051657 31692873
17339C1692873l21638R47136n76510q39415q27914m56222j89293n84521J79784
17330B9024280J48415J81465Q65852J206312O36371R96939J425826L12034O78594
17321C5476088Q07060j79684p95707m86734m05862j466370j177452j858381m35073
17312B9477885j712867j038149j210286o25506m08767m93717K28668K67528O22118
17303B5106907Q74927J321377J146399Q49101L34029J156323m15379q333o50043
17294B9715308q55663j269030j467291j624572j021905j094156j153651j162575
17286B0066465l32569j02779k76630M663K09820q7270K41609l97008o82688q75819
17276A7767794n23337p49389j389368q08129p58386j186579k43595j547465k66313
$$ plain form
17339 31692873 31371235 32318371 31741861 30902446 30074532 29618310 29429017 28844496 29024280
17330 29024280 29172695 29354160 30220012 31426324 32062695 33059634 34485460 34797494 35476088
17321 35476088 36283148 36103464 35307757 34821023 34415161 32948791 31771339 29912958 29477885
17312 29477885 27765018 26726869 25516583 24891077 24482310 23988593 24217261 24484789 25106907
17303 25106907 25981834 27303211 28449610 29298711 29632740 30789063 30373684 30365351 29715308
17294 29715308 28859645 27590615 26123324 24498752 23476847 22382691 21229040 20066465
17286 20066465 19733896 19631117 19354487 19359150 19568970 19481700 19723309 19326301 18643613 17767794
17276 17767794 17244457 16495068 15105700 14297571 13539185 12352606 12109011 10561546 10295233
17267A0295233n80193k67933p02981k94957j09541m59568n97506j76020L00457
17258G406991N7061m17735j77314j13264l16651L61485l07802j87011O7606j10084
17248F263282m67669J90529J65579l81783J67774o43772L04997k36017K62704
17239E625624j87056j39948j68139k9078M14298n43148M44987o6851K89299m5231
17229E594757L15953k82638k13404M47843k26109J30835R7719J85330J90664k11050
17219F029900M63108m89027j47376J63308o4677K45248J32324K39744q10003O65641
17209F428190l46448O34559j56223K99771K30158j71726N77992o1696j06375K44931
17199G573133l88455l04847k22825l17061o44383p11945O95061l31682l37927
$$ plain form
17267 10295233 9715040 9447107 8744126 8449169 8339628 7880060 7282554 7106534 7406991
17258 7406991 7464052 7046317 6869003 6755739 6439088 6800573 6492771 6305760 6373366 6263282
17248 6263282 5795613 5986142 6151721 5769938 5937712 5293940 5598937 5362920 5625624
17239 5625624 5438568 5298620 5130481 5101403 5515701 4972553 5417540 5350689 5639988 5594757
17229 5594757 5910710 5628072 5414668 5862511 5636402 5767237 5864956 6050286 6240950 6029900
17219 6029900 6493008 6003981 5856605 6019913 5955236 6200484 6332808 6572552 5762549 6428190
17209 6428190 6081742 6716301 6560078 6859849 7090007 6918281 7496273 7434577 7328202 7573133
17199 7573133 7184678 6879831 6657006 6339945 5695562 4983617 5678678 5346996 5009069
17190E009069k54913m93568M30779J97888J41222n59921j84497Q6549J42976l64082
17180D151502Q2789n60824k10176M37744L05621m75382K73091m64451J09309J83072
17170C832295k51116N39387q01678N3476J80037M4361K86656k18124N61456k08781
17160D017969J77206J81718j75344P8110R3018M1239K87194n55846L48329l65490
17150D128103Q69365l79513L89861q31155l90516P31220k00123m41790K68265
17141D143717M36304J13500p14629P40473j43432L43729j20034j15224M7706k40512
17131D491598p5998j23890j58911L08272n0980K05443m27355P1414J40945L18680
17121D699218Q4357K16138o12169J54024M8219j74252j02004j60381R6232o37077
$$ plain form
17190 5009069 4754156 4260588 4691367 4889255 5030477 4470556 4286059 4372608 4515584 4151502
17180 4151502 4234291 3673467 3463291 3901035 4206656 3731274 4004365 3539914 3649223 3832295
17170 3832295 3581179 4120566 3318888 3372364 3552401 3596762 3883418 3665294 4226750 4017969
17160 4017969 4195175 4376893 4201549 4279659 4372677 4413916 4701110 4145264 4493593 4128103
17150 4128103 4997468 4617955 5007816 4176661 3786145 4517365 4317242 3875452 4143717
17141 4143717 4580021 4693521 3978892 4719365 4575933 4919662 4799628 4684404 4732110 4491598
17131 4491598 4415600 4291710 4132799 4441071 4390091 4595534 4168179 4239593 4380538 4699218
17121 4699218 4783575 4999713 4387544 4541568 4589787 4415535 4313531 4153150 4249382 3612305
17111C612305J73362K241k41726m51162j39791K2164J497L15925k56999Q3714
17101C121530k09967J18189m71381L6065j78277k78027P74630m90468j69240J21341
17091B374395Q7086L7667m39216K22690n5068J87942K0549l10525P1485m2928
17081B154077J36711J31278l68157M60096m96933J052168j127084N53108P9689
17072B574953J03784l19810M87951m72467M0892n28902M51226P7667l65922J66455
17062B215827P5567k79187M28091l56200r8580K83599J56607q6658k19126k71577
17052A848363M27007j84841L06618n41133M11338p5774R2047K78122l61149M67263
17042B667861K35108o37193K60215l01756L03190L33216m49234j52464K92961
$$ plain form
17111 3612305 3785667 3787908 3546182 3095020 2955229 2977393 2978890 3294815 3037816 3121530
17101 3121530 2911563 3029752 2558371 2594436 2416159 2138132 2912762 2422294 2253054 2374395
17091 2374395 2461481 2499148 2059932 2282622 2227554 2415496 2436045 2125520 2197005 2154077
17081 2154077 2290788 2422066 2053909 2514005 2017072 3069240 1942156 2495264 2574953
17072 2574953 2678737 2358927 2846878 2374411 2415303 1886401 2337627 2415294 2049372 2215827
17062 2215827 2291394 2012207 2440298 2084098 1985518 2269117 2425724 2339066 2119940 1848363
17052 1848363 2275370 2090529 2397147 1856014 2267352 2191578 2283625 2561747 2200598 2667861
17042 2667861 2902969 2265776 2525991 2224235 2527425 2860641 2411407 2258943 2551904
17033B551904k21429l23405N34473n1078l55198K63640j62807o9631O7961P2653
17023B307083r5553P6049O2138o0123j07322n7529L1220P58289j007262n7202
17013A849788M57626l61336J89337J03703O1174p68608N15094M43291Q8960n85617
17003A993412J19847K59222P825j70899r5508O0274j22904L79051N8254J136l72238
16992B117472J63687n9712N23978m07681j2469m6344N32037o46424J32836j27118
16982B170262k21444L15336p3790K17567K48606m30962O61491j86425K47320j62618
16972B785343p5703J53974M01180m1309P89816J54904R8470J4668Q49896m26461
16962D704778M67676L70666L72231r1215M20841K51934J65669k57424L74437m18028
$$ plain form
17033 2551904 2330475 2007070 2541543 2490465 2135267 2398907 2236100 2166469 2234430 2307083
17023 2307083 2211530 2287579 2349717 2289594 2182272 2124743 2155963 2914252 1906990 1849788
17013 1849788 2307414 1946078 2135415 2239118 2300292 1531684 2046778 2490069 2579029 1993412
17003 1993412 2113259 2372481 2380306 2209407 2113899 2174173 2051269 2430320 2488574 2489710 2117472
16992 2117472 2281159 2221447 2745425 2337744 2325275 2278931 2810968 2164544 2297380 2170262
16982 2170262 1948818 2264154 2190364 2407931 2656537 2225575 2887066 2700641 2947961 2785343
16972 2785343 2709640 2863614 3264794 3223485 4013301 4168205 4266675 4281343 5131239 4704778
16962 4704778 5172454 5543120 5915351 5824136 6244977 6496911 6662580 6405156 6779593 6361565
16952F361565J21577p2695J39589j40349j095321P64103m32017k53836l46029
16943E046587k85836k2889l11782j98563k00206j75156j53643k77577l65197l07037
16933B748701j85509L63352j60299k06227k5122J71390j02988m2206j60012N62396
16923B963476m02150k54348K7761J4635K33943o62862M24262N2470j42197o4518
16913B190472L04628l40539j02256j41263Q2258j88343k37962k43065L78423l91749
16903A310604K51876P64376n65919J86044J61706K48112n34339N869L86150l08910
16893A905569M20393m45632l89458L38429O992J2379Q7749J34167l53026j2233
16883A705329M41307l31549R5099M1105k41482K2165J853l48671P88103m89363
$$ plain form
16952 6361565 6483142 6410447 6550036 6409687 5314366 6078469 5646452 5392616 5046587
16943 5046587 4760751 4737862 4426080 4227517 4027311 3852155 3698512 3420935 3055738 2748701
16933 2748701 2563192 2926544 2766245 2560018 2534896 2706286 2603298 2561092 2401080 2963476
16923 2963476 2561326 2306978 2334739 2349374 2583317 1920455 2344717 2397187 2254990 2190472
16913 2190472 2495100 2154561 2052305 1911042 1993300 1804957 1566995 1323930 1702353 1310604
16903 1310604 1562480 2326856 1760937 1946981 2108687 2356799 1822460 1828329 2214479 1905569
16893 1905569 2325962 1880330 1490872 1829301 1836293 1848672 1936421 2070588 1717562 1705329
16883 1705329 2146636 1815087 1910186 1951291 1709809 1731974 1733827 1385156 2173259 1683896
16873A683896K75500j36192M59753k51359O1922k56884J82725j84432r5375m5343
16863A694211N36981r2399n59326K64375K17976l51246J40684J53311k07159j14298
16853A683110P85215n56915k63494J08925K3279P2837o7704P2027l0117r5694
16843A731469k26062K76539j9277M26995n5053m19497k33552M93674M71694m95662
16833A951268K57557m35817L24747J16910J01840q57707M82323N03301j58788
16824B285634j08026l13713k29680j5837O25525J72741O47452o66517j06755k62513
16814B028311Q47286n8208K2313k47991l09447L05695J7472j70010Q6642N1426
16804B573489j66309j12685l58841O39772j74036K31252K00768j06330j97097
$$ plain form
16873 1683896 1959396 1823204 2282957 2031598 2093520 1836636 2019361 1834929 1739554 1694211
16863 1694211 2231192 2138793 1579467 1843842 2061818 1710572 1851256 2004567 1797408 1683110
16853 1683110 2468325 1911410 1647916 1756841 1780120 1852957 1785253 1857280 1827163 1731469
16843 1731469 1505407 1781946 1762669 2189664 2134611 1715114 1481562 1975236 2446930 1951268
16833 1951268 2208825 1773008 2097755 2214665 2316505 1458798 1941121 2444422 2285634
16824 2285634 2177608 1863895 1634215 1618378 2243903 2416644 3064096 2397579 2290824 2028311
16814 2028311 2875597 2817389 2839702 2591711 2282264 2587959 2605431 2435421 2522063 2573489
16804 2573489 2407180 2294495 1935654 2575426 2401390 2632642 2833410 2727080 2529983
16795B529983n43530k85240K44925k44244p1349k05966Q48566q45264M63771j44474
16785A747178o01385J60476O7975K4521L95807k9303k26911J3719Q8629L70329
16775B011035r72893J98025J40342J53161M8320j39037N511j60868j0067J94370
16765A467899K17199H15322N40302j30626J62858l44435J97793k74156L95282
16756A362340L89334j5627k96835J94673m25545O25164p45982M78133K46J46061
16746A711962j47497M14482l61737N21347I80494O36142L3402j21751L4320p4116
16736A488491j00287J38721M9085J33808j7616K92234O3539k85972L14070l95117
16726A680956j59821k02293O51143L25775o53540L35149M39785m33383K63063
$$ plain form
16795 2529983 1986453 1701213 1946138 1701894 1630545 1424579 2273145 1427881 1891652 1747178
16785 1747178 1145793 1306269 1374244 1398765 1794572 1765269 1538358 1552077 1640706 2011035
16775 2011035 1038142 1236167 1376509 1529670 1577990 1438953 1444464 1283596 1273529 1467899
16765 1467899 1685098 815322 1355624 1224998 1387856 1043421 1241214 967058 1362340
16756 1362340 1751674 1736047 1439212 1633885 1208340 1833504 1087522 1565655 1565901 1711962
16746 1711962 1564465 1978947 1617210 2138557 980494 1616636 1650038 1528287 1562607 1488491
16736 1488491 1388204 1526925 1576010 1709818 1692202 1984436 2047975 1762003 2076073 1680956
16726 1680956 1521135 1318842 1969985 2295760 1642220 1977369 2417154 1983771 2246834
16717B246834l8057Q0792j09276K13853l88300J33074N39279k24265M66699n41503
16707B379130N22319M31579j89316M52245J71661L96621K16109k7882M51979N9360
16697D863805j87011o70523M311J02390m4853M4589Q686m03711Q38824l05950
16687D250557L26886k44082M30074m16391J75895n81533J03639o19663J83089
16678C608471p53777M90563m33007q5447Q6548m08921L82289K6763K75845J82662
16668C371989O42500J61697l30712J62340M04765o0011L36790q5855J0158M312
16658D617973k19837J83827o28021K60541j10314M48997j74379J90790L94k31351
16648D338620l56870m35285m12397m16324N1935q70253L30432l64521j33376n92606
$$ plain form
16717 2246834 2208777 2289569 2180293 2394146 2005846 2138920 2678199 2453934 2920633 2379130
16707 2379130 2901449 3333028 3143712 3595957 3767618 4164239 4380348 4352466 4804445 4863805
16697 4863805 4676794 4006271 4010582 4112972 4068119 4112708 4121394 3717683 4556507 4250557
16687 4250557 4577443 4333361 4763435 4347044 4522939 3941406 4045045 3425382 3608471
16678 3608471 2854694 3345257 2912250 2826803 2913351 2504430 2886719 2913482 3189327 3371989
16668 3371989 4014489 4176186 3845474 4007814 4412579 4352568 4689358 4603503 4613661 4617973
16658 4617973 4398136 4581963 3953942 4214483 4104169 4553166 4378787 4569577 4569971 4338620
16648 4338620 3981750 3546465 3134068 2717744 2769679 1899426 2229858 1865337 1731961 1139355
16638A139355L3244L89603l12880L97966E95014Q15085K3305l84612J32120M17561
16628A598473q658l5354m60962k4585K20366j74036K03156M27386k44600k61038
16618A240148J12797L62472l67824k83040L47712L18423m96944K99541M99743
16609B033028o02346J17868L60326k2559j09808K27451P8085j37895l2275L51580
16599B263455o28611J12117N72316k59588N09808N0927N5363m62682P02765m75679
16589B440191k97669L74264l25256j34385j23665j32248q1976j38019L86001m54020
16579A513218K3057k05626R0371L16519m50685l50678M38275R7077j46298j80257
16569A144973J28572J71415p04555P52425m09568J15790j85812L57066l37806
$$ plain form
16638 1139355 1172599 1562202 1249322 1647288 595014 1410099 1433404 1048792 1180912 1598473
16628 1598473 1589815 1554461 1093499 1068914 1289280 1115244 1318400 1745786 1501186 1240148
16618 1240148 1352945 1715417 1347593 1064553 1412265 1730688 1233744 1533285 2033028
16609 2033028 1430682 1548550 1908876 1886317 1776509 2003960 2082045 1944150 1911875 2263455
16599 2263455 1634844 1746961 2319277 2059689 2569497 2620424 2675787 2213105 2915870 2440191
16589 2440191 2142522 2516786 2191530 2057145 1933480 1801232 1719256 1581237 1967238 1513218
16579 1513218 1536275 1330649 1421020 1737539 1286854 936176 1374451 1471528 1325230 1144973
16569 1144973 1273545 1444960 740405 1492830 1083262 1199052 1013240 1370306 1032500
16560A032500J83270k97917Q2172q0309L23358k79330M58734l01118K18111k23447
16550A116024k83213r8754q8758r1108K24670k69228N20866l17316J42147o9146
16540G86184J36882L77260k27353P04785q31030L80173l63134K51356K69588j83049
16530A301662L19721l2445j68733J46845L36217l30559j43852L99084q1665k37663
16520A508612N96027o37470j991j95477l13195K5716K52524L29073k86746P1236
16510A348309l95083N00184D30081m8736N25386l53394A58627L11661K82403J99241
16500I51932J88555k7174r5149k76730K13927k62774m8311k53257L58498J52110
16490I01627P85611o23312D73674J36016O03232O74852l14875O6046j63086L0990
$$ plain form
16560 1032500 1215770 917853 1000025 919716 1243074 963744 1422478 1121360 1339471 1116024
16550 1116024 832811 734057 645299 554191 778861 509633 1030499 713183 855330 786184
16540 786184 923066 1300326 1072973 1777758 946728 1326901 963767 1215123 1484711 1301662
16530 1301662 1621383 1588938 1420205 1567050 1903267 1572708 1428856 1827940 1746275 1508612
16520 1508612 2104639 1467169 1465178 1269701 956506 982222 1234746 1563819 1277073 1348309
16510 1348309 953226 1453410 430081 381345 906731 553337 158627 470288 752691 951932
16500 951932 1140487 1113313 1018164 741434 955361 692587 644276 391019 749517 901627
16490 901627 1687238 1063926 473674 609690 1212922 1887774 1572899 1638945 1475859 1506849
16480A506849k40052M4174j56863L98032K20913j65045J03809n3488Q12829L65577
16470B836735J1671j73923K66916j6720r6850k46979q0563l23207M10658n78712
16460B009026L08329p1893j61255L13732r0411J019785K13309N68897K57413q2554
16450D284378L9622K39392j68593l9264l50176N3717k78826n98999N86161L28539
16440D095951k06450L87263j38237Q6229O79329j7969O77045L41477O57067M79323
16430G041028J001548M94886J405806J477896J353129J333807K271148J804337
16422A8183585K152481K247563J570575K378600K114879K331733K740847K985951
16414C6706214K577152L560620M335050L472924M217856M190642M504139M776820
$$ plain form
16480 1506849 1266797 1310971 1154108 1552140 1773053 1608008 1711817 1658329 2471158 2836735
16470 2836735 2848406 2674483 2941399 2924679 2827829 2580850 2500287 2177080 2587738 2009026
16460 2009026 2317355 2245462 2084207 2397939 2307528 3327313 3540622 4109519 4366932 4284378
16450 4284378 4324000 4563392 4394799 4355535 4005359 4059076 3780250 3181251 3767412 4095951
16440 4095951 3889501 4276764 4138527 4224756 4904085 4886116 5563161 5904638 6561705 7041028
16430 7041028 8042576 8537462 9943268 11421164 12774293 14108100 16379248 18183585
16422 18183585 20336066 22583629 24154204 26532804 28647683 30979416 33720263 36706214
16414 36706214 39283366 42843986 47179036 50651960 54869816 59060458 63564597 68341417
16406F8341417M720837O114349N860869O952334O870465P461853P519200O295457
16398A20136781L761918J140375j207463j717384j371195J19997M109423J0349271
16390A35321723J9587642K3664189J8925987L895375q696406j5064276j8083779
16383A59550455k0163736j9590363j6222382j3958281j8537811k8199995h8432
16375e9190503n8820507l2262199M655841K9224222L5648131L0216607K2270665
16368b8257743a2308334a675706E620846M468459K700757J660184M88843q76636
16360A4062453n35302j276384j368310j653930j740982j134379j237861p60601
16352D354704n07574r45232q25510I95881k72021d25492j024068n32648M43126
$$ plain form
16406 68341417 73062254 79176603 85037472 91989806 98860271 106322124 113841324 120136781
16398 120136781 123898699 125039074 123831611 122114227 120743032 120863029 124972452 135321723
16390 135321723 154909365 178573554 197499541 201394916 192698510 177634234 159550455
16383 159550455 139386719 119796356 103573974 89615693 71077882 42877887 -88432
16375 -59190503 -118011010 -150273209 -145617368 -116393146 -80745015 -50528408 -28257743
16368 -28257743 -12308334 -1675706 5620846 10089305 12790062 14450246 14939089 14062453
16360 14062453 13527151 12250767 10882457 9228527 7487545 6353166 5115305 4354704
16352 4354704 3847130 2901898 2076388 995881 723860 -425492 -1449560 -1982208 -1539082
16343a539082q01165j1097l24318M67189J50026K07855K50300K59000K18513L07015
16333h15764K88313h2696j45047B18336O0619M63373k02223J81548C03759K38546
16323E42305i5130A73827J60351A12077J71026a5092A38456N2207R4415A28745
16312b24975P8809E70373j59578N56745P78354j78262K0468O8369o9462J2037
16302A599044l94711n8534n05283m3435K07751l98871a33681D90595M16416r9745
16292H07266K89407l61154O57055L90921l90480O02381m46869k42541j11465K80915
16282A475436m14779R7172R2882k69594K1942L915L76442J01743r9787N87434
16272A972806K52252l58743K23971o6319J4582K90545j48342K50196o56743l8281
$$ plain form
16343 -1539082 -2340247 -2351344 -2675662 -2208473 -2058447 -1850592 -1600292 -1341292 -1122779 -815764
16333 -815764 -527451 -82696 -227743 218336 278955 742328 540105 721653 303759 542305
16323 542305 -95130 173827 334178 112077 283103 -15092 138456 190663 285078 128745
16312 -224975 -146166 570373 410795 967540 1745894 1567632 1588100 1656469 1587007 1599044
16302 1599044 1204333 1145799 640516 597081 804832 405961 -133681 490595 907011 807266
16292 807266 1096673 735519 1392574 1783495 1393015 1995396 1548527 1305986 1194521 1475436
16282 1475436 1060657 1157829 1250711 981117 1003059 1006974 1383416 1485159 1385372 1972806
16272 1972806 2225058 1866315 2090286 2023967 2038549 2329094 2180752 2430948 1774205 1735924
16262A735924J88141J41920l29295J25143j17441j0530l65376K39653J51878j52700
16252A607317j93747M42535l88717R4274m9216J79355m4444j52157k73007L49135
16242A571328K13519K16430k13586L61049k87407O98082m70867J28059n54625
16233A661982j98794N22037j5731l39386K30508M28525p31491K36558j37444J1122
16223A667886k2128J34236R2143l37747Q20087q03102l19340K24896N58601o32962
16213A382570L35554m25713K07354P3352k38921j93428J32599L84545k62006k57767
16203A138139P24028m78220P27631o74947N24432j57660K48398n17739N60851
16194B094913l22491N7404K1864q4180P0880p6428M0095K36853n06136j20764
$$ plain form
16262 1735924 1924065 2065985 1736690 1861833 1744392 1733862 1368486 1608139 1760017 1607317
16252 1607317 1413570 1856105 1467388 1561662 1512446 1691801 1647357 1495200 1222193 1571328
16242 1571328 1784847 2001277 1787691 2148740 1861333 2559415 2088548 2216607 1661982
16233 1661982 1463188 1985225 1969494 1630108 1860616 2289141 1557650 1794208 1656764 1667886
16223 1667886 1645758 1779994 1872137 1534390 2354477 1551375 1232035 1456931 2015532 1382570
16213 1382570 1718124 1292411 1499765 1573117 1334196 1140768 1273367 1657912 1395906 1138139
16203 1138139 1862167 1383947 2111578 1436631 1961063 1803403 2051801 1534062 2094913
16194 2094913 1772422 1829826 1851690 1767510 1838390 1761962 1802057 2038910 1532774 1412010
16184A412010K21755N7366k26033j95428L08568m74112N44613n85376P10470J08257
16174A882090k84666J22282j35888J10137j39211L16488k47801P72657p27326
16165A668762k64617N10227k94595N72812o6944j76836l19142L69744n10933K69451
16155A757929R4243l81878n9065L36191m67017P64880p27919j03862L72038P7360
16145A662900n2556K45712k77380k36902N95484J94413o75942L90574l36983L09793
16135A819113J64634r0154l04562j18550M23947n66616L52277O11708o74630J65475
16125A782642l55399M72244J24569n08703M24774Q1998l43440k0523R4098q1194
16115A671066j52593L75672l54259k49450N99606N1118k8091j9581j58000N9593
$$ plain form
16184 1412010 1633765 1691131 1465098 1269670 1578238 1104126 1648739 1063363 1773833 1882090
16174 1882090 1597424 1719706 1583818 1693955 1554744 1871232 1623431 2396088 1668762
16165 1668762 1404145 1914372 1619777 2192589 2125645 1948809 1629667 1999411 1488478 1757929
16155 1757929 1852172 1470294 1411229 1747420 1280403 2045283 1317364 1213502 1585540 1662900
16145 1662900 1610344 1856056 1578676 1341774 1937258 2131671 1455729 1846303 1509320 1819113
16135 1819113 1983747 1893593 1589031 1470481 1894428 1327812 1680089 2291797 1617167 1782642
16125 1782642 1427243 1899487 2024056 1515353 1940127 2022125 1678685 1658162 1752260 1671066
16115 1671066 1518473 1894145 1539886 1290436 1890042 1941160 1913069 1893488 1735488 1795081
16105A795081p1302j32344L14886J08615j85060r4292J0392k68475Q11621l97563
16095A891559J658J65130K37698m2991n13285l53600P24311j11020m8447n2895
16085A898118O2608K88648L8998m61268L89149l75635M93189J79123m22308K71180
16075B361802K18M10277p54354N57494o35193O90368q9186k8806L61309j43868
16065B730061m858J47948J50071k69278M1606Q4115l33414K55584K21206q5688
16055B937353M52983l66457k48191K20806M43413o67337N09879j88812K06666
16046C300303M27768m87440L35743k17538J57802L7228Q1624l61902O20488k34976
16036C659100Q2546j2797J50363j03404J35671n21793K89477J82873K27187q2225
$$ plain form
16105 1795081 1723779 1591435 1906321 2014936 1829876 1735584 1745976 1477501 2289122 1891559
16095 1891559 1893217 2058347 2296045 2253054 1739769 1386169 2110480 1999460 1951013 1898118
16085 1898118 1960726 2249374 2288372 1827104 2216253 1840618 2333807 2512930 2090622 2361802
16075 2361802 2362020 2772297 2017943 2575437 1940244 2630612 2541426 2512620 2873929 2730061
16065 2730061 2725203 2873151 3023222 2753944 2795550 2879665 2546251 2801835 3023041 2937353
16055 2937353 3390336 3023879 2775688 2996494 3439907 2772570 3282449 3093637 3300303
16046 3300303 3728071 3240631 3576374 3358836 3516638 3553866 3635490 3273588 3894076 3659100
16036 3659100 3741646 3728849 3879212 3775808 3911479 3389686 3679163 3862036 4089223 4006998
16026D006998K7060j9754N0255j06521O43833p00021Q8071J03557j24482M06556
16016D375552j8733K10902n03772K33999P82110n66069J18063m82709L96647K31285
16006D777275p6794L03919m07240M31885m26518K58816K44840P197K3281m80932
15996D655729K20764N975J81227j68524k56279J73259m39471M24155P74458r31865
15986D639428k04955j08152J37875k5104R41488m44928J16471K12320Q1696o02354
15976D743785Q3952J86875k07504J0845K13378j46724K579M92191p03587j33332
15966D542458P70685m38027L39419q1792k11958L8599n75416M43873k02578K32376
15956D857639K3556n3191j21502J22020l09532K48204j31168J90033L24680p58385
$$ plain form
16026 4006998 4034058 4014304 4064559 3958038 4601871 3901850 3989921 4093478 3968996 4375552
16016 4375552 4356819 4567721 4063949 4297948 5080058 4513989 4632052 4149343 4545990 4777275
16006 4777275 4700481 5004400 4597160 5029045 4602527 4861343 5106183 5113380 5136661 4655729
15996 4655729 4876493 4882468 5063695 4895171 4638892 4812151 4372680 4796835 5571293 4639428
15986 4639428 4434473 4326321 4464196 4439092 5380580 4935652 5052123 5264443 5346139 4743785
15976 4743785 4827737 5014612 4807108 4817953 5031331 4884607 4887186 5379377 4675790 4542458
15966 4542458 5313143 4875116 5214535 5132743 4920785 4959384 4383968 4827841 4625263 4857639
15956 4857639 4881195 4828004 4706502 4828522 4518990 4767194 4636026 4826059 5150739 4392354
15946D392354L5475K56788N4461n2580L75630k7829j0166l26308N60427m59750
15936D798502L95239n00284K01784P287L21240l41847O5514K76216N5686M06271
15926E685608l24842L21856N05097k10221k8995J54901K2102J5971L79692L1262
15916F552431l17666L25222O30957O46753j48897Q86254k35525R19569J583985
15907A0843083J375856J435908J555029L396442M631972O725315R173071J2825583
15899E1962259J4896752J5699149J5181600J2324093R161841M897543O7715l494301
15891A20696651p701042j1391490j4251071j4137560j3995151j2522085j0858337
15884C5839915q041771n947897m593735k234137k839286j920737p24530j155499
$$ plain form
15946 4392354 4427829 4684617 4739078 4686498 5062128 5034299 5024133 4697825 5258252 4798502
15936 4798502 5193741 4693457 4895241 4902528 5223768 4881921 4947435 5223651 5279337 5685608
15926 5685608 5360766 5682622 6187719 5977498 5948503 6103404 6125506 6141477 6521169 6552431
15916 6552431 6234765 6559987 7190944 7837697 7688800 8575054 8339529 9259098 10843083
15907 10843083 12218939 13654847 15209876 18606318 23238290 29963605 39136676 51962259
15899 51962259 66859011 82558160 97739760 110063853 119225694 124123237 124190952 120696651
15891 120696651 112995609 101604119 87353048 73215488 59220337 46698252 35839915
15884 35839915 27798144 21850247 17256512 15022375 12183089 10262352 9537822 8382323
15876H382323o10929n07765m85654j96459J03009n05565R8496m08215l58627L05514
15866E816128p18481M11985j67358l08247j33501k62218L6304K93606J88379q21925
15856D334672O33222k99635j78619J66063j01613L54711l07022k40310K24221
15847D585690l25130L67423m35204J69538L42106m96462L01368J52965J21437
15838D783731L42932o48367P3079J4782M46214j57562M78174k23260P9039j70183
15828E018579k13520K94313l73479K2915J085o8882k63043P30694l83449k61356
15818D503857J96500J54871j12006o2960M45992n56455J48363N50887j50978J40357
15808E258428N2114j38304L10395M65939q55390Q6316L53163L59477o25511Q69340
$$ plain form
15876 8382323 7771394 7263629 6777975 6581516 6684525 6178960 6277456 5869241 5510614 5816128
15866 5816128 5097647 5509632 5342274 5034027 4900526 4638308 4674612 4968218 5156597 4334672
15856 4334672 4967894 4668259 4489640 4655703 4554090 4908801 4601779 4361469 4585690
15847 4585690 4260560 4627983 4192779 4362317 4704423 4207961 4509329 4662294 4783731
15838 4783731 5126663 4478296 4551375 4566157 5012371 4854809 5332983 5109723 5188762 5018579
15828 5018579 4805059 5099372 4725893 4748808 4749893 4681011 4417968 5148662 4765213 4503857
15818 4503857 4700357 4855228 4743222 4680262 5126254 4569799 4718162 5269049 5118071 5258428
15808 5258428 5310542 5172238 5482633 5948572 5093182 5179498 5532661 5892138 5266627 6135967
15798F135967P0688L03376N19803J96712J87593M99109K21598N51925n97379J4610
15788H104002P56489l50542N84049K38972K5619j93691M84482Q99965N67870N89890
15778A1707105l01070R94456l60030L69385K15685P3081p17275L85026k08407
15769A2157956k00169L11463j53238N5819J74483k57457O29189M9712J74027K37325
15759A3179110n9594l4327L22182m85620p18166l33124l08090O9731l20736J76966
15749A1488332m95466M35078j11076N60950o17650p6884O51836N38935M99650
15740A2873705L79038L19923M75653K39478K010K28874k89882N88343m86860K72414
15730A4602696L94808K65277j38581N34880n758J98382K00246o50617p2208j78110
$$ plain form
15798 6135967 6206655 6510031 7029834 7226546 7414139 7913248 8134846 8686771 8089392 8104002
15788 8104002 8860491 8509949 9093998 9332970 9358589 9164898 9649380 10549345 11117215 11707105
15778 11707105 11406035 12400491 12040461 12409846 12625531 12698612 11981337 12366363 12157956
15769 12157956 11957787 12269250 12116012 12171831 12346314 12088857 12718046 12767758 12941785 13179110
15759 13179110 13119516 13085189 13407371 12921751 12203585 11870461 11562371 11632102 11311366 11488332
15749 11488332 10992866 11427944 11316868 11877818 11260168 11183284 11835120 12374055 12873705
15740 12873705 13252743 13572666 14048319 14287797 14289807 14518681 14228799 14817142 14330282 14602696
15730 14602696 14997504 15262781 15124200 15659080 15653322 15851704 16051950 15401333 15329125 15151015
15720A5151015m72535n09179K54147j69380r2837O78241o95553K20181j97297
15711A4166803J88879m67088q97332n7927k28600q0793j23700Q80142O21508J51748
15701A4153640N01004K26491O55012M5001K19164r4928p847k54884K42122o21765
15691A5063010m08293K46307m40980L23157o63029L19319L7922p49976m5870j79182
15681A3502385M56305n37021K09216l16582r8602k89270r56878M55076o75167
15672A1749462M98880m61777J03808R9961k21798N8662N86310K57239Q23635Q78540
15662A4372922J046260P84192R78666J185778N66660J453999J409089R32924J503520
15653B4234010R75841K427954J377670J389160J456862J387544J572035J144944
$$ plain form
15720 15151015 14678480 14169301 14423448 14254068 14161231 14839472 14143919 14364100 14166803
15711 14166803 14355682 13888594 12991262 12933335 12704735 12623942 12500242 13380384 14001892 14153640
15701 14153640 14654644 14881135 15536147 15581148 15800312 15705384 15697537 15442653 15684775 15063010
15691 15063010 14654717 14901024 14460044 14783201 14120172 14439491 14477413 13727437 13681567 13502385
15681 13502385 13958690 13421669 13630885 13314303 13215701 12926431 11969553 12424629 11749462
15672 11749462 12248342 11786565 11890373 11990334 11768536 11827198 12413508 12670747 13494382 14372922
15662 14372922 15419182 16203374 17182040 18367818 18934478 20388477 21797566 22730490 24234010
15653 24234010 25209851 27637805 29015475 30404635 31861497 33249041 34821076 35966020
15645C5966020J219718Q68093J616029J177041J884918K374750K265002K217620
15637D9589191J572173J231925Q72175R65429j02919k37847l70097p98106m14988
15628E2306936p84684j33582K11179p73128J94958q2557j260238j401624j175687
15619D7101573j825375k493040k315170k384652k046962k465578j014646j340671
15611C1215479j439185j124533j357536r76333j030264j103681o88176o24428
15603B2871343j149932j69171q96764n85086j89151j73226k64403N65914n16951
15594A9492573L15502J353603R71795L128994P577850J2530195J7461432J4143560
15586G6975504R418454O414055L649008J51936j856909n137526j0843035j0723876
$$ plain form
15645 35966020 37185738 38053831 39669860 40846901 42731819 45106569 47371571 49589191
15637 49589191 51161364 52393289 53265464 54230893 54127974 53890127 53520030 52721924 52306936
15628 52306936 51522252 51388670 51599849 50826721 51021679 50939122 49678884 48277260 47101573
15619 47101573 45276198 42783158 40467988 38083336 36036374 33570796 32556150 31215479
15611 31215479 29776294 28651761 27294225 26317892 25287628 24183947 23495771 22871343
15603 22871343 21721411 21552240 20655476 20070390 19881239 19708013 19443610 20009524 19492573
15594 19492573 19808075 21161678 22133473 25262467 32840317 45370512 62831944 76975504
15586 76975504 86393958 92808013 96457021 96608957 94752048 89614522 78771487 68047611
15578F8047611j1858005j2360151j1215359o355348m539603k181216k183835o88841
15570A6665253n79851l41532m60888n31767O13890p88153R49198j62687K00272
15561A5563735j01752P15019L88271J496620K315637N658577J0382810J9211856
15553E5630773K2916974J7239619J1051013P343426M122491Q7333l701206q291151
15545A06399272j4350457j4920994j5850950j6609909j2126843p896217m933982
15538A9709920k933824j960337j444698p85130p24392M2551p6500K61787k82580
15529A1806797J97710k30374M211n13320M5398m61246j79105j96096J8933o99475
15519I793433M05121n45078m21921O65117m8789j58148J252729q68686K90064
$$ plain form
15578 68047611 56189606 43829455 32614096 26258748 21719145 19537929 17354094 16665253
15570 16665253 16085402 15743870 15282982 14751215 15365105 14576952 15526150 15363463 15563735
15561 15563735 15461983 16177002 16565273 18061893 20377530 26036107 36418917 55630773
15553 55630773 78547747 95787366 106838379 114181805 118304296 118391629 114690423 106399272
15545 106399272 92048815 77127821 61276871 44666962 32540119 24643902 19709920
15538 19709920 16776096 14815759 13371061 12585931 11861539 11904090 11827590 12089377 11806797
15529 11806797 12004507 11774133 11778344 11265024 11310422 10849176 10670071 10473975 10492908 9793433
15519 9793433 10198554 9653476 9231555 9896672 9847883 9689735 10942464 10073778 10363842
15510A0363842O98839M61009j9542R21715j78394j94192l66086J46076k70843
15501A1562424M2786q0041l01594k59508m34900L47610K92948j60684j34976L05833
15491A1179898O61839O3719K55239J17459J65083l06581J29125N5186L18252K48080
15481A2887299K16646K00574j3335R6473p6420O7206k81616N98489K22321Q72206
15471A4789843P16714J033142J025327J530986L46518Q32939Q81878k04181M39452
15462B1392618k69146p04792k61666o39281l41516l71732N55960O57378J469639
15453B1487462P42886P78949N16525J245785n4796n1469m76514J00853n05521
15444B3784160n51609p05392J55025l56948L88671k86890J36120P01989M0137
$$ plain form
15510 10363842 11062681 11523690 11504148 12425863 12247469 12053277 11687191 11833267 11562424
15501 11562424 11605210 11525169 11223575 10964067 10529167 10876777 11169725 11009041 10874065 11179898
15491 11179898 11841737 11905456 12160695 12278154 12443237 12136656 12265781 12320967 12639219 12887299
15481 12887299 13103945 13304519 13291184 13387657 13311237 13378443 13096827 13695316 13917637 14789843
15471 14789843 15506557 16539699 17565026 19096012 19442530 20275469 21157347 20953166 21392618
15462 21392618 21123472 20418680 20157014 19517733 19176217 18804485 19360445 20017823 21487462
15453 21487462 22230348 23009297 23525822 24771607 24716811 24665342 24188828 24289681 23784160
15444 23784160 23232551 22527159 22682184 22325236 22713907 22427017 22563137 23265126 23305263
15435B3305263n3069r4212n6545n09592k36872r84488J90646j240125k71975o80365
15425A9368666n36557o45290j87948n00533q22639L20865j122450p80469K4401
15416A5118046n61162m46432j97664j03457q54499r3968N56249J50259p62552
15407A2804820J77096L5778K03512L1575j6692L84595M40106L65559J13236L14913
15397A4854498n2417O34471L07213l90967N67602n15813m43717J95905n60731
15388A4596044M18474o62853j19129J82511J67654m26020M7326l30835J11411
15379A3984583O2810r2303o66750Q58027r56425P26055n48400k76147J26694N67892
15369A3786036l74824J53752R5307L69907O25003K18380j26097K84522L0381J38098
$$ plain form
15435 23305263 23252194 23157982 23101437 22591845 22354973 21370485 21561131 20321006 20049031 19368666
15425 19368666 18832109 18186819 17998871 17498338 16675699 16996564 15874114 15093645 15118046
15416 15118046 14556884 14110452 13912788 13809331 12954832 12860864 13417113 13567372 12804820
15407 12804820 12981916 13017694 13221206 13252781 13236089 13620684 14060790 14426349 14539585 14854498
15397 14854498 14802081 15436552 15743765 15352798 15920400 15404587 14960870 15156775 14596044
15388 14596044 15014518 14351665 14232536 14415047 14582701 14156681 14204007 13873172 13984583
15379 13984583 14047393 13955090 13288340 14146367 13189942 13915997 13367597 13091450 13218144 13786036
15369 13786036 13411212 13564964 13660271 14030178 14655181 14873561 14747464 15031986 15062367 15200465
15359A5200465K1732r678j27256p3888L58940J23912L05639N54039L19819J665081
15349A8338805J738393L684879O114857R566890R477773P244254N035206L088668
15341F4289725J392747J25033k100655m246401n355168n367688o036431n597455
15333C7103707l563637k351461r80656j222938j257900q38524j011003m33400
15325B5444188p05972k70134l05843k8789m07074O82109N95103N99984J435961
15316B7039533J858170M723603P512583J2209666J6267853J5173790J1660995
15309I6446193P223658M170050J024109j980398n988886j0017926j1721137j3679103
15301F5476560j2561606j0483746q543823m935472l118526k812242j41653j181807
$$ plain form
15359 15200465 15222197 15212519 15085263 15011375 15370315 15494227 15799866 16353905 16673724 18338805
15349 18338805 20077198 23762077 29876934 39443824 48921597 56165851 61201057 64289725
15341 64289725 65682472 65807505 63706850 59460449 54105281 48737593 42701162 37103707
15333 37103707 33540070 31188609 30207953 28985015 27727115 26888591 25877588 25444188
15325 25444188 24738216 24468082 24162239 24133450 23726376 24408485 25003588 25603572 27039533
15316 27039533 28897703 33621306 41133889 53343555 69611408 84785198 96446193
15309 96446193 103669851 107839901 108864010 106883612 100894726 90876800 79155663 65476560
15301 65476560 52914954 42431208 33887385 28951913 25833387 23021145 22879492 21697685
15293B1697685j75826l8059N62176k98449L88011J22828L40979k92738K42941
15284B2549548J3578L19473N84397J108560L396878O032387P673201Q032472N828123
15275E5538617L662199J920031O83697p60346k376402m627251n758001o263040
15267D2019504n949092o153451l830461k731484j450583o07007j610893n13718
15259A9172815m67215j21739N20833n18733O53090k07432j96530L75888R37683
15250B0148660N51143J78892P41875m33133J45074L70180p45624j49933M42003
15241B1249137p56573j30730P3732n7682J048251K0616J348512J075891M53911
15232B4325065P39864N98663L44755n85025n10757N6574o53469j102351l46691
$$ plain form
15293 21697685 21521859 21483800 22045976 21747527 22135538 22258366 22599345 22306607 22549548
15284 22549548 22563126 22882599 23466996 24575556 27972434 34004821 41678022 49710494 55538617
15275 55538617 59200816 61120847 61804544 61044198 58667796 54040545 48282544 42019504
15267 42019504 36070412 29916961 26086500 23355016 21904433 21297426 19686533 19172815
15259 19172815 18705600 18583861 19104694 18585961 19239051 19031619 18835089 19210977 20148660
15250 20148660 20699803 20878695 21620570 21187437 21332511 21702691 20957067 20807134 21249137
15241 21249137 20492564 20361834 20435566 20377884 21426135 21446751 22795263 23871154 24325065
15232 24325065 25064929 25663592 26008347 25423322 24912565 24969139 24315670 23213319 22866628
15223B2866628j112726n71711n45953p01511N63107L75837p7001P19119M42371
15214B1958160L44370j37085L78657k20325l22109o84269q89217n66869j442384
15205A8418929j242226p33719j113020q25265o26106o16427j98728q55455k7981
15196A2180002N25020p15117J95033L06989N91715O68283P06495k92398N63442
15187A4729464Q09061m14345M72262M1747Q6607J41852L47272M75744Q91901j78048
15177A7403517L60961J12839M33792M23553K8568J25730P9593o26398K06812J13744
15167A8662711l23322J3389j53523K6236l87954J08036j32815J68357Q9264j83599
15157A7886780K79976m88168M35419N35575j74473k4192k78571j37447p34239
$$ plain form
15223 22866628 21753902 21182191 20636238 19934727 20497834 20873671 20796670 21515789 21958160
15214 21958160 22302530 22165445 22544102 22323777 22001668 21317399 20428182 19861313 18418929
15205 18418929 17176703 16442984 15329964 14504699 13878593 13262166 13063438 12207983 12180002
15196 12180002 12705022 11989905 12184938 12491927 13083642 13751925 14458420 14166022 14729464
15187 14729464 15538525 15124180 15596442 15638189 15724796 15866648 16213920 16689664 17581565 17403517
15177 17403517 17764478 17877317 18311109 18734662 18763230 18888960 18968553 18342155 18548967 18662711
15167 18662711 18339389 18352778 18199255 18225491 17837537 17945573 17812758 17981115 18070379 17886780
15157 17886780 18166756 17678588 18114007 18649582 18475109 18450917 18172346 18034899 17300660
15148A7300660R78398p29623K36161k99835k41332K13536K93195L91515l59683
15139A7782992M19358L32296M96752J54867J11077l81953N30667n02719J43829
15130A9087166l61352j94272R0537j86835J1723l34612M6992k43601J62411r92630
15120A7085527J72607K4651j44934l31732m39235l75607J37932j78984m27876
15111A5522349K01721R9544k32077p7315O3487k83026M02577r8370M14589M26176
15101A6439655L29223L95861M27205N04453K60235R68600K49519J134318L37110
15092B1046179J060406J877148K483853L546416M033088K935551K456092K318886
15084D1757619O59427J72829J31631j015046j955591j306747j788365j049056
$$ plain form
15148 17300660 18279058 17549435 17785596 17485761 17244429 17457965 17751160 18142675 17782992
15139 17782992 18202350 18534646 19031398 19186265 19297342 18915389 19446056 18943337 19087166
15130 19087166 18725814 18531542 18622079 18435244 18446967 18112355 18159347 17915746 18078157 17085527
15120 17085527 17258134 17282785 17137851 16806119 16366884 15991277 16129209 15950225 15522349
15111 15522349 15724070 15823614 15591537 15514222 15577709 15294683 15697260 15598890 16013479 16439655
15101 16439655 16768878 17164739 17591944 18096397 18356632 19325232 19574751 20709069 21046179
15092 21046179 22106585 23983733 26467586 30014002 34047090 36982641 39438733 41757619
15084 41757619 42417046 42589875 42721506 41706460 39750869 38444122 36655757 35606701
15076C5606701L43684K059409L339429K798168K799495K201825J267185N48840
15068E0964736L83357j19257j503047o87002N34082L122537M003174L329892K866234
15059F2894706L469499K523219K447080L282364L236350P90785N23677M35416
15051G9603096J47898R40851L064972K933742K585779J901746j017531M6217l04225
15042H9902545Q16118K9037p20590k370399k903184l393456l704494m286519l198941
15033G0170117l726905l419548k536656j067995P29492J642654O22350k18535
15025F2194974K14202l31773J59012m23362j368550j001508m38583M25605L190487
15016F2620504M786361P480623P293183O708498O829072N935202M698499M174817
$$ plain form
15076 35606701 35950385 38009794 41349223 44147391 46946886 49148711 50415896 50964736
15068 50964736 51348093 51228836 49725789 49038787 49572869 52695406 56698580 60028472 62894706
15059 62894706 66364205 68887424 71334504 74616868 77853218 78644003 79167680 79603096
15051 79603096 79750994 80691845 83756817 86690559 89276338 91178084 90160553 90206770 89902545
15042 89902545 90718663 90747700 90027110 87656711 84753527 81360071 77655577 73369058 70170117
15033 70170117 66443212 63023664 60487008 59419013 60148505 61791159 62413509 62194974
15025 62194974 62409176 62077403 62236415 61813053 60444503 59442995 59004412 59430017 62620504
15016 62620504 67406865 74887488 82180671 88889169 95718241 101653443 106351942 110526759
15008A10526759J926225Q01630r63226n23109j495461J43905K760601M130507
15000A17307831P136526Q794799R489962Q802882P296731M059331J759828p98927
14992A63848963l102450o951906p909877q969222p916382n385746l395109j436279
14984A18781992R58552L056240M981420O481652P197500R262039J0292735J1667823
14976A72679953J3445550J5139982J5337684J4467179J2772213R954813N356627
14969B59154001J052483m160570p602595j2697137j5443544j7312619j8201816
14962A84788203j7875353j6273760j3198279j1239228p576211l516724P13008
14955A15821656M449715J0344081J6446956K2310567K7762959L0919140L5869209
$$ plain form
15008 110526759 112452984 113254614 112291388 111768279 110272818 110416723 113177324 117307831
15000 117307831 124444357 133239156 142729118 151532000 158828731 162888062 164647890 163848963
14992 163848963 160746513 153794607 145884730 136915508 128999126 123613380 120218271 118781992
14984 118781992 119740544 122796784 127778204 134259856 141457356 150719395 161012130 172679953
14976 172679953 186125503 201265485 216603169 231070348 243842561 253797374 259154001
14969 259154001 260206484 256045914 248443319 235746182 220302638 202990019 184788203
14962 184788203 166912850 150639090 137440811 126201583 118625372 115108648 115821656
14955 115821656 120271371 130615452 147062408 169372975 197135934 228055074 263924283
14948B63924283L7937681L6067378L6326822L3963846K6605473J2831385L96562
14941D48053430j1947202j7840977k1306668k3775522k8499681k9936881k8907453
14934B85839046k6704240k3059911j8321862j4182964j2065939j2523758j2055005
14927A66925367j3748093j2832551j0037472p465956m238526l378551l343714
14920A11880504m382607n903917m968012n728484o153946p455553q312755q540003
14912F0435227p967899p289088o120429m580641k072404k460590q36718K2948
14904B9130406l08119O89210P31880J100454J885569J662476K714403L057550
14896D0663829N692173P065123O351820N457640K977672J869973J214371p64884
$$ plain form
14948 263924283 301861964 337929342 374256164 408220010 434825483 447656868 448053430
14941 448053430 436106228 418265251 396958583 373183061 344683380 314746499 285839046
14934 285839046 259134806 236074895 217753033 203570069 191504130 178980372 166925367
14927 166925367 153177274 140344723 130307251 122841295 118602769 115224218 111880504
14920 111880504 107497897 101593980 96625968 90897484 84743538 77287985 68975230 60435227
14912 60435227 52467328 45178240 39057811 34477170 32404766 29944176 29107458 29130406
14904 29130406 28822287 29511497 30243377 31343831 33229400 34891876 37606279 40663829
14896 40663829 46356002 53421125 59772945 65230585 68208257 70078230 71292601 70527717
14888G0527717j346119l758611m780639n165604n746183m599595k904813k054048
14880D0172105j200973l02790q21602K2728J64286R43978P91877J197658M95580
14871D1462847O72843j12693Q78824J019422k42205L92228M53303J62170R35828
14862D5622567K264237K078434O025108Q539872R845389J1084215J2102712J0379616
14854A07942150Q869412N519700K251813k648223n010415q037541r893686j1257098
14846H7736112j1285311j0673771q398437p329300n195349k828062k195940j216882
14838C8613060j451040j091030r57731j133469j408746o5845j643851K3051n66140
14829C0318259P18730l71256L81771Q12927Q06272Q52402J638750K487616N130614
$$ plain form
14888 70527717 69181598 65422987 60642348 55476744 49730561 45130966 42226153 40172105
14880 40172105 38971132 38668342 37846740 37869468 38033754 38977732 39769609 40967267 41462847
14871 41462847 42135690 42022997 42901821 43921243 43679038 44071266 44524569 44686739 45622567
14862 45622567 47886804 49965238 55990346 64530218 74375607 85459822 97562534 107942150
14854 107942150 116811562 122331262 124583075 121934852 116924437 108886896 98993210 87736112
14846 87736112 76450801 65777030 57378593 50049293 44853944 42025882 39829942 38613060
14838 38613060 37162020 36070990 35113259 33979790 32571044 32505199 30861348 30884399 30318259
14829 30318259 31036989 30665733 31047504 31860431 32666703 33519105 35157855 37645471 42776085
14820D2776085P796807R827587R715460P920317M786801K808300K80230j692403
14812H4219184l592240o981845p993353r318681q455603q423692n369259m163180
14804B9921331k995533j164702j247823j15094m52226m6758K23909k61015k6219
14795B3835870M01650o58411M3945k98104l31640J92034m82005o7011q47386O37007
14785B2425949p38429M89631q3134N1525P69759n7809J179990J064120R69092
14776B6070694R36833K77170O50923n1866j58703o35987j052842j354816j064975
14767B3616431j306772n06464n21994q22380k10673p1903L90016k90947k78758
14758A9996556N03725L91668l82631K13279P6859O03545O56464J157225J091607
$$ plain form
14820 42776085 50572892 60400479 70115939 78036256 82823057 85631357 85911587 84219184
14812 84219184 80626944 73645099 65651746 56333065 47877462 39453770 34084511 29921331
14804 29921331 26925798 25761096 24513273 24398179 23945953 23899195 24123104 23862089 23835870
14795 23835870 24237520 23579109 23623054 23324950 22993310 23185344 22703339 22636328 21788942 22425949
14785 22425949 21687520 22177151 22094017 22145542 22915301 22857492 24037482 25101602 26070694
14776 26070694 27007527 27284697 27935620 27883754 27725051 27089064 26036222 24681406 23616431
14767 23616431 22309659 21803195 21281201 20458821 20248148 20176245 20566261 20275314 19996556
14758 19996556 20500281 20891949 20509318 20722597 20799456 21403001 22059465 23216690 24308297
14749B4308297N10799R8666L47396K04117N58338q22950L96396K6624k74039k5955
14739B5327689J124756J135881J612876J747423L095062M526382N264524Q882890
14731E2717483J4955057K1758699L0990422L8545857M1378812M0424589L3364113
14724B74135032K3858613J2302207K933967r553127j9913482k8580509l5648870
14717B19533831l8679054l6382801l2711019k6540135j9262313j2579081r007193
14710D4372235n997572m433400k923295k486557k335933j027064j331899o12291
14702B3224224j395754j485151r28521j233058k30916p22028n56282K39205M36080
14693A7347799K98617J48782k86079O27897l31483J82772r926m151j70831m12763
$$ plain form
14749 24308297 24819096 24917762 25265158 25469275 26027613 25204663 25601059 25627683 25353644 25327689
14739 25327689 26452445 27588326 29201202 30948625 34043687 38570069 43834593 52717483
14731 52717483 67672540 89431239 120421661 158967518 200346330 240770919 274135032
14724 274135032 297993645 310295852 313229819 303676692 283763210 255182701 219533831
14717 219533831 180854777 144471976 111760957 85220822 65958509 53379428 44372235
14710 44372235 38374663 33941263 31017968 28531411 26195478 25168414 23836515 23224224
14702 23224224 21828470 20343319 19414798 18181740 17950824 17228796 16672514 16911719 17347799
14693 17347799 17646416 17795198 17509119 18137016 17805533 17988305 17978379 17974228 17803397 17390634
14683A7390634P55225N23701P3490Q21558Q70885J047724J468066J655144J133010
14674B5739437J188391N37230o83748q6854j443192r12039j537028j200671j473761
14665B0127765K44521K62938k31774l09653M67395m15237P3615o74374o16830
14656A8928366r92711j701736q53824j249331m90623m73946k43822M66583J473053
14647A4862009J186508R40061J286628J039622N70716N41158J038122K62880Q61878
14638B2589582J511800O89516J654637O48877J218607L08543m5552j106120j833347
14629B5636543j382574k258258k641097l060566j622615k540686j515444n08068
14621A0107235o04779o20587J39929p10530P11338m3796k57634J85100K30104
$$ plain form
14683 17390634 18145859 18669560 18743050 19564608 20435493 21483217 22951283 24606427 25739437
14674 25739437 26927828 27465058 26781310 26694456 25251264 24339225 22802197 21601526 20127765
14665 20127765 20372286 20635224 20403450 20093797 20561192 20145955 20219570 19545196 18928366
14656 18928366 17935655 16233919 15380095 14130764 13640141 13166195 12922373 13388956 14862009
14647 14862009 16048517 16988578 18275206 19314828 19885544 20426702 21464824 21727704 22589582
14638 22589582 24101382 24790898 26445535 27094412 28313019 28621562 28576010 27469890 25636543
14629 25636543 24253969 21995711 19354614 16294048 14671433 12130747 10615303 10107235
14621 10107235 9502456 8881869 9021798 8311268 9022606 8978810 8721176 8906276 9136380
14612I136380m12731K10720o54446L08396j10173m77530k18775J3503L67352n7810
14602H104886Q33783J080280J816050K224003K346222J978707J938555M09300
14594B0731786M28891n50049j293699j044399j929873j747258j862780j888069
14586A0844550j277742m16298k71889n92128n76829M06778m12205J32684J39720
14577G976641k61836L68899P9289J61006Q582J078435O43774j5915Q24911Q41070
14567A1704856J876075K322114J916867J444544J442831J204519K505540L242621
14559B7659967O387586Q985363R000503O527427M040069K232528R25218j007893
14551F4750768k665380n202988o448686p561707o294049n361432k957029L020040
$$ plain form
14612 9136380 8723649 8934369 8279923 8588319 8478146 8000616 7781841 7795344 8162696 8104886
14602 8104886 8938669 10018949 11834999 14059002 16405224 18383931 20322486 20731786
14594 20731786 21160677 20610628 19316929 18272530 16342657 14595399 12732619 10844550
14586 10844550 9566808 9150510 8878621 8286493 7709664 8116442 7704237 7836921 7976641
14577 7976641 7714805 8083704 8162993 8323999 8332581 9411016 10054790 10038875 10863786 11704856
14567 11704856 13580931 15903045 17819912 19264456 20707287 21911806 24417346 27659967
14559 27659967 34047553 43032916 52033419 58560846 62600915 64833443 65758661 64750768
14551 64750768 62085388 56882400 50433714 42872007 36577958 31216526 28259497 31279537
14543C1279537P569814R924576R851646P500487N492146K062518O78119j640511
14535G2718332m484496o823048p635568q386225p791992o564707m308568k827265
14527B3896463r95670q66304o20188o51777l13363m13892Q56378K770917N794277
14518B9456841P136095P349004M913949L777144J813272J880507k12739r05334
14510E5208739k597550l128198m251611l932331l200861j38258K052268M524529
14502D4536727O495293M164350L115167J376670J482931j189946j518954k813394
14494E5648844m536089l814725n178868o086379m604042m251372k840744k835939
14486B1500686k312359k523359k218422k046656j809787j624141m11858l28702
$$ plain form
14543 31279537 38849351 48773927 58625573 66126060 71618206 73680724 74358843 72718332
14535 72718332 68233836 61410788 53775220 45388995 37597003 31032296 26723728 23896463
14527 23896463 22900793 22034489 21414301 20762524 20449161 20035269 20891647 23662564 29456841
14518 29456841 36592936 43941940 48855889 52633033 54446305 56326812 56114073 55208739
14510 55208739 52611189 49482991 45231380 41299049 38098188 37959930 40012198 44536727
14502 44536727 51032020 55196370 58311537 59688207 61171138 59981192 58462238 55648844
14494 55648844 51112755 47298030 42119162 36032783 31428741 27177369 24336625 21500686
14486 21500686 19188327 16664968 14446546 12399890 10590103 8965962 8554104 8225402
14478H225402n40430m52996j31018N12050q6937K54411K72193J327486J605305
14469A0985466J167642J195748J354484J12767M42496n09447J5237L048j071291
14460A3696150L5022J236136O15177K106462N95730N86564L22932P74004o99249
14451A9268928q80880q66889k184540j156489j375885j434094j0971n52493j1786
14442A0794901q6488M95109L5774O10579L87951J07607J059595R91706l09243
14433A4087491R72682O47644J311256K188261L486294N432424O717541P081182
14425D1924775O841896M780085L640605J273817J482285j676244k359090m991141
14417E0916988n081746n930474n217110n065231m046557k983206k087816k770299
$$ plain form
14478 8225402 7684972 7231976 7100958 7613008 7526071 7780482 8052675 9380161 10985466
14469 10985466 12153108 13348856 14703340 14816107 15258603 14749156 14764393 14767441 13696150
14460 13696150 13731172 14967308 15582485 17688947 18284677 18871241 19194173 19968177 19268928
14451 19268928 18388048 17521159 15336619 14180130 12804245 11370151 11359180 10806687 10794901
14442 10794901 10708413 11203522 11239296 11849875 12237826 12345433 13405028 14396734 14087491
14433 14087491 15060173 15707817 17019073 19207334 22693628 28126052 34843593 41924775
14425 41924775 48766671 53546756 57187361 58461178 59943463 58267219 55908129 50916988
14417 50916988 45835242 39904768 34687658 29622427 25575870 22592664 20504848 17734549
14409A7734549j141444j091053j736299o40662r10888j30477j32008k99877K63716
14400A1915557o19765K09697O17340P76252J191037J542655K419688M324246P053061
14391B9429768R868569J1974668J2206929J0162826Q750466N601530L029817m13630
14383I0610943l590829o586264q785519j0140035j0640777r431062q842840o298674
14375B6294943m456900l524178j667449j821924o76151m69735o34410o34010j53898
14366A2256288k7786k3861l22194k04531l03202l95242N79680N20572J425842
14357A3505566N25924K312237L141424M336300M712436M917298M206301L622595
14349D1280081J445888K27729j08994k448030k555049m173240l995527m544126
$$ plain form
14409 17734549 16593105 15502052 13765753 13125091 12214203 12083726 11951718 11651841 11915557
14400 11915557 11295792 11505489 12122829 12899081 14090118 15632773 18052461 22376707 29429768
14391 29429768 39298337 51273005 63479934 73642760 82393226 87994756 91024573 90610943
14383 90610943 87020114 80433850 71648331 61508296 50867519 41436457 32593617 26294943
14375 26294943 21838043 18313865 16646416 14824492 14148341 13678606 13044196 12410186 12256288
14366 12256288 12228502 12204641 11882447 11677916 11374714 10979472 11559152 12079724 13505566
14357 13505566 14031490 16343727 19485151 23821451 28533887 33451185 37657486 41280081
14349 41280081 42725969 42953698 42844704 40396674 37841625 33668385 29672858 25128732
14341B5128732l974473l196292j889806j431948P40053M543475P214854O511000
14333C3645595L609012K280112J256248O06919m93859j696778m526378m183063
14325C0497808m765221n579972m673654k386134j398127o16005n09608l43826
14317A0225261L38315k7425l90530M65334P59148M06285O22588O49697M95374
14308A3544047Q01475N40487P35787J033586J107569J005766P11341J329903J360556
14299B2170517K499322K356318L568914L381105M881570O287161R189534J0787413
14291F5121854J4704645J9244933K6218920L3780721L7554739L7376804L0991741
14284B64994357K2752093J3586946M892755m109984j3564286k2969973k9841392
$$ plain form
14341 25128732 21154259 17957967 16068161 14636213 15376266 19919741 27134595 33645595
14333 33645595 37254607 39534719 40790967 41397886 40904027 39207249 34680871 30497808
14325 30497808 25732587 20152615 15478961 13092827 11694700 11078695 10569087 10225261
14317 10225261 10563576 10536151 10145621 10610955 11370103 11776388 12398976 13048673 13544047
14308 13544047 14345522 14886009 15621796 16655382 17762951 18768717 19480058 20809961 22170517
14299 22170517 24669839 27026157 30595071 33976176 38857746 45144907 54334441 65121854
14291 65121854 79826499 99071432 125290352 159071073 196625812 234002616 264994357
14284 264994357 287746450 301333396 306226151 302116167 288551881 265581908 235740516
14277B35740516l5768863l5590276l1845177k7259775k1168186j5898549j2320756
14270E5888934r403233p213246o181008m327603l673877k916139k614443j800074
14262A7759311j704221j396056q86086j297055r22681o53160k79100n90750m19526
14253I610676j23635k23034n68402l32200n96745J03514l96041k65717m37870
14244F770546k31205R8794l90939L88047o67375m4866Q06907o48598q6944m20836
14234E573531k25507j74141J26134L5421k88530m87345K08996l74930M43019j85068
14224D651580K77331L5946p10006M56566J37488m04576M70997j10063J75394L41771
14214E322428j74136K41977j92479p1113j86624O29801M36640J036894Q55947
$$ plain form
14277 235740516 199971653 164381377 132536200 105276425 84108239 68209690 55888934
14270 55888934 46485701 39272455 33091447 28763844 25089967 22173828 19559385 17759311
14262 17759311 16055090 14659034 13772948 12475893 11553212 10900052 10620952 10030202 9610676
14253 9610676 9487041 9264007 8695605 8363405 7766660 7870174 7474133 7208416 6770546
14244 6770546 6539341 6638135 6247196 6635243 5967868 5923002 6729909 6081311 5994367 5573531
14234 5573531 5348024 5173883 5300017 5335438 5046908 4559563 4768559 4393629 4836648 4651580
14224 4651580 4928911 4964857 4254851 4711417 4848905 4444329 4915326 4805263 4980657 5322428
14214 5322428 5148292 5390269 5197790 5126677 4940053 5569854 6006494 7043388 7899335
14205G899335n3403J23376p4372k00738K84738l44565r11222o33439l51833r39159
14195D798718L2190j3785J9791J66999l53168J41004o1018O24399n65667L1851
14185D821314L51904q48538M08738m92324m89553K72980K34426k03495K05212
14176D260664l32766n80304K61467N37435J11764j33748K71549k87028M4941m09906
14166C744068L49398K59248l89608L00774j33452k70103J04891K28475J93068
14157D386759k98495R4218M06502m63931J69615j62213K71319l83079N22460l15297
14147D227858K63476M97058o87440M82190M82523O20867R74485K165454K160241
14138A1186712L087350J681565K050628P56431J230118P1510m13026j110896j962561
$$ plain form
14205 7899335 7845932 7969308 7894936 7694198 7978936 7634371 6723149 6089710 5737877 4798718
14195 4798718 4830908 4817123 4836914 5003913 4650745 4791749 4730731 5355130 4789463 4821314
14185 4821314 5173218 4324680 4733418 4241094 3751541 4024521 4258947 4055452 4260664
14176 4260664 3927898 3347594 3609061 4146496 4258260 4124512 4396061 4109033 4153974 3744068
14166 3744068 4093466 4352714 3963106 4263880 4130428 3860325 3965216 4193691 4386759
14157 4386759 4088264 4182482 4588984 4125053 4294668 4132455 4403774 4020695 4543155 4227858
14147 4227858 4491334 4988392 4300952 4783142 5265665 5886532 6861017 9026471 11186712
14138 11186712 14274062 15955627 18006255 18762686 19992804 20064314 19651288 18540392 16577831
14129A6577831j800055k602302k578546j006097j006919o36022p62195O4211O1408
14120F311314J246541J27509N58746L19289M1200K36285j32466o99056k72477
14111G736885r01685L33263r50478K63880j295210k6271J9205J20471Q1443j20764
14101E260739J96230L69801Q49167K79705J390797J153353J14945O31427M5272
14092A0291436L32006m54831l20507n77906o90025r2399n70587Q92476P65132
14083I574795Q54372K71556J164856K37940J63760k8697n10664n44733j180362
14074A0002823m32835j569129m52193q87920k59776p97525L78875J08494l49554
14065E741260j31844L74320K31425k11536N85302O63576J005374M86107K60101
$$ plain form
14129 16577831 14777776 12175474 9596928 8590831 7583912 6947890 6185695 6249906 6311314
14120 6311314 7557855 7685364 8244110 8563399 8604599 8840884 8708418 8009362 7736885
14111 7736885 6835200 7168463 6217985 6481865 5186655 5160384 5179589 5300060 5381503 5260739
14101 5260739 5456969 5826770 6675937 6955642 8346439 9499792 9614737 10246164 10291436
14092 10291436 10623442 10168611 9848104 9270198 8580173 8487774 7917187 8809663 9574795
14083 9574795 10429167 10700723 11865579 12103519 12267279 12238582 11727918 11183185 10002823
14074 10002823 9569988 8000859 7548666 6660746 6400970 5603445 5982320 6090814 5741260
14065 5741260 5609416 5983736 6215161 6003625 6588927 7252503 8257877 8743984 9004085
14056I004085P57419N42043n29269N98434q2337n72908p7376J12431M7134N02622
14046A0302278N87001L92342R51126Q08847K91278J540609J006338P2792j12068
14037A5840543L13084j93875k14676m26M05511J53378K56922P17584J13145K002722
14027A9393912N51164J698054J954360K211317L423350L970056M669322O276448
14019D4147983P269857R673003J3610069J8125931K5422050L3409138L9088742
14012A90746773M0334540L3403037K4903617J6508970O248326k474249j2181067
14005B97489947k1999612k9622117l6521049l7705931l4038999k8676379k2395854
13998H6530006j6311732j2827313j0013684p683331n232925m254379l896607k704569
$$ plain form
14056 9004085 9761504 10303547 9774278 10372712 10290375 9717467 9640091 9752522 9799656 10302278
14046 10302278 10889279 11281621 12232747 13041594 13332872 14873481 15879819 15952611 15840543
14037 15840543 16153627 15959752 15745076 15744650 16150161 16303539 16560461 17278045 17391190 19393912
14027 19393912 19945076 21643130 23597490 25808807 29232157 33202213 37871535 44147983
14019 44147983 51417840 61090843 74700912 92826843 118248893 151658031 190746773
14012 190746773 231081313 264484350 289387967 305896937 312145263 309671014 297489947
14005 297489947 275490335 245868218 209347169 171641238 137602239 108925860 86530006
13998 86530006 70218274 57390961 47377277 39693946 34461021 30206642 26310035 23605466
13990B3605466k035070o85662j665857j021300n70181q31910k50320j42419l52100
13981A6050647p96436k75414k70758j149n40469j30536n20195q30523n60792n41805
13971A1582570r53513p10674k17877o85387l81324o20695m76569q475p61198j09167
13961F657691m30576l98802K12908l68512k57549j09936p8050K36116j46045k05052
13951E112193K90151P64855J23470M28022O37556N84932J36485M21674l43873
13942H155465Q46844M22513Q46302K163388K911605N850471O920795P245482Q107366
13933D3470231Q115466N452169M510310O37874j045700l408049n512881o233108
13925D5986312q051426p589496o604504n484134m859325l357394j789511j408069
$$ plain form
13990 23605466 21570396 20884734 19218877 18197577 17627396 16795486 16545166 16402747 16050647
13981 16050647 15254211 14978797 14708039 14706890 14166421 14035885 13515690 12685167 12124375 11582570
13971 11582570 10629057 9918383 9700506 9015119 8633795 8013100 7536531 7528056 6766858 6657691
13961 6657691 6227115 5828313 6041221 5672709 5415160 5305224 5227174 5463290 5317245 5112193
13951 5112193 5402344 6167199 6290669 6718691 7356247 7941179 8077664 8499338 8155465
13942 8155465 9002309 9424822 10271124 12434512 15346117 21196588 28117383 35362865 43470231
13933 43470231 51585697 57037866 61548176 62186050 61140350 57732301 52219420 45986312
13925 45986312 37934886 30345390 23740886 18256752 13397427 10040033 8250522 6842453
13917F842453j024836q64772L00689r44875o4218j29394P5487P960J02512m15833
13907C885173K21594j63033j14825K41819k53493l9481L12932m61047o7756K90564
13897C852447o6779J98454k91520j50492J59358J25921k9743K03897l02469M38169
13887D137243R0464l3398n37760M49919k93831j47634K00800l81702N59518n97150
13877C446469R0117k56148k53492M07597L7915j76527J98586L71423o11318M85007
13867C739629l06166N36092k80925j57750K8331j42215O26154n01869J13798J70424
13857C825503n6865M4926J01260l6473L43657K8802l20243l33924Q13143m64089
13847C945697m73068R51997n13454K11502L24847p40803O38852m37477l80094
$$ plain form
13917 6842453 5817617 4952845 5253534 4308659 4244441 4115047 4190534 4198494 4301006 3885173
13907 3885173 4106767 3943734 3828909 4070728 3817235 3777754 4090686 3629639 3561883 3852447
13897 3852447 3785668 3984122 3692602 3542110 3701468 3827389 3797646 4001543 3699074 4137243
13887 4137243 4227707 4194309 3656549 4106468 3812637 3665003 3865803 3484101 4043619 3446469
13877 3446469 3536586 3280438 3026946 3434543 3472458 3295931 3494517 3865940 3254622 3739629
13867 3739629 3433463 3969555 3688630 3530880 3559211 3416996 4043150 3541281 3655079 3825503
13857 3825503 3768638 3813564 3914824 3878351 4222008 4250810 3930567 3596643 4409786 3945697
13847 3945697 3472629 4424626 3911172 4122674 4447521 3706718 4345570 3908093 3527999
13838C527999J3179L4945n6345m94502p2643M79113l55694J03111k58137j50037
13828B770989J20529k63066N04318M47236j90805M18156m76658J65807q1990p4956
13818C339560K08271k04497K56708p63411P5409k5503L10657l37230J018957l95510
13808C483411q72871P28479j67780j56832m2100O8329K2226m5120m66641J21418
13798B672519M90652q7161L29562K11330N971L876j08503J13630k93575J15985
13788C454286J53281m58019L5045L4109n29657N86683J22668m28580L83141j73038
13778C179919k16455K11877k52797l7812M3192o7335J05591P8785J29715j33460
13768C041220K6937K98153k00153M24j6414M18039m91756K55482L0044l48944
$$ plain form
13838 3527999 3541178 3576123 3519778 3025276 2952633 3431746 3076052 3179163 2921026 2770989
13828 2770989 2891518 2628452 3132770 3580006 3389201 3807357 3330699 3496506 3414516 3339560
13818 3339560 3547831 3343334 3600042 2836631 2912040 2886537 3197194 2859964 3878921 3483411
13808 3483411 2610540 3339019 3171239 3014407 2972307 3040636 3062862 3017742 2551101 2672519
13798 2672519 3163171 3076010 3405572 3616902 3622873 3626749 3518246 3631876 3338301 3454286
13788 3454286 3607567 3149548 3184593 3218702 2689045 3275728 3398396 2969816 3352957 3179919
13778 3179919 2963464 3175341 2922544 2884732 2927924 2860589 2966180 3044965 3174680 3041220
13768 3041220 3068157 3366310 3166157 3166581 3150167 3568206 3076450 3331932 3361976 3013032
13758C013032J12985l03797o4718j38567L5988J81376p6070j57293K52589k64444
13748B591081J17001K73958m34999J06873L53222m20478J65833l95044L15523
13739B672970L86365o76814L58195m1288J97534J54003M6405L2240L81172P5580
13729C586362j25411K4018N35935l82291N80990l51662J39829J475P14185p22739
13719D000691J39876j93275J27763l00109j93308O7791n18523k75678L15623K38823
13709C409674m27663M68834p8774j54066J09912P7589M47888j64674j1190j87513
13699C490017N12119p72521Q34179k15080R26579J83885N56992N3570p4841L22746
13689E817645R7503q74292M80836m88438j73217n17711n32928j66453m1531L57624
$$ plain form
13758 3013032 3126017 2822220 2757502 2618935 2654923 2836299 2760229 2602936 2855525 2591081
13748 2591081 2708082 2982040 2547041 2653914 3007136 2586658 2752491 2357447 2672970
13739 2672970 3059335 2382521 2740716 2699428 2896962 3050965 3097370 3129610 3510782 3586362
13729 3586362 3460951 3484969 4020904 3638613 4219603 3867941 4007770 4009245 4723430 4000691
13719 4000691 4140567 3947292 4075055 3774946 3581638 3649429 3130906 2855228 3170851 3409674
13709 3409674 2982011 3450845 3372071 3218005 3327917 3405506 3853394 3688720 3677530 3490017
13699 3490017 4002136 3229615 4063794 3848714 4775293 4959178 5516170 5569740 5494899 5817645
13689 5817645 5915148 5040856 5521692 5033254 4860037 4342326 3809398 3642945 3601414 3959038
13679C959038m70089L79362K61439L4004J93801m3876q7917K35732K91808K52394
13669E005696K60465n99261L40526R02123J44017Q39967j58292Q27363K00229
13660G762833k14958j82495n21848L85690j032251l81056J623n62747o48224K98819
13650D905386k74648l95946j47180J85198k98829P5703n8832k78227O31976m15071
13640C929530J29806P8409j69349M86799M88882Q25831J70319K53502Q8407N35710
13630F817846J76783n33708R2861r02351k33770l05309k1768j055987m020l56451
13620C674126j45762L5253o695j30768q0776M14333l2086R407p1410L94783L02333
13609D362738m45878M79786k17587K47995M29111r6906l63889j49215J36568k3506
$$ plain form
13679 3959038 3488949 3868311 4129750 4163754 4357555 4313679 4225762 4461494 4753302 5005696
13669 5005696 5266161 4666900 5007426 5909549 6053566 6893533 6735241 7562604 7762833
13660 7762833 7547875 7365380 6843532 7229222 6196971 5815915 5817538 5254791 4606567 4905386
13650 4905386 4630738 4234792 4087612 4272810 3973981 4049684 3990852 3712625 4344601 3929530
13640 3929530 4059336 4137745 3968396 4455195 4944077 5769908 5940227 6193729 6282136 6817846
13630 6817846 6994629 6460921 6553782 5651431 5417661 5112352 5090584 4034597 4030577 3674126
13620 3674126 3528364 3563617 3556922 3426154 3345378 3759711 3727625 3737032 3665622 4060405 4362738
13609 4362738 3916860 4396646 4179059 4427054 4856165 4759259 4395370 4246155 4382723 4359217
13599D359217n39071J4420k81574N06947Q1482n8955J954j67638K51456R4274
13589D262512M06351l7703r8412l64558K03277p20442l48160J5941n9433l65617
13579B893756L16320l88680O37668j13590n49586M51154k36826K51840K91160
13570C553216m12792J47933k55689L32082m99343L4441M24977k72772K92267j92297
13560C152023o18773R55074o3528o10075R3502j72234Q1681N29980k77635j27209
13550B942806M75808n09066L76083j97913J99840M28627N68014L11231Q13991
13541E409421K53906L4569K84466j57386K46828m99643j56302Q8966j354729N30564
13531D680660p25218l21133L40341J84170k96917Q68286N37739Q0389K94217N94445
$$ plain form
13599 4359217 3820146 3834566 3552992 4059939 4141421 4082466 4084420 3916782 4168238 4262512
13589 4262512 4668863 4631160 4532748 4168190 4371467 3651025 3302865 3318806 3259373 2893756
13579 2893756 3210076 2821396 3459064 3345474 2795888 3247042 3010216 3262056 3553216
13570 3553216 3140424 3288357 3032668 3364750 2865407 2899848 3324825 3052053 3344320 3152023
13560 3152023 2533250 3488324 3424796 2814721 2908223 2735989 2817670 3347650 3070015 2942806
13550 2942806 3418614 2909548 3285631 3087718 3287558 3716185 4284199 4595430 5409421
13541 5409421 5663327 5697896 5982362 5824976 6071804 5572161 5415859 5504825 4150096 4680660
13531 4680660 3955442 3634309 3974650 4158820 3861903 4730189 5267928 5348317 5642534 6236979
13521F236979J4764n46284l19413M8999o46749p2994q17561j31180k83412l44080
13511C139069J29933j71180q05380R27643L244l43949o7271k13823n19413O65342
13501B744215J85617n23573K72708l60432K93376j50206j47710O66686n10779
13492B469902K20777l71677M18782L7492Q2162l45575K35444P8237Q0129m10053
13482B495620K95673n1771J75219k44227r8519r4635P4452N03268m12446o40057
13472B002577J116802m37471k5104O4773N20738o69376J90046j62099k96334M21014
13462B725566K99873j81668j36391o2827k57565N93183J69713J27501K69365K00057
13452C746807J103047L58931P73596m74773M48674k28500q9439l85434l20227
$$ plain form
13521 6236979 6251743 5705459 5386046 5435045 4788296 4715302 3897741 3766561 3483149 3139069
13511 3139069 3269002 3097822 2292442 3220085 3223329 2879380 2812109 2598286 2078873 2744215
13501 2744215 2929832 2406259 2678967 2318535 2611911 2461705 2313995 2980681 2469902
13492 2469902 2690679 2319002 2737784 2775276 2857438 2511863 2747307 2825544 2905673 2495620
13482 2495620 2791293 2739522 2914741 2670514 2571995 2477360 2551812 3055080 2642634 2002577
13472 2002577 3119379 2681908 2656804 2721577 3242315 2572939 2762985 2600886 2304552 2725566
13462 2725566 3025439 2843771 2707380 2644553 2386988 2980171 3149884 3277385 3546750 3746807
13452 3746807 4849854 5208785 5982381 5507608 5956282 5727782 5638343 5252909 4932682
13443D932682k9681n31371o94409p7730m55386l6707K20013m86232k65234k30444
13433B345501K71065o063K75572J899n49490L86022K30791N577L30034J26591
13423C417499O15904L68628M38272L08735L74154J65015l62297O51295p90371
13414E186834O3055r10905k66411n36242r6128L21018l46075o70120p0259J11683
13404B786450K53116m47835M96865m66174K74488j28671p558j4611j39458O64171
13394C270783n08167O20730l3312q8566J70813M54704k79144M02705M44215O66811
13384E121572k92161O13706l43965M02749K62621l60002L9540m01777n01202j06354
13374D434727m56459j36082l85664J19576K5770L41794n35624M53843K28212n73952
$$ plain form
13443 4932682 4903001 4371630 3677221 3599491 3144105 3107398 3327411 2841179 2575945 2345501
13433 2345501 2616566 2610503 2886075 2887974 2338484 2724506 2955297 2960874 3290908 3417499
13423 3417499 4033403 4402031 4840303 5149038 5523192 5688207 5325910 5977205 5186834
13414 5186834 5249889 4338984 4072573 3536331 3440203 3761221 3415146 2745026 2674767 2786450
13404 2786450 3039566 2591731 3088596 2622422 2896910 2768239 2760681 2746070 2606612 3270783
13394 3270783 2762616 3383346 3350034 3261468 3432281 3886985 3607841 4010546 4454761 5121572
13384 5121572 4829411 5443117 5099152 5501901 5764522 5404520 5444060 5042283 4541081 4434727
13374 4434727 3978268 3842186 3456522 3576098 3601868 3943662 3408038 3861881 4090093 3516141
13364C516141M35976M60843l68983l21577k35346K01627k0336M0311M68466q68945
13354C308177P30025K17480L72333l44139Q5082J94645P4875n02098j76120J54723
13344D114983p57116L11094J0882l41280O39139m56702l9494j09626k5734l86942
13334B959204N07760j63683q9043J42900k06502L16055K32929R456K24947l09780
13324C624243l84323k07410N74089j23218L90744L16909l51282M63583m09389
13315C893946N92981K90608P29830l93975L46184o0643M14015n18021l41787M77002
13305E430140j51212l90990j29691J67107k07400M93858j14383J77583J90041
13296E465053K35602N46278k78817q7320O0107l82960J35422k4341m64257K73385
$$ plain form
13364 3516141 3952117 4412960 4043977 3722400 3487054 3688681 3668345 3708656 4177122 3308177
13354 3308177 4038202 4255682 4628015 4283876 4368958 4563603 4638478 4136380 3960260 4114983
13344 4114983 3357867 3668961 3679843 3338563 3977702 3521000 3481506 3371880 3346146 2959204
13334 2959204 3466964 3303281 3214238 3357138 3150636 3466691 3699620 3709076 3934023 3624243
13324 3624243 3239920 3032510 3606599 3483381 3874125 4191034 3839752 4303335 3893946
13315 3893946 4486927 4777535 5507365 5113390 5459574 5398931 5812946 5294925 4953138 5430140
13305 5430140 5278928 4887938 4758247 4925354 4717954 5211812 5097429 5275012 5465053
13296 5465053 5700655 6246933 5968116 5880796 5940903 5557943 5693365 5669024 5204767 5478152
13286E478152m14838L90827m78044r0978r8718J99120L34975N95711k57218j78916
13276E480073L03757K17051n1605L16708n92616Q18441k97451O05830m55229K78236
13266F623195N54983J48834L36148K74643j99627L34261M45856J25811N25275
13257I169379J67063K23410Q4099Q18739l10270j35834N83356j90196O04182m63113
13247A0550815N52535l16708L85431l84612M40076l29719O29045L07531N90830
13238A2425224P24487j28224K32198N95555P73166O30003Q25890j58081L00299
13229A6220517Q6713Q82258n07167J2273k51138l23814k52566q7549l74815n91313
13219A4813399M12337n77349N14498q44979n9462J38227J98231o99986K07766
$$ plain form
13286 5478152 5063314 5454141 4976097 4885119 4786401 4985521 5320496 5916207 5658989 5480073
13276 5480073 5783830 6000881 5949276 6265984 5673368 6491809 6194358 6800188 6344959 6623195
13266 6623195 7178178 7327012 7663160 7937803 7738176 8072437 8518293 8644104 9169379
13257 9169379 9336442 9559852 9643951 10462690 10152420 10016586 10599942 10409746 11013928 10550815
13247 10550815 11103350 10786642 11172073 10787461 11227537 10897818 11526863 11834394 12425224
13238 12425224 13149711 13021487 13253685 13849240 14622406 15252409 16078299 15920218 16220517
13229 16220517 16307230 17189488 16682321 16694594 16443456 16119642 15867076 15779527 15404712 14813399
13219 14813399 15225736 14648387 15162885 14317906 14258444 14396671 14594902 13894916 14102682
13210A4102682J29440M68042n39689K79436Q2840j77507J30908k94525l1806n84985
13200A3564836Q0285l45742k03326j79958o52192J42462n3848l47248n74402J26792
13190A1557659j33044k06524k5682q4363M01721l98461l98814k89810L14646p0846
13180A0666482n6787J02377o35425K1002M5212L77522m62802j62890J53727N61921
13170A0610339m02077n55406M51467K52775p8447K36416K56938K32652M73850
13161A1478507N88664J26174K42296J25832R17457m06626N23637J03203L8302
13152A3737446m401k63560o39029Q5310J52767k55105j26077j91427J37457l30536
13142A2302845J01850m21162M92308n63593k60991p95779M8808l90069q19346
$$ plain form
13210 14102682 14232122 14700164 14160475 14439911 14522751 14345244 14476152 14181627 14149821 13564836
13200 13564836 13645121 13299379 13096053 12916095 12263903 12406365 12352517 12005269 11430867 11557659
13190 11557659 11424615 11218091 11192409 11108046 11509767 11111306 10712492 10422682 10737328 10666482
13180 10666482 10609695 10712072 10076647 10097649 10142861 10520383 10057581 9894691 10048418 10610339
13170 10610339 10208262 9652856 10104323 10357098 10278651 10515067 10772005 11004657 11478507
13161 11478507 12067171 12193345 12435641 12561473 13478930 13072304 13595941 13699144 13737446
13152 13737446 13733045 13469485 12830456 12915766 13068533 12813428 12687351 12495924 12633381 12302845
13142 12302845 12404695 11983533 12475841 11912248 11651257 10855478 10904286 10514217 9694871
13133I694871K32683j332758J28546j30809o24808J97199M74753N2631l27125
13124H365183k29435J56264j05785K2853o68642J64985n80859J3274j78123p22304
13114F237411J78658K69066l87138L29602m36266M7234p2238N7580m96402p6129
13104E651378L67351q1841J14460o2150j23267J24851N31326N68441O86818M20875
13094H198242J286715Q37878K03614L16401J09827j04119j0907k70142l04100
13085A0263409j33494J31835O094j56631j07942L9393o5988k31779k99061o25413
13075H820423l61916q06037m03158L1391q56240K73646j240366J21579n00550
13066E078772K60249N0300l07562M2343j14856j59863M62465m34667M50814L50029
$$ plain form
13133 9694871 9927554 8594796 8723342 8592533 7967725 8164924 8639677 8692308 8365183
13124 8365183 8135748 8292012 8186227 8209080 7540438 7705423 7124564 7137838 6959715 6237411
13114 6237411 6416069 6685135 6297997 6627599 6191333 6238567 6166329 6223909 5727507 5651378
13104 5651378 6018729 5936888 6051348 5989198 5865931 5990782 6522108 7090549 7777367 8198242
13094 8198242 9484957 10322835 10526449 10842850 10952677 10848558 10837651 10567509 10263409
13085 10263409 10129915 10261750 10267844 10111213 10003271 10042664 9976676 9744897 9445836 8820423
13075 8820423 8458507 7652470 7249312 7280703 6424463 6698109 5457743 5579322 5078772
13066 5078772 5339021 5389321 5081759 5124102 5009246 4849383 5311848 4877181 5327995 5678024
13056E678024p2015l08468L07430J5689J15522l49264p222j46499l74161L19736
13046E178772j31678j47649P82119p89569l91033N79213J8944k82317K01181J29915
13036E147898n94816L38969O25744k86099k06145J45746L04258j79350P04051
13027F000256q9630m53986M98334o51599P66013m54382L96080P1841J61649r8062
13017F146514l32631K13971K31457L26652M76245k38203K73519J91458L963J36099
13007G429044R67474m02961O97771j58855K7067m95949J006839j32103O57929
12998I596256k22543M71081O17092J17649M2269K08282M00606O06235j9309J83670
12988A2001288K61667l28488J79137O30222j62447l20602N40799n23895K33436
$$ plain form
13056 5678024 5606009 5297541 5604971 5620660 5736182 5386918 5379696 5233197 4859036 5178772
13046 5178772 5047094 4899445 5681564 4891995 4500962 5080175 5099119 4816802 5017983 5147898
13036 5147898 4553082 4892051 5517795 5231696 5025551 5171297 5475555 5296205 6000256
13027 6000256 5910626 5456640 5954974 5303375 6069388 5615006 6011086 6082927 6244576 6146514
13017 6146514 5813883 6027854 6259311 6585963 7062208 6824005 7097524 7288982 7292945 7429044
13007 7429044 8396518 7993557 8691328 8532473 8559540 8063591 9070430 8938327 9596256
12998 9596256 9373713 9844794 10461886 10579535 10621804 10830086 11230692 11836927 11817618 12001288
12988 12001288 12262955 11934467 12113604 12743826 12581379 12260777 12801576 12277681 12511117
12979A2511117K92590L51551L56147p17046j92160K13211L9886k03545r48809
12970A1702942J63444K8067m04675L61301n71652k11258K2844l19502L26347J60319
12960A1258177k91134l06837l52091M32940q21391r3804k03594M1052o7362L13252
12950I909208j44869K0111k87455L44320o07040J41604j9462K52742q2426j70975
12940I355758L33309j95729J02416j54993N03405j37508M09033J02601m322P80697
12930A1094667J5517K61825q6069m59332N57156n0982l01089n77985L71451l52301
12920A0472858O02014j3466r4213O50835l56210m19279Q2141m35941j71569l02602
12910A0014568R4983m05244j43072o20526M74359p76702j96332j01524K40430
$$ plain form
12979 12511117 12803707 13155258 13511405 12794359 12602199 12815410 12855296 12651751 11702942
12970 11702942 11866386 11894453 11489778 11851079 11279427 11068169 11091013 10771511 11097858 11258177
12960 11258177 10967043 10660206 10308115 10741055 9919664 9825860 9622266 9663318 9595956 9909208
12950 9909208 9764339 9784450 9496995 9841315 9234275 9375879 9356417 9609159 9526733 9355758
12940 9355758 9689067 9493338 9595754 9440761 9944166 9806658 10215691 10318292 10313970 11094667
12930 11094667 11110184 11372009 11285940 10826608 11383764 11332782 11031693 10453708 10825159 10472858
12920 10472858 11074872 11061406 10967193 11618028 11261818 10842539 10924680 10488739 10317170 10014568
12910 10014568 10109551 9704307 9561235 8940709 9415068 8638366 8442034 8340510 8580940
12901H580940j89448n96403K85010l75022N1920o09023J0407j6501n8230k65553
12891F818097L67919n07575p1168j06839L03959n8518l62393L9305k16016L04350
12881F511121l00785j12902K35405k21733p5150r2463J33576l93932l58198L81182
12871E706121K66741K32117q64026M00455o73884K91418p58813P90251j06479
12862E283901j32662J70149j54430Q3898k65952L8221n89341Q62608l24051J89379
12852E161720k58791J83194k89463J04370O41288l80834j9804J58946n19839L5730
12842D816517N49413l00900P1053L5174M68174l93931N90192m74798k29657L71229
12832E502466M9330K4605k72153j53880j4913P9985l31658M56990N7724j53601
$$ plain form
12901 8580940 8391492 7795089 8080099 7705077 7756997 7147974 7158381 7141880 7083650 6818097
12891 6818097 7186016 6678441 6607273 6500434 6804393 6745875 6383482 6422787 6206771 6511121
12881 6511121 6210336 6097434 6332839 6111106 6035956 5943493 6077069 5683137 5324939 5706121
12871 5706121 5972862 6204979 5340953 5741408 5067524 5358942 4600129 5390380 5283901
12862 5283901 5151239 5321388 5166958 5250856 4984904 5023125 4433784 5296392 4972341 5161720
12852 5161720 4902929 5086123 4796660 4901030 5542318 5161484 5141680 5300626 4780787 4816517
12842 4816517 5365930 5065030 5136083 5171257 5639431 5245500 5835692 5360894 5131237 5502466
12832 5502466 5551796 5576401 5304248 5150368 5135455 5215440 4883782 5340772 5398496 5244895
12822E244895L73754m52853K12831o810J51463l51338J899j95901r4018L14103
12812E198025j01613j0442N0390P7227O7089m49634M40196K89356l03242K7280
12802E284632k9869L29793L415P4457n1423o13745O43158K64144q43485K13707
12792E274784M60835J10598J08913n72295O9049M28797j7068K5805K46546o43565
12782E492399M46791J9237O2114o91490O49061o49691L33905K35682k87724l2640
12772E577644l90117L61802K33752J1701k31430K62244q3211J51178L1027j5907
12762E908683J98455p2123J39418l54842R7632L14940l00891L46990l50353K98324
12752F226233m17321K34079K83188j33446m03564M41042k05462j52507M01155
$$ plain form
12822 5244895 5618649 5165796 5378627 5371817 5523280 5171942 5173841 4977940 4883922 5198025
12812 5198025 5096412 5085970 5136360 5213587 5280676 4831042 5271238 5560594 5257352 5284632
12802 5284632 5254763 5584556 5587971 5662428 5611005 4997260 5640418 5904562 5061077 5274784
12792 5274784 5735619 5846217 5955130 5382835 5451884 5880681 5863613 5889418 6135964 5492399
12782 5492399 5939190 5958427 6020541 5329051 5978112 5328421 5662326 5898008 5610284 5577644
12772 5577644 5187527 5549329 5783081 5794782 5563352 5825596 5742385 5893563 5924590 5908683
12762 5908683 6107138 6035015 6174433 5819591 5917223 6232163 5931272 6278262 5927909 6226233
12752 6226233 5808912 6042991 6326179 6192733 5789169 6230211 6024749 5872242 6273397
12743F273397m72280j00762K15587m23472K60301K59334J18672k80615Q3251M65675
12733F399088l39620k85482N01874m10567K74384L02645j97344n6789j12369L02358
12723F378178m17667Q3251L99450n11269m5138K01876J91196K59380l44840j22051
12713F072366l46226N60712j09953M64108n28628K08751N98639j64154J31250
12704F886865J71716K09309m55787Q34999K56329K54338l44056q9353O65585l32175
12694H057770R5525K07022j30908P68136J486227J504895J371281Q54257J254839
12685A5469044N01759J55831R6358m25677j108460p46480j302426j383849p45603
12676A0510497j029372n76091J44305K9948Q3731k74445P7313L20567l79868O55883
$$ plain form
12743 6273397 5801117 5700355 5915942 5492470 5752771 6012105 6130777 5850162 5933413 6399088
12733 6399088 6059468 5773986 6275860 5865293 6139677 6442322 6244978 6188189 6075820 6378178
12723 6378178 5960511 6043762 6443212 5931943 5886805 6088681 6279877 6539257 6194417 6072366
12713 6072366 5726140 6286852 6176899 6641007 6112379 6321130 6919769 6755615 6886865
12704 6886865 7058581 7267890 6812103 7647102 7903431 8157769 7813713 7724360 8389945 8057770
12694 8057770 8153295 8360317 8229409 8997545 10483772 11988667 13359948 14214205 15469044
12685 15469044 15970803 16126634 16222992 15797315 14688855 13942375 12639949 11256100 10510497
12676 10510497 9481125 8905034 9049339 9079287 9163018 8888573 8965886 9286453 8906585 9562468
12666I562468K95037j95952O48786m09495j1843o7774j96895j30953k18920N8754
12656I333213n59242k31740J40883J83383J58920K38711N15498P33162L40972
12647A0853760K78899J87002R52711l20885L8362P05069K73838l92805j78903
12638A2397048l12810O3787k60526N04055J66629k05605K52349o48663K73856
12629A2230120K454P71753L84996j40292M94088j74559j14587q9508j94914l41573
12619A2827978l56987m51442j064685o2976n48111l28345K47469O63521N04592
12610A1431014P18359P80696P23778J052952R49930L33890L47196k7814L51841
12601A6661842j040998r08666j018954q33068o38934j686868L77524j090298m25628
$$ plain form
12666 9562468 9857505 9661553 10310339 9900844 9889001 9821227 9624332 9493379 9274459 9333213
12656 9333213 8773971 8542231 8683114 8866497 9025417 9264128 9779626 10512788 10853760
12647 10853760 11132659 11319661 12272372 11951487 11989849 12694918 12968756 12575951 12397048
12638 12397048 12084238 12148025 11887499 12391554 12558183 12352578 12604927 11956264 12230120
12629 12230120 12232574 13004327 13389323 13249031 13743119 13568560 13453973 13364465 13169551 12827978
12619 12827978 12470991 12019549 10954864 10891888 10343777 10015432 10262901 10926422 11431014
12610 11431014 12149373 12930069 13653847 14706799 15656729 15990619 16337815 16310001 16661842
12601 16661842 15620844 14712178 13693224 12860156 12221222 10534354 10911878 9821580 9395952
12592I395952J74388l44803M20027L75118k83514J144961L72112j88584L39018
12583A1404675J48105L21470k03872J135176J40804L12082M72590J76657n16605
12574A3391082O67910q11868l43132J95034q87375q20038r21408k28319o24082
12565I617804k31382J71353K1528o2114J34105k40138j1905J91932k24535p4458
12555I292190K3379J77533j34651o10311L32710J13601k7045o116L88405L44672
12545I894367q50037L29694K58432P66421L59132O42911J17441K94245N69783
12536A2382389k25392J96589r0799q82445k63601J35331j006168l56269p8927
12527I810708j86993k60783k30002M31769j5770j35825N89439l34197p6493J83578
$$ plain form
12592 9395952 9570340 9225537 9645564 10020682 9737168 10882129 11254241 11065657 11404675
12583 11404675 11552780 11874250 11670378 12805554 12946358 13258440 13731030 13907687 13391082
12574 13391082 14058992 13247124 12903992 13099026 12211651 11391613 10470205 10241886 9617804
12565 9617804 9386422 9557775 9579303 9517189 9651294 9411156 9399251 9591183 9366648 9292190
12555 9292190 9315569 9493102 9358451 8748140 9080850 9194451 9167406 9161290 9549695 9894367
12545 9894367 9044330 9374024 9632456 10398877 10758009 11400920 11518361 11812606 12382389
12536 12382389 12156997 12353586 12262787 11380342 11116741 11252072 10245904 9889635 9810708
12527 9810708 9623715 9362932 9132930 9564699 9548929 9413104 10002543 9668346 9591853 9775431
12517I775431M67504j48O21663j4030N54132J471387J138005J234585L4189O91326
12507A5974044M91751p58375K62920q59033k47071j357354m06085o22780j315165
12498A1162852j1348n75997O06916l86609m13430K32798P7849O9883K88823l29862
12488A0721875J10098k6827j04602M47220J85316N43881J082894o185P55412K31933
12478A3941015O12774L99958k49999o16089o22584J24300n13836o15485k49574
12469A2210480J0471k64983k8845J58258j24989K83891M33761M27787n1838K04421
12459A3258414j18897P13441L39734N53877Q04200L0619M91503R23748m61310
12450A6535329R29867O58384j76271P51867L65829M2247K00037j84332M41561
$$ plain form
12517 9775431 10242935 10242787 10864450 10850420 11404552 12875939 14013944 15248529 15282718 15974044
12507 15974044 16465795 15707420 15970340 15111307 14864236 13506882 13100797 12478017 11162852
12498 11162852 11151504 10575507 11182423 10795814 10382384 10615182 10693031 10762914 11051737 10721875
12488 10721875 10831973 10805146 10700544 11147764 11333080 11876961 12959855 12953670 13709082 13941015
12478 13941015 14553789 14953747 14703748 14087659 13465075 13589375 13075539 12460054 12210480
12469 12210480 12220951 11955968 11927123 12085381 11960392 12244283 12678044 13105831 13053993 13258414
12459 13258414 13139517 13852958 14192692 14746569 15550769 15581388 16072891 16996639 16535329
12450 16535329 17465196 18123580 17947309 18699176 19065005 19107252 19307289 19122957 19564518
12441A9564518m56407L6223J02759R9017k42016L73677l24084P59129P8420M94014
12431B0485250L17045M25019O40654P12126P01483P35693J237639Q04309J097226
12422B7156444M46410Q54332L25997P97172K16852O58348p4736N32096o09178
12413C0303737J14403J65p86147j94505m11265j03813j69962j667859L06190n77029
12403B6813915J58765j083028k25325j91956M94234J5181P08032L27689J50787
12394B7168294R04087N87206M73195Q84152Q85548Q58378P90566P21543P65346
12385C4038315P04034l8958j55992Q72804K1213j58499r5029L04857j24044k29022
12375C5139679O10238L00963l52535K90696J49788l67169O49613m56873Q65823
$$ plain form
12441 19564518 19108111 19144334 19247093 19346110 19104094 19477771 19153687 19912816 19991236 20485250
12431 20485250 20802295 21227314 21867968 22580094 23281577 24017270 25254909 26059218 27156444
12422 27156444 27602854 28457186 28783183 29580355 29797207 30455555 30380819 30912915 30303737
12413 30303737 30418140 30418305 29632158 29437653 29026388 28922575 28752613 27084754 27390944 26813915
12403 26813915 26972680 25889652 25664327 25472371 25966605 25981786 26689818 27017507 27168294
12394 27168294 28072381 28659587 29132782 30016934 30902482 31760860 32551426 33272969 34038315
12385 34038315 34742349 34703391 34547399 35420203 35441416 35282917 35187888 35492745 35368701 35139679
12375 35139679 35749917 36050880 35698345 35989041 36138829 35771660 36421273 35964400 36830223
12366C6830223m05020k19423q841O24968n80483O07499n10149j64150m33213J29807
12356C5871218j2953l90166r277L50077n44554m4079m57820j97820j24019p86609
12346C3653998j62514o32504J72055m09342M79028P73022n5360N89010J130358
12337C5537751J24079L27679J360039Q67720J194768J374113P39205O74312Q41148
12328D3040814J030538o5852N64259O57448J72478Q83298n01127M79087M84832
12319D6745775m78114J0474K9468n42891J75350M51529k62241N653O52728K00211
12309D6987942L85436Q49175L69490J014505P02706P06003J362699K61932N6380
12300E2696268j08073p17825o74715r89630j419318j381690j019064p9301k072326
$$ plain form
12366 36830223 36425203 36205780 36196939 36821907 36241424 36848923 36338774 36174624 35741411 35871218
12356 35871218 35858265 35468099 35458822 35808899 35264345 35220266 34762446 34564626 34440607 33653998
12346 33653998 33491484 32858980 33031035 32621693 33100721 33873743 33818383 34407393 35537751
12337 35537751 35661830 35989509 37349548 38217268 39412036 40786149 41525354 42199666 43040814
12328 43040814 44071352 44005500 44569759 45227207 45399685 46282983 45781856 46260943 46745775
12319 46745775 46267661 46278135 46307603 45764712 45940062 46391591 46129350 46135003 46787731 46987942
12309 46987942 47373378 48222553 48592043 49606548 50309254 51015257 52377956 52639888 52696268
12300 52696268 52588195 51870370 51195655 50206025 48786707 47405017 46385953 46306652 44234326
12291D4234326k57851q70495r2873p35657m59669j389411q37984p35870j888065
12282C6966451p68692j382169n94444j198036p93140q83705n15785n44381l46518
12273B9939581k68158r7815p13212R81642o50548l48342j69798m51493N27945
12264B8749802J47509j074590l19390K14294r564k14434M56229K89960P21371
12255B8961187P27114J145066P56266J594861J642312J892657K243783K162295
12247D1125541K621722L026987K077952K626641K289691J842184J163188R60879
12239E7734785j71934O90454n39715p12540r48991l25529l85773j039073n61277
12230E3740407p35779o38116j815519r51243k230296k014339k553672k344819
$$ plain form
12291 44234326 43976475 43105980 43013107 42277450 41817781 40428370 39590386 38854516 36966451
12282 36966451 36197759 34815590 34221146 33023110 32229970 31346265 30830480 30286099 29939581
12273 29939581 29671423 29573608 28860396 29842038 29191490 28843148 28673350 28221857 28749802
12264 28749802 28897311 27822721 27503331 27717625 27708061 27493627 27949856 28239816 28961187
12255 28961187 29688301 30833367 31589633 33184494 34826806 36719463 38963246 41125541
12247 41125541 43747263 46774250 48852202 51478843 53768534 55610718 56773906 57734785
12239 57734785 57562851 58253305 57713590 57001050 56052059 55726530 55340757 54301684 53740407
12230 53740407 53004628 52366512 50550993 49599750 47369454 45355115 42801443 40456624
12222D0456624k953156k212947k195474k106175j616647k205659m37611p41091
12214B5987864r82074j034660l48781j210034m1048l06932r44309p68177J12683
12205B0464532r0676o24059j88782K41214L57310o30K06353k1112k24823M63988
12195B0583315N54895k03896M04105K74337L28556R97803N99271O56616K88636
12186B4483638L23037M40069P89446k13416L69455j35550l70212L2965n2203P759
12176B5674988q05373k51378M9525K56379n06258n4090n19921K20370O8892Q4172
12166B4217306Q4899J28555j09690O14978N46531Q38963O41655O90134P48894
12157B8402225J55003K20696K83699j4772N8979M67259p38343Q7054L41187M75626
$$ plain form
12222 40456624 37503468 35290521 33095047 30988872 29372225 27166566 26728955 25987864
12214 25987864 25005790 23971130 23622349 22412315 22371267 22064335 21120026 20351849 20464532
12205 20464532 20373856 19749797 19561015 19802229 20159539 20158909 20365262 20344150 20119327 20583315
12195 20583315 21138210 20934314 21338419 21612756 21941312 22939115 23538386 24195002 24483638
12186 24483638 24806675 25246744 26036190 25822774 26192229 26056679 25686467 25719432 25667229 25674988
12176 25674988 24869615 24618237 24667762 24924141 24417883 24363793 23843872 24064242 24133134 24217306
12166 24217306 24302205 24430760 24321070 24936048 25482579 26321542 26963197 27653331 28402225
12157 28402225 28557228 28777924 29061623 29046851 29105830 29573089 28834746 28921800 29262987 29738613
12147B9738613J296073J294598J689831J288543J911058J465087J549951J479518
12139D1713272J919772J517367J967309J097737K038740K613801K316481K835871
12131E8020350L081734L553069L977369M456078M049496M467760M482875L351285
12123H9440016K769749K334500J913967P33230k91587k22889j694274j452801
12115I3529911k283906k678165k053262k515262k540052k150182j846539k052923
12107G5409620j785771k173025j552368j044769j297808k93872k97555m11505
12099F6552947K30347n7005j02655K2849k01227k82404n11109n31291p09977q43130
12089F3567345R70327J185951O91684J441554J101125J936038R96727J338472
$$ plain form
12147 29738613 31034686 32329284 34019115 35307658 37218716 38683803 40233754 41713272
12139 41713272 43633044 45150411 47117720 48215457 50254197 52867998 55184479 58020350
12131 58020350 61102084 64655153 68632522 73088600 77138096 81605856 86088731 89440016
12123 89440016 92209765 94544265 96458232 97191462 96899875 96676986 94982712 93529911
12115 93529911 91246005 88567840 86514578 83999316 81459264 79309082 77462543 75409620
12107 75409620 73623849 71450824 69898456 68853687 67555879 67262007 66964452 66552947
12099 66552947 66783294 66726289 66623634 66646483 66445256 66162852 65651743 65120452 64410475 63567345
12089 63567345 64537672 65723623 66415307 67856861 68957986 70894024 71890751 73229223
12081G3229223J186978P25191P23545j84900K82840K74614M62471p442P34724
12072G7427244m42918k26560m12911j228765j546593j533258k229165k201088
12064F7605986k080058k343476k535590j310902k018487q82880j804117m88467
12056E4142009j677573r56484j198355j202773j245762j345734j344010o02962
12048D4568356p78753j249117l29399q23907j32354n51808o77693j425144n15278
12039C8084903j463752l78807j238858j344420m40133n63229K58664l19022J007981
12030C3603327M07461Q38410J116348R83123M52183J22597J01428o72967l02398
12021C6649512j154762k148146j448486j540032j311615j814653j061370o00685
$$ plain form
12081 73229223 74416201 75141392 75864937 75680037 75962877 76237491 76699962 76692520 77427244
12072 77427244 76984326 76757766 76344855 75116090 73569497 72036239 69807074 67605986
12064 67605986 65525928 63182452 60646862 59335960 57317473 56434593 54630476 54142009
12056 54142009 52464436 51507952 50309597 49106824 47861062 46515328 45171318 44568356
12048 44568356 43789603 42540486 42211087 41387180 41254826 40703018 40025325 38600181 38084903
12039 38084903 36621151 36242344 35003486 33659066 33218933 32655704 32914368 32595346 33603327
12030 33603327 34010788 34849198 35965546 36948669 37400852 37523449 37624877 36951910 36649512
12021 36649512 35494750 33346604 31898118 30358086 29046471 27231818 26170448 25569763
12013B5569763q93000j325992m72840q29788o57864n20205r12860p07281L68002
12004A9617935m60761j31076o8825N19720N26186K09915l12773N15985j039163
11995A9377143n93888L0705m05768M03190n27662m8104j68180K63418P6733m38734
11985A7968853M07898n02341k10255k72489o048j75066k47080j2663n73059L69824
11975A6747574k13517m37508n33422n70601k21524n68482n45338m83928m98527
11966A2674727k18061l60160k40246m57407l46915l28810K25776J85890K29320
11957A1364114k35281P42833j69418k41367K78170M60645J86822k86213J71398
11948A2271703k41443K35874l54456J057959l74182Q66453P23980K56742O74381
$$ plain form
12013 25569763 24676763 23350771 22877931 22048143 21390279 20870074 19957214 19249933 19617935
12004 19617935 19157174 19026098 18957273 19476993 20003179 20213094 19900321 20416306 19377143
11995 19377143 18783255 18813960 18408192 18811382 18283720 18235616 18067436 18330854 18407587 17968853
11985 17968853 18376751 17874410 17664155 17391666 17385618 17210552 16963472 16950809 16377750 16747574
11975 16747574 16534057 16096549 15563127 14992526 14771002 14202520 13657182 13173254 12674727
11966 12674727 12456666 12096506 11856260 11398853 11051938 10723128 10948904 11134794 11364114
11957 11364114 11128833 11871666 11702248 11460881 11739051 12199696 12386518 12100305 12271703
11948 12271703 12030260 12266134 11911678 12969637 12595455 13461908 14185888 14442630 15117011
11939A5117011j46562M08042P00632O33903N94475j81776M61022m04176J31073
11930A7313644j06331J27566m55164l85006K03514j127157k11336l40586l15852
11921A4703292N8089o83787K0955q74456q12516l66221J03171j87721k93669M21310
11911A2088447N28284J057455M743143N953944K484115K646951J124704N83481
11903C1210524K76366q84064j790122l742644k538171l659675l778670k487808
11895A2605736j569967n85283m5970l26759n36252Q55793M12193L4814O39601
11886A1483906Q19878J184007J027288J249838J511183K24118O75961O13699m3181
11877A8746697m78286m35284m87813q16595r13610j561406m75531j233021m00643
$$ plain form
11939 15117011 14970449 15378491 16079123 16713026 17307501 17125725 17586747 17182571 17313644
11930 17313644 17207313 17334879 16879715 16494709 16698223 15571066 15359730 15019144 14703292
11921 14703292 14761381 14077594 14098549 13224093 12411577 12045356 12148527 11960806 11667137 12088447
11911 12088447 12616731 13674186 18417329 24371273 26855388 29502339 30627043 31210524
11903 31210524 31486890 30602826 28812704 25070060 22531889 18872214 15093544 12605736
11895 12605736 11035769 10450486 10404516 10077757 9541505 10397298 10809491 10844305 11483906
11886 11483906 12303784 13487791 14515079 15764917 17276100 17500218 18176179 18789878 18746697
11877 18746697 18268411 17833127 17345314 16528719 15615109 14053703 13578172 12345151 11944508
11868A1944508r31817n14491q93036j42038l98881j14219J35865o88015M07166
11859H805042j22658p92243P8007Q04017l40171J04323N15921O9146L05267p04401
11849H722250P87663P11492M27234j58182P97817K79612M61195Q55433O49395
11840A3533909K32235L45545p62989M27503m11823P9700r53118n99203J03638
11831A1995397R2766k63731m07296J52509R530k85903l69545l89690k62690p79434
11821I491913j244383j82661q1503j87660l8163m55406j00866l45575n6686K44599
11811G043609m89235L80020q91161M03243l34933j77315M4042j68992K36971m98526
11801E547723N74945j67266k55344K2979K78898l82748P88954r48615J66179K62226
$$ plain form
11868 11944508 11012691 10498200 9605164 9463126 9064245 8950026 9085891 8397876 8805042
11859 8805042 8682384 7890141 7968148 8772165 8431994 8536317 9052238 9121384 9426651 8722250
11849 8722250 9509913 10221405 10648639 10490457 11288274 11567886 12029081 12884514 13533909
11840 13533909 13766144 14111689 13348700 13776203 13364380 13444080 12490962 11891759 11995397
11831 11995397 12088163 11824432 11417136 11569645 11579175 11293272 10923727 10534037 10271347 9491913
11821 9491913 8247530 8064869 7983366 7795706 7757543 7302137 7201271 6855696 6799010 7043609
11811 7043609 6554374 6934394 6043233 6446476 6111543 5934228 5978270 5809278 6046249 5547723
11801 5547723 6122668 5955402 5700058 5723037 6001935 5619187 6408141 5459526 5625705 5887931
11791E887931N99726P23369M58115J70347J090548J74267r9507k1567k0072k53096
11781H710061J22012q33362m20843j98700m04219p05155j90782n80755K1104K03843
11771E723204p16795O03137k94285j0925m97467N85276l53310j24387r667Q7996
11761D992777L0297J86701n52669R4334L16373m48845K03524P4501j84666k57030
11751D455297L48769M80740o91636M94252l10782M86450n29226p7849O2532m9397
11741D669150l66016N07115j09370m36124O5937J39108j88742m128K50286L38328
11731D865544q331k76272k45615P3837K14412k67208q633k71486J56895l7182
11721D195961J76077L18055m29906K03098M12362k72086r8800J93281k05311N29019
$$ plain form
11791 5887931 6487657 7211026 7669141 7839488 8930036 9104303 9004796 8983229 8963157 8710061
11781 8710061 8832073 7998711 7577868 7379168 6974949 6269794 6079012 5498257 5519361 5723204
11771 5723204 5006409 5609546 5315261 5304336 4806869 5392145 5038835 4914448 4904781 4992777
11761 4992777 5023074 5209775 4657106 4751440 5067813 4618968 4822492 4896993 4712327 4455297
11751 4455297 4804066 5284806 4593170 5087422 4776640 5263090 4733864 4656015 4718547 4669150
11741 4669150 4303134 4810249 4700879 4264755 4330692 4469800 4281058 4276930 4527216 4865544
11731 4865544 4857213 4580941 4335326 4409163 4623575 4356367 4347734 4076248 4233143 4195961
11721 4195961 4372038 4690093 4260187 4463285 4875647 4603561 4504761 4698042 4492731 5021750
11711E021750j032783M15431k62031P52518o12373Q191J81597L5502l61218Q88587
11701E035171l59036M95609j80867L11109k34579n49006J40663P1731J76100l56308
11691D550587l98106M1875K70202M55185j36538l23084M65694l48975N32305k46525
11681D862620m38513j08161Q48956o74259L46192L50576m8062L21298l84388m9448
11671E026811l14542J69170K42809l17748l3241O94118j65998j18122r2474n12119
11661D578664O07649l57143O193q6634L32831M23067p07417Q9249j60484M6523
11651D772498J72236n7680q244M26162m62072N05788J72521q22170K55278j4847
11641D939470j62219N87151k83554j86767L85313k99439M67469l48861k41538
$$ plain form
11711 5021750 3988967 4404398 4142367 4894885 4282512 4290703 4472300 4507802 4146584 5035171
11701 5035171 4676135 5171744 4990877 5301986 5067407 4518401 4659064 4730795 4906895 4550587
11691 4550587 4152481 4194356 4464558 4919743 4783205 4460121 4925815 4576840 5109145 4862620
11681 4862620 4424107 4315946 5164902 4490643 4836835 5187411 5139349 5460647 5076259 5026811
11671 5026811 4712269 4881439 5124248 4806500 4773259 5467377 5301379 5183257 5090783 4578664
11661 4578664 5186313 4829170 4835363 4748729 5081560 5504627 4797210 4886459 4725975 4772498
11651 4772498 4944734 4887054 4878810 5304972 4842900 5348688 5521209 4699039 4954317 4939470
11641 4939470 4777251 5364402 5080848 4894081 5279394 4979955 5447424 5098563 4857025
11632D857025M96424r2413J0778J9239K50029R0458o31239N96847J41772n2549
11622E686371j80682j70231o4693k40164l7934M36015j35608J41981j04102j79153
11612E151800K07615r3699K22515Q2025j79905j59380L79533J31411J79432r26267
11602D995080P67597R3968O6553j13841O46035j98761K09301j07536p2359j78867
11592F107170L86274r01235O21202k95345r6295j95632J99520k33096l92809N2471
11582E252225L90419j3677j3284O1637j69051j58124L71872K18592J4111K23871
11572F178591m28972Q5855L85051j20132J18363l58304o6592N56529O2733m76050
11562E937072J25962M1185o6275M9775l2075j99352j61014K44377l02248o57879
$$ plain form
11632 4857025 5353449 5261036 5271814 5291053 5541082 5631540 5000301 5597148 5738920 5686371
11622 5686371 5505689 5335458 5270765 5030601 4992667 5428682 5293074 5435055 5330953 5151800
11612 5151800 5359415 5265716 5488231 5570256 5390351 5230971 5610504 5741915 5921347 4995080
11602 4995080 5762677 5856645 5923198 5809357 6455392 6256631 6465932 6358396 6286037 6107170
11592 6107170 6493444 5592209 6213411 5918066 5821771 5626139 5825659 5592563 5199754 5252225
11582 5252225 5642644 5628967 5615683 5677320 5508269 5350145 5722017 5940609 5954720 6178591
11572 6178591 5749619 5835474 6220525 6100393 6218756 5860452 5793860 6350389 6413122 5937072
11562 5937072 6063034 6104219 6037944 6087719 6055644 5856292 5695278 5939655 5637407 4979528
11552D979528Q13850J67476k1343k0673k79196o6799j72959K44083J36481L2908
11542E813356m45542L9462j27325M27757l45733J35561L07403q49107J26227K20115
11532E302174P11217m92009k69004L52861J07593n42263N19377k59820N8887j90076
11522E298937N3677K23074O3242J3227j18410l39174j93565K20467L41786L87573
11512E950834j04272m17622M29155k69471j11663P9575K88398l43997J26400k36690
11502E390647R9850l23093M47554m52800K89072n3339L02303l71254J95385n23153
11492E001172L78627j45910j47512M63928K87577l28883K26532J11622K81294
11483F128447o95741J18154J5340J18692J72984L08734j10933m80147K23084P3099
$$ plain form
11552 4979528 5793378 5960854 5939511 5918838 5639642 5572843 5399884 5643967 5780448 5813356
11542 5813356 5367814 5407276 5279951 5707708 5361975 5497536 5804939 4955832 5082059 5302174
11532 5302174 6013391 5521382 5252378 5605239 5712832 5170569 5689946 5430126 5489013 5298937
11522 5298937 5352614 5575688 5638930 5652157 5533747 5194573 5001008 5221475 5563261 5950834
11512 5950834 5846562 5428940 5858095 5588624 5476961 5556536 5844934 5500937 5627337 5390647
11502 5390647 5490497 5167404 5614958 5162158 5451230 5397891 5700194 5328940 5524325 5001172
11492 5001172 5379799 5233889 5086377 5550305 5837882 5508999 5735531 5847153 6128447
11483 6128447 5432706 5550860 5566200 5684892 5857876 6166610 6055677 5575530 5798614 5871713
11473E871713k07739O18797m31900o5498Q555N910J07130l0149n28114J76605
11463E525310M90056j63936K9129l02120J84140P3736R2915P1167k32352n26263
11453E241782M24131k61719K75959l48314M17758J87757L09881o18987L99485
11444F027733m651n18454K30677J02230J04626K06643k92999m03491P06617L9092
11434F198023J55397j00877L34818j78803J97215J82001j95213K23756j41678
11425F674639N1277K26776P086J75087j36861M85955p0917J56979K75337J23947
11415G969305m08178P31694N6119J76460P5249K5320K60755J4766O68272m42336
11405I127426M66662m171k75102Q90085K48684K06950k34614R24488n32008Q4674
$$ plain form
11473 5871713 5663974 6282771 5850871 5785373 5793928 5799838 5906968 5876819 5348705 5525310
11463 5525310 6015366 5851430 5880559 5578439 5762579 5836315 5929230 6000397 5768045 5241782
11453 5241782 5665913 5404194 5680153 5331839 5749597 5937354 6247235 5628248 6027733
11444 6027733 6023082 5504628 5735305 5837535 5942161 6148804 5855805 5452314 6158931 6198023
11434 6198023 6353420 6252543 6587361 6408558 6605773 6787774 6592561 6816317 6674639
11425 6674639 6725916 6952692 6959778 7134865 6998004 7483959 7413042 7570021 7845358 7969305
11415 7969305 7561127 8292821 8348940 8525400 8600649 8625969 8886724 8901490 9569762 9127426
11405 9127426 9594088 9589917 9314815 10204900 10453584 10660534 10425920 11350408 10818400 10903074
11395A0903074R97547k04307M8297O7356N61725L14669j11929J31848k05577N70273
11385A3072976N82783o73902P49981l67060L84162K94885O3609l88665L70054
11376A4088823L25148P0623K8810J90651K99246n1956M51872P300m5441K37028
11366A5602104j8960K88755o74693P04155j46359J27287j97836J16717J74711
11357A5975881J029L65564m84219J88641j48017l74178J54602k72878O0392J09561
11347A5576378q8797k98914M4519k47813Q3312j10666l64025K54414k46444k63421
11337A4338543j35716r287l52784l08303O02394k09910m80166k63165m14099j4382
11327A2753125k17292J3243J9209J86569n65871m64803j46258k99047j04106l20289
$$ plain form
11395 10903074 11900621 11696314 11744611 11811967 12373692 12688361 12576432 12708280 12502703 13072976
11385 13072976 13655759 12981857 13731838 13364778 13748940 14043825 14107434 13718769 14088823
11376 14088823 14413971 14484594 14513404 14704055 15003301 14951345 15403217 15410517 15365076 15602104
11366 15602104 15583144 15871899 15197206 15901361 15755002 15882289 15684453 15801170 15975881
11357 15975881 15976910 16342474 15858255 16046896 15898879 15524701 15679303 15406425 15466817 15576378
11347 15576378 15487581 15188667 15233186 14985373 15068685 14958019 14593994 14848408 14601964 14338543
11337 14338543 14202827 14193540 13840756 13532453 14134847 13924937 13444771 13181606 12767507 12753125
11327 12753125 12535833 12549076 12568285 12754854 12188983 11724180 11577922 11278875 11174769 10854480
11317A0854480K16548j074179P80677j73979Q2124p60371J62617Q5487p82522
11308I390882r5066k19802j07100J28541k53787m76643k99439J90695J96667p43607
11298G711341L5613L13121k91425m05474L61357k29702l80667n6024K31444r61950
11288F327634J79225J46403K95331j90928j77321J95109o13606L57669p11850
11279E807666K34712L8617k24316j02511j26493K4609K0464J78827p07258Q59210
11269F003527m38826K42169m11895J89340J02714K91281P0621m75287k42700L62230
11259E693174k41122L90558j164390M96826j20408J27616O04057n88283M86724
11250E684752o66278N12542o7167k70436k80311L43963k02357K74240N1913K87386
$$ plain form
11317 10854480 11071028 9996849 10777526 10603547 10685671 9925300 10087917 10173404 9390882
11308 9390882 9295816 9076014 8968914 9097455 8843668 8367025 8067586 8258281 8454948 7711341
11298 7711341 7746954 8060075 7768650 7363176 7724533 7494831 7114164 7058140 7289584 6327634
11288 6327634 6506859 6653262 6948593 6757665 6580344 6775453 6161847 6519516 5807666
11279 5807666 6042378 6080995 5856679 5754168 5627675 5652284 5672748 5851575 5144317 6003527
11269 6003527 5564701 5806870 5394975 5584315 5687029 5978310 6048931 5573644 5330944 5693174
11259 5693174 5452052 5842610 4678220 5175046 5054638 5182254 5786311 5198028 5684752
11250 5684752 5018474 5531016 5463849 5193413 4913102 5257065 5054708 5328948 5380861 5668247
11240E668247L87679l56486o84695L38850K82392j64101l75523R40355n51454
11231E485264J17225L09969j67752M48749m6366M56365P40075J389911J904022
11222A0637462J772506J222627N02057M66535M42642m86259n85475j201979j636390
11213A1133726o95756j629623j843479k05795m30837m84433K79820l98491K1775
11204E746907r26145P58809K48034k6974L45004J5427j85540K71944J452942K116665
11194I817073J587480J109333Q39765J000914Q19016p60639N086r22570q36141
11185A2659317j039919j861183j619559p87041q44633j50630l63066J10632k81610
11176E822308L08468o18184N77977m70523M32196q7575l39146n12458J59854J45411
$$ plain form
11240 5668247 6055926 5699440 5014745 5353595 5635987 5471886 5096363 6036718 5485264
11231 5485264 5602489 5912458 5744706 6193455 6147089 6603454 7343529 8733440 10637462
11222 10637462 12409968 13632595 14134652 14601187 15043829 14557570 13972095 12770116 11133726
11213 11133726 10437970 8808347 6964868 6759073 6328236 5843803 6123623 5725132 5746907
11204 5746907 4820762 5579571 5827605 5800631 6145635 6161062 5975522 6247466 7700408 9817073
11194 9817073 11404553 12513886 13353651 14354565 15173581 14412942 14418028 13495458 12659317
11185 12659317 11619398 9758215 8138656 7351615 6506982 6356352 5993286 6103918 5822308
11176 5822308 6130776 5512592 6090569 5620046 6052242 5964667 5625521 5113063 5272917 5418328
11166E418328K34509K08217R6292n7060L44113k84065j45291j31811k81276N96049
11156E998005j61298r7881J51206l22849M8763k1584N4232M82967r938N9192m36434
11145E744381L88328K40537o10388L41276l12125K32586K91916j08851K71658
11136F479318O4459r2893K5568l31241L39058l30673M40967J20992j44184K09418
11126F780789n13297K70680J152j48353j08227Q07348m33110J07946K25577J52287
11116G142792l84325q0446j39204L35417N157p5680K29153j17125J0601J07198
11106G033538O21143q95093M16696P9362k8603n76087J01427K61867L58497k64120
11096G108627l56075J09614K20929J51970Q9796K22031p43433L06707M3442m10943
$$ plain form
11166 5418328 5652837 5861054 5957346 5900286 6244399 5960334 5815043 5683232 5401956 5998005
11156 5998005 5836707 5738826 5890032 5567183 5615946 5594362 5648594 6131561 6121623 6180815 5744381
11145 5744381 6132709 6373246 5762858 6104134 5792009 6024595 6316511 6207660 6479318
11136 6479318 6543777 6450884 6476452 6145211 6484269 6153596 6594563 6715555 6571371 6780789
11126 6780789 6267492 6538172 6539324 6390971 6282744 7090092 6656982 6764928 6990505 7142792
11116 7142792 6758467 6678021 6538817 6874234 6879391 6803711 7032864 6915739 6926340 7033538
11106 7033538 7654681 6759588 7176284 7255646 7227043 6650956 6752383 7014250 7372747 7108627
11096 7108627 6752552 6862166 7083095 7235065 7324861 7546892 6803459 7110166 7153608 6742665
11086F742665K89541o3116K89266j84854J85097o5310J24091m01131M92933k10606
11076G198576K77649o25368O16121p6057l31454P98276j08229k6008K08267O8659
11066H000432k70009M76581k25721J53816L48922j49211J28975N15409l46182
11057H633012L26422J90667N6103R4988J30291L63702M45292l32167Q4933K81965
11047A0275208j47860l24745M93229K86586O3146M32491k8967P41995j13244O3284
11037A1741123N13964L31094J28785M00568J35363L49264Q7965Q5097K12773M2388
11027A4028384n6106N50304j6573O00500k18699n0123J18114N12411J40597j03794
11017A5505015L98130M84836j31196M27994M30125N24998L63847Q06211L55975
$$ plain form
11086 6742665 7032206 6969090 7258356 7073502 7258599 7193289 7317380 6916249 7409182 7198576
11076 7198576 7476225 6850857 7466978 7390921 7059467 7857743 7749514 7723506 7931773 8000432
11066 8000432 7730423 8207004 7981283 8135099 8484021 8334810 8463785 8979194 8633012
11057 8633012 8959434 9150101 9206204 9301192 9431483 9795185 10240477 9908310 9993243 10275208
11047 10275208 10127348 9802603 10295832 10582418 10645564 11078055 11049088 11791083 11677839 11741123
11037 11741123 12255087 12586181 12714966 13115534 13250897 13600161 13688126 13773223 13985996 14028384
11027 14028384 13972278 14522582 14506009 15106509 14887810 14837687 14955801 15468212 15608809 15505015
11017 15505015 15903145 16387981 16256785 16684779 17114904 17639902 18003749 18809960 19165935
11008A9165935J85838M03068M41944N49915L34686K61225J05804N22726J56894
10999B2128035j13907R2862N67599J9597M85577Q9850m54370K72281M96359L16398
10989B3900281J66103j67822Q82399M47743P51233N93801R61144J370104J867330
10980C0772316P52264J153211P06215J78877J008642P933L78156j5029o43797
10971C4298788L07150j60613N45744K66195Q36343K25462J250308Q08624R88634
10962C9366635J309839Q92890J364882Q08607J393052J594168J180493J676884
10954D9587450K085940J615377J439391O07048J016215P01703N61097O76171L85001
10945E8675393K99142K35138J73196R07639R95129J171935J695327J415337Q46107
$$ plain form
11008 19165935 19351773 19754841 20196785 20746700 21081386 21342611 21448415 21971141 22128035
10999 22128035 22014128 22106990 22674589 22694186 23179763 23269613 22815243 23087524 23583883 23900281
10989 23900281 24066384 23898562 24780961 25228704 25979937 26573738 27534882 28904986 30772316
10980 30772316 31524580 32677791 33384006 33562883 34571525 34579458 34957614 34942585 34298788
10971 34298788 34605938 34445325 34991069 35257264 36093607 36319069 37569377 38378001 39366635
10962 39366635 40676474 41569364 42934246 43742853 45135905 46730073 47910566 49587450
10954 49587450 51673390 53288767 54728158 55335206 56351421 57053124 57614221 58290392 58675393
10945 58675393 58974535 59209673 59382869 60290508 61285637 62457572 64152899 65568236 66414343
10936F6414343K022382J164728J025143J376157J041926J091157J268429J024513
10928G6428778j40415O02080L00408l64482K88627l251j96981L2466p13480J58361
10918G6392111k17683o73806k66608L64845n16814K80450l71522j65411P73844
10909G5599406q3750O66492K83609L78798L81419N98226J020348J584856Q58036
10900H1287440J139736J564755J822583J741609K482526K184766K823940L315541
10892I8362896M671688L693173N676984N126895O406847P381569Q141767Q457691
10884A47919510P751946Q511197P341910O254536N346796L072546J706560l70934
10876A87534067k111581l663157n337124n838284o878345p321620p783793p459559
$$ plain form
10936 66414343 68436725 69601453 70626596 72002753 73044679 74135836 75404265 76428778
10928 76428778 76288363 76890443 77190851 76826369 77114996 77111745 76914764 76947230 76233750 76392111
10918 76392111 76174428 75500622 75234014 75598859 75082045 75362495 74990973 74825562 75599406
10909 75599406 75515656 76182148 76465757 76844555 77225974 77824200 78844548 80429404 81287440
10900 81287440 82427176 83991931 85814514 87556123 90038649 92223415 95047355 98362896
10892 98362896 103034584 106727757 112404741 117531636 123938483 131320052 139461819 147919510
10884 147919510 155671456 164182653 171524563 177779099 183125895 186198441 187905001 187534067
10876 187534067 185422486 181759329 176422205 170583921 163705576 156383956 148600163 141140604
10868A41140604p806226p504180p294900o073318o357632o454227n366653n500727
10860H8782741n565254m372951m526308m076300m271211l621696l566949l730358
10852E5051714k807165k831649k771394k196260k698534j596388k050925j660974
10844C6438425j467525j776168j449925j015892j833539j424244j452491o82736
10836B5335905j060344n72973j319893l56190j011589p47261l78859o70412o87257
10827A8531127m69108p22073q87743l7714m76624m57513o66895l83716l90095
10818A4039646M29266r18652M08692k35063q26554j22337K04952q59986j73435
10809A1946529l66925J78937j24515n58746J35175l36453k63418J165j75018m72616
$$ plain form
10868 141140604 133334378 125830198 118535298 112461980 106104348 99650121 94283468 88782741
10860 88782741 83217487 78844536 74318228 70241928 65970717 62349021 58782072 55051714
10852 55051714 52244549 49412900 46641506 44445246 41746712 40150324 38099399 36438425
10844 36438425 34970900 33194732 31744807 30728915 28895376 27471132 26018641 25335905
10836 25335905 24275561 23702588 22382695 22026505 21014916 20267655 19888796 19218384 18531127
10827 18531127 18062019 17339946 16452203 16414489 15937865 15480352 14813457 14429741 14039646
10818 14039646 14468912 13550260 13958952 13723889 12897335 12774998 12979950 12119964 11946529
10809 11946529 11579604 11758541 11634026 11075280 11210455 10874002 10610584 10611749 10436731 9964115
10799I964115l80401L5003J85679p90419j48177L14055m32697M78970n46204k10165
10789H469759M60726m68138r3015o4812O3539j92304l53761Q9195j33696o7311
10779G710182j68899J55341l00920j06132n6948j59382K4088l7606m38753j2239
10769F608732k36192K77738k59222k6348J43197l84089K76220m8771m98877M00460
10759F252848j19741j49624k35867l54124L61623O1344L54702k74867K18084L61789
10749F476167n61087N28938o03801N90347n26471J2601k34017j82363K95757n96842
10739E199229J4170j44255J1590k4504L6527J99176l4974K11261n04929M48570
10729E411861j62495j16262M40578n36926O47985o16457L06668l96118M37021
$$ plain form
10799 9964115 9583714 9618717 9804396 9013977 8865800 9179855 8747158 9226128 8679924 8469759
10789 8469759 8930485 8462347 8369332 8304520 8368059 8175755 7821994 7911189 7777493 7710182
10779 7710182 7541283 7696624 7395704 7289572 7232624 7073242 7097330 7059724 6620971 6608732
10769 6608732 6372540 6650278 6391056 6364708 6507905 6123816 6400036 6351265 5852388 6252848
10759 6252848 6133107 5983483 5747616 5393492 5755115 5816459 6171161 5896294 6114378 6476167
10749 6476167 5915080 6444018 5840217 6430564 5904093 5916694 5682677 5500314 5796071 5199229
10739 5199229 5213399 5069144 5080734 5056230 5092757 5291933 5256959 5468220 4963291 5411861
10729 5411861 5249366 5133104 5573682 5036756 5684741 5068284 5374952 4978834 5415855
10720E415855l88397K1068J17299o1253n2691l53857L32281l29958M3726J9322
10710D763395K05998o52528N95004k78510j34186j09611N23431m41055J53470
10701D625408J33581q8636J75635J04190n05632J40348L97913l02633M190N2819
10691D737183k09246K76215l47856j67443N80924o46513J77558R9096K51120l42865
10681D408173R6436P8507k5458K04992N62340M19593j70654M17549L29271o25179
10671E695570P60866n77851N1329j19056j39020o66591K04377m9098q8892r06901
10661D164733L51114k56087K53317k20554j77342N03022O8884J00422L67631q2583
10651E072557M65060J6400Q4907M31839M22793m69667n37594n47090K46715m13669
$$ plain form
10720 5415855 5027458 5048526 5165825 5104572 5051881 4698024 5030305 4700347 4744073 4763395
10710 4763395 4969393 4316865 4911869 4633359 4499173 4389562 4912993 4471938 4625408
10701 4625408 4758989 4670353 4845988 4950178 4444546 4584894 4982807 4680174 4684364 4737183
10691 4737183 4527937 4804152 4456296 4288853 4869777 4223264 4400822 4499918 4751038 4408173
10681 4408173 4504609 4583116 4557658 4762650 5324990 5744583 5573929 5991478 6320749 5695570
10671 5695570 6456436 5878585 5929914 5810858 5671838 5005247 5209624 5160526 5071634 4164733
10661 4164733 4515847 4259760 4513077 4292523 4115181 4618203 4687087 4787509 5155140 5072557
10651 5072557 5537617 5554017 5638924 6070763 6493556 6023889 5486295 4939205 5185920 4772251
10641D772251k99213m87788j02621p7359n34717O46638m67553R2332j64325K33270
10631C610915l99279k8579R6447l4977N7557K75808l7405k80539k13584L40156
10621C386520l01347L13392m43696L53049M06702o66588M04246k5789k6558K44071
10611C644002l41537J07736o5024L20062j65044l15811m1089J78809K79269J4220
10601C615593p30950p0000N74168M57683p77888N02563l65882J05001R2633o59055
10591B743866N07194q1060M80806j004211O05840N2359m37267K06881J15905m19093
10581B771220J18174K68449K66198k41529J15371K67232k3019j35168J42905p8648
10571C471185m43518P84444j50547p28264P17476J64885p53707M8734M80946k66250
$$ plain form
10641 4772251 4473038 3985250 3882629 3805270 3270553 3917191 3449638 3541970 3377645 3610915
10631 3610915 3211636 3183057 3279504 3244527 3302084 3577892 3540487 3259948 3046364 3386520
10621 3386520 3085173 3398565 2954869 3307918 3714620 3048032 3452278 3426489 3399931 3644002
10611 3644002 3302465 3410201 3345177 3665239 3500195 3184384 3143295 3322104 3601373 3615593
10601 3615593 2884643 2814643 3388811 3846494 3068606 3571169 3205287 3310288 3402921 2743866
10591 2743866 3251060 3170000 3650806 2646595 3252435 3304794 2867527 3074408 3190313 2771220
10581 2771220 2889394 3157843 3424041 3182512 3297883 3565115 3542096 3406928 3549833 3471185
10571 3471185 3027667 3812111 3661564 2933300 3650776 3815661 3061954 3110688 3591634 3325384
10561C325384r6443p7491m59891M21235l71940K66416j54963K18868J21573j55697
10551C037051M1649Q2996k27541o28428O11975k63773Q2222K09746L1669o06141
10541B371425r752J28940J1517K00096p7996R4027Q5834N9847K05202l73735q8956
$$ plain form
10561 3325384 3228941 3151450 2691559 3112794 2740854 3007270 2852307 3071175 3192748 3037051
10551 3037051 3078700 3161696 2934155 2305727 2917702 2653929 2736151 2945897 2977566 2371425
10541 2371425 2361673 2490613 2502130 2702226 2624230 2718257 2804091 2863938 3069140 2695405 2606449
$$ [...]
##END NTUPLES=NMR SPECTRUM
##END=
