##TITLE=coffee_type ROVE100E-Feb25
COFFEE_meoh_noesyp64 COFFEE_meoh {C:\Bruker\TOPSPIN} Administrator 11
##JCAMPDX= 6.0         $$ Bruker NMR JCAMP-DX V2.0
##DATA TYPE= NMR SPECTRUM
##DATA CLASS= NTUPLES
##ORIGIN= Bruker BioSpin GmbH
##OWNER= Administrator
$$ 1.72 TOPSPIN		Version 2.1
$$ 2012-05-29 16:49:29.361 -0700  Administrator@X
$$ Compression mode = diff/dup
##.OBSERVE FREQUENCY= 400.13188235
##.OBSERVE NUCLEUS= ^1H
##.ACQUISITION MODE= SIMULTANEOUS (DQD)
##.ACQUISITION SCHEME= undefined
##.AVERAGES= 64
##.DIGITISER RES= 22
##SPECTROMETER/DATA SYSTEM= spect
##.PULSE SEQUENCE= noesygpps1d.comp
##.SOLVENT NAME= COFFEE_meoh
##.SHIFT REFERENCE= INTERNAL, COFFEE_meoh, 1, 14.98061
##AUDIT TRAIL= $$ (NUMBER, WHEN, WHO, WHERE, PROCESS, VERSION, WHAT)
$$ ##TITLE= Audit trail, TOPSPIN		Version 2.1
$$ ##JCAMPDX= 5.01
$$ ##ORIGIN= Bruker BioSpin GmbH
$$ ##OWNER= Administrator
$$ $$ C:\Bruker\TOPSPIN/data/Administrator/nmr/12-COFFEE-2502/52/pdata/1/auditp.txt
$$ ##AUDIT TRAIL=  $$ (NUMBER, WHEN, WHO, WHERE, PROCESS, VERSION, WHAT)
(   1,<2012-02-25 15:06:44.516 -0500>,<Administrator>,<TOPSPIN>,<go>,<TOPSPIN 2.1>,
      <created by zg
	started at 2012-02-25 14:55:13.812 -0500,
	POWCHK enabled, PULCHK disabled,
       configuration hash MD5:
       B0 76 FB 9C 50 81 44 7D 18 B3 26 32 4E 60 AD 96
       data hash MD5: 64K
       05 4A 16 C0 55 05 E4 2A C1 D5 EE D8 7D B0 62 20>)
(   2,<2012-02-25 15:06:48.719 -0500>,<Administrator>,<TOPSPIN>,<proc1d>,<TOPSPIN 2.1>,
      <Start of raw data processing
       efp LB = 0.3 FT_mod = 6 PKNL = 1 PHC0 = 0 PHC1 = 0 SI = 128K 
       data hash MD5: 128K
       73 1D C8 8C AD 84 AA 65 07 CC BE 16 FD A1 33 9C>)
(   3,<2012-02-25 15:06:50.016 -0500>,<Administrator>,<TOPSPIN>,<proc1d>,<TOPSPIN 2.1>,
      <pk PHC0 = 19.81934 PHC1 = 0 
       data hash MD5: 128K
       F9 1D 16 C5 B1 0C 25 74 A0 96 A7 85 F8 B6 84 54>)
(   4,<2012-02-25 15:06:50.734 -0500>,<Administrator>,<TOPSPIN>,<proc1d>,<TOPSPIN 2.1>,
      <abs ABSG = 1 
       data hash MD5: 128K
       FE E0 DE 0E 25 23 8C A7 71 EB 0D A0 D6 A1 08 DC>)
(   5,<2012-02-25 15:06:50.812 -0500>,<Administrator>,<TOPSPIN>,<proc1d>,<TOPSPIN 2.1>,
      <abs ABSG = 2 
       data hash MD5: 128K
       B4 21 F0 85 F2 C0 7D 86 D4 8E 58 D2 05 9A 43 3E>)
(   6,<2012-02-25 15:06:50.875 -0500>,<Administrator>,<TOPSPIN>,<proc1d>,<TOPSPIN 2.1>,
      <abs ABSG = 3 
       data hash MD5: 128K
       8F D8 E0 E9 FA 81 D5 4D E2 DD 7B BC D1 86 65 BA>)
(   7,<2012-02-25 15:06:50.953 -0500>,<Administrator>,<TOPSPIN>,<proc1d>,<TOPSPIN 2.1>,
      <abs ABSG = 4 
       data hash MD5: 128K
       FE 89 A2 23 6C 3F B5 5F 1D 6C 41 DF 30 D5 A3 BE>)
(   8,<2012-02-25 15:06:51.016 -0500>,<Administrator>,<TOPSPIN>,<proc1d>,<TOPSPIN 2.1>,
      <abs ABSG = 5 
       data hash MD5: 128K
       8E C7 10 73 8E A2 2D 78 66 82 62 0A 54 38 5F 4B>)
(   9,<2012-02-25 15:06:51.203 -0500>,<Administrator>,<TOPSPIN>,<audit>,<TOPSPIN 2.1>,
      <user comment:
       ICON-NMR User ID: Administrator
$$ [...]
150 150 150 150 150 150 150 150
##$TP07= 0
##$TPNAME0= <>
##$TPNAME1= <>
##$TPNAME2= <>
##$TPNAME3= <>
##$TPNAME4= <>
##$TPNAME5= <>
##$TPNAME6= <>
##$TPNAME7= <>
##$TPOAL= (0..7)
0.5 0.5 0.5 0.5 0.5 0.5 0.5 0.5
##$TPOFFS= (0..7)
0 0 0 0 0 0 0 0
##$TUNHIN= 0
##$TUNHOUT= 0
##$TUNXOUT= 0
##$USERA1= <user>
##$USERA2= <user>
##$USERA3= <user>
##$USERA4= <user>
##$USERA5= <user>
##$V9= 5
##$VALIST= <valist>
##$VCLIST= <CCCCCCCCCCCCCCC>
##$VD= 0
##$VDLIST= <DDDDDDDDDDDDDDD>
##$VPLIST= <PPPPPPPPPPPPPPP>
##$VTLIST= <TTTTTTTTTTTTTTT>
##$WBST= 1024
##$WBSW= 4
##$XGAIN= (0..3)
0 0 0 0
##$XL= 0
##$YL= 0
##$YMAX_a= 11043995
##$YMIN_a= -6350326
##$ZGOPTNS= <>
##$ZL1= 120
##$ZL2= 120
##$ZL3= 120
##$ZL4= 120
##$ABSF1= 14.98061
##$ABSF2= -5.57192
##$ABSG= 5
##$ABSL= 3
##$ALPHA= 0
##$AQORDER= 0
##$ASSFAC= 0
##$ASSFACI= 0
##$ASSFACX= 0
##$ASSWID= 0
##$AUNMP= <proc_prof1d_extract>
##$AXLEFT= 0
##$AXNAME= <>
##$AXNUC= <1H>
##$AXRIGHT= 0
##$AXTYPE= 0
##$AXUNIT= <>
##$AZFE= 0.1
##$AZFW= 0.1
##$BCFW= 0
##$BC_mod= 0
##$BYTORDP= 0
##$COROFFS= 0
##$CY= 15
##$DATMOD= 1
##$DC= 0
##$DFILT= <>
##$DTYPP= 0
##$F1P= 0
##$F2P= 0
##$FCOR= 0.5
##$FTSIZE= 131072
##$FT_mod= 6
##$GAMMA= 0
##$GB= 0
##$INTBC= 1
##$INTSCL= 1
##$ISEN= 128
##$LB= 0.3
##$LEV0= 0
##$LPBIN= 0
##$MAXI= 10000
##$MC2= 0
##$MEAN= 0
##$ME_mod= 0
##$MI= 0
##$NCOEF= 0
##$NC_proc= -3
##$NLEV= 6
##$NOISF1= 0
##$NOISF2= 0
##$NSP= 0
##$NTH_PI= 0
##$NZP= 0
##$OFFSET= 14.98061
##$PC= 1
##$PHC0= 19.81934
##$PHC1= 0
##$PH_mod= 1
##$PKNL= yes
##$PPARMOD= 0
##$PPDIAG= 0
##$PPIPTYP= 0
##$PPMPNUM= 2147483647
##$PPRESOL= 1
##$PSCAL= 4
##$PSIGN= 0
##$PYNMP= <proc.py>
##$REVERSE= no
##$SF= 400.13
##$SI= 131072
##$SIGF1= 0
##$SIGF2= 0
##$SINO= 400
##$SIOLD= 131072
##$SPECTYP= <>
##$SREGLST= <1H.CDCl3>
##$SSB= 0
##$STSI= 131072
##$STSR= 0
##$SW_p= 8223.68421052632
##$SYMM= 0
##$S_DEV= 0
##$TDeff= 65536
##$TDoff= 0
##$TI= <>
##$TILT= no
##$TM1= 0
##$TM2= 0
##$TOPLEV= 0
##$USERP1= <user>
##$USERP2= <user>
##$USERP3= <user>
##$USERP4= <user>
##$USERP5= <user>
##$WDW= 1
##$XDIM= 131072
##$YMAX_p= 466421104
##$YMIN_p= -334955146
##$CURPLOT= <Network HP LaserJet P1505>
##$CURPRIN= <$Network HP LaserJet P1505>
##$DFORMAT= <normdp>
##$LAYOUT= <+/1D_H.xwp>
##$LFORMAT= <normlp>
##$PFORMAT= <normpl>
##$SURQMSG= 1
$$ End of Bruker specific parameters
$$ ---------------------------------
##NTUPLES= NMR SPECTRUM
##VAR_NAME=  FREQUENCY,     SPECTRUM/REAL,   SPECTRUM/IMAG
##SYMBOL=    X,             R,               I
##VAR_TYPE=  INDEPENDENT,   DEPENDENT,       DEPENDENT
##VAR_FORM=  AFFN,          ASDF,            ASDF
##VAR_DIM=   131072,        131072,          131072
##UNITS=     HZ,            ARBITRARY UNITS, ARBITRARY UNITS
##FACTOR=    0.0627417313425165, 1,          1
##FIRST=     8223.62146879498, -5306,        -69093
##LAST=      0,             -3234,           -70909
##MIN=       0,             -334955146,      0
##MAX=       8223.62146879498, 466421104,    0
$$ Real data points
##PAGE= N=1
##DATA TABLE= (X++(R..R)), XYDATA
$$ [...]
63237I20699j3422j2358j3019j4117j4606j4960j5421j5032j3423j1822j1220
63226G71299j0975j0377j0060j0534j0709r420p446o436o538o556n896n036m490
63213F66826m597n777p779r047q246o153m739m488m102k898k008k604m077m814
63199E95497m178l106k968m156n598n631l678j068J72o39k346l346k915j292P11
63184E55459J974J711M27l10M16J683J876P62k23J52J510K627L056L308L774M134
63168E82336L958L198J969M41q15j039k81M63P37J489L534N727O043M346K650
63153F14756K323K416J521J53M8J575L016K563L80j584j604R8J665J803J344K067
63137F32540M121N624N182L729L210M212N875P439Q665R004P837N889N205O975
$$ plain form
63237 920699 907277 894919 881900 867783 853177 838217 822796 807764 794341 782519 771299
63226 771299 760324 749947 739887 729353 718644 709224 701778 695342 688804 682248 676352 671316 666826
63213 666826 662229 656452 648673 639626 631380 625227 620488 616000 611898 609000 606992 604388 600311 595497
63199 595497 591319 588213 585245 581089 575491 569860 566182 565114 565286 564647 562301 558955 556040 554748 555459
63184 555459 557433 559144 559571 559261 559677 561360 563236 563998 563775 563927 565437 568064 571120 574428 578202 582336
63168 582336 586294 589492 591461 591902 591087 590048 589767 590230 590967 592456 595990 601717 607760 612106 614756
63153 614756 617079 619495 621016 621169 621217 622792 625808 628371 628751 627167 625563 625661 627326 629129 630473 632540
63137 632540 636661 642285 647467 651196 654406 658618 664493 671932 680597 689601 697438 703327 708532 715507
63123G15507R860J1255J0058P690O502P609J0336J3267J5353J6191J5788J4532
63111H53948J3077J1850J0729R504Q492Q210Q500Q665Q496Q506Q832Q631P057
63098I74497M454K002M71k94r79k311m620p424r750j1199j2380j3838j5015j5029
63084H88585j4037j2919j1769r762o735l968k877l522m895o043o421n721m212
63071G95704k977k944l570l267j397Q08J759J408R51J013J029M84j63k94j95n53
63055G87796j192j148oJ376J752P87p10j586j426r79j346k527l141k185o21l15
63039G74529j435k121j167K08J42j155j672k99J990L609M038L757L356L205L386
63024G90371L552L274K867L334N033O859P468P072P143Q297R415R296Q454Q448
$$ plain form
63123 715507 725367 736622 746680 754370 760872 768481 778817 792084 807437 823628 839416 853948
63111 853948 867025 878875 889604 899108 907600 915810 924310 932975 941471 949977 958809 967440 974497
63098 974497 978951 980953 981424 981130 980151 977840 973220 965796 956046 944847 932467 918629 903614 888585
63084 888585 874548 861629 849860 840098 833363 829395 826518 822996 818101 812058 805637 799916 795704
63071 795704 792727 789783 786213 782946 781549 782357 784116 785524 786475 787488 788517 789001 788838 788544 788349 787796
63055 787796 786604 785456 785450 786826 788578 789365 788655 787069 785643 784664 783318 780791 777650 775465 774844 774529
63039 774529 773094 770973 769806 770014 770156 769001 767329 767030 769020 772629 776667 780424 783780 786985 790371
63024 790371 793923 797197 800064 803398 808431 815290 822758 829830 836973 845270 854685 863981 872435 880883
63010H80883R769J1309J1942J1702J1073R916P770M834J930l58k023l274m371
62997I51102n660p248q684r466r827j0489j1638j2702j3191j3137j2671j1811
62985H24578j0961j0926j1891j2834j2496j0763q719p442p062o891o191m822l268
62972G10312k091j439j230j488k069k313j656o13l36j030j598j164j51O14J077
62957F94825J525J653J054J79j37N0j39j054k019k170j180Q10L235N084N568N096
62941G12380M921N625O606P199P641Q524R938J1634J3478J5195J6053J5609J4531
62928H49334J4016J4389J4827J4488J3371J1952J0599R553Q958Q510P497N695
62916I83189L854K672J500j084n264r513j2583j5179j8713k2843k5487k5453k4040
$$ plain form
63010 880883 890652 901961 913903 925605 936678 946594 954364 959198 961128 960770 958747 955473 951102
62997 951102 945442 938194 929510 920044 910217 899728 888090 875388 862197 849060 836389 824578
62985 824578 813617 802691 790800 777966 765470 754707 745988 738546 731484 724593 718402 713580 710312
62972 710312 708221 706782 705552 704064 701995 699682 698026 697413 697077 696047 694449 693285 693134 693748 694825
62957 694825 696350 698003 699057 699236 699099 699149 699010 697956 695937 693767 692587 693397 696632 701716 707284 712380
62941 712380 717301 722926 729532 736731 744372 752896 762834 774468 787946 803141 819194 834803 849334
62928 849334 863350 877739 892566 907054 920425 932377 942976 952529 961487 969997 977494 983189
62916 983189 987043 989715 991215 990131 984867 975354 962771 947592 928879 906036 880549 855096 831056
62903H31056k3467k4419k5810k6458k6119k5043k3452k1692k0316j9623j9342
62892E75315j8980j8268j7091j5348j3203j1316j0333j0090r670q372o478m914
62880D31252m283m453m996n684o476p145p201o244m371k280r07q36j901l324m312
62865C66839m530m107l329k363j282k74K02k64j417k330k327j751j366j168n15
62850C40018N14Q37l2j028r87m73r14k205k464o26J843K554J073o66o53J061K657
62833C40509K664J467O74J208K429L274L552L636L433K623J748J879K995L776
62819C75867L581L592N086P391Q683Q517Q239Q813R454R044P983P722Q768J0067
62805D82807J0362R393P510M831J464j734l505l514k864k909l905n067n661n635
$$ plain form
62903 831056 807589 783170 757360 730902 704783 679740 656288 634596 614280 594657 575315
62892 575315 556335 538067 520976 505628 492425 481109 470776 460686 451016 442644 436166 431252
62880 431252 426969 422516 417520 411836 405360 398215 391014 384770 380399 378119 377212 376376 374475 371151 366839
62865 366839 362309 358202 354873 352510 351228 350954 351156 350892 349475 347145 344818 343067 341701 340533 340018
62850 340018 340532 341369 341337 340309 339322 338849 337935 335730 333266 332640 334483 337037 338110 337444 336791 337852 340509
62833 340509 343173 344640 345314 346522 348951 352225 355777 359413 362846 365469 367217 369096 372091 375867
62819 375867 379448 383040 388126 395517 404200 412717 420956 429769 439223 448267 456250 463972 472740 482807
62805 482807 493169 502562 510072 514903 516367 514633 511128 507614 504750 501841 497936 492869 487208 481573
62791D81573n383n346n738o398o821o603n835m978m454m449m820n090m803m089
62777D06766l486k994j855J86J989K160P52r15j895k249k245j939j577j522j593
62762C89583j222m76r6m57j212k082l023l463k540o53L36o97k577l380k899k445
62746C62697k680k910k479j742j316j152r29q30j330k375l255l427l157l108l478
62731C28529l782l563k839j797m90Q23J535J385R32P62N83j88j264j730j320m77
62715C17099O04J971K913K262O3k064k775k295j403j88J401K578K357R98j2N39
62699C24048K423M225M685L915L165L197L318K678J942K457M071N304N652O013
62685C77093O503N727L198P04N6P52J231J207J240J052O1j084j194n06m95j836
$$ plain form
62791 481573 476190 470844 465106 458708 451887 445284 439449 434471 430017 425568 420748 415658 410855 406766
62777 406766 403280 400286 398431 398617 400606 402766 403518 402603 400708 398459 396214 394275 392698 391176 389583
62762 389583 388361 387885 387789 387332 386120 384038 381015 377552 375012 374359 374695 373998 371421 368041 365142 362697
62746 362697 360017 357107 354628 352886 351570 350418 349489 348659 347329 344954 341699 338272 335115 332007 328529
62731 328529 324747 321184 318345 316548 316058 316881 318416 319801 320733 321495 322078 321890 320626 318896 317576 317099
62715 317099 317703 319674 322587 324849 324912 322848 320073 317778 316375 316187 317588 320166 322523 323521 323509 324048
62699 324048 326471 330696 335381 339296 342461 345658 348976 351654 353596 356053 360124 365428 371080 377093
62685 377093 383596 389323 392521 393225 393281 394033 395264 396471 397711 398763 398824 397740 396546 396040 395545 393709
62669C93709l690m942n105m258l005k239k098j670n29J81o13j956k043q46M7k9
62653C60914j36M72J382K043K401K376J991K089L653O147P860Q121P927Q203Q732
62638D24175R175R794J0592J0977J0925J1497J3423J6104J8546K0479K2010K3002
62626F00699K3491K4050K5099K6326K7234K7706K7733K7182K6124K4762K2815
62615H83221J9721J5664J1490P332K318l818r831j4372j7510k0122k2558k4719
62603H26816k6707k8388k8831k7316k4724k2925k2720k3134k2867k1711k0261
62592E57232j8804j7004j4646j2300j0935j0846j1162j0634q920o758n062m159
62580D26002l990m496n506o472o652n730m188k935k432k256j876j675k488m124
$$ plain form
62669 393709 390019 385077 379972 375714 372709 370470 368372 366702 366173 366354 365741 363785 361742 360896 360943 360914
62653 360914 360778 361250 362632 364675 367076 369452 371443 373532 377185 383332 391192 399313 407240 415443 424175
62638 424175 433350 443144 453736 464713 475638 487135 500558 516662 535208 555687 577697 600699
62626 600699 624190 648240 673339 699665 726899 754605 782338 809520 835644 860406 883221
62615 883221 902942 918606 930096 937428 939746 935928 926097 911725 894215 874093 851535 826816
62603 826816 800109 771721 742890 715574 690850 667925 645205 622071 599204 577493 557232
62592 557232 538428 521424 506778 494478 483543 472697 461535 450901 441981 435223 430161 426002
62580 426002 422012 417516 412010 405538 398886 393156 388968 386033 383601 381345 379469 377794 375306 371182
62566C71182n210m977m180l605k770j160K18P3j043j507j176j342k238k497j515
62551C38253n64p93j569j635p84L78J311J595J141P82J526K739K589R69L51K402
62535C48691N258N836L904J977J736K356K381J649R39P63J045J484J964K722L936
62520C86641N049N141M237L503L513L303J920J19o97m94l09l88r1M67K33j087
62504D11060k318k342j455p84r80j844k728l022k687k421k871l673l747k679j215
62489C76294l03q0N5O88J825K773K632J301j81p04l24K6j49n76r78j311j181n2
62471C79755J622K381J524K24R6J074J668J207P50J512L112M189M253M063M257
62456D11687M538M549M706N454O291O411O023O108O962P903Q422Q697Q889R055
$$ plain form
62566 371182 365972 360995 356815 353210 350440 349280 349498 349571 348528 347021 345845 344503 342265 339768 338253
62551 338253 337689 336896 335327 333692 332908 333286 334597 336192 337333 338115 339641 342380 344969 345938 346289 348691
62535 348691 353949 359785 363689 365666 367402 369758 372139 373788 374727 375490 376535 378019 379983 382705 386641
62520 386641 391690 396831 401068 404571 408084 411387 413307 413426 412729 412235 411926 411538 411447 411914 412147 411060
62504 411060 408742 406400 404945 404161 403181 401337 398609 395587 392900 390479 387608 383935 380188 377509 376294
62489 376294 375991 375911 375966 376654 378479 381252 383884 385185 385004 384300 383976 384002 383853 383277 382299 380988 379807 379755
62471 379755 381377 383758 385282 385506 385602 386676 388344 389551 390301 391813 394925 399114 403367 407430 411687
62456 411687 416225 420774 425480 430934 437225 443636 449659 455767 462729 470632 479054 487751 496640 505695
62442E05695R927J2429J5849J7799J7040J5267J4843J5658J5680J4069J1980J0449
62430F76685R032O976M312J361j813m803o737p495q258r968j1852j2431j1664
62417F23345j1056j1616j2654j2914j2208j1276j0461r298p520n740m790m765
62405E09047n154n573n874n780n082m130l487l141k663k098j847j663p71O50J236
62390D63670K76j124j508q59q2N39J265K000K559L345M607N422M659K688R05j23
62374D88239p56p86M22K200K818K006J575K651L899L667K589K399L107L143K022
62359E19195J165J811L507N118O337P553Q840R782J0082R934R814J0019J0362
62346F13519J0382R997R793J0302J1199J1737J1862J2377J3816J5737J7338J8330
$$ plain form
62442 505695 515622 528051 543900 561699 578739 594006 608849 624507 640187 654256 666236 676685
62430 676685 685717 692693 697005 698366 696553 691750 685013 677518 669260 659292 647440 635009 623345
62417 623345 612289 600673 588019 575105 562897 551621 541160 531862 524342 518602 513812 509047
62405 509047 503893 498320 492446 486666 481584 477454 473967 470826 468163 466065 464218 462555 461784 462434 463670
62390 463670 463946 462822 461314 460455 460373 460912 462177 464177 466736 470081 474688 480110 484769 487457 488362 488239
62374 488239 487483 486697 487119 489319 492137 494143 495718 498369 502268 505935 508524 510923 514030 517173 519195
62359 519195 520360 522171 525678 530796 537133 544686 553526 563308 573390 583324 593138 603157 613519
62346 613519 623901 633898 643691 653993 665192 676929 688791 701168 714984 730721 748059 766389
62334G66389J8816J8860J8579J8340J8225J7655J6210J4681J4449J5577J6460
62323I54241J5870J4642J4389J5011J4694J2598J0349J0133J2006J4054J5009
62312A102996J5693J7667K1165K4957K7862K9851L1727L4228L7628M1920M7009
62301A432703N2692N8545O3917O8217P1473P4646P8931Q4305Q8895R0370Q8071
62290B252765Q3305P7334O9769N9498M6776L3499K1379J0500j51j1330k2992l4530
62278B585822m5100n3884o0480o5014o7853o9307o9651o9112o7699o5282o2032
62267A890408n8431n4704n0548m5821m1184l7508l4695l1561k7272k2510j8852
62256A467322j6887j5414j2814r009n503l494k494j141J056L359M894N491N531
$$ plain form
62334 766389 785205 804065 822644 840984 859209 876864 893074 907755 922204 937781 954241
62323 954241 970111 984753 999142 1014153 1028847 1041445 1051794 1061927 1073933 1087987 1102996
62312 1102996 1118689 1136356 1157521 1182478 1210340 1240191 1271918 1306146 1343774 1385694 1432703
62301 1432703 1485395 1543940 1607857 1676074 1747547 1822193 1901124 1985429 2074324 2164694 2252765
62290 2252765 2336070 2413404 2483173 2542671 2589447 2622946 2644325 2654825 2654674 2643344 2620352 2585822
62278 2585822 2540722 2486838 2426358 2361344 2293491 2224184 2154533 2085421 2017722 1952440 1890408
62267 1890408 1831977 1777273 1726725 1680904 1639720 1602212 1567517 1535956 1508684 1486174 1467322
62256 1467322 1450435 1435021 1422207 1413198 1407695 1404201 1401707 1400566 1401622 1404981 1409875 1415366 1420897
62243A420897N503N871O828Q076R104R744J0189J0545J0720J0708J0610J0408
62231A529203J0130J0183J1075J2677J4173J4786J4400J3631J3515J4860J7378
62220A676011J9764K1110K1878K2918K4150K5073K6172K8396L1436L3844L5117
62209A965869L6311L8348M0968M3789M7178N1379N5912O0397O4975O9390P2967
62198B547483P6195Q0917Q7726R4378R8258R9542J00337J01189J00085R4866Q5428
62187C566404P3404O0680M8327L6221K3590J0463j676j1218j8263k4484l1297
62176C732151l8573m4786m8059m7564m4404m0711l7445l3872k9524k5488k2686
62165C319039k0062j5928j0456n307j259K250N540Q252J0461J2773J5187J7186
$$ plain form
62243 1420897 1426400 1432271 1439099 1447175 1456279 1466023 1476212 1486757 1497477 1508185 1518795 1529203
62231 1529203 1539333 1549516 1560591 1573268 1587441 1602227 1616627 1630258 1643773 1658633 1676011
62220 1676011 1695775 1716885 1738763 1761681 1785831 1810904 1837076 1865472 1896908 1930752 1965869
62209 1965869 2002180 2040528 2081496 2125285 2172463 2223842 2279754 2340151 2405126 2474516 2547483
62198 2547483 2623678 2704595 2792321 2886699 2984957 3084499 3184836 3286025 3386110 3480976 3566404
62187 3566404 3639808 3700488 3748815 3785036 3808626 3819089 3817413 3806195 3787932 3763448 3732151
62176 3732151 3693578 3648792 3600733 3553169 3508765 3468054 3430609 3396737 3367213 3341725 3319039
62165 3319039 3298977 3283049 3272593 3267286 3266027 3268277 3273817 3282069 3292530 3305303 3320490 3337676
62153C337676J9056K1727K5209K8401L0719L2645L4428L5731L6850L8855M1817
62142C683114M4283M5490M6862N0130N4785N8578O0148O0147O0038O0763O2542
62131D286880O5091O7833P0253P2202P3759P4934P5822P6813P8199P9497P9523
62120E100806P7386P3437O9026O5179O1639N7574N3062M9257M6983M5905M5598
62109E745852M6647M9886N4890O0177O4699O8377P1229P2872P3026P1885O9681
62098F449221O6186O0797N3053M3245L2610K2490J3082L692n617j3630j9920k5959
62086F679250l3073m0239m5428m8467n0799n2685n2677n0130m6479m3433m1289
62075F174551l9609l8232l6887l4943l2291k9669k7569k5730k4084k3172k2998
$$ plain form
62153 3337676 3356732 3378459 3403668 3432069 3462788 3495433 3529861 3565592 3602442 3641297 3683114
62142 3683114 3727397 3772887 3819749 3869879 3924664 3983242 4043390 4103537 4163575 4224338 4286880
62131 4286880 4351971 4419804 4490057 4562259 4636018 4710952 4786774 4863587 4941786 5021283 5100806
62120 5100806 5178192 5251629 5320655 5385834 5447473 5505047 5558109 5607366 5654349 5700254 5745852
62109 5745852 5792499 5842385 5897275 5957452 6022151 6090528 6161757 6234629 6307655 6379540 6449221
62098 6449221 6515407 6576204 6629257 6672502 6705112 6727602 6740684 6744376 6738759 6725129 6705209 6679250
62086 6679250 6646177 6605938 6560510 6512043 6461244 6408559 6355882 6305752 6259273 6215840 6174551
62075 6174551 6134942 6096710 6059823 6024880 5992589 5962920 5935351 5909621 5885537 5862365 5839367
62064E839367k2580k1370k0184j9855j9805j8986j7500j6288j5640j5014j4147
62053E637998j3396j3061j3077j3444j4379j5860j7429j8656j9656k0919k2611
62042E455510k4196k5124k5743k6877k8246k8265k6298k4209k4397k6595k8193
62031E167367k7595k5758k4124k2700k0884j8826j6947j5028j2763j0580r073
62020D963089q123p143n699l432j28L530N979O360N617N291N771O456P129Q211
62006D992908R785J1236J2078J2654J3760J5581J6903J5433R237j810j5955l0679
61994E061131m3661n3332n9451o3366o7002p1562p7629q5964r6802j08269j16983
61983D217110j20968j21191j19755j17603j14522j10378j05380r9636r3228q6433
$$ plain form
62064 5839367 5816787 5795417 5775233 5755378 5735573 5716587 5699087 5682799 5667159 5652145 5637998
62053 5637998 5624602 5611541 5598464 5585020 5570641 5554781 5537352 5518696 5499040 5478121 5455510
62042 5455510 5431314 5406190 5380447 5353570 5325324 5297059 5270761 5246552 5222155 5195560 5167367
62031 5167367 5139772 5114014 5089890 5067190 5046306 5027480 5010533 4995505 4982742 4972162 4963089
62020 4963089 4954966 4947823 4942124 4938692 4938564 4942094 4948073 4954433 4960050 4965341 4971112 4977568 4984697 4992908
62006 4992908 5002693 5013929 5026007 5038661 5052421 5068002 5084905 5100338 5109575 5107765 5091810 5061131
61994 5061131 5017470 4964138 4904687 4841321 4774319 4702757 4625128 4539164 4442362 4334093 4217110
61983 4217110 4096142 3974951 3855196 3737593 3623071 3512693 3407313 3307677 3214449 3128016
61973C128016p9506p2717o6782o2552n9833n7216n3607m9395m5859m3917m3641
61962B492991m4182m4090m2556m0508l9476l9330l8481l6505l4834l4187l3108
61951B065734l0273k6673k4022k2146j9694j6492j3496j0904p896m042L22M748
61939A895166Q598J0705J0338Q181N265J358m225j0724j6366k0638k4624k8981
61927A834053l3011l5993l8164l9869m0728m0303l8835l6919l4881l2815l0679
61916A431856k8198k5109k1674j8579j6272j4753j3841j3086j1669r069n903l381
61904A250322j886o37J123L221N009O185O904P545Q642J0703J3750J7063J9690
61891A347634K1380K2982K5759L0054L4802L8589M1067M2972M5050M7633N1159
$$ plain form
61973 3128016 3048510 2975793 2909011 2846459 2786626 2729410 2675803 2626408 2580549 2536632 2492991
61962 2492991 2448809 2404719 2362163 2321655 2282179 2242849 2204368 2167863 2133029 2098842 2065734
61951 2065734 2035461 2008788 1984766 1962620 1942926 1926434 1912938 1902034 1894138 1890096 1890418 1895166
61939 1895166 1903764 1914469 1924807 1932988 1938253 1939611 1935386 1924662 1908296 1887658 1863034 1834053
61927 1834053 1801042 1765049 1726885 1687016 1646288 1605985 1567150 1530231 1495350 1462535 1431856
61916 1431856 1403658 1378549 1356875 1338296 1322024 1307271 1293430 1280344 1268675 1259606 1253703 1250322
61904 1250322 1248436 1247799 1248922 1252143 1257152 1263337 1270241 1277786 1286428 1297131 1310881 1327944 1347634
61891 1347634 1369014 1391996 1417755 1447809 1482611 1521200 1562267 1605239 1650289 1697922 1749081
61880A749081N6093O1963O7254P0699P2287P2749P2711P2582P2516P2143P0859
61869B510937O8697O6183O3280N9367N4494M9532M4782L9651L4276L0224K8816
61858C050239K9931L3119L8557M5905N3691O1211O9853Q1041R3956J06733J18947
61847C783183J31140J42842J53066J62255J71798J81859J91506K00693K10317
61838E328659K20279K29316K36817K42980K46679K44637K33160K09875J74019
61829G366421J26705P1111J1067n0824j12454j69948k18191k54320k79162k94696
61819F195709l01663l00534k93269k82618k70192k56054k39808k21509k02008
61810C828054j82808j65107j48805j32976j17227j01891q7091p2794n9692m8627
$$ plain form
61880 1749081 1805174 1867137 1934391 2005090 2077377 2150126 2222837 2295419 2367935 2440078 2510937
61869 2510937 2579634 2645817 2709097 2768464 2822958 2872490 2917272 2956923 2991199 3021423 3050239
61858 3050239 3080170 3113289 3151846 3197751 3251442 3312653 3382506 3463547 3557503 3664236 3783183
61847 3783183 3914323 4057165 4210231 4372486 4544284 4726143 4917649 5118342 5328659
61838 5328659 5548938 5778254 6015071 6258051 6504730 6749367 6982527 7192402 7366421
61829 7366421 7493126 7564237 7575304 7524480 7412026 7242078 7023887 6769567 6490405 6195709
61819 6195709 5894046 5593512 5300243 5017625 4747433 4491379 4251571 4030062 3828054
61810 3828054 3645246 3480139 3331334 3198358 3081131 2979240 2892149 2819355 2759663 2711036
61800B711036l8863k8476j7006o293K183R570J8188K8703L9760M9714N7752O3806
61788B890074O8241P1408P2996P2163O8621O2954N5563M6142L4830K2963J1879
61777C477834J673p934j6054k1101k2637k1809j9867j6963j2521o311J011Q107
61765C343428J3624J6724J7051J4389Q741P13q732j9093l0423m2374n3634o2674
61753C197740o8753p2042p3266p3427p3281p2502o9799o4383n7148m9822m3156
61742B480161l6434k8755k0357j2472o046q81M073R712J6243K3405L0763L7663
61730B497075M3608M9014N5153O2712P0855P8474Q6026R5051J05949J17353J28184
61719C389454J39419J53086J70029J89300K09602K30753K53713K79467L08002
$$ plain form
61800 2711036 2672173 2643697 2626691 2620398 2622581 2632151 2650339 2679042 2718802 2768516 2826268 2890074
61788 2890074 2958315 3029723 3102719 3174882 3243503 3306457 3362020 3408162 3442992 3465955 3477834
61777 3477834 3479507 3471573 3455519 3434418 3411781 3389972 3370105 3353142 3340621 3334310 3335321 3343428
61765 3343428 3357052 3373776 3390827 3405216 3413957 3414670 3405938 3386845 3356422 3314048 3260414 3197740
61753 3197740 3128987 3056945 2983679 2910252 2836971 2764469 2694670 2630287 2573139 2523317 2480161
61742 2480161 2443727 2414972 2394615 2382143 2376097 2375216 2379289 2389001 2405244 2428649 2459412 2497075
61730 2497075 2540683 2589697 2644850 2707562 2778417 2856891 2942917 3037968 3143917 3261270 3389454
61719 3389454 3528873 3681959 3851988 4041288 4250890 4481643 4735356 5014823 5322825
61710E322825L38337L69435M00820M32067M61849M87772N06999N16583N13207
61701I349894M93022M52201L88143L00957J94460P5771m6317j63051k66850l52414
61691A0425816m17650m63337m91441n04081n03863m93941m76874m54187m27647
61682F192795l99947l73057l46749l19994k93173k67746k44356k22710k02844
61673C522219j84940j68199j51524j35340j21223j09657r9515q9936q1323p4197
61663B306365o8330o3262n8665n4091m9556m6463m6543m9504n3004n5216n6294
61652A705437n6990n7211n6420n4337n0890m6519m2797m1338m1718m1694l9904
61641A175619l6999l3868l0487k7132k4960k4264k3589k1783j9620j8216j7102
$$ plain form
61710 5322825 5661162 6030597 6431417 6863484 7325333 7813105 8320104 8836687 9349894
61701 9349894 9842916 10295117 10683260 10984217 11178677 11254448 11208131 11045080 10778230 10425816
61691 10425816 10008166 9544829 9053388 8549307 8045444 7551503 7074629 6620442 6192795
61682 6192795 5792848 5419791 5073042 4753048 4459875 4192129 3947773 3725063 3522219
61673 3522219 3337279 3169080 3017556 2882216 2760993 2651336 2551821 2461885 2380562 2306365
61663 2306365 2238035 2174773 2116108 2062017 2012461 1965998 1919455 1869951 1816947 1761731 1705437
61652 1705437 1648447 1591236 1534816 1480479 1429589 1383070 1340273 1298935 1257217 1215523 1175619
61641 1175619 1138620 1104752 1074265 1047133 1022173 997909 974320 952537 932917 914701 897599
61630H97599j5356j3555j2970j3495j3924j3878j3953j4103j3338j1314r205q593
61618G43915r877j1926j3021j2287j0383q727p950p505o745n732m776l857k846
61605F38283j776p91j94m62j386j428Q09M447O994P358O816O638O479N931N885
61590F83603P113Q740R643J0315J1829J3674J4211J2908J0796Q988P888P585P900
61577H15193Q036P118N182L044J380L94J05L34P72J509L129N707Q246R658R927
61562H79734R748R396Q497O490K965j989p350j1651j4307j5928j7086j7591j7431
61549H13497j7449j8340j9586k0055j9187j7204j4816j2977j2067j1166r129o563
61537F34958n240n258m577k262k28k84j174m91J740L413L583L334L800M986O452
$$ plain form
61630 897599 882243 868688 855718 842223 828299 814421 800468 786365 773027 761713 752508 743915
61618 743915 734038 722112 709091 696804 686421 677694 669744 662239 655494 649762 644986 641129 638283
61605 638283 636507 635716 635522 635060 633674 632246 633055 637502 644496 651854 658670 665308 671787 677718 683603
61590 683603 690716 699456 709099 719414 731243 744917 759128 772036 782832 791820 799708 807293 815193
61577 815193 823229 830347 835529 838573 839953 840347 840452 840786 841558 843067 846196 851903 860149 869807 879734
61562 879734 889482 898878 907375 913865 916830 914841 907491 895840 881533 865605 848519 830928 813497
61549 813497 796048 777708 758122 738067 718880 701676 686860 673883 661816 650650 641521 634958
61537 634958 629718 624460 619883 617621 617393 617109 615935 615444 617184 620597 624180 627514 631314 636300 642752
61522F42752P727Q321Q496R654J2645J6144J8015J7934J7386J7543J8519K0278
61510H15414K2716K4938K5746K4879K2853K0054J7087J5257J5212J5589J4617
61499A034362J2619J1282J0865J0088Q584P431P089O843O610P290Q675Q979P407
61486A148124N577N208N801N816N044M423M263L999L342K486J339m04k329l283
61472A189406k666j340p92j477k346k183j035K86J862M897R853J5308J9444K2080
61458A251297K4463K7486L1057L4866L8849M2905M6925N1142N6035O1993O9201
61447A736219P7291Q4934R0766R5234J00537J07850J15606J21435J24607J25207
61437B779686J22166J14011J00960Q4508O5428M4050K2021J681j6287l2656m7139
$$ plain form
61522 642752 650479 658800 667296 676950 689595 705739 723754 741688 759074 776617 795136 815414
61510 815414 838130 863068 888814 913693 936546 956600 973687 988944 1004156 1019745 1034362
61499 1034362 1046981 1058263 1069128 1079216 1087800 1095231 1102320 1109163 1115773 1123063 1131738 1140717 1148124
61486 1148124 1153701 1158909 1164710 1170526 1175570 1179993 1184256 1188255 1191597 1194083 1195422 1195018 1192689 1189406
61472 1189406 1186740 1185400 1184608 1183131 1180785 1178602 1177567 1177853 1179715 1184612 1194465 1209773 1229217 1251297
61458 1251297 1275760 1303246 1334303 1369169 1408018 1450923 1497848 1548990 1605025 1667018 1736219
61447 1736219 1813510 1898444 1989210 2084444 2184981 2292831 2408437 2529872 2654479 2779686
61437 2779686 2901852 3015863 3116823 3201331 3266759 3310809 3332830 3334511 3318224 3285568 3238429
61426C238429n8131o5166o9626p2437p2923p0658o6745o2285n7092n0771m3961
61415B548634l7584l1874k6845k2707j9162j5359j1152p471m881k832r06M51J162
61402B369474K365N018Q558J1884J4898J8151K1566K4498K6662K8276K9588L0660
61390B591598L1420L1714L1854L2947L5782L9238M1025M0371L8734L7280L5061
61379B987024L0695K4694J8769J3641Q924M593J230j116l027m706n742n951n670
61366C063358n162m380l535l263m027n696p890j0408j3247j6301j9295k1891k3837
61353B924426k4991k5267k4811k4227k4198k4594k4383k3024k1508k1232k2070
61342B664121k2458k1397j9387j7210j4801j1752q014l582J854Q319J5055K1242
$$ plain form
61426 3238429 3180298 3115132 3045506 2973069 2900146 2829488 2762743 2700458 2643366 2592595 2548634
61415 2548634 2511050 2479176 2452331 2429624 2410462 2395103 2383951 2376480 2371599 2368767 2367861 2368312 2369474
61402 2369474 2371839 2376857 2385415 2397299 2412197 2430348 2451914 2476412 2503074 2531350 2560938 2591598
61390 2591598 2623018 2654732 2686586 2719533 2755315 2794553 2835578 2875949 2914683 2951963 2987024
61379 2987024 3017719 3042413 3061182 3074823 3083747 3088340 3089570 3088454 3085427 3080721 3074979 3069028 3063358
61366 3063358 3058196 3053816 3050281 3047018 3042991 3037295 3029405 3018997 3005750 2989449 2970154 2948263 2924426
61353 2924426 2899435 2874168 2849357 2825130 2800932 2776338 2751955 2728931 2707423 2686191 2664121
61342 2664121 2641663 2620266 2600879 2583669 2568868 2557116 2549102 2545520 2547374 2555693 2570748 2591990
61330B591990K7022L3339M0916M9592N8553O7113P5444Q4444R4527J04590J12729
61319C340259J17955J20777J22099J22033J19789J14167J04154Q9577P1349N0739
61309D372898K8662O156j4936l2890m7724o0938p3448q4635r3563j00160j04798
61298C794624j07492j08107j06760j03804r9749r5191r0230q4079p6141o7391
61288B855680n9595n3007m6188l8506l1413k6409k2859j9050j4708j1089q879
61277B523977p171m852k162m32n01j788k973l343l125k558j264J025L656N655
61263B504144O818P502P679P023N642L907J836n00k231k524k024k282l705n261
61249B526024o229p000p899q515q529q201p683o864o080n753n254l466q18Q30
$$ plain form
61330 2591990 2619012 2652351 2693267 2742859 2801412 2868525 2943969 3028413 3122940 3227530 3340259
61319 3340259 3458214 3578991 3701090 3823123 3942912 4057079 4161233 4250810 4322159 4372898
61309 4372898 4401560 4407716 4392780 4359890 4312166 4251228 4177780 4093145 3999582 3899422 3794624
61298 3794624 3687132 3579025 3472265 3368461 3268712 3173521 3083291 2999212 2923071 2855680
61288 2855680 2796085 2743078 2696890 2658384 2626971 2600562 2577703 2558653 2543945 2532856 2523977
61277 2523977 2516806 2511954 2509792 2509360 2508859 2507071 2504098 2500755 2497630 2495072 2493808 2494833 2498489 2504144
61263 2504144 2510962 2518464 2526143 2533166 2538808 2542715 2544551 2544051 2541820 2539296 2537272 2534990 2531285 2526024
61249 2526024 2519795 2512795 2504896 2496381 2487852 2479651 2471968 2465104 2459024 2453271 2448017 2444551 2443733 2444563
61235B444563Q55Q48J996K924J388k790p647j1313j3444j5030j7405k0838k3731
61222B340376k4032k1798j9148j7333j5417j2600j0041q960q453o942m614k560
61210B188478m11L096P680J1889J5706K0726K7470L4517M0787M6785N2727N7137
61198B506587N8778N8762N9227O0454O0870N9713N8276N8108N9236O0764O2224
61187C162999O3232O2235N6916M6161L0942J3077o117k5646m4211o0443p3374
61176C225771q2388q7326q9128q9508q9101q6681q1126p3399o5435n7794n0009
61165B373876m2717l7537l4776l3066l1727l1750l3590l5479l5202l2758l0181
61154A995093k8997k8674k7513k4718k1469j9766k0077k0671j9768j7580j5342
$$ plain form
61235 2444563 2445418 2446266 2448262 2451186 2452574 2449784 2442137 2430824 2417380 2402350 2384945 2364107 2340376
61222 2340376 2316344 2294546 2275398 2258065 2242648 2230048 2220007 2211047 2202594 2195652 2191038 2188478
61210 2188478 2188067 2191163 2198843 2210732 2226438 2247164 2274634 2309151 2349938 2396723 2449450 2506587
61198 2506587 2565365 2624127 2683354 2743808 2804678 2864391 2922667 2980775 3040011 3100775 3162999
61187 3162999 3226231 3288466 3345382 3391543 3422485 3435562 3429445 3403799 3359588 3299145 3225771
61176 3225771 3143383 3056057 2966929 2877421 2788320 2701639 2620513 2547114 2481679 2423885 2373876
61165 2373876 2331159 2293622 2258846 2225780 2194053 2162303 2128713 2093234 2058032 2025274 1995093
61154 1995093 1966096 1937422 1909909 1885191 1863722 1843956 1823879 1803208 1783440 1765860 1750518
61143A750518j3325j1153r366q812q869q160o978o888p846p918o249m120k453
61130A648381n20J929L460L370L397N450R068J2601J5487J7800J8754J7510J4622
61117A771309J1217P343K430l287q848j3503j6688j8021j8320j9560k2668k6272
61105A645132k8772l0531l2620l4438l4397l2490l0408k9197k8208k6534k4348
61094A313189k2514k1461k0591j8633j4893j0256o432l994j977M54K976N131P196
61081A208195R447J1580J3498J5674J8115J9877K0024J8062J3337N638l112r644
61069A340691j2818j4740j7500k0537k2339k2902k2880k1866j9233j5760j2820
61058A137296j0973j0429j1569j3802j5200j4699j3377j2353j1094r231q175q896
$$ plain form
61143 1750518 1737193 1726040 1716674 1707862 1698993 1690833 1683855 1676967 1669121 1661203 1654954 1650834 1648381
61130 1648381 1647861 1649790 1653250 1656620 1660017 1665467 1674535 1687136 1702623 1720423 1739177 1756687 1771309
61117 1771309 1782526 1789869 1792299 1789012 1780164 1766661 1749973 1731952 1713632 1694072 1671404 1645132
61105 1645132 1616360 1585829 1553209 1518771 1484374 1451884 1421476 1392279 1364071 1337537 1313189
61094 1313189 1290675 1269214 1248623 1229990 1215097 1204841 1198409 1194415 1192438 1192892 1195868 1200999 1208195
61081 1208195 1217642 1229222 1242720 1258394 1276509 1296386 1316410 1334472 1347809 1353447 1350335 1340691
61069 1340691 1327873 1313133 1295633 1275096 1252757 1229855 1206975 1185109 1165876 1150116 1137296
61058 1137296 1126323 1115894 1104325 1090523 1075323 1060624 1047247 1034894 1023800 1014569 1006394 997498
61046I97498r677q327n480l515l202l478l491k814o13L212O868Q662R326J0377
61032I95346J1337J0787R184Q033O954M172m99n475r837j3583j5809j5190j2353
61019I73067r598q190p775q135r254r833q080m343j044K44qq12j511j102J269
61004I04895M794P511Q470Q137O983N287L969L857M304M136L678M190N668O962
60990I82841P632P945P594O423N786O988Q807Q813O937N415N430O151O972Q250
60976A081984R737J0550J1014J2358J4294J4987J3765J2152J1827J3058J5081
60965A220807J6682J6749J5817J6342J9689K3812K5943K6407K7197K8024K7126
60954A464595K5234K5082K7068K8865K9546L0620L2529L3536L2997L2697L3940
$$ plain form
61046 997498 987821 979494 974014 970499 967297 963819 960328 957514 956901 960113 966981 975643 984969 995346
61032 995346 1006683 1017470 1026654 1034687 1041641 1045813 1045314 1039839 1030002 1016419 1000610 985420 973067
61019 973067 963469 955279 947504 939369 930115 920282 912202 907859 906815 907059 907051 906239 904728 903626 904895
61004 904895 909689 917200 925670 933807 940790 946077 950046 953903 958207 962343 966021 970211 975879 982841
60990 982841 990473 998418 1006012 1012435 1018221 1025209 1034016 1042829 1049766 1055181 1060611 1066762 1073734 1081984
60976 1081984 1091721 1102271 1113285 1125643 1139937 1154924 1168689 1180841 1192668 1205726 1220807
60965 1220807 1237489 1254238 1270055 1286397 1306086 1329898 1355841 1382248 1409445 1437469 1464595
60954 1464595 1489829 1514911 1541979 1570844 1600390 1631010 1663539 1697075 1730072 1762769 1796709
60943A796709L5970L8035M0501M3188M5135M6667M9372N3575N8141O2883O8646
60932B338822P4966Q0442Q5457R1662R8920J05824J13035J22517J33553J43386
60922C388584J52003J62218J74754J87478K00085K14850K31821K47981K62712
60913E222486K79469L00224L22376L42843L61137L77111L90390M03774M22555
60904H422365M48533M79135N13659N54798O02263O51078O98888P49399Q07049
60895A3927167Q75646R64253J084697J238676J416847J616238J847971K121640
60887B5093135K436392K798337L230116L745260M330167M974754N687755O405736
60879E8701652O868538O677162N596943L839049J989022O09992q5232j98827R8310
$$ plain form
60943 1796709 1832679 1870714 1911215 1954403 1999538 2046205 2095577 2149152 2207293 2270176 2338822
60932 2338822 2413788 2494230 2579687 2671349 2770269 2876093 2989128 3111645 3245198 3388584
60922 3388584 3540587 3702805 3877559 4065037 4265122 4479972 4711793 4959774 5222486
60913 5222486 5501955 5802179 6124555 6467398 6828535 7205646 7596036 7999810 8422365
60904 8422365 8870898 9350033 9863692 10418490 11020753 11671831 12370719 13120118 13927167
60895 13927167 14802813 15767066 16851763 18090439 19507286 21123524 22971495 25093135
60887 25093135 27529527 30327864 33557980 37303240 41633407 46608161 52295916 58701652
60879 58701652 65570190 72247352 77844295 81683344 83672366 84282358 84197126 83998299 84096609
60870H4096609O59261J223628J347882O36745r12477k843823m553184n665879
60862G3988762o150545o169671n901814n481053n006208m539639m101141l687392
60854C2951299l297656k935204k597215k279312j986652j730111j513776j333347
60846A5278026j183463j059232r53342q59072p75274p03226o40350n82185n28496
60837G993386m81897m41562m03813l68491l39570l18931l03539k89353k74628
60828D771602k58946k42212k25441k10156j96356j82828j69423j57180j46393
60819B982667j36445j27330j19387j11871j03802r6018r0236q6141q1614p6059
60809A953764p1344o8738o6832o3626n9276n5517n3151n1241m8610m5200m1844
$$ plain form
60870 84096609 84755870 85979498 87327380 87964125 87051648 84207825 79654641 73988762
60862 73988762 67838217 61668546 55766732 50285679 45279471 40739832 36638691 32951299
60854 32951299 29653643 26718439 24121224 21841912 19855260 18125149 16611373 15278026
60846 15278026 14094563 13035331 12081989 11222917 10447643 9744417 9104067 8521882 7993386
60837 7993386 7511489 7069927 6666114 6297623 5958053 5639122 5335583 5046230 4771602
60828 4771602 4512656 4270444 4045003 3834847 3638491 3455663 3286240 3129060 2982667
60819 2982667 2846222 2718892 2599505 2487634 2383832 2287814 2197578 2111437 2029823 1953764
60809 1953764 1882420 1813682 1746850 1683224 1623948 1568431 1515280 1464039 1415429 1370229 1328385
60798A328385l9119l6907l4975l3412l2070l0108k6926k3277k0523j8868j7409
60787A014791j5757j4285j2770j0376p381n264m450l639k230j675l153n361o318
60774I22132o171o459p348p585o916o635p421p973o589l311Q0J935K178J929K105
60759H63951K803M018O078Q720J0550J0590R850J0046J1130J1704J1613J2105
60747I73158J3226J3262J1443R103P193M736J165j746k159j068r51k596m955p203
60733A012608r107j0027r546q782r302j0872j1813j1468j0840j0773j0955j0954
60721H88169j0927j0934j0554r550q247p077o215n655n078l883k034n40k59n33
60707H06683M5J703L290L995M107M070L897L917M983P191R081R070P393N832N559
$$ plain form
60798 1328385 1289266 1252359 1217384 1183972 1151902 1121794 1094868 1071591 1051068 1032200 1014791
60787 1014791 999034 984749 971979 961603 954222 948958 944508 940869 938639 936964 933811 928450 922132
60774 922132 915961 909502 902154 894569 887653 881018 873597 865624 859035 855724 855804 857739 859917 861846 863951
60759 863951 866754 870772 876850 885570 896120 906710 916560 926606 937736 949440 961053 973158
60747 973158 986384 999646 1011089 1020192 1027385 1032121 1033286 1031540 1029381 1028313 1027362 1024766 1019811 1012608
60733 1012608 1003501 993474 983928 975146 965844 954972 943159 931691 920851 910078 899123 888169
60721 888169 877242 866308 855754 846204 837957 830880 824665 819010 813932 810049 808015 807475 807216 806683
60707 806683 806728 808431 811721 815716 819823 823893 827790 831707 836690 843881 852962 862032 869425 875257 880816
60692H80816N999O073N885O357P435P654N982L360J684J603K133K077P75k277
60678I35556p159j2527j6154j7114j6592j6087j5793j5380j5251j5859j6573j6369
60666G54698j5311j4195j3081j1339r132p744q040r316j0070r512q050o624n831
60653F26453n529n180m525l926l938m676n660o249o157n605m936m147l050j929
60639E60946j543k048k476j896p48j46k25q5O56J368J496J180P01L26P58K577
60623E60841M909O039N759N804P175Q398P629N466M236N023O722P874Q236Q457
60609F52568R063J0063J1085J1674J1732J1588J1613J1935J2521J3218J3649J3608
60597G94317J3554J4090J4899J5036J4362J3692J3283J2326J0481Q807Q135P542
$$ plain form
60692 880816 886815 892888 898773 905130 912565 920219 926201 929561 931245 932848 934981 937058 937833 935556
60678 935556 928397 915870 899716 882602 866010 849923 834130 818750 803499 787640 771067 754698
60666 754698 739387 725192 712111 700772 691640 683896 675856 666540 656470 646958 638908 632284 626453
60653 626453 620924 615744 611219 607293 603355 598679 593019 586770 580613 575008 570072 565925 562875 560946
60639 560946 559403 557355 554879 552983 552235 552089 551864 551779 552435 553803 555299 556479 557180 557506 558264 560841
60623 560841 565750 571789 577548 583352 590527 598925 606554 612020 616256 621279 628001 635875 644111 652568
60609 652568 661631 671694 682779 694453 706185 717773 729386 741321 753842 767060 780709 794317
60597 794317 807871 821961 836860 851896 866258 879950 893233 905559 916040 924847 932982 940524
60585I40524N541K261o74k283l177m515o624q802j0149j0526j0674j1019j0734
60572H69149q838o177m923n696o628o065m769m270m274l442j814p08n49m99j27
60557H10370J70M91J612L445M678M581M181M891O664Q254Q837Q803R073J0010
60543H86060J1101J1608J1620J2167J3982J6337J7661J7294J6147J5527J5752
60532A045256J6165J6159J5735J5033J3723J1258P832M453J736j063n134j0457
60520A130696j5800k0183k3364k4921k4145k1504j9099j8677j9689k0098j8691
60509I04525j5922j2904j0351q409o878n616m880n012n709o082n688m887l972
60496H08215k781j453p03o44k11J527M013N912O562O230N571N532O917R260J0875
$$ plain form
60585 940524 946065 948326 947652 945369 942192 937677 931053 922251 912102 901576 890902 879883 869149
60572 869149 860311 854134 849211 843515 836887 830822 826053 821783 817509 814067 812253 811545 810996 810497 810370
60557 810370 810540 811031 812643 816088 820766 825347 829528 834419 841083 849337 858174 866977 876050 886060
60543 886060 897161 908769 920389 932556 946538 962875 980536 997830 1013977 1029504 1045256
60532 1045256 1061421 1077580 1093315 1108348 1122071 1133329 1141161 1145614 1147350 1146287 1141153 1130696
60520 1130696 1114896 1094713 1071349 1046428 1022283 1000779 981680 963003 943314 923216 904525
60509 904525 888603 875699 865348 856939 850061 844445 839565 834553 828844 822762 817074 812187 808215
60496 808215 805434 803981 803278 802634 802423 803950 807963 813875 820437 826667 832238 837770 844687 853947 864822
60481H64822J0906J0537J1139J2139J2154J1546J2106J4394J7005J8748K0007
60470A015503K1517K2960K3610K3698K4354K6466K9896L3787L7511M1404M6339
60459A347045N2520N9147O5635P2563Q0824R0414J00731J11515J22508J32556
60449B235458J40149J44667J46160J43923J36554J23693J06727Q7420O6526M4215
60439C375492K1223j080k1544l9729n5648o9194p9823q6638q8823q6205p9724
60428B788307p1257o2480n3369m2426k9006j4823k020R685K2331L6347M9845O1584
60416B692718P2269Q1835Q7625Q7218Q1484P2910O2366M9843L7250K7652K1937
60405C375107J8606J6889J7803K1917K8282L6211M6208N8626P3071Q9748J09642
$$ plain form
60481 864822 875728 886265 897404 909543 921697 933243 945349 959743 976748 995496 1015503
60470 1015503 1037020 1059980 1083590 1107288 1131642 1158108 1188004 1221791 1259302 1300706 1347045
60459 1347045 1399565 1458712 1524347 1596910 1677734 1768148 1868879 1980394 2102902 2235458
60449 2235458 2375607 2520274 2666434 2810357 2946911 3070604 3177331 3264751 3331277 3375492
60439 3375492 3396715 3395635 3374091 3334362 3278714 3209520 3129697 3043059 2954236 2868031 2788307
60428 2788307 2717050 2654570 2601201 2558775 2529769 2514946 2512926 2522611 2544942 2581289 2631134 2692718
60416 2692718 2764987 2846822 2934447 3021665 3103149 3176059 3238425 3288268 3325518 3353170 3375107
60405 3375107 3393713 3410602 3428405 3450322 3478604 3514815 3561023 3619649 3692720 3782468 3892110
60394C892110J32601J56980J82193K10194K43144K80771L21259L63995M10129
60385F193376M60771N15511N72395O28462O80088P22674P49720P52650P22956
60376A1998603O55486N49902M09815K42136N7525j30162l06439m58752n78003
60367A2440111o60119p07380p26774p25495p08073o77711o38516n94818n49238
60358F451987n02953m57394m14358l74596l37660l03225k71650k43217k17714
60349C329220j94953j75001j57762j42776j29580j17745j06682r6043q6411p9004
60339B043263p4227p0921o7367o2880n8135n4047n0712m7483m3834l9888l6230
60328A437539l3458l1800l0857k9828k8349k6997k6389k5852k3992k0845j8285
$$ plain form
60394 3892110 4024711 4181691 4363884 4574078 4817222 5097993 5419252 5783247 6193376
60385 6193376 6654147 7169658 7742053 8370515 9050603 9773277 10522997 11275647 11998603
60376 11998603 12654089 13203991 13613806 13855942 13913467 13783305 13476866 13018114 12440111
60367 12440111 11779992 11072612 10345838 9620343 8912270 8234559 7596043 7001225 6451987
60358 6451987 5949034 5491640 5077282 4702686 4365026 4061801 3790151 3546934 3329220
60349 3329220 3134267 2959266 2801504 2658728 2529148 2411403 2304721 2208678 2122267 2043263
60339 2043263 1969036 1898115 1830748 1767868 1709733 1655686 1604974 1557491 1513657 1473769 1437539
60328 1437539 1404081 1372281 1341424 1311596 1283247 1256250 1229861 1204009 1180017 1159172 1140887
60317A140887j7622j7918j7772j7638j8785k0627k1080j9558j7652j6533j5521
60306I40181j3892j2307j1396j0331q233o019n381o426p562p496o427n363n052
60293H34296n469n790n098l568k538k974m286n227n431n373n372n385n530n925
60279G66330o226n915m916l449j700j52L99jM7J499L123K975J448J092L089N639
60263G63282O605O306O358O972P052O448O416P760R846J1702J2949J3337J2531
60250H77564J0926R610Q804P302M421J560N07P98L69j316k474j630M95K424L834
60235I23194N000N379M208K003K55l23l59q10k132m175o150o950o308n469n860
60220I01503p338q452q252o918m914k626p80j3J73R45K289K708J318o77j251K75
$$ plain form
60317 1140887 1123265 1105347 1087575 1069937 1051152 1030525 1009445 989887 972235 955702 940181
60306 940181 926289 913982 902586 892255 884022 878003 872622 866196 858634 851138 844711 839348 834296
60293 834296 828827 823037 817939 814371 811833 808859 804573 799346 793915 788542 783170 777785 772255 766330
60279 766330 760104 754189 749273 745824 744124 743972 744371 744370 744417 745916 749039 752014 753462 754554 757643 763282
60263 763282 769887 776193 782551 789523 796575 803023 809439 817199 827045 838747 851696 865033 877564
60250 877564 888490 898100 906904 914206 918627 920187 920694 921492 921861 920545 918071 916441 916936 919360 923194
60235 923194 928194 933573 937781 939784 940039 939716 939357 938547 936415 932240 926090 919140 912832 907363 901503
60220 901503 894165 885713 877461 870543 865629 863003 862223 862210 862383 863328 865617 868325 869643 868966 867715 867990
60204H67990K877N097O254O781P746R663J1617J2173J1262J0417J0827J2020J3020
60191I87744J3964J5761J8697K2161K5545K8667L1584L4496L7695M1027M3748
60180A301089M5518M7325N0645N5636O0721O4190O5753O6314O6541O6128O4479
60169A954339O1820N9200N7161N4649M9697M1541L1848K3486J8008J4388J0380
60158B376517N098r8l390m797n940p593q575p530m785j533J972O122J0387J3695
60144B369550J6386K0237K6111L2805L8680M3335M7172N0515N3864N7849O2077
60133B818581O4980O5658O4887O3316N9731N2669M3069L3622K5618J7877Q886
60122C318894j314j1569k0558k6903k9700k9809k9657l0737l1890l0961k7584
$$ plain form
60204 867990 870867 875964 882218 888999 896745 906408 918025 930198 941460 951877 962704 974724 987744
60191 987744 1001708 1017469 1036166 1058327 1083872 1112539 1144123 1178619 1216314 1257341 1301089
60180 1301089 1346607 1393932 1444577 1500213 1560934 1625124 1690877 1757191 1823732 1889860 1954339
60169 1954339 2016159 2075359 2132520 2187169 2236866 2278407 2310255 2333741 2351749 2366137 2376517
60158 2376517 2381615 2381517 2378127 2373330 2367390 2359797 2351222 2343692 2338907 2337374 2339346 2345468 2355855 2369550
60144 2369550 2385936 2406173 2432284 2465089 2503769 2547104 2594276 2644791 2698655 2756504 2818581
60133 2818581 2883561 2949219 3014106 3077422 3137153 3189822 3232891 3266513 3292131 3310008 3318894
60122 3318894 3317580 3306011 3285453 3258550 3228850 3199041 3169384 3138647 3106757 3075796 3048212
60111C048212k3111j8067j1226j738R077J9019K7500L5559M3774N1557N8679O6040
60099C305275P3937Q0783Q4915Q7067Q9322R1765R1946Q8221Q1799P4306O4732
60088D214068N0750L2524J3318l899j8778l1921m2422m8470m9667m7304m2455
60077D025744l5081k5280j4231k968R032K2948L8519N3926O7922Q1225R5346J10639
60065D427741J25989J39919J51585J61037J69060J76318J82147J84512J81824
60056E900132J74443J63895J50950J35286J16833R6330P4447N1203K6636J409
60046F891564k3706m8455p2814r6284j17732j35698j48959j57201j61209j61985
60036E767521j59668j53750j44340j32613j19822j06416r2456p8221o3913m9152
$$ plain form
60111 3048212 3025101 3007034 2995808 2994070 3003147 3022166 3049666 3085225 3128999 3180556 3239235 3305275
60099 3305275 3379212 3459995 3544910 3631977 3721299 3813064 3905010 3993231 4075030 4149336 4214068
60088 4214068 4264818 4297342 4310660 4306761 4287983 4256062 4213640 4165170 4115503 4068199 4025744
60077 4025744 3990663 3965383 3951152 3948184 3957216 3980164 4018683 4072609 4140531 4221756 4317102 4427741
60065 4427741 4553730 4693649 4845234 5006271 5175331 5351649 5533796 5718308 5900132
60056 5900132 6074575 6238470 6389420 6524706 6641539 6737869 6812316 6863519 6890155 6891564
60046 6891564 6867858 6819403 6746589 6650305 6532573 6396875 6247916 6090715 5929506 5767521
60036 5767521 5607853 5454103 5309763 5177150 5057328 4950912 4858456 4780235 4716322 4667170
60026D667170l3481j7402k461R923J9480K6763L2048L4992L5435L3914L0776K5408
60014D862565J7378Q030l76p343j4448k2448k9700l4585l7950m1504m4970m6833
60002D607816m7118m7168m6883m4475l9128l1928k3802j4551m382N575J5086K5357
59990D354399L6887M8414N8904O8828P8238Q5197Q7745Q6220Q2120P5796O6861
59979E129609N6057M4893L3904K2672J1233Q9j0825k1945l3103m3936n4920o6726
59967E067002p8647q8902r6547j02175j06636j09966j11638j11275j09005j05544
59957D046667j01622r6889r0028q0613p0236o0780n2102m2584l1549k0003r154
59946C391107O17R390J7552K6023L5557M5674N5200O3795P1835P8706Q2523Q2146
$$ plain form
60026 4667170 4633689 4616287 4613826 4623749 4643229 4669992 4702040 4737032 4772467 4806381 4837157 4862565
60014 4862565 4879943 4887973 4887597 4880254 4865806 4843358 4813658 4779073 4741123 4699619 4654649 4607816
60002 4607816 4560698 4513530 4466647 4422172 4383044 4351116 4327314 4312763 4308381 4313956 4329042 4354399
59990 4354399 4391286 4439700 4498604 4567432 4645670 4730867 4818612 4904832 4986952 5062748 5129609
59979 5129609 5185666 5230559 5264463 5287135 5298368 5298457 5287632 5265687 5232584 5188648 5133728 5067002
59967 5067002 4988355 4899453 4802906 4700731 4594095 4484129 4372491 4261216 4152211 4046667
59957 4046667 3945045 3848156 3758128 3677515 3607279 3546499 3494397 3451813 3420264 3400261 3391107
59946 3391107 3391724 3401114 3418666 3444689 3480246 3525920 3581120 3644915 3716750 3795456 3877979 3960125
59934C960125P8596P3854O8830O2869N4708M3681L0486J6946M556o891j8652l1175
59922D337933m3558n4786o4372p1604p5327p5216p2364o7978o2178n4793m6477
59911C649280l7975k8803j7943n842N402J4181K0927K7095L3400L9587M5472N1254
59899C796035N6744O1037O3280O3504O2361O0296N7317N3424M8902M4094L9071
59888D406065L3662K7852K2154J7559J4734J3318J2522J2825J6234K4084L4958
59877D635967M6027N6410O7933Q2237R8485J14762J30636J46989J63738J79073
59867E722257J90972J98362K00551J96536J85573J67924J44423J15442Q0905M1480
59857G244425n78m2030q0020j12810j39561j60049j74695j84224j88837j88164
$$ plain form
59934 3960125 4038721 4112575 4181405 4244274 4298982 4342663 4373149 4390095 4394651 4387760 4369108 4337933
59922 4337933 4294375 4239589 4175217 4103613 4028286 3953070 3880706 3812728 3750550 3695757 3649280
59911 3649280 3611305 3582502 3564559 3558717 3564119 3578300 3599227 3626322 3659722 3699309 3744781 3796035
59899 3796035 3852779 3913816 3977096 4040600 4102961 4163257 4220574 4273998 4322900 4366994 4406065
59888 4406065 4439727 4467579 4489733 4507292 4522026 4535344 4547866 4560691 4576925 4601009 4635967
59877 4635967 4681994 4738404 4806337 4888574 4987059 5101821 5232457 5379446 5543184 5722257
59867 5722257 5913229 6111591 6312142 6508678 6694251 6862175 7006598 7122040 7202945 7244425
59857 7244425 7243847 7201817 7121797 7008987 6869426 6709377 6534682 6350458 6161621 5973457
59847E973457j82490j73529j63095j51395j37535j21527j04803q8553p2641n6519
59837D721370m0293k4480r373M907J8261L0836M2755N3446O1932O7897P1425P1553
59825E070236O6441N5798M1845K6785J0267r304l1665n4333p4996r2875j07768
59814D900431j19143j26719j31075j33103j33297j31870j29271j26203j23119
59805C746631j19947j16338j12238j07947j03427r7837r0368q1344p1896o2624
59795B782665n3380m4224l5670k7875k0577j4011q828m989j857N30J662K282M192
59782B579920P719J1157J3551J6160J9849K2990K3763K2978K2472K1888J9317
59771B781764J4262P740N4r075j8433k5796l0672l4557l8308m1210m2820m3774
$$ plain form
59847 5973457 5790967 5617438 5454343 5302948 5165413 5043886 4939083 4850530 4777889 4721370
59837 4721370 4681077 4656597 4647224 4652131 4670392 4701228 4743983 4797429 4859361 4927258 4998683 5070236
59825 5070236 5136677 5192475 5234320 5261105 5271372 5262068 5230403 5176070 5101074 5008199 4900431
59814 4900431 4781288 4654569 4523494 4390391 4257094 4125224 3995953 3869750 3746631
59805 3746631 3626684 3510346 3398108 3290161 3186734 3088897 2998529 2917185 2845289 2782665
59795 2782665 2729285 2685061 2649391 2621516 2600939 2586928 2578100 2573111 2571254 2571784 2573446 2575728 2579920
59782 2579920 2587639 2598796 2612347 2628507 2648356 2671346 2695109 2718087 2740559 2762447 2781764
59771 2781764 2796026 2803766 2803820 2794745 2776312 2750516 2719844 2685287 2646979 2605769 2562949 2519175
59759B519175m4331m4024m3249m3235m3644m2039l6895k9826k3676j9342j5455
59748B133459j0511m449J527O270J0096J4696K0994K7562L2336L5368L8171M0725
59736B346244M1404M0195L9459M0626M2303M2991M3256M3404M1154L4445K5467
59725B780948J9168J7977K0299K4046K9177L6121M3739N0066N4093N6186N7701
59714C189521O0611O6467P5080Q4971R5579J08049J23150J39308J53665J64278
59704D260679J70004J68573J56491J31678R5644N2795Q180l3866o9827r7248j15299
59693D727804j24750j27218j24463j18128j09549r9460q8028p5318o1781m8348
59683C750761l6080k5295j5016l737Q820K1210L2116M2011N2154O2479P1993Q1043
$$ plain form
59759 2519175 2474844 2430820 2387571 2344336 2300692 2258653 2221758 2191932 2168256 2148914 2133459
59748 2133459 2122948 2118499 2120026 2126296 2136392 2151088 2172082 2199644 2231980 2267348 2305519 2346244
59736 2346244 2387648 2427843 2467302 2507928 2550231 2593222 2636478 2679882 2721036 2755481 2780948
59725 2780948 2800116 2818093 2838392 2862438 2891615 2927736 2971475 3021541 3075634 3131820 3189521
59714 3189521 3250132 3316599 3391679 3476650 3572229 3680278 3803428 3942736 4096401 4260679
59704 4260679 4430683 4599256 4755747 4887425 4983069 5035864 5044044 5010178 4940351 4843103 4727804
59693 4727804 4603054 4475836 4351373 4233245 4123696 4024236 3936208 3860890 3799109 3750761
59683 3750761 3714681 3689386 3674370 3670633 3679453 3700663 3732779 3774790 3826944 3889423 3961416 4042459
59671D042459R1416J03650J15944J26685J36799J48505J62705J78721J95754K13354
59661E515992K31156K49369K68993K90374L12184L32833L52148L70188L85277
59652H308514L95079L99347L99689L96657L89083L76817L62242L48197L35708
59643A1711333L24618L15256L08444L04529L03144L03107L02055K96988K85936
59634A4455410K68728K45762K17067J83098J45520J06200O6052K5943j1832m4065
59624A5657883o8728q5831r6244j00412r8226q9512p4295n2923k6182M919L9460
59613A5009909P6596J15271J54412J93703K33777K74956L15634L52335L81690
59604A7108283M01828M11342M07493L86669L46694K87722K10976J18153J2977
$$ plain form
59671 4042459 4133875 4237525 4353469 4480154 4616953 4765458 4928163 5106884 5302638 5515992
59661 5515992 5747148 5996517 6265510 6555884 6868068 7200901 7553049 7923237 8308514
59652 8308514 8703593 9102940 9502629 9899286 10288369 10665186 11027428 11375625 11711333
59643 11711333 12035951 12351207 12659651 12964180 13267324 13570431 13872486 14169474 14455410
59634 14455410 14724138 14969900 15186967 15370065 15515585 15621785 15687837 15713780 15701948 15657883
59624 15657883 15589155 15503324 15407080 15306668 15208442 15118930 15044635 14991712 14965530 14970449 15009909
59613 15009909 15086505 15201776 15356188 15549891 15783668 16058624 16374258 16726593 17108283
59604 17108283 17510111 17921453 18328946 18715615 19062309 19350031 19561007 19679160 19692137
59595A9692137r7861k06762l07913l97378m71514n27073n63035n81315n85316
59586A5953970n78095n61554n36732n05069m69959m36553m09224l89708l78442
59577A1688634l76666l85287m01855m20460m35394m43876m45215m39019m25425
59568G915437m06102l83652l59974l35579l10376k84707k59708k36738k16407
59559E122194j98220j81334j65378j50218j35541j21357j08642r8465r0510q3174
59549C789355p5315o7312o0264n4832n1088m9054m8844n0192n1999n2736n1898
59538C175821n0867n1524n3891n5997n6323n5245n3745n2015n0179m8899m8101
59527B599035m6204m2129l7143l3300l0827k8470k5512k1907j7266j1683o894
$$ plain form
59595 19692137 19594276 19387514 19079601 18682223 18210709 17683636 17120601 16539286 15953970
59586 15953970 15375875 14814321 14277589 13772520 13302561 12866008 12456784 12067076 11688634
59577 11688634 11311968 10926681 10524826 10104366 9668972 9225096 8779881 8340862 7915437
59568 7915437 7509335 7125683 6765709 6430130 6119754 5835047 5575339 5338601 5122194
59559 5122194 4923974 4742640 4577262 4427044 4291503 4170146 4061504 3963039 3872529 3789355
59549 3789355 3714040 3646728 3586464 3531632 3480544 3431490 3382646 3332454 3280455 3227719 3175821
59538 3175821 3124954 3073430 3019539 2963542 2907219 2851974 2798229 2746214 2696035 2647136 2599035
59527 2599035 2552831 2510702 2473559 2440259 2409432 2380962 2355450 2333543 2316277 2304594 2297700
59516B297700m517l465j062L390Q149J1997J5479J8954K1437K2260K2407K3401
59504B436130K5769K8967L2040L4387L6583M0041M4906M9119N0897N1411N3231
59493B883481N7017O1705O7156P4029Q1404Q7405R2300R8330J06121J13825J20312
59482C843085J26659J33703J40486J45931J49809J51435J49777J45599J41111
59473E127595J36636J30220J21357J12134J03165R1281P3597N1673K9649J0168
59463E987475n874j7694k5380l0851l5545l8042l6054k9950k2191j3904l972Q798
59451E736816K4135M0693N6822P1212Q3486R3587J00173J00661R3499P9285N9178
59440F539547L3828M547k6339n7457q9010j20281j48389j70877j87777j99625
$$ plain form
59516 2297700 2293183 2289718 2288656 2292046 2300195 2312192 2327671 2346625 2368062 2390322 2412729 2436130
59504 2436130 2461899 2490866 2522906 2557293 2593876 2633917 2678823 2727942 2778839 2830250 2883481
59493 2883481 2940498 3002203 3069359 3143388 3224792 3312197 3404497 3502827 3608948 3722773 3843085
59482 3843085 3969744 4103447 4243933 4389864 4539673 4691108 4840885 4986484 5127595
59473 5127595 5264231 5394451 5515808 5627942 5731107 5822388 5895985 5947658 5977307 5987475
59463 5987475 5981601 5963907 5938527 5907676 5872131 5834089 5798035 5768085 5745894 5731990 5728018 5736816
59451 5736816 5760951 5801644 5858466 5929678 6013164 6106751 6206924 6307585 6401084 6480369 6539547
59440 6539547 6573375 6577922 6551583 6494126 6405116 6284835 6136446 5965569 5777792 5578167
59430E578167k05499k04892j99783j92662j83807j72522j59576j46268j32362
59421C980796j17266j02242q9050p7177o4633n0933l7372k4898j3636l814M715
59410C404490J3392K3628L5166M7143N9656P2483Q3522R0853R5587J00334J05406
59399D131660J08792J09268J07088J01836R2152P7798O0010L9703J7093o969l0989
59388D807442n4083p5532r3595j06807j16243j24397j31700j36225j36903j34965
59378C696992j31878j27728j22212j15538j07954r9752r2002q5726q0080p2887
59368B661235o3528n3902m6178m0678l6274l1739k6416k0463j4694r574m642L39
59356B313486M496P183R436J2647J6559K0230K4178K9520L5603M0791M5206N0131
$$ plain form
59430 5578167 5372668 5167776 4967993 4775331 4591524 4419002 4259426 4113158 3980796
59421 3980796 3863530 3761288 3672238 3595061 3530428 3479495 3442123 3417225 3403589 3399775 3404490
59410 3404490 3417882 3441510 3476676 3523819 3583475 3655958 3739480 3830333 3925920 4026254 4131660
59399 4131660 4240452 4349720 4456808 4558644 4650796 4728594 4788604 4828307 4845400 4838431 4807442
59388 4807442 4753359 4677827 4584232 4477425 4361182 4236785 4105085 3968860 3831957 3696992
59378 3696992 3565114 3437386 3315174 3199636 3091682 2991930 2899928 2814202 2734122 2661235
59368 2661235 2597707 2543805 2497627 2456949 2420675 2388936 2362520 2342057 2327363 2317789 2313147 2313486
59356 2313486 2317982 2325165 2334601 2347248 2363807 2384037 2408215 2437735 2473338 2514129 2559335 2609466
59344B609466N4558N5103N0259M2704L6560L4009L5282L9938M6986N5062O3567
59333C123494P2622Q1346Q7379Q8995Q6852Q3334Q1050Q2143Q7545R6093J05319
59322D076172J13743J21789J30490J40275J51207J63163J75468J87386J99287
59313E458980K12258K26421K40747K54862K69816K86604L04861L23531L41885
59304G919965L59362L74954L86970L93144L91454L81844L66910L49784L31409
59295A1255796L10769K87385K62285K36749K11463J86914J63149J39137J13343
59286A3166990Q4995N3804J9053j9537o0500j01852j43262j85070k25524k61316
59276A2327781k91019l15686l35552l48690l53945l53123l48772l41456l30576
$$ plain form
59344 2609466 2664024 2719127 2769386 2812090 2848650 2882659 2917941 2957879 3004865 3059927 3123494
59333 3123494 3196116 3277462 3364841 3453836 3540688 3624022 3705072 3787215 3874760 3970853 4076172
59322 4076172 4189915 4311704 4442194 4582469 4733676 4896839 5072307 5259693 5458980
59313 5458980 5671238 5897659 6138406 6393268 6663084 6949688 7254549 7578080 7919965
59304 7919965 8279327 8654281 9041251 9434395 9825849 10207693 10574603 10924387 11255796
59295 11255796 11566565 11853950 12116235 12352984 12564447 12751361 12914510 13053647 13166990
59286 13166990 13251985 13305789 13324842 13305305 13244805 13142953 12999691 12814621 12589097 12327781
59276 12327781 12036762 11721076 11385524 11036834 10682889 10329766 9980994 9639538 9308962
59267I308962l16571l00777k83965k66340k48386k30759k13685j97103j80969
59258G070407j65177j49741j35189j22070j09981r8055q6317p5477o5487n5724
59248F007189m6649l9647l4856l0838k6978k4485k4284k5459k6876k8939l2454
59237E665724l6881m1090m5186n0195n6350o2580o7630p0990p2960p4301p5584
59226E011977p6555p6366p4522p1148o6410o0375n3483m6448l9453l2074k4135
59215D391008j6087q421j244N556J2163J8597K4220K7824K8811K7742K5121K0501
59203D555791J3665N627k830j2593k4528l7129m7857n6199o3361o9392p2897p3537
59191D114760p2555p0689o7609o3442n8683n2486m3384l2122k1387j2205k923
$$ plain form
59267 9308962 8992391 8691614 8407649 8141309 7892923 7662164 7448479 7251376 7070407
59258 7070407 6905230 6755489 6620300 6498230 6388249 6290194 6203877 6128400 6062913 6007189
59248 6007189 5960540 5920893 5886037 5855199 5828221 5803736 5779452 5753993 5727117 5698178 5665724
59237 5665724 5628843 5587753 5542567 5492372 5436022 5373442 5305812 5234822 5161862 5087561 5011977
59226 5011977 4935422 4859056 4784534 4713386 4646976 4586601 4533118 4486670 4447217 4415143 4391008
59215 4391008 4374921 4366500 4365256 4370812 4382975 4401572 4425792 4453616 4482427 4510169 4535290 4555791
59203 4555791 4569456 4575083 4572253 4559660 4535132 4498003 4450146 4393947 4330586 4261194 4188297 4114760
59191 4114760 4042205 3971516 3903907 3840465 3781782 3729296 3685912 3653790 3632403 3620198 3617275
59180C617275P609J8366K8644L9697N2407O5096P4815P9141P6148O5201M9607
59169D174006L6287L0539L2091L7644M5581N6273O9236Q2574R5159J07521J20497
59158D887408J34110J47872J61499J75305J90057K06090K22640K38564K53308
59149F616853K66069K74501K76064K70613K59771K43653K20484J89927J54540
59140H772475J16835P7044L4907q069m9399q7057j19262j44552j63220j77006
59130H252696j86472j90614j89979j87726j85992j83457j78364j71837j66065
59121F612190j61042j55491j49395j43287j36406j28192j20409j15067j10933
59112E391968j04759r5610q5612p6634o8647o1268n4671m8492m1768l4575k8335
$$ plain form
59180 3617275 3624884 3643250 3671894 3711591 3763998 3829094 3903909 3983050 4059198 4124399 4174006
59169 4174006 4210293 4240832 4272923 4310567 4356148 4412421 4481657 4564231 4659390 4766911 4887408
59158 4887408 5021518 5169390 5330889 5506194 5696251 5902341 6124981 6363545 6616853
59149 6616853 6882922 7157423 7433487 7704100 7963871 8207524 8428008 8617935 8772475
59140 8772475 8889310 8966354 9001261 8993192 8943793 8856736 8737474 8592922 8429702 8252696
59130 8252696 8066224 7875610 7685631 7497905 7311913 7128456 6950092 6778255 6612190
59121 6612190 6451148 6295657 6146262 6002975 5866569 5738377 5617968 5502901 5391968
59112 5391968 5287209 5191599 5105987 5029353 4960706 4899438 4844767 4796275 4754507 4719932 4691597
59101D691597k4034k1198j8790j6028j2297p449k412J405L537M651N440O026O299
59088D616747O108N165L313P49k388o272j0953j6249k2435l0035l8402m5455m9823
59075D410070n2488n5333n8956o2759o6353o9454p1078p0242o7465o4361o1750
59064C709831n8938n5006n0065m4950l9997l4447k7452j9807j3943j1211r761
59053C344254o528j070M261Q018J1388J5631J9828K2436K3496K4049K4532K4945
59041C515240K5630K6776K8128K9921L3069L7646M2390M6370M9734N2103N1832
59030C938839M7899M0915L1152J7357j093k2366m3949o4730q3970r9912j11426
59019C648716j19623j25935j29679j29498j26156j21805j17217j11657j05021
$$ plain form
59101 4691597 4667563 4646365 4627575 4611547 4599250 4591801 4589389 4590794 4594331 4598982 4604422 4610448 4616747
59088 4616747 4622855 4628020 4631333 4632082 4629694 4623422 4612469 4596220 4573785 4543750 4505348 4459893 4410070
59075 4410070 4357582 4302249 4243293 4180534 4114181 4044727 3973649 3903407 3835942 3771581 3709831
59064 3709831 3650893 3595887 3545822 3500872 3460875 3426428 3398976 3379169 3365226 3354015 3344254
59053 3344254 3337726 3336656 3340917 3348935 3360323 3375954 3395782 3418218 3441714 3465763 3490295 3515240
59041 3515240 3540870 3567646 3595774 3625695 3658764 3696410 3738800 3785170 3834904 3887007 3938839
59030 3938839 3986738 4027653 4058805 4076162 4075069 4052703 4008754 3944024 3860054 3760142 3648716
59019 3648716 3529093 3403158 3273479 3143981 3017825 2896020 2778803 2667146 2562125
59010B562125r8288r2203q6830q1864p6335o8997o0384n3411n0255m9462m7772
58999A796324m3928l9111l4567l0701k7870k6118k4454k1906j8932j6466j4351
58988A497920j2156j0694j0864j1571j0656p713m390k054n52Q95K725M895O941
58975A442726Q632J1033J5688K1893K6399K7232K6303K6450K7352K6583K3677
58964A683968K0563J8493J6845J4936J2997J1280R738Q584P966P424O792P074
58952A826660R140J2165J4642J6184J7150J7490J7300J7375J7606J6029J1257
58941A992998M711j432p215j3719k0275k5333k9200l3074l6249l7191l6838l7740
58929A719443l9904m0478l7967l4023l0549k7573k4754k2545k0751j7900j3282
$$ plain form
59010 2562125 2463837 2371634 2284804 2202940 2126605 2057608 1997224 1943813 1893558 1844096 1796324
58999 1796324 1752396 1713285 1678718 1648017 1620147 1594029 1569575 1547669 1528737 1512271 1497920
58988 1497920 1485764 1475070 1464206 1452635 1441979 1434266 1429876 1427822 1427270 1428165 1430890 1435785 1442726
58975 1442726 1451358 1462391 1478079 1499972 1526371 1553603 1579906 1606356 1633708 1660291 1683968
58964 1683968 1704531 1723024 1739869 1754805 1767802 1779082 1788820 1797404 1805370 1812794 1819586 1826660
58952 1826660 1835800 1847965 1862607 1878791 1895941 1913431 1930731 1948106 1965712 1981741 1992998
58941 1992998 1997709 1996277 1989062 1975343 1955068 1929735 1900535 1867461 1831212 1794021 1757183 1719443
58929 1719443 1679539 1639061 1601094 1567071 1536522 1508949 1484195 1461650 1440899 1422999 1409717
58918A409717q299m761k952j891n97J353L713N809P575R986J3577J7102J8979
58905A469311J9556K0458K2122K3462K3690K2865K1014J8284J5619J3797J2039
58894A682217R325O689O409Q941J2439J5367J7941K0861K4124K7377L0356L2881
58882A894927L5130L7566L9808M0438L9074L7644L8193M0390M2805M5477M9308
58871B340760N3893N8125O2247O7213P2690P7763Q2929Q9161R5689J01120J06148
58860C207738J12556J19903J25894J30111J34766J41477J49540J57866J66677
58851D446528J76836J88870K02854K18082K33224K47973K63681K81017K98151
58842F557216L13101L26240L38168L46665L48702L44229L34646L18590K92960
$$ plain form
58918 1409717 1401418 1396657 1393705 1391814 1391217 1392570 1396283 1402092 1409667 1419653 1433230 1450332 1469311
58905 1469311 1488867 1509325 1531447 1554909 1578599 1601464 1622478 1640762 1656381 1670178 1682217
58894 1682217 1691542 1698231 1704640 1713581 1726020 1741387 1759328 1780189 1804313 1831690 1862046 1894927
58882 1894927 1930057 1967623 2007431 2047869 2086943 2124587 2162780 2203170 2245975 2291452 2340760
58871 2340760 2394653 2452778 2515025 2582238 2654928 2732691 2815620 2904781 3000470 3101590 3207738
58860 3207738 3320294 3440197 3566091 3696202 3830968 3972445 4121985 4279851 4446528
58851 4446528 4623364 4812234 5015088 5233170 5466394 5714367 5978048 6259065 6557216
58842 6557216 6870317 7196557 7534725 7881390 8230092 8574321 8908967 9227557 9520517
58833I520517K57544K14844J65717J09300M7532j4448p3320j29381j82248k28497
58823I687560k65189k92800l12935l25787l31422l31355l27289l19947l10104
58814F870732k98946k86757k73160k59133k46558k35360k23479k10191j97069
58805D640079j85041j73080j60615j48673j37794j27117j16533j07403j00315
58796C383508r4248q8684q4277q0833p6901p2011o7007o1727n5058m7768m2264
58785B612730l8762l4640k8617k2556j7979j3846r220n018j475L260R944J6391
58773B470212K0876K4947L0590L6846M1662M5260M9314N4270N9657O5783P3005
58762B972422Q0278Q6328R1554R7359J04206J11503J18686J25445J31608J37467
$$ plain form
58833 9520517 9778061 9992905 10158622 10267922 10315454 10301006 10227686 10098305 9916057 9687560
58823 9687560 9422371 9129571 8816636 8490849 8159427 7828072 7500783 7180836 6870732
58814 6870732 6571786 6285029 6011869 5752736 5506178 5270818 5047339 4837148 4640079
58805 4640079 4455038 4281958 4121343 3972670 3834876 3707759 3591226 3483823 3383508
58796 3383508 3289260 3200576 3116299 3035466 2958565 2886554 2819547 2757820 2702762 2654994 2612730
58785 2612730 2573968 2539328 2510711 2488155 2470176 2456330 2447110 2442092 2440617 2443877 2453821 2470212
58773 2470212 2491088 2516035 2546625 2583471 2625133 2670393 2719707 2773977 2833634 2899417 2972422
58762 2972422 3052700 3139028 3230582 3327941 3432147 3543650 3662336 3787781 3919389 4056856
58752D056856J43732J51024J59986J71453J85148J98922K11216K23618K38699
58743E740654K55896K72217K86679L00660L13911L23692L28431L28637L23408
58734H474185L09684K86317K55383K18105J72913J19334O0663Q37n8412j15592
58724I723417j67718k12758k51168k83141l06999l22083l30471l33847l31561
58715G183671l23709l13112l01967k89366k74574k59781k46891k34317k19978
58706D719976k05143j92358j81544j70971j60190j49364j37772j25663j15606
58697C281365j09036j03286r4972q4772p5880o9228o3218n6986n1002m5197l9175
58686B488613l3623k9326k5442k0610j4930r200l388K563P679J1225J3530J4227
$$ plain form
58752 4056856 4200588 4351612 4511598 4683051 4868199 5067121 5278337 5501955 5740654
58743 5740654 5996550 6268767 6555446 6856106 7170017 7493709 7822140 8150777 8474185
58734 8474185 8783869 9070186 9325569 9543674 9716587 9835921 9896584 9897421 9839009 9723417
58724 9723417 9555699 9342941 9091773 8808632 8501633 8179550 7849079 7515232 7183671
58715 7183671 6859962 6546850 6244883 5955517 5680943 5421162 5174271 4939954 4719976
58706 4719976 4514833 4322475 4140931 3969960 3809770 3660406 3522634 3396971 3281365
58697 3281365 3172329 3069043 2974071 2889299 2813419 2744191 2680973 2623987 2572985 2527788 2488613
58686 2488613 2454990 2425664 2400222 2379612 2364682 2355482 2352094 2354657 2362336 2373561 2387091 2401318
58674B401318J1563N286j874p569j2536j7867k1862k2416k0749j9901k0813k2470
58662B250110k4629k7895l2138l6990m2759m8927n3320n4866n5562n7573o0004
58651A755447o0819o0114n9021n7070n3287m8526m4087l9515l4230k9697k7292
58640A241789k5534k2335j8503j6103j4657j2280r421q161q443q212p001o484
58628A084655p475q942r959j0515j0499r774q970q490p322m531j205P64J067P54
58614I99558O32J376L782P191R158Q541P531Q552J0711J1453J0288Q579O929N055
58600A099336L192J478q81m026o457p433q590j1155j3531j4041j4018j5418j7210
58587I91246j7210j5840j4979j4371j2381r296o807n054k936n65J168K741N176
$$ plain form
58674 2401318 2412881 2418167 2416293 2408724 2396188 2378321 2356459 2334043 2313294 2293393 2272580 2250110
58662 2250110 2225481 2197586 2165448 2128458 2085699 2036772 1983452 1928586 1873024 1815451 1755447
58651 1755447 1694628 1634514 1575493 1518423 1465136 1416610 1372523 1333008 1298778 1269081 1241789
58640 1241789 1216255 1193920 1175417 1159314 1144657 1132377 1122956 1114795 1106352 1098140 1091139 1084655
58628 1084655 1077180 1068238 1058279 1047764 1037265 1027491 1018521 1010031 1002709 998178 996973 997737 998804 999558
58614 999558 1000190 1001566 1005348 1012539 1021697 1030238 1037769 1046321 1057032 1068485 1078773 1087352 1094281 1099336
58600 1099336 1102528 1104006 1103125 1099099 1092642 1085209 1076619 1065464 1051933 1037892 1023874 1008456 991246
58587 991246 974036 958196 943217 928846 916465 907169 900362 895308 892372 891807 892975 895716 900892
58574I00892P915R730J0737J1525J1604J0851J0950J2992J5375J6428J7291J9535
58562A055825K1979K2876K3365K5508K8743L1512L4608L9271M3745M5702M6762
58551A419896N0584N7391O4170O9429P3933P7710Q0348Q3706R0149R8198J03583
58540B269097J04666J03372J00875R5861Q7338P5932O1935M4784K4927M195j5753
58529B957229l3623m8001n8540o6470p2192p4084p1857o8745o7295o5388o0017
58518B271017n2795m7441m3739l8686l2284k7314k4019j9907j4654j0679q712
58507A950787o915m555k614o86K930P807J1606J3640J4716J3594P598l035j4973
58494A989900k6255l7543m8768n7901o3618o6361o6638o4787o2146n9893n7263
$$ plain form
58574 900892 908807 918537 929274 940799 952403 963254 974204 987196 1002571 1018999 1036290 1055825
58562 1055825 1077804 1100680 1124045 1149553 1178296 1209808 1244416 1283687 1327432 1373134 1419896
58551 1419896 1470480 1527871 1592041 1661470 1735403 1813113 1893461 1977167 2067316 2165514 2269097
58540 2269097 2373763 2477135 2578010 2673871 2761209 2837141 2899076 2943860 2968787 2972982 2957229
58529 2957229 2923606 2875605 2817065 2750595 2678403 2604319 2532462 2463717 2396422 2331034 2271017
58518 2271017 2218222 2170781 2127042 2088356 2056072 2028758 2004739 1984832 1970178 1959499 1950787
58507 1950787 1943872 1939317 1936703 1936017 1938947 1946754 1958360 1972000 1986716 2000310 2007908 2004873 1989900
58494 1989900 1963645 1926102 1877334 1819433 1755815 1689454 1622816 1558029 1495883 1435990 1378727
58483A378727n3378m9626m7385m5047m0647l5832l3222l1485k7417k1622j7534
58472I75532j5689j3806j1720j1277j1747j0405p706o893q314q748o898m998m483
58459H52848m246l707l663l825l138k377k730k539L22L826M223K342K313M651
58445H44300O128O120P134Q973Q368N281L621M599N104L918M029P058J0688J3422
58431I38743J6875K1480K4624K4985K4424K3982K2334J9606J8193J8186J6317
58420A169749J1134N213P87k921o898j0808j5076k0530k5310k6453k4907k4412
58408A029568k5168k3775j9894j7305j7349j6976j4629j2529j1599r702o611n237
58396H48794o077n788l175j311j787k176j135o07r75M62L985N927N010M771P208
$$ plain form
58483 1378727 1325349 1275723 1228338 1183291 1142644 1106812 1073590 1042105 1014688 993066 975532
58472 975532 959843 946037 934317 923040 911293 900888 893182 886289 877975 869227 862329 857331 852848
58459 852848 848602 844895 841232 837407 834269 831892 829162 826623 826945 830771 834994 837336 839649 844300
58445 844300 850428 856548 863682 872655 881023 886304 889925 894524 899628 903546 907575 914633 925321 938743
58431 938743 955618 977098 1001722 1026707 1051131 1075113 1097447 1117053 1135246 1153432 1169749
58420 1169749 1180883 1186096 1186883 1183962 1177064 1166256 1151180 1130650 1105340 1078887 1053980 1029568
58408 1029568 1004400 980625 960731 943426 926077 909101 894472 881943 870344 860642 854031 848794
58396 848794 842717 836929 833754 832443 830656 828480 827345 826738 825763 826225 830210 836137 841147 845918 853126
58381H53126R451R311Q897R967J0896J0950J2391J5635J7481J6792J6650J8177
58369A009724J7761J3478Q836O680M698N49l607n493o931r865j2448j2712j2021
58356I98649j1625r830n717j669O33K621M853N208L633L784P064R979J0322J1041
58342A028946J4648J8609J9724J8569J6578J3106Q321M508J808k540q447j1754
58330A122076j1245j1038j3226j4239j1831r392r434q885n108q33J275L384P286
58317A038790R954Q932P126P636Q632P715O481O553O073M171L820O116O997L985
58303A132981R57J847M795O769Q727J1760J3489J2780J2893J5796J8532J9105
58291A260431K0229K3320K5007K3788K3627K6444K7803K4857K1671K1292J9677
$$ plain form
58381 853126 862577 871888 880785 890752 901648 912598 924989 940624 958105 974897 991547 1009724
58369 1009724 1027485 1040963 1049799 1056479 1061177 1061726 1058119 1052626 1045695 1035830 1023382 1010670 998649
58356 998649 987024 977194 971477 969808 970441 973062 977915 983123 986756 990540 997604 1007583 1017905 1028946
58342 1028946 1043594 1062203 1081927 1100496 1117074 1130180 1138501 1143009 1144817 1142277 1133830 1122076
58330 1122076 1110831 1099793 1086567 1072328 1060497 1051105 1041671 1032786 1027678 1026845 1028120 1031504 1038790
58317 1038790 1048744 1057676 1064802 1072438 1081070 1088785 1095266 1101819 1107892 1112063 1115883 1121999 1128996 1132981
58303 1132981 1133938 1135785 1140580 1147349 1156076 1167836 1181325 1194105 1206998 1222794 1241326 1260431
58291 1260431 1280660 1303980 1328987 1352775 1376402 1402846 1430649 1455506 1477177 1498469 1518146
58280A518146J3344O284L077J617j176k940j447j41j676k266J189M730M562M018
58266A547321O757R828J0365J2165J8229K3578K3383K1610K3777K7584K8836K9996
58254A783429L4389L8291L7609L6392L9706M3931M3209L9872L9274L9544L5818
58243B211464K9753K5891K3272J9201J6439J8156K0745J9973J9001K2141K6392
58232B452428K7523K8619L3870M0042M2813M5187N0706N5188N4652N4441O0471
58221B945940O8400P1674P3226P8533Q4224Q4925Q4592Q9655R7424J02430J07344
58210C888367J16172J24052J25666J26207J31706J36267J32020J23858J20882
58201E025197J21094J18679J18228J26536J38141J44569J50455J64436J81590
$$ plain form
58280 1518146 1531490 1537774 1540851 1542468 1541292 1538352 1536905 1536764 1535088 1532822 1534011 1538741 1543303 1547321
58266 1547321 1554078 1563906 1574271 1586436 1604665 1628243 1651626 1673236 1697013 1724597 1753433 1783429
58254 1783429 1817818 1856109 1893718 1930110 1969816 2013747 2056956 2096828 2136102 2175646 2211464
58243 2211464 2241217 2267108 2290380 2309581 2326020 2344176 2364921 2384894 2403895 2426036 2452428
58232 2452428 2479951 2508570 2542440 2582482 2625295 2670482 2721188 2776376 2831028 2885469 2945940
58221 2945940 3014340 3086014 3159240 3237773 3321997 3406922 3491514 3581169 3678593 3781023 3888367
58210 3888367 4004539 4128591 4254257 4380464 4512170 4648437 4780457 4904315 5025197
58201 5025197 5146291 5264970 5383198 5509734 5647875 5792444 5942899 6107335 6288925
58192F288925J91797J98448K11528K28807K41430K51842K68267K87627L01878
58183H470549L15014L35713L59680L77891L95360M22465M54780M81662N07504
58174A2120618N43405N85265O22100O58620P06461P60362Q07178Q51335R06316
58165A8561660R68169J023648J077544J144510J220649J291611J361952J446903
58157B8096646J542470J634839J731666J850714J985403K117257K254643K420954
58149D3634592K612159K807137L012957L256415L538484L844920M195506M632442
58141G1534612N167710N796971O555603P496899Q622386R904026J1366849J3069843
58133A39514899J5016772J7185023J9640663K2523308K5932773K9923887L4429514
$$ plain form
58192 6288925 6480722 6679170 6890698 7119505 7360935 7612777 7881044 8168671 8470549
58183 8470549 8785563 9121276 9480956 9858847 10254207 10676672 11131452 11613114 12120618
58174 12120618 12664023 13249288 13871388 14530008 15236469 15996831 16804009 17655344 18561660
58165 18561660 19529829 20553477 21631021 22775531 23996180 25287791 26649743 28096646
58157 28096646 29639116 31273955 33005621 34856335 36841738 38958995 41213638 43634592
58149 43634592 46246751 49053888 52066845 55323260 58861744 62706664 66902170 71534612
58141 71534612 76702322 82499293 89054896 96551795 105174181 115078207 126445056 139514899
58133 139514899 154531671 171716694 191357357 213880665 239813438 269737325 304166839
58126C04166839L8719954M0789794L7862655K8334820J3533632k681364j6305424
58119D44420906k5328471k9952301l1415023l0949488k9482170k7645035k5753030
58112B43895388k3858526k1934473j9989260j8038947j6089987j4191977j2439094
58105A17353124j0889293r530999q341318p321682o460237n713158n048930m472355
58097E9575152l985775l563526l183900k852173k571389k320410k081833j865161
58089C7150985j681061j515889j353016j198444j063168r38091q08919o80725
58081B7911672n65139m57082l47835k48591j74030j10604k8348Q1582K09220L60123
58071B6630968N53846P88403J043064J322369J659237K064369K513724K997908
$$ plain form
58126 304166839 342886793 383676587 421539242 449874062 463407694 460726330 444420906
58119 444420906 419092435 389140134 357725111 326775623 297293453 269648418 243895388
58112 243895388 220036862 198102389 178113129 160074182 143984195 129792218 117353124
58105 117353124 106463831 96932832 88591514 81269832 74809595 69096437 64047507 59575152
58097 59575152 55589377 52025851 48841951 45989778 43418389 41097979 39016146 37150985
58089 37150985 35469924 33954035 32601019 31402575 30339407 29401316 28592397 27911672
58081 27911672 27346533 26889451 26541616 26293025 26118995 26008391 25980043 26061625 26270845 26630968
58071 26630968 27184814 27973217 29016281 30338650 31997887 34062256 36575980 39573888
58063C9573888L535848M133053M810456N699264O940783Q298875Q935823P869921
58055H9797911M857048P64326l036235n625107o902941p235697o999743o461560
58047E9158002n835251n262842m769175m318880l899473l514126l142152k763716
58039B5652387k398921k079506j803547j553820j337614j171107j042864r28140
58031A3336868q25245p46527o86759o30644n80022n44918n17346m81120m39226
58022G885061m06012l79933l48760l15048k92442k81527k71375k60479k55239
58013E074246k52061k41145k24646k12385k03287j89045j72043j61427j55053
58004C263154j43238j27401j17366j12835j04770r3164q6629q5803q3158p8087
$$ plain form
58063 39573888 43109736 47242789 52053245 57752509 64693292 72992167 81927990 89797911
58055 89797911 94654959 95419285 92383050 86757943 79855002 72619305 65619562 59158002
58047 59158002 53322751 48059909 43290734 38971854 35072381 31558255 28416103 25652387
58039 25652387 23253466 21173960 19370413 17816593 16478979 15307872 14265008 13336868
58031 13336868 12511623 11765096 11078337 10447693 9867671 9322753 8805407 8324287 7885061
58022 7885061 7479049 7099116 6750356 6435308 6142866 5861339 5589964 5329485 5074246
58013 5074246 4822185 4581040 4356394 4144009 3940722 3751677 3579634 3418207 3263154
58004 3263154 3119916 2992515 2875149 2762314 2657544 2564380 2477751 2391948 2308790 2230703
57994B230703p6781p8196p5155o8459o5409o5357o1130n3880n1898n4874n3613
57983A525951m5945l9482l7744l6227l3052l1541l1363k8489k4356k4155k6164
57972A167433k3856j8296j7081k0951k2958k1096k0576k2842k3346k1132k0269
57961I35030k0822j8355j3043r709q544n459j465j765n409o002k894j559k663
57948H37341j184L052M548K809L399P084Q188N573N144R181J2764J3183J3739
57935I24821J5630J4986J0827P781Q068Q318O661N700O372N935L745K157O66l768
57921A017899r765j2438j1960j3424j7431j9069j7137j6000j6812j5552j1512
57910H56799r268r982r088n030k138k251j461J946M136L385L610O932R685R001
$$ plain form
57994 2230703 2153922 2075726 2000571 1932112 1866703 1801346 1740216 1686336 1634438 1579564 1525951
57983 1525951 1480006 1440524 1402780 1366553 1333501 1301960 1270597 1242108 1217752 1193597 1167433
57972 1167433 1143577 1125281 1108200 1087249 1064291 1043195 1022619 999777 976431 955299 935030
57961 935030 914208 895853 882810 873101 864557 859098 857633 855868 850459 844457 841563 840004 837341
57948 837341 836157 839209 843757 846566 849965 857049 865237 870810 875954 885135 897899 911082 924821
57935 924821 940451 955437 966264 974045 982113 990431 997092 1002792 1009164 1015099 1018844 1021001 1021667 1017899
57921 1017899 1008134 995696 983736 970312 952881 933812 916675 900675 883863 868311 856799
57910 856799 847531 837549 828461 823431 821293 819042 817581 819527 823663 827048 830658 837590 847275 856276
57896H56276O790M272p20p948j2855j3524j3573j5414j6782j6346j6415j7424
57884G36337j6131j2066r362r488q467m317q32q06j563m58J075K035M626R279
57870F89862J2562J3063J3798J5957J6127J2795R639Q925P601L572J61K41J156
57857H05459l13k808m182n824r226j2437j3655j4430j6123j7107j6529j6643j8385
57844F57797j8987j7128j6024j8052k0412j9685j6830j4492j2969j1899j2274
57833D79045j3768j3584j0652p611o323n349l902l847n324m962j319K322L424
57820D08150M053O240Q045P571O595O804O528M673L754N477P154O182M219L380
57806D88825K072j470n072o050n568n839o039m654l009k819l051k451k386l822
$$ plain form
57896 856276 863066 867338 866618 858670 845815 832291 818718 803304 786522 770176 753761 736337
57884 736337 720206 708140 698778 689290 680823 676506 675674 674868 673305 672847 673922 675957 680583 689862
57870 689862 702424 715487 729285 745242 761369 774164 783803 792728 800329 803901 804062 804303 805459
57857 805459 805146 802338 798156 792332 783106 770669 757014 742584 726461 709354 692825 676182 657797
57844 657797 638810 621682 605658 587606 567194 547509 530679 516187 503218 491319 479045
57833 479045 465277 451693 441041 433430 427107 421758 417856 414009 408685 403723 402404 404726 408150
57820 408150 412203 418443 426488 434059 440654 447458 453986 458659 462413 467890 475044 481226 485445 488825
57806 488825 490897 489427 484355 478305 472737 466898 460859 456205 453196 450377 447326 444875 442489 438667
57792D38667m485k403M47J412J387K581M709O563Q628J1093J1995J0490R188J0116
57778E10388J1124R516O579N194N437N731N864N766L844l91m429o323p635j0028
57764E40637j1897j1495j0408j0572j0572q472n737m717m727m089l700m797n520
57751D43934l559k53J610K191L157L769K393L15J28J293J048j086l092m024m659
57736D43165n141m760l788l185k895k260j387n71N72K104L295M321O509R664J1445
57721D57088J0905J0073J0303R996P922N764M893L614N58k104j932j75P57J326
57707E18988L102N262O245O810Q167R006P817O128O021O184M027Q4l131n253p513
57692E71944r539j0085r858j0356j0964j0351r533j0354j1977j2051j0424q802
$$ plain form
57792 438667 434182 431779 432226 433638 435025 437606 442315 448878 457506 468599 480594 491084 500272 510388
57778 510388 521512 531028 537607 542801 548238 553969 559833 565599 569443 569052 564623 558300 550665 540637
57764 540637 528740 517245 506837 496265 485693 477221 471484 466767 462040 457951 454251 449454 443934
57751 443934 440375 440122 441732 443923 447080 450849 453242 453557 453685 454978 456026 454940 451848 447824 443165
57736 443165 438024 433264 429476 426291 423396 421136 419749 419178 419750 421854 425149 429470 435979 445643 457088
57721 457088 467993 478066 488369 498365 506287 512051 516944 520558 521116 519012 517080 516905 517662 518988
57707 518988 522090 527352 533597 540407 548574 557580 565397 571525 577546 583730 587757 587841 584710 579457 571944
57692 571944 562405 552320 542462 532106 521142 510791 501258 490904 478927 466876 456452 447650
57680D47650p673o499n869o428o699n008k659k248l652m570m114l141j948m46
57666C86696K66n99j349J28L011M946N726O683P510O797N152M643N542O309O400
57651D47861O512O692O722P742J0643J3532J3547J0943Q764Q803J0340J2437J4876
57638E79414J6996J8040J8642K0100K2477K5130K8270L1895L4033L2536K8136
57627H55669K3607K0389J8076J6457J5824J5739J5614J6118J8246K1691K5904
57616A063334L1662L9561M8006N4975O0934O7899P6416Q5621R5446J06500J18326
57605A848680J29720J40192J49618J57262J62100J62182J52328J25525Q0118K4180
57595C131905k9970p4365j06735j26705j35301j36751j35942j33866j28715j20906
$$ plain form
57680 447650 439977 433478 427609 421181 414482 409474 406815 404567 400915 396345 392231 389090 387142 386696
57666 386696 386962 386363 385014 385142 388153 393099 398825 405508 413018 419815 424967 429610 435152 441461 447861
57651 447861 454373 461065 467787 475529 486172 499704 513251 524194 532958 541761 552101 564538 579414
57638 579414 596410 614450 633092 653192 675669 700799 729069 760964 794997 827533 855669
57627 855669 879276 899665 917741 934198 950022 965761 981375 997493 1015739 1037430 1063334
57616 1063334 1094996 1134557 1182563 1237538 1298472 1366371 1442787 1528408 1623854 1730354 1848680
57605 1848680 1978400 2118592 2268210 2425472 2587572 2749754 2902082 3027607 3107725 3131905
57595 3131905 3101935 3027570 2920835 2794130 2658829 2522078 2386136 2252270 2123555 2002649
57585B002649j13394j07277j00709r2452q3378p4226o4816n5761m8325m2283l6364
57574A183664l0712k6585k3736k0667j7254j4632j2578r582n571k110J90K214
57562A022641M401O483Q952J2525J6347J9031K1154K4457K8813L2380L4605L6862
57550A268651M0250M4804N0390N6276O0456O1791O2084O3517O4797O2653N6479
57539A892148M8421L9254K7514J2679l739k0447l6795n0919o0525o5996p0039
57528A711556p3907p6450p7026p6487p4980p1650o7017o2969n9776n5771n0559
57517I64964m5925m2849m0116l6786l3640l1260k8804k5696k2720k0584j9018
57506F17566j7667j6395j4528j1521q485p092p067o704n761n565o294o666o440
$$ plain form
57585 2002649 1889255 1781978 1681269 1588817 1505439 1431213 1366397 1310636 1262311 1220028 1183664
57574 1183664 1152952 1126367 1102631 1081964 1064710 1050078 1037500 1027918 1022347 1020237 1020427 1022641
57562 1022641 1027042 1033525 1042477 1055002 1071349 1090380 1111534 1135991 1164804 1197184 1231789 1268651
57550 1268651 1308901 1353705 1404095 1460371 1520827 1582618 1644702 1708219 1773016 1835669 1892148
57539 1892148 1940569 1979823 2007337 2020016 2016277 1995830 1959035 1908116 1847591 1781595 1711556
57528 1711556 1637649 1561199 1484173 1407686 1332706 1261056 1194039 1131070 1071294 1015523 964964
57517 964964 919039 876190 836074 799288 765648 734388 705584 679888 657168 636584 617566
57506 617566 599899 583504 568976 557455 548970 541878 534811 528107 522346 516781 510487 503821 497381
57493D97381o707p284o546m312k429j746r14R82K884L734L899L831L374L175M581
57478D93903P124Q212O570M287M126O294Q987J0792J1516J1554J1553J2042J2975
57465F09935J4166J6081J9288K3286K6950K9888L2280L4039L5448L7834M1822
57454I21017M5654M7342M7795M9357N1699N2007M9158M4899M0552L5274K8205
57443A412959J9805J0241j113j3635k5041l3981m1166m7127n0862n1687n0728
57432A127665m9492m8418m7457m6636m5390m2867l9421l6302l3461k9487k4319
57421F84415k0148j8556j8288j7079j4488j1870j0214r015o982l619j27J701J927
57408E57657K866O004R637J1123J0527J0119J1027J2572J4429J6972J9644K1334
$$ plain form
57493 497381 490674 483390 476844 472532 470103 468357 467443 468425 471309 475043 478942 482773 486147 489322 493903
57478 493903 501027 509239 515809 520096 524222 530516 539503 550295 561811 573365 584918 596960 609935
57465 609935 624101 640182 659470 682756 709706 739594 771874 805913 841361 879195 921017
57454 921017 966671 1014013 1061808 1111165 1162864 1214871 1264029 1308928 1349480 1384754 1412959
57443 1412959 1432764 1443005 1441892 1428257 1403216 1369235 1328069 1280942 1230080 1178393 1127665
57432 1127665 1078173 1029755 982298 935662 890272 847405 807984 771682 738221 708734 684415
57421 684415 664267 645711 627423 610344 595856 583986 573772 564757 557775 554156 554029 555730 557657
57408 557657 560523 566527 576164 587287 597814 607933 618960 631532 645961 662933 682577 703911
57396G03911K2480K4690K8171L1611L4539L7707M0928M2847M3041M2336M0709
57385A092970L6985L0947K3735J5833O617l797j4159k3882l3389m2356m9436n3987
57373I86081n6449n6960n5396n2724n0377m8250m5296m1912l9605l8294l6265
57362D64553l2944k9476k6359k2852j9015j6117j4593j3682j3262j3884j4790
57351B47579j4179j1934r947r329r294q974q383p401n975n300o505q187p729n163
57337A29279l239l436m419m740m369l283j188Q39J003l58j068n31k38n51K9J717
57321A05447K529J460n3p71j225j847j993j684j918k578k460j928k794m961o061
57306G9163n216m222m159l929l218l657n527o341m649k556k555m160n542o280
$$ plain form
57396 703911 726391 751081 779252 810863 845402 883109 924037 966884 1009925 1052261 1092970
57385 1092970 1129955 1160902 1184637 1200470 1207087 1203290 1189131 1165249 1131860 1089504 1040068 986081
57373 986081 929632 872672 817276 764552 714175 665925 620629 578717 539112 500818 464553
57362 464553 431609 402133 375774 352922 333907 317790 303197 289515 276253 262369 247579
57351 247579 233400 221466 211519 202190 192896 183922 175539 168138 162163 156863 150358 142171 134442 129279
57337 129279 126040 122604 118185 113445 109076 105793 104605 105444 106447 106089 105021 104490 104252 103701 103730 105447
57321 105447 107976 109436 109383 108612 107387 105540 103547 101863 99945 97367 94907 92979 90185 85224 79163
57306 79163 73947 69725 65566 61637 58419 54762 49235 42894 38245 35689 33134 28974 23432 17152
57292A7152o679D186g41l659l361l631l969m395m342k962j111o90j548j545l58
57277c2312k43k068l475k469j10J857L422M836N150L973K632K156J986J708J833
57262a1124K042J216K43J804A25Q809P628M378K573K877L847M711N330N251M692
57247E0221M883O147P346Q067R087R927Q769O112N338P938J1058J1762J0945J0859
57233A68459J1488J1879J2652J4550J6342J6653J6155J5787J4566J1363P301M276
57221C21471K433Q92n43k033m473p828j0170j0009q210o208l894p41K473M604
57207B77764N591N940N952O140O865P145N640L131J838J956J456k85j597j829
57193C25707k455l799l883j797O43J948K768L534L388K673L316N340O244N299
$$ plain form
57292 17152 10473 4186 -741 -4400 -7761 -11392 -15361 -19756 -24098 -27060 -28171 -28861 -30409 -31954 -32312
57277 -32312 -32555 -34623 -38098 -40567 -40677 -38820 -35398 -30562 -25412 -21439 -18807 -16651 -14665 -12957 -11124
57262 -11124 -9082 -7866 -7623 -5819 125 8934 16562 20940 23513 26390 30237 34948 40278 45529 50221
57247 50221 55104 61251 68597 76664 85751 95678 104447 110559 115897 123835 134893 146655 157600 168459
57233 168459 179947 191826 204478 219028 235370 252023 268178 283965 298531 309894 317195 321471
57221 321471 323904 324796 324253 322220 317747 309919 299749 289740 281530 275322 271428 270687 273160 277764
57207 277764 283355 289295 295247 301387 308252 315397 321037 324168 326006 327962 329418 329133 327536 325707
57193 325707 323252 319453 315570 313773 314416 316364 319132 322666 326054 328727 332043 337383 343627 348926
57179C48926N045P006R328J0587J2382J6036J9791K1527K1475K0413J8251J5996
57167E26763J5943J8054J9409J8897J8967K1030K2899K2756K1855K1205J9581
57156G47359J7162J6989K0232K4069K6881L1243L8655M5702M9175N1125N4853
57145A123445N9472O2393O3986O5848O7416O8113P0034P4685P9665Q2151Q3133
57134A900341Q4895Q7028Q8248Q9372R1029R1225Q8657Q5829Q5472Q6389Q6178
57123B864663Q5590Q6824Q9705R2485R4334R4704R2733Q9377Q7340Q6916Q5237
57112C849908Q1337P7970P6492P4481P0842O8380O8504O8293O5916O3885O3634
57101D629642O2118N7603N3559N2788N2788N0976M9263M9051M7234M1825L6367
$$ plain form
57179 348926 353971 360977 370305 380892 393274 409310 429101 450628 472103 492516 510767 526763
57167 526763 542706 560760 580169 599066 618033 639063 661962 684718 706573 727778 747359
57156 747359 764521 781510 801742 825811 852692 883935 922590 968292 1017467 1068592 1123445
57145 1123445 1182917 1245310 1309296 1375144 1442560 1510673 1580707 1655392 1735057 1817208 1900341
57134 1900341 1985236 2072264 2160512 2249884 2340913 2432138 2520795 2606624 2692096 2778485 2864663
57123 2864663 2950253 3037077 3126782 3219267 3313601 3408305 3501038 3590415 3677755 3764671 3849908
57112 3849908 3931245 4009215 4085707 4160188 4231030 4299410 4367914 4436207 4502123 4566008 4629642
57101 4629642 4691760 4749363 4802922 4855710 4908498 4959474 5008737 5057788 5105022 5146847 5183214
57090E183214L3790L1082K5031J7973J2662O623l006j4074k4069l5073m8906o2626
57078E122621p4173q6948j03412j19843j33026j46341j63596j82725k01224k21534
57068C689799k45327k69216k92125l19985l56927l99174m43873m95980C07622
57058c22914p05246p87979q82713r86321j097443j222503j365332j521319j689724
57049a0581494j880103k098035k337219k594993k881595l203973l556321l938700
57041c3072433m368361m859430n409003o017047o699598p466462q307220r214532
57033h5414086j0193947j1233522j2298364j3377069j4491367j5637290j6781158
57026a79426803j7942772j9147503k0145014k0269742j8867656j6001141j2591925
$$ plain form
57090 5183214 5217004 5248086 5273117 5291090 5303752 5310375 5307369 5293295 5269226 5234153 5185247 5122621
57078 5122621 5048448 4961500 4858088 4738245 4605219 4458878 4295282 4112557 3911333 3689799
57068 3689799 3444472 3175256 2883131 2563146 2206219 1807045 1363172 867192 307622
57058 -322914 -1028160 -1816139 -2698852 -3685173 -4782616 -6005119 -7370451 -8891770 -10581494
57049 -10581494 -12461597 -14559632 -16896851 -19491844 -22373439 -25577412 -29133733 -33072433
57041 -33072433 -37440794 -42300224 -47709227 -53726274 -60425872 -67892334 -76199554 -85414086
57033 -85414086 -95608033 -106841555 -119139919 -132516988 -147008355 -162645645 -179426803
57026 -179426803 -197369575 -216517078 -236662092 -256931834 -275799490 -291800631 -304392556
57019c04392556r702937p697856o155124m479956k430415r6302K402082N063574
57011c27489490P934984J0992482J4081547J6929130J9233035K0785242K1529221
57004b16003849K1520449K0870917J9734533J8291542J6699135J5058145J3434053
56997i0395075J1886417J0460717R171796Q016644O993730O098658N316139M631670
56989b7819304M041356L539772L109842K735371K412623K139570J904692J696576
56981f239502J514307J358465J221260a050396f8477H16484P98630P15858O37924
56972B968896N68743N06291M47275L93715L47691L05681K64604K27339J96156
56963F226391J66943J35831J05498P9145N4270K7897K083k1160m4498o9757r3726
$$ plain form
57019 -304392556 -314095493 -321793349 -327948473 -332428429 -334858844 -334955146 -332553064 -327489490
57011 -327489490 -319554506 -308562024 -294480477 -277551347 -258318312 -237533070 -216003849
57004 -216003849 -194483400 -173612483 -153877950 -135586408 -118887273 -103829128 -90395075
56997 -90395075 -78508658 -68047941 -58876145 -50859501 -43865771 -37767113 -32450974 -27819304
56989 -27819304 -23777948 -20238176 -17128334 -14392963 -11980340 -9840770 -7936078 -6239502
56981 -6239502 -4725195 -3366730 -2145470 -1050396 -68477 816484 1615114 2330972 2968896
56972 2968896 3537639 4043930 4491205 4884920 5232611 5538292 5802896 6030235 6226391
56963 6226391 6393334 6529165 6634663 6713808 6768078 6795975 6798058 6776898 6732400 6662643 6568917
56952F568917j14829j38362j69620k06595k43584k76501l00514l08952l00361
56943D509599k81983k61610k40469k17695j95721j76485j57702j37783j19717
56934B720434j05703r2937p9024o6567n8005n0754m1890l3068k6479k0416j2981
56923B132610n863n14N145J2604J9676K5106L1915M2882N6928P2878R2561J17726
56911B603654J48035J83301K22887K64135L09204L70287M51316N19320N12252
56902E584391L92620J88348k9841k05346l21637l84862m03716l89393l58388l24852
56892C747324k94268k67326k44615k25344k06510j86240j65327j45008j26081
56883A886605j09988r7575q7171p6801o7249n9981n3615m5941l7878l1539k5822
$$ plain form
56952 6568917 6454088 6315726 6146106 5939511 5695927 5419426 5118912 4809960 4509599
56943 4509599 4227616 3966006 3725537 3507842 3312121 3135636 2977934 2840151 2720434
56934 2720434 2614731 2521794 2442770 2376203 2318198 2267444 2225554 2192486 2166007 2145591 2132610
56923 2132610 2126747 2126233 2131378 2143982 2163658 2188764 2220679 2263561 2320489 2393367 2485928 2603654
56911 2603654 2751689 2934990 3157877 3422012 3731216 4101503 4552819 5072139 5584391
56902 5584391 5977011 6165359 6135518 5930172 5608535 5223673 4819957 4430564 4072176 3747324
56892 3747324 3453056 3185730 2941115 2715771 2509261 2323021 2157694 2012686 1886605
56883 1886605 1776617 1679042 1591871 1515070 1447821 1387840 1334225 1288284 1250406 1218867 1193045
56872A193045j8026q979k523m80j678n299j1670j9957k8045l4516l8699l9857
56860I83316l8540l7277l7493l7340l4972l1966l0680l0248k8350k5181k2433
56849F28836j9972j6783j3751j2349j1800j0529r142r081r668r216p798o396m853
56836D87498l061k363l161l278j349L61l94j697l51L090N669O527O498N002J082
56821E00073l716p070r324j2036j4499j4914j3745j2553j0942p895m700l149k182
56808C83348K73L599O103Q801J3769J9931K4375K6952K9807L3113L4905L4354
56796F19330L1665K5647J5419L913m231q166j0717j3181j3990j2491j0311q432
56784F14455n926k114K558P877J3717J8906K2662K6522L2387L9485M6052N2736
$$ plain form
56872 1193045 1175019 1166040 1163517 1163037 1161359 1156060 1144390 1124433 1096388 1061872 1023173 983316
56860 983316 944776 907499 870006 832666 797694 765728 735048 704800 676450 651269 628836
56849 628836 608864 592081 578330 565981 554181 543652 534510 525429 515761 506545 498747 492351 487498
56836 487498 484437 482074 478913 475635 474286 474647 474253 472556 472205 475295 480964 487491 493989 498991 500073
56821 500073 496357 489287 479963 467927 453428 438514 424769 412216 401274 393379 388679 385530 383348
56808 383348 383621 387220 393323 402124 415893 435824 460199 487151 516958 550071 584976 619330
56796 619330 650995 676642 692061 695974 691743 683577 672860 659679 645689 633198 622887 614455
56784 614455 608529 606415 608973 616850 630567 649473 672135 698657 731044 770529 816581 869317
56772H69317O0614O6330O3257M8257K4631j469k4712m1133m8968n0082m8257m5446
56760H72339m1415l6460l1765k7202k1501j4697q048j662N396J2742J8926K4000
56748G50653K9584L6378M3300M8338M8287L9184K0334k688k2160l5061m3272m8204
56736H64673m9083m6363m2736l9726l6316l1601k6324k1274j6608j2901j0423
56725E31318p365j490O400J3328J8332K2750K6238K5857J9983J0343n49j1321
56713F53824k0543k6470k9148l0480l1381l0926k8871k6619k4915k2775j9556
56702C62140j6130j3341j1139r681r386r481q502o645n628n907o078n322m383
56689B50517l722k884k100k323l222l296k473k386l430l836k552r65p41j642k539
$$ plain form
56772 869317 929931 996261 1059518 1107775 1132406 1130937 1106225 1065092 1016124 966042 917785 872339
56760 872339 830924 794464 762699 735497 713996 699299 691251 689589 694985 707727 726653 750653
56748 750653 780237 816615 859915 908253 956540 995724 1016058 1013370 991210 956149 912877 864673
56736 864673 815590 769227 726491 686765 650449 618848 592524 571250 554642 541741 531318
56725 531318 523953 522463 528863 542191 560523 583273 609511 635368 655351 665694 665145 653824
56713 653824 633281 606811 577663 547183 515802 484876 456005 429386 404471 381696 362140
56702 362140 346010 332669 321530 311849 302463 292982 284480 277835 272207 266300 260222 254900 250517
56689 250517 246795 243911 241811 239488 236266 232970 230497 228111 224681 220845 218293 217328 216587 214945 212406
56674B12406l114l579l872l788l192j887j01J150J290J237J858K172Q03j429k400
56659A97554j592r0J608L423M045K208o63j804r97m31q73r42k05J30jQ68K633
56642B04871L180J910R54J750K967L066K533K297J985J021k29j359k361k685j676
56627B18224l39n78k216k983k025j050j260j604j075m43n18p22m86k49k0J087
56611B03743K919L749K835J706J849K732L210L240L158K743K052J928K798M087
56597B42749N341O601P417P037N897N241M961L661J272l95l38K41p9j217k465
56582B85924l425l613k726j684j852k953l507l353l637m337m106k941k512l214
56568B42064l400k268j164j063j105n66k16o28j035q28m34p5O22J256Q71j59n50
$$ plain form
56674 212406 209292 205713 201841 198053 194861 192974 192873 194023 195313 196550 198408 200580 201383 199954 197554
56659 197554 195962 195872 197480 200903 204948 207156 206493 204689 203692 203261 202388 201446 201241 201371 201370 202238 204871
56642 204871 208051 209961 210915 212665 215632 218698 221231 223528 225513 226534 226305 224946 222585 219900 218224
56627 218224 217885 217307 215091 212108 210083 209033 207773 206169 205094 204651 204133 203411 202925 202676 202656 203743
56611 203743 206662 210411 213246 214952 216801 219533 222743 225983 229141 231884 233936 235864 238662 242749
56597 242749 248090 254691 262108 269145 275042 280283 285244 288905 290177 289782 289444 289685 289606 288389 285924
56582 285924 282499 278886 276160 274476 272624 269671 266164 262811 259174 254837 250731 247790 245278 242064
56568 242064 238664 236396 235232 234169 233064 232498 232282 231654 230619 229791 229357 229282 229904 231160 232031 231872 231322
56551B31322n54j464k527j425J566L097J659j64J67J669K255K022J997J964J508
56536B43092J465K368L112K697J729Q95k69j714j879Q4K695M029L871L026K205
56521B67406K402M355O795P349N985N139N610N217K882R82J644L482M229M234
56507C27711M841N461M864L752L587M129M322M287M612M894M872N580P590R438
56493C99940R633R042R431J0768J1723J1903J2008J2423J2967J3366J3209J2149
56481E38562J0605R203P452M633J897J267K402K787J447k98j985m552p085p000
56467E59335m726m310p469j0870j1600j1363j2427j3262j1795r695r485j0101
56455D42232r286q021q485r599q909p359p930j0310j1008q518m971k779k460l554
$$ plain form
56551 231322 230768 229304 226777 225352 226918 230015 231674 231510 231677 233346 235601 237623 239620 241584 243092
56536 243092 244557 246925 250037 252734 254463 255358 255089 253375 251496 251580 254275 258304 262175 265201 267406
56521 267406 269808 274163 280958 288307 294292 299431 305041 310258 313140 314122 315766 319248 323477 327711
56507 327711 332552 338013 342877 346629 350216 354345 358667 362954 367566 372460 377332 382912 390502 399940
56493 399940 409573 418615 428046 438814 450537 462440 474448 486871 499838 513204 526413 538562
56481 538562 549167 558370 565822 570455 572352 573619 576021 578808 580255 579957 577972 573420 566335 559335
56467 559335 554609 550299 542830 531960 520360 508997 496570 483308 471513 461818 452333 442232
56455 442232 432946 424925 416440 406841 397932 390573 382643 372333 361325 352807 347836 345057 342597 339043
56441C39043n106n445l858k004j709k219j727n61m46j484k259k251j964j398l59
56426C06253N18Q26J382K530K867J457k65p44o51r05m19J640L288K392L26q2J165
56409C21578K020K170K921M289N126N340N402M665K727J303K125M087N037N008
56395C73798N150N053M034L518M954O828O884N856N713N828M650L658N423Q685
56381D50032R630P643N731N515N734N686O236P143O946N874N664O266N770L684
56367E37554J432l54k118l290l021k588l939o135o597n458n199o255o753o453
56353D80826p071q410q132n914m239m355m872m987n615o597o136m024k412k487
56339D05575l183l717m499n105m350k883k596l193k536q00o55k708m376m281m155
$$ plain form
56441 339043 333937 328492 324634 322630 320921 318702 316975 316414 315968 314484 312225 309974 308010 306612 306253
56426 306253 306771 307597 308979 311509 314376 315833 315568 314824 314173 313268 312849 314489 317777 320169 320495 320413 321578
56409 321578 323598 325768 328689 332978 338104 343444 348846 353511 356238 357541 359666 363753 368790 373798
56395 373798 378948 384001 388035 391553 396507 403335 410219 416075 421788 427616 432266 435924 441347 450032
56381 450032 459662 467305 473036 478551 484285 489971 496207 503350 510296 516170 521834 528100 533870 537554
56367 537554 538986 538632 536514 533224 530203 527615 523676 517541 510944 505486 500287 494032 487279 480826
56353 480826 473755 465345 457213 451299 447060 442705 437833 432846 427231 420634 414498 410474 408062 405575
56339 405575 402392 398675 394176 389071 384721 381838 379242 376049 373513 372713 372058 369350 364974 360693 356538
56324C56538n157n738m656l025j876o97L30m12k874m402l459j700p83J94K353
56309C24636M556N169M364L178K043J472K304M068M918M127K923K066P71j140
56295C65455k208j606l88M82J472K805L368K512J329J088J683K377K952L593M545
56280C89459N954P080O476M253L010M473O433N682K835J106J226J242Q61K051
56266D42141N004P136O910N534M435L908M461O472Q390Q262O984O976Q063Q167
56252E32843P474P833Q489P012M393M239O516P292N405M037M492L949J295k86
56238F04983R91K328J685J426L405M884L034k53j781j914k544l132k422j601k371
56223F06718l829m103l341k697k279k033k649l802l733k162j145j695k289k013
$$ plain form
56324 356538 351381 345643 340987 337962 336086 335389 335719 335307 332433 328031 324572 322872 322089 322283 324636
56309 324636 329192 334361 338725 341903 343946 345418 347722 351790 356708 360835 363758 365824 366595 365455
56295 365455 363247 361641 361253 361735 363207 366012 369380 371892 373221 374309 375992 378369 381321 384914 389459
56280 389459 395413 402493 408969 413222 416232 420705 427138 432820 435655 436761 437987 439229 440090 442141
56266 442141 447145 454281 461191 466725 471160 475068 479529 486001 494391 502653 509637 516613 524676 532843
56252 532843 540317 548150 556639 563651 568044 572283 578799 586091 591496 595533 600025 603974 605269 604983
56238 604983 605974 608302 609987 611413 614818 619702 622736 622483 620702 618788 616244 613112 610690 609089 606718
56223 606718 602889 598786 595445 592748 590469 588436 585787 581985 578252 576090 574945 573250 570961 568948
56209E68948k046k561j618J066K768K115J338K145K981K621K808M716O359O176
56195E97816N748O329O197M339L351N458Q691J0080R849R606R265Q549Q622R612
56181G03512R426P556O731Q334R790R248Q943J0690J2054J0620Q447Q290Q912
56168H22553Q191P571R138J1215J1229J0243J0472J0894R533P589P134P111N712
56155I38585M374N156O459N558L315K249J886K60j942k726k583l089l580k806
56141I51116j968k492k984j970j302k978n093n001l978m489n267l845j736k156
56127I05857m254m448k236j87O60J150R20q91k808k587o36J240K771L996L457
56112I02004J110L32L129O086N362K930L080N353O205N533O164Q364J0016J0883
$$ plain form
56209 568948 566902 564341 562723 563789 566557 568672 570010 572155 575136 577757 580565 585281 591640 597816
56195 597816 603564 609893 616090 620429 623780 629238 637929 648009 657858 667464 676729 685278 693900 703512
56181 703512 712938 720494 727225 735559 745349 754597 763540 774230 786284 796904 805351 813641 822553
56168 822553 830744 838315 847453 858668 869897 880140 890612 901506 911039 918628 925762 932873 938585
56155 938585 942959 948115 954574 960132 963447 965696 967582 967842 965900 963174 960591 957502 953922 951116
56141 951116 949148 946656 943672 941702 940400 937422 932329 927328 923350 918861 913594 909749 908013 905857
56127 905857 901603 897155 894919 894732 895392 896542 897462 896571 893763 891176 890540 891780 894551 898547 902004
56112 902004 903114 903446 906575 912661 918023 920953 924033 929386 935591 941124 947288 955652 965668 976551
56098I76551J2061J2703J1821J1562J4090J7073J7230J6214J7728K0833K1766
56087A149632K0809K1419K3760K4965K5112K7212L1643L5743L8606M1448M3805
56076A484154M4165M3738M5025M7460M8938N0464N4551O0144O4151O6993P1982
56065B081765Q0080Q9906J01647J16402J33041J50227J69792J93490K18493K40944
56055C575787K61139K79554K90525K86767K68559K42335K12356J80458J51759
56046E749239J32178J20408J09031R3453P3765M9511K0218r212l1095m3773n2154
56035F211569o0348p0093q5385j10908j45051j80482k11699k36604k51986k54543
56025D604470k46226k32341k14895j93739j72394j55483j41513j25648j08626
$$ plain form
56098 976551 988612 1001315 1013136 1024698 1038788 1055861 1073091 1089305 1107033 1127866 1149632
56087 1149632 1170441 1191860 1215620 1240585 1265697 1292909 1324552 1360295 1398901 1440349 1484154
56076 1484154 1528319 1572057 1617082 1664542 1713480 1763944 1818495 1878639 1942790 2009783 2081765
56065 2081765 2161845 2251751 2353398 2469800 2602841 2753068 2922860 3116350 3334843 3575787
56055 3575787 3836926 4116480 4407005 4693772 4962331 5204666 5417022 5597480 5749239
56046 5749239 5881417 6001825 6110856 6204309 6278074 6327585 6347803 6338591 6307496 6263723 6211569
56035 6211569 6151221 6081128 5995743 5884835 5739784 5559302 5347603 5110999 4859013 4604470
56025 4604470 4358244 4125903 3911008 3717269 3544875 3389392 3247879 3122231 3013605
56016C013605r5399q6080p6263o5499n7334n1498m4293l6302l1371k8328k2220
56005B419018j3570p840n876l459j42N53l58K182P928J1596J2664J5721K0855
55992B459272K3329K3230K5741L1094L4142L4597L7645M3503M6605M6266M7836
55981B853260N2100N3984N3015N4308N7841N7862N4667N5616O2250O7741O9410
55970C492054P2508P9021Q4212Q7109R3076J02884J10353J13748J18659J27120
55960D480744J35027J42342J54052J68862J79249J84878J93378K05842K14967
55951F059341K19744K27841K40932K51982K59814K71425K87188K99450L08754
55942H426471L24905L48516L68768L83468M03429M32359M60907M85913N16667
$$ plain form
56016 3013605 2918206 2832126 2755863 2690364 2633030 2581532 2537239 2500937 2469566 2441238 2419018
56005 2419018 2405448 2397608 2391732 2388273 2388131 2388684 2388326 2390508 2398436 2410032 2422696 2438417 2459272
55992 2459272 2482601 2505831 2531572 2562666 2596808 2631405 2669050 2712553 2759158 2805424 2853260
55981 2853260 2905360 2959344 3012359 3066667 3124508 3182370 3237037 3292653 3354903 3422644 3492054
55970 3492054 3564562 3643583 3727795 3814904 3907980 4010864 4121217 4234965 4353624 4480744
55960 4480744 4615771 4758113 4912165 5081027 5260276 5445154 5638532 5844374 6059341
55951 6059341 6279085 6506926 6747858 6999840 7259654 7531079 7818267 8117717 8426471
55942 8426471 8751376 9099892 9468660 9852128 10255557 10687916 11148823 11634736 12151403
55933A2151403N56087N94897O30592O72635P22502P69067Q10414Q58848R17304
55924A8683749R73328J024115J083776J157233J231657J302990J385021J481975
55916B8323844J579397J673575J781645J910385K044726K180211K335251K517096
55908D4346130K709313K908825L140009L415588L722086M062841M475090M985827
55900G3765709N595597O324445P219537Q293015R513948J0894640J2523064J4480775
55892A48610730J6803133J9541880K2748905K6344767L0131985L3953013L7492623
55885C35627036L9606961L8132050L1100002J8606094L348961j0939128k1676550
55878D33805426k8280776l1465169l2236621l1471362k9872357k7910353k5793478
$$ plain form
55933 12151403 12707490 13302387 13932979 14605614 15328116 16097183 16907597 17766445 18683749
55924 18683749 19657077 20681192 21764968 22922201 24153858 25456848 26841869 28323844
55916 28323844 29903241 31576816 33358461 35268846 37313572 39493783 41829034 44346130
55908 44346130 47055443 49964268 53104277 56519865 60241951 64304792 68779882 73765709
55900 73765709 79361306 85685751 92905288 101198303 110712251 121606891 134129955 148610730
55892 148610730 165413863 184955743 207704648 234049415 264181400 298134413 335627036
55885 335627036 375233997 413366047 444466049 463072143 466421104 455481976 433805426
55878 433805426 405524650 374059481 341822860 310351498 280479141 252568788 226775310
55871B26775310k3590315k1361104j9159752j7009871j4951802j3067101j1413729
55864A06221636r979641q731057p661358o762818n995589n320904m733553m234793
55856E2801923l803998l421605l091145k815069k574569k353783k159330j996613
55848C0585811j850373j707252j575451j464149j364103j265409j174838j099230
55840A9085006j029828r58637q93171q40243p91395p38387o87697o46217o07338
55831A1892093n64343n23694m92540m66021m38397m13998l96238l78444l56261
55822G862157l36895l25761l15903l00608k84770k74008k64074k50622k38086
55813E271430k29310k17378j97038j73716j52471j29021j00480p3828n4416l6915
$$ plain form
55871 226775310 203184995 181823891 162664139 145654268 130702466 117635365 106221636
55864 106221636 96241995 87510938 79849580 73086762 67091173 61770269 57036716 52801923
55856 52801923 48997925 45576320 42485175 39670106 37095537 34741754 32582424 30585811
55848 30585811 28735438 27028186 25452735 23988586 22624483 21359074 20184236 19085006
55840 19085006 18055178 17096541 16203370 15363127 14571732 13833345 13145648 12499431 11892093
55831 11892093 11327750 10804056 10311516 9845495 9407098 8993100 8596862 8218418 7862157
55822 7862157 7525262 7199501 6883598 6582990 6298220 6024212 5760138 5509516 5271430
55813 5271430 5042120 4824742 4627704 4453988 4301517 4172496 4072016 3998188 3943772 3906857
55803C906857j7351l429k857j1215k1388l5533n7276q0968r9188j13456j27646
55792C336550j38252j40643j38167j35924j32029j23493j13981j07347j00105
55783B206609q8603p7106p0659o6305n9362n1989m7657m3535l6507l0358k8806
55772A605722k7449k0938j2362p187l374M025J3531K0733K6508L3772M0189M1393
55760A714563L7254K8520J2430j0954l3305m6747n3600o0157o5727o5892o2128
55749A394257n9422n7704n3685m8281m4683m1742l6593l1088k8622k7297k3104
55738I42036j7291j3862j2372r813p084o906p790o533m461m781o183n427l983
55725H35550n533q880r755q066p246p942q097p776q279q027m783m40J536J737
$$ plain form
55803 3906857 3889506 3886077 3883220 3872005 3850617 3815084 3757808 3676840 3577652 3464196 3336550
55792 3336550 3198298 3057655 2919488 2783564 2651535 2528042 2414061 2306714 2206609
55783 2206609 2118006 2040900 1970241 1903936 1844574 1792585 1744928 1701393 1664886 1634528 1605722
55772 1605722 1578273 1557335 1544973 1537786 1534412 1538437 1551968 1572701 1599209 1632981 1673170 1714563
55760 1714563 1751817 1780337 1792767 1781813 1748508 1701761 1648161 1588004 1522277 1456385 1394257
55749 1394257 1334835 1277131 1223446 1175165 1130482 1088740 1052147 1021059 992437 965140 942036
55738 942036 924745 910883 898511 888698 881614 874708 866918 860385 855924 851143 844960 839533 835550
55725 835550 830017 821137 811382 803316 796070 788128 780031 772255 763976 755949 751166 750726 752262 753999
55711G53999K677L174J91n462j0528j4651j9228k2930k3621k2898k3484k3962
55699E93277k1398j7321j5620j6180j6096j5519j6757j8845j8602j5961j3062
55688D07916r390l187L460O488O046N603N697L905L79j922k428l405n350o398
55674D07414o252o441o983o660o149o928p805o548m177l610m866n615n603o431
55660C23346p843q298q333r342r974p941m526l100l989m810m860m947m081r28
55646B40374K378K477K77l71J111J769N75n06q31j964m029n307n653o533p652
55631B16115p166n190l599k676j374k85p34j624p55J496L448N664R157J1526R811
55616B33814O212N626P954Q201M355j86k600l949n517o619p268q803j0607j0120
$$ plain form
55711 753999 756676 759850 760041 754579 744051 729400 710172 687242 663621 640723 617239 593277
55699 593277 571879 554558 538938 522758 506662 491143 474386 455541 436939 420978 407916
55688 407916 398526 395339 398799 405287 411333 416936 422633 426538 426917 424995 422567 419162 413812 407414
55674 407414 401162 394721 387738 381078 374929 368001 360196 353648 349471 345861 340995 335380 329777 323346
55660 323346 315503 307205 298872 289530 279556 271615 267089 263989 260000 255190 250330 245383 241302 240374
55646 240374 242752 245229 245506 245135 246246 248015 248590 248084 247253 245289 241260 235953 230300 223767 216115
55631 216115 208949 203759 200160 197484 196110 195825 195091 193467 192712 194208 197656 203320 212477 224003 233814
55616 233814 240026 245652 253606 261807 266162 265976 263376 259427 253910 247291 240023 231220 220613 210493
55602B10493p200m782m269l933k724j985k409k801k767l248l702k223P77K397
55588A71624J604M29J59k05r54o20R43J750R58N0j09n13j483j823j258r87j280
55571A68285j156p77j310k217j760k75K04l01J80J569J505l88j798j972k873n082
55555A51834o278n176l643l455l908l922l785l641k915k106k534l625l282j456
55541A02108l77o80n84M71P78j25l24R83K045J784J375J539J418J070J843L195
55525A16519K630M9j306K33K334K772K568L138L661L533M360P070R585R862R103
55510A76111R794J2416J5856J9236K1709K2527K2684K4538K8305L1191L1166K9282
55498D44815K6786K2669J5875P675k96q292j6748k4093k8230k9004k7829k6262
$$ plain form
55602 210493 203293 198511 194242 190309 187585 185600 183191 180390 177623 174375 170673 168450 169227 171624
55588 171624 173228 173657 173816 173611 172657 172037 172980 174730 175688 175738 175629 175116 173633 171810 170552 169565 168285
55571 168285 167129 166352 165042 162825 161065 160790 160994 160693 160873 162442 163947 163559 161761 159789 156916 151834
55555 151834 145556 140380 136737 133282 129374 125452 121667 118026 115111 113005 110471 106846 103564 102108
55541 102108 101731 101051 100467 100938 101716 101591 101267 102250 104295 106079 107454 108993 110411 111481 113324 116519
55525 116519 119149 119198 117892 118125 120459 123231 125799 128937 132598 136131 140491 147561 157146 167008 176111
55510 176111 185905 198321 214177 233413 255122 277649 300333 324871 353176 384367 415533 444815
55498 444815 471601 494270 510145 517820 517524 509232 492484 468391 440161 411157 383328 357066
55486C57066k5751k6851k7676k5364k0156j5741j4285j3694j1385q273o801p119
55474A53970p550p422p256p251p239p263o982n547l084j119o11r05j213j591j842
55459H7095j230p6J63q59j813j977k102k491k339j691j717k318j839m0J166R20
55443F8852P62J636K167J357M50O19J084J027J157J775J519l87k636l895m415
55428G1072m481l614k422k669m109m034j631L2j496m168m455k151K16J025M08
55413C7523r84k109j755k14O28j4p43n87n09j176j610j348j440j920j057J307
55397B3992K507J091p63q55j71k48l11L99L76j296k404r64J278J694P76K63k30
55380B5134j540k185q88K96q78k527j390J713L344L049L230M204L783J588k38
$$ plain form
55486 357066 331315 304464 276788 251424 231268 215527 201242 187548 176163 167890 161089 153970
55474 153970 146420 138998 131742 124491 117252 109989 103007 97460 94376 93257 92646 91741 90528 88937 87095
55459 87095 85865 85789 85952 85093 83280 81303 79201 76710 74371 72680 70963 68645 66806 66766 67932 68852
55443 68852 69614 71250 73417 74774 75224 75843 76927 77954 79111 80886 82405 82018 79382 75487 71072
55428 71072 66591 62977 60555 57886 53777 49743 48112 48144 46648 42480 38025 35874 36090 37115 37523
55413 37523 36539 34430 32675 32461 33089 33075 32332 31745 31236 30060 28450 27102 25662 23742 22685 23992
55397 23992 26499 27590 26827 25972 25801 25553 25242 25641 26017 24721 22317 21353 22631 24325 25101 25364 25134
55380 25134 23594 21409 20521 20817 19939 17412 16022 17735 21079 24128 27358 31562 35345 36933 36695
55365C6695q69j670k907k940j402j85m79j335j750j961k060j386P2J413K318L321
55349B4875M457N065M893M134K741J065N31K018M064M382K789J088N15P58J031
55334F4406P11m70j659j205R24K311J111j326k570k446k325k405j884q77r3M62
55318E2665P51q2j986l079k426j890k959l828k516p37j083k158p69K231K853M08
55302C5395j561j040l3m23j246j369j509k161k247j313n66o20m84K45M82l8l7
55285B1475O53J27k401m575l733l24K994M365L710J900J79m87l78o40j454j690
55269A9721p12N17Q22K99j35l2K48P5o63j083j58J427J468o92k515j435J378K535
55251B1065J092o94r86k99L54R60J596J800J534J320J235R72R46J769K731K409
$$ plain form
55365 36695 35826 34156 31249 28309 26907 26722 26243 24908 23158 21197 19137 17751 17823 19236 21554 24875
55349 24875 29332 34397 39290 43424 46165 47230 47761 49779 53843 58225 61014 62102 62617 63375 64406
55334 64406 65117 64647 62988 61783 62707 65018 66129 64803 62233 59787 57462 55057 53173 52296 52203 52665
55318 52665 53416 53334 51348 48269 45843 43953 40994 37166 34650 33913 32830 30672 29903 32134 34987 35395
55302 35395 33834 32794 32761 32338 31092 29723 28214 26053 23806 22493 21927 21307 20823 21068 21550 21512 21475
55285 21475 22128 22255 19854 15279 11546 11222 14216 18581 22291 24191 24370 23883 23505 22865 21411 19721
55269 19721 19009 19526 20348 20647 20512 20480 20728 20803 20140 19057 18899 20326 21794 21102 18587 17152 18530 21065
55251 21065 22157 21463 20477 20178 20532 21492 23088 24888 26422 27742 28977 29949 30895 32664 35395 37804
55235C7804Q22n48r03p79p19q59j586k929l572k281j39O16k80j133j196j300j606
55218A9412j158RN29l7n99n27l49j67M93J146P95J87J224L605M482K388o88k130
55200B8615j733r47q21j558k588k533p12J148O54j518k121j30J732J335K18O10
55184A9651J831J933R86M07J89p27k081k310p95J353K641K394R21o61j191o34
55168B3907j31m64j110j178n38L56J010J039N22M02J465K943L244K265J489J571
55152C6792J432L12q17p61J36P18N42Pl45q3Q51J821K052J530O30p54k535l357
55134C8171j920P00J910R43m08o29j92n2l11q88j783k094o83J638K477J059q05
55117C7133j644k043k537k021J62K382K700J398Q8o09j067j390j423j249q17R9
$$ plain form
55235 37804 38626 38078 37175 36396 35677 34818 33232 30303 26731 24450 24311 24927 24647 23514 22318 21018 19412
55218 19412 18254 18263 18792 18755 18156 17629 17280 17113 17606 18752 19547 19734 20958 24563 29045 31433 30745 28615
55200 28615 26882 25935 25114 23556 20968 18435 17723 18871 19525 18007 15886 15756 17488 18823 19041 19651
55184 19651 21482 23415 24401 24808 24997 24270 22189 19879 19084 20437 23078 25472 26393 25732 24541 23907
55168 23907 23776 23312 22202 21024 20486 20842 21852 22891 23413 23815 25280 28223 31467 33732 35221 36792
55152 36792 38224 38536 37719 36958 37094 37812 38354 38361 38016 37933 38784 40605 42657 44187 44817 44063 41528 38171
55134 38171 36251 36951 38861 39804 39396 38767 38575 38523 38212 37324 35541 33447 32764 34402 36879 37938 37133
55117 37133 35489 33446 30909 28888 29050 31432 34132 35530 35618 35009 33942 32552 31129 29880 29063 29162
55101B9162R73P34n00j240q49m29o59n99L42R43J56r31q41j39l67j421j751p47
55083B1837N46R55M21j28L46J888L063K369L48q65l68M43J97n69o90k02J20Ll91
55064B9323q66q68J94J745K415K060K036K938L669L374K650K069J313O49J272
55049E3973L050L853K562R44R25J666J243k28j202j390j789k707l332l035j923
55034E2610n57K50L0m40L2J032R25l27q75j79n3j326k100j032K63J94M9J282K392
55015E2170J527J35N17J477J65k752l710j674O97J404J213J147R83Q65J520K293
54999E7977J568l48j377j227j916l869m530k355M50J143L05L44J704K761K596
54984E3226J839J239J017J415K418L018K047j04j579j262j00K60l41n05N81J813
$$ plain form
55101 29162 30135 30869 30369 29129 28280 27851 27192 26593 26935 27878 28034 27103 26262 26123 25756 24335 22584 21837
55083 21837 22383 23338 23759 23631 23977 25865 28928 31297 31645 30780 30412 30855 31052 30483 29793 29591 29711 29714 29323
55064 29323 28457 27589 27783 29528 31943 34003 36039 38977 42646 46020 48670 50739 52052 52701 53973
55049 53973 57023 60876 63438 64382 65307 66973 68216 67988 66786 65396 63607 60900 57568 54533 52610
55034 52610 52053 52303 52333 51893 51925 52957 53882 53555 52680 52501 52448 51122 49022 47990 48253 48447 48496 49778 52170
55015 52170 53697 53832 54349 55826 55991 53239 49529 47855 48552 49956 51169 52316 53299 54164 55684 57977
54999 57977 59545 59197 57820 56593 54677 50808 46278 43923 44373 45516 45821 46165 47869 50630 53226
54984 53226 55065 56304 57321 58736 61154 64172 66219 66115 64536 63274 63174 63434 63093 62588 63169 64982
54968F4982J661M89J42J248K275J869P37J94l8j080k632l079j725M81K442L928
54952G1894M898M858L475J237p21j346m99P96J325J229J720K877K977J048j170
54937I4598j350K05J208P61J50L54O57K11n01o26k65j81o91j349j470r07m67j267
54919H9070l201m612m118k266o16K11O24P90N53L95J121K605L836M265M135L605
54903I6397K617J671J547K021J868N35q42o99J107K979L130J457j83J37K231M059
54887A20032M225L297K452K029K132L356N640P360P012N359M543N386O689P078
54873A86590O533O170P155R503J1528J1069P946M408K413J477Kk359m922p445
54859B40068r884j1491j1630j0935j0298r463q003o893p364q762r213p985n850
$$ plain form
54968 64982 66643 67132 67274 68522 70797 72666 73403 73597 73559 72479 69847 66768 65043 65524 67966 71894
54952 71894 76792 81650 85125 86362 85641 84295 83796 84592 85917 87146 88866 91743 94720 95768 94598
54937 94598 93248 93453 94661 95422 95572 95926 96583 96794 96293 95667 95402 95221 94530 93181 91711 90804 90337 89070
54919 89070 85869 81257 77139 74873 74257 74468 75092 75882 76435 76830 77951 80556 84392 88657 92792 96397
54903 96397 99014 100685 102232 104253 106121 106656 105814 105115 106222 109201 112331 113788 113605 113742 115973 120032
54887 120032 124257 127554 130006 132035 134167 137523 143163 150523 157535 162894 167437 172823 179512 186590
54873 186590 193123 199293 206448 215951 227479 238548 246494 250902 253315 254792 254794 252435 247513 240068
54859 240068 230184 218693 207063 196128 185830 176367 168364 161471 154107 145345 136132 128147 122297
54846A22297l634j883j249j617j497P6J811J979J005L56j9o77k72K821O980Q744
54830A35221P865P662R874J2421J3235J3119J3125J1978Q334L599K80j294k765
54817B32654n229q371j1309j3147j3402j2695j2154j1594r635o249l619l328m137
54804A17785l862k289p18K81J070J538J160K33k32J41O91O56p0r52j145j26J608
54787A15769K822K793J831M61j161k673l298k850k334k776l872m402l732k515
54773I4063j998k808m226m737l710k209j521j358n81O28P54p18k362k725j943
54758F4549r10J9P60R75O98O63J234J631J055j3m31Q2Q22J208J337J453J432R35
54740G7499j1p75n75P18K379L580M052L959L626L547L974M137K959J111J039L858
$$ plain form
54846 122297 118663 116780 115531 113914 112417 112493 114304 116283 117288 117644 117625 116948 116676 119497 126477 135221
54830 135221 143086 150748 160622 173043 186278 199397 212522 224500 232834 236433 236713 235419 232654
54817 232654 227425 219054 207745 194598 181196 168501 156347 144753 135118 128869 125250 121922 117785
54804 117785 113923 111634 110916 111197 112267 113805 114965 115198 114966 115107 115798 116454 116384 115432 114287 114161 115769
54787 115769 118591 121384 123215 123676 122515 119842 116544 113694 111360 108584 104712 100310 96578 94063
54773 94063 92065 89257 85031 80294 76584 74375 72854 71496 70915 71543 72297 71579 69217 66492 64549
54758 64549 63639 63658 64418 65393 66091 66754 67988 69619 70674 70661 70230 70312 71134 72342 73679 75132 76564 77499
54740 77499 77488 76713 76138 76856 79235 82815 86867 90826 94452 97999 101973 106110 109069 110180 111219 115077
54724A15077P386Q815Q267P968Q750R542R818J0232J0821J0860J0634J1355J2879
54711B42404J3429J1936Q993N295J168k132l030k182k222m121n889n873n048m715
54697B48013m140k287k04L75l55q12l55M56J073J136J89j522k716k655k279k685
54681B31232l376l215k274j399n43J060L379N334O013N560M972N282O436O860
54667B65321N018J455j741l684n368p402q928r628j0820j3121j4675j3468j0303
54654A72656p863p511q426r146q631o572l844k036j543j061J57Q57q1j451j470
54639A14035o38q34k231l185k847j966j191l35N56R87J015J137J135L22q95j043
54623A04022M48K343L113K650K142K701M227N379M871L033J629J748K660L292
$$ plain form
54724 115077 122463 131278 139545 147513 156263 165805 175623 185855 196676 207536 218170 229525 242404
54711 242404 255833 267769 276762 282057 283225 281093 278063 275881 273659 269538 263649 257776 252728 248013
54697 248013 243873 241586 241382 241757 241402 240590 240235 240691 241764 242900 243089 241567 238851 236196 233917 231232
54681 231232 227856 224641 222367 220968 220425 221485 224864 230198 236211 241771 246743 252025 258461 265321
54667 265321 270339 271794 270053 266369 261001 253599 244671 235043 224223 211102 196427 182959 172656
54654 172656 164793 157282 148856 139710 131079 124507 120663 118627 117084 116023 116180 117037 116956 115505 114035
54639 114035 113397 112563 110332 107147 104300 102334 101143 100808 101364 102351 103366 104503 105638 105960 105065 104022
54623 104022 104470 106813 109926 112576 114718 117419 121646 127025 131896 134929 136558 138306 140966 144258
54609A44258L767M476M589L104Q91Q6J379L189L796L204K651L013M031M738M523
54594A91695L900L990N068O323P294Q594J0573J2231J2514J1905J1600J1686J1349
54581C08722J0392R200P585M958J568j619m199o456q247r021q953q980r353r262
54567B76335q164o749n970n789n453m716m254m667n452n374m069k781k913m189
54553B05795n041m711l911l374k954k495k381k670k805k687k937l497l330k302
54539A60700j887k905l911l251j587p41q83o76K92R09M06o20j241j321j321j498
54523A40465j420k78J851L303K447J09j105k53Q62P15J18Q3k49j719k952k224
54507A39753k67J023J537K336L104K677J487J015J206Q98M82J587M017N450M703
$$ plain form
54609 144258 148025 152501 157090 160194 161085 161171 162550 165739 169535 172739 175390 178403 182434 187172 191695
54594 191695 195595 199585 204653 210976 218270 226864 237437 249668 262182 274087 285687 297373 308722
54581 308722 319114 328314 335899 340857 342425 340806 336607 330151 321904 312883 303930 294950 285597 276335
54567 276335 268171 261422 255452 249663 244210 239494 235240 230573 225121 219747 215678 212897 209984 205795
54553 205795 200754 196043 192132 188758 185804 183309 180928 178258 175453 172766 169829 166332 163002 160700
54539 160700 158813 155908 151997 148746 147159 146418 145535 144859 145151 146060 146466 145846 144605 143284 141963 140465
54523 140465 139045 138767 140618 143921 146368 146477 145372 145119 145981 146696 146814 146897 146648 144929 141977 139753
54507 139753 139486 140509 142046 144382 147486 150163 151650 152665 153871 154769 155251 156838 160855 166305 171008
54492A71008L166K485K736L450M577N642N492L781J680N39O62J602K868M097N333
54477B19118O896Q358Q340O413M383M119M922M793L570K652K143Q51r87j721j390
54462B72460k212n043p728q173p091o299n978n070l389j879j386k077l456m422
54448B08257m010k485j087m82j93L17Q88J144R52L51k70k58L15L86l48l55J523
54431B04645L742L979K618J992K676L187L100L502M270L933K714K672M010M312
54417B51352K693J511K370L409K755J909L020M934M984L155J769J875K488K693
54403B90917K337J137q50k275j827j46J133J702K498L650M157L333J441q04k335
54388C04068k043k13J094L39j448k195j625j077j188j446j645k252l343m427n333
$$ plain form
54492 171008 174174 176659 179395 182845 187422 193064 198556 202337 204017 204556 205218 206820 209688 213785 219118
54477 219118 226014 234372 242712 249125 253508 257627 262549 267342 270912 273564 275707 276558 275571 273850 272460
54462 272460 270248 265205 257477 249304 242213 235914 229936 224866 221477 219598 218212 216135 212679 208257
54448 208257 204247 201762 200675 200193 200000 200317 201205 202349 203301 203652 203382 203124 203439 203825 203477 203122 204645
54431 204645 208387 212366 214984 216976 219652 222839 225939 229441 233711 237644 240358 243030 247040 251352
54417 251352 254045 255556 257926 261335 264090 265999 269019 273953 278937 282092 283861 285736 288224 290917
54403 290917 293254 294391 293541 291266 289439 289293 290426 292128 294626 298276 302433 305766 307207 306403 304068
54388 304068 302025 301812 302906 303245 301797 299602 297977 296900 295712 294266 292621 290369 287026 282599 277266
54373B77266o168o581o081m876l531k162q13o0k37o27m98k70n61q42m30m2o82
54356B42805j498p45J318K416J443m2q6J384L154M356M670L967K608J619J751
54341B69120K589L068K700K000J753K110K363J736K93j208k272l011l453l229
54327B74559k288j223n00L5M94N45J12l81r55k223l929m441k793l00J015Q75L41
54310B58943j26q37j538j521q10n2N83J240J562J165N66M73O00M48N45J331J544
54293B64116k88l055m012k532o48L90J595L406L953J836j331k981k891k507k190
54278B52861j281k84p10k612m198m336m019m634n928o573n996m826l897l480l378
54263A96709l276k973k603k520k768k907k659k573l402m819n375m193k183j008
$$ plain form
54373 277266 271098 264517 258436 253560 250029 247867 247054 246994 246757 246130 245632 245362 244801 243959 243529 243487 242805
54356 242805 241307 240562 241880 244296 245739 245697 245611 246995 250149 254505 259175 263142 265750 267369 269120
54341 269120 271709 274777 277477 279477 281230 283340 285703 287439 287732 286524 284252 281241 277788 274559
54327 274559 272271 271048 270548 270583 271077 271622 271734 271353 270398 268175 264246 259805 257012 256712 257727 258602 258943
54310 258943 258817 257980 256442 254921 254111 254059 254642 255882 257444 258609 259175 259648 260248 260696 261241 262572 264116
54293 264116 263828 260773 256761 254229 253581 253971 255566 258972 262925 264761 263430 260449 257558 255051 252861
54278 252861 251580 251296 250586 247974 243776 239440 235421 230787 224859 218286 212290 207464 203567 200087 196709
54263 196709 193433 190460 187857 185337 182569 179662 177003 174430 171028 166209 160834 156641 154458 153450
54249A53450j183j940k689l552m321m041k318l42L50k84r01n14O12J628J913J155
54233A37023n38k368l177k465j000k53j136l100m495m050k260r01j011j811k067
54218A06391j825k019k657k511q29J458K586J700n30k626l400k673j200R6Q59
54203I2820J295J684K046K125J493qj727k470j749m28M04P94J467K299K208P70
54187A03023j044k043k102j761j203k52R43J850K208K332K641L118L198K229J53
54172A13290k135l445l493l109k964k574j218N07J095J90p92o25Q7J15m15m12
54156I4102K65O59M68M31O91K31j420l123l603k956j894n96O21O76q48k418k193
54139G9093m60R09Q99n7j319k275j888J94K333K434O81r54j663k308l119l159
$$ plain form
54249 153450 152267 150327 147638 144086 139765 135724 133406 133064 133414 133130 132229 131715 132327 133955 135868 137023
54233 137023 136485 134117 130940 128475 127475 127222 126086 122986 118491 114441 112181 111280 110269 108458 106391
54218 106391 104566 102547 99890 97379 96550 98008 100594 102294 101764 99138 95738 93065 91865 91961 92820
54203 92820 94115 95799 97845 99970 101463 101455 99728 97258 95509 95081 95485 96279 97746 100045 102253 103023
54187 103023 101979 99936 97834 96073 94870 94618 95561 97411 99619 101951 104592 107710 110908 113137 113290
54172 113290 111155 107710 104217 101108 98144 95570 94352 94859 95954 96144 95352 94727 94814 94929 94514 94102
54156 94102 94367 95026 95494 95925 96616 96847 95427 92304 88701 85745 83851 83255 83876 84552 83704 81286 79093
54139 79093 78633 79542 80441 80384 79065 76790 74902 75096 77429 79863 80544 79590 77927 75619 72500 69341
54123F9341k339j745j545p33N04N31q57j709j228j225k745l641j706J662L282
54108E5847K401Q41K0r7K35Q06R21J43r11j611k239k733j958K52J760Q45j011
54091E3511j200K42J269J332J645K577L285L581L857L465J610m79r10l17q83k204
54075G0381j400K007M542L467M73j020r8J703K878K746J054j407k805k172n71
54060G9778N26R88J313J302O04l20p88q31p23m26j29m75j539k464k739k844k931
54043F8302k115r6J612J378l43j684j750j212q71o73j78P29J667K100J941J765
54027G0572K005K124J461O91J180K701L342K261J058J323K210J784j07j801k172
54012H8632j654j132r11p97m57L30J350K008J980J414M26q98j818j343J55Q94
$$ plain form
54123 69341 67002 65257 63712 62979 63483 64014 63157 61448 60220 58995 56250 52609 50903 52565 55847
54108 55847 58248 59089 59109 59012 59247 60053 60974 61117 60206 58595 56356 53623 51665 51917 53677 54522 53511
54091 53511 52311 52553 53822 55154 56799 59376 62661 66242 70099 73564 75174 74695 73785 73468 72585 70381
54075 70381 68981 70988 75530 78997 79470 78450 78352 80055 82933 85679 86733 85326 82521 80349 79778
54060 79778 80304 81292 82605 83907 84511 84191 83403 82572 81849 81423 81294 80819 79280 76816 74077 71233 68302
54043 68302 66187 66091 67703 69081 68738 67054 65304 64092 63221 62548 62370 63099 64766 66866 68807 70572
54027 70572 72577 74701 76162 76853 78033 80734 84076 86337 87395 88718 90928 92712 92605 90804 88632
54012 88632 86978 85846 84935 84138 83681 84011 85361 87369 89349 90763 91189 90291 88473 87130 87285 88179
53996H8179O1r00m41P86J245J123J754K887K636M51j747k160j422j260j872j912
53980H7408o64J027K169K893L736M291L566J686K38M19J555K242K409L181M870
53965A21026O327O530N734M653L528K662K868M499O500P380O830N785N188N291
53951A94801N834O258N916M618L019K054K034K480K627J924L31j573k929l293
53937B24101k947k531k501k911l334l128k110r34m92j117k636m659o283o276m595
53922A77647l108l452m673m618l311k811l678m030k827j775k479l710l303j406
53908A32466P0L27J67K16K87K49K83M20P06J382K056J641L8j023q6J924K985K558
53890A46666J579P03J20L62J621K795K882K675L398M207L281J077K29J900M326
$$ plain form
53996 88179 88240 87340 86899 87685 88930 90053 91807 94694 97330 97781 96034 93874 92452 91192 89320 87408
53980 87408 86744 87771 89940 92833 96569 100860 104426 106112 106350 106769 108324 110566 112975 116156 121026
53965 121026 127353 133883 139617 144270 147798 150460 153328 157827 164327 171707 178537 184322 189510 194801
53951 194801 200635 206893 212809 217427 220446 222500 224534 227014 229641 231565 231896 230323 227394 224101
53937 224101 221154 218623 216122 213211 209877 206749 204639 203705 203213 202096 199460 194801 188518 182242 177647
53922 177647 174539 171087 166414 161796 158485 155674 151996 147966 145139 143364 140885 137175 133872 132466
53908 132466 132536 132863 133030 133246 133533 133782 134065 134485 135191 136573 138629 140270 140308 139285 139199 141123 144108 146666
53890 146666 148245 148948 149068 149430 151051 153846 156728 159403 162801 167008 170289 171366 171595 173495 177821
53875A77821N500N373M855M300L869L932M388M741N235O604Q279Q473O656M347
53861B54373K659P98j796l549k762m61O89q1p99N52L748O938Q592Q452P165N377
53845B89895L353J434M89J246L279N392O967Q126Q625Q008P043P354Q881R239
53831C69331O829L178P48l79j698l144l150j713j015k380m385n014m236l404l085
53816C46483k824k521k845m219o136p595p981p435o647o172n996n831n717n856
53802B68708n913n186l725k650k924m212n448o055o032n314l929k660k607l765
53788B08288m630l805j636J64M49l26j009j256j677k683l642l588k533j629j865
53773A78622k907l472k772j367n70j062k098k140n00J718K757K194J230P83K24
$$ plain form
53875 177821 183321 188694 193549 197849 201718 205650 210038 214779 220014 226618 234897 243370 250026 254373
53861 254373 257032 257830 256034 252485 249723 249262 249951 249870 249071 249623 253371 260309 268901 277353 284518 289895
53845 289895 293248 294682 295171 296417 299696 305088 312055 320181 328806 336814 343857 351211 360092 369331
53831 369331 376160 379338 380086 379707 378009 374865 371715 370002 368987 366607 362222 357208 352972 349568 346483
53816 346483 343659 341138 338293 334074 327938 320343 312362 304927 298280 292108 286112 280281 274564 268708
53802 268708 262795 257609 253884 251234 248310 244098 238650 232595 226563 221249 217320 214660 212053 208288
53788 208288 203658 199853 198217 198381 198830 198504 197495 196239 194562 191879 188237 184649 182116 180487 178622
53773 178622 175715 172243 169471 168104 167534 166472 164374 162234 161734 163452 166209 168403 169633 170416 170640
53758A70640j237k686k351k03J684J738P44M37J146J838J768J223Q12R64J867
53743A78384L080L401K067P8n02J164L858N780O173N308L760K245J510J735K320
53728B20361K654K842L190L490L322K897K805L023K831K020J519K288L921N036
53714B62199M967M392L973L257J579m80j626j766k172l377m138l253j456m42n46
53699B61111o68j90K28j41j155k326l371l904l364j719J81J270J096Nj197j755
53683B44101j667j764k665l824m123l338k396k237l060m454n560n307l381j012
53669A99313O3n22j589j981j541p24j94o21j908k773k176q85l79n68k35M93J74
53652A83947j247j902q47N28Q27M96L38N9m43j69J128J865R42l75n12M5K03N35
$$ plain form
53758 170640 169403 166717 164366 164163 165847 167585 168329 168766 169912 171750 173518 174741 175553 176517 178384
53743 178384 181464 184865 186932 187010 186508 187672 191530 197310 203483 208791 212551 214796 216306 218041 220361
53728 220361 223015 225857 229047 232537 235859 238756 241561 244584 247415 249435 250954 253242 257163 262199
53714 262199 267166 271558 275531 278788 280367 279887 278261 276495 274323 270946 266808 263555 262099 261657 261111
53699 261111 260443 260253 260481 260340 259185 256859 253488 249584 246220 244501 244682 245952 247048 247053 245856 244101
53683 244101 242434 240670 238005 234181 230058 226720 224324 222087 219027 214573 209013 203706 200325 199313
53669 199313 199376 198854 197265 195284 193743 193019 192825 192204 190296 187523 185347 184462 184083 183515 183280 183773 183947
53652 183947 182700 180798 179951 180479 181306 181802 182140 182199 181756 181587 182715 184580 185522 185147 184635 184680 184883 185418
53634A85418J893L197K972J988J841J991R19l96O40L912O227N712L915K715J839
53619B24783O06k22K24J323K163K881L626L554K210R17J329L242M872M796K924
53604B59228K37j712j740j77J424K066K102K036J781J566K259L851M739L735J797
53589B83192N90J41o84j984k590j890n52O40J494J904J665J056P08P01N10J10
53573B85011K13J020J600J172L45J87M50j18j687k731k064m95L41J18k96n37q50
53556B81679p24Q39L250M279L029J504J873L423L906K996K364K765L156K890K862
53541C20091L830N090N538N043M130L210K663K797L302L419L012K736K897L087
53527C70845L144L526M307M816M719M426M015K826Q86k51Q30L411N171M617K380
$$ plain form
53634 185418 187311 190508 193480 195468 197309 199300 200219 199823 200463 204375 210602 216314 220229 222944 224783
53619 224783 225389 225167 225391 226714 228877 231758 235384 238938 241148 242065 243394 246636 251508 256304 259228
53604 259228 259465 257753 256013 255836 257260 259326 261428 263464 265245 266811 269070 272921 277660 281395 283192
53589 283192 283782 283923 283239 281255 278665 276775 276223 276863 278357 280261 281926 282982 283690 284391 284901 285011
53573 285011 285224 286244 287844 289016 289361 289548 289998 289880 288193 285462 283398 282903 283244 283362 283066 282529 281679
53556 281679 280955 281794 285044 289323 292352 293856 295729 299152 303058 306054 308418 311183 314339 317229 320091
53541 320091 323921 329011 334549 339592 343722 346932 349595 352392 355694 359113 362125 364861 367758 370845
53527 370845 373989 377515 381822 386638 391357 395783 399798 402624 403510 403259 404089 407500 412671 417288 419668
53512D19668L20k58L71R64Q89Q25J467K138J679L19n55m21r4j32k08j85l64l82
53494D26041N28J779J723L71j40J187K517K129J184J576K671K497J192P39J816
53479D47810L211M185N173O039N847M847M829O633Q771R316Q097O391N450N914
53465E32513P708R841J1184J1879J3177J5370J6918J6442J4742J3920J5003J7359
53453F96056J9991K2347K3969K4495K4351K4685K6089K7816K8714K8562K8104
53442I75179K8057K8795L0703L3896L7379L9562M0150M0615M1919M2771M1558
53431A380584L9248L8520M0028M1559M1469M0912M1614M3135M3914M3862M4136
53420A838981M5018M5854M6674M8151M9867N0154M8122M4795M1827L9834L8258
$$ plain form
53512 419668 419988 419730 420101 421065 421954 422779 424246 426384 428063 428382 427827 427406 427312 427180 426972 426787 426423 426041
53494 426041 426569 428348 430071 430442 430302 431489 434006 436135 437319 438895 441566 444063 445255 445994 447810
53479 447810 451021 455206 460379 466418 472265 477112 481941 488574 497345 506661 514758 521149 526599 532513
53465 532513 540221 550062 561246 573125 586302 601672 618590 635032 649774 663694 678697 696056
53453 696056 716047 738394 762363 786858 811209 835894 861983 889799 918513 947075 975179
53442 975179 1003236 1032031 1062734 1096630 1134009 1173571 1213721 1254336 1296255 1339026 1380584
53431 1380584 1419832 1458352 1498380 1539939 1581408 1622320 1663934 1707069 1750983 1794845 1838981
53420 1838981 1883999 1929853 1976527 2024678 2074545 2124699 2172821 2217616 2259443 2299277 2337535
53409B337535L6202L3085K9080K5138K2228K0467J9189J7813J6282J4894J3998
53398B585911J3540J2621J0139O331K972J255P3k610p188j2232j6435j9531k1615
53385B553231k2906k4310k6942l0723l4267l6443l7286l7435l7477l8009l9398
53374B188035m1181m2373m2493m1746m0328l8300l6095l4381l3298l2625l2335
53363A772880l2216l1183k8258k4151k0584j7872j4580r870m812o95K688O331
53351A597678J0550J5050J9634K4062K7806L0540L2422L3710L4809L6716M0377
53340A903354M5184M9307N1992N4356N7349O0357O2719O5208O8681P2468P5555
53329B566530P8386Q1846Q5315Q7527Q8868R0924R3946R6579R8189R9687J01612
$$ plain form
53409 2337535 2373737 2406822 2435902 2461040 2483268 2503735 2522924 2540737 2557019 2571913 2585911
53398 2585911 2599451 2612072 2622211 2628542 2631514 2632769 2632842 2630232 2623044 2610812 2594377 2574846 2553231
53385 2553231 2530325 2506015 2479073 2448350 2414083 2377640 2340354 2302919 2265442 2227433 2188035
53374 2188035 2146854 2104481 2061988 2020242 1979914 1941614 1905519 1871138 1837840 1805215 1772880
53363 1772880 1740664 1709481 1681223 1657072 1636488 1618616 1604036 1594166 1589354 1588659 1591347 1597678
53351 1597678 1608228 1623278 1642912 1666974 1694780 1725320 1757742 1791452 1826261 1862977 1903354
53340 1903354 1948538 1997845 2049837 2104193 2161542 2221899 2284618 2349826 2418507 2490975 2566530
53329 2566530 2644916 2726762 2812077 2899604 2988472 3079396 3173342 3269921 3368110 3467797 3569409
53318C569409J03074J03343J03081J03196J03414J02917J01526R9488R6697R2961
53308D579106Q8507Q3570P7965P1691O5391N9568N3737M7239M0550L4883L0573
53297E232780K6635K2024J6571J0493L736l675j1240j8656k6811l7328n0748o5453
53285E098328p8710q8805r6002j01539j06158j09802j12417j14454j16379j18022
53275D056040j18811j18554j17646j16439j14791j12587j10428j09197j08783
53266C028804j07813j05105j01030r6898r3344q9999q6533q2990p8857p2933o4952
53255B048350n6654n0277m6272m3293m0058l6262l1818k6546k0949j6264j3030
53244A666927j0362p238l861r08J908N380R158J1774J2642J2986J4263J6449J8599
$$ plain form
53318 3569409 3672483 3775826 3878907 3982103 4085517 4188434 4289960 4389448 4486145 4579106
53308 4579106 4667613 4751183 4829148 4900839 4966230 5025798 5079535 5126774 5167324 5202207 5232780
53297 5232780 5259415 5281439 5298010 5308503 5312239 5308564 5297324 5278668 5251857 5214529 5163781 5098328
53285 5098328 5019618 4930813 4834811 4733272 4627114 4517312 4404895 4290441 4174062 4056040
53275 4056040 3937229 3818675 3701029 3584590 3469799 3357212 3246784 3137587 3028804
53266 3028804 2920991 2815886 2714856 2617958 2524614 2434615 2348082 2265092 2186235 2113302 2048350
53255 2048350 1991696 1941419 1895147 1851854 1811796 1775534 1743716 1717170 1696221 1679957 1666927
53244 1666927 1656565 1649327 1645466 1644558 1646466 1651846 1661004 1672778 1685420 1698406 1712669 1729118 1747717
53231A747717K0538K2963K5977K8602L0241L1832L4733L8662M1725M2763M2980
53220B108733M4445M7386M9871N0300M9301M8572M8503M7905M5865M2873L9893
53209B623647L7174L4407L1527K8835K6650K5195K4485K3825K1956J8371J4316
53198B910388J1646J0623R405O001K36o343j2093j6487k0187k4349k9814l6566
53186B802460m3732n0097n4915n8520o2226o7055p2264p5642p5847p4015p2290
53175B095857p1164o9350o6186o2792o0455n9135n8332n8242n9003n9592n8815
53164A412791n6981n5393n4505n3586n2191n0684m9235m7391m4975m2490m0162
53153H65198l7562l4579l1918l0018k8222k5711k2694j9978j7842j6114j4942
$$ plain form
53231 1747717 1768255 1791218 1817195 1845797 1876038 1907870 1942603 1981265 2022990 2065753 2108733
53220 2108733 2153178 2200564 2250435 2300735 2350036 2398608 2447111 2495016 2540881 2583754 2623647
53209 2623647 2660821 2695228 2726755 2755590 2782240 2807435 2831920 2855745 2877701 2896072 2910388
53198 2910388 2922034 2932657 2942062 2948063 2948299 2941956 2929863 2913376 2893189 2868840 2839026 2802460
53186 2802460 2758728 2708631 2653716 2595196 2532970 2465915 2393651 2318009 2242162 2168147 2095857
53175 2095857 2024693 1955343 1889157 1826365 1765910 1706775 1648443 1590201 1531198 1471606 1412791
53164 1412791 1355810 1300417 1245912 1192326 1140135 1089451 1040216 992825 947850 905360 865198
53153 865198 827636 793057 761139 731121 702899 677188 654494 634516 616674 600560 585618
53142E85618j4553j4414j3584j2003j0642j0190j0309j0438j0693j1388j2205
53131D55199j2330j1404r920q724q341q698r229r319q796p994p279o660o031n567
53117C34907n574o035o585o871o680n866m495l105k298k083j929j669j785k629
53103B77303l765m516m651m180k983j340m08j227l195m416l813k253j300j480
53089B37776k153k591k675k690k864k984k395p13J287J934K76k709m793m368j709
53074B08629J247K287P27j821k897j754j9N15R0J64J010J362N50k47N04K549M044
53057B16940L702K108P95N02O27L16m97j269j701j917j944j681j458j899k920
53042B09704l434k605r74K60O33M79L0o89j291j364j320j919k793k574r71M05
$$ plain form
53142 585618 571065 556651 543067 531064 520422 510232 499923 489485 478792 467404 455199
53131 455199 442869 431465 421545 412821 404480 395782 386553 377234 368438 360444 353165 346505 340474 334907
53117 334907 329333 323298 316713 309842 303162 297296 292801 289696 287398 285315 283386 281717 279932 277303
53103 277303 273538 269022 264371 260191 257208 255868 255460 254233 251038 246622 242809 240556 239256 237776
53089 237776 235623 233032 230357 227667 224803 221819 219424 218711 219998 221932 222208 219499 214706 210338 208629
53074 208629 209876 212163 212890 211069 208172 206418 206399 206914 207004 207168 208178 209540 210090 209843 210347 212896 216940
53057 216940 220642 222750 223545 224047 224674 224990 224493 223224 221523 219606 217662 215981 214523 212624 209704
53042 209704 206270 203665 202691 202951 203584 204063 204093 203404 202113 200749 199429 197510 194717 192143 191172 191577
53026A91577Q4j261j849j241m68l1P29K093L187L376L276L558L667K959K302K964
53010B14922M292M167K126K62L30J428J672Q97J14p50k605m906n527l469l47J468
52994B14074J155n19k532m226n283n762n907n617m714l677l416l949m190l430
52980A62007k221j441j261j493k113k936l538l932m551n102m515k699j202j210
52966A23793j820j534m65J60Qk95o18j325k022j786o74J50K2n10p07m24J85R03
52948A13041J200N65p41j922k575k844k813k462k056j867j650j115o38p16j004
52933I2403p79j47K43M87J225K222K387J316j40j016r86N8J973L695L820K245
52917A09006M22m60o01o23n46k78j93n30p42k07P39R90j98k364m022l807j810
$$ plain form
53026 191577 191661 190400 188551 187310 186842 186811 187540 189633 192820 196196 199472 203030 206697 209656 211958 214922
53010 214922 219214 223381 225507 225769 226099 227527 229199 230096 230210 229460 226855 221949 216422 212953 212606 214074
52994 214074 215229 214710 212178 207952 202669 196907 191000 185383 180669 176992 173576 169627 165437 162007
52980 162007 159786 158345 157084 155591 153478 150542 147004 143072 138521 133419 128904 126205 125003 123793
52966 123793 121973 120439 119974 120134 120142 119847 119229 117904 115882 114096 113422 113572 113594 113084 112377 111953 112138 113041
52948 113041 114241 114806 114065 112143 109568 106724 103911 101449 99393 97526 95876 94761 94123 93407 92403
52933 92403 91624 91477 91720 92207 93432 95654 98041 99357 99217 98201 97215 97273 99246 102941 106761 109006
52917 109006 109428 108968 108367 107744 107198 106920 106727 106197 105455 105248 105987 106977 106779 104415 100393 96586 94776
52900I4776M30J477J247M05o75j637j708p12R8l65j142n22J177J922R84k46n66
52883I4943k31M60J823L381L720K597J551J538J595Q49K14P62J901K583K978L510
52867A24174L398J983M93P50K532L908L899L358L253L379K924J540k84j441j157
52852A52709l5L47o02j728j961j837k292k889k625j881k047l434m796m959m029
52837A17941k892k294k446k935l011k305j100J93J284J582M34j749l460l730l015
52822I2497k029q09M33P51j39j043r67n75p91j083n77P1l27j387j664r06j99k06
52804H1050o93j424k123j919k84J704K458J957J387J199R97R57J593K396K310
52789I1565J500R35N48m25j432j039M67J045n3j103m49J531L692N573O683O095
$$ plain form
52900 94776 95206 96683 97930 98335 97660 96023 94315 93603 93701 93336 92194 91672 92849 94771 95755 95509 94943
52883 94943 94712 95172 96995 100376 104096 106693 108244 109782 111377 112226 112440 113202 115103 117686 120664 124174
52867 124174 127572 129555 130048 130798 133330 137238 141137 144495 147748 151127 154051 155591 155307 153866 152709
52852 152709 152674 153021 152419 150691 148730 146893 144601 141712 139087 137206 135159 131725 126929 121970 117941
52837 117941 115049 112755 110309 107374 104363 102058 100958 101151 102435 104017 104451 102702 99242 95512 92497
52822 92497 90468 89659 90092 90843 90704 89661 88694 88119 87328 86245 85668 85739 85412 84025 82361 81455 81256 81050
52804 81050 80357 78933 76810 74891 74607 76311 78769 80726 82113 83312 84309 85266 86859 89255 91565
52789 91565 93065 94000 94548 94123 92691 91652 92119 93164 93111 92008 91559 93090 96782 102355 109038 115133
52773A15133L910J832J163J187N88o51j703k271k443j972p19P19J581J674J043
52758A19071k82j645j844o61M98M03k61N9J597L180L971M251M420M111K722M73
52742A40063j481k107j575r52p43l55O13J363J083M82P46J444J065l97j186n65
52726A37498j56j593m111n487m528j827J163K972K844J291m59j885l325m597m694
52711A13106l402k023j803k485l126l301k870j679l08n6j207k273j903o72k1k59
52695H5718o63p81n65L6P08O64k05r39j005j105j549j210M11J494K23k109k626
52678G6497r72M00Qr09q19l0M64O06P51P40M41L07O44R75P75K23k52o15r49j109
52658G7176r39m49M03J484K096J543L40o7Q66J952J753K97j139j411k60J761L556
$$ plain form
52773 115133 119043 120875 122038 123225 123813 123162 121459 119188 116745 114773 114054 114773 116354 118028 119071
52758 119071 118789 117144 115300 114639 115137 115540 115279 115338 116935 120115 124086 128337 132757 136868 139590 140063
52742 140063 138582 136475 134900 133948 133205 132850 133463 134826 135909 136391 137137 138581 139646 139249 138063 137498
52726 137498 137342 135749 131638 126151 121623 119796 120959 123931 126775 128066 127607 125722 122397 117800 113106
52711 113106 109704 107681 105878 103393 100267 96966 94096 92417 92109 92053 90846 88573 86670 85998 85977 85718
52695 85718 85055 84274 83709 83745 84453 85117 84912 83973 82968 81863 80314 79104 79515 81009 81232 79123 76497
52678 76497 75525 75925 75933 75024 74205 74175 74639 75245 75996 76736 77177 77484 78128 79103 79878 80101 79849 79234 78285 77176
52658 77176 76237 75788 76191 77675 79771 81314 81654 81587 82453 84405 86158 86455 85316 83905 83645 85406 88962
52641H8962M077L148J588K74o63j559k459k959k650j575l61N9p94k363l462l214
52625G6049j563Q92L097L861K759P93m56m60n9o0k68j48K44M86N04N35O60P33
52607H7599P64J021J749K884L922M143L155J380j05l47P68K370L144K464J196
52592A16107R65K174L288K716Q90l52j73N39P24K48o48j791k606k337j275p58
52576A17711j303j752j085j04k34j339k029j742j206r86q29o47r88k052l025k941
52560I5449j806n05O6l77j271j555o43P25J245O40j01k69l44q57j208n54O66J186
52542I0487P17L03P27J468J565Q69pm25r0Q50J648J399R2j117j220o11m37r77
52524I5241j354q81k7K10m85j426j670r86j63j92j030j543q96L85J261J592J928
$$ plain form
52641 88962 93039 96187 97775 98049 97386 95827 93368 90409 87759 86184 85823 85882 85088 82725 79263 76049
52625 76049 74486 75378 78475 82336 85095 85888 85432 84972 84913 84853 84585 84437 84681 85167 85671 86206 86866 87599
52607 87599 88363 89384 91133 94017 97939 102082 105237 106617 106512 106165 106933 109303 112447 114911 116107
52592 116107 117072 119246 122534 125250 126140 125788 125615 126154 126878 127126 126478 124687 122081 119744 118469 117711
52576 117711 116408 114656 113571 113467 113233 111894 109865 108123 106917 105931 105102 104455 103467 101415 98390 95449
52560 95449 93643 93138 93204 92827 91556 90001 89358 90083 91328 91968 91867 91598 91254 90397 89189 88635 89301 90487
52542 90487 91204 91507 92234 93702 95267 96136 96129 95704 95614 96464 98112 99511 99603 98486 97266 96655 96218 95241
52524 95241 93887 93006 92979 93189 92704 91278 89608 88622 88459 88267 87237 85694 84798 85183 86444 88036 89964
52507H9964K219J828Q32K23M53P81N84L77P70J149M05j357k714k584j348k50p8
52490I1254m60l13R35K492K971K053Q52M82Q74J330J428Q90n60k347k878j335
52474I7668Q79J671Q85K17P51J773K118J507M11m41l23P39J462O66q83j317m83
52457A07300k42j367j958k30K517L411J763l75j037k30R09J453R34m74j698j541
52441A09135j08J195J292L94p39j601j779r77K95P73k0r44o30O50J392Q06m28
52424A08706j325j579j327o53K07P13N78K28J94L33J26l52l87L24J096J036J41
52407A08059p40j014r81j257j800j769m66J624L090K972J765P78P08J203J613
52392A13785J605R88j96j102m86J575L028J964q57k757k269n49N49N09j59j074
$$ plain form
52507 89964 92183 94011 94843 95066 95519 96300 96884 97261 98031 99180 99585 98228 95514 92930 91582 91332 91254
52490 91254 90794 90481 91416 93908 96879 98932 99784 100266 101140 102470 103898 104788 104228 101881 99003 97668
52474 97668 98547 100218 101103 101320 102071 103844 105962 107469 107880 107439 107116 107855 109317 109983 109100 107783 107300
52457 107300 107058 105691 103733 103503 106020 109431 111194 110819 109782 109552 110461 111914 112848 112374 110676 109135
52441 109135 109027 110222 111514 111908 111169 109568 107789 106812 107107 107880 107860 106916 106286 106936 108328 109134 108706
52424 108706 107381 105802 104475 103822 104029 104742 105320 105548 105742 106075 106201 105849 105462 105786 106882 107918 108059
52407 108059 107319 106305 105324 104067 102267 100498 100032 101656 104746 107718 109483 110261 110969 112172 113785
52392 113785 115390 116378 116182 115080 114594 116169 119197 121161 120304 117547 115278 114729 115278 115787 115628 114554
52376A14554j881j798m64J144J624R49L90P06J224R64J1o63l21Q25J844J879R52
52359A21939p0m90o09j115j881j960r08N41J403J503J328J223J187J136J015O98
52343A24940J22n52j046j159q10q2P46J412J926K347K367J591L20m66k80K07L
52326A31586j013k089k386j430O82K994L993K972R56k91j61M00K34q20k008k449
52310A31170j769m29O58J109J494K388L295L242K228J301J202J622J906J748J187
52295A52352M71o2m35j119j942j551P76L193L050N93j185q16j88q98j318N45L129
52278A54595L127L58k116k500k100k265k281j274p6L60P04J913L288L414K269
52263A57416J005J89m87j050r93j91P59J203R46K92r0L98J523K280K090J467J033
$$ plain form
52376 114554 112673 110875 110411 111555 113179 114128 114518 115224 116448 117412 117423 116760 116439 117264 119108 120987 121939
52359 121939 121869 121379 120770 119655 117774 115814 114906 115447 116850 118353 119681 120904 122091 123227 124242 124940
52343 124940 125062 124510 123464 122305 121495 121413 122159 123571 125497 127844 130211 131802 132122 131656 131376 131583 131586
52326 131586 130573 128484 126098 124668 125350 128344 132337 135309 136265 135974 135813 136213 136447 135627 133619 131170
52310 131170 129401 128972 129630 130739 132233 134621 137916 141158 143386 144687 145889 147511 149417 151165 152352
52295 152352 152823 152761 152326 151207 149265 147714 148490 151683 154733 155326 154141 153325 153137 152239 150921 151466 154595
52278 154595 157722 158080 155964 153464 151364 149099 146818 145544 145468 145828 146532 148445 151733 155147 157416
52263 157416 158421 158610 158123 157073 156080 155889 156648 157851 158797 159089 158999 159397 160920 163200 165290 166757 167790
52246A67790N65k85q90k96J274K611L131L407L981M557M606M096L340K638K357
52231B02882K804L701M270M268M394N204O013N670M299L342L638M231L724K236
52217B60676J153J160J561J713J995K734L140K381J168J058K227L085K320M88
52203B86859p39l35J357L027L378K262J053J278K767L765L018J065p30j560j304
$$ plain form
52246 167790 168355 168070 167180 166884 168158 170769 173900 177307 181288 185845 190451 194547 197887 200525 202882
52231 202882 205686 209387 213657 217925 222319 227523 233536 239206 243505 246847 250485 254716 258440 260676
52217 260676 261829 262989 264550 266263 268258 270992 274132 276513 277681 278739 280966 284051 286371 286859
52203 286859 286120 285785 287142 290169 293547 295809 296862 298140 300907 304672 307690 308755 308025 306465 305161
$$ [...]
##END NTUPLES=NMR SPECTRUM
##END=
