##TITLE=Coffee green (ROVE100E + 1.5mL buffer 50/50,  450uL extracto + 50uL (D2O+TMS))
without heating, vortex and centrifuged, temperature 0oC.
##JCAMPDX= 6.0         $$ Bruker NMR JCAMP-DX V2.0
##DATA TYPE= NMR SPECTRUM
##DATA CLASS= NTUPLES
##ORIGIN= Bruker BioSpin GmbH
##OWNER= Administrator
$$ 1.72 TOPSPIN		Version 2.1
$$ 2012-05-22 16:17:50.559 -0700  Administrator@X
$$ Compression mode = diff/dup
##.OBSERVE FREQUENCY= 400.131882
##.OBSERVE NUCLEUS= ^1H
##.ACQUISITION MODE= SIMULTANEOUS (DQD)
##.ACQUISITION SCHEME= undefined
##.AVERAGES= 64
##.DIGITISER RES= 22
##SPECTROMETER/DATA SYSTEM= spect
##.PULSE SEQUENCE= noesygppr1d
##.SOLVENT NAME= H2O+D2O
##.SHIFT REFERENCE= INTERNAL, H2O+D2O, 1, 14.97974
##AUDIT TRAIL= $$ (NUMBER, WHEN, WHO, WHERE, PROCESS, VERSION, WHAT)
$$ ##TITLE= Audit trail, TOPSPIN		Version 2.1
$$ ##JCAMPDX= 5.01
$$ ##ORIGIN= Bruker BioSpin GmbH
$$ ##OWNER= Administrator
$$ $$ C:\Bruker\TOPSPIN/data/jwist/nmr/11-coffee-green-quantification-2/391/pdata/1/auditp.txt
$$ ##AUDIT TRAIL=  $$ (NUMBER, WHEN, WHO, WHERE, PROCESS, VERSION, WHAT)
(   1,<2011-11-18 17:47:48.685 -0500>,<Administrator>,<TOPSPIN>,<go>,<TOPSPIN 2.1>,
      <created by zg
	started at 2011-11-18 17:38:54.044 -0500,
	POWCHK enabled, PULCHK disabled,
       configuration hash MD5:
       DA 63 81 1B EF 4C B5 72 B4 DF EA D9 B4 DB 4C 08
       data hash MD5: 64K
       FA 23 C9 8B 61 BC B2 EB C4 EB DB 14 D2 43 C4 3E>)
(   2,<2011-11-18 17:48:39.325 -0500>,<Administrator>,<TOPSPIN>,<proc1d>,<TOPSPIN 2.1>,
      <Start of raw data processing
       efp LB = 0 FT_mod = 6 PKNL = 1 PHC0 = 0 PHC1 = 0 SI = 32K 
       data hash MD5: 32K
       32 A2 5C 9D C0 8C A6 FD 48 B4 F3 4A 58 61 A7 99>)
(   3,<2011-11-18 17:48:39.700 -0500>,<Administrator>,<TOPSPIN>,<proc1d>,<TOPSPIN 2.1>,
      <pk PHC0 = 24.87305 PHC1 = 0 
       data hash MD5: 32K
       C8 C9 E5 FE 5C F6 82 BB AF 85 43 C9 83 C2 C5 32>)
$$ ##END=
$$ 
$$ $$ hash MD5
$$ $$ 42 CE 92 B0 9D E0 08 C9 CB 79 EA 83 B5 79 08 DB
##$RELAX= 
##$RELAX= 
##$RELAX= 
##$RELAX= 
##$RELAX= 
$$ Bruker specific parameters
$$ --------------------------
##$DU= <Z:>
##$EXPNO= 391
##$NAME= <11-coffee-green-quantification-2>
##$PROCNO= 1
##$TYPE= <nmr>
##$USER= <jwist>
##$ACQT0= -8.17507012126584
##$AMP= (0..31)
100 100 100 100 100 100 100 100 100 100 100 100 100 100 100 100 100 100
100 100 100 100 100 100 100 100 100 100 100 100 100 100
##$ANAVPT= -1
##$AQSEQ= 0
##$AQ_mod= 3
##$AUNM= <au_prof>
##$AUTOPOS= <>
##$BF1= 400.13
##$BF2= 400.13
##$BF3= 400.13
##$BF4= 400.13
##$BF5= 400.13
##$BF6= 400.13
##$BF7= 400.13
##$BF8= 400.13
##$BYTORDA= 0
##$CFDGTYP= 0
##$CFRGTYP= 9
##$CHEMSTR= <none>
##$CNST= (0..63)
1 1 145 1 1 1 1 1 1 1 1 1 1 1 1 1 1 1 1 1 1 1 1 1 1 1 1 1 1 1 1 1 1 1 1
1 1 1 1 1 1 1 1 1 1 1 1 1 1 1 1 1 1 1 1 1 1 1 1 1 1 1 1 1
##$CPDPRG= <>
##$CPDPRG1= <>
##$CPDPRG2= <>
##$CPDPRG3= <>
##$CPDPRG4= <mlev>
##$CPDPRG5= <mlev>
##$CPDPRG6= <mlev>
##$CPDPRG7= <mlev>
##$CPDPRG8= <mlev>
##$CPDPRGB= <>
##$CPDPRGT= <>
##$D= (0..63)
$$ [...]
150 150 150 150 150 150 150 150
##$TP07= 0
##$TPNAME0= <>
##$TPNAME1= <>
##$TPNAME2= <>
##$TPNAME3= <>
##$TPNAME4= <>
##$TPNAME5= <>
##$TPNAME6= <>
##$TPNAME7= <>
##$TPOAL= (0..7)
0.5 0.5 0.5 0.5 0.5 0.5 0.5 0.5
##$TPOFFS= (0..7)
0 0 0 0 0 0 0 0
##$TUNHIN= 0
##$TUNHOUT= 0
##$TUNXOUT= 0
##$USERA1= <user>
##$USERA2= <user>
##$USERA3= <user>
##$USERA4= <user>
##$USERA5= <user>
##$V9= 5
##$VALIST= <valist>
##$VCLIST= <CCCCCCCCCCCCCCC>
##$VD= 0
##$VDLIST= <DDDDDDDDDDDDDDD>
##$VPLIST= <PPPPPPPPPPPPPPP>
##$VTLIST= <TTTTTTTTTTTTTTT>
##$WBST= 2048
##$WBSW= 25
##$XGAIN= (0..3)
0 0 0 0
##$XL= 0
##$YL= 0
##$YMAX_a= 4513760
##$YMIN_a= -1570865
##$ZGOPTNS= <>
##$ZL1= 120
##$ZL2= 120
##$ZL3= 120
##$ZL4= 120
##$ABSF1= 0
##$ABSF2= 0
##$ABSG= 0
##$ABSL= 0
##$ALPHA= 0
##$AQORDER= 0
##$ASSFAC= 0
##$ASSFACI= 0
##$ASSFACX= 0
##$ASSWID= 0
##$AUNMP= <proc_prof1d>
##$AXLEFT= 0
##$AXNAME= <>
##$AXNUC= <1H>
##$AXRIGHT= 0
##$AXTYPE= 0
##$AXUNIT= <>
##$AZFE= 0.1
##$AZFW= 0.1
##$BCFW= 0
##$BC_mod= 0
##$BYTORDP= 0
##$COROFFS= 0
##$CY= 15
##$DATMOD= 1
##$DC= 0
##$DFILT= <>
##$DTYPP= 0
##$F1P= 7.82497349650455
##$F2P= 6.21922071582177
##$FCOR= 0.5
##$FTSIZE= 32768
##$FT_mod= 6
##$GAMMA= 0
##$GB= 0
##$INTBC= 1
##$INTSCL= 1
##$ISEN= 128
##$LB= 0
##$LEV0= 0
##$LPBIN= 0
##$MAXI= 10000
##$MC2= 0
##$MEAN= 0
##$ME_mod= 0
##$MI= 0
##$NCOEF= 0
##$NC_proc= -7
##$NLEV= 6
##$NOISF1= 0
##$NOISF2= 0
##$NSP= 0
##$NTH_PI= 0
##$NZP= 0
##$OFFSET= 14.97974
##$PC= 1
##$PHC0= 24.87305
##$PHC1= 0
##$PH_mod= 1
##$PKNL= yes
##$PPARMOD= 0
##$PPDIAG= 0
##$PPIPTYP= 0
##$PPMPNUM= 2147483647
##$PPRESOL= 1
##$PSCAL= 0
##$PSIGN= 0
##$PYNMP= <proc.py>
##$REVERSE= no
##$SF= 400.13
##$SI= 32768
##$SIGF1= 0
##$SIGF2= 0
##$SINO= 400
##$SIOLD= 32768
##$SPECTYP= <>
##$SREGLST= <1H.CDCl3>
##$SSB= 0
##$STSI= 32768
##$STSR= 0
##$SW_p= 8223.6842105263
##$SYMM= 0
##$S_DEV= 0
##$TDeff= 65536
##$TDoff= 0
##$TI= <>
##$TILT= no
##$TM1= 0
##$TM2= 0
##$TOPLEV= 0
##$USERP1= <user>
##$USERP2= <user>
##$USERP3= <user>
##$USERP4= <user>
##$USERP5= <user>
##$WDW= 1
##$XDIM= 32768
##$YMAX_p= 483153354
##$YMIN_p= -4935023
##$CURPLOT= <Network HP LaserJet P1505>
##$CURPRIN= <$Network HP LaserJet P1505>
##$DFORMAT= <normdp>
##$LAYOUT= <+/1D_H.xwp>
##$LFORMAT= <normlp>
##$PFORMAT= <normpl>
##$SURQMSG= 1
$$ End of Bruker specific parameters
$$ ---------------------------------
##NTUPLES= NMR SPECTRUM
##VAR_NAME=  FREQUENCY,     SPECTRUM/REAL,   SPECTRUM/IMAG
##SYMBOL=    X,             R,               I
##VAR_TYPE=  INDEPENDENT,   DEPENDENT,       DEPENDENT
##VAR_FORM=  AFFN,          ASDF,            ASDF
##VAR_DIM=   32768,         32768,           32768
##UNITS=     HZ,            ARBITRARY UNITS, ARBITRARY UNITS
##FACTOR=    0.250966925370065, 1,           1
##FIRST=     8223.43324360093, 147772,       -571963
##LAST=      0,             -173217,         -354048
##MIN=       0,             -4935023,        0
##MAX=       8223.43324360093, 483153354,    0
$$ Real data points
##PAGE= N=1
##DATA TABLE= (X++(R..R)), XYDATA
$$ [...]
23038 418615 511928 237556 796674 136777 683442 529199 974067 34465 683937 350631
23028 350631 521263 673259 540402 658477 174208 726321 468497 855616 366062 919525
23018 919525 610925 804215 614782 334316 162106 475369 418709 874202 439057 353242
23008 353242 922765 467480 439574 574236 1001135 801752 810011 502886 986127 842795
22998 842795 717772 426911 648228 734148 972986 586905 424001 549506 677294 667583
22988 667583 992053 99575 278270 222240 640253 664075 333688 1055090 743247 751500
22978 751500 1060467 910206 925718 1030396 363525 1254798 589248 777566 824373 519858
22968 519858 1134085 1460816 914817 937174 1271968 848013 1204778 1152738 818494 841483
22958 841483 995799 1577581 1125824 1488254 901938 1138873 902785 1342829 1661550 1110720
22948 1110720 2361586 2276555 3215652 4084171 5514798 6236088 7899055 9947939 11851071
22939 11851071 14839255 16661308 18597495 20123226 21977862 22261325 23295793 23080098
22931 23080098 22938103 22531428 20728641 18475790 16539274 13847790 12461545 10554348
22923 10554348 8758556 7266973 5275156 4666856 4229496 3959065 4089939 3836386 4022769
22914 4022769 5036952 6081392 7270368 9016149 11575030 13922418 16578291 20416396
22906 20416396 23546218 27287251 30310375 33595461 35859923 38113115 39773945 41059991
22898 41059991 40669611 39994484 38196760 35795218 33858960 30785414 27630288 24435700
22890 24435700 21291425 18185251 15729813 13968592 11690333 10921089 10624009 10861523
22882 10861523 10519424 11321515 12300405 13540556 14766911 16718149 17614233 19658186 20061443
22873 20061443 20725849 20763646 20340431 20128616 19436715 18303496 16416077 15543061 13514630
22864 13514630 11318194 10258711 8491104 7544367 5994628 4855910 4027892 3269074
22856 3269074 3176055 2262761 2101767 2110673 1698802 1541010 1693745 1148558 1512307 909041
22846 909041 1161911 1139158 1181260 1097838 1209459 1040517 705456 1126726 821474 745264
22836 745264 912781 1013775 599963 407673 991105 569373 785679 510747 1150918 1053484
22826 1053484 344177 1170915 1193101 206980 1084950 451386 588551 1068940 455948 801781
22816 801781 1203302 1187266 721236 792309 603612 630711 1032552 995858 728050 788447
22806 788447 759529 1027750 563329 615386 1042941 586003 1146131 600065 961684 1196381
22796 1196381 510398 486783 530459 901011 435441 473680 549123 752069 658160 416997
22786 416997 926303 646812 135298 551670 673263 716491 726133 893607 542141 530933
22776 530933 922974 447668 428008 784496 1092505 510905 1046047 689235 726404 832826
22766 832826 522795 489214 855530 564574 577671 683203 249194 1042056 857424 525952
22756 525952 599817 469725 651261 634831 298405 1053031 719537 817395 355255 530474
22746 530474 609119 353274 609037 488537 312978 367120 492830 569798 662849 381064
22736 381064 679162 432693 79400 207173 562566 726273 742903 528897 607988 431988
22726 431988 893034 704931 742069 317416 77084 621657 209180 287486 309720 197507
22716 197507 433124 726326 545137 543898 363195 709348 703386 533982 878204 1180737
22706 1180737 764082 437762 440104 313891 407831 601951 532700 694474 849284 250803
22695 822051 599954 554671 420728 631058 622803 865563 962618 259365 743609 683822
22685 683822 579064 780168 362100 536544 692978 912263 1354901 713692 216545 626751
22675 626751 475775 201713 718136 473031 511016 642978 906843 541330 677336 624689
22665 624689 811143 -55352 553053 918218 1072260 26082 514723 991930 761062 581826
22655 581826 464080 630486 763832 375858 570879 428650 872190 609693 601835 758833
22645 758833 800244 525301 289106 824729 759281 729077 438552 939872 537956 578088
22635 578088 413110 593210 869762 753890 798596 1053808 578788 430638 681821 638366
22625 638366 1370364 349187 1199580 1158497 690929 524664 1072188 1001033 1307387 988369
22615 988369 1123572 977097 1375156 608674 957750 884813 1048042 617265 494173 1036346
22605 1036346 793181 575853 335790 853288 1008578 771492 878961 1060402 1207147
22596 1207147 1284349 829236 799215 1607462 955439 1233063 655533 1314095 1475776 1145658
22586 1145658 1410769 1022975 1187158 858973 702119 769501 1145981 969833 1072759 1128503
22576 1128503 730248 1030761 674366 904016 957700 544088 731060 1017349 707533 746038
22566 746038 943248 911106 778045 1057259 759525 939610 1244771 1110649 610225 1141663
22556 1141663 1217827 1075001 1145805 1048845 827350 729258 613261 1224107 1023107 1174290
22546 1174290 743555 1334408 642505 712339 1038299 1240355 946676 957629 942637 748606
22536 748606 842664 497144 483850 746760 1070805 246676 840208 855298 805863 1104064
22526 1104064 830982 1476273 845319 749164 1211385 758196 760628 1222379 513503 1088806
22516 1088806 571449 1325191 506303 1136211 886704 712211 828774 898141 737969 1058072
22506 1058072 927699 809315 583577 853418 949583 707411 1102504 911917 676440 1083915
22496 1083915 910824 1210044 1098307 1013956 1243712 988179 691093 1451876 972193 876236
22486 876236 1189397 1057405 1102430 1221748 576079 1181163 974643 714732 1178006 548302
22475 1534446 890068 843492 786398 1027478 860979 912761 671086 988309 1036359 1128397
22465 1128397 996191 861535 1023734 1214848 583510 903463 571146 1340924 723599
22456 723599 910973 814169 644463 616356 790980 921768 635501 1515587 1024677 873273
22446 873273 870612 869099 1289409 740898 902305 1011232 821425 779126 832694 985228 914695
22435 914695 976007 776805 1056233 962879 740550 1260915 958041 843405 778842 1033958
22425 1033958 1020353 804048 1027970 910424 1332043 852032 1023924 735402 884803 900588
22415 900588 803875 734150 847069 597170 1275325 1016186 542675 1013568 1020099 690318
22405 690318 818043 1039374 986823 1188076 851092 1255640 1212818 773335 992273 1310936
22395 1310936 887581 1243978 1394983 990729 734411 895907 1257446 1032799 998001 951527
22385 951527 1318298 863410 852841 984190 350408 1264235 774090 942344 789294 1003268
22375 1003268 1141352 893139 763104 1050224 702119 1188064 1103751 360814 897787 745281
22365 745281 1082212 1099871 1285654 1061638 1004516 1320568 966007 1049872 718424 917540
22355 917540 1172649 872286 1127805 901201 1214295 967354 683142 997517 1278455 940513
22345 940513 1197969 915150 1022841 775112 751791 1246361 858468 1294141 1209371 645890
22335 645890 766005 1300529 1496710 1464630 2336315 2187213 2239139 2334079 2347950 2183213
22325 2183213 2520064 2395241 2091975 1745612 1359326 1143936 1355343 1126878 1716332
22316 1716332 829001 1467509 1207260 1236981 1281567 1182085 1075699 1396040 1553924 1239606
22306 1239606 1402900 1084898 1390612 1519525 1066263 1518186 1409644 638281 1343996
22297 1343996 1082626 1571911 1157659 1562113 1831527 954630 1239824 708870 1250420
22288 1250420 1042300 1549193 803277 1049765 1608851 1497316 861575 1210487 1158834 1305746
22278 1305746 1544570 1624702 1596067 1498803 1424386 961663 1189260 973630 1537637 1207789
22268 1207789 1279177 1180472 995214 1367212 931598 1341372 1778411 1197049 1753379 1872392
22258 1872392 996750 1516071 1551148 1879126 1273725 1608388 1584674 1022572 1679331 1482081
22248 1482081 2134730 1530291 1977151 1654806 1856985 1438365 1701257 1913996 2011532 1473653
22238 1473653 1606458 1794356 1365378 1569975 1451528 1587893 1524009 1588489 1157186 1336848
22228 1336848 1634320 1709644 1343703 1185118 1387535 1287417 1561085 1593635 1403298 1369333
22218 1369333 1446315 1449242 1462311 1520289 1189998 1483049 1386272 1320622 1565792 1199080 1612691
22207 1612691 1637951 1407854 942593 1616142 1506041 1360192 1677690 1283389 1199263 2097739
22197 2097739 2025505 1419506 1215034 1519830 1384020 1729443 1248819 1978984 1250610 1152861
22187 1152861 1559913 918796 1500913 1084786 1166941 1177476 1199206 1118240 2042675 1222528
22177 1222528 1696398 1632919 1442322 1248576 1086347 1539324 1310415 1590452 1205283 1596859
22167 1596859 1329326 1514821 1418473 1319110 1805790 1237700 1052024 1213299 1038813 963988
22157 963988 1505301 1187560 1267339 1476726 989152 1645960 998261 1046551 1564949 1214024
22147 1214024 1120961 1093016 834652 1020370 1031739 1545999 1353016 1721624 1177235 1463500
22137 1463500 1780983 1434808 1236724 1071201 1493441 1721907 1342970 1779776 1115128
22128 1115128 1422596 975646 1074794 1063252 1267642 1283179 1002400 1286972 823297 1320889
22118 1320889 1196715 1134624 1220078 1437971 1181475 989172 1522214 1323337 1334404 1333183
22108 1333183 807675 1067808 1863232 1157176 1045481 1372796 1483577 1081522 1145059 1396804
22098 1396804 1613402 1107751 1304876 1616048 1855351 1445880 1014412 866376 1460702
22089 1460702 1304677 1407757 1603559 1047869 1873274 1366288 1332574 994378 1774322 1235845
22079 1235845 1127470 1919225 1565247 1207613 1134853 1512629 1270433 1358210 1351988 1405575
22069 1405575 887140 1350972 1436018 1485253 1505027 1492856 1476009 1569798 1460216 1725060
22059 1725060 1854497 1627911 1789784 2040525 1444073 1748867 1711433 1560603 1778950 1764585
22049 1764585 1961599 1567355 1523687 1868407 1756637 1510442 1597248 1875518 1682051 1469027
22039 1469027 1784518 1786778 1250285 1515223 1793152 1661453 1499975 1360200 1807872 1718621
22029 1718621 2104256 1819416 1552738 1746572 1759537 1757212 1415288 1821930 1767588 1629034
22019 1629034 1445390 1702108 1838633 1343377 1045833 1929538 1566767 1733063 1506672
22010 1506672 1276495 1959745 1469437 1736840 1596538 1629239 1458583 1645195 1529954 1835956
22000 1835956 1603779 1228222 1613509 1343314 1766395 1173481 1323796 1054061 1524672
21991 1524672 1697453 1420518 1741057 1613200 1592638 1660910 1628509 1458341 1592005 1800276
21981 1800276 2016093 1659073 1061819 1487867 1675851 1758257 1436934 1321752 1419884 2030586
21971 2030586 1845167 1533745 1530385 1782514 1665453 1536577 1983223 1540900 1488695 1839464
21961 1839464 1377991 1697078 1926137 1690558 1416140 1635696 1642928 1829588 1410777 1586104
21951 1586104 1983836 1996621 2021272 1519552 1838840 1049802 1862553 1297235 1720710 1852231
21941 1852231 1398355 1705914 1611410 2058098 1759734 2087825 1495954 1794750 1302199 1459479
21931 1459479 1875710 1654543 1848667 1370839 1627475 1710471 1777335 1904227 1400754 1145571
21921 1145571 1439651 1432767 1813188 1546310 1563437 1672302 1881053 1677153 1998194 1784317
21911 1784317 2084249 1824279 1708576 1533259 1765359 1432690 1595426 1746972 1459845
21902 1459845 1770166 1728581 1613638 1479850 1684353 1635066 1678112 1678757 1561237 2218152
21892 2218152 1605523 1146543 1919500 1484417 1471408 2128662 1136368 1064710 1554527 1568087
21882 1568087 1406110 1669376 1627880 2037889 1457729 1997791 1686208 1868008 1867277 2018709
21872 2018709 2301746 1736630 1329532 1446755 1470395 1468573 1359994 1548939 1480344 1465511
21862 1465511 1434657 1632246 1669705 1676424 1961406 1595684 1476179 1721154 1455434 2022525
21852 2022525 1283195 1571967 1503127 1691277 977738 2299386 1322965 1272202 1371068 1932651
21842 1932651 1718501 1745832 1457150 1686735 1534980 1680475 1295901 1695394 1348612 1643846
21832 1643846 2043298 1225329 1694442 1338401 1394195 1664105 1141212 1847774 1430479 1851911
21822 1851911 1465961 1489219 1993188 1657312 1456354 1790297 1786863 1397505 1697699 1569865
21812 1569865 1473023 1553167 1376730 863384 1638449 1433257 1423371 1420166 1711283 1392431
21802 1392431 1611668 1265522 1811269 1391159 1229540 1643108 1267567 1420675 1149278
21793 1149278 1319856 1410855 1268167 1321427 1838947 1940818 1570437 1370556 1580749 1209912
21783 1209912 1528506 1634164 1166481 940274 1269572 1306743 1385188 1370416 1478897 1552517
21773 1552517 1354430 994419 1478660 1326203 1555688 1739885 1709417 1485014 1677452 1362173
21763 1362173 1744164 1525974 2170987 1441345 1957727 1895573 1519929 1780553 2218203 2083593
21753 2083593 2137376 2119785 1727400 2534135 2455539 2260887 2392333 2861149 2950562 3502719
21743 3502719 3569490 4116082 4380200 5304198 5424762 7252262 7998987 9509467 10323622
21734 10323622 11001185 12132411 12957984 13271672 13400359 12525112 12529839 11694967 10527530
21725 10527530 9839979 8642467 8093551 7173634 6892167 6562470 6272274 6150691 7092700
21716 7092700 7249991 8223796 8428369 9746225 10969710 12328259 13280911 14265143 15936278
21707 15936278 16804336 17564674 18530436 18902425 19430812 18930799 19222302 18302201 17480707
21698 17480707 16266177 15460521 14356335 12954498 11789220 10631938 9483782 8611223
21690 8611223 7489853 6723970 6700483 6371421 6091477 6414319 6372431 7364862 7576757 8460406
21680 8460406 9431517 10265197 11466239 11827983 12563875 12026094 12465174 11936604 11930743 10737171
21670 10737171 9708024 8664011 7684297 6347421 5139805 5035057 4076916 3956298 3602151
21661 3602151 3211580 3045523 3628625 3200264 2512486 2417000 2384056 2176233 1794356 1958611
21651 1958611 1750669 2144715 2194903 1702078 1547059 2151269 1510115 2007647 1644378 2133601
21641 2133601 1581090 1603617 1325566 1985102 1541525 1785505 1358797 1612466 1594390 1636819
21631 1636819 1622787 1693038 1297333 1838992 2026131 1627492 1558048 1659413 957923 1230122
21621 1230122 1369324 1370519 1229536 971534 1169650 895810 1344642 1641852 1347661 1295009
21611 1295009 1309715 1428891 1363943 1445022 1456187 1757247 1515758 1458059 1362073 1485427
21601 1485427 1865376 1462409 967999 1160410 1576889 1397426 1617849 1511326 984216
21592 984216 1198862 1018964 1655195 1332600 1134515 1220102 1774692 1576867 1575830 1392242
21582 1392242 1665872 2069320 1542348 2018888 1473319 1517741 1615918 1520135 1901253 1791577
21572 1791577 1576011 1583996 1465279 1619315 1886494 1220530 1463295 1149306 1255059 1304727
21562 1304727 1340036 1508638 1175184 1725178 1480468 1891624 1810164 1755665 1492157 1245311
21552 1245311 1406937 1264795 1532037 1746665 663839 1341213 1402075 1188409 711709 1173413
21542 1173413 1644235 1773285 1326716 1770624 1782664 1410196 1535997 1718211 1956790 1581976
21532 1581976 1350797 1266429 991714 1651288 1553184 1405309 1778311 1227671 1607341 1709061
21522 1709061 1662657 1921795 1371679 1771680 1869872 1629971 1830866 1986050 1432899 1326579
21512 1326579 1822753 1734451 1586626 1733327 1437198 1476367 1986586 2251610 1448762 1625917
21502 1625917 1390458 1513060 1998911 2065614 1505769 1572930 1512965 1957022 2069430 1916544
21492 1916544 1659671 1482766 1737320 1134603 1279231 1853784 2048401 1544314 2208938
21483 2208938 1810619 1711516 1762239 1842964 1916815 2008998 1832782 1422642 1732678 1542905
21473 1542905 1556876 1411252 1802720 1906835 1685150 1784844 1581208 1965605 1280224 1795723
21463 1795723 1653489 1764373 2427036 1864392 1979647 1768728 1685597 1726236 1877187 1526108
21453 1526108 2066832 2125881 2010867 1733453 1522703 1786030 1838958 1746298 1821187 1921719
21443 1921719 1435602 1878501 1643945 1917755 1558888 1475089 1604022 1830435 1926311 1753086
21433 1753086 1696693 1411615 1413436 1714202 1730685 1683922 1206361 1986048 1809957 1501185
21423 1501185 1659027 1646808 1880893 1737787 1914923 1860118 1683597 1840326 1762763 1256461
21413 1256461 1855515 1102988 1494143 1339887 1533926 1866464 2040157 1746573 1585463
21404 1585463 1620560 1972820 1619274 1724889 1746745 1467435 1768070 1779729 1612468 1317665
21394 1317665 1473836 1929203 1404631 1916385 1746107 1607497 1636507 1135437 1657408 1850484
21384 1850484 1565411 1980867 1827499 1726473 1644435 1976417 2052666 1789631 1587490 1484229
21374 1484229 1860888 1852784 2199637 1178545 2020674 1965632 2104761 2150785 1979928 1823538
21364 1823538 1767909 1832947 1445515 1842118 2001005 1671202 1403069 1874240 1760099 1874026
21354 1874026 1825551 1592063 1777079 1986806 1657387 1854861 1394014 2209505 2071645 2320370
21344 2320370 1445725 1588361 1861677 1600124 1893669 2339094 2102546 1748561 2343222
21335 2343222 1834811 1896764 2525179 2684925 1693405 1646953 2506531 1973059 1844696 2049339
21325 2049339 2037097 2041761 2178888 2425092 1919051 2069343 2578378 2361799 2302179 2269948
21315 2269948 2410467 2509397 2410809 2023204 2156889 2022165 2432396 2518317 2723286 2828981
21305 2828981 2507397 2928163 2431626 2651064 3054028 3023125 2554683 2964502 2922975 2919656
21295 2919656 3293486 3505507 3439585 3509383 3810967 3627598 4122629 3727694 4126062 4073268
21285 4073268 4324012 4926932 4996681 4894975 5425442 5646015 5971489 6210471 6582508 6640966
21275 6640966 7778084 8006763 8922929 9105661 9301770 11100347 11696363 12864607 14286124
21266 14286124 16018800 18684603 21042957 24068855 27983831 32057688 36662413 42482372
21258 42482372 48141840 53665799 59461910 64284815 67890953 70551406 71999529 71251610
21250 71251610 69681637 66192179 62192042 56278208 50707616 45543522 39123503 33617278
21242 33617278 29554342 25437243 22096573 19516347 16992022 15157987 13759349 12301923
21234 12301923 11194751 10249532 9521379 9218771 8231288 7258234 7427268 7060260 6023857
21225 6023857 5942364 5899542 4925586 4788562 4469836 4497384 4148156 3948976 4429506 4112205
21215 4112205 4019834 3831881 3315186 3512805 3571854 3142829 2748254 2769228 3139143 2911220
21205 2911220 2983778 2874670 2919271 2469317 2587078 2074542 2565909 2450433 2323029 2181559
21195 2181559 2862163 2809730 3037497 2546078 2450276 2660987 2492542 1767376 2407136 2579932
21185 2579932 2178286 2728622 2525854 2075036 2463538 2340612 2083452 2246258 1924196
21176 1924196 1776283 2075957 2005532 2022233 2331977 1687064 2228536 1643659 2000889 2225318
21166 2225318 2482929 2401872 2542771 2740555 2592783 2198975 1711023 2119891 2032555 2415431
21156 2415431 1655360 2335956 1966342 2223237 2291152 2386464 2069242 2060156 2231774 2770669
21146 2770669 1684207 2234944 2311764 1734684 2160692 2236636 2375097 2423787 1633535 2176769
21136 2176769 2271394 2394192 2388374 2002021 2141046 2307571 2083153 2476085 2523478 1946087
21126 1946087 2517205 2104857 2254034 1827953 2172667 2236388 1648033 1966490 2662055 2032635
21116 2032635 1574123 2330818 1591181 2175112 2207155 1725466 2058278 2151903 2396236 2119125
21106 2119125 1962806 2215875 2320929 2094048 2314525 2483895 2378954 2202000 2255478 2468813
21096 2468813 2414370 2516630 2510174 2977766 2107022 2070922 2539710 2297120 2599324 2649125
21086 2649125 2053583 1960188 2481529 2154561 2478263 2086826 2568018 2502905 2864902 3305093
21076 3305093 2731833 2645919 3039932 3212506 3444177 3228750 3683137 4269725 4025130 4257038
21066 4257038 4168982 3816307 4068662 3874733 3334203 3791871 3071998 3309668 3200101 2991265
21056 2991265 2875766 2628038 2434833 2799978 2486170 2398385 3020844 3235516 2231674
21047 2231674 2647550 2131282 2530713 2734585 2628420 2361371 2352491 2710275 2776816 2480788
21037 2480788 2690216 2391882 3165229 2445090 3000231 2766576 2919145 2536342 3012914
21028 3012914 2973708 3554157 3642190 3079458 3658415 3733879 3113109 3880272 4234020 4595057
21018 4595057 5333362 6266618 7541224 8458551 9041118 10460412 10676825 11479044 11176033
21009 11176033 11384745 10944645 9950306 9174393 8149249 7306977 6786887 6674979 6161338
21000 6161338 6163176 5959314 5583902 5484399 4768782 5360938 4771545 4949599 4767870 4635431
20990 4635431 4966088 4954499 5510837 5681223 6248687 6410361 8212819 9001311 10237167
20981 10237167 11388196 13141453 14167887 14752476 15380364 15018621 15672972 14459607 12817604
20972 12817604 11617088 10030381 8564950 7249470 7155704 6051088 5239402 5103911 4764790
20963 4764790 5070572 4694584 5166709 4747850 4692696 5344407 5414339 5563556 6545192 7778551
20953 7778551 8358404 9386516 11183617 11796223 12912452 12967349 14014822 14215928 14373383
20944 14373383 14853636 14656909 14722181 14426241 14294284 14152209 14594537 14967897 15221972
20935 15221972 14502667 14885819 15276284 15163258 15709962 17214883 19320712 22662108 26108401
20926 26108401 31443053 36405480 40926968 45914178 49616120 52764844 54802470 55877068
20918 55877068 55033407 53346148 49982413 44981208 41011740 35611875 32077817 28302127
20910 28302127 25130758 21611859 18343765 15839293 13301802 11656805 9935347 9344284
20902 9344284 7905020 7773623 7254439 6577504 6091881 5852396 5660392 5240192 5248454 5195399
20892 5195399 5217396 5402292 5197629 4976497 4924164 5301937 5299129 5425592 5508501 6415692
20882 6415692 6672734 7777673 8415108 9168069 10483487 11416225 12123999 12858968 13078084
20873 13078084 13680988 13683986 13311135 13597698 13657384 14297798 15487862 17286645 20226541
20864 20226541 24015326 28615675 34013041 38856906 43376923 47567433 49972894 51933674
20856 51933674 51738277 50525595 47752628 43406566 37584916 32148730 26448780 21358760
20848 21358760 17771021 14239651 12291388 10520753 9046756 8783291 7505251 6893526
20840 6893526 6181897 6302010 5683250 4779820 4673881 4570325 4465999 4416354 3618387 4037130
20830 4037130 4166073 3743467 3293278 3556428 4528140 3195045 4081848 3563767 3850674
20821 3850674 4441290 3782428 3271687 3788878 3655478 3637646 4121585 3607914 2824534 3661303
20811 3661303 3743783 3770785 3344179 3222550 3452927 3681244 3943974 3363258 3479990 3569054
20801 3569054 3333798 3373769 3305005 3702249 3034910 3752382 3984828 3603820 3354518 3497195
20791 3497195 3670695 3836284 3733357 3145007 3435462 2578072 3041899 2755468 3008408
20782 3008408 2717081 2845511 2500370 3025392 2301441 2810449 3007909 3078310 2756884 3149883
20772 3149883 2996848 3128640 2799998 2902092 2831750 2884607 3144740 2573830 2825430 3028872
20762 3028872 3118166 3006865 3369310 3328215 3376119 3239388 2489244 2998180 3199716 2769244
20752 2769244 3017387 2992595 2575101 2786097 2672089 3049354 2503528 2645022 2268497 2844986
20742 2844986 2659657 2399510 2923740 2701845 2569240 2161347 2817332 2843611 2725681 2523443
20732 2523443 1928289 2602372 2747719 2731096 2868185 2370267 2552401 2530638 2757925 3035204
20722 3035204 2813622 2645245 3126202 2847568 3276554 2803812 3237980 3599613 3108287
20713 3108287 2947887 3063904 3712594 3601844 3733237 3788537 4184150 3875326 4162150 3743960
20703 3743960 4131805 4274362 4293264 4183856 4630191 4226995 3995048 3855706 4318272 4071338
20693 4071338 4002428 3811705 3930748 3710959 3671477 3577761 3954335 3639446 3704643 3929314
20683 3929314 3562359 3776482 3479135 4268652 4139722 4087831 4451457 4708684 4627833 5131158
20673 5131158 5302057 4999675 5495935 5230915 5112383 5069433 5033174 4873306 4571621 4376110
20663 4376110 4696744 4215206 3910523 3966969 3566224 4009731 3521779 3566573 3912190 3831597
20653 3831597 3762038 3943230 4107365 4100225 3959965 4285902 4887733 4827948 4683900 5024848
20643 5024848 4889189 4964364 5091509 4940210 5265974 4879182 5124350 4540210 4421324 4124919
20633 4124919 4066698 4135265 3983030 3773439 3874219 3831285 3686998 3761519 3428865 3808020
20623 3808020 3393631 3872238 3585791 3260670 3422864 4068333 3426030 3937241 3925372 3714711
20613 3714711 3743597 4216280 4298167 4116974 4362803 4417235 3635068 4241436 4404046 4245251
20603 4245251 4039632 3941981 3625381 3256460 3717460 3468089 3003998 3062613 2924281 3561461
20593 3561461 2401020 2837233 2940974 3193752 3361221 2739629 3269890 3394957 3323704
20584 3323704 2965237 3759818 3061313 3500295 3102724 3747678 3191452 2918200 3268487
20575 3268487 2327316 2740131 2786646 2970255 3022762 2803754 2614854 2364655 2551620 2783700
20565 2783700 2934977 2624966 2904435 2632605 2988959 2853194 2973814 3282433 2616563
20556 2616563 3519614 3096448 3144590 3520115 3342541 3597370 3164833 2868074 2928899 3178341
20546 3178341 3160313 3356644 3416435 3007624 3254165 3522172 3027752 3353390 3550113 3274779
20536 3274779 3678966 3018135 3758796 4251397 3898075 4159060 4337806 4225831 4276212 4243054
20526 4243054 4386234 4187903 3737434 3769475 3961698 3629987 4078061 3462906 2967210 3428265
20516 3428265 3119480 3367221 2904859 2747560 2593841 2598893 3026729 2724392 2813625 3389277
20506 3389277 3609101 3251589 3427642 3293575 3764635 3225283 3408859 3493730 3718259 3444880
20496 3444880 3015639 3659084 3592864 3664855 3550102 3781845 3262238 3037058 3092482 2798407
20486 2798407 2667037 2665118 2682750 2488374 2903840 2374831 2605263 2537073 2538383 2905545
20476 2905545 2506978 2939533 3141980 2829870 3035561 2958579 2862265 2885572 3585774 3566461
20466 3566461 3748451 3333393 3560803 3276691 3535221 3655707 3365112 3290366 3254822 3088952
20456 3088952 3080413 3523378 3459078 3077801 3067135 3305810 3565103 3213377 3272930 3518422
20446 3518422 3263661 3313295 3046874 3546035 3223964 3443851 3008972 3032018 2805060 3278109
20436 3278109 2986068 3296904 3073121 2845163 3445279 3325075 2814832 3311065 2764351
20427 2764351 2451318 3278222 2927862 3064884 2501280 2992603 3080895 3215435 2824989 2981715
20417 2981715 3123051 2999401 3169075 3346668 3138580 3503875 3320832 3442296 2872137
20408 2872137 3394739 3318126 3074145 2939068 3065854 3410935 3189985 3053578 2968709 3256623
20398 3256623 3294600 3276388 3160598 3504716 3369845 2736798 3314024 3125142 3026689 3193786
20388 3193786 3219148 3711211 3098093 3328251 3751461 3395431 3494470 3820009 3607054 3620710
20378 3620710 3379295 4082974 3931516 3697491 3263513 3697981 3398391 3350340 3463664 3577311
20368 3577311 3213097 3372005 3450778 3259466 3850267 3071102 3257238 3033163 2712337 2810818
20358 2810818 3552839 2984319 3271886 3394030 3671942 3309493 3615436 3325590 4034059
20349 4034059 3777570 3496958 4170593 4048781 4223854 3495140 3595968 3894731 3929757 3964130
20339 3964130 3664324 3956721 3484838 3899168 3723925 3847774 3533459 3245885 3452188
20330 3452188 3566467 3871183 3356438 3859737 3523659 3583731 2968513 3204237 2954928 3205315
20320 3205315 3401044 3057020 3997335 2767038 3186964 2877308 3365073 3612125 3430204
20311 3430204 3925892 3407683 3856619 3691233 4052617 4192199 3404221 4598141 4618964
20302 4618964 4613198 4878697 5058728 4882486 4921999 5190950 5427746 4904225 4551379 5593787
20292 5593787 5286406 5425724 5622234 5932361 5611116 5654009 5514277 5792408 5554401 4920325
20282 4920325 5536971 5468250 5541680 5637697 4919042 5271030 4977676 5238478 4754539 4877787
20272 4877787 4946657 4429910 4335932 4729305 4604649 4910117 4753050 4759204 4701653 4828233
20262 4828233 4941030 4727620 4518745 4654575 5056966 4571945 5052034 5686738 5219437
20253 5219437 5727473 5928447 6419815 6468110 7273202 7894341 8707101 9701985 11032047
20244 11032047 12465996 14123999 15177717 17090076 17811729 19425581 19805544 21537846
20236 21537846 21691415 22220697 21689180 21102922 20978782 19345214 18884846 17811514 16418129
20227 16418129 14672210 12704737 11533495 9274701 8630305 7692980 7288265 6727771 6145019
20218 6145019 6210344 5702956 5477887 5500340 5762074 5361988 5194488 5015117 5407546 4964404
20208 4964404 4449838 5247184 4837516 4290828 4727434 4654169 4854394 4694897 4957993 5356277
20198 5356277 5024032 5140694 5675419 5506584 6063016 5993543 6367689 7071937 7285114 8611512
20188 8611512 8931607 10027071 11574823 13843746 15552560 17097337 18692662 19847841
20180 19847841 21355430 22650594 23920176 25272532 25994299 25791574 25908678 25228087 24225830
20171 24225830 23348117 22141494 21224568 19845607 17387631 15920403 13737225 11912316
20163 11912316 11221231 10684613 9931480 9436703 9572158 9823516 9236057 10077219 10325021
20154 10325021 10893152 11011560 11956230 12953134 13592469 15132335 16436940 18206072 20699499
20145 20699499 22802450 25585733 29709675 33450237 37910017 42731106 47645711 51973509
20137 51973509 56825983 61567286 65514649 69344246 72449425 74215441 75126013 75553743
20129 75553743 74286876 72992988 70248438 67297551 62925531 58065856 53183237 48160091
20121 48160091 42306552 37233081 32805811 28621653 25201477 22581596 19618038 18110420
20113 18110420 16908573 15576049 14516328 13744168 13596936 12887199 12473449 12120038 12894265
20104 12894265 13336899 13899810 14657768 15224384 15748375 16750330 17488487 18741302 19405971
20095 19405971 21014718 21339348 21530452 22049209 22584355 22469516 22215609 21753116 20998120
20086 20998120 20413328 18632824 17944762 16471463 15911609 14582808 14110315 13109783 12373581
20077 12373581 11040360 10634923 10070883 8941261 9412088 9242073 8710397 8933794 8939828
20068 8939828 9455114 9632974 10818101 11678782 12472667 13331694 14951218 15893664 17484670
20059 17484670 18972323 20549152 22479502 24417579 26402823 28111021 30472872 33066931
20051 33066931 34497886 36818680 38438093 39800940 40852016 41325569 41604828 41072799
20043 41072799 39722154 38500288 36794401 34957211 33864070 31259945 29361895 27798321
20035 27798321 25316704 23094136 21023447 18993849 17443252 16413559 15928040 14844527
20027 14844527 15162378 14717288 16033702 17066180 18208559 20083918 22458654 25040732
20019 25040732 28247951 31240268 34007106 36663967 38421329 40917084 42376303 43490861
20011 43490861 44740128 44009444 43121780 41528009 40160743 37863440 35062771 33307796
20003 33307796 29533656 26906214 23736316 20726980 17876519 15235696 12883873 11718228
19995 11718228 10466457 9424208 8902690 8494095 7935407 7340688 7090378 6688801 6232762
19986 6232762 5950186 6128417 5457485 5416914 5014556 4942945 4850452 4815948 5145526 5023535
19976 5023535 5270427 4902166 4906714 4786842 5133882 4878412 4350705 4508148 4835673 4336537
19966 4336537 4475806 4466485 4561817 4845894 4336307 4214510 4510897 4201605 4081990 4041977
19956 4041977 4123731 3764412 4161837 4133238 4069754 4030071 4396400 4195406 4206303 3615470
19946 3615470 4072602 3933120 3789597 4172332 3727291 3653056 3911662 3973351 3863147 3803588
19936 3803588 4016542 3613768 4014695 3700195 3859371 4181609 3764920 3918083 3552164
19927 3552164 3952338 3941926 3677620 4154239 3925568 3445126 4177126 3580532 4112267 4023960
19917 4023960 3958289 4161489 3739041 4196993 4012510 4005647 3898105 3933366 4163476 4116500
19907 4116500 4149365 4734883 4146839 4017636 4727970 4441763 4874330 4117820 4115421 4551815
19897 4551815 4484157 4908957 4436441 4964947 4688612 5049935 5198108 4648876 4799338 5152011
19887 5152011 5251315 4666323 4509044 4782113 4295421 5043252 5168147 4981605 5150568 5351983
19877 5351983 4894352 5144131 5253192 5282536 5123388 5463437 5642737 5517292 5895197 6008796
19867 6008796 5799786 6052924 6171710 5994782 6411502 6264051 5932976 6626572 6103391
19858 6103391 6192911 6752864 6984099 6688927 6550917 6484379 6711739 6718725 6311665 6734543
19848 6734543 7229326 7281098 7051102 8204350 7832676 8101827 8452689 8500032 8464476 9270895
19838 9270895 9462579 9797183 10285924 11231735 12051559 12722841 13343087 14754598 16941634
19829 16941634 18433944 20742108 22156845 24503677 26629681 27793761 29444794 31017985
19821 31017985 32516418 33564872 34864685 36521951 38617330 40361850 44365143 47337685
19813 47337685 50974928 54742363 56838011 59267539 60793585 61539692 60932382 59438667
19805 59438667 56970651 53692375 49976614 46605850 43349906 39844743 37500327 35269233
19797 35269233 33687031 32654122 31579546 31780799 31454265 31680939 31641332 31722594 31925140
19788 31925140 32105687 32134461 32476451 33642426 34210446 36603804 38542676 40585448 42989801
19779 42989801 45039958 46785064 48238745 49125446 49085302 48253755 46371923 44129762 40659178
19770 40659178 37551187 33882968 30937419 27753585 24818792 22140915 19833833 17831126
19762 17831126 15846551 14107881 13234386 12158168 11786268 11003830 10490169 9842603 9002523
19753 9002523 8791162 8439968 8123763 8689846 7329231 7418333 7485434 7742890 7032983 7282722
19743 7282722 6693884 6562645 6413626 6407151 6680338 7264232 6162765 6471450 6820980 6430807
19733 6430807 6775767 6295068 6099641 6429485 6331639 6607550 6205779 6145380 6387892 6007096
19723 6007096 6190805 6320902 5890935 6377229 6536838 6316044 6468153 6133636 5942055
19714 5942055 6298296 6235636 6450019 6061440 6577554 6051864 6026745 5851616 5871194 6187594
19704 6187594 6075155 6352838 6530121 6039131 6395250 5612929 6202482 5530699 5939469
19695 5939469 5833706 5726792 5538851 5908476 5894228 5708381 6009092 5998473 5373840 5827709
19685 5827709 5362910 6086150 5930333 5263546 5529708 5732342 5493839 5432789 5383085 5324783
19675 5324783 4912053 4796751 5082896 4888013 5128764 5351470 5000782 4826408 4984368
19666 4984368 5187198 4726694 4906721 4414908 4824741 4734585 5489076 5044431 5033798 5105725
19656 5105725 4572755 4584840 4419115 4562517 4655741 4016250 4226566 4788145 4557559 4513415
19646 4513415 4215144 4635663 4476128 4870567 4521836 4653382 4653141 4629222 4420284 4696482
19636 4696482 4574220 4945433 4353685 4456434 4647815 4008469 4493857 4398634 4251548 4534073
19626 4534073 4215755 4198919 4272009 4062047 3799191 4398415 3794670 4054550 4530577 4296046
19616 4296046 3708619 4438530 4100826 4296204 4094789 3980444 4140456 4067268 3694747 4049901
19606 4049901 3390192 3468746 4131729 3595434 4065595 3481058 4001416 3443410 4082249 4138173
19596 4138173 3758583 4071411 4004552 3826229 4086874 4198451 4275395 4042220 4204979 4112427
19586 4112427 4239125 4131849 4064683 4005759 4447975 4072660 4057365 4164053 4078489 4361448
19576 4361448 4470613 3819647 4371485 4592892 4085295 4171507 4458183 4087644 4403720 4439922
19566 4439922 4465149 4655523 4820181 4199105 4085917 4467278 4911220 4673867 4294617 4336258
19556 4336258 4731125 4365971 4508646 4352105 3993762 4549179 4534330 4253923 4102361 4109480
19546 4109480 4397161 4032108 4381575 3788857 4340098 3449724 4316195 3800726 3946495
19537 3946495 3905744 3561633 3691979 3966465 3698361 3746882 3131185 3514412 3020776 3595617
19527 3595617 3301809 3510299 3726430 3522102 3582403 3532569 3127862 3605727 3234700 3438864
19517 3438864 3329775 3067961 2829660 2988683 3235406 3276846 3600730 3386864 3804337 3217837
19507 3217837 3781933 3108577 2980211 3327234 3239146 3200962 3435011 3140351 3467440 3519317
19497 3519317 3316021 2911023 3656170 3343950 3292620 3733361 3721030 3878838 3305206 3597214
19487 3597214 3478024 3295763 3495794 3034287 3385878 3632515 2979063 2768009 3293766
19478 3293766 3063116 3020257 3001692 3029012 3051764 2571144 2787078 2656014 2949784 2590480
19468 2590480 2852535 2937920 2534222 2682921 2635629 2654934 2484939 2714723 2947194 2611560
19458 2611560 2610287 2712920 3084203 2240902 2563006 2289221 2490725 2509716 2339244 2186392
19448 2186392 2530977 2468752 2040305 2192828 1975043 1912813 2122847 2399391 2223285 2307655
19438 2307655 1627160 1642057 2211697 1616990 2081603 1958445 1596243 2205595 2169540 1895355
19428 1895355 1859478 1974437 2100504 2008697 2234910 1813001 1788764 1934431 1744966 1783741
19418 1783741 1801320 1870414 1707972 2187724 2246815 2154690 2097650 1899000 1928803 2083577
19408 2083577 1514476 2010230 1714829 1864181 1983644 1646486 1668870 1833556 1672626 1175174
19398 1175174 1716551 1881247 1868755 1759906 1336258 1724411 1480791 1992547 1261756 1658251
19388 1658251 1829069 1682073 1360108 1639747 1760027 1552696 1923346 1483164 1356017
19379 1356017 1779548 1982583 1970329 1471152 1666395 1477212 1991581 1490786 2205614 1702076
19369 1702076 1781720 1685978 1698532 1300182 1964672 1586288 2106144 1609464 1636744 1312406
19359 1312406 1837790 1798620 1762869 2123019 1964447 1538912 1758406 1191764 1476404 1241228
19349 1241228 1675289 1586997 1441824 1300209 1556625 1158243 1419393 1325781 1502824 1026409
19339 1026409 1295354 1056363 1443760 1460337 1293046 1631684 1573544 1610901 1381995 1657136
19329 1657136 1558387 1584216 1627247 1591819 1683446 1614205 1550643 1357877 1420573 1721960 1603975
19318 1603975 1977267 1356298 1859756 1903304 1569865 1738472 1456984 1705516 1655543 1529805
19308 1529805 1356391 1606490 1366518 1698363 1243048 1330645 1746949 2019180 1384989 1452844
19298 1452844 1439408 1564253 1494913 1917825 1567663 1332346 1436159 1650319 1303320 1441940
19288 1441940 1354173 1328545 1778536 1254545 1145688 1326066 1393989 1728797 1858533 1678239
19278 1678239 1472577 1717951 1442638 1628393 1828803 1577943 1608931 1657453 988137 1571260
19268 1571260 1296472 1795982 1976710 1659196 1176414 1587136 1317103 1186661 1682868
19259 1682868 1396681 1849839 1389215 1253177 1134418 1321717 1466559 1429673 1514857 1062630
19249 1062630 1152593 795937 1345700 1706735 1343882 1967815 2520109 2746653 2581182 2868618
19239 2868618 2650629 2422205 3159061 2602363 2924248 2705637 1423325 1422795 1406155 1112251
19229 1112251 1319072 982560 1446157 1562459 1672349 1605342 1214424 1461283 1223770 1694427
19219 1694427 1411317 1269086 1437883 1426570 1378054 1308832 1792111 1568093 1171313 1267250
19209 1267250 1641590 1194746 1325479 1810209 1378194 1355622 1244897 1407600 1322424 1083377
19199 1083377 1515621 1091943 1189874 1127976 1156299 1076044 1102594 1217187 1050957 1312345
19189 1312345 1363729 1200878 1204104 1560033 1169609 1130659 1415633 1440654 1631311 1553489
19179 1553489 1546512 1203967 1944553 712922 1285809 1231046 1293802 1280053 1478161 1247193
19169 1247193 1505624 1208371 1411620 1327343 856247 1401728 1550788 1248116 1158564 1270828
19159 1270828 1718268 1176925 1338068 1362458 1551803 1775092 1557014 1498110 1768919 1259430
19149 1259430 1260137 1604323 1389304 1426745 1885189 1169304 1434952 1981209 1910803 1773173
19139 1773173 1600002 2375020 2089944 2523582 2933695 2706310 3056558 2690005 2765067 2982052
19129 2982052 2781175 3097341 3010216 2903728 3028233 2553987 2511367 2554136 2595822 2951411
19119 2951411 2805706 2930078 2745346 2503965 1952108 2398703 1971256 1665328 1998367
19110 1998367 1974592 1883949 2137356 2287177 1909597 2150343 2731645 1990275 2354251 2701857
19100 2701857 2373412 2259506 2681195 2241580 2326819 1997859 1947735 2462152 2475273 2750600
19090 2750600 2774703 2219723 2300356 2451727 2500490 2706192 2368875 2775902 2833247 2272819
19080 2272819 2492486 2760025 2925856 2666422 2727387 2727820 3482667 3679351 4243316 4610833
19070 4610833 5095136 5894329 7192083 8246326 9549425 10411916 11134729 11575725 11605534
19061 11605534 11212939 11806184 10918334 9550213 8320404 7225782 5880773 5645028 5106013
19052 5106013 4353329 4064305 4444691 4678168 5161973 6081961 7111023 7681616 8585551
19043 8585551 8756220 9562576 9686864 9595114 9593655 9283412 8611148 6934846 5980047 5219705
19033 5219705 5182800 4232810 4927487 4539597 4466421 4497852 5066882 4804451 6064381 6494811
19023 6494811 7846330 9409046 10865605 12161507 13553991 14291720 14675778 15211487 15762412
19014 15762412 14752902 13851652 12242154 10055091 8647037 7512176 6397378 6133601
19006 6133601 6524108 6551284 7235135 8357842 9407050 10182562 10264413 10436130 10703353
18997 10703353 10475750 10173303 9287897 8245498 7105197 5935624 5245821 4914305 4170642
18988 4170642 3966804 4582938 4611918 5148716 5411642 6607110 8046777 8935744 9466636
18979 9466636 9719631 10450220 10231023 10256776 10074146 9458546 8583369 7899437 6840693
18970 6840693 6624719 6139761 6421069 6205117 6509836 6686483 7247767 8279088 9016110
18961 9016110 10219662 11668356 13827812 16689604 19388438 22184230 25578205 30262756
18953 30262756 34118394 39094862 43644594 48716998 51835631 53504380 54782378 53633747
18945 53633747 52716254 50250364 47129273 42345865 37366449 31045163 25623597 21150308
18937 21150308 17411080 14759928 12520786 10731828 9586065 7833276 7259384 6643528
18929 6643528 6303120 5761089 5116779 4955841 4464289 4373934 4264845 4052156 4155740 4036294
18919 4036294 4069241 3712489 3797089 3358738 3917280 3663261 4404262 3921980 3727956 4103113
18909 4103113 3624471 4217615 4131066 4717987 3808926 4664518 4821585 5628400 5050401 5766296
18899 5766296 6015703 6943542 7048887 8054735 8464980 9716282 11714832 13584914 15782854
18890 15782854 18874415 22835081 27809333 32211852 36886083 41042990 43784795 45542412
18882 45542412 46178274 45896867 43695008 40673418 35986289 30507211 25601330 20619726
18874 20619726 17538447 13720858 11392004 9742339 8421605 7499616 6289251 6298366 5505477
18865 5505477 4945291 4407677 4520817 3566761 3392396 2590645 2898284 3222801 2815932
18856 2815932 2871007 2892903 2091429 2119173 2339681 2456395 2832249 2579963 2675119 2512069
18846 2512069 2353073 1643772 2141399 1817449 2123323 2518590 2089307 1874004 2205239
18837 2205239 1758127 1565052 1811109 1796098 1591784 2084872 1818529 1554663 1681350 2276723
18827 2276723 1451510 1161651 1360080 1921143 1201222 1431841 1439451 1567026 1467124 1386781
18817 1386781 1688638 1395837 1122717 1554943 1775688 1659220 1475979 1436417 1895098 1634788
18807 1634788 1625166 1714458 1411584 1512129 1420367 1808699 1796656 1550258 1518286 1585106 1424763
18796 1424763 1639006 1583480 1780617 2182658 2271659 1679529 1784966 1808507 1969582 2038514
18786 2038514 2120354 2436312 1927189 1849047 2218651 1629442 1904787 2037093 1508735 2065738
18776 2065738 2089410 2105335 2142769 1715289 2321712 1636878 2103898 1906733 2231595 2180381
18766 2180381 2419796 2081621 2289775 2026864 2164645 2480219 2476328 2365783 2207860 1981307
18756 1981307 1380055 1882131 1629687 1677897 1797979 1791481 1559097 1749038 1772176 1242853
18746 1242853 1730231 1746770 1762725 1587699 1796556 1508613 1617703 1788128 1532932 1815234
18736 1815234 1568011 1251836 1483339 1885493 1749064 1636616 1862709 1496688 1661731
18727 1661731 931983 1612703 1396341 1157057 1419865 1475674 1586187 1923370 1810613 1487489
18717 1487489 1815497 2158444 1937081 1335086 1845169 1606072 1626115 2152793 1436139 1974499
18707 1974499 1571646 2133061 1578859 1451444 1668732 2030921 1753795 1705840 2207272 1881918
18697 1881918 2105250 1770029 2150188 1933258 1629027 2028315 1747201 1613080 1306125
18688 1306125 1434767 1266262 1771464 1747248 1878057 1084503 1544562 1327287 1006273 1208144
18678 1208144 1402101 1126939 1493346 1352648 1308939 993882 1223932 1416995 1233674 1058808
18668 1058808 1235734 953554 1005197 1334487 806947 1465813 1434593 804453 1054746 1206471
18658 1206471 1234160 863593 1124308 1734302 1305269 1267981 985092 901576 1063860 1159737
18648 1159737 1413557 1451319 1477613 1297326 1530327 1318176 1502087 1207681 1155238 1828821
18638 1828821 1213163 1448130 961948 1175373 1212332 1368356 1003103 1949690 1440859 1149317
18628 1149317 1124029 1313160 913140 1267552 1292492 1411685 1727883 1644676 1812256 1291963
18618 1291963 1525411 1673900 1049980 1644546 1433796 1191988 910059 1888959 1264376
18609 1264376 1556185 1168918 1576509 1362934 1733363 769123 1064801 1390429 1666188
18600 1666188 1176167 1245975 1195339 1169308 1230305 1412264 924562 1319315 1512069 1516739
18590 1516739 1563772 1415126 1608385 1454918 1089375 1530906 1070366 1761387 1413854 1629539
18580 1629539 1625056 1309606 1125033 1715427 933060 1576441 967942 1344925 1022614 1663234
18570 1663234 1220950 1328950 1083690 1144551 1234916 1769452 1314825 1386814 962517 1231442
18560 1231442 1596512 1390801 1048770 1453179 896019 1263853 1624334 1819777 1487511
18551 1487511 1198130 1021281 1426772 1244337 1518005 1486135 1072059 778585 1182038 1272303
18541 1272303 562960 824239 1226699 780952 853191 962269 1105653 988315 1478339 1057737
18531 1057737 953593 1322132 1032696 1128327 823035 1164755 530081 1061592 1049153 1027112
18521 1027112 653361 969730 952379 1079691 1358487 931674 1328372 749200 1321253 946919
18511 946919 656560 859200 1218292 892199 729376 607409 1384241 994435 837803 901346
18501 901346 1151999 800106 1003789 716622 870419 821675 882919 938386 659898 1158095
18491 1158095 1454191 659920 1107741 1117761 1610342 806417 894814 788246 1107065 1165724
18481 1165724 873588 946303 1230096 1079954 866381 913585 881534 929997 979114 1018064
18471 1018064 668072 611325 301713 799647 517862 409057 1054188 1040947 1278770 798581
18461 798581 1343782 1141825 763186 801862 1222938 1180815 923860 738705 1029986 1455877
18451 1455877 1342004 942469 891724 816265 993837 717331 722826 1080365 1048071 1296305
18441 1296305 897592 769884 951673 699847 815974 631196 704256 1008014 1087085 1454484
18431 1454484 957376 1222443 1284908 1558735 786237 687168 1230194 1040232 1276711 1357906
18421 1357906 815279 1244881 946685 1035841 1104806 1050918 1076276 1536714 1966376 1153523
18411 1153523 1176261 1113886 1127125 1518122 1152731 832409 800122 564385 874298 840099
18401 840099 820129 999250 960162 1148348 930991 1299456 1450584 1229161 1072479 1075811
18391 1075811 963456 608283 1446811 461281 966781 870672 1130792 950733 111343 1038538
18381 1038538 635902 831790 1187043 718375 362688 1301647 547466 913704 1195460
18372 1195460 1078180 244037 760702 929514 1305020 783934 780187 1298105 667613 766657
18362 766657 1038024 1073786 639382 981372 1181974 630401 942870 700657 518255 509100
18352 509100 1495291 1011896 993679 1030359 782747 1424791 836488 719297 941071 742748
18342 742748 1103786 1162256 1022202 1495451 806731 712263 832913 822441 987696 1326274
18332 1326274 830066 1097106 887691 1059134 904171 1099995 812284 737499 782841 1031244
18322 1031244 787594 1267961 534027 1106634 774752 1040011 1144202 1520980 1023835
18313 1023835 953138 1239973 1171436 789407 1295051 1133480 1170297 896191 861913 1211965
18303 1211965 900857 1115793 1248738 1099767 641339 353371 1485909 906323 863460
18294 863460 1159521 744743 1039444 1097536 952684 1054051 1350514 1286274 955299 1174619
18284 1174619 1142624 1281334 1172514 819374 1371578 789091 894762 933849 402995 259696
18274 259696 1282820 1068556 649163 1000753 989979 674793 668506 877445 1119873 684929
18264 684929 687421 1017372 649729 629400 1281913 1021326 1039929 1149360 1174441 377933
18253 723821 1088296 1217591 1201248 1002420 1151675 1428583 1093859 1000105 1301411 983778
18243 983778 1383057 872669 1057019 1210305 1163300 1473962 872547 981300 961968 564902
18233 564902 1530478 703245 945948 829539 1192774 975985 906558 885677 914078 851935
18223 851935 1091201 790887 1076295 515362 730194 1107044 831975 918004 974570 1116145
18213 1116145 1518518 848440 710433 1119154 834942 1034065 647967 1094499 848533
18204 848533 827806 775220 608333 990885 1236018 924572 1066400 1025620 1125778 1211456
18194 1211456 795014 1011004 1172962 1016766 1124125 878495 1382267 690146 906669
18185 906669 1306698 1055155 760251 688309 1215036 849938 927192 953871 1130777 681406
18175 681406 753111 959016 865759 618334 1048971 690067 1261724 1580072 939286 942937
18165 942937 1297823 1277446 618866 874637 969192 1138428 951962 1181887 1143250 901005
18155 901005 949212 881300 891727 785950 788065 869282 577263 1182080 721143 1122277 872583
18144 872583 762442 1081871 1205384 801902 717723 771650 925986 728364 1023726 1212060
18134 1212060 793038 866996 1146000 934986 1020917 719937 1354194 862009 1038325 1232211
18124 1232211 1126915 549551 907023 1363698 733055 850598 784568 527060 1287124 1112819
18114 1112819 964641 1091635 845242 724449 728025 912230 842784 1100876 647280 483169
18104 483169 718404 1056733 722108 1377479 843993 1248460 571851 1046355 974828 991223
18094 991223 1140371 708717 677223 1323286 758545 524740 980111 990980 576578 982668
18084 982668 1159119 1101847 625536 765563 838246 455337 740711 860998 1268453 759629
18074 759629 625997 515297 961041 915349 609414 1151051 867714 945023 630659 768936
18064 768936 854273 1211938 734721 568659 998711 899032 1173206 915263 628708 645073
18054 645073 1502964 686044 745414 940121 751790 740061 325968 1081086 1027526 814103
18044 814103 644339 800143 402759 713537 1259107 857016 482996 1013061 344552 909290
18034 909290 1106303 1152172 749643 1157581 917350 1160580 1298343 438660 839623 907004
18024 907004 848626 1084812 496634 310118 1115742 1051351 626229 744997 221916 952033
18014 952033 1300435 596457 1276748 983544 570216 976168 1132025 1052204 808456 870915
18004 870915 1030875 855548 1120641 1085934 976571 965497 620395 1401126 1146460 763838
17994 763838 736661 1333223 918252 1125899 621663 830371 913459 1013154 1298332 1019717
17984 1019717 489599 1182789 1126577 1306669 714020 1025183 874836 1315699 782582 1283834
17974 1283834 965475 1075664 735809 1091913 1112780 774388 1190541 1069654 720581 1248125
17964 1248125 1272364 557371 1003679 1102993 900499 1355045 597654 1368934 1445209 1494963
17954 1494963 1315387 907047 1180315 944086 936323 1062325 822451 1355577 1091337 938800
17944 938800 1116310 1439244 1380685 1663508 1064807 1056377 959365 1545309 781329 1344817
17934 1344817 1580310 1310309 1613909 854948 1513009 1505643 1460070 1221651 1400549 1524711
17924 1524711 1108979 1585553 906211 1478129 1633538 1643205 1461060 1734353 1244532 1717678
17914 1717678 1324899 1243916 1480602 1821511 2016420 1871284 1842500 1552873 1666989 1551178
17904 1551178 1798155 1457378 1872926 1734856 2045883 1468215 1483303 1787885 1715956 1450272
17894 1450272 1672471 2349825 2026532 1552363 1650182 2223010 1968364 1966092 2000585 2289580
17884 2289580 1882283 2032995 2178694 2251873 1845655 1986522 2356165 2113024 2062451 2285486
17874 2285486 1797303 1644300 1943538 2153486 2211076 2008356 2030422 2403217 1788994 2101531
17864 2101531 2288157 2419061 1853021 1922885 1818174 1651149 1959613 1768817 2044613 1754493
17854 1754493 1757208 1675664 1466533 1771118 1452717 1965523 2068921 1289553 1789073 1543830
17844 1543830 1382354 1779226 1950964 1719136 1513529 1930651 1312383 1429814 2026338
17835 2026338 1604799 1186883 1527738 1538513 1362890 1500393 1938247 1491702 1556534 1536777
17825 1536777 1337221 1694483 1465006 1546734 1577552 1772883 1464800 1366664 1808564 1639153
17815 1639153 1672777 1906322 1814599 1530689 1702659 2083650 1993907 1908426 1684373 1401369
17805 1401369 1640796 1400695 1425445 1440885 1680999 1525440 2025994 1719999 1778850 1338349
17795 1338349 1780857 1576898 1746928 1380126 1310318 1406333 1473627 1483736 1036032 975714
17785 975714 1124913 1437665 1067000 1505882 1867030 1206893 1166543 1538567 1276624 1135288
17775 1135288 1158720 1670868 752694 1099777 862432 1308364 1607757 1227140 1403697 1197144
17765 1197144 831254 1083705 1075528 1013076 1305899 1425418 1368745 924003 1015608 1235936
17755 1235936 1663322 1338995 1349244 1421288 1278048 1390976 954615 1486356 1447540 1088077
17745 1088077 1410683 1084577 1362569 1053335 1130296 1367577 1482918 1341945 1401219 1445851
17735 1445851 1282593 1033721 1118380 949686 1404771 1502189 1017813 1327830 1240799 834413
17725 834413 1371109 1391248 1231393 1237654 1016721 959388 1641256 745126 998124 1097773
17715 1097773 1167556 1050228 1432396 1073220 1187651 1448009 1596767 698919 1109200 1593275
17705 1593275 927363 1292579 1156320 1485050 1169658 1125230 1243317 1026717 1328613 1073402
17695 1073402 1222777 1116223 1504537 1218714 1353332 1510536 1037383 1395972 1476428 1420741
17685 1420741 870289 1457129 965816 1211215 1581866 1469538 1858072 1576658 1504982 1349000
17675 1349000 1502109 1407038 1585544 1273006 1238316 1365499 1193818 1102528 1430025 1507924
17665 1507924 1593698 1023966 1552258 1568236 1496440 1485505 1136939 1062646 1384762 1723176
17655 1723176 1663174 1212378 1835082 1426860 1355396 1326760 1332015 1677531 1716007 1854917
17645 1854917 1342114 2223883 2213874 1829528 1811517 1496313 1902800 1990131 1776387 1613046
17635 1613046 2252059 1731235 1721667 1915741 2259475 2297856 2435114 2085834 2248428 2025854
17625 2025854 2232213 1975324 2386137 2129323 2210171 2330239 2292561 2830890 2895720 2470058
17615 2470058 2532881 2539059 2343335 3113079 2331604 3019686 2331667 2167469 2458963 2631472
17605 2631472 2470592 2562655 2925461 3173886 3026359 2961680 3047049 2622987 3310168 3195186
17595 3195186 2885265 2711881 2715171 2895217 2621356 2667163 2870878 2706193 2855452 2654187
17585 2654187 2605902 2761136 2626916 2509184 2624076 2630153 2524120 2315519 2990648 2502080
17575 2502080 2570321 2177110 2221952 2870510 2519250 2846599 2238232 1828825 2603839 2127100
17565 2127100 2229251 2750382 2772672 2473815 2544860 2168475 2179350 2033349 2224438 2296699
17555 2296699 2103185 1805280 2324930 1752956 2248216 1922787 2375381 2054602 2355475
17546 2355475 1755674 2279868 1730519 2426362 1736259 2192338 2646392 2540243 2216159
17537 2216159 2386785 2250051 2585305 2219740 1668719 2570618 2076069 2135057 2191261 2236803
17527 2236803 2225286 1972835 2330967 2201311 2199924 2624956 2477482 1890818 2546135 2289511
17517 2289511 2445126 2231264 1987426 2461771 2900913 2859451 2652284 2846663 2840417 3678495
17507 3678495 3374605 3467469 3481012 3217247 3738303 3911369 3678128 3966143 4107757 4237127
17497 4237127 4008981 4550126 4490274 5028409 5227624 5687871 6289694 7668878 8913166
17488 8913166 11150098 14264279 20322795 28922775 41876480 55868156 69650516 80495134
17480 80495134 88506430 93491436 97892791 99301236 96300468 89732466 78440292 63879193
17472 63879193 50237795 42483902 41940749 47918240 59034338 71303791 82857875 90711167
17464 90711167 96313720 99650139 100714554 98891867 92314571 80211377 64982378 47376932
17456 47376932 32334308 21713770 15579682 11867539 9892302 8887660 8229465 7912507
17448 7912507 6821758 7014169 7438180 6972122 7381988 8068484 7534888 7471662 7294633
17439 7294633 7113496 7562483 6684833 6957566 6472944 6200628 5674409 6263527 6353767 6411638
17429 6411638 6451308 6911579 7064578 6581236 7004910 6676577 6288328 5694636 5604193 4874489
17419 4874489 4326640 4661154 4427834 4363586 4308652 4446653 4202631 4558702 4247224 4624339
17409 4624339 4480296 4773932 4810580 4858664 5329181 4948725 5454437 5906818 6159169 6646375
17399 6646375 6733724 6981458 6803630 7088256 7265073 7821981 8068379 9299666 9337231 10477699
17389 10477699 11170589 12356349 13535022 13893515 14955967 15436322 15396075 16134347 15265192
17380 15265192 14993410 14442005 13899634 13509105 12669894 12880895 12415831 12248253 12750876
17371 12750876 13502255 14351559 15522077 16160134 16948091 17612846 17750663 18393297 18781510
17362 18781510 18768705 18841771 18165738 17877102 17083666 17274549 16923755 16615426 17266417 17402816
17352 17402816 18292677 18633359 20109949 20558131 22286902 23191097 24741596 26578461 27415530
17343 27415530 28456759 29332754 29905220 29770537 29700249 28990803 28160347 27450400 26635972
17334 26635972 25868404 25738287 25544143 25851616 26212055 26687504 27458928 28421543 29224437
17325 29224437 30430119 30769535 31361089 31452753 30933563 30266299 29764752 28178812 27207714
17316 27207714 25790121 24980091 23226863 22037116 21137367 20220173 19334361 19530048 19229940
17307 19229940 19938240 19958736 20432670 22375107 23577185 24092263 24907515 25347502 25599255
17298 25599255 25522010 24948482 24432099 23064476 21984698 20713413 19539991 18187115 17538834
17289 17538834 17146420 16082950 16113206 16400440 16632025 16560262 17004738 16686256 16122265
17280 16122265 16747881 16610775 15242258 14502099 13363204 12368496 11639624 10441290 9784413
17271 9784413 8874991 8456463 7937437 7480208 7021787 6610187 6347426 6284293 5951685 5789270
17261 5789270 5004825 5463421 4897095 5349856 5136161 5084012 5023911 5298247 5046959 5069572
17251 5069572 4783630 4682666 4614687 4677287 4200030 4179197 4315753 4460405 4201180 3669012
17241 3669012 3883885 4369527 4497483 3991009 3954053 3772964 4076769 4280124 3767512 4183207
17231 4183207 3696963 4191798 4160603 4248371 4728125 4821533 4377641 4343597 4387547 4358461
17221 4358461 4229987 4522636 4987538 4430925 4792651 4303460 4513270 4677649 4735034 4082907
17211 4082907 4583882 5274330 4856816 4438534 4647045 5059555 5086165 5563736 5136865 5592356
17201 5592356 5548706 5153515 5158697 5282598 4694768 4866637 4201781 4211331 4185831 3917798
17191 3917798 3895182 3062680 3811463 3685134 3438024 4039633 3528437 3539908 3589009 3642624
17181 3642624 3338034 3232126 3433969 2730881 3373363 3267349 3262438 3397735 2741542 2659611
17171 2659611 3104841 2825550 2989472 2965524 2978539 3340882 3215395 3471469 3384392 3127064
17161 3127064 3390551 2903429 3648977 3166394 3545653 3559327 3468504 3834589 3760056 4009260
17151 4009260 3727952 3735352 3057341 3478288 3464185 3858003 3549564 3589768 3803801 3637393
17141 3637393 3690358 3750842 3412293 4396080 4028334 3449349 3900474 3835491 3691026 3479939
17131 3479939 3683538 3418160 4234991 3289322 3825715 3440698 3728120 3672709 3454396 3913528
17121 3913528 3661335 3938063 3753914 3566834 3392606 3596602 3866801 3381527 4013153
17112 4013153 3083557 3252021 2756309 2607663 2776271 2912293 2909957 3158752 2695524 2653165
17102 2653165 3102856 2340706 2293891 2310012 1903197 2821257 2497218 2438220 2472722 2408427
17092 2408427 2344172 2163588 2185854 2353469 2162672 1894922 2511538 2491572 2324215 2227789
17082 2227789 2074902 2341788 1892664 2280783 2087560 2573797 2091691 2071681 1934087 2542853
17072 2542853 2623820 2266968 2089318 2387617 2138421 2068187 2151609 2151185 1978276 2033217 1659292
17061 1659292 1919015 2131935 2332972 1921497 2174924 1819948 2192984 2133392 1650839 2372967
17051 2372967 2204189 2111030 1833272 2121906 2783432 1702403 2001131 2221749 1626209
17042 1626209 1887145 2643669 2769720 2153087 2327023 2376842 2268033 1965909 2187217 1976384
17032 1976384 2748442 1889752 2175957 2112082 2131858 2104165 2501519 2293595 1876343 2244976
17022 2244976 2460462 2189694 2272571 2134387 1936629 2156290 1871450 2148626 2226816 2515604
17012 2515604 2021371 2141344 1811939 1919671 1945376 1930385 1934313 2165221 2162111 2145019 1765376
17001 1765376 2229247 2016880 1840972 2011228 1834587 1854939 2306691 2157163 1858649 1877545
16991 1877545 1836704 2046301 2349314 1924824 1965198 2079542 2076771 2322857 2367347 2055091
16981 2055091 2098094 2456000 2282207 2418518 2181704 2399674 2211303 2205480 2447369 2509815
16971 2509815 2557877 3250580 2989764 3278857 2842316 3732284 3512197 3772619 4004990 4198990
16961 4198990 3888328 4256610 4307255 4650711 4926101 5037742 4726661 5163455 4973700 4848429
16951 4848429 5018643 4646125 4249701 4662198 4274685 4057481 4134143 3939367 3718668 3545584
16941 3545584 3545808 3678116 3166656 2918507 3497126 2769279 2616531 3091932 2739836 2876582
16931 2876582 2681013 2665314 2242799 2427610 2404784 2459539 2254518 2290490 1858558 2196526
16921 2196526 2005035 2391410 2159255 2196913 2192558 2017159 2153448 1981888 2170171 1686142
16911 1686142 1828794 1909349 2239962 1750496 1868329 1684956 1527381 1952704 1978846 2265063
16901 2265063 1882462 1904544 2232073 2068794 1815948 2152981 1775094 1529745 2041119 1642070
16891 1642070 1903318 1679178 1537198 1740831 1443011 2105351 1934253 1759482 1893076
16882 1893076 1540843 1659011 1796516 1930561 2007703 1840919 2089963 1703038 2092772 2287373
16872 2287373 1811837 2421618 2286447 2250142 1889330 2034597 2243656 2430034 1997257 2003037
16862 2003037 1614058 2467227 2110116 2580341 2162457 2261617 1921743 2252089 2411550 2280620
16852 2280620 2451787 2189626 2223557 1678305 1989649 2425632 2527135 2141586 1897284 2350147
16842 2350147 2164879 1979823 2204740 1999425 2289271 2096542 1678769 2094205 1633464
16833 1633464 1943680 2231575 2074244 2426391 1964402 2026534 2549729 1685880 1915965 2035790
16823 2035790 2425495 2491414 2364926 2491108 2304389 2737467 3111135 2480970 3033319 2555549
16813 2555549 2490916 3228794 2749320 2841037 2604250 2750406 2548835 2378424 2333728 2771427
16803 2771427 2498306 2435747 2635982 2262820 2332570 2292458 2566788 2478455 2113454 2148608
16793 2148608 2209400 2461723 2038327 1562176 2046618 2391369 1871098 1727463 1488937 1704138
16783 1704138 1752710 1807871 1457491 1689132 1660792 1503761 2107846 1710530 1511502 1401129
16773 1401129 1695859 1336648 1584218 1838334 1521455 1343251 1871114 1782901 1951379 1970943
16763 1970943 1255723 1411697 1748674 1669843 1662081 2011261 1788119 2292173 1479225 1527413
16753 1527413 1399809 2160225 1694567 1753833 2184292 2036628 2075785 1587439 1857356 2316181
16743 2316181 1865636 1651079 1986961 1369566 1888534 1474899 1559290 2155685 1394471 2418117
16733 2418117 1738480 2262231 2023343 1946708 1955621 2144752 2388498 2285133 2394190 1857078
16723 1857078 2163274 2115243 2440243 2430163 2471106 2188679 2440184 2604886 2142202 1734786
16713 1734786 2309348 2007918 2327100 2614107 2631780 2697212 2745823 3307583 3341014 3777790
16703 3777790 4084398 4175973 3566231 4136533 4242088 4087229 4017362 3898235 3647484 2873481
16693 2873481 3826464 3727782 4322694 4266686 3907510 3852428 4184565 4014911 4312944 4125188
16683 4125188 4398655 3621255 3404696 2974042 2853838 3068870 3079199 2871363 3082854 2899406
16673 2899406 3097663 3386127 3419733 3949188 3554024 4083512 4202717 4477454 4539728 4549219
16663 4549219 3848628 4628835 4475993 3893283 3799051 4389452 4200223 3978908 4695626 4536176
16653 4536176 4056568 4262276 4307412 3920169 3818726 3694804 3229836 2846511 2778584 2388017
16643 2388017 2331641 2519522 2362769 1996776 2595283 1902983 2224089 2392063 1721994 2460858
16633 2460858 1993741 2030634 1894497 1870152 2006462 2377012 2160866 2269625 1816186 2309268
16623 2309268 1979321 2055530 2351614 2027746 2020969 1870644 1825725 1800786 2769451 2496500
16613 2496500 1739757 2018065 1969815 2978773 2024990 2200380 2106136 2094552 2295555 2583385
16603 2583385 2175861 2278408 2428064 2314817 2167253 2666222 2528822 2434787 2307832 2210845
16593 2210845 2491895 2792091 2582360 2403884 2848601 2954745 2452491 2405027 2337893 2085123
16583 2085123 2413668 2306161 2103043 2348781 2353270 2315305 2221150 2183725 1833356 2338210
16573 2338210 2420212 1908486 2493228 2888541 1855809 2528538 2298831 2305620 2035338 2637904
16563 2637904 1872898 1988210 1563347 1633094 1814700 2155456 1545710 1745343 1886617 2026596
16553 2026596 1881784 2201417 2436776 1854950 2255916 2572927 1951293 2043570 1838649 1763438
16543 1763438 1999801 2128834 1843133 1760110 1592763 1618964 1656234 1708225 1830104 1469752
16533 1469752 2270035 2010162 2270473 2145687 2323618 2712652 2561880 2453534 2479161 2362349
16523 2362349 2227871 1916811 1878631 2093271 1961373 1806880 1688585 1443779 2233677 2124127
16513 2124127 2018864 2266093 3445472 2796663 2898775 2664618 3215563 3015618 2663783
16504 2663783 2587541 3111526 2700834 2824254 2105402 2178218 2131873 1645249 1670800 1815251
16494 1815251 1578764 1924732 1669310 1867998 1261377 1647394 1930050 2230820 1918207
16485 1918207 2058020 2108708 1894872 2233452 1949577 2020997 2357190 2042554 2611983 1983047
16475 1983047 2512758 2275741 2402350 2945718 2793907 2882491 2849131 2075233 2865436 2472195
16465 2472195 2499092 2128092 2795819 2957684 2909520 2651972 3253861 3762930 3194403 3304467
16455 3304467 3574507 3268138 3302813 3080897 2479152 2321469 1815230 1810046 2042978 1147363
16445 1147363 1193137 443642 1045296 858348 1487568 1877508 2572259 2934573 3537019 4137205
16435 4137205 5133105 5600720 6511256 6508758 6526977 6523869 7152173 8370273 8782318 10395440
16425 10395440 12570611 14230091 16239885 17104818 17721811 18156764 17806763 17077283 16364720
16416 16364720 15775758 14878885 14948990 16104772 18665296 22456146 26471259 31451317 36043278
16407 36043278 40482785 44022754 46465557 48497192 49702489 51229854 51863767 54017751
16399 54017751 59036400 67309405 76457195 83684958 87711942 88175839 84464727 78339916
16391 78339916 76090509 84884310 106494702 128105179 139272971 140669645 136362285 127235465
16383 127235465 112843496 101413787 98361890 105411064 117348808 121336371 110047952
16376 110047952 91110278 80614206 79990820 83505478 84368789 78952389 70411298 60639697
16368 60639697 51810713 42925566 35103584 27031729 20069082 14851132 10759099 8661354
16360 8661354 8581908 10101128 12753139 15789321 17623892 18064246 17495030 14083486 10488564
16351 10488564 6864903 4142218 2110120 1409934 331535 114278 -221355 -975673 -1191652
16342 -1191652 -1827622 -2075306 -1616627 -1598979 -1265627 -1552142 -1481654 -1888524 -2600381 -2922607
16332 -2922607 -3957775 -4584287 -4701876 -4768173 -4935023 -4103239 -3927977 -3210828 -3096850
16323 -3096850 -2133785 -1971323 -2188072 -2010346 -1882959 -1827431 -2012618 -2016935 -2391194 -2072010
16313 -2072010 -1796566 -1492663 -1082750 -1468706 -1043066 -1063130 -877808 -1362340 -734802 -133791
16302 -238444 -588845 -598294 -413706 -825556 -945505 -579843 -968794 -1280895 -847435 -1101172
16292 -1101172 -1032933 -629471 -156755 -993145 -1078362 -631108 -1120312 -1183130 -561732 -1394052
16282 -1394052 -857422 -910529 -1239354 -1113244 -1470016 -880739 -604308 -1092897 -1299833 -692693
16272 -692693 -764138 -728246 -784756 -413789 -401488 -61463 -352614 -71174 -220101 -342234 -557138
16261 -557138 -223895 -333491 -22351 -569568 -565185 242952 262340 181190 74588 456298 201860
16249 542673 263434 483225 462766 154138 396897 -2939 294275 453735 461291 844282
16239 844282 935482 348198 628036 1186211 1070418 1188294 1137531 1426407 886940 805104
16229 805104 583997 476568 614163 357664 541173 19935 300745 214992 383869 112236
16218 -425895 -106231 76534 -75542 -24024 258718 388165 554942 52965 487937 89147
16207 164070 307681 128405 1012069 270705 -493366 195936 -163114 498135 404551 -37742
16196 -299325 344672 834337 654171 693492 712244 -19167 1024624 393104 372518 709871
16186 709871 955064 1096448 711212 845535 1012105 1069550 710013 1115697 680668 1055789
16176 1055789 1060174 633601 975891 886374 661248 1148063 774756 617963 972441 784033
16166 784033 592113 816511 970132 1131008 589272 628400 498054 580834 556474 836173
16156 836173 623716 717130 761326 469035 357232 697608 468583 650633 939603 754737
16146 754737 942464 768231 832682 752177 1199940 1331940 1284465 1079240 848853 985332
16136 985332 739451 795110 1015795 814125 376821 482244 451712 1088430 1326160 1089105
16126 1089105 1303542 855433 592013 892132 1044871 1419290 1050465 1113594 623988 1037637
16116 1037637 1329735 1436920 1315440 1053972 1196527 1097641 1356156 883631 1513441 947202
16106 947202 518403 1480079 927235 784415 1370986 1199617 1491639 1204829 1325353 1493879
16096 1493879 1301459 997708 1663486 1242141 1159387 1326399 1335307 1242584 1363023 1186954
16086 1186954 1334879 1742866 1312382 1603490 2002673 2046988 1341161 1452761 1553746 1868755
16076 1868755 1848610 1440225 1888120 2060678 1852488 1952148 2046557 1950775 1429901 1401553
16066 1401553 2037893 1782067 2217391 2204371 1972474 2506409 2440460 2023541 2587335 2329130
16056 2329130 2184012 2058847 1864944 2233857 2264672 1992543 2267286 2197659 2062199 2166766
16046 2166766 2224000 1848639 2404629 2159872 2074681 2274025 1894057 2614465 2975053 2396447
16036 2396447 2584473 2275965 2673180 2956451 2316466 2426560 3042575 2327288 3253136
16027 3253136 2915774 2946847 2579983 2400420 2870230 2983581 2907144 2708482 3129041 2824125
16017 2824125 2518175 3232632 3300804 2895694 3046441 3829686 3307222 3227003 3371113 3422554
16007 3422554 3893148 3120882 3265934 3322876 3464987 3321458 3396284 3317129 3406408 3061507
15997 3061507 2914699 2676410 3206384 3124270 3557681 3549751 3379169 3133824 3563972 3849096
15987 3849096 3909716 3225880 3355945 3917099 3349706 3692320 3795225 3689264 3897145 3922591
15977 3922591 4125526 3923195 3949921 3898461 3662656 3988886 4098281 3587438 3746227 3150003
15967 3150003 3779587 3363109 3744962 3706130 3349660 3268226 3796685 3233293 3325563 3356711
15957 3356711 3300642 3385258 3428607 3595539 3399552 3898748 4008140 3523295 3811686 3959578
15947 3959578 3389173 3394156 4195122 3989605 3843329 3775798 3982311 3744905 4171858 4137419
15937 4137419 3979579 4300651 4161225 4328465 4294548 4548996 4020444 4592952 4470748 4688027
15927 4688027 4613113 4556305 4679833 5197179 5229545 4937667 5493896 5245366 5984369 6164458
15917 6164458 6196812 5603582 6230412 6432507 6860211 7614350 8012222 8672515 10002115
15908 10002115 11563494 14177246 16966614 21952739 29190357 39417132 52542178 67087459
15900 67087459 82330604 97260076 108650418 117634330 123139523 124798216 122329812 114820401
15892 114820401 102378519 86228261 68334262 52016017 38178483 27910532 21438710
15885 21438710 16456180 13555870 11611730 9967424 9279107 8076002 6961198 6250832
15877 6250832 5742100 5513887 4811440 5238807 5245406 4540698 4201303 4713082 4214844 4506199
15867 4506199 4567664 4158706 4461127 4153523 3946492 4079437 3615343 3921682 3834449 3513397
15857 3513397 4168998 3889383 3714195 3680311 3301576 3520428 3437936 3352093 3113094 3545210
15847 3545210 4018136 3618647 3375743 3158483 3358475 3514759 3716499 3826648 3861604 3774588
15837 3774588 4584579 4143420 4132856 4174169 4283448 4164292 4052037 4443860 4148483 4016508
15827 4016508 3920119 3611046 3636643 3842339 3491755 3381246 3952794 3501913 3600202 3483661
15817 3483661 3727434 3597425 4000151 4252742 4063871 4344718 4273460 4037718 4248899 4616057
15807 4616057 4386921 4408656 4354000 4143477 4449645 4719646 4776781 4945082 4884991 5145321
15797 5145321 5631030 6155775 6343939 6327407 6235768 6700065 6478303 6674953 7049404 7206357
15787 7206357 7027356 7081847 7441724 7707503 7885224 8165811 8836879 9017923 9249689 9216388
15777 9216388 10092334 9937002 9558029 9531468 9258362 8912283 9121624 9424196 8984562 9440944
15767 9440944 9928993 9563559 10313940 10088598 10092044 10267570 10064251 10326120 10377322 9822918
15757 9822918 10054553 9289686 9068384 9539519 9108132 9071452 8845628 9110783 9099480 9122246
15747 9122246 9111402 9764411 9881851 9968626 10332371 10886102 11491290 11464671 12037071 12498996
15737 12498996 12556901 12258135 12307351 12675321 12676255 12616806 12561902 13255482 13304878 13480428 13563278
15726 13563278 13656756 13568457 14031090 13583959 12818625 12098238 12075457 11945826 11536007 11598333
15716 11598333 11834312 11610614 11116188 11770362 11256193 11189213 11018836 10393140 10252767
15707 10252767 10788965 10404839 10723167 11171687 11449110 12384276 12377392 13406072 13055025
15698 13055025 13483090 13147735 13064740 13298108 12930665 13253513 12804615 12156531 12238852 11835436
15688 11835436 12115517 11646059 11822619 11441318 11354962 10835032 11602096 10549227 10364270
15679 10364270 10267294 10258285 9920992 10377495 9443794 9619518 9532283 9355734 9446226 9448623
15669 9448623 9085652 9660884 10132656 10627385 11422865 12012814 13330170 13878330 14906100
15660 14906100 16099376 17074358 18131451 19407344 20373340 20856462 22245464 24356661
15652 24356661 25304244 26599417 27747649 29310873 30630861 31566948 33344219 34550685
15644 34550685 35713924 36794784 38429890 41099899 43092553 44590202 46670156 48341267
15636 48341267 49546486 50550403 50451518 50766850 50414371 49628276 49037973 48358533 48039084
15627 48039084 47684246 47869569 47201595 47591391 46893200 46091384 44855411 43433597 41290222
15618 41290222 38686355 35805722 33515939 31480721 29891497 28593540 27118960 26660269
15610 26660269 25044948 24102106 23520336 22487941 21168466 20319524 19468698 18551011 17791249
15601 17791249 16942784 16623831 16072268 15953695 16153684 16479075 16852523 17798283 19090135
15592 19090135 23503520 30934367 44205816 62004705 75998086 85914533 92494605 97596403
15584 97596403 100897241 102038167 101715922 96027214 80581659 60033600 40364857 26346117
15576 26346117 20691837 17596561 15370399 14957311 14033266 14576977 13996551 13114802 13271216
15567 13271216 12849966 13233046 12749283 13352983 13117917 13772706 14076134 14952702 16469029
15558 16469029 19538981 26247283 37644941 56900835 80587818 97704282 108727371
15551 108727371 117525827 122655350 126617014 127965550 126488308 115770936 92518957 65687532
15543 65687532 41259780 25817078 18884364 15136018 13530719 12266694 11301070 10802234
15535 10802234 10808316 10170045 10300668 9978436 9645401 10008914 9754671 9526394 8704108 9058720
15525 9058720 8131207 7814556 7935280 7809605 8141320 7963454 7469099 7529238 7712311 7734653
15515 7734653 8031024 8163187 8094310 8586366 8771387 9588769 9200717 9436484 8936201 9218246
15505 9218246 9366863 9135782 9333101 8849547 8832449 8972722 8652642 8346531 8365675 8445144
15495 8445144 8265029 9350679 8880909 9199318 9190039 9282559 9241393 9622465 9305690 9577431
15485 9577431 10233189 9963365 10714386 10880224 10833413 10587917 11119304 10867824 11031991 11414786
15475 11414786 10997313 11371197 11442318 12909653 13447484 14470896 15445031 16026544 16933961
15466 16933961 17649854 17663555 17815868 17632557 17729332 16973433 15962686 15842285 15761324 15972313
15456 15972313 15775394 17135096 17952357 18839862 19434482 19956895 20116047 20295904 19431750
15447 19431750 19566047 18843216 18062385 17486720 17497641 16697713 16915426 16958061 16882923 17064855
15437 17064855 16995242 17543895 16971727 17513401 16904601 16388514 16147249 15566977 15175539
15428 15175539 14834314 14056024 13567587 13732213 13403517 12861789 12644757 12320050 11866981
15419 11866981 12043144 11478308 11307796 10986346 10635563 10421620 10050380 10199392 10364871
15410 10364871 10734688 10322848 10586211 10267330 10262125 10391113 10283968 10364801 10710017 11061272
15400 11061272 11201130 11706897 11607889 11964850 12159637 12059884 11872349 12024674 11680644 11826994
15390 11826994 12079287 11438789 11015899 10703878 11282903 10629113 11037663 11420595 10805005
15381 10805005 10461257 11088398 10581245 10426101 10747155 10403016 10417150 10435393 10199006 10424366
15371 10424366 10603676 10898751 10797094 11181815 11095036 11418168 11623377 11666718 11887376 12087244
15361 12087244 11823504 12004306 12153944 12017582 12268465 12611242 12948174 13082042 13855926
15352 13855926 14237508 16106827 18441209 22475220 28475954 38108469 47622080 54625188
15344 54625188 60361563 63824394 66263213 68537722 69096891 67287881 61791842 53053329
15336 53053329 43390304 34794835 29774980 27757568 26918807 26670858 26427826 26024604 25278940
15327 25278940 24440289 23298293 22618372 22266225 21837402 21588232 22210995 22866836 24351991
15318 24351991 25765483 28387039 32939955 41526832 54367923 70464691 85362481 97424926
15310 97424926 105930432 111839804 115337614 117125177 115418163 107411694 93199210 74251510
15302 74251510 54876451 39914753 29804627 25296689 22970378 21121898 20649408 19801292
15294 19801292 19946023 20043267 19905362 20098231 20170471 20263661 20435206 20511509 20578253 20520819
15284 20520819 20882060 20979332 22808189 26422356 32330644 40609137 49039407 55155026
15276 55155026 58782857 61608217 64081265 64822134 64833247 61976404 55440620 45878599
15268 45878599 35748180 27260469 22414865 20347608 20014320 18969073 18101810 17552775
15260 17552775 17250443 16662886 17095501 16673035 16837032 16721326 16187663 16902944 17522721
15251 17522721 17657682 18103810 18047233 18005270 17944066 17657442 17401838 18212014 17562742 17396845
15241 17396845 17386849 16989927 17462290 17304918 18264265 18875886 19841088 20004089 21099759
15232 21099759 21172521 21363444 21893688 22198708 21292199 21134661 20008115 18962977 18407422
15223 18407422 17838652 17456281 17376088 17668860 18051215 18687131 18978605 19241056 19531449
15214 19531449 19915946 19781026 20063752 19968317 19632527 18456750 17597473 16694022 15211128
15205 15211128 14270030 12935864 12290707 11696091 11325340 11555570 10775057 10907223 10688462
15196 10688462 10357757 10866824 11097452 11171312 12101095 12055289 12445649 12403623 13168817 12930169
15186 12930169 13213454 13281401 13469175 13398140 13655201 13740036 14138390 14143259 14356541 15457054
15176 15457054 15195263 15661893 15763321 15456928 15359997 15601883 15786207 15409597 15250915
15167 15250915 15361852 15103078 14329562 14746841 13731949 14383475 14288975 14149970 14037209
15158 14037209 14196184 13991313 14195363 14129698 14425659 14737910 14430981 14354112 14312177 14118646
15148 14118646 13896148 13228588 13881461 13416523 13223716 13306302 13713277 14199385 14091193
15139 14091193 14353713 14914593 14715427 14827729 14755735 15049560 15219392 14907585 14670377
15130 14670377 14809242 14450075 14416252 14429529 14267739 14604085 13937898 13907512 14576844 14128663
15120 14128663 13625113 14069946 13453195 13383472 13515295 13204017 13109223 12965707 12808819 12745578
15110 12745578 12991801 12843578 12721969 12861997 12947691 13073190 13184736 13736243 14371369
15101 14371369 13901462 14770237 15309820 15928491 16544721 16792674 17273062 18459138 19139704
15092 19139704 20900472 23227914 26501926 30307193 33695935 35897449 38223958 39748123
15084 39748123 40717507 41404453 40678417 39788910 37298793 34697107 32703197 32676395 34481506
15075 34481506 38525673 41844580 44533982 46830455 48543497 49800285 51208085 51003089
15067 51003089 51541476 50058807 49246439 51737083 54741039 57898004 61600799 64443188
15059 64443188 68749468 73213160 77827475 82031000 83773469 82145352 79510144 77405798
15051 77405798 78867397 82132711 86351819 89469508 90165190 90559063 90123461 90916428 91935896
15042 91935896 93578465 92865687 89756726 84853856 79634262 75926292 72303639 68944895
15034 68944895 65260641 61273033 57889717 56268589 57005528 59011681 59582912 59963491
15026 59963491 60724798 61811167 62181705 63153031 63862462 62069676 60629140 60496362 62397573
15017 62397573 68622465 77329686 85665965 92522513 99724518 105749751 111390718 115422998
15009 115422998 118945755 120221928 119493321 119274014 121462361 126148588 132323572 139019128
15001 139019128 145208872 151390877 157183620 161832943 164208884 163308211 159607232 153822325
14993 153822325 146616092 139636769 136168636 135247672 138130521 145554703 157349734 173247505
14985 173247505 190965701 212667847 235741702 258362292 278483271 294117981 303456971
14978 303456971 304996132 299501045 288302846 271424763 250033589 224378439 197512890
14971 197512890 172121336 149291542 130235414 115455224 102917829 93536661 86021485
14964 86021485 80283062 75484038 72281448 70291682 69903272 71316945 75196284 82080976
14956 82080976 92902905 108238689 130331914 157997508 190169400 226791496 267928360
14949 267928360 311582424 353843946 395302343 435634821 466962446 482376553 483153354
14942 483153354 473822955 457088167 434781752 408426002 377775369 341995469 302771635
14935 302771635 265655145 237330090 219746413 209536489 200016582 188344534 173403465
14928 173403465 158194625 143862718 132600120 125474243 121306369 117410213 112573963
14921 112573963 107208547 101911471 96830692 92476756 87982309 82183862 73378099 62449136
14913 62449136 50616415 40165370 33260960 29838495 26475433 25590656 24915754 24633918
14905 24633918 24506607 24692943 25411944 26723905 28550660 30741944 32987757 36789054
14897 36789054 42417671 48953095 55220908 61190247 64761780 66287003 68451206 69405835
14889 69405835 69026261 67185309 62214170 54568059 46428510 40014817 35757137 33263755
14881 33263755 32422850 31247698 30774318 30634828 30954557 32255956 33143550 35050353 35263727
14872 35263727 35489543 35770693 35505096 36407127 37658347 37318955 37255333 36952205 37223296
14863 37223296 38918787 43063351 48048731 57344607 67932865 79771539 91764904 104012102
14855 104012102 114701619 122674452 126517809 128159144 125536261 117942485 106847009 94114733
14847 94114733 80093709 65715574 53559370 44518603 38549933 35031211 33241943 32168653
14839 32168653 30535700 29642564 29418077 28082351 26960095 26190619 25721342 24826537 23992936
14830 23992936 23960770 23651176 24141700 24414439 26000851 26823695 29243146 32855950 37442931
14821 37442931 45477323 55370654 65558749 74147430 79427004 83649031 85249982 86169102
14813 86169102 85199317 80784863 71832837 60309507 46932214 35992278 27967157 23549898
14805 23549898 22069753 20694347 19593422 19191342 18935016 18441046 19492874 19315916 19149824
14796 19149824 18789481 19036901 18575606 17774882 17955237 17998941 17515565 16947324 17197000
14787 17197000 16945289 17277197 16401824 16894009 17698472 17949368 18111136 19387275 20813675
14778 20813675 21328402 22278468 23015628 23197433 24176637 24144169 24445731 23854769 22577396
14769 22577396 20887825 19142918 18802106 18110241 17124840 16215003 16182919 16031661 16170026
14760 16170026 16188915 16315314 16476481 16852626 16880253 17203027 17662954 18814334 19589968
14751 19589968 20495857 20883700 21631366 22538283 22724659 23040095 23412468 23417201 23546906 22870273
14741 22870273 22300058 23502153 24659282 26092911 28837717 31696278 36858954 43605464
14733 43605464 54046843 70623880 95143157 129310634 169890453 212414406 253683463
14726 253683463 288907912 316101311 333912544 343400834 341473561 325913641 295278430
14719 295278430 252799112 203766772 154963993 113687578 81613989 61219530 49047108
14712 49047108 41178877 36496457 32045782 29457527 27437291 25589889 25277295 23885790
14704 23885790 22440609 20741815 19204845 17227962 16218747 16034463 15540025 15554117 15864548
14695 15864548 16304487 16367061 16831243 16607996 16932120 17278446 17394608 17170011 17191011 16755370
14685 16755370 15670771 15637917 15585495 15460389 16014282 16345069 17089542 19016443 20394212
14676 20394212 22666201 23392483 23665017 24187981 24116884 23609298 22837643 22702427 21578336
14667 21578336 19904926 19084599 18686473 18489603 18236569 17872451 18195530 18581459 18501566
14658 18501566 18475543 18067269 16162420 14250113 12824281 11857493 11951283 12152654 12294231
14649 12294231 13540087 14895505 15536537 16295016 17175623 17883052 18795467 19538859 20769151
14640 20769151 20790900 22071746 22265558 23115659 24344737 25424561 26528242 26656613 26341537
14631 26341537 25863801 24308095 21979279 19752956 16786071 13966378 10825381 9703901
14623 9703901 8771842 8064966 7969662 7663300 7301591 6870457 7068335 7525955 7513212 7285861
14613 7285861 7064934 7121554 6759442 6738517 6831620 6620153 6855081 6428743 7227629 6299472
14603 6299472 7849552 9068839 10360514 12316530 13941462 16210604 17079501 18450736
14595 18450736 18725492 19683312 19148542 18499807 17062740 14856860 12422178 9784488 8058421
14586 8058421 7109347 7786755 6817282 7535212 7402397 7580225 7437334 7581610 7803650
14577 7803650 7973375 8383781 8634047 8940687 8899714 9238792 9727142 10338488 10753906 12300682
14567 12300682 14426139 15726215 17084425 18284529 19858470 22291881 27324693 34212668
14559 34212668 43557963 52166591 57753425 61717727 64651980 66310547 68234873 68298303
14551 68298303 65598077 58358505 47710052 37157095 29776279 27452705 30996766 39283975
14543 39283975 50001067 59077066 67209676 72620314 75850654 78154718 78742441 77194060
14535 77194060 71343323 61519938 48424397 36076358 26899184 22510925 19897881 19134347
14527 19134347 19119983 19077819 19201529 19216558 19989386 20900808 24408483 29772602 37177195
14518 37177195 43517534 48398419 52135336 55150539 57433737 59638210 60912338 59634850
14510 59634850 54604517 46891981 40471584 36812385 36599832 40502692 46591236 53100344
14502 53100344 57298928 59527555 61946585 63307724 64133461 63738635 62238638 57505287
14494 57505287 50941482 42672622 34922142 29786599 25745738 22480372 20275460 17963798
14486 17963798 15993944 13919458 11398484 9546928 8143269 7918901 6740325 6820804
14478 6820804 6357123 5988416 6183214 6625988 6814663 7472857 8298399 9641045 10501134
14469 10501134 11587766 12375029 12690238 13864045 13804644 14020205 14418244 13991689 13606778
14460 13606778 14097164 14430107 15909341 17173951 18006571 18209779 18452840 18272079 18395853
14451 18395853 16940973 15617018 13250051 11382384 10226600 10604442 9663945 10349017
14443 10349017 10499072 11052237 11343841 12341747 12739735 12750707 13484711 13523626 14503805 15220788
14433 15220788 15726715 17333996 19335381 23205382 28793203 35924894 43038401 49426214
14425 49426214 54855018 58766879 62401275 64262149 64381068 62799206 58624518 51357362
14417 51357362 43134421 35040583 28950344 25093414 21974269 19707287 17832701 16458114
14409 16458114 14787560 13122589 12666077 11787341 11163335 11435343 11118897 10554869 11108232
14400 11108232 10805244 11273342 12103769 13446842 15304749 18293179 23872838 30912285
14392 30912285 41147972 54046472 66693241 77743558 86810565 93934023 98155828
14385 98155828 99963110 98811720 93454549 84115674 70066380 55709820 42932615 32505056
14377 32505056 25026948 20454637 17308271 14911724 14367230 13641838 12993519 12448565 12279117
14368 12279117 12065955 11797120 11363652 11336673 10652046 10630819 10387547 11078587 11589242 12334065
14358 12334065 13931397 15956752 19564582 24346412 28779394 34290196 39148612 42904535
14350 42904535 44900587 46139350 45982242 45150375 42656595 37958328 32886244 26920804
14342 26920804 21552430 17296983 14351718 14056502 14845308 18331023 24471876 28309998
14334 28309998 30208668 31673235 33342136 34010479 34469096 34364687 33157086 28641113
14326 28641113 22171548 16691123 13031246 11643860 11304179 11679445 11403152 11198332 12021305
14317 12021305 12304350 12895053 13530668 14371529 15252557 16412613 17527072 18957819 20585378
14308 20585378 22757982 25367217 28544093 32824821 37698020 45186199 55290752 68342898
14300 68342898 86937978 111695990 143658563 181728774 220810878 254383790 280759618
14293 280759618 299715110 311860631 315333346 309227714 292584957 263687947 223021786
14286 223021786 178672102 137310801 104917018 81120114 64029374 52010363 43214810
14279 43214810 36466021 31589871 27637263 24236636 21963488 19564936 17919252 16386014
14271 16386014 14839390 13655264 12226675 10994400 9730477 9185310 8489662 8108664
14263 8108664 7739997 7731018 6987281 7288406 6991018 6494960 6523239 5928938 6586806 6142797
14253 6142797 6086996 6158461 5553461 5474679 5315151 5612810 5141561 5368639 4443365 4941970
14243 4941970 4344003 4147375 4383674 4139895 3897278 4190447 3961150 3832197 3728816
14234 3728816 4456347 4309805 3815155 3750710 3691736 3485809 3779250 3758762 4100074 3970349
14224 3970349 3813823 3756943 3931939 3493887 4239432 4331479 4285916 4417094 4324913 3880533
14214 3880533 4249089 4374931 4099496 4636443 4774944 5343468 6884487 7405843 7944833
14205 7944833 7427326 7631317 7786830 7786806 8066020 7232662 5903065 5086888 4070052 3851659
14195 3851659 3649067 3814148 3637821 3668432 4263945 3908143 4000119 4067019 3910112 4227106
14185 4227106 3725453 3838506 3465626 3338614 3336920 3007405 3133748 3063501 3468294 2743942
14175 2743942 3517813 3178231 3383225 3575868 2898634 3089703 3521143 3334395 2991303
14166 2991303 3512402 3923039 4088271 3418479 3934237 3285221 4069674 3574481 3801945
14157 3801945 3524089 4141604 3827768 3667472 3751014 3874665 3768565 3520590 3620793 3899079
14147 3899079 4163998 4198430 4321048 4738541 5462870 6575256 7504931 10161720 12301270
14138 12301270 13848713 14966500 16771009 17326836 18083363 18253283 17782229 16620344 13821824
14129 13821824 11367132 9187112 7523855 6315100 5755917 5516410 5804627 6563867 6626444
14120 6626444 7508662 7649530 8011215 8393370 8707040 8166039 8978593 8214293 7163780
14111 7163780 5983796 5721928 4688142 4517727 4667879 4464269 4573553 4933288 4867050
14102 4867050 4243425 4826165 5218274 6549152 7043463 7236694 8241824 8449227 8776116
14093 8776116 8734741 8922828 8751069 9028081 8179545 8461714 7094030 7540347 8862049
14084 8862049 9962653 10694917 11230390 11473512 12052204 11925111 12410623 11873760 11322981
14075 11322981 9734196 8689170 6673991 6247576 5512239 5491775 5279688 5741224 5856473
14066 5856473 5813183 5918997 6217967 5783998 6200590 7228744 7951798 8174368 8982457
14057 8982457 9454895 9674597 9728298 9971481 10501949 10606371 10176495 10081665 10569429 11109095
14047 11109095 11791436 12790802 13605704 15660806 16715585 17876932 19184671 19804456 20716634
14038 20716634 20709450 21102146 21210552 22259271 22583078 23568458 25326092 27851248 31826333
14029 31826333 36616343 43218940 52279883 65262429 82448426 106809910 138195952
14022 138195952 177199199 218864246 255011812 283892054 304451823 318051053 323646447
14015 323646447 319639933 304692286 276346284 236175376 189955474 145698040 110840473
14008 110840473 84750200 66574511 54409307 44690536 37874029 32100694 28115623
14001 28115623 24567156 22038441 19395130 17317761 15472582 13892052 12731643 11230476
13993 11230476 10234648 10065238 9622944 9548908 9888088 9780624 10093399 10228559 10530258
13984 10530258 10724741 11295717 11087212 11513573 11071925 11210779 10937327 10774603 11348203
13975 11348203 9832580 9243062 8398783 8163942 7689840 7252592 6632409 6146187 6260730
13966 6260730 5256983 5141568 5438141 5049086 4447607 4304689 4486937 4786017 4500852
13957 4500852 4667733 4188256 3976355 4389158 4775760 4775348 4914009 5423338 5644029 6445144
13947 6445144 6097534 6374315 6746339 7223357 7791407 9478270 11341678 14906663 20717881
13938 20717881 28100832 36076497 44753185 52656887 59589933 64601885 68227129 68844257
13930 68844257 67252486 62227267 53916053 45146990 35441763 26082363 17696957 12263745
13922 12263745 9010953 7147057 5408492 5286227 4576378 4833819 4537485 4383837 4224278
13913 4224278 3712151 3883484 4212958 3852627 3730973 3583305 3552290 3167254 3507031 3364123
13903 3364123 3025592 3183414 3210635 3032082 3577897 3227105 3393022 3276678 3584418 3134337
13893 3134337 3465807 3595269 3432516 3810873 4236930 3000586 3441715 3399687 3246195
13884 3246195 3743194 3308703 3473373 3714701 3351805 3072212 3140346 2845489 2684540 2692032
13874 2692032 3118672 2776744 3500155 3618343 3110053 3278640 3224956 3256232 3708007 3166930
13864 3166930 3494653 3680212 3242043 3284623 3434348 3486112 3602710 3372293 3617464 3685959
13854 3685959 3744798 3206479 3373117 3658355 3150247 3603360 3262181 3576693 3124859 3511578
13844 3511578 3651893 3506178 4065060 3726113 3570485 3044196 2921452 3263530 2696200
13835 2696200 2959108 2744087 3029061 2821635 3119812 2757091 2730124 2941098 3153280 3320536
13825 3320536 3051551 3028749 3202822 3159534 3264415 3161362 2544576 2439329 3006964 2300978
13815 2300978 2651646 3082445 2849072 3013053 2996313 2837217 2868960 2499426 2812659 2522135
13805 2522135 2744109 2999622 2974781 3183933 3230249 2939442 2650469 2446399 3057821 3253856
13795 3253856 3011383 3112546 3276642 3133363 2764208 2374729 2350898 3167382 2508023 2768974
13785 2768974 2700742 2400687 2151022 2315993 2748832 2681668 2931883 2432123 2826414 2811112
13775 2811112 2609709 2554723 2954489 2810990 3098247 3022459 3102431 2798007 2771852 3004990
13765 3004990 2608927 2633592 3127786 2933916 2914949 3000863 3085309 2570015 2282306 2499603
13755 2499603 2754200 2575344 2917368 2375247 2338620 2579472 2809361 2749141 2396306 2874403
13745 2874403 2293406 2233478 2111237 2859849 2890173 2731611 2638504 2886684 2707133 2961289
13735 2961289 3394504 3680391 3930257 3449104 3849102 4188524 4363234 4135294 4042643 4248457
13725 4248457 3442196 3323726 3504882 3302964 2996817 2519063 2560880 2484177 2608935 2515863
13715 2515863 2659478 2373498 2761622 2611788 2499665 2404185 2662393 2675201 2587970 2648810
13705 2648810 2325852 2695019 3331234 2709106 2998493 2471260 2713265 3080919 3709849
13696 3709849 3722829 4011110 3542597 4339736 4933705 5292897 4445526 4512327 4756965 4420149
13686 4420149 4214086 3607446 3433796 3173714 3064588 2909795 3194375 3652271 3597304 3361202
13676 3361202 3458879 3602612 3202902 3400567 3657890 3745737 3717357 4132766 4412201 4598385
13666 4598385 4861494 5360955 5640956 6177053 6570305 6023225 6323057 6347474 5969276 5453594
13656 5453594 5078292 4806780 4526642 4090296 3705029 3802272 3595274 3243933 3463370 3462709
13646 3462709 3536929 3494606 3236521 3552137 3503257 3995391 3722655 3806280 3642456 4223690
13636 4223690 4556945 4937465 5480364 5359454 5591200 5347341 5716771 5549981 5467430 4780007
13626 4780007 4751179 4003593 3532751 3601131 3676202 3564647 3357883 3332898 3098048 2922455
13616 2922455 3776466 3569329 3542494 3651150 3520984 3742923 3884995 4035976 4370418 3946488
13606 3946488 4071511 4018413 4224896 3797104 3945732 3777083 3857902 3654806 3312514 3333723
13596 3333723 3976261 3328962 4199861 4286585 4418821 4147631 3941849 4374455 4206945 3828352
13586 3828352 3719231 3705699 3452570 3319309 3302593 2980395 2642154 3032983 2963722 3163390
13576 3163390 2921192 2867574 2576501 3094270 2756229 2940886 2566285 2832173 3118056 2761270
13566 2761270 2932159 2856380 2868921 2799244 3031082 2738544 2483881 2758490 2692373 3015521
13556 3015521 2656166 2501560 3030728 2807532 2654426 2949004 3233628 3272506 3108229 3373626
13546 3373626 3668300 3995224 4214885 4426812 5021709 4686227 5679177 5094601 5237434
13537 5237434 5084951 5099513 4499729 4156278 4073438 3649270 3286431 3258114 3611696 3684981
13527 3684981 3815270 4687254 4560836 4765960 5209389 5187230 4920921 5289619 4862241 4367143
13517 4367143 4312774 3476074 3465380 3037022 2908034 2705246 2517172 2503515 1993181 2761892
13507 2761892 2748249 2150260 2369245 2315737 2299147 2588304 2258502 2617727 2462451 2209923
13497 2209923 2141259 2286957 2449130 2545727 2331037 2013512 2178348 2407867 2550502 2559134
13487 2559134 2149006 2576869 2514591 2507187 2217463 2577747 2668589 2694857 2340375 2110487
13477 2110487 1731797 2233467 2225607 2356133 1683772 2484110 1925473 2681122 2450178 2504227
13467 2504227 2534495 2686462 2202268 2008298 1987216 2099923 2314478 2961219 2468042 2673797
13457 2673797 2161923 2928993 3214579 3365810 3518191 4398203 4088739 4770854 5196242
13448 5196242 4673779 5244163 5138151 4494599 4164416 3813701 3093249 3145177 2777300 3315433
13438 3315433 2474810 2690030 3119757 2126776 2182266 2676580 2580027 2700640 2915098 2984154
13428 2984154 2156159 2622298 3251964 3441395 3730833 3663503 4533040 4625369 4694108 4566878
13418 4566878 4874754 5037439 5379137 4563043 4480249 3324424 3537548 3135123 2851429
13409 2851429 2599473 2917945 2293734 2263180 2227028 2923201 2815940 2648806 2077474 2757680
13399 2757680 2920252 2796291 2299699 2473245 2780122 3002998 2690418 3305442 3079702
13390 3079702 3107232 3562613 3578419 3479714 4192079 4665891 4968104 4422273 4689226 4679996
13380 4679996 4668983 4706999 4638785 4239658 4288798 4080601 3896713 3248505 3667131 3465955
13370 3465955 3742633 3423110 3548227 4023750 3868591 3605283 3643383 3785383 3987416 3596806
13360 3596806 3580259 3544195 3746598 3196655 3608392 4011106 3723745 4343271 4258536 4837619
13350 4837619 4130063 4218465 3578936 4207839 3639862 3194171 3669901 3168829 3734652 3212406
13340 3212406 3154393 2958666 3383482 3036175 3215181 3569919 3656474 3502033 3586080 3617605
13330 3617605 3524104 3620623 3443653 3222985 3630795 3192788 3427617 3355632 3172775 3645557
13320 3645557 3666922 3048120 4063758 4029786 4341422 4883416 5109054 5572041 5091112 5694775
13310 5694775 5442692 4913915 5062839 5243966 4904079 4833335 4272083 4410454 4480192 4765366
13300 4765366 5519946 5358938 5796713 5852890 6317062 5867308 6045162 5486975 6091714 5172790
13290 5172790 5558239 4626540 4937129 4764761 4475876 4895973 4463498 5391050 5123825
13281 5123825 4935148 4817532 5547767 5242603 5250394 5791484 5676223 5395724 6137351 6014033
13271 6014033 5580939 5884245 6003014 5818789 6580876 6588371 6468478 7370130 7329692 7264134
13261 7264134 6968090 7393843 7742447 8073748 8200427 8625189 8721703 8298338 8676840 8961160
13251 8961160 8534720 9134785 9344796 9527624 9279368 9462338 9430768 10077477 10190369 9985782
13241 9985782 10245345 10374929 10289703 10815413 10731776 11216466 11980666 11840681 12234703 12567675
13231 12567675 13088511 13457110 13215837 13108704 13377745 13469590 13237621 13238960 12531298 12555366
13221 12555366 12206450 12200717 12350075 11809440 11506069 11641997 11395517 11876527 11557308 11704725
13211 11704725 11760098 12212757 12036601 12138057 12202175 11614135 11766722 11702766 11823913 12089744
13201 12089744 11579746 11177932 10988392 10867835 10841685 10400117 10364589 10144464 10091897 10501149
13191 10501149 10321826 10126926 9804578 9777511 9652186 9964001 9924335 9358795 9777805 9744596
13181 9744596 9142437 9733851 9564162 9193450 9698091 9520887 9580206 9219776 9402545 9538412
13171 9538412 9126834 9166706 9556789 9532212 9831581 9695507 9892294 10538720 10930791 11504079
13161 11504079 12031890 11949990 11613827 12519097 12551478 13438034 13748121 13400178 13561043 13016101
13151 13016101 13195244 12829450 12422978 12528230 12109553 11973689 12036744 12088609 11640689 11948496
13141 11948496 11509955 11665663 11377093 11061683 10602409 9996519 9463478 8913804 7919110
13132 7919110 7438400 7801374 7873976 8140735 7971870 7488657 8338173 8328802 7952752 8374812
13122 8374812 8396978 7746597 7366707 6899766 6877098 6121642 6582597 6043616 6135253 6084863
13112 6084863 6184477 5617039 6080867 5713736 5693930 5346677 5753158 5660071 5431222 5970387
13102 5970387 5975402 5947197 7055487 6864555 7514152 7506347 8367188 9258079 9559004 10172508
13092 10172508 11011549 10941718 11465768 11509570 11551956 10628873 10664532 10525669 10502736 10100853
13082 10100853 10036494 10207300 10151721 9928424 9868651 9405769 8562457 8678255 7534011 7228150
13072 7228150 6181908 6152515 6129256 5213003 5374095 5387836 4959895 4911116 5068457 4792774
13062 4792774 5141372 5283210 5028924 5146577 5175948 5231185 5920368 5500671 5504940 5660313
13052 5660313 5613833 5208409 5438527 4974433 5303585 4661467 4669031 4595965 4886641 4743536
13042 4743536 5240690 4877962 5157454 4860378 4571845 5069958 5297161 5570542 4930204
13033 4930204 5286136 5073183 5751025 5732286 5805848 5941275 5628815 5774341 5665002 5836124
13023 5836124 6513742 6307733 6080314 6139626 6348995 6660893 6465749 6799152 7279417 7192419
13013 7192419 7434413 6753877 7294017 7751227 7944901 8024105 8015416 8613111 8356854 8782676
13003 8782676 8796325 9319876 9542459 9846856 9849941 9647767 10295115 10658168 10846745 11015019
12993 11015019 11314092 11216122 11663341 11614567 12178053 12039182 12120206 12169615 12264322 12006395
12983 12006395 12214551 12234176 12423450 11860720 11852835 11926630 12235107 12285437 11935976 11589406
12973 11589406 11929214 11226341 10973814 11117421 10806744 11073169 10778549 10377761 9959912
12964 9959912 10252373 10310597 10268727 9787605 10122850 9847610 9588779 9375086 9419491 9376378
12954 9376378 9248005 9643263 8873893 8936899 9504706 9294021 9052500 8944063 9626893 9054585
12944 9054585 9407336 9112453 9686596 9473324 9114959 9298712 9228766 8818472 10177087
12935 10177087 9113195 9882996 10157827 10467407 10842696 10413347 10268580 10521333 10649727
12926 10649727 10726668 10555377 10493823 10261198 10509949 10331119 10423513 10376389 10609862 10107050
12916 10107050 10231341 10193257 9488807 9303916 9298066 8903096 9008553 8125581 8403416 7972656
12906 7972656 8493713 8287799 7362156 7854555 7694898 7340795 7428673 6988305 6821889 7169744
12896 7169744 6324800 6554253 6055575 6392528 6246309 6246024 5884259 5638655 5972981 5928027
12886 5928027 6285782 5731600 6243664 5910221 5831791 5763269 5606528 5597404 5187194 6011035
12876 6011035 5294373 5268299 5145620 5536429 5130851 5406058 5423155 5492257 5430259 4947465
12866 4947465 4696935 5302742 4960104 5106076 5122225 4763928 4855859 4578504 4878533 4371280
12856 4371280 4856256 4741985 4654096 4968362 4504011 4790091 4744364 5198278 4532940 4733814
12846 4733814 4796737 4852702 4936132 5071882 4751133 5139274 4765101 4741624 4698147 4966250
12836 4966250 5127244 5065700 4736020 5072411 5132986 4820965 4639932 4959272 4952524 4994763
12826 4994763 4931960 4583661 4944796 4768225 4655535 5162673 4855561 4988404 4841431 4896909
12816 4896909 4890272 4455030 4382570 4818803 5003885 4285380 4701956 5028604 4998948 4667744
12806 4667744 4594063 5093650 5028940 5204052 4454559 4860361 5175169 4571525 5269611 4861498
12796 4861498 4979371 5067224 4782699 5052976 5155837 5007896 4768372 5103024 4987442 4856824
12786 4856824 4979634 5075887 5315412 5646778 5194625 4814872 5082289 5418966 5147962 5198733
12776 5198733 4712439 4783785 5112518 5177795 5019186 4894070 5130232 5412401 5290488 5310239
12766 5310239 5518820 4893580 5158730 5199580 5436740 5443901 5199943 5236566 4995942 5288790
12756 5288790 5762448 5247500 4948377 5253513 5843714 5579678 5593000 5201462 5362973 5553522
12746 5553522 5206658 5535953 5588751 5977138 5907617 5717298 5515818 5196454 5582695 5139946
12736 5139946 5573943 5694606 5699526 5422278 5470641 5285017 5727053 5081877 5669568 5664173
12726 5664173 6016647 5054626 5378286 5817250 5218462 5240940 5250874 5818183 5530633 5370797
12716 5370797 5644308 6010512 5766224 5555525 5917834 5760459 5635819 6173302 6323332
12707 6323332 5642476 6326622 6060341 6299745 6852074 7242232 6972665 7328276 7384931 7396072
12697 7396072 7016999 7982939 7716115 7593810 8486693 8767461 9289311 10807969 11120381
12688 11120381 12538385 13460605 13385872 13642400 13899001 14164922 13902681 12776721 12405558
12679 12405558 10721454 9652317 9081520 8421711 8706766 8611804 8445613 8196698 8328575
12670 8328575 8836400 8660615 8922278 9014713 9091005 9251742 9103469 8929090 8887352 8914252
12660 8914252 8347898 8774723 8553535 8302069 8606724 8456266 8157537 8279402 8737850
12651 8737850 9598174 9551535 10298026 10952600 10698354 11754290 12246663 12163729 12378834 12393185
12641 12393185 12620434 12205602 12296645 11445235 11793205 11985496 11896674 11509471 11591268 12013834
12631 12013834 11909843 12189014 12346537 12392771 12823697 12858821 12882686 13036222 13379682 13016038
12621 13016038 12962567 12278111 11476977 10969179 10354306 9994938 9535649 10322537 10576063
12612 10576063 10776656 12233439 12430114 13324959 14005552 14711435 15104161 15300792 15596682
12603 15596682 15638238 14962048 14039518 13547742 12843985 12018503 10810520 10071648 8814419
12594 8814419 8652305 8522198 9054480 9627253 10043417 10062335 10247517 10541655 11029920 11435532
12584 11435532 11287344 11542060 11849139 12493433 12786146 13328912 13457092 13344202 13538153
12575 13538153 13581839 13250084 13013577 12732043 11563051 10889899 10082885 9733920 8893451
12566 8893451 8832157 8821725 9370757 9008204 9347441 8961657 9045982 8997906 8692743 9177734
12556 9177734 9097591 8953668 8691062 8614749 8499514 8167659 8346744 8487703 8903616 8625544
12546 8625544 8448559 9004374 9233319 9494742 9836203 10123258 9957586 10517959 10826920
12537 10826920 10560927 10866784 10929353 10678436 10279208 10198714 9528899 9199703 8997118 8886425
12527 8886425 8759338 8681781 8788682 8832966 8664413 9098790 9048781 8858404 8774567 9396531
12517 9396531 9344005 9448158 9806409 10722851 10868057 11794410 12584293 13613576 13467462
12508 13467462 13583365 13531483 13972209 13699322 13449898 12250121 11408905 10894867 9798509
12499 9798509 9916282 9917092 9469707 9685854 10053121 9460105 10172797 9797234 9289635 9857891
12489 9857891 9764267 9620412 10212485 10020499 9929170 10560809 10942497 11639045 12218592 11901427
12479 11901427 12326650 12044514 12696259 12587640 12594956 12001068 11538984 10649792 10862716 10486165
12469 10486165 10418438 10739372 10347830 10529417 10784962 10968346 10925426 11084186 11609095 11046396
12459 11046396 11857335 12070271 12508093 12409994 13333019 13101035 13467866 13954517 14376406
12450 14376406 14699325 14618486 15039978 14726063 14871900 15159522 15590799 15212826 15240714 15431177
12440 15431177 15073474 15810307 15593720 15276583 15806846 15688420 15990692 15754002 16262026
12431 16262026 16485431 17055608 17253566 18025933 18817934 19606135 19920942 21017630 21489735
12422 21489735 21672648 21689716 22300866 22755309 22734243 23328362 23520801 22813211 23247152 23195524
12412 23195524 22540579 22794223 22387383 21827594 21663094 21746473 21398709 21309092 21226256 21190587
12402 21190587 21127872 21005406 21266109 20973754 22002917 22290521 23055762 23383648 23692076
12393 23692076 24525589 25303552 26304357 26867885 27448186 28941558 29187137 29418781 30355859
12384 30355859 30538126 30503724 30561356 31339871 30949899 31374736 31441584 31228212 31735839 31818551
12374 31818551 32463517 32559729 32228096 32427136 32543419 32134508 32572404 32567528 32420915 32382574
12364 32382574 32540085 32074081 31623537 32121533 31892165 31814402 31938295 31813805 31662340
12355 31662340 31248831 31208328 31677029 31536376 31042965 30592456 29877493 29423259 29792871
12346 29792871 29086033 28839324 28881601 29417678 29887414 30197200 30521738 31536585 32543782
12337 32543782 33386623 33718534 35185801 35913982 36777255 37683513 38084059 39888953 40209603
12328 40209603 40575117 41471247 41711602 41630264 42144910 42470002 42589855 42835719 42719355
12319 42719355 42717984 42692886 43260994 42736852 42522368 42849014 42976439 43139878 43667722 44045139
12309 44045139 45080411 45638874 46765923 47496297 48252164 48555305 49443852 49230443 48941483
12300 48941483 48547395 48756114 47623574 45585770 44912735 43387436 42208093 41330866 40139295
12291 40139295 39671266 38832578 38420557 38013143 37079388 36617480 35197035 33493293 32647815
12282 32647815 30812583 29957224 28376649 27689841 26935440 25597343 25539121 25335582 24966731
12273 24966731 24725802 24695307 24384219 24703045 23806749 24047793 23806012 23956896 23833472
12264 23833472 23835841 23542673 23593452 23554184 23931372 23639900 24774962 24939613 25910974 26887481
12254 26887481 28005342 29779444 31191448 33094448 34820677 37426408 39856727 42413484
12246 42413484 44977179 46980061 49347630 51000884 52384986 53580873 54563750 54381539
12238 54381539 54848776 53380878 53037603 52637425 51455516 51051022 50280004 49649880 48373708
12229 48373708 47715517 46237578 44471528 42303439 39783071 37190507 34747772 32105804
12221 32105804 30193561 28183928 26216910 24917646 24004092 23054022 22477146 21476887
12213 21476887 20825031 20033006 19743630 19125722 18702870 18203746 17828521 17361905 16685306
12204 16685306 17068228 17034235 17062773 16860076 16892834 17406391 17374249 17250611 17565776 17464281
12194 17464281 17975856 18141132 18481034 19199249 19457008 19983015 19920225 20469477 20564241 20940593
12184 20940593 21346550 21512066 21446244 21560032 21677012 21968502 21637219 21471857 21167087
12175 21167087 20986256 20901931 20767198 20481836 20562919 20423322 20829914 20839385 21076173 21531030
12165 21531030 21452916 22104023 22588716 23219283 23727345 24248958 25640430 25702734 25957165
12156 25957165 26569366 26833331 26416698 26586590 26266780 25579218 25941509 27136512 27946317
12147 27946317 29279002 30378606 32262120 33136394 34800343 36435325 37579562 38909507
12139 38909507 40030461 41515309 43006625 44191435 46626123 48938116 52006998 54637599
12131 54637599 58334802 62392808 66520274 70734319 74674948 78555179 81694680 84188897
12123 84188897 85825671 87110746 87777944 87236223 86126996 84506245 82872996 80377883
12115 80377883 78292183 75895361 73788153 72047749 69866569 67806980 66104555 64541822
12107 64541822 62613060 61235104 60130804 59813760 59210239 59512112 59161239 59212946 59520568
12098 59520568 58537200 58422047 58177667 57963317 57135075 57309377 56634391 55244954 55560744
12089 55560744 55379102 56279363 57561597 58964124 60067436 61943972 63914103 65598186
12081 65598186 66618406 67099598 67329559 67785870 67816384 68096982 68484949 68466289 68383855 68033890
12071 68033890 67087240 65690779 64954954 62793091 61048753 58876850 56525465 54293648
12063 54293648 52527805 50876972 48785572 48100301 46582630 45561077 45727767 44426542
12055 44426542 43154436 42391541 41718374 40654601 39619242 38949580 37739002 36797078 36313053
12046 36313053 35999509 35146839 34627383 33820719 33832671 32703515 31256267 30930608 29769390
12037 29769390 28996465 27977482 28025774 28222819 28775848 28838171 29688655 30622170 31923682
12028 31923682 32680920 33616760 33944977 33936813 33165385 32245131 30749022 29206221 27428325
12019 27428325 26215539 24748783 23200381 22165532 21714721 20691429 20192115 19349229
12011 19349229 19027288 18649214 18734790 17920456 17365630 16684604 16328123 16470962 16426172 17267667
12001 17267667 17170289 17430663 17926383 17623444 17441552 16716342 16461320 16853113 16084124
11992 16084124 16484763 16006105 15989757 15686239 15785709 15911502 16156901 15885989 15514493 15642491
11982 15642491 15309464 14589012 14441425 14129097 13575108 13901885 13208059 13336106 13180260
11973 13180260 12516705 12266901 11725147 11263046 10799015 10470303 10243509 9712686 9658388
11964 9658388 9824409 9530653 9713219 9761284 9543873 9796838 9684500 9853478 10424352 10062320
11954 10062320 10101394 10779377 10557778 10461117 10820786 10741613 10709597 10442529 10687512 10724634
11944 10724634 11168684 11672127 12043222 12403246 13533173 13271490 13875259 13407345 14306422
11935 14306422 14164128 14134626 14820457 14659714 14151289 14091576 14247955 14152332 13510810 13162375
11925 13162375 13479659 12662968 12661659 11861326 11556016 11220477 11353808 11154456 11122819 10282583
11915 10282583 10484020 10969342 11009319 12805098 15553773 22305227 34094153 39706069
11907 39706069 43013464 46131343 48280376 49365302 49597495 50268076 47342131 38625299
11899 38625299 26826343 16495044 10988845 9757088 9269177 9100801 9133612 8620317
11891 8620317 9057110 9071581 9758219 10223631 10914636 12241577 12336089 13597779 14387239
11882 14387239 15158939 15651863 15971268 16318174 15892017 15411205 14384469 13643997 12969497
11873 12969497 11616360 11562969 10738227 10042971 9114517 8842620 8818023 8675803 7858221
11864 7858221 7603027 7935844 7474304 7352270 7101814 7344434 7774683 7429780 7342330 7014117
11854 7014117 7768142 7484523 7725551 8282876 8790970 8654029 9545387 9286253 9771596
11845 9771596 10283242 10922111 11082926 11690520 12487170 12161374 12467010 12864812 12127838
11836 12127838 12601782 11935379 11814854 11195993 10846561 9990566 10292474 10321717 10259442 10010665
11826 10010665 10418335 9616489 9102839 8911623 8284332 7421386 6899128 7217695 6444885
11817 6444885 6707120 6399330 6246823 6273962 5918374 6138126 5918163 5509800 5187791 5229915
11807 5229915 5698257 5414148 5382641 5578357 4917578 5301030 5687476 5407069 5113647 4918346
11797 4918346 5233002 5320712 5247158 5290108 5285759 5807414 6003816 6784800 7882845 7735798
11787 7735798 8421591 8614056 8322474 8777784 8824152 8670794 7548208 7320993 6655116
11778 6655116 6069594 5623212 5056627 4934479 5488655 4812426 4857966 4230791 4373258 4563806
11768 4563806 4637272 4317358 4802316 5029748 4164902 4327512 4288546 4774846 4299772 4435552
11758 4435552 4289613 4828937 3965150 4416849 4054869 4215223 4266569 4140553 4420594 4414383
11748 4414383 4563835 4157834 3899349 4604928 4041775 4130239 4055244 4022311 4224393 4385270
11738 4385270 3788211 4152245 3786867 3941324 4278894 3621334 4322723 4373227 4360679 4369391
11728 4369391 3914989 3815476 4265026 3820911 3861333 3807319 4405666 3989297 4126964 4075386
11718 4075386 3958457 3760126 3786960 3880687 3722784 4033165 4316012 4153527 4336449 4081352
11708 4081352 4133150 3896389 3906359 3860679 3915387 4431764 3826291 4090337 4209128 3932836
11698 3932836 4061720 4383617 3811333 3770942 4209694 3818990 3613650 4015195 3916404 3659133
11688 3659133 4320299 4356291 3989679 3648909 3856124 3482682 4412634 3972061 4329741 4369777
11678 4369777 3803756 4143549 4514723 4248608 4539456 4078298 4366044 4595154 4306183
11669 4306183 4480911 4281943 4836931 4423680 4839394 4361476 4392896 4171622 4413368 4245638
11659 4245638 4627455 4460709 4559556 4546173 4328045 4189621 4756583 4476492 4493825 4655114
11649 4655114 4363588 4493731 4418686 4806699 4522328 4427285 4571293 4258857 4808001 4407371
11639 4407371 4583756 4517106 4462052 4453518 4736954 4948033 4861106 4630441 4496639 4659719
11629 4659719 4687410 4477580 4250556 4749829 4658812 4027775 4708018 4513287 4983044 4496027
11619 4496027 4340264 4486644 4121547 4179478 4758005 4740921 4356031 4514485 4508935 4297826
11609 4297826 5319084 4440274 4749800 4829168 4750456 4429222 4944843 5159439 5103606 4617597
11599 4617597 5325756 5236821 5108519 5211968 5396416 5216030 4983592 5411136 4875091 4882638
11589 4882638 5134121 5303867 4638182 5346471 4639971 5038645 5092260 4669601 5096443 5115152
11579 5115152 4974710 4889533 5137448 4698895 5118193 4923039 5153082 5121410 5210182 5324442
11569 5324442 5165345 5015388 5012195 4881074 5086139 4977718 4983316 5169114 4968778 4877254
11559 4877254 5066864 4517845 4920410 4852062 4900793 4765794 4926567 4663176 4977592 5079133
11549 5079133 5004879 4990133 4597211 4573472 4859061 4903391 4797564 5031580 4659582 4926648
11539 4926648 4644617 4938901 4579609 5050615 4895640 4804809 4777227 4527318 4395408 4725190
11529 4725190 4947597 4886203 4538918 4645315 4827661 4498835 4786247 4927578 4902657 4825873
11519 4825873 5137204 4905250 4449605 4401334 4937136 4828366 4743777 4792010 5100168 4432134
11509 4432134 4925429 4790746 4438976 4844811 4779194 4915806 4728487 5365838 4521561 5126672
11499 5126672 5200384 4913087 5041956 4800343 4533594 4864263 4392298 4913791 4980222 5158320
11489 5158320 4651204 4687927 4923902 5219703 4758976 4891988 4855505 4901890 5506020 4786517
11479 4786517 4983514 5424447 5077700 5156037 5229688 5405470 4890466 5335194 5400806 4844944
11469 4844944 5338927 4776695 5183356 5149256 5028259 5125623 5016045 4987677 4785709 4964657
11459 4964657 4815706 4935552 5025287 5241911 4346170 4925945 4666384 4996652 4859729 4858901
11449 4858901 5136820 4835018 5320973 4825924 4940542 5135062 5053708 5028005 4815360 5008700
11439 5008700 5396542 5109787 4899739 4824706 5133498 4941871 4962441 5350417 4984529 5629507
11429 5629507 5605916 5517384 6129799 5572217 5625848 6210224 6192193 5748598 5642282 6242889
11419 6242889 6007409 5841130 6534259 6767542 6226436 6285581 6823035 6815865 6713387 6985540
11409 6985540 7286280 7048287 7759453 7492124 7614837 7619883 7881842 7877950 7952314 8378104
11399 8378104 8279775 8513546 8574880 8699804 8865821 8985128 8876027 9084179 9332538 9554183
11389 9554183 9547254 10008757 9723686 9624732 9938426 10059403 9939239 10007817 10292519 10626806
11379 10626806 10617703 10351930 10480986 10634001 10676218 10756611 11329050 10751218 11236760 11259358
11369 11259358 10745906 11109337 11166880 11605059 10893930 11322196 11348108 11862031 11632148 11820152
11359 11820152 11728978 11066709 11802236 11992266 11710307 11311549 11646915 11476432 11352189
11350 11352189 11203704 10943679 11525211 11222554 11256111 11270360 10881440 10813873 10625287 10852652
11340 10852652 10914426 10903575 10334210 10158410 10229752 9957562 9704987 10267200 9769219 10124394
11330 10124394 9662547 10197441 9585077 9460175 9378113 9593880 9154552 8760172 8866438
11321 8866438 9093655 8780719 8287495 8436820 8061185 8136314 7901618 7468696 8038772 7534038
11311 7534038 7809754 7432655 7204710 7335338 7361512 6922027 7050758 6857462 6135705 6441377
11301 6441377 6377178 5910641 6155788 6429013 6005176 5749721 6229467 5877560 5983642 5955263
11291 5955263 5591253 5866390 5627410 5464301 5773269 5246681 4969877 4792361 4880842 4911950
11281 4911950 5139019 5111690 5232241 4570580 5114833 4942292 4993612 4997869 4576408 5116917
11271 5116917 5496255 4704438 4770035 4869027 4419522 4671870 4616864 4922171 4773343 4698681
11261 4698681 4757662 4794516 4568773 4490877 4821222 4595927 5295419 4402389 4787939 4222382
11251 4222382 4353625 4346154 4850379 4460416 4436418 5137385 4465991 4091101 4795847 5003811
11241 5003811 4850002 4353253 4676264 4741442 5172844 4915482 4633501 4573647 4829546 4870586
11231 4870586 4388963 4969066 5103721 5128000 5726654 6486001 7640916 9477606 11136819
11222 11136819 11559371 12664801 12723472 12733841 13208836 13358499 12361182 11096247 8905602
11213 8905602 6918927 6272968 5614163 5339096 5192584 4757591 5532845 5117391 4966244
11204 4966244 5261495 5044179 5075696 4840287 4914255 5060152 5832906 7027420 8016553 10070916
11194 10070916 11219754 12197285 12468766 12898961 13153457 13251684 13330628 12679411 10830369
11185 10830369 8685030 7111588 6557699 5466146 5692166 5330986 5000188 5304574 5309314
11176 5309314 5199722 5004671 4697627 5065829 4569639 4269839 4676399 4911708 4675938
11167 4675938 4955198 5055788 4816122 4858034 4654224 4630514 4961083 5362294 5160402 4679553
11157 4679553 4969250 5172844 5203571 5381349 5253704 5277361 5183692 4783704 4747397 5194902
11147 5194902 5025157 5290421 5425174 5230629 4833000 4884674 5326611 5114782 5388303 5345069
11137 5345069 5312866 5120763 5411463 5289721 5460938 5374369 5445739 5631233 5725242 5875804
11127 5875804 5294981 5664308 5312866 5833984 5369799 5590452 5777803 5528907 5688753
11118 5688753 5784010 5856375 5884395 5520342 5952923 5844885 6036328 5433733 5833746 5877361
11108 5877361 5727189 6000703 5392771 5795392 5817380 5663204 5615485 6072443 6074961 6139150
11098 6139150 5723359 5521443 5826471 5568580 6054480 5531042 6059579 6184716 5534406
11089 5534406 5869689 5774429 6050785 5534450 5541400 5668086 5314787 5709210 5585219 5791930
11079 5791930 6056552 6197172 5246038 5932994 6220885 5818084 5725605 6262482 6378002 6418753
11069 6418753 6356054 6306347 6905182 6732653 6390866 6477377 6941812 6499122 6757629 7782645
11059 7782645 6956497 6913793 7098248 7597158 7474482 7754441 7692120 7775011 8014197 7844927
11049 7844927 7753669 7602251 7654348 8065903 7757087 8286839 8533837 8692333 9091698 8388414
11039 8388414 9397613 8850686 9420564 9429136 9602626 9992490 10039295 10254998 10294577 10255835
11029 10255835 10508397 10731093 10939067 11014031 11610703 10603655 11375672 11095170 11633879
11020 11633879 11501559 11935299 11804312 12034816 12497264 12232792 12699100 13407436 13336737
11011 13336737 13511758 14144697 14380145 14366423 14998390 15414585 15247607 15849454 15993789
11002 15993789 16118450 15995059 16230253 15715605 16246288 16631590 16506380 16356868 16651770
10993 16651770 16518505 16931719 16907311 17464414 17657851 17803473 18339360 18729262 19132149
10984 19132149 19481068 20677511 21612141 22585813 23366015 23753160 23846153 24012552 24924022
10975 24924022 24856799 25586128 24803467 24877155 24510139 24736185 25321497 25863634 26641192 27238945
10965 27238945 28060433 28668860 29537367 30946490 31458735 32433749 32978711 34681385 34442416
10956 34442416 36241930 37221584 37949549 39131416 39879848 40103479 40790385 41269128 41604764
10947 41604764 41950656 42024040 42153823 42682312 42974030 43413151 44490505 45299744 46556250
10938 46556250 47156190 48220944 48952563 49792971 50589529 51962320 52465081 52479249 53546912
10929 53546912 53807905 54078305 54247007 54147819 53828284 53802424 53545504 53473253 53038873 52596842
10919 52596842 52827626 52233897 53144910 52860893 52596692 52061289 52359680 52120961 51832416
10910 51832416 52150936 52802257 52675464 53356861 54283040 53989595 54802929 55791720 56013319
10901 56013319 57182879 58154422 59654701 60545702 62166722 64133614 66094746 68121453
10893 68121453 70682522 73661011 77579913 81260166 85327745 90668327 95850646 101166797
10885 101166797 107272795 112301668 116877814 121381320 124729199 126598602 128013102 127894194
10877 127894194 126059040 123920853 119862886 115521148 110798700 105253802 100531913 95234706
10869 95234706 90096036 85020678 80547181 76123605 72010641 67567091 63808746 60739238
10861 60739238 56952401 54039970 51021929 47945222 45378306 42920584 40116809 38120517
10853 38120517 36279664 34175435 32748199 30711662 29684195 28401032 27013766 26028225
10845 26028225 24678965 23699664 22706507 21433227 20766969 20237466 19179250 18586733 17670138
10836 17670138 17395018 16663806 16417372 15885931 15761150 14918184 14582366 13650416 13464330
10827 13464330 13198275 12848811 12576318 11956649 11414408 11320293 11200426 10970393 10638967
10818 10638967 10324805 10211775 10367086 10367058 10440516 9773370 9397414 9266475 9330548 9224195
10808 9224195 8921495 8804919 8651984 8573493 8715890 8050137 8200245 7745692 7621009 7413064
10798 7413064 7678563 7798128 7013506 7318583 7300278 7128875 7180078 7285825 7357340 6548831
10788 6548831 6730882 6768878 6421877 6557504 6609031 6106647 6482221 6338463 6314156 6359487
10778 6359487 5874393 6285220 5809481 5492275 6035814 5896771 5720770 5689636 5566560 5367591
10768 5367591 5165545 4950355 5279624 4721018 5614357 5074110 5143386 5359035 5468174 5721844
10758 5721844 5266240 5538253 5429975 5675987 5230483 5476757 4855159 4612939 4931939
10749 4931939 5054299 4863932 5039272 4763407 4918181 4524473 4966728 4465520 4185799
10740 4185799 4599379 3862223 4288970 4496022 4203087 4256675 4647863 4287036 4119707 4929935
10730 4929935 5020840 4323119 4876387 4741616 4915695 4658892 4607287 4551101 4235072 4199552
10720 4199552 4301372 4422605 3941990 4293978 4339875 3771463 4332854 4279079 3772688 3864823
10710 3864823 4243082 3962499 4151894 3980654 4081583 4327415 3941894 3956225 4573898 3802377
10700 3802377 3896173 3951060 4726508 3987736 3791378 3875880 3913619 3705784 3680685 3755159
10690 3755159 3477659 3924757 4002465 3834160 3630938 3821491 3791963 3649220 3693566 3846947
10680 3846947 3855628 3926297 3709869 3835703 4139853 3978814 4516272 4220138 4499326 4724010
10670 4724010 4325414 3565211 3757263 3847616 3067501 3688374 3349819 3595570 3327111 3691092
10660 3691092 3392439 3468212 3132998 3096970 3745158 3458880 3818371 3965726 4376022 3991185
10650 3991185 3965842 4250693 4061799 3821146 3698156 3596073 3636731 2928395 3464362 3671954
10640 3671954 2705491 2582897 3359269 3090199 3050100 2891803 2394514 2852595 2873694 2459483
10630 2459483 2780769 3072438 3383614 2791480 3016833 3256718 2820748 2762220 2590929 2861502
10620 2861502 2870837 3062985 3006818 2325631 2803411 2894218 2218480 2982044 2794911 2640599
10610 2640599 2943054 2785530 3146281 2851881 3113959 2372211 3044176 2831349 3089234
10601 3089234 2978335 3309417 2552929 3113239 2913615 3159438 2880278 3239396 2649146
10592 2649146 3493880 3072295 2781554 2927114 2649531 3316199 2742300 2795385 2637287 2729344
10582 2729344 3242164 2681893 3247776 2944637 2803975 3132555 2888564 3080822 2779816
10573 2779816 2827630 3153830 3169582 3211662 3067310 3026412 2828480 2608293 2911431 2912881
10563 2912881 2981000 2560392 2497686 2259249 2312182 2365111 2614857 3210971 2715044 2552427
10553 2552427 2660478 2634711 2533829 2474240 2324085 2031103 2401414 2517858 2158216 2342331
10543 2342331 2917296 2778587 2256905 2415019 2453596 2677865 2202395 2366985 1987902 2361740
10533 2361740 2228721 2419038 2307971 3006972 2401662 2520573 2800205 2774844 2691668 2454915
10523 2454915 3182654 2992924 3222912 3405131 3419965 3998376 3618817 3846222 3501255 4004301
10513 4004301 3981159 3588013 3598594 3331394 3532084 3269045 2853796 3006747 3105908 2565056
10503 2565056 2261781 2716676 2850831 2760799 2698204 2889477 3104022 3158604 3062680 3406572
10493 3406572 3719638 3912479 3805494 4145257 4350539 4733469 4476492 4658450 4498894
10484 4498894 4915399 4788920 4025596 4045801 3605047 3916504 3435475 3554197 3587552 3612495
10474 3612495 3984485 3541883 3318124 3660828 3655580 3670576 3876187 4171775 4031716 4140517
10464 4140517 4199307 4285933 4671451 4149462 4444491 4880454 4264393 3800978 4086860 3971862
10454 3971862 4118953 3703929 3634599 3770919 4205703 4052639 3642745 4013101 3503627 4429647
10444 4429647 4140164 4109154 3885467 4301860 4348709 4465279 5345758 5774129 5792343 5308624
10434 5308624 5953280 5909637 5551253 5399757 5672951 4573233 4047232 3719106 4330054
10425 4330054 3860954 3749301 3811029 4105834 4265757 3626055 3869825 3214172 3682002 4098568
10415 4098568 3614231 3901598 4007037 4355109 4429966 5216661 4725720 5170658 5123131 5461952
10405 5461952 5547456 5468684 5268504 4919223 4998991 4737346 5305856 5047600 5352069 4628776
10395 4628776 5151163 4790699 5072118 5177554 5054945 5028228 5569604 5299525 5136302 4953781
10385 4953781 5223990 4954367 5216212 4953128 5385522 5206797 5377845 5184738 5634560
10376 5634560 6226795 5766140 6402024 6459078 6594654 7075049 6661815 7135237 6840299 7492080
10366 7492080 7618605 7233276 7391398 6798001 7068122 7084204 6784936 6589578 6672603 5867789
10356 5867789 5938948 6234059 6267697 6250229 5933264 6304322 6863370 6119791 6607054 6418679
10346 6418679 6473013 6760961 6899878 6382401 6298007 6585046 6363414 7224483 6842687 7498477
10336 7498477 7020741 7127271 7098638 7682622 7655255 7723581 7551404 7556392 7310612 7132465
10326 7132465 7175208 7355054 6874897 7685275 7679029 7508956 7834308 7508178 7396788 7371867
10316 7371867 7536319 7959438 7884344 8115330 8241676 8203458 9098499 9358557 9824132 9549361
10306 9549361 9747984 9793926 10034709 9903705 10608016 10671130 10404167 9612413 10253926 10577762
10296 10577762 10566642 10849777 11373285 11608835 12095903 12407776 12836271 12846290 13990927
10287 13990927 13807689 14375744 14770114 15431429 16452070 16631387 17239900 17597024 18557469
10278 18557469 18764749 18878730 19342044 19563913 19970884 20278336 20382282 20239273 21395469
10269 21395469 21917489 22333281 23379067 23750408 24360606 24651978 24997007 25131953 25445291
10260 25445291 25528905 25625326 25445391 25592350 25569611 25924880 26311707 26513593 27269423 27769220
10250 27769220 27021197 27032880 27286203 26520596 26147919 25213535 24701228 23565753 22999876
10241 22999876 22762509 22390052 21216059 21289014 20438368 20600383 20294905 20318965 19228849
10232 19228849 18927053 18776141 18421233 18331726 18128307 18055579 17280532 17428035 17402647 17074808
10222 17074808 17245028 16780913 16609175 16074604 15297773 15145172 14697472 14641170 13901348
10213 13901348 13268534 12837579 12178716 11823394 11607212 11111874 10789914 10294204 9992106
10204 9992106 9500946 9947139 9153485 9017582 9028028 8937813 8595131 8493698 8123661 8182087
10194 8182087 7612837 8053334 7209901 7864781 6938858 7402706 7050169 6999907 7170651 7464277
10184 7464277 7222670 6978332 7043786 7038544 6816475 7320509 7202609 6516580 6664022 6898585
10174 6898585 6447667 6558927 6286906 6451535 6188570 5983597 5942373 6088784 6355693 6030857
10164 6030857 5781902 6301443 5916108 6129814 5803817 5997959 5695451 5901123 5893824 6179468
10154 6179468 5755488 5656919 5995536 5914539 5586050 5751318 5684936 5694053 5733802 5460003
10144 5460003 5681136 5228511 5315415 5028389 4502369 4870673 5255304 5301674 5526487 5037813
10134 5037813 4631467 4555332 4984080 4727274 4852688 4466843 4519398 4457312 4701600 4889351
10124 4889351 4011411 4125293 4487734 4393176 4123172 3989462 4232369 3972264 4170237 4045048
10114 4045048 4050980 3774652 4306743 3704708 4290810 3540841 4102667 3768749 3812068 3910104
10104 3910104 3955809 3796840 3889874 4093679 3854600 3779139 3532805 3373785 3637647 3616165
10094 3616165 4145464 3758054 3957175 4017225 3944672 3895140 3969235 3822819 3745584 3639095
10084 3639095 3641565 3707238 3709745 3706980 3524264 4376252 4134633 3822182 4215968 4104991 3987200
10073 3987200 3810502 4173262 3904100 4396775 4263869 4117189 3898552 4158625 3555584
10064 3555584 3856646 4249324 4322512 4123563 4455739 4186307 4359939 4198351 4288600 4465480
10054 4465480 4526053 4628334 4907119 5017846 4610217 4471684 4440589 4778203 4481821 4380532
10044 4380532 4697496 4316880 4308466 4650130 4302140 4819619 4645360 4527048 4723660 4448359
10034 4448359 4575156 4781850 4607752 4424569 4570225 4316503 4521414 4314968 4713692
10025 4713692 4496941 4448372 5202026 4744770 4508913 4604598 4441920 4537885 3940777 4295934
10015 4295934 4463135 3869033 4202490 4187126 4017313 4046269 4293474 3995561 4464177 4406607
10005 4406607 4552553 4242378 4136112 4053987 4055999 4296830 3775935 3706816 3974605 4059089
9995 4059089 3713964 4127466 3622174 3402134 3594511 4102084 3641267 3437571 3409218 3040356
9985 3040356 3606380 3676072 3269036 3009701 3328758 3213049 3232801 3136661 2866503 2975629
9975 2975629 2402720 2900463 3035001 3040476 3009852 2672491 2988165 2527069 2612817 2760509
9965 2760509 3239238 2517249 2986760 2638522 2666915 2772425 2214216 2097732 2596873 2634844
9955 2634844 2497485 2622269 2464186 2480418 2094421 1956262 1774001 2213295 1905556 1704714
9945 1704714 1957127 2035143 2337211 2061346 1884334 1874434 2061208 2107743 1850621 2431381
9935 2431381 1881057 1465300 1967719 1481730 1537611 1733394 1921581 1876035 2439490 1274803
9925 1274803 1338908 1747775 2116306 1560598 1687217 2063871 1975294 1514396 1837743 1531688
9915 1531688 1611821 1652586 1742965 1596770 1803276 1806247 1670726 1654795 1322097 1542284 1631849
9904 1631849 1585056 1843585 1779073 1803641 1831693 1528143 1849436 2257822 1772386 1237165
9894 1237165 1832575 1492378 1752529 1245784 1650030 1339223 1801461 1693729 1129274 1555719
9884 1555719 1174298 1795662 1848459 1737216 1714354 1731408 1798312 1765973 1722065 1702060 1337834
9873 1337834 1737039 1745340 1386326 1690686 1052972 1953165 1764736 1142413 887152 1420537
9863 1420537 1627022 1573184 1729831 1174188 1429995 1663067 1319867 1358245 1359797 1763576
9853 1763576 1419283 1475929 1662853 1808029 1455115 1353798 1414040 1241057 1150923 1657714
9843 1657714 1904007 1283473 1476747 1728251 1756118 1707571 1828708 1576937 1736234 1636132
9833 1636132 1361637 1591173 1540006 1758921 1658200 1328553 2365291 1396650 1293151 1756235
9823 1756235 1585027 1634527 1799017 1700361 1532840 1519990 1387284 1343707 1459545 1700542
9813 1700542 1792414 1536550 1309074 1641306 1467535 1773842 1572028 1218279 1574282 1217576
9803 1217576 1398484 1780492 1613791 1946621 1258077 1486096 1696990 1425478 1127171 1204743
9793 1204743 2044279 1521387 1418462 1223318 1837353 1040078 1386663 1532808 1386117 1027787
9783 1027787 1418949 1497802 1292070 1357499 1133828 1366359 1417931 1027044 939978 1847534
9773 1847534 1342352 1918468 1751415 1580951 1262165 1694309 1168351 1810930 1758856 1246631
9763 1246631 784484 1394096 1469440 1334399 1341909 826690 1186077 1238264 1568336 1114204
9753 1114204 1203342 1511235 1190962 1529273 1096682 1404084 897110 831934 1283705 1135283
9743 1135283 1105956 1291270 1262569 1724731 688965 1142199 967096 1165994 1359585 738996
9733 738996 1014931 655152 1145992 1241664 898399 1204218 1198302 1290086 629152 855489
9723 855489 754576 730311 799828 987135 979340 1083077 489757 987681 602234 1081238
9713 1081238 1148174 1636972 902849 823421 683128 1042761 978482 1214073 1094290 528538
9702 1227665 861277 1106233 1130478 1269420 1088564 500168 1046745 1067204 679764 1078040
9692 1078040 1066673 1070267 538105 1292945 985112 261579 914156 500565 945208 747936
9682 747936 952656 1220952 915815 657368 1127557 973452 1007886 884382 1000191 801986
9672 801986 1133699 697740 415438 767629 1076812 1243219 901150 1110238 1375854 972231
9662 972231 888860 703402 698034 715277 840703 845190 868128 831749 861121 425454 720751
9651 720751 873845 944705 442921 727420 963204 498664 816204 643008 1002571 691922
9641 691922 711952 805531 588168 785856 1126297 1179609 970800 870894 1165408 912451
9631 912451 809218 1120922 805418 949107 1063973 879496 957947 664068 958474 851277
9621 851277 700870 847080 585066 726884 379749 972472 886669 810301 512663 433821
9611 433821 702507 681739 644007 705103 1479065 1085976 929431 1012976 787868 366444
9600 558037 842482 561089 714260 509687 1009123 380736 976191 1159588 618962 1068774
9590 1068774 621155 1088480 826307 629290 1342825 663999 738273 919488 858138 1049194
9580 1049194 1302180 793369 772490 1380675 671503 925608 979647 485407 713109 287816
9569 625099 53176 908138 995799 704279 968582 759719 617435 998940 841497 940802
9559 940802 977783 1157889 958907 805460 383197 253589 962066 634832 864507 888781
9549 888781 525974 516030 276905 383544 1288281 760773 617192 589231 504349 397770
9539 397770 757022 1117058 232770 374297 759502 1063858 590508 1217609 868770 353309
9528 1255112 807388 577956 622847 739076 615670 241554 996261 741012 611644 941451
9518 941451 313375 808829 444966 1069050 427413 555923 550366 305515 806694 642719
9508 642719 1047591 561250 353586 340195 671668 598242 718484 681752 325169 815119
9498 815119 391113 413505 218868 654319 881314 388161 874676 412982 749439 279066
9487 503713 553458 810388 190380 811267 714997 714157 713896 756817 601595 843553 480784
9476 480784 241296 444413 187016 649796 624017 625665 702553 373111 457218 793773 542182
9465 542182 886666 779251 549969 543472 539005 704488 676019 463997 477356 437979 325032
9454 325032 429230 357740 724570 405255 166385 502283 362072 634620 551596 116243
9443 -106080 505785 414573 431930 621729 409706 345786 580587 166830 276172 544155
9433 544155 482360 554221 407290 723811 555432 761515 344241 334961 422568 799260 545279
9422 545279 132424 648482 157120 646810 520538 751715 537130 476061 1930 661999
9412 661999 1063696 666863 436586 254026 571116 596552 580032 635804 -179118 375106
9401 263401 452964 990466 393876 717661 649553 700794 485254 783069 790926 517021
9391 517021 368528 373404 405215 744534 572948 447760 60104 685361 -183320 410369
9380 162626 252553 380516 530628 320246 272552 486506 250380 505213 386116 -50097
9369 605020 340520 517313 355383 330501 192629 157976 241844 263741 248353 502518 7790
9357 -20097 368083 101759 774161 546424 344954 421354 447493 171166 205729 426963
9347 426963 679571 511153 386621 430387 -197797 132103 378402 266374 393975 -13686
9336 2875 605535 338735 613237 489831 316124 420530 558018 784554 520886 336944
9326 336944 691468 537420 706018 665406 715867 85871 -39556 89309 287951 415109 243676
9315 243676 501684 -90086 224304 637402 401446 293051 535890 378015 932321 186117
9304 324295 609289 44768 95491 582124 333372 559690 326923 574718 717392 -255008
9293 145720 462513 -82159 353568 365735 394402 216890 279945 319768 464704 733095 270409
9281 331337 507491 359502 111196 683454 550506 742422 446572 569099 348736 551631
9271 551631 300727 204217 359304 96352 180722 407488 469839 -1430 462304 77092 493944
9260 493944 489478 -136364 -208113 396564 432317 222244 486263 950494 176126 647726
9250 647726 178067 447174 443562 530646 -47138 327183 819961 554085 591469 40752 158758
9239 158758 544095 693227 324434 379841 84850 515189 737845 -1371 976485 304912
9228 498399 216317 636216 374431 177991 354387 227896 23002 821847 589144 572480
9218 572480 300856 1697 219604 551478 13002 578432 626935 311265 512101 462378 128858
9206 66029 367920 285181 206426 509904 638822 182690 -183493 504430 317191 220136
9196 220136 220637 372122 280861 341179 152071 316675 196868 80230 490906 -48398 906356
9184 414089 661636 233960 449351 151649 458059 604406 395692 344785 394632 264308
9174 264308 535673 629647 206994 476401 178230 90144 447674 680606 654385 -256198
9163 343329 -24740 657793 400672 526974 488845 512052 88424 323498 122959 413833
9153 413833 726009 119420 -48152 783953 166307 424094 444500 442436 227833 509996
9143 509996 105286 188925 190532 718575 -107605 22856 130347 291065 201942 403592 294306
9132 294306 570 427267 283503 345654 378020 656276 740963 451683 250406 91434 -58572
9120 613318 213862 400882 290792 186104 402938 281464 743438 646603 75880 106743
9110 106743 474137 165850 443067 262412 36182 358493 257497 558770 789089 894104
9100 894104 531691 574830 634329 253032 458158 544307 458215 623865 436890 562889
9090 562889 273957 252387 684226 499602 121250 599263 78931 750001 681788 290332
9079 406118 419498 302744 424517 440728 382029 462633 307046 537412 498655 186560 24766
9067 490256 80093 297321 181973 314454 412328 173954 373049 517178 -43425 496767
9056 1043536 307188 28707 502013 538922 611531 334269 -80437 312318 250484 314910 468753
9045 468753 -173716 428570 246341 130657 184046 177400 369003 464202 315130 270396 437385
9034 437385 331281 604646 -43641 600693 482372 723265 516925 428570 333015 95219
9023 187266 112298 -24440 311067 458588 321183 -3175 406666 697590 137945 389689
9013 389689 -24380 610101 -19225 408768 613171 375319 164862 -33484 684343 215077
9002 262741 366136 341160 144449 489859 503141 346791 116293 503422 213397 485609
8992 485609 641516 808504 275316 321504 172584 58189 256038 713636 252002 287183
8982 287183 332882 638245 128219 209863 493122 366937 207105 -243618 784127 127706
8971 602330 805034 125753 672917 97576 782552 407106 131376 239779 143700 522323
8961 522323 846842 400934 170185 252716 339389 453926 70985 846364 746418 161664
8950 -82216 375148 703245 866538 16494 199768 303373 531608 447741 326995 529971
8940 529971 245801 624370 475058 57691 701132 528402 698491 525161 231378 474024
8930 474024 313615 484276 345917 463799 329050 224933 390459 629638 59928 509854
8920 509854 382219 8487 563247 352766 422619 330244 537542 611286 274746 436697 509230
8909 509230 442031 676948 606635 1049435 286731 789734 732117 456363 861311 792716
8899 792716 474496 1021915 647321 548824 765862 638012 664630 422125 686905 678159
8889 678159 925278 762468 792821 967483 1103502 748710 1159141 1061150 691727 1295640
8879 1295640 1138817 805396 908857 745570 1135364 747776 844328 1046702 1104539 1301584
8869 1301584 1086985 894078 1251432 1170288 984812 1381477 779703 974407 1062279 710850
8859 710850 1212279 997893 950567 1192142 342429 597974 535963 520580 947776 1024890
8849 1024890 334278 920781 781675 900229 638984 661279 1148192 190320 428765 1152344
8839 1152344 821633 416922 887854 606925 385514 703463 462982 499729 855721 506515
8829 506515 444409 524227 456354 402174 667564 341821 -50383 536779 691502 258027 101407
8817 467039 154696 607643 576166 64089 156116 691145 673444 224754 596929 708970
8807 708970 181763 474517 504373 125844 704959 243262 69672 449727 433724 447900
8797 447900 150567 747350 822295 429938 432260 -75773 416496 334805 562643 414607 -124801
8785 -214491 624510 765551 215917 409724 261796 441571 494494 -42062 -207142 232654
8774 437510 146099 116976 195412 310229 -133267 236589 -278059 469011 -57536 420881
8763 445268 989162 -63505 616929 197342 481123 297098 371052 290870 607959 497383
8753 497383 462780 595122 587444 -32506 283862 502293 389058 194919 197254 728965 66212
8741 380845 232662 427426 140940 527684 64987 -198076 577113 608587 304420 239367
8731 239367 -184995 531916 529988 80072 486445 51415 404078 111898 260768 686939
8721 686939 372847 -179462 15974 132483 84456 -30322 358640 274882 274366 277880 304130
8710 304130 79616 344183 214849 -133107 158646 246329 165426 432531 138334 290221
8700 290221 336336 171199 660790 -216676 461120 546263 -75583 230438 -276796 458321
8689 472429 287261 95654 290758 46567 -87581 170282 60733 348390 154869 319859
8679 319859 154466 514694 389191 63857 476963 524398 380797 117133 415868 147067
8668 200046 661543 551774 188366 -141304 99746 156886 58835 479982 139596 -380192
8657 324759 565042 -46084 632294 775641 -20369 251945 147935 397588 601276 104528
8646 189774 354544 49628 302598 331252 206917 233931 157318 -230415 579527 592241 354142
8635 354142 71444 87595 523069 53082 127385 -218708 414701 522140 71926 333554 458714
8624 458714 345248 426896 -120758 53207 600597 -172449 -213011 611815 539609 106449
8613 255270 135288 260861 434376 217947 233418 44257 298454 -21638 111100 63872
8603 63872 119269 443517 444175 -25392 639939 805021 564307 144058 302643 99319 85227
8592 85227 52649 39747 431114 385779 945990 141439 571117 -144189 476507 317492
8582 317492 653560 601048 481037 538339 460221 508376 569084 90633 244835 57967 72835
8571 72835 289387 170891 -187086 97227 75951 -7359 423139 268003 103426 294428 243346
8560 243346 538844 -17055 640149 377194 252536 460339 -256132 109868 66786 -31204
8549 522242 295232 85620 568745 163879 617882 389744 279322 26052 396757 92086
8538 373276 198845 247413 319699 107342 669797 461609 190985 50325 283081 -85748
8527 357526 -63047 20315 148160 796735 286138 93316 129910 -49792 519358 570247 207130
8515 248242 -62890 -64816 224167 469360 -74939 182360 229650 -219998 -36430 -1777 480629
8503 190083 178272 -18494 482060 502125 -158560 431847 85930 -33769 563870 58840 93646
8492 93646 419488 490645 -22692 -293261 161248 144492 194196 284549 370402 39339 -72416
8480 118425 171891 -7889 -36038 264061 182286 258116 433635 424024 172890 444421 67497
8468 423106 51648 149039 74435 374036 194726 404582 64754 -274185 528831 765328
8458 765328 164234 259436 169447 264440 193161 390755 404319 98423 -8767 -224593 526700
8446 319642 -289220 569239 369142 398139 339325 82413 174608 342486 -6195 210624 201416
8435 201416 -504 -5323 96246 86439 3871 66675 8379 429418 324019 428956 458716 -314798
8422 135511 108236 199017 204599 -95559 494954 107783 195029 -28209 429692 54130 410301
8411 410301 278212 76937 -127137 117473 84741 -256048 236365 130196 261204 440710
8401 440710 370595 51093 398851 272902 -43705 242125 44505 -128529 116981 -50620 -150884
8390 -150884 124493 260684 402469 313407 181085 166347 155873 -52468 -64776 158343 189191
8379 189191 102332 120355 49299 406850 137389 235811 353592 245400 194740 58705 404178
8368 404178 118824 480055 -108576 -83019 184825 458857 414050 198262 302697 121537
8357 -40784 163330 657199 -72324 190540 -176760 143627 90712 -129213 297482 548697
8347 548697 645781 281878 341692 24391 212271 353301 22431 482623 310804 106652
8336 -162830 166167 679542 -138843 431554 31710 -274874 191055 168625 200691 104546
8326 104546 237426 197612 209153 497095 633124 276055 433665 640554 -121491 589495
8315 504044 387581 219402 1189 546892 280829 -46730 314507 555168 -33607 39694 379315
8304 379315 260245 52197 317425 329073 286444 70969 -22424 618193 679930 118295 -187875
8292 731039 -72273 667270 567045 282806 -152615 112241 470293 171973 -164110 -99980
8282 -99980 86559 412804 240528 357178 32169 82386 139007 -95962 143692 44461 -388017
8270 129370 78171 231166 -169164 400650 208455 158261 282831 347147 156977 452152
8260 452152 597800 11400 101622 212906 495121 225252 135585 277290 389062 44139
8249 566174 -123505 -382300 35524 155832 418688 123063 486414 76663 482950 433075
8239 433075 463101 225786 -102327 183523 -40127 192877 -178022 216313 371443 -65299
8228 454710 96200 14656 482238 350004 -168694 312239 309587 -124847 260694 95379 401422
8217 401422 -7304 -203638 -20702 375918 263176 520911 218146 6148 319962 -17975 103786
8205 544965 130105 183205 966723 461070 153459 408112 -341957 402578 81023 140432
8195 140432 393186 206021 299542 471389 479408 364492 754299 -51747 57404 303377 500643
8184 500643 -113378 -346571 -83727 66998 -28220 -139788 -80291 -30287 327602 131395 -58029
8172 27526 206069 243614 562049 71712 672296 346661 430813 452137 -225240 403518 -10934
8160 -69662 -95682 544913 -55267 198411 -110874 60402 533522 45365 169956 315101 85213
8148 -188481 43578 110161 266375 132300 -248155 108411 622801 256620 218882 324114
8138 324114 545047 54988 173554 -105290 55742 47295 81480 247827 219616 118757 -54711
8126 484437 415728 471025 14273 516428 72844 78871 308516 -135712 578306 201126 32142
8114 537004 69257 351454 39354 282212 402200 596482 -331281 179060 67731 380139
8104 380139 159474 -479277 159048 36251 12755 -207554 382172 112941 -18134 132639
8093 -27421 -261485 125544 243928 -335190 -26541 176531 221996 217586 254990 -85788 218129
8081 16636 34729 314242 -109550 234251 312954 207824 174202 166195 12461 -56632 324043
8069 164474 143230 -69952 153200 146151 223431 420250 -39261 25840 -28571 185399 -55983
8057 423217 -229631 76976 162741 250117 -153842 215432 363689 219122 -105469 -138801
8047 -138801 -21732 178691 -177156 376849 624423 42724 24987 171982 140306 -27667 386380
8035 252980 220154 229722 141372 297071 346896 232643 402905 559777 646053 489642 -49901
8023 -19103 -147474 475079 226801 -292834 715722 378910 453011 66437 -78372 38516 -82574
8011 -367111 422111 232491 287538 562064 38632 315352 206754 40823 424595 -211221
8000 68109 270133 193911 260078 90435 453179 -82616 -46921 408933 444291 108371 28991
7988 -55690 229868 -193092 -63164 22829 -134689 -2837 -6774 -285121 -13304 86405 243480
7977 243480 158165 193487 415704 94791 326404 442427 682330 -75337 769293 -71375 -14378
7965 -2272 188949 -313784 603276 264174 2346 328437 -151769 94224 -10880 408833 142239
7953 -441198 -119887 486683 169304 514929 5752 33515 233659 373724 505045 118165
7942 353636 -117871 79392 215248 511211 -304250 107800 -237407 697437 242313 183911
7932 183911 204470 52961 -14327 19999 436817 380411 232673 162345 222517 529870 -121385
7920 108288 -14677 -146219 190994 -167121 -89405 413851 492059 -235331 450838 228255
7910 228255 67439 657999 211179 393416 207911 280987 25073 445484 277703 694161
7900 694161 -117316 332109 546491 397784 -21014 388905 190363 30187 -61134 295844
7889 328456 107962 -103964 -157327 171402 16988 -27883 323728 447786 -155266 133906
7878 171324 432551 221457 76888 -153886 -377933 400623 147961 40641 -51255 167352
7867 191149 319107 316902 814680 198407 621165 4846 139560 140765 187750 209114 309026
7856 309026 534669 287725 355722 -77045 191254 -91332 -220817 548116 146814 -170900
7845 485519 168178 111043 246684 -167861 -12915 396921 -144392 -339817 434140 583296
7835 583296 132787 388966 241330 194392 -66682 197382 392711 51176 -87920 40481 331367
7824 331367 15717 102289 49122 70831 179636 -50992 197783 13091 63135 56843 682591
7813 682591 188879 564750 348675 -244638 252536 115921 155462 267439 3284 401490
7803 401490 -285744 -371007 98119 584196 188439 -157007 150220 673123 -373634 119617
7792 323995 400851 465941 -27141 370910 32941 145713 257951 -160790 -159160 278032 341799
7781 341799 88134 -93558 205949 296234 93982 365347 93985 513134 -100879 93812 117132
7770 117132 488058 267471 -145274 88413 -7117 86527 448807 284819 67338 599914 -124926
7758 134849 643145 -72357 403339 310158 86358 268339 357162 575139 -42851 -54706 118797
7746 128377 -71727 171640 -154363 270381 507684 289745 -151372 99041 302540 -160960
7735 -345505 -30947 206620 207179 82102 -98391 102667 630136 179680 441050 -474 123736
7723 426217 117185 -125162 6191 192914 53591 175988 133214 390850 -103852 170909
7712 409963 -183137 51095 -293836 25921 205755 278841 50650 173543 221371 -173874 276854
7700 360277 52042 158681 -36401 79676 202899 482614 -170974 33224 170173 7824 95587
7689 95587 547660 328910 372011 -199366 31911 215504 459373 343703 154928 159499 361655
7678 361655 590161 -68781 640804 195187 317066 283195 -32489 328644 28299 582524
7668 582524 -106617 29535 491082 183603 131689 185365 -32212 -118318 100395 87751 98592
7657 98592 156422 157365 141749 32254 133276 441348 6769 32904 429874 186810 -32471 258949
7644 43791 211547 -81248 330847 -260328 -172557 548849 141095 805314 102720 -147943
7633 610492 -150360 337948 90702 271462 -2406 322089 503684 4726 474175 20742 113879
7622 113879 441212 -23083 -255550 -166326 110812 -18256 171788 -252650 93385 -69586 -82664
7611 -82664 -18609 -66140 109146 -169104 94974 336177 178973 -166089 -13590 144268 457765
7600 457765 -214675 192786 54631 239304 73638 -75153 268915 92440 -19949 16431 216975
7589 216975 501865 591490 158990 -232356 173044 213750 -377965 -10855 379072 358373
7579 358373 187977 322249 -21237 210500 -174783 111748 176812 -135110 181381 -36426
7568 39491 -134519 91376 62065 406756 319 76067 -81985 126222 299051 -541620 280774
7556 -63558 51486 -446014 -375935 208609 40940 337848 51363 -63966 124634 254273 201461
7545 201461 164524 -20898 747776 -145877 338828 260685 261610 -171668 172319 -67148 -68473
7534 -68473 84162 488743 129863 -91270 -185177 -148544 54205 71573 456324 182784 657666
7523 657666 548881 340100 462886 -25763 73735 93282 109925 183544 67732 121408 140964
7512 140964 -205602 -238033 -99148 -27811 14509 262828 104726 -144386 -362086 71996 -132077
7500 174122 17079 233118 486348 -66074 228131 -145419 -365276 -154949 -152658 48906 -101110
7488 311160 138361 367976 628056 245467 64440 -317166 -52709 326152 246027 346292
7478 346292 -108357 132205 298217 194644 571895 -98095 -102678 351204 248566 -654296
7467 352916 268756 -211672 172000 403835 448778 -136624 -253229 102999 131415 31484
7456 504470 -125129 161946 172157 104001 191468 569969 -34396 269376 216901 275187 -22241
7444 -1097 -276112 241790 467077 607613 -48768 73479 196598 23086 385824 -376247 47104
7432 390565 47729 309051 61133 244371 58446 369185 398700 43952 55660 -149978 74662
7420 11614 144737 154519 10800 -201941 175004 459811 26852 -153999 -194380 143424 97967
7409 97967 177915 -315307 184331 66118 -49938 320077 121209 -250454 433490 296297
7399 296297 -53184 307623 316708 391925 -416350 272822 11691 135473 276314 186650 146067
7388 146067 453658 47237 323328 74035 -136592 -68994 236823 -186378 66071 -37415 47630
7376 308322 165258 112673 411250 91611 255932 195206 -33628 253219 -91457 18676 246762
7365 246762 52813 -145137 -20162 268844 122229 272668 133157 87388 364741 -211192
7354 80954 -143657 146862 180336 133658 -137585 -41232 -301893 362111 80892 341816 -11268
7342 353592 -93906 -96497 -38165 -120466 80513 33139 237140 374733 -128195 -104119 404203
7330 -312992 173885 -379304 -329670 41715 22357 220286 29270 -88551 67834 387843 -259019
7318 309078 95581 230658 466572 272141 212083 -49449 -72311 326144 5485 276826 -64806
7306 84869 342797 270064 -111468 -130552 48054 -66091 -8886 -38382 541420 86499 -77561
7294 884490 38091 681009 121019 -107028 375715 187156 72024 5955 157446 160099 -31141
7282 703201 -208668 -145780 -6747 332867 251896 -314374 279256 412655 -2511 -68349 -23383
7270 443295 -26660 -374867 500190 254797 596811 137069 -43180 382524 -187627 447107
7259 -59336 453241 -117244 -341450 171124 -185651 153376 -52939 741521 448010 119673
7248 -272017 -232661 271183 123377 -4174 35756 172806 -5781 101177 214013 274892 -64490
7236 331825 -378936 148083 -111670 158486 192002 -61496 -141417 276539 740406 186146
7225 261795 184458 23208 42771 217345 201143 -330500 -151381 -300876 269275 -90952 269633
7213 86426 307891 -76328 507710 -185135 542397 550580 371438 262031 180394 -212829 116364
7201 243535 274253 -48133 464174 96851 391620 404230 571431 30124 338373 350558 509133
7190 509133 493573 122737 -22862 343316 -84024 423132 274365 323148 -153570 384916
7179 120876 154088 117652 331818 83831 -154323 -158070 163210 -381279 149440 316759 410682
7168 410682 -49037 168659 355433 -397844 164183 158356 273087 385541 67894 229534
7158 229534 177303 358582 304904 -47906 347610 148917 -83837 -159803 27071 171155 223894
7147 223894 -234023 -24770 -82870 18687 -145688 -87554 -106258 -239617 504402 -256792 -401977
7136 -401977 -45104 386887 418964 209569 -277078 448170 96468 -255573 452908 176662
7125 -70548 636375 -154421 413091 78455 50706 -95153 36828 141210 305517 162262 235019
7114 235019 141046 32071 318608 64918 44955 -42611 171797 262377 -171934 239035 -463355
7102 194616 157880 180759 271811 2293 -58308 54812 331374 -166768 -166885 100616 29269 -474819
7089 73837 159654 348556 57863 494225 -30148 224499 286189 304490 -170512 -97761 -52489
7078 -52489 377891 456509 88738 -46195 30493 415509 25162 35623 142989 191909 276072
7067 276072 731648 -84254 -36976 11382 364552 346094 86114 -74450 59976 474487 -39134
7055 84181 -163745 -31599 794073 407677 105614 545473 406493 152365 -253414 191378
7044 -137233 199700 -199547 513739 329298 291065 -168602 -176454 259438 235110 -320568
7033 110880 352348 344704 85781 341833 -276741 180496 -69855 -197979 330350 375097 102521
7021 127237 339877 306720 54069 -94262 140816 -254020 379636 138943 472766 -161122
7010 -99053 -40199 242344 271673 -402973 -31493 210493 -189459 -405084 -40445 131467 168873
6999 168873 -261134 164863 272898 108895 393091 396756 141385 259509 59092 467651
6989 467651 -57608 28894 233126 -161419 158465 -35896 -44069 281375 150441 201864 -238385
6977 -224421 -228489 -239607 462211 206026 -181795 121695 117479 253056 119079 688025 29055
6965 -84799 -238102 517157 165564 487985 262910 138844 -310878 -41886 116997 189215
6955 189215 887369 -238079 -57308 36052 22295 366688 -103984 297521 248754 615279
6945 615279 -125718 131681 13724 106246 124683 62930 -244635 8789 -175454 -133123 157253
6933 19274 140052 114141 -78289 396881 76034 7129 -94130 64955 -13531 171048 34596
6921 190379 -258848 387165 81312 160568 184345 -107304 250168 -30580 262911 160868
6911 160868 -62809 169689 280480 -159594 372173 54920 237882 58168 18862 169922
6901 169922 205551 -463282 182205 -216164 -180664 531265 309129 156358 287976 -179448
6890 283975 235263 604091 75919 218109 24879 -81860 -65284 -291271 261493 -98321 -82581
6879 -82581 197707 373514 -252377 13798 -3092 314494 592698 -390931 3255 186423 292702
6868 292702 -286451 79175 617220 66987 190035 209864 115588 11446 96668 -279563 178284
6856 208194 197211 -272086 -177956 -218288 294877 -226230 336838 467860 142959 153930
6846 153930 210845 306610 -88689 -91247 330964 143715 168897 37704 77675 -182493 -63123
6834 167065 191937 415847 72526 496931 476677 257630 232648 42480 -86528 -88668 -161357
6823 -161357 239614 284327 139163 327049 -537563 484461 -10902 452393 163414 -27224
6812 -74588 380350 69730 -188537 500046 372115 390604 45228 60286 339562 255320 117601
6800 320755 -277718 112312 7270 213063 158204 -463466 122796 188829 236202 303897 142303
6788 1370 -565965 5913 -124967 -160777 292996 -200799 -109157 85804 30681 250674 -181281
6776 271563 -304204 186984 -228289 360284 -99401 -131266 411639 154472 189167 44032
6765 618341 43870 131147 601772 236653 -238796 224923 648871 104812 -66157 271094
6754 301330 59994 87640 430610 325231 -99211 474005 -333843 27429 222823 139333 268247
6743 268247 50983 258818 -348482 -531379 197969 -27952 -244288 292364 273344 -81725
6732 -12630 -182574 360558 -29600 232926 264612 589904 197549 127310 529587 286524
6722 286524 97228 -130135 321960 213751 465308 65807 -165682 -91342 178793 197807
6712 197807 218406 -51419 116717 -211636 82228 -21419 -539572 -119959 9314 43729 287337
6701 287337 264617 270604 129867 217219 -44343 -553827 159217 -53931 235670 212224 137849
6690 137849 -211815 498050 62310 48186 423625 -201143 75709 86419 -12087 148992 60554
6678 57920 109188 279910 450908 348412 445080 98360 116914 220126 125351 52859 201632
6667 201632 162158 357049 287536 93901 377226 25314 -281349 79895 241198 -68043 129773
6655 -120069 67105 378513 -147253 167685 397321 348947 -104270 468805 61096 570588
6645 570588 406767 17809 -637151 89934 475099 547075 -9516 234511 64678 332684 394847
6634 394847 -146725 24955 -33555 399237 -435600 -242692 84566 -241126 173828 51594
6623 306613 472442 -436544 445836 58590 -111405 488549 264414 -175951 74566 125798
6613 125798 117677 316667 246770 -93892 423047 63152 200258 -78667 197198 17447 -294049
6601 168119 447375 209385 -110773 67176 -169544 98816 110053 156227 226224 272720 288084
6590 288084 -133488 -54070 151149 45118 278927 -26422 97392 319820 322543 198919 103462
6579 103462 78580 184569 339184 75721 140082 450007 -277422 -156974 -201682 183341
6568 84767 154793 141134 186785 36368 -136692 -195105 416870 196655 144704 -213032 174905
6556 523869 58888 367299 104053 143251 101558 -53625 208736 298329 210617 353745 -57620
6544 291819 -329238 70029 85349 117227 503178 234190 195890 685207 -261858 -262130 686958
$$ [...]
##END NTUPLES=NMR SPECTRUM
##END=
