##TITLE=Coffee green (TOFR01 0.1002g + 1.5mL buffer 50/50,  450uL extracto + 50uL (D2O+TMS))
without heating, vortex and centrifuged, temperature 0oC.
##JCAMPDX= 6.0         $$ Bruker NMR JCAMP-DX V2.0
##DATA TYPE= NMR SPECTRUM
##DATA CLASS= NTUPLES
##ORIGIN= Bruker BioSpin GmbH
##OWNER= Administrator
$$ 1.72 TOPSPIN		Version 2.1
$$ 2012-05-22 17:20:44.858 -0700  Administrator@X
$$ Compression mode = diff/dup
##.OBSERVE FREQUENCY= 400.131882
##.OBSERVE NUCLEUS= ^1H
##.ACQUISITION MODE= SIMULTANEOUS (DQD)
##.ACQUISITION SCHEME= undefined
##.AVERAGES= 64
##.DIGITISER RES= 22
##SPECTROMETER/DATA SYSTEM= spect
##.PULSE SEQUENCE= noesygppr1d
##.SOLVENT NAME= H2O+D2O
##.SHIFT REFERENCE= INTERNAL, H2O+D2O, 1, 14.97974
##AUDIT TRAIL= $$ (NUMBER, WHEN, WHO, WHERE, PROCESS, VERSION, WHAT)
$$ ##TITLE= Audit trail, TOPSPIN		Version 2.1
$$ ##JCAMPDX= 5.01
$$ ##ORIGIN= Bruker BioSpin GmbH
$$ ##OWNER= Administrator
$$ $$ C:\Bruker\TOPSPIN/data/jwist/nmr/11-coffee-green-origin/61/pdata/1/auditp.txt
$$ ##AUDIT TRAIL=  $$ (NUMBER, WHEN, WHO, WHERE, PROCESS, VERSION, WHAT)
(   1,<2011-10-06 16:49:24.347 -0500>,<Administrator>,<TOPSPIN>,<go>,<TOPSPIN 2.1>,
      <created by zg
	started at 2011-10-06 16:40:29.534 -0500,
	POWCHK enabled, PULCHK disabled,
       configuration hash MD5:
       DA 63 81 1B EF 4C B5 72 B4 DF EA D9 B4 DB 4C 08
       data hash MD5: 64K
       EB CD 38 49 89 0C 89 2A 61 3F 69 31 98 C2 6B 02>)
(   2,<2011-10-06 16:49:45.800 -0500>,<Administrator>,<TOPSPIN>,<proc1d>,<TOPSPIN 2.1>,
      <Start of raw data processing
       efp LB = 0 FT_mod = 6 PKNL = 1 PHC0 = 0 PHC1 = 0 SI = 32K 
       data hash MD5: 32K
       02 E6 0B 98 1D 66 1A 5F 10 D9 72 98 21 EA 39 3F>)
(   3,<2011-10-06 16:49:46.487 -0500>,<Administrator>,<TOPSPIN>,<proc1d>,<TOPSPIN 2.1>,
      <pk PHC0 = 25.25757 PHC1 = 0 
       data hash MD5: 32K
       4D 6D 81 2F DD 30 1F F2 B6 A7 6E 08 91 CB B7 1A>)
(   4,<2011-10-06 19:45:03.690 -0500>,<Administrator>,<TOPSPIN>,<audit>,<TOPSPIN 2.1>,
      <user comment:
       TITLE=Coffee green (TOFR01 0.1002g + 1.5mL buffer 50/50,  450uL extracto + 50uL (D2O+TMS))
       without heating, vortex and centrifuged, temperature 0oC.TITLE_END
       data hash MD5: 32K
       4D 6D 81 2F DD 30 1F F2 B6 A7 6E 08 91 CB B7 1A>)
$$ ##END=
$$ 
$$ $$ hash MD5
$$ $$ 75 5F 45 19 E4 75 52 DA 82 42 A0 92 4E 56 51 DD
##$RELAX= 
##$RELAX= 
##$RELAX= 
##$RELAX= 
##$RELAX= 
##$RELAX= 
$$ Bruker specific parameters
$$ --------------------------
##$DU= <Z:>
##$EXPNO= 61
##$NAME= <11-coffee-green-origin>
##$PROCNO= 1
##$TYPE= <nmr>
##$USER= <jwist>
##$ACQT0= -8.14839601820287
##$AMP= (0..31)
100 100 100 100 100 100 100 100 100 100 100 100 100 100 100 100 100 100
100 100 100 100 100 100 100 100 100 100 100 100 100 100
##$ANAVPT= -1
##$AQSEQ= 0
##$AQ_mod= 3
##$AUNM= <au_prof>
##$AUTOPOS= <>
##$BF1= 400.13
##$BF2= 400.13
##$BF3= 400.13
##$BF4= 400.13
##$BF5= 400.13
##$BF6= 400.13
##$BF7= 400.13
##$BF8= 400.13
##$BYTORDA= 0
##$CFDGTYP= 0
##$CFRGTYP= 9
$$ [...]
0 120 120 120 120 120 120 120
##$TP= (0..7)
150 150 150 150 150 150 150 150
##$TP07= 0
##$TPNAME0= <>
##$TPNAME1= <>
##$TPNAME2= <>
##$TPNAME3= <>
##$TPNAME4= <>
##$TPNAME5= <>
##$TPNAME6= <>
##$TPNAME7= <>
##$TPOAL= (0..7)
0.5 0.5 0.5 0.5 0.5 0.5 0.5 0.5
##$TPOFFS= (0..7)
0 0 0 0 0 0 0 0
##$TUNHIN= 0
##$TUNHOUT= 0
##$TUNXOUT= 0
##$USERA1= <user>
##$USERA2= <user>
##$USERA3= <user>
##$USERA4= <user>
##$USERA5= <user>
##$V9= 5
##$VALIST= <valist>
##$VCLIST= <CCCCCCCCCCCCCCC>
##$VD= 0
##$VDLIST= <DDDDDDDDDDDDDDD>
##$VPLIST= <PPPPPPPPPPPPPPP>
##$VTLIST= <TTTTTTTTTTTTTTT>
##$WBST= 2048
##$WBSW= 25
##$XGAIN= (0..3)
0 0 0 0
##$XL= 0
##$YL= 0
##$YMAX_a= 5484555
##$YMIN_a= -2175659
##$ZGOPTNS= <>
##$ZL1= 120
##$ZL2= 120
##$ZL3= 120
##$ZL4= 120
##$ABSF1= 0
##$ABSF2= 0
##$ABSG= 0
##$ABSL= 0
##$ALPHA= 0
##$AQORDER= 0
##$ASSFAC= 0
##$ASSFACI= 0
##$ASSFACX= 0
##$ASSWID= 0
##$AUNMP= <proc_prof1d>
##$AXLEFT= 0
##$AXNAME= <>
##$AXNUC= <1H>
##$AXRIGHT= 0
##$AXTYPE= 0
##$AXUNIT= <>
##$AZFE= 0.1
##$AZFW= 0.1
##$BCFW= 0
##$BC_mod= 0
##$BYTORDP= 0
##$COROFFS= 0
##$CY= 15
##$DATMOD= 1
##$DC= 0
##$DFILT= <>
##$DTYPP= 0
##$F1P= 0
##$F2P= 0
##$FCOR= 0.5
##$FTSIZE= 32768
##$FT_mod= 6
##$GAMMA= 0
##$GB= 0
##$INTBC= 1
##$INTSCL= 1
##$ISEN= 128
##$LB= 0
##$LEV0= 0
##$LPBIN= 0
##$MAXI= 10000
##$MC2= 0
##$MEAN= 0
##$ME_mod= 0
##$MI= 0
##$NCOEF= 0
##$NC_proc= -6
##$NLEV= 6
##$NOISF1= 0
##$NOISF2= 0
##$NSP= 0
##$NTH_PI= 0
##$NZP= 0
##$OFFSET= 14.97974
##$PC= 1
##$PHC0= 25.25757
##$PHC1= 0
##$PH_mod= 1
##$PKNL= yes
##$PPARMOD= 0
##$PPDIAG= 0
##$PPIPTYP= 0
##$PPMPNUM= 2147483647
##$PPRESOL= 1
##$PSCAL= 4
##$PSIGN= 0
##$PYNMP= <proc.py>
##$REVERSE= no
##$SF= 400.13
##$SI= 32768
##$SIGF1= 0
##$SIGF2= 0
##$SINO= 400
##$SIOLD= 32768
##$SPECTYP= <>
##$SREGLST= <1H.CDCl3>
##$SSB= 0
##$STSI= 32768
##$STSR= 0
##$SW_p= 8223.6842105263
##$SYMM= 0
##$S_DEV= 0
##$TDeff= 65536
##$TDoff= 0
##$TI= <>
##$TILT= no
##$TM1= 0
##$TM2= 0
##$TOPLEV= 0
##$USERP1= <user>
##$USERP2= <user>
##$USERP3= <user>
##$USERP4= <user>
##$USERP5= <user>
##$WDW= 1
##$XDIM= 32768
##$YMAX_p= 460262983
##$YMIN_p= -419297
##$CURPLOT= <Network HP LaserJet P1505>
##$CURPRIN= <$Network HP LaserJet P1505>
##$DFORMAT= <normdp>
##$LAYOUT= <+/1D_H.xwp>
##$LFORMAT= <normlp>
##$PFORMAT= <normpl>
##$SURQMSG= 1
$$ End of Bruker specific parameters
$$ ---------------------------------
##NTUPLES= NMR SPECTRUM
##VAR_NAME=  FREQUENCY,     SPECTRUM/REAL,   SPECTRUM/IMAG
##SYMBOL=    X,             R,               I
##VAR_TYPE=  INDEPENDENT,   DEPENDENT,       DEPENDENT
##VAR_FORM=  AFFN,          ASDF,            ASDF
##VAR_DIM=   32768,         32768,           32768
##UNITS=     HZ,            ARBITRARY UNITS, ARBITRARY UNITS
##FACTOR=    0.250966925370065, 1,           1
##FIRST=     8223.43324360093, -17840,       -285482
##LAST=      0,             72595,           -113671
##MIN=       0,             -419297,         0
##MAX=       8223.43324360093, 460262983,    0
$$ Real data points
##PAGE= N=1
##DATA TABLE= (X++(R..R)), XYDATA
$$ [...]
23441 329544 235625 270344 280112 320575 200622 425448 256567 65481 440741 306574 347958
23430 347958 202738 261346 113565 286314 100842 411139 132691 59160 360472 359784
23420 359784 217588 243922 91769 471633 323161 250327 213599 188904 237100 208255 202207
23409 202207 145063 320663 382448 379073 362151 462262 185944 258479 204193 307394 365893
23398 365893 422209 197886 304893 360643 614999 560819 246115 505067 634667 343798
23388 343798 232462 517461 513346 708415 525814 646127 665752 710294 933719 1027733
23378 1027733 977770 1018877 1461396 1840065 1915668 2639538 3158182 4371345 5737648 7279439
23368 7279439 9219774 11249373 13281823 15700214 17758940 19953553 21489984 22863452
23360 22863452 24316111 24574792 24738647 24418505 23291990 21725181 19889718 17868203
23352 17868203 15814767 13397849 11310635 9254050 7278061 5869741 4067017 3041759
23344 3041759 2268065 1591676 1366022 964745 960326 959995 832866 559487 235155 339296
23334 339296 435116 549621 301892 504444 263656 189918 223535 265878 173134 175771 279728
23323 279728 194507 340014 -8762 244673 486850 190340 137383 458831 121190 260837
23313 260837 124845 380820 138928 -50008 303427 202649 218839 369127 333748 222459
23303 222459 291763 189165 13972 227976 363811 132038 319653 174645 312586 76575
23292 164413 184258 268285 225059 249572 458824 378449 317074 339169 259383 217622 308625
23281 308625 352164 380067 407283 200504 495099 489327 262575 399675 203331 327291
23271 327291 -29274 241376 200471 -12177 204247 345568 437735 372342 43003 366327 368186
23260 368186 347791 341790 266280 292534 340099 475173 152531 375600 328690 453919 183194
23248 276471 425790 364652 390800 263702 231617 418205 443770 400637 290623 332496 328049
23237 328049 423341 321170 5611 184427 233894 317077 157502 55334 173378 76525 282301
23226 282301 190844 134299 277312 208962 46079 377298 114751 315198 308959 270313 531731
23215 531731 263388 177332 191558 208401 160018 128482 48125 153513 381986 155389 45300
23203 342151 278306 329556 276671 134186 196955 245626 389317 272774 276471 243291 348967
23192 348967 227541 132093 287830 235113 72474 193730 112410 359229 393149 203234
23182 203234 205205 224573 59749 419549 211848 134926 187758 126117 186542 163756 284028
23171 284028 308054 318919 160755 107158 40605 24738 334821 220774 101957 250174
23161 250174 319791 382029 246194 317565 323504 14253 305938 219302 419195 410277 302137
23150 302137 179973 114242 398666 250695 166236 113878 555943 232969 374445 194665
23140 194665 398262 321372 103334 132139 274327 122540 -81064 337149 215144 226550
23130 226550 453788 355316 165266 224235 343970 347771 141982 262097 245510 247778 338818
23119 338818 -53090 224079 230178 226707 374854 267231 -68855 436398 89655 221352 206225
23108 206225 540050 191364 358040 306844 109434 226749 243121 485877 170027 150097
23098 150097 319695 342246 403230 420698 421829 469563 344871 340425 291630 261875 154296
23087 154296 171238 115322 429725 506414 130896 372775 454675 179071 192249 110573 252955
23076 252955 157571 304775 274342 259215 219439 20071 290933 201283 541636 373328 284075
23065 284075 226046 373939 339944 188480 422059 620181 196541 87515 374643 394279
23055 394279 384730 67716 313488 343791 229608 186370 230162 534148 297712 314010 435873
23044 435873 -34903 259494 253400 357972 302058 448108 225854 233219 155350 241859 541644
23033 541644 380652 212023 290257 183912 338559 293876 178527 26966 266870 434499
23023 434499 334100 341510 528746 152971 162800 232073 273515 256999 163151 395522 241184
23012 241184 455406 394925 312444 313711 181448 179024 309824 184534 356875 137925 275783
23001 275783 360428 381287 194233 481085 364373 370804 456709 138281 164849 445698 386409
22990 386409 371915 275156 231169 277693 275294 487732 167042 483183 355334 328774 554056
22979 554056 421395 595159 482891 577598 240978 591094 629042 563037 559100 605414 771445
22968 771445 282909 459623 605266 648397 499153 587542 684151 366155 639149 721962
22958 721962 678456 803282 712936 933517 1094270 1076810 1345525 1380862 1746939 2550106
22948 2550106 3487465 4323890 5529676 6468898 7946741 9095664 10327297 11635899 12776602
22939 12776602 13271880 13498851 13470949 13501025 12916344 11901741 10883510 9618996 8356021
22930 8356021 7445086 6271196 5039062 4028279 3464081 2902957 2587744 2299727 2169107
22921 2169107 2473346 2530496 2839772 3609497 4625066 5793701 7400231 8697071 10442014
22912 10442014 13086519 15166611 17414436 19451327 21310496 22969800 23989076 24256950
22904 24256950 24660970 24190767 23167370 21471048 19759419 17774274 15901859 13923149
22896 13923149 11662026 9849697 8248955 6925096 6467839 6118407 6225428 6336230 6600619
22887 6600619 7358868 8010772 8815304 9490732 10162711 10877159 11287077 11528160 11672384
22878 11672384 11325747 11033951 10667748 9653951 8734409 7693413 6713331 5884767 5047960
22869 5047960 4162253 3193279 2950676 2438692 2194482 1871202 1531529 1341041 1354268 1212848
22859 1212848 1012470 900418 702364 858137 450219 694584 705629 504217 553074 614189
22849 614189 547743 454648 383853 789866 487293 387721 326350 525461 509102 513531 172371
22837 434024 337493 520813 321215 344451 341591 369234 505839 462108 406139 208234 356343
22826 356343 342023 413964 137619 87079 615698 387178 245869 447975 175493 216518
22816 216518 302420 410229 319860 368187 415311 298291 102957 453566 435025 262120
22806 262120 196507 292082 548243 489853 184360 232142 533120 442979 84817 300494 142451
22794 420516 231536 58891 157682 285461 460986 447738 186232 265711 196482 259598 252277
22783 252277 368594 457631 242810 400124 251479 371240 144227 163997 454781 193884
22772 288119 389473 458668 386447 290578 291661 173593 328921 359350 399760 196022 296689
22761 296689 322051 370933 240222 310957 393865 152333 295329 327717 163192 94427 539337
22750 539337 280470 139782 405319 251933 322456 170104 215414 570115 244725 197462
22740 197462 239133 38719 273850 308205 326386 386050 344945 168766 243858 180474 273775
22729 273775 342022 392061 172566 193678 258272 582485 146223 422759 310899 184689
22719 184689 225449 454558 568106 216126 316151 233674 324269 410487 335039 169299
22709 169299 241168 307481 378959 190906 83693 203545 349680 214468 383588 435965
22699 435965 296618 255508 373929 462351 461654 166152 416290 152587 147414 264480 366013
22688 366013 320667 101675 354658 511418 270600 404324 -25114 214101 344453 243384
22678 243384 252509 305940 321564 74692 194870 195053 286267 282246 285657 391255 225776 266511
22666 266511 203649 470836 318210 449927 76637 335079 297848 391532 389633 494588 316859
22655 316859 172425 411794 493378 203734 -66386 467097 392291 304712 63018 179026
22645 179026 273912 212990 269183 54362 391590 275420 369514 405741 194781 370094 415573
22634 415573 478979 415928 201499 357212 542638 248051 396688 309079 468030 416429
22624 416429 173584 456691 453000 104032 429010 639647 560161 234010 347227 347741 272536
22613 272536 491753 529189 473171 485781 328512 417712 450030 256016 547398 327063
22603 327063 510918 311727 507973 322489 576535 327494 400170 541744 371935 382862
22593 382862 566162 332063 547954 518825 247394 414340 380733 483360 430799 485057
22583 485057 364733 392973 663227 206444 374873 378701 606988 392343 317874 498874
22573 498874 422615 433859 369400 346088 415770 467599 602017 451517 334981 151892 264161
22562 264161 407269 403875 440059 584293 498239 515037 583408 784324 335217 515191 361089
22551 361089 491505 284950 574561 405798 478229 434816 597274 431948 494196 431067
22541 431067 378006 606410 364634 330806 478931 403852 543691 489790 572496 196573
22530 355394 393641 561981 247558 386158 595942 313604 872059 298536 715504 556520
22520 556520 206422 427794 351816 303899 252716 409802 479241 516459 458815 427995 552364
22509 552364 725381 565650 442158 370782 347053 418553 167810 464230 413640 295755
22499 295755 276102 572883 522954 676342 350767 387746 486387 455803 622312 449382
22489 449382 477887 739390 648186 282857 342401 671307 628998 526195 289585 430893
22479 430893 633608 298575 495016 217440 557466 224020 251601 398924 534066 562093
22469 562093 428834 528443 365700 428000 326034 407166 263425 149415 452656 388995
22459 388995 337708 430436 399817 469171 202843 280773 417072 523477 550287 382146 580347
22448 580347 417629 328468 446752 469608 271992 400168 580148 348855 330535 740256
22438 740256 456068 343440 604167 598864 333719 603784 452344 372384 342817 385267
22428 385267 504371 458618 442272 198734 604718 382493 286210 412195 246759 388194
22418 388194 428449 570498 460880 316626 609069 501911 466239 324601 513482 414332
22408 414332 462134 502803 365114 482186 423666 524172 488403 483643 576203 443504 522876
22397 522876 598063 423068 545600 281377 498208 730085 809842 430217 459863 484492
22387 484492 538589 451241 474127 477791 403487 599571 696770 305390 661787 679830 247652
22375 403122 377767 275195 272250 322507 453948 539859 389481 380231 516933 434796 588606
22364 588606 442760 350113 367690 465681 334383 311978 468104 656138 561168 429914
22354 429914 582005 372644 514137 521886 478659 512065 484946 446067 418997 410432 690029
22343 690029 484110 442218 342560 551994 404518 279340 589318 677187 518162 576322
22333 576322 609617 659521 734416 508284 667285 779076 1092252 1247179 1346602 1129550
22323 1129550 1199151 1077060 988019 760870 926485 817045 687633 498211 731992 823689
22313 823689 622921 560548 559457 542144 692680 645253 634492 599110 888380 610514 674400
22302 674400 521664 591271 442614 465371 706379 486077 471773 623394 476675 739958
22292 739958 571066 685521 718909 668724 607897 518754 642561 444091 525711 565063 785889
22281 785889 670628 632878 728260 254850 720054 399599 544458 672061 686400 690438
22271 690438 339856 597780 710656 685584 850529 691576 577239 567814 596169 646573
22261 646573 630518 611924 686453 561911 594491 624400 676357 730368 880636 536579 590620
22250 590620 632314 747068 612959 815582 729420 745395 515710 458051 515350 776533
22240 776533 618272 400924 611355 627106 634049 750072 665984 709742 501414 510476 536143
22229 536143 410514 665653 706194 552379 603053 714632 551306 454179 1048982 377884
22218 560622 847905 681833 471619 720765 561825 774650 760532 900914 598690 589918
22208 589918 504887 728614 578616 656969 534663 871374 802702 464757 725466 705408
22198 705408 580166 791731 705883 724828 543692 647260 837929 641926 759252 805176
22188 805176 689506 786856 510559 667744 877642 351361 687327 616781 888153 651482
22178 651482 660470 731700 708382 805473 943489 987637 552919 821994 481576 744190 772695
22167 772695 732283 639111 740640 648457 628466 627465 527209 779941 664941 685857 668062
22156 668062 607855 676366 635583 779116 769409 695269 707714 993120 609117 641096 839422
22145 839422 716135 801970 699562 668725 763014 713448 627936 460421 717543 871610
22135 871610 884485 520978 484481 697013 931345 780767 717416 650432 374651 741502
22125 741502 686277 822168 724437 711357 713263 451423 685693 832695 830613 766518 565905
22114 565905 501874 799319 850827 821888 678394 371320 519294 582993 618107 789336
22104 789336 684867 659460 564551 595567 668231 515204 738088 838942 725609 605923
22094 605923 491923 631971 767543 735331 647311 817030 503143 733074 897296 791200
22084 791200 951891 693829 598601 721695 757463 704772 643282 753945 607251 551030
22074 551030 699576 724047 635928 733660 508590 798152 677726 581338 762992 566642
22064 566642 519508 696178 737716 570438 710753 737401 928138 615201 748312 599527
22054 599527 846743 633870 774467 617621 776181 693760 715369 699100 827023 587313
22044 587313 545078 885076 810791 691331 597434 637319 558861 631457 751100 703152 742636
22033 742636 584681 587779 785441 763933 637979 575141 554700 748199 759686 677289 724827
22022 724827 1114547 562732 721426 782294 635414 669868 621776 590610 688014 809051
22012 809051 750888 737127 526807 738154 769357 873911 630640 616554 676250 608590 787127
22001 787127 873433 602936 813527 722343 817337 872281 822952 579700 734150 734742 837099
21990 837099 564688 941198 621716 577786 891217 848311 620572 787491 648205 728562
21980 728562 656982 871020 925697 766169 730763 811757 776453 687182 864640 861310 763491
21969 763491 757558 706655 734111 764004 829306 848083 881455 678378 623949 749041 680966
21958 680966 967199 962886 897124 712110 811926 821247 935616 889611 798227 982630 863330
21947 863330 952018 664942 845442 670034 942778 876109 800191 848282 994622 797876
21937 797876 989376 828352 985830 1024969 854570 669588 981018 1073164 760296 819346
21927 819346 862724 818628 629727 699001 441827 743837 750987 811527 881020 804362 772298
21916 772298 657134 957623 666135 852147 965720 741973 873551 940994 597319 832415
21906 832415 788027 779947 661294 871783 884379 986026 599294 918494 793765 925732
21896 925732 1029921 956735 1049436 758787 871099 772125 695719 820024 834679 776847 720867
21885 720867 1026533 703012 822331 1006065 938808 770428 1027167 1034538 1008692 881519
21875 881519 682895 891622 1014454 829026 1073706 708430 745985 705911 652801 711839
21865 711839 735055 879405 715717 907777 920802 842773 822556 837878 828631 1013307 909639
21854 909639 766904 863055 797915 870266 870564 834672 967736 991382 829590 827253 887740
21843 887740 960183 836949 803807 716499 805576 582154 779129 767311 983169 726964
21833 726964 971172 736199 730106 761024 814188 742820 972470 834558 827341 894751 848533
21822 848533 962470 1031495 824528 701441 1037284 1103032 1007652 771078 1008433 759317
21812 759317 600876 713687 1040830 892259 642281 733104 820544 684632 416994 794259
21802 794259 994559 707161 963395 919346 808656 907827 915146 643660 689592 858027
21792 858027 649185 624496 865199 651756 613333 656194 871279 910040 712185 641535
21782 641535 855884 834302 640226 735552 709789 856042 777197 852377 1059902 625454
21772 625454 861809 872829 678752 868488 1027700 920472 757833 955173 1080784 758087
21762 758087 1149779 1143106 1192544 882017 1086619 1282411 1216696 1327368 1293214 1418472
21752 1418472 1438862 1653506 2201973 1956394 2136550 2557061 3180789 3412900 3922585 4295109
21742 4295109 5421663 5920185 6474789 6871229 7312145 7608304 7596628 7212403 6732718
21733 6732718 6409051 5728526 5150886 4386224 4418600 3811875 3693762 3608494 3706156 3758693
21723 3758693 3841594 4112517 4580069 4870205 5589558 6252751 6988303 7714258 8568921 9255048
21713 9255048 9879068 10080505 10493398 10809116 10638842 10751819 10671319 10348486 9583471 9288612
21703 9288612 8668315 7685057 6929176 6510538 5497308 4989215 4428885 4052416 3799228
21694 3799228 3614512 3419334 3481357 3302151 3693140 3849101 4200245 4621485 5144871 5603720
21684 5603720 5896809 6525104 6787523 6860864 7075879 6553652 6028043 5675050 5062105 4382726
21674 4382726 3674920 3140068 2715446 2207618 1850288 2137408 1643542 1679616 1486100 1249015
21664 1249015 1285493 1299915 962472 1186322 1030557 1148668 1048925 983075 936986 1138103
21654 1138103 942833 801334 845251 935057 961861 854864 879994 787129 911867 761130
21644 761130 791627 902863 650441 940902 726990 645406 690084 850641 753008 809673
21634 809673 641544 698642 828418 834586 878253 731693 899494 686755 712201 643659 747120
21623 747120 717640 759196 777185 638567 858897 676838 642433 787797 602268 710550
21613 710550 748000 575436 879061 784736 541001 730514 736405 831172 796685 708921 706140
21602 706140 836912 576759 912827 828638 750270 1025534 990684 754038 983903 853204
21592 853204 788210 605870 897810 545253 663985 747437 718010 840698 563053 563000 797452
21581 797452 708685 772034 806586 581633 945042 709080 760816 781981 572044 661696 845856
21570 845856 926540 790002 861442 662989 565087 834222 848046 744076 806316 582261
21560 582261 861830 608364 722993 646061 713727 512068 779360 765645 707214 595053
21550 595053 833351 712325 925660 906134 652150 698237 611141 819110 600121 527534
21540 527534 664343 956394 612481 848135 698663 627775 709193 907575 770951 761174
21530 761174 733274 850097 588115 894000 644538 774867 844780 675029 661795 883341
21520 883341 770172 887553 1007933 802453 575760 956528 627634 937279 1094980 874347
21510 874347 753935 928367 848045 746229 760640 683845 991027 791894 721926 897588
21500 897588 899635 977161 791522 1049565 1057998 1087962 1028572 1006100 900804 1039265 909738
21489 909738 915239 1014368 1046424 810732 857454 881032 961207 996654 663389 929807 1007184
21478 1007184 925639 928976 1033522 1014642 798409 1156234 992033 741549 734488 727020 830138
21467 830138 946050 942651 753738 858477 662183 753252 845899 820310 789069 741700 882183
21456 882183 846746 686303 1028743 937072 784503 942097 792085 857498 1019749 971902
21446 971902 876005 881787 955231 776464 908901 872350 997938 841252 883373 862708 857720
21435 857720 807569 756516 768717 654202 731012 1037155 1118855 865150 935342 818340 894571
21424 894571 807146 777606 989376 952837 704750 1062072 1003321 890341 720642 910604
21414 910604 852043 874996 1039512 1059191 797395 763789 952265 916247 997990 960878 830799
21403 830799 1164720 870159 1273516 958574 1019361 1083864 845833 1021909 798014 866959
21393 866959 654200 875162 827194 922191 1082181 976821 957370 1016898 983796 1007657 897441
21382 897441 753576 712941 1234865 1228464 994784 1185664 863924 1137616 820428 988784
21372 988784 996653 1263102 894311 1190009 975195 1200650 1137647 1065249 1215157 1366737
21362 1366737 1168479 1288706 1034229 1119904 915952 1088377 1177164 1283231 1132525 1228235
21352 1228235 1128544 1195653 1175405 1206300 1281355 1252856 1423774 1513799 1372528 1565107 1531236
21341 1531236 1653910 1581074 1540892 1593775 1732363 1810949 1808005 1769737 1904660 2075159 2096607
21330 2096607 1958292 2240739 2609909 2518835 2635170 2969441 3094812 3116709 3364553 3563372
21320 3563372 3846890 4340474 4506275 4799852 5289754 6055975 6790712 7589966 8481901
21311 8481901 9871594 11130061 12463577 13979820 15679858 17078617 18769713 19954711
21303 19954711 20526543 21190768 21165811 20522820 19706263 18199576 16688767 14947812 13571203
21294 13571203 11780195 10466463 9188950 8168442 7195952 6509291 5499533 5067703
21286 5067703 4792789 4568781 4018959 3572895 3655816 3114566 2964416 2908899 2695902 2599977
21276 2599977 2298861 2330572 2245545 2050580 1890618 1957021 1700637 1795954 1553605 1641425
21266 1641425 1670186 1572278 1320848 1490191 1284795 1257682 1079604 1271494 1033850 1119559
21256 1119559 1300731 1015402 1031199 1121087 1119173 1247789 1090098 946588 1200511 1160175
21246 1160175 1275616 1253605 1109763 647039 1007565 907681 894031 1025573 977499 905909
21236 905909 1123009 1194585 718085 1113340 872436 877885 938650 917335 1052383 990675 776782
21225 776782 1214407 1216848 1000142 1016405 829598 910343 805416 1012241 1135533 953603
21215 953603 1027407 845982 867446 1049704 897339 868844 1042102 870568 837864 816588
21205 816588 1061668 965110 1030777 1063994 851580 789856 1047081 996487 1105844 1092976 1256534
21194 1256534 1061809 1217081 761619 1113015 1011587 1078998 1042872 942257 1186884 924539
21184 924539 936141 952258 1052761 1101140 1064432 1119841 1252222 1197651 1209473 1077080 1106598
21173 1106598 1088886 1212483 993420 854098 1108773 914911 1110934 998288 1001273 727155
21163 727155 898249 901785 842446 1148424 967842 683884 993262 914132 867897 967381 853985
21152 853985 1005530 983489 829490 830670 946229 925574 1066611 879643 878651 956337 1053343
21141 1053343 917163 695288 1048350 888186 953515 945940 1040217 1014934 971254 1026778 1063618
21130 1063618 1196795 1166764 1449080 1314948 1436509 1379159 1588593 1190444 1263977 1296929
21120 1296929 1034481 1291464 1331056 1174308 1021036 1030357 1046988 1297325 1398435 1210665
21110 1210665 1230262 1271442 1316161 1184427 1424879 1284733 1506889 1274881 1352118 1236324
21100 1236324 1356951 1493166 986791 1377616 1360543 1131088 1434921 1123504 1151501 1472350
21090 1472350 1182374 1560425 1157437 1100649 949406 1103003 1223962 1139107 1158847 1356966
21080 1356966 1226566 1129902 1220536 1085614 1329504 1398982 1567457 1508216 1555665 1903698
21070 1903698 1727754 2094223 2584119 3037582 3626320 4048007 4147203 4597216 4770525 4561194
21060 4561194 4427986 4148622 3136922 2830616 2610902 2272172 1964958 1889402 1918933 2004822
21050 2004822 1878061 1982054 2046807 2216050 2208186 2494111 2577504 2994737 3149558 3568370
21040 3568370 3771200 3937208 4059235 3979168 4093230 3412817 3349548 3176831 2551176 2485606
21030 2485606 2357947 2110642 1934339 2070854 1923930 1997946 2098456 2026115 1961602 1690843
21020 1690843 1858494 1894437 2161013 2022313 1853154 1995020 2208614 1989184 2107850 2217727
21010 2217727 2223607 2440112 2414826 2502551 2839662 3020178 3583242 4029717 4376112 4930932
21000 4930932 5336011 5518987 5829584 5712667 5387511 4944942 4468373 4313311 4086222
20991 4086222 4156525 4097813 4775938 5179941 5765463 6399597 7377663 8351795 9652919 11116054
20981 11116054 12576109 14440565 16715610 18873688 20835406 22530578 23726765 23780359
20973 23780359 23116282 21998629 19580804 17389099 14542111 12272518 10041864 8223234
20965 8223234 7252823 6042274 5542633 4868005 4208395 4103295 3835555 3545258 3228424
20956 3228424 3280190 2753555 2773489 2647475 2524394 2160329 2376452 2265103 2191367 2226978
20946 2226978 2205199 2220111 2113842 2265603 2000535 2122954 2085708 2281344 2234270 2209425
20936 2209425 2252862 2343291 2555481 2528693 2644740 2836974 3013909 3059128 3443719 3594082
20926 3594082 3763915 4380093 5005168 5674777 6369602 7488344 8710876 10085013 11507958
20917 11507958 13121642 15066125 17007369 18990950 20456493 21834600 22450216 22148103
20909 22148103 21602252 19720771 17367059 14887597 12544470 10250531 8519400 7069644
20901 7069644 5980154 5244677 4608635 3910690 3396170 3191475 2940819 2715913 2476717
20892 2476717 2255689 2232739 1816360 2183075 1808030 1594004 1810531 1504891 1520230 1726491
20882 1726491 1668709 1658352 1478071 1138301 1298023 1692254 1560121 1712780 1578851 1454469
20872 1454469 1295711 1422525 1462026 1397512 1604356 1576802 1331498 1648639 1449798 1512800
20862 1512800 1480166 1440156 1445104 1600727 1297664 1836994 1824661 1696310 1709799 1693545 1571856
20851 1571856 1712016 1730970 1518461 1710408 1983097 1556426 1472719 1457681 1497810 1563129
20841 1563129 1689747 1391924 1422434 1448783 1585528 1458414 1561220 1635315 1606293 1421412
20831 1421412 1331626 1566485 1383636 1418906 1278839 1623588 1544124 1502887 1691800 1609465
20821 1609465 1816163 1793564 1689238 1727213 1685113 1731505 1849086 1702223 1737231 1705348
20811 1705348 1339653 1564677 1345778 1445272 1299920 1377194 1565411 1455924 1401778 1276839
20801 1276839 1458989 1590996 1406789 1727812 1432209 1427269 1384074 1378804 1450898 1329598
20791 1329598 1266314 1337851 1411319 1525103 1478429 1657275 1269210 1262371 1343956 1430272 1528661
20780 1528661 1335162 1388237 1376513 1521642 1281055 1430006 1037892 1494276 1306391 1212882
20770 1212882 1259041 1260429 1354355 1333953 1087125 1391242 1113731 1122501 1115713 1427436 1371335
20759 1371335 1358322 1291247 1111325 1231126 1455462 1208156 1279002 1253636 1457464 1339689
20749 1339689 1323795 1262396 1442602 1234995 1514489 1503837 1064920 1118280 1517741 1402191
20739 1402191 1502112 1332688 1196081 1310002 1306301 1435698 1283571 1470404 1219089 1127365
20729 1127365 1070522 1225078 1413197 1366925 1399448 1133363 1403791 1339500 1409915 1416968 1220380
20718 1220380 1334793 1504603 1336398 1000125 1390515 1322693 1456699 1355830 1174345 1280140
20708 1280140 1337053 1505766 1414486 1372946 1424175 1291418 1295514 1470919 1206173 1266413 1295871
20697 1295871 1214832 1181540 1114557 1293027 1179542 1088286 965575 1206256 1345846 1097065
20687 1097065 1110942 1212068 997868 1146614 1278889 1246562 1258918 1336306 1599519 1524122
20677 1524122 1393963 1520172 1534753 1476161 1519547 1499754 1245852 1188360 1461476 1366975
20667 1366975 1123983 1295662 1292186 1332264 1365067 1304054 1302029 1434383 1223818 1407226 1402620
20656 1402620 1194129 1498479 1071075 1268148 1407589 1438141 1606379 1634136 1631256 1451884
20646 1451884 1478910 1429357 1455375 1567603 1541479 1486640 1410529 1331434 1318903 1405857 1486453
20635 1486453 1321134 1598003 1295353 1134368 1258265 1299255 1406298 1261523 1332790 1309369
20625 1309369 1354165 1245358 1229363 1135550 1322222 1374910 1264070 1125122 1375801 1217133
20615 1217133 1204941 1257608 1408992 1402385 1367291 1247935 1109499 1355951 1342807 1312488 1012983
20604 1012983 1116770 1100587 1179968 1161302 866713 1189670 1096972 1016187 1204039 1186219
20594 1186219 1171183 1008736 1084600 968548 1059944 1036504 985704 1317286 1336208 1122806
20584 1122806 1135119 988272 1103718 1124935 772505 978619 927889 847401 1170636 1291846
20574 1291846 994295 1228347 1036191 1084783 1123784 1106543 940106 1008255 1035656 1009195
20564 1009195 1183562 1165323 1057554 1346397 1220362 1169946 1246190 1098618 1299278 1238759
20554 1238759 1187132 1287704 1232589 1258258 1121633 1112866 1088142 1158269 1198547 1383635 1075103
20543 1075103 1219211 1267769 1285127 1324684 1202747 1361153 1602192 1459799 1397258 1444005
20533 1444005 1424774 1632778 1595806 1721346 1385068 1509027 1430073 1369875 1565066 1278607
20523 1278607 1302820 1389003 1192497 1141299 1199616 1210687 1369541 1189269 1381535 1168411
20513 1168411 1193006 1295690 1347327 1640318 1638854 1344000 1560578 1431414 1274389 1551384
20503 1551384 1474671 1588230 1520553 1649760 1624478 1703957 1623236 1433048 1396151 1495392 1411781
20492 1411781 1316464 1282991 1492900 1405052 1553775 1366934 1584059 1444241 1657183 1611081
20482 1611081 1777580 1569237 1820992 1417742 1530615 1558571 1493468 1416106 1410349 1555937
20472 1555937 1512969 1436168 1377839 1812539 1455520 1441177 1414838 1358128 1436366 1344978 1458274
20461 1458274 1356566 1434059 1157512 1284919 1197128 1179174 1259750 1246231 1354875 1252025
20451 1252025 1170720 1423966 1223273 1420162 1118784 1228949 1182262 1170283 1281523 1135201
20441 1135201 1351828 1149170 1464737 1386156 1022317 1310095 1419761 1324528 1643515 1433960
20431 1433960 1497613 1438674 1530935 1449111 1688980 1348000 1408621 1104104 1517880 1515267 1558811
20420 1558811 1310375 1556910 1371172 1363718 1277535 1505596 1346746 1281505 1471699 1365074
20410 1365074 1226366 1320448 1281792 1609981 1399542 1641231 1368804 1442003 1523438 1413210
20400 1413210 1499774 1511598 1438429 1384996 1409009 1467971 1343475 1537223 1512891 1178232 1505423
20389 1505423 1332992 1273530 1315791 1272336 1444202 1384016 1562697 1255882 1625322 1410346
20379 1410346 1264596 1181257 1354063 1399538 1501589 1492014 1502139 1736174 1535311 1782805
20369 1782805 1826211 1765737 1744232 1762746 2018424 2058033 1938013 2265390 2031982 2020647
20359 2020647 1960971 1848087 2148108 1856268 2021159 1790168 1702964 1717832 1687300 1547685
20349 1547685 1485763 1650467 1302680 1695144 1494727 1486692 1376177 1605458 1675894 1433480
20339 1433480 1617568 1690058 1717515 1662604 1776826 1780971 1612799 1716119 1659349 1799324
20329 1799324 2076329 2150677 2189188 2393333 2529063 2651493 2875302 3437775 3702574 3765462
20319 3765462 4117005 4429814 4575194 4652629 4726279 4823651 5004849 4949866 4965547 4479278
20309 4479278 4759334 4483818 4106581 3651054 3502964 3046616 3159882 2294137 2659072
20300 2659072 2346329 2561509 2314536 2113027 2128223 2192444 2409011 1921529 2096905 1887698
20290 1887698 2021298 1817259 1872339 1887101 1949031 1690045 1928974 1978040 1685351 1872824
20280 1872824 1577757 1820395 1741268 1976489 2055362 2089612 2095873 1896476 1949173 2164499
20270 2164499 2152571 2162190 2033999 2201977 2001531 2062378 1985997 2085379 2013106 2087035 2365969
20259 2365969 1975506 2248397 2484811 2598932 2254287 2545308 2613191 2771163 2759917 3092426
20249 3092426 3265487 3430897 3747219 4159361 4488103 4830083 5557382 5998772 6589461
20240 6589461 6883791 7531110 7577615 8146530 8321634 8728786 9264512 9202338 9048891 9168539
20230 9168539 8826544 8440771 7836836 7421982 7111074 6881254 6485891 6154344 6077689 5612423
20220 5612423 5285281 5027074 5023603 5044137 5187730 5190187 5430128 5811328 6259350 6600690
20210 6600690 7080826 7801775 8476394 9326620 10755680 12066452 13534891 15585967 17034339
20201 17034339 19080870 20928416 23032363 24395484 25975300 27145751 27881866 28380152
20193 28380152 28591943 28504593 28176891 27528252 26384779 25210832 23418501 21256576 19432864
20184 19432864 17053410 14894261 13187080 11647257 10251948 9197552 8234178 7374285
20176 7374285 6908027 6532592 6086270 5558897 5663791 5704244 5594113 5241075 5374581 5014534
20166 5014534 5261609 5040522 4923876 4841444 4639412 4911730 4568039 4711908 4581211 4454535
20156 4454535 4301743 4174053 4206442 4282436 4426650 4897083 4503226 4939070 4960346 5342338
20146 5342338 5214060 5349921 5491427 5477704 5546906 5429672 5295798 4986492 4817081 5186027
20136 5186027 4707731 4278274 4134679 4196088 3909176 3510956 3484945 3572928 3417916 3375741
20126 3375741 3722961 3864236 3825644 3979658 4433699 4668052 4941962 5700198 6210955 7039136
20116 7039136 8080291 8847832 10054145 11296589 12345078 13808075 14643514 15948048
20108 15948048 16599714 17326419 17773981 17728150 17567059 17346625 17006942 16303673 15805153
20099 15805153 14805060 14035524 12822106 11970704 10653666 10074408 8755618 8221280 7380980
20090 7380980 7397333 6951066 6477777 6648903 6918220 7297838 7484706 7722121 8496604 9593631
20080 9593631 10606493 11877863 12907129 14327402 15437425 16405638 17010542 17746348 18062257
20071 18062257 18385533 18132760 17765238 17206235 16761656 16214190 15100110 14102669 12586556
20062 12586556 11329661 9993725 8555425 7537231 6734691 5955074 5286920 4684488 4475531
20053 4475531 3992559 3735625 3434722 3264209 3055220 2986548 2867018 2839443 2662086 2746514
20043 2746514 2659203 2341176 2312904 2299639 2190863 2043464 2071004 2096062 1984818 1819948
20033 1819948 1734254 1949846 1665253 1749777 1617455 1719608 1698130 1675714 1722388 1566644
20023 1566644 1586916 1584424 1679588 1555489 1384394 1664402 1483541 1587369 1497998 1478046
20013 1478046 1568325 1350547 1616207 1447919 1333793 1602638 1418415 1351409 1615605 1451124
20003 1451124 1265660 1396565 1536185 1277371 1327597 1408798 1548795 1353255 1282744 1364308
19993 1364308 1489646 1350175 1428540 1300540 1450384 1429562 1606646 1380873 1414090 1509483
19983 1509483 1267254 1572220 1530984 1555064 1416494 1350187 1498214 1541749 1702317 1474575
19973 1474575 1584225 1431945 1427468 1485559 1487080 1544927 1748890 1652529 1485796 1694693 1524981
19962 1524981 1551338 1308940 1464571 1878803 1621051 1640767 1677327 1569336 1662413 1631515
19952 1631515 1779854 1794468 1705523 1578512 1724571 1838824 1753951 1870154 1723785 1800858
19942 1800858 1863109 1733831 1799516 1858936 1698999 1933530 1638080 1961246 1759848 1956491
19932 1956491 1909599 1749617 1887757 1828765 2039965 1813244 1909931 1732115 1758360 1882971
19922 1882971 1739440 1824970 1817150 1828711 1974302 1793451 1864532 1915410 1941526 1858468 1963966
19911 1963966 1883757 1786244 1695277 1889346 2100656 1929033 1770632 2100824 2074382 2194784
19901 2194784 2023532 2059450 2454958 2341643 2265573 2190013 2321706 2308868 2610675 2414440
19891 2414440 2683705 2624467 2541756 2845412 3007725 3191723 3202127 3115842 3089998 3298384
19881 3298384 3460217 3855630 3644456 3809238 4032038 4095212 4479730 4337769 4594973 5045207
19871 5045207 5177991 5711123 6230826 7062626 7845143 8888944 9519240 10494397 11338424
19862 11338424 11808144 12495190 13006866 13588427 13914095 14663529 15654465 16682415 18121128
19853 18121128 19691882 21186642 22277134 23289463 23507591 23305771 22474288 21012281
19845 21012281 19600316 17659907 16132833 14393896 13211163 11859218 11048625 10573801
19837 10573801 10409547 10019053 10134148 10288171 10740539 11119795 11833421 12086165 12235611
19828 12235611 12541412 12550846 12921694 12996568 13322637 13863581 14410156 15472159 16707422
19819 16707422 17568166 18426431 19057065 18867679 18482391 17581731 16141027 14678895 13110013
19810 13110013 11595698 10264887 9108215 8004073 7387208 6639719 6045727 5613392 5037021
19801 5037021 4935549 4435915 4543833 4142999 3887908 3802658 3665660 3457198 3173796 3173197
19791 3173197 2983306 2998243 3049954 2815614 2720704 2682081 2530970 2434506 2329303 2421099
19781 2421099 2439839 2422268 2305747 2351871 2450347 2476346 2130283 2453612 2317352 2483699
19771 2483699 2309626 2382028 2272593 2330171 2174243 2269380 2151043 2340879 2427730 2311907
19761 2311907 2306562 2302441 1978245 2289793 2142353 2156793 2280540 1961496 2208105 2126687
19751 2126687 1998281 2478182 2252609 2132355 2336986 2006174 2122363 2308297 2121742
19742 2121742 2043537 2045448 1936867 2022866 2029505 2064090 2033380 1944699 2160892 1904267 2041306
19731 2041306 2208601 1802200 2098264 1814033 1973267 2047250 1996599 2039663 1981102 1882378
19721 1882378 1914703 2017471 1756121 2018103 1863530 2019263 1947149 2165048 1972831 1763882
19711 1763882 2066890 1812783 1779191 1833449 1913400 1705671 1839692 2078871 2123637 1828111
19701 1828111 1758234 2087035 1745908 1964453 2177817 1780955 1856354 1778023 1846331 1778005
19691 1778005 1823863 1751485 2047074 1579421 1874618 1667058 1588030 1911252 1739977 1894841
19681 1894841 1725356 1831571 1633775 1572994 1588883 1791239 1699433 1751357 1812326 1747601
19671 1747601 1779897 1442138 1561870 1612788 1447709 1809215 1779690 1759049 1483821 1657340
19661 1657340 1642488 1849262 1777837 1623273 1584480 1929025 1776850 1646313 1823012 1628033
19651 1628033 1582039 1704215 1656599 1312272 1713906 1710498 1662639 1754256 1685851 1734251 1425221
19640 1425221 1551096 1774301 1732791 1499225 1770439 1606947 1644889 1650283 1703541 1497938
19630 1497938 1843237 1622289 1683570 1392417 1555533 1482805 1565861 1728567 1517872 1545103
19620 1545103 1604841 1679787 1433880 1444498 1319599 1364444 1382361 1460228 1546485 1564099 1398087
19609 1398087 1310140 1269054 1264453 1182213 1380417 1622110 1287751 1270524 1190516 1209366 1162580
19598 1162580 1314425 1172694 1225487 1189931 1186503 1088996 1410401 1129269 961406 1169122
19588 1169122 1388393 1293515 1225494 1273513 1504424 1385920 1265463 1073490 1247305 1332855
19578 1332855 1359788 1338617 1148358 1246148 1171563 1005362 1259666 979056 1094245 1213211
19568 1213211 952170 1141469 1186428 1309599 1286656 1016241 1181731 987273 1204884 999566
19558 999566 1051162 1143344 754705 1065398 1260590 1313768 959960 1175008 1114400 1273031
19548 1273031 1088934 1231458 1236478 1242408 1181589 969147 1006265 1086043 1117620 1052320 1143257
19537 1143257 1211850 1247218 1253982 939894 1250349 1160322 1171243 952348 1151195 1300207
19527 1300207 934356 1318108 1437744 919988 1143850 1239002 1226546 1311509 1225145 948075
19517 948075 1242508 1325688 1110475 1379705 1215569 1192350 1384679 1290675 978657 1250924
19507 1250924 1068443 1252523 1267372 941071 1123791 1223988 1111116 919591 1071323 1068282
19497 1068282 762112 926443 1104724 1026705 984457 1108778 1083946 1096225 1293046 1163227
19487 1163227 1070350 1109074 992452 1337238 1036517 1092077 1042989 1004468 1167642 1072451
19477 1072451 1026719 1107239 965705 811235 1110159 1077749 1062920 882735 690743 942289
19467 942289 731238 834037 749020 625872 662242 842385 892408 758473 790471 612524
19457 612524 736548 647067 577468 963529 575843 813437 664814 665345 741554 832070 831080
19446 831080 784321 856071 903344 775413 681808 733110 827789 796404 849225 766075 824209
19435 824209 485525 823696 707972 683390 914475 726301 753645 582445 598214 1070966
19425 1070966 821957 761501 868194 492229 951967 692516 579494 945996 817516 597507
19415 597507 666825 723216 967737 733163 924561 669362 639167 732050 610330 576308
19405 576308 544527 517920 819529 605063 814921 649185 607879 745789 760073 950912
19395 950912 805030 640462 937956 529770 749093 765459 804003 643909 904117 810395
19385 810395 957923 799777 906745 845373 839046 843081 780802 847030 804869 773476 800638
19374 800638 738550 659308 812814 949421 817121 938819 999800 778760 732220 870153
19364 870153 647072 732958 491817 918416 893626 790805 786188 678008 870609 826402
19354 826402 667947 775058 892483 1126721 771566 833670 1049225 628794 921602 882535
19344 882535 961506 579510 1019224 981178 806595 904363 993429 863060 832029 926103 922352
19333 922352 948554 943576 823648 745383 696699 799280 817080 881628 767637 849360 701290
19322 701290 788801 743558 638970 805744 729537 623150 646922 772958 811265 789619 647325
19311 647325 814785 520595 902467 534693 712475 698453 804602 508924 780715 598163
19301 598163 601084 687494 657787 812946 593452 363211 755106 580050 739379 542693
19291 542693 696675 598284 383382 732258 584378 684816 586589 672920 628303 688500
19281 688500 637280 589261 639512 341493 607296 817862 820067 711861 685826 562713 610402
19270 610402 523238 551212 522153 639041 578530 672635 676090 631330 616491 759501 785410
19259 785410 763866 728565 671524 649038 746540 858412 611658 973413 582197 806654
19249 806654 656201 587061 668365 589651 772710 770618 670687 698028 827817 949125 979883
19238 979883 1406385 1556929 1570517 1717730 1580621 1524863 1120927 1037180 649687 812585
19228 812585 829294 707554 655494 639311 663111 535309 629207 420191 754078 480511
19218 480511 492145 575287 806106 563856 575835 598403 773717 474970 532874 608570 718753
19207 718753 770494 565099 499205 760668 461124 529469 570297 784432 568710 641569
19197 641569 767013 517824 505748 592231 582888 668664 602635 498440 593144 536340 759124
19186 759124 873786 690577 490487 834514 664323 584382 787634 561139 852574 987835
19176 987835 875744 968107 972407 891964 1004575 968580 628607 619591 820343 825425 734196
19165 734196 775207 878079 830772 1015155 722579 864646 883120 712459 1077100 1171849
19155 1171849 936677 863196 668143 815338 766068 783427 887943 1021887 1012655 635239
19145 635239 819970 1059778 953005 935226 951788 993366 1025384 837036 1008685 1134661
19135 1134661 884867 778546 1195827 933234 845461 883670 938160 1005125 1096920 1097575 935064
19124 935064 980499 794419 1233590 758864 915441 1202516 981321 1071496 1354807 1258408
19114 1258408 1279637 1277712 1573424 1492651 1574107 1844396 1946106 2135278 2499925 3215404
19104 3215404 3633799 4059515 4465033 4644691 4452835 4407327 4057712 3487174 3239191 2530615
19094 2530615 2288857 1971061 1746404 1550569 1579689 1590551 1219088 1415286 1308441 1429763
19084 1429763 1235815 1273263 1305517 1463709 1712441 1999833 2232629 2753667 3193824 3572062
19074 3572062 3720726 4232782 4323003 4432395 4572678 4429009 4680083 4378158 4249057 4119428
19064 4119428 3821900 3482589 3209764 2789159 2719865 2400210 2309303 2176085 1864690 1651403
19054 1651403 1567844 1570929 1435895 1290823 1769489 1678718 1437352 1643859 1616091 1985937
19044 1985937 2187082 2677132 2695989 3380604 3693107 4225384 4430855 4542346 4668350 4438000
19034 4438000 3759184 3236519 2567747 2376660 1752896 1615537 1927335 1729544 1690453 1654662
19024 1654662 1494357 1771607 1704043 2019086 1989326 2004959 2285858 2190775 2563744 2656409
19014 2656409 3357555 3636536 4062931 4616685 4916685 5082607 5758675 5819665 5910093 6244622
19004 6244622 6261639 6355570 6943461 7291933 7839367 8274491 8932376 9876344 11353315 12766193
18994 12766193 14953430 17043550 18702945 20190586 20872634 21114974 20606095 19258823
18986 19258823 16965718 14929948 12870942 10278536 8889969 7507881 6350616 5297621
18978 5297621 4539182 4180202 3762442 3275047 2979616 2983433 2754733 2384777 2216601 2039723
18968 2039723 2302195 2016958 1864238 1920776 1798145 1657193 1813186 1780420 1753498 1790413
18958 1790413 1633146 1690340 1763723 1786340 1804689 1839124 1804335 1696346 2089619 1916677
18948 1916677 1953488 2233739 2342360 2159902 2342951 2474449 2750378 3035764 3297838 3445848
18938 3445848 4196316 4380726 5201017 6216100 7039090 8452152 10128037 12098831 13987705
18929 13987705 15988640 17761588 18866231 19227166 19224084 18201822 16781820 14489547 12637807
18920 12637807 10276299 8715119 7417667 5842437 4936965 4266964 3882497 3233516 2905204
18911 2905204 2431118 2517626 2135250 1825728 1792317 1509281 1667554 1318805 1413301 1398623
18901 1398623 1336813 1007476 1215901 1021072 809800 907400 842035 885981 928834 1035208
18891 1035208 978350 770352 862767 641584 686679 712044 850308 1076939 657285 816409
18881 816409 875214 816714 693947 476421 506268 708301 884540 584587 716567 987403
18871 987403 510609 649965 734038 600416 514002 646486 644629 533131 624957 674425 786145
18860 786145 765669 692462 647970 560806 479108 729113 598468 812860 465499 574411
18850 574411 650369 563678 534726 678617 640390 647378 694902 596187 526827 621390 648886
18839 648886 618697 457205 627765 523413 735022 545359 520279 311950 424499 505971
18829 505971 603913 678737 632422 614118 529902 640536 511417 645238 627075 611597 528288
18818 528288 437629 844253 715079 700807 535172 693641 605352 607002 323712 534053
18808 534053 459558 671498 479929 654673 767343 786902 782391 475610 446076 705326
18798 705326 583972 622117 620582 681165 607935 317966 688295 826772 500741 568093 478111
18787 478111 503172 527678 758660 617472 639237 908432 703212 743194 592124 856024
18777 856024 629479 744853 748167 549389 720818 632637 628213 655259 733196 739806 626387
18766 626387 425159 418194 549643 415879 511138 620125 531730 470598 653209 551462
18756 551462 419021 473836 521121 550361 606604 666536 589504 624400 632718 500377 647773
18745 647773 411594 596325 680308 660934 551385 358585 299596 555525 414137 585265
18735 585265 586012 551897 407064 686071 607597 583886 539104 516318 461474 390412 705596
18724 705596 479267 528893 498477 613349 596047 421541 709138 312088 467276 506541
18714 506541 430436 544367 430217 501080 608115 437374 513621 475043 550169 432957
18704 432957 406066 460718 408425 536215 496025 697902 757994 709448 470111 663265 533831
18693 533831 533900 494517 737110 601022 387882 559197 619603 558261 651786 419431 463428
18682 463428 688306 382191 611514 683587 471061 619420 519781 415512 656247 737665
18672 737665 758390 311240 578235 637269 655962 360205 735020 683097 583361 781623
18662 781623 643246 370432 608702 453751 562054 713137 778126 561769 434838 404398
18652 404398 668165 612085 562947 502116 488099 480229 657948 615564 442530 448026 623469
18641 623469 466914 408417 500114 638127 436685 444869 755011 395873 627787 594863
18631 594863 388543 321409 428427 427654 493131 614283 465096 418415 222337 566119 636612
18620 636612 596370 476168 549666 564288 354851 529842 623635 564886 471236 656607 642026
18609 642026 605686 653302 629899 525291 478421 606732 620119 683916 756448 588045 365718
18598 365718 859579 719171 638042 668147 512295 558447 947711 574493 450316 702129
18588 702129 787848 799870 661202 882339 463565 706606 635976 547526 729829 567791
18578 567791 440690 672961 632386 538057 572765 689958 739669 435426 621723 648401
18568 648401 512132 446327 497572 784201 696661 508849 478344 462182 533481 453095 401514
18557 401514 331476 415210 594859 854774 948466 491672 685370 416342 698559 515631
18547 515631 411992 489818 564770 358671 682593 783176 732959 302458 863416 640271
18537 640271 442699 346737 297266 508236 374302 452194 559304 452829 554041 357030
18527 357030 469416 476244 725775 616640 695745 634010 534548 444079 370075 439701 511046
18516 511046 519574 683651 356384 325485 412118 280016 432366 139498 318741 574617
18506 574617 326256 761743 316048 498293 400883 623509 431752 368366 394834 346824
18496 346824 454983 215339 420080 928261 487336 594774 643262 541297 324302 270050
18486 270050 698430 518162 486454 611403 438399 441745 496724 320538 489589 595733
18476 595733 397783 588758 333793 282917 625546 333861 485500 419292 412625 424498
18466 424498 614635 433547 565609 564771 775242 676316 618464 554754 758806 672353 551299
18455 551299 613819 623226 647859 744536 708386 870821 675157 566027 516689 588242 575102
18444 575102 406098 534998 599835 706722 503602 619539 312958 647960 628795 474977
18434 474977 507601 429310 461230 586063 749245 719502 621134 636877 685238 826785 801933
18423 801933 862820 735355 628048 681939 670191 591564 264945 621856 524632 450527 535932
18412 535932 540379 671470 330023 487161 591306 388391 433658 304713 429193 320921
18402 320921 462128 552350 388911 513228 640965 380793 588109 496317 520031 401876
18392 401876 483573 457181 452663 449016 425479 600286 229070 428835 429732 484382 394993 429630
18380 429630 209993 219315 519804 488166 594455 283139 610247 492472 634827 350835
18370 350835 297424 409160 577195 472654 396476 512876 553810 211312 585999 540085
18360 540085 314166 439006 673835 721774 277719 691448 483429 377210 377097 760802
18350 760802 328927 647387 723166 429330 462536 625046 773763 361010 542179 758831
18340 758831 653754 440370 533997 497048 719838 546588 492157 735011 300924 632027
18330 632027 423397 427832 630782 499541 509090 397327 411038 535120 531061 736197 636125
18319 636125 527486 641860 610734 765521 627876 757767 768033 558423 718416 477316
18309 477316 259741 688523 495972 363681 412580 501277 285230 406846 478030 388357
18299 388357 518897 514799 609789 497322 555032 348933 521726 435700 323903 534843
18289 534843 369999 491907 422152 545011 476131 490065 371210 309468 454231 734652
18279 734652 306049 396944 625986 650009 468192 337821 445681 333345 611561 669713
18269 669713 624802 572487 472055 636499 654108 433934 609756 589422 442699 555380
18259 555380 606713 490362 458571 566009 560895 269904 649027 653515 777348 726689 574760
18248 574760 675407 695567 589246 457780 707121 389304 347231 501565 318625 599438
18238 599438 454032 299861 555346 480160 238125 452481 456301 444181 391654 443490 300161
18227 300161 465224 487005 605033 455245 343037 594411 556851 488119 439217 590062
18217 590062 322372 451909 559561 626727 488495 522712 499537 625839 583180 410881
18207 410881 249106 501244 562506 510913 349846 436831 458060 470496 567857 314453 420192
18196 420192 708537 606474 583024 635428 489899 310599 813099 764887 764364 632610 402892
18185 402892 603820 694330 288435 475789 539252 619156 603991 431657 388436 411675 513396
18174 513396 497043 686707 535262 714870 583740 535839 700606 485641 446057 315696
18164 315696 561230 499010 389706 485818 350697 291531 466941 462154 714711 326702
18153 269339 200859 757823 505174 546393 597360 468513 607363 507603 575812 608023 586804
18142 586804 318518 353906 475396 458270 643018 405763 418078 416114 841485 521993
18132 521993 615691 386450 475863 595457 825957 430796 416799 457400 642368 533679
18122 533679 711893 519050 308205 482638 538767 508530 470385 642374 496376 649026
18112 649026 824152 629876 689612 600882 628903 365482 542469 547577 555156 358910 548836
18101 548836 394510 517928 463429 485563 644951 470879 594403 563265 574706 581848 430680
18090 430680 580744 539926 646419 536230 441635 618314 513749 633026 441866 516920
18080 516920 507935 429733 561584 427113 453171 459278 290926 489371 449866 284876 565379
18069 565379 482916 350115 467755 339258 629563 442276 287114 677354 217728 438980
18059 438980 629681 441537 434542 387423 366517 627969 349838 576075 583919 360026 392570
18048 392570 427920 412645 401257 532425 337279 276446 635423 580139 403219 196858
18037 450956 412005 270586 462637 542258 617339 474869 286457 428597 250015 444033
18027 444033 428262 317148 319023 415505 330304 562452 355091 282287 587630 548237 456198
18016 456198 425694 607451 385967 316366 617609 308868 490333 585320 456661 465604
18006 465604 477045 491025 478579 557119 371946 401249 501611 336365 295251 376264 619836
17995 619836 419010 433986 463015 583907 586974 404704 597578 440414 329859 563838
17985 563838 354666 473646 765863 417776 415523 355395 530373 480372 295750 503179
17975 503179 517479 376005 549823 477425 456198 446276 557309 481649 510361 368939 439667
17964 439667 580297 258845 611393 358153 306507 454830 484813 557955 476977 374918
17954 374918 468823 397102 373524 522600 567070 488491 314970 674812 495614 542575 669520
17943 669520 379044 413295 464853 525606 731879 248896 510370 451111 409167 506509 310465
17932 310465 329521 604988 427708 524150 435699 613425 600723 697024 424190 458927 481422
17921 481422 553142 531285 374217 462405 528567 521640 526105 472912 417914 392196 473563 358202
17909 358202 421513 418938 696334 548678 291165 500379 614749 733344 594940 583667
17899 583667 685646 614267 559893 400227 603237 502004 895413 490124 424793 595430
17889 595430 397775 731509 355199 383036 268974 492719 912142 781318 762940 464194
17879 464194 522064 445602 599142 610422 639962 523447 244309 525579 711768 673183
17869 673183 407550 580433 538492 552530 613644 628415 487361 619744 447009 676852
17859 676852 642128 648026 723009 526428 568647 306174 563922 441656 435308 589294 716976
17848 716976 324757 644644 601794 521923 553557 589619 715939 292257 512010 664292
17838 664292 682371 411626 660414 714518 595779 732895 757543 489971 665271 828525
17828 828525 687561 596101 732953 469389 694273 548694 675406 530574 572809 676690
17818 676690 670102 851020 836913 843712 779901 800416 900066 827790 1194580 1152108 841459
17807 841459 1071647 955106 1014183 651221 701371 666485 801096 847900 916192 835212 925544
17796 925544 994515 1240623 940539 1044469 935431 848535 896052 840616 820309 596823
17786 596823 559556 660449 691584 741557 622457 699814 575086 583869 438863 575889 618612
17775 618612 666879 726157 474308 552648 585738 533801 741343 658636 600318 595048 672156
17764 672156 508092 529242 724526 684515 420892 1021911 561486 747226 881008 493694
17754 493694 684091 570918 565040 561252 469346 579940 562507 631654 673248 495258 506804
17743 506804 670590 472698 237110 540828 645251 428914 614459 493930 747200 532818
17733 532818 461189 609721 723021 531323 554482 496414 706493 837228 763357 335748
17722 660190 641341 758779 662665 701195 710136 732494 678830 584705 562539 622762 912833
17711 912833 763207 772861 511504 533991 744888 577523 404634 633682 590731 624174
17701 624174 600583 541860 603687 650667 418929 698717 409656 676109 660480 690767 604521
17690 604521 337231 565928 802924 529710 552496 771589 578958 617681 529642 990007
17680 990007 717920 641836 469135 426225 678681 637513 703000 504295 796796 533743
17670 533743 483850 619571 415573 763442 517774 666886 517734 854987 502086 578645
17660 578645 593271 596126 763948 655932 703630 765527 571967 777517 828943 1006919 704917
17649 704917 727702 783287 708211 592017 760521 903986 801372 600314 947360 607388
17639 607388 810300 637508 942237 899340 732245 777846 885951 1010113 930983 960595
17629 960595 774232 1075264 992949 960091 1001003 826842 884717 917003 829532 935628 1084116
17618 1084116 1018623 1132485 966266 1226611 1195987 903932 1161124 1169713 990807 1232867
17608 1232867 1186075 1172885 1366088 1106876 1011704 1255182 1168938 946055 1309094 951930
17598 951930 1113036 1246165 1085309 1310489 1154393 1287460 1136121 1370735 1252902 1123159
17588 1123159 1008854 1138726 1408289 1302089 1296673 1192429 1068652 1318584 1326767 1237902
17578 1237902 1226442 1178041 1119523 1326388 1347471 1216885 1357433 1414523 1238279 1287818
17568 1287818 1568336 1271869 1355964 1167326 1117928 1370297 1202800 1336312 1283837 1223064
17558 1223064 1380996 1107766 1164840 1329460 1107760 1135759 1001111 1069943 1115669 1253156
17548 1253156 1287494 1047196 1059089 1366827 1190743 1207404 1387528 1431135 1568189 1332754
17538 1332754 1528824 1308672 1176327 1080492 1373046 1240112 1253194 1335286 1216552 1395841
17528 1395841 1100278 1166359 1401088 1218615 1499085 1222191 1270699 1204080 1408072 1353678
17518 1353678 1326801 1363962 1382752 1444859 1487172 1666737 1718589 1750271 1935809 2006769 2117325
17507 2117325 2224078 2175556 2365239 2156782 2400166 2695503 2459908 2532951 2614111 2481452
17497 2481452 2604909 2767009 2670827 3123442 3337613 3866887 4059561 4628865 5291643 5916486
17487 5916486 6458647 7603005 8788109 11600738 15996469 24121119 35893515 51436210
17479 51436210 68505840 84400949 96463439 103987759 106202353 101573949 89978852
17472 89978852 73406463 55626964 40815016 31994303 28597423 30934886 38914587 51650045
17464 51650045 67217697 82677832 95406823 103818671 106734869 103572795 93533973
17457 93533973 77254670 57461319 39657353 26048086 16898762 11495108 8486129
17450 8486129 6852809 5669827 4731264 4520350 4093146 3848584 3609952 3301155 3464952
17441 3464952 3275229 3342594 3281141 3119001 2944595 3064750 3006399 2542117 2457455 2528960
17431 2528960 2349511 2335743 2529390 2553992 2873062 2646446 2670427 2743842 2628829 2483003
17421 2483003 2543631 2188206 2098903 1944284 2106760 1691221 1989418 1915377 1499548 2077424
17411 2077424 2000587 2004304 2002127 1944074 1997284 2033597 1992408 2266760 2083663 2105505 2178959
17400 2178959 2343925 2441947 2602445 2652019 3073682 2932903 2829764 3330817 3453168 3727318
17390 3727318 4056724 4529088 5096789 5405365 6144640 6257813 6322654 6632050 6601181 6757528
17380 6757528 6362613 6220667 6045293 5945906 5742470 5587400 5326964 5323815 5697866 5832209
17370 5832209 5907718 6149380 6475220 7002532 7267501 7425922 7506247 7809629 7857619 7807414
17360 7807414 7658636 7646000 7347118 7313433 7177673 7332648 7271700 7299613 7583154 7959786
17350 7959786 8111536 8890043 9181657 9876224 10440331 11271384 11712051 12295861 12590813
17341 12590813 13032508 13070521 12952608 12695160 12419749 12131795 11917767 11594773 11305790
17332 11305790 11216446 11144760 11086522 11339057 11280897 11821797 12155801 12478627 12639474 13021960
17322 13021960 13026837 13411441 13405682 13095111 13328704 13143969 13049038 12776280 12731620 12630597
17312 12630597 12426525 12221173 12386860 11928801 11992286 12164570 12059250 12256413 12356922
17303 12356922 12809913 13146232 13277636 13636944 13450986 13584861 13367152 13046783 12817030
17294 12817030 12337832 12230485 11901560 11928487 11775146 11721194 12206926 11976752 12400424 12322415
17284 12322415 12822988 12574385 12566862 12414438 12188633 11942224 11098702 10535191 9714794 8923803
17274 8923803 8263628 7538899 6982037 6405993 6299286 5430064 5514034 5118992 5098055 4998384
17264 4998384 4563394 4411529 4616475 4705965 4626568 4452907 4572720 4175764 4321459 4049343
17254 4049343 4093321 3964616 3562354 3790517 3635754 3690682 3477361 3235781 3362877 3548047
17244 3548047 3383529 3505533 3603867 3193970 3561792 3143777 3361426 2965519 3356108 3134619
17234 3134619 2816251 2881203 2963687 2815151 2698149 2752357 2431633 2743896 2552370 2761036
17224 2761036 2645929 2516364 2615484 2405672 2551354 2714402 2806337 2728977 2711445 2801227
17214 2801227 2979239 2672125 2864989 2723978 2522391 2672119 2559570 2429301 2550681
17205 2550681 2644360 2612970 2535925 2185425 2582214 2490322 2500616 2235885 2217337 2308364 2060193
17194 2060193 1979499 1868876 1770345 1865023 1614200 1844817 1530426 1498306 1670074 1632045
17184 1632045 1509651 1723426 1533909 1680719 1575174 1489003 1591129 1693112 1318010 1584060
17174 1584060 1836545 1679761 1778810 1735580 2092486 1859659 1874330 1992662 1819945 1812276
17164 1812276 2031427 1914713 2016436 1944507 1960021 2139197 1868972 1805754 2333544 2200957
17154 2200957 2190784 2199050 2207507 2411128 2488917 2177012 2128868 2291165 2110792 2349640 2205772
17143 2205772 2245984 2337555 2396689 2392186 2433053 2306043 2265029 2558678 2411509 2542796 2435256
17132 2435256 2428385 2237376 2191438 2299569 2190749 2307182 2136699 2137485 2323478 2237509 2219798
17121 2219798 2335583 2257736 2287707 2484506 2466624 2315980 2351272 2291897 2375061 2083396
17111 2083396 2270028 2551810 2414741 2492453 2544965 2678947 2719733 2849425 2665520 2659838
17101 2659838 2634292 2721464 2473204 2405009 2316137 2178693 2007580 2196383 1805253 1644375
17091 1644375 1620696 1468021 1249929 1366730 1448147 1285346 1417913 1136299 1199051 1141204
17081 1141204 1167725 1179902 987720 953510 1061425 1011224 1117046 940698 1089778 1163556
17071 1163556 1289424 1096845 1182170 1223471 1044426 1133363 1248932 1202704 1221262 1026415
17061 1026415 1112725 1149371 1023820 1359259 1260445 1590841 1341782 1647167 1764390 1980644
17051 1980644 2362197 2364211 2754562 2850468 3102931 3093127 2922733 2938921 2797897 2509195
17041 2509195 2941936 2638278 3064713 3248414 3017342 3294371 3234945 3225062 2972648 3237830
17031 3237830 3002452 2789147 2454917 2133228 1862495 1886683 1649966 1613608 1724259 1609053
17021 1609053 1548653 1501639 1385870 1362581 1382103 1234862 1252711 1090025 1301710 1127606
17011 1127606 1195988 1298404 1364823 1113954 1278131 1232836 934516 1067525 1241403 1097333
17001 1097333 823354 1291359 960597 850208 1003866 1356332 1099045 1233645 1151031 1211579
16991 1211579 1022457 1227256 1170620 1219899 998834 824120 1165603 1045816 862303 1010769
16981 1010769 1239828 1260505 1359767 1254201 1295669 1182423 1308465 1299221 1334218 1399795 1281265
16970 1281265 1502232 1418101 1516409 1567052 1498231 1585254 1865798 1643936 1934068 2128631
16960 2128631 2016258 2187949 2210755 2214091 2361126 2312168 2452848 2599404 2292944 2501876
16950 2501876 2297705 2150620 2120828 2459799 2163466 1991834 2133875 1844670 1699400 1718757
16940 1718757 1751500 1681932 1386575 1574612 1283659 1197888 893661 1358228 1104812 1149341
16930 1149341 1116273 1274138 1127665 1200074 1019123 990209 1057917 1008866 1055605 887193
16920 887193 804511 687030 1030904 792007 905553 752367 1231018 1051114 858991 1081751
16910 1081751 973295 957189 799685 763066 849946 709613 647072 820741 683875 678181
16900 678181 965350 721972 642229 706380 878817 869230 878626 849396 784790 721223 754610
16889 754610 723275 885254 717864 785605 474715 681064 702211 758228 714322 839557
16879 839557 817961 757957 737845 855325 660857 474436 504831 705405 693156 906197
16869 906197 787798 692185 630290 807199 750876 887283 927723 772629 819744 825691 715565
16858 715565 708224 981929 709809 941722 821477 1034385 734078 719520 741843 743660 689457
16847 689457 858755 727194 737540 1004759 829298 707029 714060 906865 772662 779793
16837 779793 931976 635529 611282 841988 813274 754315 918817 954821 803523 874778
16827 874778 811213 862878 795409 762667 1345434 1094500 1081590 1218155 1121024 1342404 1246713
16816 1246713 1444268 1424949 1569284 1676132 1814845 1568350 1846476 1597458 1698889 1672380
16806 1672380 1698355 1563363 1602259 1730955 1615554 1703468 1453448 1516352 1663868 1437950
16796 1437950 1569992 1521354 1480465 1489948 1319884 1190527 1426714 1053945 1323203 921725
16786 921725 1019821 938084 805919 782455 847258 647069 591239 488855 726798 892120
16776 892120 746413 771351 522350 584187 761985 728195 792552 750279 834043 807915 600550
16765 600550 712408 721437 730768 517568 588783 665584 591366 681128 598852 736420 629921
16754 629921 824879 692072 539091 693286 911976 691625 679358 643376 647239 904669
16744 904669 859740 681630 505174 658747 693128 788779 678681 926296 664563 749149
16734 749149 740456 733639 977335 591565 614338 913736 813699 658169 991077 561132
16724 561132 700218 885907 957283 1040445 871176 1045863 940483 850840 873843 943465
16714 943465 906050 948816 917558 899056 1201514 809584 944986 1003573 999982 1031176 1247438
16703 1247438 1286937 1120311 1652656 1492251 1601129 1456086 1911351 1542140 1518784 1275323
16693 1275323 1500080 1519807 1419549 1714676 1443498 1625118 1479610 1781732 1515761 1577475
16683 1577475 1585095 1472402 1294731 1311172 1061852 1193584 1050172 1032007 1256053 1095773
16673 1095773 979515 1109949 902272 1088575 1300422 1423566 1495555 1400288 1590727 1738114
16663 1738114 1738881 1665591 1844863 1749775 1636854 1687599 1371598 1596983 1678863 1664853 1882533
16652 1882533 1847843 1964194 2050152 1878004 1552488 1527554 1360296 1587363 1365373 795729
16642 795729 1142857 793123 870930 1022085 653630 799901 951117 864051 1037051 858680
16632 858680 761125 956813 751514 861926 893448 865524 665223 915808 763863 882717
16622 882717 766230 1125056 917272 920160 866488 860116 681320 990019 552080 702139
16612 702139 677240 1076597 605379 713626 802779 480780 695839 777840 845273 806899
16602 806899 698689 954958 682570 796097 986583 729443 1121417 826461 706496 902773
16592 902773 872277 957800 1027276 884745 968874 902808 990601 913034 982401 1076685 995898
16581 995898 1023209 1120537 973101 949572 861266 979448 910613 777018 790732 602384 787144
16570 787144 887765 637381 763271 754977 940446 881761 1032795 894037 893712 642605 1120560
16559 1120560 976963 640339 1119686 949689 988501 1026265 882675 946155 1033440 915223
16549 915223 1105013 1233252 801328 1201868 994884 1151846 1224730 1447839 1293037 1208282
16539 1208282 1416853 1373119 1455808 1558169 1175510 1373005 1307137 1269520 1267767 1130440
16529 1130440 1112562 847611 1160651 1023710 1067993 1220678 1264353 1015223 1122891 979635
16519 979635 1229748 1169605 1125377 1100281 1052968 1054218 1079827 988155 1267901 1007735 1110974
16508 1110974 1487902 1175498 1254818 1019046 963609 1094699 1092303 966410 874353 1106319
16498 1106319 1045165 811824 1280139 1087532 1258868 1289443 1002258 1254640 1332799 1191446
16488 1191446 1298591 1361352 1236409 1371995 1478589 1775536 1854882 1789147 2051916 2107072
16478 2107072 2051149 2078702 1812702 2323555 1903189 2039140 2017242 2139453 2218870 2530149
16468 2530149 2438317 2591513 2814307 3018210 3083825 3002913 3395616 3421078 3701505 3547173
16458 3547173 3979407 3495903 3917293 4115668 4167695 4437777 4627244 4743151 5343134 5456032
16448 5456032 6108168 6303519 6989350 7483036 7998065 8901974 9834882 10836936 12080914
16439 12080914 13285887 14808598 16474144 18417996 20236077 22592738 25040720 27350604
16431 27350604 30050867 33286857 36826863 40724426 45342189 50168116 56356245 63309259
16423 63309259 70642799 77197262 82852136 87193922 91191424 95248969 98559607 101891702
16415 101891702 105118364 108223731 111085309 113294707 114476502 114125324 112428002 110327699
16407 110327699 107902306 105268089 101970565 98077050 93511142 88964977 83942957 79004689
16399 79004689 74204606 70210437 66620675 64386816 61750148 59004470 56255861 54216176
16391 54216176 54416253 57820582 64969172 74905241 85243166 93064190 94838898 89477189
16383 89477189 79098974 65403686 50643401 37447826 26919199 17712887 11123198
16376 11123198 8130941 7291464 7773483 8413426 8613559 8704210 8292394 8054956 7378768
16367 7378768 6715704 6019212 5704286 5124130 4903980 4798766 4571095 4479415 4210678 4306802
16357 4306802 4346406 4452589 4250867 4129362 3888453 3714662 3689940 3309123 3416352 3172829
16347 3172829 3193834 3094597 2883154 2756266 2504937 2402379 2190123 2226361 2053808 1817594
16337 1817594 2015663 1686540 1714316 1498289 1484805 1587345 1601932 1497323 1506823 1275272
16327 1275272 1320753 1690100 1619383 1512858 1403933 1273292 1406244 1397036 1189974 1095953
16317 1095953 1053964 1138793 1081084 863616 833727 739633 800666 595561 902717 685020
16307 685020 862638 766899 475962 795505 634108 660207 762194 806117 675131 805581
16297 805581 798501 838824 736316 858633 1081433 1095830 906316 953591 1215362 826395
16287 826395 847844 635599 684275 646137 602941 730883 562202 685174 558587 662827
16277 662827 434453 239916 237285 190190 416931 307119 647622 824411 616285 1152101
16267 1152101 1069559 1066143 979178 898007 778592 582212 779198 644192 693921 579291
16257 579291 587843 736467 405903 628792 499247 686864 695640 741420 722221 767010 825956
16246 825956 781505 966803 852676 869925 1085412 933479 1045694 899908 1360312 1024336
16236 1024336 1223926 1531321 1062495 1072431 1221822 1119000 1157097 1115507 706900 686938
16226 686938 1064478 882245 659354 645161 768191 660917 832096 672599 828463 890226
16216 890226 991602 798711 874040 797528 874408 800786 633255 827253 987068 844605
16206 844605 922145 1010557 866300 917891 869159 965200 636834 619454 797829 729323 682096
16195 682096 968891 1282824 688760 978255 856047 883474 986286 814086 687497 902001
16185 902001 865918 963076 769180 756459 718917 980721 901594 597165 872726 940609 1144568
16174 1144568 942004 956734 1096391 850619 985732 1026086 872557 1024000 935547 866207
16164 866207 723559 757243 861010 824544 817614 572992 651380 613661 788671 718580 643748
16153 643748 715679 618170 884159 669177 677791 724166 684242 712591 849336 631711 672869
16142 672869 753936 1035129 880814 875745 977306 1005886 898523 846603 987104 941604 791823
16131 791823 488686 932232 808638 872192 672489 795472 941434 804517 879344 1037098
16121 1037098 787481 658520 790019 840851 906203 1091103 747006 1029376 890716 909063
16111 909063 801186 781475 897188 812658 949454 742834 836771 1141135 930281 894122
16101 894122 1057497 1038707 1104642 980403 922638 922874 1171912 927432 1263615 1162066 1187589
16090 1187589 1176628 904366 1176291 1330607 1239828 1317436 1202262 978908 1171054 1306928
16080 1306928 1390677 1165756 1166587 1228567 1015737 953425 1168975 1036273 1089050 971036 966476
16069 966476 1253214 1374543 1109709 1334470 1274553 1192865 969173 1360106 1275883 1477881
16059 1477881 1304882 1426682 1328289 1245929 1369708 1386026 1299543 1516569 1419095 1550245
16049 1550245 1477881 1383651 1472080 1601944 1622327 1706447 1428664 1459538 1389454 1360903 1453950
16038 1453950 1385911 1484657 1425050 1451530 1601259 1717129 1407088 1673609 1767243 1716560
16028 1716560 1601022 1759909 1597577 1771709 1602973 1708126 1718474 1941056 1884674 2064102
16018 2064102 1811212 2067863 1992790 2073185 1994334 2234430 2033204 1827633 2238041 1748091
16008 1748091 1833458 2053847 1728992 1939508 1937576 2065108 1795724 1812407 1892917 1795788
15998 1795788 2242813 1873302 1969364 2001261 1972546 1908622 2052294 1845287 1951883 1823501
15988 1823501 1896323 1866751 1913399 1811161 1992418 2094778 2044011 2167354 2053258 1913469
15978 1913469 2044447 2136691 2088100 2246346 2175104 2256511 2342713 2172269 2354088 2147547
15968 2147547 2237981 2101162 1985254 2171578 1985089 2065887 1972880 2128907 1915547 2154296
15958 2154296 2034740 2145534 2002131 2154391 1865513 2139314 1934033 2028349 2195325 2258538
15948 2258538 2294039 2254578 2327069 2291053 2402040 2437370 2430183 2197001 2315643 2442537 2379022
15937 2379022 2207192 2391559 2398604 2427885 2413945 2454678 2449339 2496606 2772894 2901818 2687132
15926 2687132 2834001 3087038 2823825 3132216 3208998 3341971 3230509 3720233 3761116 3983672
15916 3983672 4451015 4544535 5023663 5737705 6561355 7738897 8810331 11428421 14346119
15907 14346119 19124493 26022245 34399273 43818668 54152588 63529592 70734148 74649028
15899 74649028 74769100 70738500 62795835 52656639 41772818 31523190 23192940 16935194
15891 16935194 12378377 9621518 7666629 6550141 5372546 4749423 4538821 3891608
15883 3891608 3593508 3228748 2936540 2889412 2651065 2677312 2730574 2493059 2333282 2365613
15873 2365613 2404236 2466289 2096163 2181794 2135914 2542873 2492370 2565812 2497643 2283540 2586394
15862 2586394 2101294 2128962 2184781 2146471 2061752 2159860 1988778 1897467 1966657 2012031 2062830
15851 2062830 2169775 2251463 2100057 2167818 1880532 2050675 2079581 2127632 2148720 2127983
15841 2127983 2080828 2024852 2068720 2155420 2144226 2255533 2167598 2488969 2523996 2653973 2493522
15830 2493522 2491957 2684042 2397826 2259190 2261428 2205656 2424690 2110860 2181402 2138980 2080336
15819 2080336 1928195 2215359 2134953 2048838 2213158 2207243 2276332 2281751 2268765 2237093 2457702
15808 2457702 2288764 2590867 2446863 2199256 2178689 2198040 2377518 2269642 2348836 2355147
15798 2355147 2556605 2573180 2461187 2629041 3004561 2921363 2977607 3046197 3191207 3294644
15788 3294644 3311243 3343939 3344948 3136399 3087974 3439701 3360834 3524968 3647548 3703135 3942796
15777 3942796 4133948 4407554 4337129 4469181 4344585 4476024 4536350 4248476 4234292 4404160
15767 4404160 4396466 4215663 4389138 4545329 4647534 4667792 4725477 4760537 4828841 4890142 4808263
15756 4808263 4973568 4732980 4700591 4753248 4994032 4840932 4920953 4959846 5062884 5598361
15746 5598361 5423701 5650179 5836049 5737669 6124557 6068285 6294660 6343398 6817712 6885987
15736 6885987 7033465 7097992 7122730 7542490 7209605 7296200 7124403 7074631 7302980 7344465
15726 7344465 7584547 7438089 7312209 7197466 7261354 6802707 6996450 6538332 6461538 6320515
15716 6320515 6452599 6339346 6722398 6658875 6730986 6777565 6807551 6724097 6567474 6471384
15706 6471384 6524439 6594774 6724663 6599487 7002486 7400637 7421040 7242060 7474686 7880678
15696 7880678 7960167 8068738 8134053 8059558 8355300 8415640 8393011 8431711 8588560 8195810
15686 8195810 7951697 7713880 7891394 7403093 7348384 7341710 7322447 7439393 7483544 7694221
15676 7694221 7582806 7437033 7305289 7038686 6777952 6695748 6510601 6755447 6711533 6655909
15666 6655909 6623826 6450463 6525936 6497223 6633595 6794159 7177927 7238421 7361944 7646114
15656 7646114 8103685 8242072 8678757 8990567 9380283 9846274 10408530 11250720 11884237
15647 11884237 12297643 12996038 13352850 13987735 14635202 15064877 15487917 16165852 16849051
15638 16849051 17276692 18346798 19527084 20234999 21187697 22253228 22417046 22145265 22495991
15629 22495991 22384668 22140743 21615031 21312040 21109782 21311495 21579411 21396315 21460420
15620 21460420 21553254 21344353 20890266 20144300 19284576 18192340 17436133 15994048 15373967
15611 15373967 14501673 14206573 13695012 13393745 13132126 12628851 12429018 12011997 11690066
15602 11690066 11101437 10798046 10673872 10355621 10367876 10213143 10029288 10058771 10150734 10367765
15592 10367765 10769986 11314222 12330300 14284155 17760698 25154161 39456773 57669693
15584 57669693 76606713 91575291 100739479 106290585 108648765 101355160 82813636 59676352
15576 59676352 38980768 25631042 17702693 13452475 11015514 10006023 9410359 8731748
15568 8731748 8897298 8466894 8940370 9108303 8961943 9212894 9686185 9577403 9908766
15559 9908766 10360169 10485653 11394342 12027940 13759188 16368346 21916887 34180545 54802443
15550 54802443 79378024 103266455 120752147 130481193 136591072 137197217 123153745 95831040
15542 95831040 65854241 40940119 25677415 16880590 12070164 9510800 8241823 7460132
15534 7460132 7033719 6690936 6185790 6190926 5993500 5873644 5876554 5567361 5431164 5035954
15524 5035954 4885223 4649372 4680028 4291658 4185761 4106959 3974745 4004339 4025639 3872695
15514 3872695 3917942 3887590 4091374 3717553 3999675 4360950 4611516 4356287 4420570 4627098
15504 4627098 4475973 4544278 4601954 4491683 4222460 4221873 4119690 4017628 4085933 3790205
15494 3790205 3892136 4182238 4066750 4274160 4232886 4429213 4385878 4551702 4411996 4747943
15484 4747943 4664534 4635708 4917992 5008595 5553543 5597614 6057170 6124027 6371439 6575758
15474 6575758 6133154 6303240 6018966 5931843 6141945 6802948 7394242 8095691 9286967
15465 9286967 10080476 10823817 11507745 11635662 11313522 10994616 10395475 9527576 9252693
15456 9252693 8675283 8765433 9097816 9268912 9999801 11086915 11469227 12425291 12591146
15447 12591146 12521868 12071539 11458906 10733359 9768186 9013978 8698415 8473482 9014182
15438 9014182 8796289 9164774 9413979 9581569 9509561 9444796 9275578 8756090 8446543 7731799
15428 7731799 7530213 7413927 7065772 6913697 6692426 6527024 6436173 6304959 6256221 6046126
15418 6046126 6074211 5726532 5271647 5321508 5121136 5160665 4957880 4958420 4828328 4757390 4779880
15407 4779880 4742092 4797569 4797980 4576028 4671393 4882536 4851660 5121745 4882332 5188534 5148816
15396 5148816 5215786 5113515 5233364 5206998 5165764 5234938 5225492 5228037 5218815 5280602 5184936
15385 5184936 5003364 5396681 5367827 5322543 5668067 5811710 5534587 5678424 5693790 5941188
15375 5941188 5812589 5595826 5921659 5735940 5766951 5792992 5800994 5817850 5697663 5844339
15365 5844339 5690442 6125956 6169040 6000842 6255942 6381557 6820497 6800905 6726657 6847117
15355 6847117 7159125 7371417 7778411 7726975 8417697 8553160 8925226 9460664 10302751 11715006
15345 11715006 14374796 19627248 27642924 37835452 48340939 56412497 61653157 64617503
15337 64617503 65277579 60651296 50935013 38896219 28412987 21529499 17778451 16003537
15329 16003537 14939951 14693130 14419997 14077098 13492328 12891038 12699805 12402854 12268377
15320 12268377 12406740 12516073 13071099 13531031 14042546 14891914 15970493 18169853 21861617
15311 21861617 29338178 41577054 58555480 77786311 95156776 108484699 117161017
15304 117161017 120155609 115567885 102663636 82624498 60668431 42866358 29725505
15297 29725505 21888800 17581232 15192432 13965846 13227183 13047368 12677686 12829479 12961491
15288 12961491 12815533 12755669 12888074 12486590 12311615 11992278 12136301 11918994 12583515
15279 12583515 13473383 15219067 18191510 23926565 32580546 42433835 52157178 58772428
15271 58772428 62982264 64945132 63909301 57967246 47542192 35963163 26392961 20102822
15263 20102822 16517021 14355222 13088586 12035135 11125671 10352034 9714456 9269694 9078855
15254 9078855 8566770 8933024 9004607 9505295 9658706 9879657 10258498 10402146 10246810 10196760
15244 10196760 10043014 10359748 9946138 9567151 9277592 8890464 8256359 8069825 7570408
15235 7570408 8028199 7829968 8233382 8907319 9389142 9909550 10335830 10805035 11233135
15226 11233135 11277273 11056497 10637853 10507339 9978782 9229255 8875980 8563350 8124175
15217 8124175 8312375 8721297 8594824 9201596 9694022 9885545 10726323 10903680 11213397
15208 11213397 11167232 11234911 10881159 10118813 9304122 8781571 8501040 7821505 7577917 7167875
15198 7167875 6959601 6951084 6754570 6330801 6388479 6048309 6304554 6093463 6108948 6311929
15188 6311929 6486662 6723659 7048667 7047005 7149725 7405504 7280931 7235220 7269936 7012411
15178 7012411 7182212 7301017 7274251 7554933 8062153 8020574 8381023 7939221 7961862 7998343
15168 7998343 8085968 7740912 7900557 7684863 7665147 7717469 7801652 7781388 7729160 7929063
15158 7929063 7890458 8062469 8552486 8710040 8805017 9154193 9092938 9038697 8916994 8872401
15148 8872401 8663443 8550466 8476945 8476572 8392469 8457828 8523816 8386513 8315995 8511336 8085370
15137 8085370 8194823 8232927 8215166 8068404 8179036 8152594 7938989 8161538 8173737 8077173
15127 8077173 7799625 7944751 8018352 7992259 8060395 8194346 8202879 8031879 7891946 7892924 7931177
15116 7931177 7908880 7756910 7799750 7793958 7659539 7710250 7772566 7776530 7700023 7974114 7894298
15105 7894298 8102460 8261433 8384203 8571867 8689557 8810666 9107664 9542827 9779124
15096 9779124 10060783 10235838 10406750 10655988 10953348 11394057 11884845 12747002 14296863
15087 14296863 17107323 20469837 24548047 28456574 31449801 33786397 34531928 34634703
15079 34634703 32814761 29705377 25693076 23066574 21354068 21532631 22711013 25581387
15071 25581387 29530674 33506218 36990671 39122615 40583346 41059505 39874208 36971156
15063 36971156 33579559 31551232 32910982 37536447 43578063 50293386 54756078 58433257
15055 58433257 61604634 63850854 62120363 58481933 54206516 51914957 51331742 52713173
15047 52713173 55061917 58587625 62221653 65558279 68411328 71221839 73238333 75152607
15039 75152607 75430478 73989181 71617509 69008480 67533849 67172627 67391188 67329822 68109463
15030 68109463 70446694 75035956 82564605 92790671 105128427 116576710 125232805 130205663
15022 130205663 131166059 128559266 120819070 108526479 94360717 81098979 71315616 64833246
15014 64833246 62214066 62090143 63839405 66488307 68600536 70163473 71130046 71182429 68771776
15005 68771776 64633496 59316408 55134737 51576023 48918282 46847383 45396311 44623475
14997 44623475 44959308 46695504 49325633 52162645 55512790 57787435 59243850 59516783
14989 59516783 59124502 56969127 53827672 50600243 49075483 48707082 49706881 51321983
14981 51321983 52635002 54620815 56777307 57940862 56646775 53512013 48571460 44079340
14973 44079340 40269277 36312629 32854536 29882050 27904171 27220515 26786864 26685303
14965 26685303 27691827 28000635 28981877 29707143 30457869 31309609 32391227 33901613 35953682
14956 35953682 38392187 42146664 48467097 57937225 71258163 90114032 115765604 147093123
14948 147093123 184430237 225799339 269899039 315107956 359414620 398724662 430501187
14941 430501187 452640280 460262983 450627972 427457860 397454728 362290245 322461286
14934 322461286 280498083 243723219 217159349 201363912 191341322 181990509 170081896
14927 170081896 155969954 140858869 126843787 114187497 103124514 94311206 88986574
14920 88986574 86715366 86529919 87478703 87007940 85480607 83083635 77249355 67296402
14912 67296402 53995991 41565537 31162752 23948410 19570738 16815965 15092551 13905857
14904 13905857 13152152 13149715 13352987 13575934 14449248 15781006 17091280 18861151 20543534
14895 20543534 22346426 25136387 29147442 34908386 42212141 48592860 53992798 57622649
14887 57622649 59232583 58561378 54295976 46761397 37663869 28996150 22541905 18527601
14879 18527601 16169596 15017334 14624535 14777735 14781088 15339647 16003490 17335979 18536058
14870 18536058 20003421 20990786 21337941 21906852 21978456 21626909 20928014 20152715 19679117
14861 19679117 20085636 21071047 22765341 25306346 30075641 37664943 48596065 61784855
14853 61784855 76372936 91580031 105331031 115729580 119949512 117345874 108526137
14846 108526137 96425248 81532314 65674488 50516338 38042475 29842611 24301315
14839 24301315 20793587 18785468 17426929 16578315 16352396 15846050 15447752 15392870 15372782
14830 15372782 15092054 14921655 14827488 15160530 15510935 16404716 16986038 17861065 18693140
14821 18693140 19768098 21081522 23263279 27029929 33434484 42923653 54063727 65411820
14813 65411820 74653875 80562512 83249613 81962642 75412662 63558860 49271478 36078120
14805 36078120 26726201 20090376 16487512 14247781 13033652 12261527 11865657 11280510
14797 11280510 11001751 10644738 10257416 10146284 9935457 9179429 8838540 8453782 8189288
14788 8189288 7897985 7627320 7758885 7570650 7566714 7579417 7601483 7746134 7946865 8112242
14778 8112242 8757012 9519924 10210602 11458785 12450432 13279443 13805755 14118500 13474314
14769 13474314 13151605 12056885 11060166 9925348 8991522 8580790 8480658 8375427 8436005
14760 8436005 8611692 8856390 9105471 9094689 9187089 9511437 9993104 10126610 10416196 10243825
14750 10243825 10279201 10440244 10502398 10693475 10772854 10631527 10987013 11101706 11338706 11750608
14740 11750608 12130675 13008895 13459902 14428404 15608050 17148584 19188268 21713917 25064807
14731 25064807 30196046 37160779 47486358 63456888 89219388 124823646 169646903
14724 169646903 219983450 269134299 311748660 342001067 354916763 345950763 316820582
14717 316820582 271585072 217547307 163680415 117396541 82891352 59315935 44102757
14710 44102757 34061779 27862410 23466250 20463976 17919061 16338402 14757927 13556996
14702 13556996 12462764 11685298 10593046 9963694 9196035 8776886 8234187 7958263 7468178
14693 7468178 7282420 6957387 6866937 6661316 6914341 7018703 6973576 6916520 6844831 6883653
14683 6883653 6777020 7095585 7241101 7510532 7850230 7878906 7930897 8037480 8535497 9317856
14673 9317856 10351283 11223263 11920580 12359704 12821456 12656193 12164361 10956138 9642257
14664 9642257 8045839 7228251 6486097 6477398 6588342 6674655 6839635 6708764 6584272 6518564
14654 6518564 6146213 5851528 5677002 5498796 5594214 5794584 5644492 5759588 5619883 5824736
14644 5824736 5597532 5830975 5758825 6198642 6281210 6323314 6311730 6728515 6683248 7304257
14634 7304257 7630384 7989618 8524684 8993278 9301487 9558266 9519774 8663203 8017764 7401620
14624 7401620 6316683 5718645 5064646 4689519 4725422 4551685 4568839 4600324 4620827 4470060
14614 4470060 4271710 4093557 4057119 4076931 3951700 4057878 3905740 3567211 3521607 3834286
14604 3834286 3288272 3170910 3216306 3084799 3209269 3442157 3492733 4047232 4863599 5221424
14594 5221424 5919743 6529854 7297555 7014128 6742463 6711800 5981636 5166564 4630727 4162869
14584 4162869 3666520 3629078 3511114 3627939 3823289 3627912 3589231 3884175 3858363 4250791
14574 4250791 4172355 4098498 4336855 4047152 4113494 4377927 4328780 4449192 4589834 4959139
14564 4959139 5477943 5679397 6744307 7252108 8351539 9710648 11979207 16834057 24986629
14555 24986629 35704024 46908244 56658744 63432763 67667956 69198211 66012359 56537981
14547 56537981 44142974 31940149 23706024 19568753 18758427 20947630 27235466 37155396
14539 37155396 48828343 59781760 67790749 72627951 74809938 73208464 65322636 52140383
14531 52140383 38104088 27073518 20003495 16159687 14158023 13791816 13820788 13980134
14523 13980134 14403623 14671049 14517530 14539758 14328427 15221513 18998509 25067732 33068033
14514 33068033 41229457 47713370 51530506 54019934 54265132 50576945 42736217 34110849
14506 34110849 26458951 22181933 20583748 21242440 24391839 29819558 37357277 45113593
14498 45113593 51725270 56028100 57911994 58089195 55178340 48110094 38060839 28656606
14490 28656606 21974267 17611839 14973589 13151233 11820392 11257295 10097599 9076473
14482 9076473 7476870 6222857 5411590 4849186 4469933 4384900 3958604 4371072 4283536
14473 4283536 4171400 4001515 4046990 4029483 4255198 4697806 4965733 5551158 6128613 6314215
14463 6314215 6624908 6756801 6475030 6146112 5733251 5914522 6093690 6211852 6829747
14454 6829747 7393871 7834622 7847844 8014208 7621009 7429238 6665097 6010701 6086116 5999749
14444 5999749 6111222 6542628 6672633 7169332 7342263 7916904 8180056 8573638 8477608 8899518
14434 8899518 8899640 9021130 9232804 9403688 10158930 11004255 11869630 14433987 18126594 23875801
14424 23875801 31309595 40189778 48196805 55050364 60165348 62313928 61318036 56151185
14416 56151185 48131994 38953400 30663686 23939781 19009540 15487478 13154368 11506199
14408 11506199 10363811 9749661 9110799 8676965 8875860 8945980 8810272 8986963 8908838
14399 8908838 8735096 9036216 9240832 9436341 10026388 10889505 12296759 14222120 17511207
14390 17511207 22892992 30701224 42005474 55803396 70424684 83606165 94164471
14383 94164471 100442117 101775380 97206794 86646846 72021865 56410806 42457221
14376 42457221 31527196 23933150 18368788 15146127 12835691 11365483 10498309 10203165
14368 10203165 9806566 9712486 9361813 9392454 9425969 9217895 9372011 9264657 9155962 9668689
14358 9668689 10201075 11073676 12375436 13916973 16546121 19706824 24425649 30403427
14350 30403427 37521804 45481732 53124249 60281461 66922538 72760593 78361659 83157667
14342 83157667 88791344 95245492 101523093 106340928 109364853 108529160 104218737 95662708
14334 95662708 84281514 71422193 59663780 50190837 42718700 37223478 32800980 29455497
14326 29455497 25117362 20279726 15283993 12276539 9958581 8332266 7474903 6600759
14318 6600759 5989537 5643789 5204841 4590900 4333852 4276045 3741675 3585041 3433992 3188123
14308 3188123 3207180 3352402 3070105 2966218 3047223 2981606 2783989 2861060 2622487 2584179
14298 2584179 2548908 2671207 2797758 2645413 2666393 2565511 2533844 2591050 2374065 2221791
14288 2221791 2623964 2524740 2192140 2250757 2131980 2296226 2435178 2107619 2103485 2255476
14278 2255476 2368161 2426275 2362751 2601667 2633970 2474685 2297968 2684335 2669135 2392864
14268 2392864 2562311 2501793 2360048 2322246 2480735 2522163 2508729 2447966 2350804 2248109
14258 2248109 2239614 2296878 2115552 2259697 2214632 2127435 2061169 1967149 1985185 2012160 1977647
14247 1977647 1897077 1707270 2064980 1923694 1972568 1809061 1927607 1753676 1667191 1706407
14237 1706407 1936793 2272023 2042114 1985046 2006151 1924279 2146989 2277625 2386291 2102364
14227 2102364 1842250 1887880 1817495 1507334 1978926 1962991 1780402 1854935 2060190 1922946
14217 1922946 1828071 2081727 2110357 2157462 2123049 2551547 2576019 2549815 2600052 2702455 2671197
14206 2671197 2793470 3294439 3764796 4179757 4680747 4640279 4734131 4973235 4368798 3826452
14196 3826452 2907148 2082720 1947135 1772027 1774193 1741993 1822617 1770853 1956398 1900382
14186 1900382 1983678 2163626 2049877 2064708 1901691 1956938 1979685 1906164 1999027 2098045 2360747
14175 2360747 2470353 2656688 2880727 2911292 3043972 2867307 3093655 2746327 2630005 1958511
14165 1958511 2142689 1886360 1939676 1729517 1637843 1775104 1890431 1760660 1789757 2106736
14155 2106736 2079863 1964673 2077262 2096694 2198870 2290984 2341728 2219795 2273297 2310830
14145 2310830 1931496 2221845 2304206 2380026 2665750 2734448 3579796 4048047 4968769 6057417
14135 6057417 7007079 7752434 8162269 8642866 8805507 8286746 7722704 6658165 5509048
14126 5509048 4727788 4271073 3654319 3286772 3052727 2813961 2529128 2820144 2893181 2875328
14116 2875328 3555785 3504911 3832756 4040265 4037311 3890732 3566166 3543856 2905518 2871716
14106 2871716 2607972 2490579 2531819 2657001 2366870 2678681 2626014 2981227 2930742 3137129
14096 3137129 3423816 4062259 4383708 4778140 5350734 5473666 5803884 5883143 5822898 5584981
14086 5584981 5253592 4972801 4983062 5181761 5580755 6068506 6697665 7521874 8265439 8881641
14076 8881641 9880363 10582105 11379877 12467323 13537872 15440757 18149383 21725213 26885453
14067 26885453 33756070 43018846 54467907 67797893 81213589 93014000 101168504
14060 101168504 105056436 103758283 97971634 86809545 72719415 57571951 44686312
14053 44686312 34666117 27158705 21575301 17688216 14571900 12077874 10251778 8968504
14045 8968504 8241727 7335815 6888013 6758742 6373638 6119098 5822371 5807118 5477178 4995157
14035 4995157 4604489 4283503 4019424 3807078 3680526 3278853 3159075 3084711 2634723 2702797
14025 2702797 2609544 2598754 2463844 2461233 2260364 2315251 2310895 2420805 2198820 2151204 2054446
14014 2054446 2003734 2220345 2092255 2161211 2257926 2111718 2065042 2312296 2233267 2229998 2116527
14003 2116527 2185539 2181540 2131050 1891561 1997419 2094052 1806958 1943338 2105810 2158439
13993 2158439 1983401 2268611 2238870 2537184 2551893 2736675 2915807 3243526 3661107 4631148
13983 4631148 5748845 7256919 8708877 10264718 11297063 11777858 12109145 11849700 11018610
13974 11018610 9390359 7812318 6274221 5176334 4479585 4119317 3642917 3626430 3465319
13965 3465319 3622255 3512818 3204096 3156280 2856616 2965888 2490735 2695058 2330880 2212606
13955 2212606 2194293 2114649 2217178 1985278 1796190 1812997 1924135 2209151 2280760 2598270
13945 2598270 2601433 2888589 2873633 2808534 3335912 3696530 4224521 5623038 7726308 10255119
13935 10255119 13341664 16281622 18814229 20624068 21426087 20520682 18604023 15740710
13927 15740710 12945219 10085798 7224315 5060437 3835784 2951897 2729563 2274970
13919 2274970 2248978 2187037 1793341 1771086 1805922 1775839 1717014 1711506 1753144 1517119 1351273
13908 1351273 1279151 1660726 1497071 1593877 1308902 1391582 1436969 1417267 1648686 1566250
13898 1566250 1471966 1595151 1158441 1395604 1556119 1408630 1609559 1188350 1516682 1323966
13888 1323966 1424343 1227140 1491921 1542067 1397310 1527401 1348323 1527146 1370105 1581540
13878 1581540 1301401 1526294 1427440 1198216 1563323 1404071 1511256 1443504 1493078 1493021 1438145
13867 1438145 1486331 1626409 1786372 1786856 1572281 1621467 1773241 1713239 1611942 1562041 1610365
13856 1610365 1609148 1595194 1657470 1586505 1810540 1628527 1752967 1531489 1524580 1529760 1534460
13845 1534460 1410622 1544909 1463782 1529375 1474650 1488000 1785748 1495251 1371603 1322176
13835 1322176 1218687 1545488 1466960 1256822 1348333 1452377 1101466 1252078 1312559 1284947
13825 1284947 1473880 1503934 1378166 1406222 1287621 1423872 1298666 1338304 1291666 1240719
13815 1240719 1119192 1270871 1256637 1265501 1192446 1399001 1078553 1229369 1142857 1518830
13805 1518830 1330238 1214275 1264168 1278535 1528766 1362442 1298813 1460789 1382505 1576067
13795 1576067 1657425 1601139 1649045 1775487 1383704 1330957 1356632 1443205 1206545 1281652 1140423
13784 1140423 1251830 1270777 1323978 1260126 1130060 1396507 1343085 1540530 1919639 1736138
13774 1736138 1582681 1547790 1583439 1813982 1796964 1715164 1615175 1606358 1458738 1479606 1397565
13763 1397565 1309800 1501279 1392154 1464321 1329900 1243950 1382537 1383247 1404159 1311507 1365259
13752 1365259 1346927 1277040 1484706 1595054 1372926 1190979 1431515 1485335 1383616 1829103
13742 1829103 1492900 1516122 1690193 1758642 1841843 1857989 1598936 1803580 1908376 1707784
13732 1707784 1843246 1924421 1869982 1770529 1978876 1816037 1745570 1809944 1977645 1991813
13722 1991813 1965952 2257140 1994603 1913172 2194599 2113680 2082217 2061808 2234647 2351006
13712 2351006 2175523 2555219 2290327 2362855 2519186 2348037 2468705 2449839 2339732 2403833
13702 2403833 2410127 2226138 2388808 2175272 2257196 2332164 2078983 2239988 2451277 2332720
13692 2332720 2389452 2706623 2992088 3015062 3269411 3229598 3027150 3179121 2983967 2608785
13682 2608785 2343708 2088241 2154367 2128874 1887244 2057535 1909137 2024667 2006605 2090888
13672 2090888 2224865 1944441 1985601 1811364 1993512 2206394 1921241 2095748 2450098 2699435
13662 2699435 2974274 3030094 3274791 3544643 3487948 3549129 3613184 3339035 3001821 2934575
13652 2934575 2699676 2618313 2411056 2296183 2074541 2242019 2111761 2021825 2125029 2212375
13642 2212375 1870701 1955794 1975834 2006748 2112501 2045102 2071000 1909295 2200000 2184104
13632 2184104 2747829 2879643 2950810 3082507 3118686 3219527 3057970 3062995 2627598 2414723
13622 2414723 2069145 1905254 1952999 1925635 1920805 1790871 1816599 1544887 1936495 1756180
13612 1756180 1896979 1990017 1925682 1867497 2110067 2227193 2122458 2199841 2450142 2136329
13602 2136329 2473579 2225663 2346161 2422880 1936267 1871132 2018281 1823611 1945214 2127397
13592 2127397 2013053 2009491 2224213 2331124 2407849 2239788 2313418 2261836 1884972 2086193
13582 2086193 1877420 1779097 1884474 2005721 1652916 1646752 1911770 1687849 1740571 1995880
13572 1995880 1835041 1646348 1773189 1633670 1601911 1609310 1819921 1534804 1794911 1718723
13562 1718723 1562832 1895571 1692957 1573287 1782867 1301323 1796801 1755312 1665275 1775113
13552 1775113 1656321 1493392 1591219 1442267 1491033 1713719 1534045 1455771 1527881 1621464
13542 1621464 1741025 1935517 2064987 2568352 2617058 2722755 2760885 2854752 2686154 2392068
13532 2392068 1976753 1861637 1902899 1828731 1712403 1779968 1680221 1661905 1847754 2083368
13522 2083368 2290946 2543614 2572965 2572667 2671785 2432342 2173434 1965514 1807229 1559493
13512 1559493 1516289 1570471 1442792 1562838 1291349 1452129 1432013 1429685 1363896 1252275
13502 1252275 1461054 1162649 1541567 1359602 1252619 1341503 1278699 1118182 1276089 1243258
13492 1243258 1377609 1308170 1290688 1562250 1469980 1355997 1211187 1223264 1398405 1278824
13482 1278824 1251752 1346911 1593642 1430905 1389665 1308191 1463727 1232168 1412040 1335425
13472 1335425 1353562 1291459 1205603 1249113 1469163 1253353 1274268 1460022 1415320 1350578 1431741
13461 1431741 1307051 1326780 1311157 1471988 1435988 1536919 1537767 1464281 1473872 1423272 1925818
13450 1925818 1909304 2198103 2621582 2574717 2836660 2742136 2638644 2629248 2392010 2236539
13440 2236539 1808662 1678404 1538736 1757514 1524845 1643389 1681763 1465949 1592308 1389509
13430 1389509 1600434 1527358 1393884 1481111 1427057 1615423 1619950 1750915 1606229 1787316
13420 1787316 1946710 2271134 2626899 2678281 2790215 2945260 2744745 2752321 2473160 2281793
13410 2281793 1828525 2044536 1946405 2002920 1756845 1808658 1735102 1431996 1688691 1811716
13400 1811716 1784349 1673349 1659672 1717164 1585250 1711496 1738492 1674076 1746671 2031531
13390 2031531 1721253 1895236 1996624 2226069 2144711 2191649 2445033 2452943 2466444 2514771
13380 2514771 2709913 2812453 2887442 2644047 2932541 2620079 2746602 2413852 2227135 2371586
13370 2371586 2141403 2288081 2118100 2319571 1996346 2343528 2455599 2251399 2354095
13361 2354095 2293145 2490377 2277170 2323068 2329674 2347353 2211823 2324576 2404768 2328931 2528109
13350 2528109 2536484 2743664 2650132 2816586 2558383 2784863 2483607 2295141 2465037 2456799
13340 2456799 2315187 2285631 2139641 2129044 2654985 2176915 2124515 2334068 2232429 2247511
13330 2247511 2301578 2151114 2231249 2290644 2248158 2278268 2298988 2339332 2441741 2281208 2368707
13319 2368707 2527593 2407616 2377748 2428660 2682894 2578113 2757043 2798388 3163268 3093704
13309 3093704 3254904 3433010 3374290 3278149 3315185 2944693 3210639 2982992 3154630 2939765
13299 2939765 3169895 3027515 3147280 3428108 3390024 3605071 3637559 3627953 3752816 3837769
13289 3837769 3615539 3547458 3471195 3384369 3367684 3405098 3249093 3278734 3446142 3110399
13279 3110399 3191968 3552670 3564904 3462157 3574959 3627708 3488152 3664561 3580286 3743086
13269 3743086 3600560 3906309 3706185 3918818 3828744 3976051 4029534 4041784 4135564 4130664
13259 4130664 4021238 4280650 4264642 4489919 4385202 4754161 4882548 4768285 4922502 5128391
13249 5128391 5155762 5408882 5285874 5573160 5706947 6186302 6032831 6269813 6282785 6428806
13239 6428806 6481374 6308827 6358047 6439705 6685097 6767222 6843134 6595175 6771978 6925031
13229 6925031 7162529 6939229 7086416 7407568 7837042 7946377 8061789 8517331 8195733
13220 8195733 8914390 8778285 9422027 9313419 9385488 9549831 9325210 9308588 9150679 9437308
13210 9437308 9051049 8702582 8668272 8572567 8282499 8164600 8096052 7674805 7939065 7729097
13200 7729097 7873250 7537863 7550346 7441085 7619768 7618945 7426888 7519489 7491065 7412738 7321207
13189 7321207 6984458 6721992 6848796 6706338 6490227 6128506 6176275 5919956 5794547 5517185
13179 5517185 5415216 5380545 5179793 5196457 4658439 4879848 4800288 4702998 4698048 4505843
13169 4505843 4339667 4479388 4658262 4457197 4446638 4422365 4694885 4832357 5039532 5290552
13159 5290552 5558024 5897628 6398268 6719595 6957445 7066790 7132282 7071812 7013490 7333000
13149 7333000 6891359 6747722 6777926 6555979 6763138 6645182 6602520 6467229 6358526 6390108
13139 6390108 6413069 5864119 5781948 5398007 4887628 4773721 4607989 4212850 4091119 3925803
13129 3925803 3811459 3859916 3724131 3615092 3757630 3885327 4051604 4076011 4203692 4018774
13119 4018774 3916294 3997644 3870426 3490932 3397282 3277160 3460408 3117871 3549080 3372616
13109 3372616 3259879 3071516 3289237 3600436 3375370 3619718 3754403 3612219 3790229
13100 3790229 4059002 4166043 4526452 4829156 5135370 5577065 5981886 6025244 6537468 7186556
13090 7186556 7302306 7520403 7557857 7638630 7496645 7271590 7439197 7403439 7250950 7143167
13080 7143167 6986912 6941499 6843961 6444980 5886534 5534706 5291971 5064083 4681928 4255243
13070 4255243 3979325 3896605 3792783 3335985 3624674 3549275 3425605 3252978 3238021 3356562
13060 3356562 3366931 3321905 3347815 3632606 3500850 3590879 3526706 3571322 3965266 3786550
13050 3786550 3780878 3755738 3574958 3787023 3473884 3751703 3609478 3563637 3685572 3665769
13040 3665769 3605439 3452725 3801355 3577078 3539202 3772946 3788870 3690914 3930633 3920431
13030 3920431 3886002 4134742 4079865 4196262 3886461 4378750 4166631 4200479 4311635 4092318
13020 4092318 4405223 4369223 4605691 4362641 4304408 4458818 4581621 4544049 4624140 4676539
13010 4676539 4595798 4619133 4658521 4679061 4681434 4663097 5163401 4995716 4898761 4833224 4896761
12999 4896761 4953284 4943916 4948412 5291136 4946786 5074033 5160992 5138484 5109019 5407329 5094835
12988 5094835 5352090 5404092 5028786 5431945 5227560 4981693 5145082 5200327 5224727 5070757
12978 5070757 5308001 5321157 5211221 5347790 5213310 5145597 5178399 5210772 5025458 5019191
12968 5019191 4806148 4892660 5102340 4814492 4798448 4979110 4628999 4644377 4744906 4637578
12958 4637578 4419644 4630794 4582870 4505288 4789608 4775265 4635368 4623365 4668208 4736514
12948 4736514 4692929 4796367 4718757 4703748 4868003 4769288 4483439 4642800 4567872 4708584
12938 4708584 4490794 4577760 4478937 4546700 4474483 4437880 4752923 4643574 4662882 4856777
12928 4856777 4618845 4831337 4807223 4739541 4567730 4443219 4272813 4383413 4240213 4353051
12918 4353051 4148367 4379017 4447974 4219231 4471387 4431746 4336499 4024675 3926770 3570807
12908 3570807 3650965 3350944 3584960 3852834 3608876 3512963 3703814 3462967 3361770 3708589
12898 3708589 3460530 3379866 3266908 2994543 3124564 2969874 3289106 3149455 2825230 3005834
12888 3005834 3054524 3217471 3146577 3013072 3055405 2872256 3141980 3138614 3157558 3319477
12878 3319477 3188240 3208474 3196856 3126992 3200921 2856786 2932904 2984099 2698759 2874549
12868 2874549 3030962 2752571 2846649 2762781 2653195 2674937 2871729 2556960 2581776 2738612
12858 2738612 2594855 2771827 2772661 2766686 2865324 2806651 2850785 2960014 2692391 2799267 2792367
12847 2792367 2695366 2726716 2873694 2962256 2683868 2714145 2506698 2753813 2850580 2848196 2631326
12836 2631326 2685872 2755791 2710998 2832604 2629792 2563426 2882094 2596097 2675900 2810188
12826 2810188 2759564 2626375 2773588 2732536 2600786 2794202 2771978 2677934 2819393 2889079
12816 2889079 3006488 2641915 2729560 2846689 2743722 2576259 2553665 2749742 2799538 2700868
12806 2700868 2755441 2654557 2813701 2986337 2765636 2853646 2771015 2688155 2801847 2867505
12796 2867505 2782746 3065744 2883003 2952018 2769173 2726804 2875897 2944487 2839733 2807832
12786 2807832 3037262 2953683 2828077 3202933 3006677 2851414 3050104 2836909 2855985 2961559
12776 2961559 2896929 2699291 2823952 2582296 2929598 2929480 2688435 2813644 2988971 2953339
12766 2953339 3216235 3051657 3343135 3377992 3067427 2963763 3200147 2997422 3088318 2900971
12756 2900971 3150716 3041714 2954177 3442282 3084634 2818063 3108097 3053654 3254996 3029196
12746 3029196 2961255 3102600 2904902 3131854 3100971 3067085 3039767 2973207 2821520 3228427
12736 3228427 3168730 3156363 3186582 3177908 3332151 3219367 3315367 3272366 3441204 3336353 3247241
12725 3247241 3213640 3056221 3174889 3039689 3267406 3306801 3069369 3250045 3413046 3382467
12715 3382467 3334356 3352544 3477412 3425728 3308048 3288663 3434354 3705675 3486433 3431167
12705 3431167 3792828 3774883 3982821 3766954 3938636 3865960 4297068 4337672 4634700 4570989
12695 4570989 4645701 4883753 5252670 5076375 5491914 5798272 5949527 6347560 6675988 7050458
12685 7050458 7417829 7408417 7599644 7567327 7309266 6989372 6692428 6230077 5530496 5005191
12675 5005191 4927225 4634272 4530802 4676653 4670434 4476100 4376401 4743307 4783509 5073416
12665 5073416 4907129 5070743 5235869 5146111 5091553 5350112 5293940 5391058 5385851 5602920
12655 5602920 5374131 5818053 6101129 5782729 6325574 6318981 6505397 6631472 6639935 6702804
12645 6702804 6375596 6651604 6477875 6324468 6159709 6192528 6725519 6719034 6909259 7121447
12635 7121447 7498004 7318050 7674294 7850239 7712823 7828432 7861711 7925853 8196948 8184240
12625 8184240 7883301 7715061 7368401 7236464 6452504 6594158 6377352 5832427 5702635
12616 5702635 5752945 5328938 5430186 5153318 5065851 5269973 5638662 5878954 6625444 7242798
12606 7242798 7771807 8482129 9051476 9778827 10167499 10022536 10154428 9654616 9274452
12597 9274452 8651417 8262232 7345321 6653345 6287590 6100215 6001019 5860274 6033816 6168984
12587 6168984 6173514 6463312 6043957 6165259 6103399 5995107 6031855 5711095 5744511 5978435
12577 5978435 6187993 6415721 6857454 7374674 7722576 8092319 8121957 7983648 7701533 6971293
12567 6971293 6371708 6062572 5366606 4887690 5017364 5061485 4747058 4706703 4903929 4787282
12557 4787282 4871433 4660507 4949774 5024225 4777509 4929693 4962668 4840463 5026280 4799142
12547 4799142 5037453 4863568 4937676 5113235 5180519 5103481 4947409 5256216 5287887 5522915
12537 5522915 5578289 5837198 5903516 6125205 5916215 5919052 5623179 5267370 5088873 5127167
12527 5127167 4643004 4954237 4585996 4897918 4554203 4907185 4923461 5139280 4954628 5057873
12517 5057873 5077254 5030330 5059751 5336082 5298845 5246710 5523312 5937060 6135376 6974752
12507 6974752 7168668 7391302 7656294 7676107 7626692 7404266 6925994 6383891 5909276 5541542
12497 5541542 5377678 5393065 5193275 5087244 5177714 5453650 5281012 5233970 5284186 5083251
12487 5083251 5236168 5101583 5307346 5379596 5497560 5419015 5808654 5823271 6015996 6545902
12477 6545902 6561390 6654278 6725439 6543330 6272743 6238600 5808455 5776750 5323932 5353861
12467 5353861 5363748 5393540 5220892 5249186 5290932 5673227 5682133 5615793 5496978 5662399 5596025
12456 5596025 5965697 5723834 5747837 5753116 6026575 5848178 5991357 6286396 6148276 6563653
12446 6563653 6496170 6630958 6660886 6932251 7375924 7510843 7612491 8052743 8009933 8445219
12436 8445219 8552481 8978076 8989947 9354651 9411015 9239445 9393092 9700082 9547813 9648740
12426 9648740 9778814 9822185 9883716 9938090 9968027 9946913 10045192 10087809 10368585 10309499 10556161
12415 10556161 10623176 10872207 11489766 11851354 12155534 12800442 13338098 13536885 13962681
12406 13962681 14253001 14335078 14651984 14629232 14943966 14512803 14626761 14366025 13940708 13980394
12396 13980394 13720801 13771718 13592961 13687508 13423669 13137780 13428020 13184677 13545018 13487209
12386 13487209 13742110 14099848 14505548 15049220 14951287 15630928 15693614 15977184 16148688 16315560
12376 16315560 16576101 16567369 17071777 16889285 16903521 17157351 16879689 16962753 16861285 16723286
12366 16723286 16447146 16498941 16293372 16064687 16059809 15980653 15683999 15715649 15570252 15299009
12356 15299009 15261108 15218345 14925419 14586037 14458888 14377828 14516969 13921074 13900793 13588644
12346 13588644 13413156 13373440 13150563 12777183 12668856 12706434 12983034 12931471 13223826 13447615
12336 13447615 13923635 13881614 14404051 14553334 14848842 15159010 15436151 15721290 16089265
12327 16089265 16488709 16734405 17026532 17219606 17420838 17729011 17761485 17861092 17990938 18177654
12317 18177654 17747567 18019467 18143826 18099668 18163530 18157549 18135109 18034464 18141002 18442094
12307 18442094 18575519 18685816 19071660 19263534 19844507 19949169 20318359 20613014 20705184
12298 20705184 20808865 20640899 20498744 20167181 19780813 19162851 18804000 17978262 17993120
12289 17993120 17718748 17628445 17495674 17413672 17217734 16809656 16592734 16002865 15369244 14980775
12279 14980775 14591916 14068188 13520303 13067214 12704965 12355244 12219678 12037736 11643012
12270 11643012 11819794 11514957 11366081 11283740 11484070 11405482 11413945 11316837 11329643 11475672
12260 11475672 11160535 11117876 11305316 11428615 11348712 11473371 11500444 11718637 11759211 12014263
12250 12014263 12729944 12962206 13627942 14289987 15007690 15709504 16359748 17245578 18520856
12241 18520856 19731324 20652580 21415184 21983980 22472567 22733180 22598409 22415270 22109016
12232 22109016 21897302 21772673 21811750 21490425 21642875 21530858 21467041 21136363 20173384 19438549
12222 19438549 18430689 17631107 16606941 15266453 14621038 13716105 13178551 12432496 11886994
12213 11886994 11856780 11522919 10938752 11038519 10929005 10627794 10389386 10335934 9920266 9623169
12203 9623169 9164412 9241034 9080280 8867673 9196667 9130320 9095070 9132772 9145584 9269213
12193 9269213 9270005 9246550 9139697 8989834 8946395 9313211 9730662 9652599 10206066 10256471 10455182
12182 10455182 10581857 10930231 10905755 10783569 11278400 11324341 11252991 11396747 11554765 11520554
12172 11520554 11284806 11037695 10616360 10831046 11011657 10972123 11080180 11531348 11665373
12163 11665373 11783072 11846078 12161314 12612154 13004722 13887381 14662861 15150136 15527740
12154 15527740 15914449 15873294 15658314 15152317 14728892 14056106 14217987 14142886 14248567 14865529
12144 14865529 15407732 15974255 16052568 16618857 16770653 17040638 17391946 17439345 17895012 18187645
12134 18187645 18625188 19346580 20647209 21484913 22588867 24076960 26190524 27605911
12126 27605911 29681746 31445927 33365416 35136244 36491166 37515304 38276164 38797553
12118 38797553 38776880 38458435 37930153 37529909 37443947 36923439 36641454 36017602 35589753 35401951
12108 35401951 34838757 34508410 33751925 33574154 33575627 33348903 33596970 33673849 33993080 34591620
12098 34591620 34906525 35427241 35636922 35965719 35811913 35471193 34420676 33346116 32480075
12089 32480075 31327970 30567486 30156765 30469188 31167823 31569108 32489144 33635878 34373573
12080 34373573 35023797 35020838 35293878 35071088 35087307 34723561 34361661 34315392 34353364 34284196
12070 34284196 34205025 33770196 33548590 33061040 32449968 31626169 30613463 29509442 28357915
12061 28357915 27446431 26462685 25574964 24934718 24234062 23835536 23596349 23198568 23027530
12052 23027530 22673648 22402117 21885798 21497072 21092541 20552916 20338723 19910596 19656585
12043 19656585 19374574 19029453 18770601 18715640 18215261 17944691 17561506 17065924 16538711
12034 16538711 16178128 15839492 15851534 15390971 15485915 15706064 16035036 16205363 16618401 17111957
12024 17111957 17318927 17436252 17201464 16902162 16763800 16012495 15249852 14761069 13947187
12015 13947187 13507600 13433609 13188013 13163573 13209480 12924735 12765893 12346794 12183727 11555165
12005 11555165 11225702 10851076 10767558 11131569 11118381 11616735 11661977 11962958 12273815 12172049
11995 12172049 12280381 11745698 11558518 11218973 10689289 10137300 10079513 9548180 9406966
11986 9406966 9491169 9547032 9781326 9759302 9732225 9289189 9050104 8636156 7937111 7876647
11976 7876647 7572144 7345267 7232133 7259413 7299686 7193896 6834812 7095652 6728712 6943330
11966 6943330 6425305 6219835 6000018 5706598 5924737 5547156 5673406 5852515 5551115
11957 5551115 5619232 5781123 5850843 6136052 6422560 6554913 6738162 6790252 6583404 6594958
11947 6594958 6540798 6232948 6512995 6373377 6569107 6685356 6902629 6974632 7241358 7260485
11937 7260485 7638554 7626310 7638504 7547632 7885419 7617243 7773008 7639667 7755015 7744402
11927 7744402 7828695 7904958 7737238 7818288 7740625 7515442 7316594 6854167 6710595 6350222
11917 6350222 6347245 6353689 6270538 6380541 6123168 6183553 6176293 6055562 5942879 6130643 6481755
11906 6481755 7947391 9657613 11877065 12877649 13666783 14198458 14347522 13688016 11849580
11897 11849580 9400737 7190398 5977461 5410854 5468722 5522954 5137927 5255922 5257047
11888 5257047 5325766 5872428 5908350 6137567 6936408 7461770 8389765 8970913 9626336 10429442
11878 10429442 10316965 10653147 10528924 10075362 9466383 8942495 8152144 7885566 7249345
11869 7249345 7050524 6321854 6011032 5724190 5508648 5291946 4975904 4963192 5008102 4832255
11859 4832255 4553115 4667066 4535858 4447416 4544621 4415839 4481971 4309295 4651113 4786939
11849 4786939 4916493 5025925 4990515 5165014 5326214 5482697 5981072 6472932 6965020 7425946
11839 7425946 8014608 8477273 8830941 9185893 9204040 8760357 8749269 8304235 7879110 7266928
11829 7266928 7457362 7176046 7432644 7704045 7744677 8010617 7443199 7070701 6451028 5779490
11819 5779490 5330983 4892851 4349244 4462843 4022564 4111052 3957796 4070439 3888460 3993131
11809 3993131 3832066 3722721 3656026 3766099 3671988 3476023 3623330 3636634 3689720 3867949
11799 3867949 3613574 3728530 3810860 3432578 3668236 3726626 3708118 3721993 3759496 3891631
11789 3891631 4261464 4396753 5193882 5306451 5884011 6145758 6581006 6783704 6514313
11780 6514313 6467424 6188525 5702797 5277099 4535524 4112090 3987635 3696881 3594971 3374256
11770 3374256 3394029 3107338 3329334 3585334 2948827 3145670 3099682 3137792 3036417 3018267
11760 3018267 2981667 2833993 2821898 3149390 2996009 2901775 3151994 3159124 2672058 3024546
11750 3024546 2973055 2930702 3028596 2998537 2958857 2803632 3025791 2962746 2961051 2985655 2662233
11739 2662233 2744134 2623817 3035172 2843397 2790622 2635938 2814176 2472610 2652235 2630399
11729 2630399 2600690 2686150 2686743 2823302 2703551 2587124 2849964 2591893 2650596 2570146 2779208
11718 2779208 2901997 2780605 2750598 2772259 2619259 2639890 2700511 2833517 2511365 2482209
11708 2482209 2678695 2740943 2643357 2736261 2500587 2848922 2693671 2780453 2862653 2751666
11698 2751666 2840506 2896451 3044688 2953600 3039451 2914831 2854767 3034257 3096854 2863511
11688 2863511 3179497 3263460 3169818 3405749 3508414 3254063 3579816 3406193 3620976 3531131
11678 3531131 3618769 3637138 3721360 3620725 3810047 3842645 3454902 3973166 3505088 3639773
11668 3639773 3582551 3846964 3587919 3852905 4005160 3988368 3985375 3725736 3753699 3621653
11658 3621653 3738131 3908143 3975405 3779836 3688857 3573112 3438713 3469680 3535546 3540367
11648 3540367 3446543 3498143 3521004 3423083 3424437 3369324 3315264 3074549 3295380 3409435 3502806
11637 3502806 3231756 3430191 3173225 3381450 3450825 3389101 3319461 3186080 3211405 3291592
11627 3291592 3265699 3421925 3159984 3123994 3027638 3117263 3246062 3176713 3338261 3154371
11617 3154371 3056342 3030081 3061441 2970063 3097734 3152021 3041823 3306244 3184936 3334125
11607 3334125 3107889 3153465 3057737 3075756 2954995 2951348 3385241 3204813 3419416 3202119
11597 3202119 3178058 3396568 3255914 3390871 3348231 3387154 3331773 3359632 3328439 3472046
11587 3472046 3292897 3178822 3391740 3207379 3223348 3334047 3107982 3522844 3289075 3566034
11577 3566034 3643632 3596133 3369862 3514070 3449390 3691018 3532029 3468537 3457280 3436724
11567 3436724 3718372 3577079 3375882 3536730 3361480 3547581 3669883 3425303 3631716
11558 3631716 3600789 3482778 3723980 3761889 3698955 3781820 3910795 3818336 3788554 3600122
11548 3600122 3920078 3510149 3770994 3575231 3592483 3614810 3486140 3442661 3605476 3507570
11538 3507570 3465315 3358350 3292141 3544015 3303473 3197878 3502424 3461046 3343360 3322467
11528 3322467 3330571 3346294 3267760 3600975 3415369 3224260 3407284 3344206 3218464 3294440
11518 3294440 3466543 3472943 3278389 3369082 3501668 3511151 3448938 3626362 3734704 3629888
11508 3629888 3698857 3765827 3814539 3899824 3790091 3577926 3722810 3800562 3618067 3914203
11498 3914203 3808898 3756201 3676844 3621706 3937592 3739105 3959231 3875612 3838413 3673759
11488 3673759 3805362 3710120 3863838 3775548 4065735 3878931 4150782 3807682 3899030 3923814
11478 3923814 3791483 4315738 4079021 3936408 3946429 3893335 4148996 4117930 3798180 4027821
11468 4027821 4002874 4026845 4152282 4026265 4073546 3737515 3853990 3866355 3893111 3733409
11458 3733409 3897801 3764117 3659912 3846747 3732796 3839216 3892980 3892531 3715826 3951714
11448 3951714 3823036 3788713 4018798 3889815 3836347 4156483 4285848 4166058 4201670 4337905
11438 4337905 4138853 4258720 4402372 4329966 4102448 4408877 4407950 4629545 4585430 4913888
11428 4913888 4572632 4755149 4830833 4938652 4797813 4718903 4861703 4855455 4736354 4780691
11418 4780691 4912662 4913783 4697795 4794332 4820665 4872410 4986156 5057798 4980961 5386145 5183643
11407 5183643 5051789 5210256 5106850 5548953 5528129 5393160 5553107 5779827 5672475 5715580
11397 5715580 5883372 5897955 6363637 6079897 6435404 6251859 6399237 6676859 6504779 6727546
11387 6727546 6896670 6958103 7101191 7130743 7377524 7251013 7521789 7670450 7623235 7736633
11377 7736633 7819224 7860874 8038460 7901439 8231028 8409844 8315593 8216584 8783106 8238287
11367 8238287 8380863 8583648 8686483 8465164 8759152 8648432 8832023 8731827 8593335
11358 8593335 8850213 9020736 8945440 8895786 8886437 9153370 9136004 8979671 8941199 8976571 8970984
11347 8970984 9218534 9294090 9153503 8989827 9177517 9205667 9142645 9082913 9025976 9122463
11337 9122463 9002461 8843684 8733447 8840745 8624313 8684923 8605395 8728205 8578761 8220535
11327 8220535 8460574 8099937 8136048 7956407 7931344 8107994 7942206 7755562 7356201 7387999
11317 7387999 7556353 7482702 7032977 7155436 6809839 6787327 6766882 6521341 6323036 6369909
11307 6369909 6370861 6028196 6118478 5796219 5854551 5751458 5544946 5534012 5343621 5340914 5040294
11296 5040294 5203361 4835686 4855146 4880337 4756119 4749780 4500547 4683339 4191122 4332335
11286 4332335 4180529 4096880 4160983 3938600 3981710 3759501 3901632 3941783 3638437 3645401
11276 3645401 3782193 3522388 3430436 3561668 3464778 3508945 3369905 3451913 3248630 3335136
11266 3335136 3371394 3512530 3069259 3305675 3243120 3113206 3327208 2976384 2887142 3012882
11256 3012882 2764724 2940312 2763686 2871358 2840430 2816558 2835967 2930845 2773013 3036989
11246 3036989 2818595 2641482 2911871 2895679 2825386 2725944 2870144 2793347 2805891 2678416
11236 2678416 2763390 2941250 2799679 3200328 2908324 2930447 3004720 2894382 3039542 3143318
11226 3143318 3094983 2857964 3251065 3236411 3289143 3710031 4663218 5416181 6304206 6666442
11216 6666442 6816078 6972470 7133967 6380087 5542807 4614409 3921930 3394024 3288764
11207 3288764 2967346 3119932 2885165 2929322 2785885 3010555 3018736 2923738 2913994 2720989
11197 2720989 2972446 3031060 3185316 3249237 3740317 4285093 4847238 5760245 6483486 6723700
11187 6723700 7057611 7107875 6988712 6292612 5374055 4526006 4094102 3527257 3254223 3167716
11177 3167716 3214010 3391159 3023899 3091000 3235903 2985289 3207390 3263948 3228343 3271617
11167 3271617 3170787 3398141 3056969 3285342 3352539 3236757 3316617 3651025 3352482 3353919
11157 3353919 3434679 3602874 3239776 3531498 3379688 3475314 3312457 3465471 3484195 3284851
11147 3284851 3286544 3450734 3550521 3560262 3708848 3416974 3492493 3324989 3607345 3427279
11137 3427279 3575570 3829764 3641189 3766252 3730803 3596239 3716867 3622642 3557517 3735204
11127 3735204 3986190 3843956 3879405 4081521 4071029 4179589 3895087 4147556 3989602 3862556
11117 3862556 3913041 4205765 3998139 4209706 4082759 4056567 3974413 4241039 4282029 4252229
11107 4252229 4099535 4209111 4209314 4244682 4204938 4104101 3855958 4131711 4254452 4070468
11097 4070468 3971315 3985888 3883863 4077173 3794188 4138886 3964639 3974832 3919942 3917922
11087 3917922 3803037 3849866 3931338 3970405 4010497 3926291 3871625 3811981 3883128 3986964 3800456
11076 3800456 3983851 3836319 3863675 3902488 4048298 3658804 3865123 3989369 4267028 3979604
11066 3979604 4173417 4242059 4215453 4298179 4317414 4451299 4363589 4195750 4294992 4619089
11056 4619089 4516399 4582460 4648181 4742790 4668618 4628700 4633003 4719066 4669452 4766022 4881083
11045 4881083 4721943 5061155 4768560 4947168 5060303 4891008 4877904 4864395 4976452 5186099
11035 5186099 5137700 5253345 5520716 5424309 5493714 5607342 5767073 5986216 6014280 6238724
11025 6238724 6300309 6634622 6783597 6658448 7001916 7280102 7568119 7322128 7581818 7528664
11015 7528664 7711862 8034044 7959486 8220638 8040810 8244278 8280957 8490800 8504287 8477178
11005 8477178 8645753 8756632 8931423 9025824 9393433 9338961 9716854 9819975 10127995 10244600
10995 10244600 10488184 10813932 11067492 11041743 11534397 11695107 11633689 11815271 12095577 12238393
10985 12238393 11970880 12290078 12460256 12569769 12876996 12948552 12981624 13667967 13823774 14059249
10975 14059249 14455284 14404657 14832050 14799718 14907971 14894810 15011171 15400720 15380192 15871078
10965 15871078 16292310 16520279 16896755 17222304 17340912 17510092 17922293 18080581 18581234
10956 18581234 19042392 19064055 19188424 19580802 20264377 20651834 20890917 21325947 21857438
10947 21857438 22425567 22618125 22947181 23225514 23592548 23978008 24158936 24792464 25224540
10938 25224540 25709319 26131379 26637346 27152540 27661225 27898190 28618067 29069950 29490805
10929 29490805 30058274 30667960 31251450 31724029 32557386 33100432 34008237 34658021 35311218
10920 35311218 36140049 36980316 37742265 38526405 38811313 39066582 39276019 39476209 39476101 39554766
10910 39554766 39679943 39952979 39890964 40059421 40023935 40099651 39933307 39690489 39662700 39817671
10900 39817671 39922645 40092851 39953757 40337244 40401098 40371206 40660637 40987147 41137445 41238887
10890 41238887 41681837 42246050 42450083 43170240 43781711 44588533 45236924 46055122 47020694
10881 47020694 48204903 49735871 50921571 52793189 54768681 56862410 59135721 62050304
10873 62050304 65042964 68507425 71763877 75514170 78831073 82610772 85794209 88288055
10865 88288055 90537159 92261966 92713525 92634664 92048908 90500072 88525345 85927031 83009115
10856 83009115 79847297 76473309 72876121 69545907 65806757 62440479 59076029 55868628
10848 55868628 52661425 49661063 46835775 44122651 41843816 39333813 37051191 34328596
10840 34328596 32767032 30688595 29026662 27283676 25765400 24567709 23150391 21876538
10832 21876538 20761416 19519076 18920018 17854255 16822769 16432334 15643086 14896160 13977703
10823 13977703 13571248 13047028 12308827 11977490 11456447 10935025 10544851 10433166 9996790
10814 9996790 9872139 10062649 9522203 9524642 9298117 9160296 8953447 8832790 8508666 8255424
10804 8255424 7878055 7681914 7412809 7093208 7057450 6855920 6317019 5991237 6150006 5980963
10794 5980963 5464898 5434232 5430402 5385803 5438664 5282027 4914121 4974392 4849429 4844659 4778205
10783 4778205 4731522 4710222 4735273 4442261 4482438 4527043 4355732 4178784 4384207 4128017
10773 4128017 4097890 4000358 3920657 3844769 3808499 3860293 3818123 3744909 3625691 3788786 3413386
10762 3413386 3446685 3463166 3562293 3646268 3426098 3588754 3421050 3465519 3564927 3631581 3511846
10751 3511846 3450735 3561420 3734566 3531077 3574110 3777683 3667499 3431887 3274504 3263314
10741 3263314 2970306 3044501 3056094 3105097 2868088 2962732 3145919 3054627 2825559 2843008
10731 2843008 3149115 3081566 3219162 3064054 3304051 3326366 3454122 3224803 3362884 3088382
10721 3088382 2968399 3168974 3036234 3107733 2998012 3008863 2960972 2895844 3012340 3058257
10711 3058257 3005685 2765421 3100069 3130018 3224555 3096969 3357389 3195415 3239366 3218009
10701 3218009 3194706 3305589 3358582 2861685 3201535 3037165 3099221 3190436 2745185 2838185
10691 2838185 2791627 2911781 2798858 2952017 3039652 2889419 2878977 2980317 3124542 2882911
10681 2882911 3137121 2720201 2876836 2839725 2617584 2743151 2717606 2865120 2662650 2826185
10671 2826185 2923885 2737587 2579533 2572340 2576136 2544407 2468635 2617629 2386837 2675275 2304463
10660 2304463 2312906 2293407 2319056 2366040 2300170 2144147 2202641 2414203 2217387 2347478 2266000
10649 2266000 2392665 2236504 2394699 2231014 2312650 2243803 2232165 2135753 2120655 2247478
10639 2247478 1998973 2032371 2146560 2059300 1904187 2063286 1794983 1901199 1744348 1846831
10629 1846831 1768542 1770674 2019960 2007281 1850219 1926762 1904733 1983913 2042178 1893563 1734267
10618 1734267 1731362 1894105 1794669 1686803 1796315 1902997 1763749 1999957 1743410 1801925
10608 1801925 1801305 2004671 1927227 1879077 1811489 1918050 1978957 1738455 1776106 1855413 1762225
10597 1762225 1841244 2171473 1967270 1872200 1881297 1793215 1887894 1534426 1871558 1781776 1866199
10586 1866199 1828798 1579819 2018793 1992861 2009478 2169374 1852320 2082468 2043589 2133996
10576 2133996 1835999 1970745 1909513 1808841 1905395 1850745 1751428 1664109 1557963 1857371
10566 1857371 1644967 1398001 1848504 1636192 1633179 1531197 1721641 1534513 1549346 1569895
10556 1569895 1420997 1345230 1275424 1453898 1650517 1337221 1391581 1465147 1454371 1380124
10546 1380124 1239498 1438949 1466012 1257070 1573090 1621558 1295812 1405453 1565388 1470778
10536 1470778 1439998 1372958 1594400 1538044 1418638 1423556 1636909 1433700 1563568 1651840
10526 1651840 1533232 1523583 1646365 1734838 1649153 1662981 1669034 1784250 1946280 1948182 2021194
10515 2021194 2491763 2398927 2381248 2493655 2670487 2581448 2196320 2001353 1873961 1848333
10505 1848333 1765075 1868497 1638155 1840321 1880459 1640222 1961291 1795977 1822240 2072618
10495 2072618 2179419 1690613 2024384 1911661 1897121 1986379 2151638 2430086 2368776 2617290
10485 2617290 2651123 2437706 2925812 2684444 2424714 2350921 2229861 2022929 1991336 1902552
10475 1902552 2240186 1908613 2078845 2037304 2324228 2147680 2162412 2061642 2059960 2456486
10465 2456486 2315743 2496136 2268834 2418592 2805387 2670052 2885508 2993606 2582316
10456 2582316 2735629 2658955 2835584 2942838 2639123 2705557 2981510 3272994 2966969 3224319
10446 3224319 2636247 2823922 2515000 2664644 2366189 2307801 2518404 2299347 2429034 2622598
10436 2622598 2756133 3023591 3228689 3355810 3370023 3709761 3603493 3366880 2981135 2716706
10426 2716706 2555641 2294043 2300267 2400637 2016861 2096283 2132306 2384702 2326813 2239071
10416 2239071 2054133 2091894 2208959 2214373 2434348 2333613 2257153 2532266 2760574 3240660
10406 3240660 3475728 3638312 4033280 4388723 4520995 4574764 4286061 4388541 4545366 4419518
10396 4419518 4445415 4780990 4858106 5159291 5704753 5996074 6497069 6610375 7115194 7245470
10386 7245470 7038867 7174083 7325314 7137794 6943909 6430587 6362077 6223118 6101422 6027908
10376 6027908 5892623 5978608 5839910 5912389 5800985 6181158 6051879 6084823 6128229 6104392
10366 6104392 6262892 6674457 6939004 6890454 6935187 6946798 6752289 6345030 6297054 6368959
10356 6368959 5894056 5990998 5289221 5610400 5439088 5233323 5201066 4988894 4877516 4799110
10346 4799110 4916352 4676880 4401583 4550588 4459204 4228147 4314894 4284195 4172111 4190683
10336 4190683 4440604 4523075 4535278 4416755 4681725 4577055 4599546 4861235 4497732 4369099
10326 4369099 4273288 4312801 4188392 4319100 4252210 4344931 4585100 4373115 4460946 4500254
10316 4500254 4422454 4344429 4432858 4147309 4388861 4562045 4549963 4549934 4735438 4731570 4977319
10305 4977319 5059080 5078670 5334158 5222310 5251853 5119469 5452448 4954167 5098333 4560398
10295 4560398 4859477 4971433 4880684 5139827 5219100 5327554 5448356 5385395 5601306 5943039
10285 5943039 5945878 6375881 6344917 7060120 7320349 7773674 7960186 8655673 9033625 9415547
10275 9415547 9601921 10084666 10036376 10642183 10543269 10812016 11279425 11543265 11724050 12056958
10265 12056958 12388337 13096498 13309820 13266580 13817948 14249949 14538606 14954553 15486105
10256 15486105 15954059 16301045 17067534 17418401 18084318 18620003 18795248 19303912 19211749
10247 19211749 19322118 19488921 19254264 19197528 19167777 19474111 19551349 19737929 20091736 20428211
10237 20428211 20368166 20285435 20345474 20074113 19617994 18997361 18262878 18055845 17631781 17193686
10227 17193686 16579066 16233630 16243863 15743321 15618981 15319325 15167516 14560654 14408663
10218 14408663 14024888 13550486 13383386 13108225 12985242 12654078 12430928 12395323 12077674
10209 12077674 12089528 11952841 11470903 11078921 10881667 10442994 10008420 9430819 9131695
10200 9131695 8585188 8347148 7894159 7580476 7345256 7015271 6921121 6406843 6297248 6214472
10190 6214472 5830104 5514621 5625309 5126082 5174434 5101098 5026852 4670152 4623321 4575710
10180 4575710 4574739 4500164 4335426 4348403 4222327 4093380 4118326 4201816 4137554 4060143 4071760
10169 4071760 3894576 3859945 3564553 3590123 3730897 3575490 3645482 3332800 3539590 3584304
10159 3584304 3366040 3376892 3275118 3169235 3154336 3336558 2951025 3227901 3237161 3299301
10149 3299301 2936345 3148744 3265609 3023854 3159339 3175482 3057343 2965476 3037298 3016915
10139 3016915 3012585 3199910 2946389 3031957 2827140 3021541 2723891 2689994 2912041 2974285
10129 2974285 2810106 2921603 2700253 2715457 2727389 2710513 2701782 2737352 2472241 2793414
10119 2793414 2424570 2696302 2606435 2558864 2691952 2550023 2488908 2623268 2539727 2704337
10109 2704337 2574595 2515017 2700857 2519769 2646434 2521379 2592596 2582429 2612516 2839103
10099 2839103 2690221 2915927 2942396 2831407 2901198 2870132 2781065 2890099 2689144 2858578
10089 2858578 2659131 2634679 2692517 2881256 2554339 2727969 2637275 2651619 2597327 2697873
10079 2697873 2689667 2509217 2210912 2405537 2589744 2603532 2592321 2482391 2550783 2510285
10069 2510285 2543751 2532462 2585362 2556979 2655242 2713440 2467040 2360911 2680922 2774172 2612895
10058 2612895 2604534 2505917 2832796 2775173 2946125 2568272 2708699 2709731 2726370 2595245 2400761
10047 2400761 2727739 2610883 2530029 2601594 2453954 2548482 2501102 2387331 2401592 2509339
10037 2509339 2229899 2410523 2133067 2386198 2261949 2139687 2220463 2276981 2245669 2374083
10027 2374083 2116773 1888775 2177844 2004352 1885061 2231188 2133432 2082951 2092776 2288450
10017 2288450 2219846 2035743 1734508 1870142 2107530 2124602 1697418 2047550 1879130 1850479
10007 1850479 1908145 2109190 2080359 1922196 2037242 1943962 1917419 2015725 1908240 1715775
9997 1715775 1970637 1972716 1798012 1972443 1864655 1694610 1735133 1683063 1871470 1841222
9987 1841222 1663738 1790001 1871471 1606976 1835101 1848694 1382266 1596806 1602854 1554641
9977 1554641 1471910 1380663 1333864 1564194 1596843 1585799 1632267 1311818 1421127 1476218 1373931
9966 1373931 1304338 1442526 1414215 1142693 1369716 1115564 1050439 1402827 1366945 1143590
9956 1143590 1276641 1126326 1365996 1386434 1328230 1035013 1128190 1210759 1224859 1037030
9946 1037030 1165763 1119591 1059261 998050 1187831 1026227 990720 1080877 875429 872666 953195
9935 953195 1005610 800689 875643 1081536 1018921 1184898 1135012 939543 1075949 844482
9925 844482 973892 973172 974988 1141263 1026676 950602 1112062 1034077 1005474 1156793 1008007
9914 1008007 1222471 1167062 1030867 904763 1297227 804291 984659 964105 1097604 1198998
9904 1198998 1091731 1160748 1025153 991811 886604 1081679 1063814 1213201 817689 974501
9894 974501 1018048 997485 919810 924320 952439 608573 923257 1113274 1077057 836061 980147
9883 980147 1043206 1243435 855761 1099592 919451 764307 888451 1094595 1000137 813652
9873 813652 826871 761774 961419 803412 873169 741430 911950 807200 1152340 810976
9863 810976 1104185 1015226 908257 958414 980769 791802 807697 884785 862378 1044777 1066892
9852 1066892 958719 878444 1044374 910237 855868 698309 902749 779917 723392 801814
9842 801814 908204 790520 864010 1155818 866809 863940 923286 826158 916171 692162 1002204
9831 1002204 935711 949811 986405 976540 905346 725745 908103 984186 802281 846204 822543
9820 822543 734197 777260 870133 818617 811579 710348 807654 611705 817009 1021203 943090
9809 943090 885734 913456 779988 743419 921447 971126 817901 812304 714790 834704 1003876
9798 1003876 814869 710146 817008 1066435 531094 736995 489892 811922 560843 867118
9788 867118 713066 652044 606907 889365 778228 829465 743817 959012 804913 614712
9778 614712 967725 678729 647486 928956 876768 582697 744154 586444 622386 807764
9768 807764 671020 752366 798667 637337 609611 679072 525616 685163 633212 676373 794778
9757 794778 468634 750127 487697 557989 667344 481520 415094 724264 560320 773515
9747 773515 486037 600831 576714 605513 765570 532188 694375 290934 676142 680343
9737 680343 411175 624169 508981 533561 294288 354065 500966 560210 567071 670225 590566
9726 590566 406541 493175 725012 327509 273086 669998 656483 434616 473792 551864 395896
9715 395896 546134 545322 453517 580128 481841 448624 211036 419574 398635 331493 290577
9704 290577 395215 548089 377017 539249 425001 413528 219541 607813 352978 285118
9694 285118 358182 347168 391494 497741 529136 341412 86820 531306 470452 624444 614237
9683 614237 358008 386877 415948 591726 285712 331168 512286 602921 290761 396746
9673 396746 420493 235564 294287 276378 365322 431951 549111 229299 389123 281187 223395
9662 223395 473023 282083 403664 286947 273869 450444 374035 408675 430285 512762 239653
9650 446915 324406 392861 259689 412489 320791 435995 543927 464574 288605 299251
9640 299251 584807 87690 338415 342884 210826 301258 348797 244133 544043 404108 434818
9629 434818 428147 321089 259310 234676 136075 428095 361502 452698 358099 371628 267888
9618 267888 352908 697899 415243 585058 651914 534635 427864 394123 221959 558895
9608 558895 663148 305438 648744 350905 250703 498284 346657 551390 472103 644001
9598 644001 468133 481530 231235 277287 625464 350754 548156 525372 355785 536851
9588 536851 291064 392700 497611 497943 509732 118858 541242 539261 449248 340924 545376
9577 545376 330691 436924 552481 510189 393096 495593 296469 270522 334841 557453
9567 557453 450554 216986 565787 534821 239353 424043 356278 289696 558106 361047
9557 361047 377392 571655 270128 300203 359261 299017 450503 651905 157613 255983 319566
9546 319566 262236 157277 363501 460815 127173 464938 297148 331946 358815 356607 244260
9535 244260 255577 167444 389479 328202 517543 335824 552775 459812 437910 468267 355624
9524 355624 248801 364984 374221 196378 223558 258434 440970 413840 337976 320213 375827
9513 375827 347956 331187 165583 173619 387661 270705 335998 288112 338323 357959 130468
9501 290932 273775 538892 374071 164425 544012 238271 413308 314832 254972 97479
9490 403340 195973 428792 329170 113719 465062 191007 229439 108706 173608 10532
9479 179838 229173 263624 151439 216284 337728 289959 323329 240158 323200 301419 227303
9468 227303 166282 122510 399941 165648 421647 272829 390249 413865 411686 194365 309826
9457 309826 309413 410350 151390 85781 216831 266498 304327 145091 435353 525480 319847
9446 319847 321935 141623 119659 224796 312861 412249 176031 46981 327216 118844 81560
9435 81560 173330 264765 187707 434069 310751 460383 97195 96891 415101 351078 241179
9424 241179 122859 44426 357195 283896 181833 288777 237823 298943 323882 150318 50769
9412 232764 367282 214150 413141 307400 33606 244258 391824 215370 515788 91344
9401 300874 149372 314994 418187 270041 131738 304465 50535 126229 336691 143431
9390 52823 291977 217835 420632 222588 207358 326123 -50029 310048 270028 219718 234391
9379 234391 9919 178518 200299 292766 169027 137355 375081 362915 305542 76560 146362
9368 146362 150777 463868 197132 245112 254563 231636 162659 293482 223888 23947 176176
9357 176176 212307 250120 222438 248107 264665 141514 448997 313102 142053 282066 274833
9346 274833 188098 129682 318208 465988 252617 183038 105623 284536 165634 197942 148493
9335 148493 171829 338196 543245 126821 266947 128420 70848 328687 131358 296686
9325 296686 386045 240758 234166 170560 251418 65237 140029 387525 86050 508963 229595
9313 305604 41337 25122 163737 173960 271232 119660 377271 340108 263964 286960 323428
9302 323428 157956 -44857 316899 269485 156906 272754 366019 346532 298083 181657 235116
9291 235116 307594 421705 271435 343339 96376 149680 75113 9851 23723 331651 -32571
9279 262353 223388 134756 115168 103546 114419 94987 166250 116448 58977 184526 239003
9268 239003 124767 287807 333944 153248 287517 226872 67576 111961 168230 275348 13405
9256 87651 379629 371696 237046 110708 89398 397288 77154 134191 253899 276887 281370
9245 281370 200388 -34902 180389 375779 70615 196612 321608 318054 294817 61232 329609
9234 329609 -27610 4629 202752 265284 255792 271259 213920 163832 180261 74704 186850 -29554
9221 191786 129577 168048 283474 363050 313276 80566 115064 249010 257701 260604 174302 313852
9209 313852 290963 263451 -32789 65182 346132 363164 294153 648751 378600 -43992 119795
9197 146712 355215 131268 262111 96045 319492 187995 465440 188541 423804 128868
9186 250838 153155 400385 77945 323785 230188 55062 -32900 156203 45335 215704 -13418
9174 208412 195857 184424 217975 48604 113399 124925 318644 102398 244069 300289 -40595
9162 416946 -131868 131331 284837 384453 334252 536999 283671 197439 207503 190350 167880
9151 167880 12161 199980 91116 98591 134113 288443 187449 348142 67643 -8818 298254
9139 97345 429747 129856 112903 400413 227321 252524 -82111 61911 154841 415306 340159
9128 340159 56775 179514 228432 300128 224543 325995 352109 245013 170667 -30664 -72556
9117 -72556 345663 -4946 216035 386782 306414 350000 126127 262459 344368 208939 181483
9106 181483 294085 87809 52889 286979 160872 345107 260982 262197 269807 293875 284291
9095 284291 261597 398866 354822 246379 273873 17380 254293 144525 462814 162494
9084 376743 124691 103175 127511 176768 399675 207401 299037 446163 312480 207286
9074 207286 306079 184125 252065 112193 272231 209346 117517 96020 264438 285635 297214
9063 297214 218248 297814 296699 286086 389992 136905 391488 399806 161511 303732 201505
9052 201505 220155 252251 389688 385074 235297 314369 66741 305087 111430 260595 131767
9041 131767 268520 106207 79039 328401 220576 369587 263429 353191 35158 93122
9031 93122 161262 414972 255341 363976 109016 341351 184009 -75286 379670 121053
9020 316929 162282 265903 219477 315945 339251 291968 137180 153004 329991 52213 -84559
9008 46733 396837 256631 88559 152651 -164021 204648 314553 246265 262665 137262 274791
8997 274791 481774 -211410 160350 177642 153412 53333 113561 65148 148208 174543 457207
8986 457207 198260 222042 32124 75396 80777 359579 204993 14656 209122 -64501 328736
8974 17987 -26982 126722 -13373 386260 298061 160389 102428 172022 175683 35229 133817
8963 133817 249671 287746 274411 472558 236574 320201 144621 505701 177000 25473
8952 269598 309870 12851 -65034 314608 238108 39377 221374 395045 -2147 232531 214716
8941 214716 53444 186512 270525 218162 178360 322216 361591 139020 177637 278090 90308
8929 17142 334889 167158 144292 329459 241743 272096 259667 246618 390479 83631 413867
8918 413867 329226 492838 156652 301837 321610 195232 249682 389074 140048 337646
8908 337646 406679 302555 106447 234097 244170 371899 447690 336713 209448 388582
8898 388582 260827 428780 540905 385486 394940 208052 378778 349120 366225 266336 473001
8887 473001 559119 235811 401042 235059 631492 749878 515391 510009 289860 361174
8877 361174 524806 354670 538688 511661 429133 423321 480408 325914 414560 310631 401092
8866 401092 255559 447649 529113 258991 507699 301463 516835 383017 427658 405187
8856 405187 240634 192566 128761 248477 316871 174154 83223 407577 267489 307741 392428
8845 392428 133496 299788 328604 321409 450071 24821 344360 385698 199597 248562 207478
8834 207478 270449 388591 201334 380934 70088 188958 185970 307785 177986 119304 296483
8823 296483 130290 277890 226330 216960 174655 273350 313429 262985 296136 308192 314012 92012
8810 175236 208245 10870 52557 3003 130034 153604 217702 322051 266931 98545 296511
8799 296511 102181 152098 365801 201629 317484 35048 363732 105797 194840 -107776
8788 297370 333583 406067 198878 430982 172939 15306 75080 197051 231710 151008 92046
8777 92046 162454 297645 169499 -3501 297840 139824 177139 89094 271712 354599 -78380
8765 219488 209929 249919 259218 151699 290309 282011 -111408 118304 328788 67379 158472
8754 158472 105248 217224 171054 -152489 188332 230574 32869 233209 354486 276180 246704
8743 246704 154615 91945 45025 195771 205379 252942 73958 94323 109516 181890 224385 331719
8731 331719 -35618 97252 36094 79409 382758 364787 332822 154004 100655 236798 57944
8719 166227 97643 189039 78350 187434 72044 73253 -28173 51151 211236 132631 7008 74918
8707 74918 32141 149948 223761 160958 129562 181390 67782 60552 325396 96236 312348
8696 312348 -14164 169745 -114425 188107 296106 194750 20587 155253 21057 156644
8686 156644 116078 224821 72059 79732 -2899 245807 345551 53579 291148 27264 277330
8675 277330 177445 333523 279567 153373 -26801 85779 184882 138486 273817 83922 158380
8664 158380 134068 174065 56632 8234 159570 49480 67519 7928 -16262 216371 61829 28176
8651 -23381 178923 -92522 182570 74560 221412 12143 36209 227278 65279 -73627 11333
8639 75177 254974 -17296 311215 111821 316023 124554 247306 254546 165524 71860 295833
8628 295833 165495 486191 385989 -223854 115289 18487 -43816 200827 4234 166279
8618 166279 -9395 1815 172295 123372 -103939 143924 152768 63104 65428 196312 176997 36753
8605 278610 227733 254598 46234 65390 -48156 26338 232558 209984 218966 179032 425572
8594 425572 158449 215760 88204 100813 223848 133402 -28864 273173 303960 95248 176338
8583 176338 219306 -36292 318556 8239 121217 112617 210269 401895 209659 39442 127408
8572 127408 236597 -9583 167854 182886 197260 214056 79015 176043 182813 299454 -95884
8560 41995 105118 303627 129342 94447 284819 -89029 78570 50894 225588 138810 280367
8549 280367 379243 144410 382094 71664 334307 217503 162267 355072 207041 170429
8539 170429 432561 2749 51139 73108 -126606 246771 -61959 232268 197439 188112 65081
8527 89792 265419 340076 288752 -35971 224781 288425 22393 208235 342710 173768 4270
8515 145402 259679 153351 239440 91243 116123 57438 211259 -100799 -3068 170963 -32344
8503 309874 315537 142421 99046 334306 198951 -210012 -84829 -146652 35045 61110 301567
8492 301567 147304 91645 225813 205596 40136 76222 263212 105179 130897 -105193 125844
8480 101482 185577 28613 375149 202471 -25191 135542 248995 48494 239064 38503 -74147
8468 -57671 -135369 194576 212063 -7183 159234 67165 219795 208900 126375 241099 50008
8456 188412 58878 56016 165511 264849 235249 222892 250315 30558 100596 132489 110059 -89506
8443 245876 157816 151868 93491 107556 -237905 61721 146646 301720 259072 257401 136605
8432 136605 -40876 14934 94631 157275 275621 276732 224168 -28297 20052 158951 231307
8421 231307 134415 82298 148809 61246 317598 222037 44222 232332 184514 -25242 76502
8409 179315 409647 103121 216647 74199 2455 204011 44372 115440 366072 359067 20378
8397 91670 134667 208396 208849 227324 86465 -14627 408820 76905 293842 8840 275651 269953
8385 269953 227580 252716 304570 -49495 54127 19560 114401 121740 277640 168375 141526
8374 141526 116809 140153 -24493 -50861 -187981 178026 118153 184205 -5167 134628 26385
8362 140436 253682 218262 130499 54928 284284 291443 150567 -41265 116117 217390 232829
8351 232829 30680 19501 10498 151447 96613 151670 115835 182272 -15552 165250 384954
8340 384954 -8622 10552 175129 75516 136547 153887 235168 71916 20973 -126456 338427
8328 -130466 -24922 91275 119543 268324 40859 66670 247463 370271 -33465 103451 -129966
8316 190155 70684 320164 104248 157927 101523 87429 282191 56242 119914 148530 -25135
8304 219684 149758 148204 -68831 55322 232027 158474 83554 6841 23917 26604 39224 139271
8292 139271 184697 132048 38407 -9519 152063 50118 158884 66297 300267 207686 76248
8280 64178 160801 149867 241053 107085 194032 -3623 149575 232546 188092 91866 369692
8269 369692 240592 151300 313057 286759 65842 51384 -4584 72507 243391 -112378 -141391
8258 -141391 -87219 74732 104488 181856 -10857 114558 167184 94729 58690 260479 198722
8247 198722 389284 247752 154600 -58635 208247 -66432 212886 137310 -933 131258 6245
8235 175858 103675 51752 -13844 59718 79663 -9220 240839 -50815 85288 203724 21165
8223 59329 138268 155257 179065 243842 47322 33511 83053 -20795 24751 141259 -14036 18050
8210 83244 -52431 134024 125040 125332 148035 166868 232903 63704 58897 166883 20124 -216407
8197 113398 -18838 187247 232660 -66434 151407 80512 63151 169704 229966 209273 10857
8185 235390 237132 320232 44519 28216 -192907 83675 131734 88425 114707 96532 -17760 85478
8172 29818 -90520 259310 202100 338957 333832 63851 30603 -55344 207993 102524 -68975
8160 131485 284526 151610 62871 221835 179112 -168697 10576 291624 280879 135820
8149 108523 161173 -15364 122314 28272 99801 138276 2264 125807 199098 428118 -61298
8137 96006 28451 124969 285521 4969 28907 100700 211119 207061 173992 59900 99231 335858
8125 335858 104127 107583 297968 451793 160588 166475 -55920 253778 167415 156341 214345
8114 214345 17748 63050 162769 392094 69914 76328 59679 26813 -128996 17681 -33728
8102 4080 168839 117851 -48071 389285 37899 19941 39778 -109097 -127213 129188 -26745
8090 220318 13690 222357 23897 -11722 395011 165920 36282 58801 -70107 166542 -22136
8078 -13808 129362 -39257 222791 255446 136847 -88196 1892 -160895 -46250 99794 44098
8066 43262 160555 76150 -3635 163890 155173 -176683 70087 38113 243921 241764 39993 45300
8054 45300 182522 111915 101828 -1055 -23849 159114 -12618 -179113 188434 2234 209698
8043 209698 52718 36456 -98401 92351 152454 203496 -63791 236451 103161 82814 41992
8032 41992 237946 261513 140060 39139 171296 -34009 79793 112842 109934 143300 51175
8020 104632 152780 12783 138797 7430 127813 152902 264254 234364 16851 63539 -40224
8008 115270 -40380 308438 212961 -65443 195485 -107453 -65978 270043 -40426 -37986 48292
7996 84176 374359 203742 -88208 90369 81030 67928 19860 57694 91276 -20353 189267
7984 -216643 -43339 279303 59371 42749 276381 183697 130117 18697 4147 -67624 -159039
7973 -159039 21019 72154 136301 161681 179543 -59510 55889 -57887 19327 66932 -20168 209656
7960 118079 -51731 189601 284857 62620 209447 -120801 3244 84942 -107722 122549 173046
7949 173046 69587 -59367 85026 91409 -109638 74310 231971 -17131 120982 54590 -71836
7937 128098 38145 198687 80528 107011 14098 243196 84508 46141 152202 139355 138989
7926 138989 383824 64397 94083 251416 -191293 67699 -17961 135882 495835 174265
7915 108943 200079 -61078 99021 153637 -13562 -19942 355991 16571 310977 -32883 291852
7903 -10532 296869 77044 208681 -2472 134684 122810 46719 164608 35547 280579 53961
7891 156781 112048 125610 186249 -62294 29283 392125 44656 77499 200749 198235 224556
7880 224556 118959 116969 -71560 348961 6503 178993 -36448 151482 196222 22645 47251
7869 47251 149247 31326 171811 67048 -930 281043 -220119 72321 122076 47017 173182
7858 173182 230290 49518 -38895 44068 -198565 240433 447555 174434 -136774 262020
7847 164559 189826 76609 -42751 -657 -20771 144797 193172 281861 113615 209168 36916 8410
7834 3891 41630 126543 -46521 123343 -51439 -4446 4301 192719 122048 211146 22859 22617
7822 22617 -130078 4625 -74808 143184 171134 237608 165845 273864 -48035 98237 170536
7811 170536 -25995 -121265 5656 -60629 -94149 19420 117453 197448 244126 -140874 60452 338965
7799 338965 -172664 339625 207518 181375 256189 -37199 7314 -22291 -10303 2175 74265
7788 74265 159312 95043 -5634 226389 187780 305906 -114346 -25635 72265 193021 260190
7777 260190 -46743 -22116 84135 221835 -6169 7664 -5260 38760 -63426 106593 -109459 46194
7764 -13128 123303 164142 88743 51522 43495 -197324 -117997 241441 45884 46461 90337 64965
7752 64965 -41904 47343 -114310 43015 118066 104177 147310 31545 -127922 -8790 147848
7740 -167058 -23581 -48585 -120309 120627 -69625 55279 206222 -76521 36126 -35232 106555
7728 163808 23293 -10802 -20192 289920 8363 -65265 19409 110132 -10921 48375 189735 -52817
7715 314998 195757 59741 54664 15938 -110907 85088 -111033 -35367 141177 126674 -270138
7703 11361 -118595 323653 457118 87874 156248 210988 86784 116196 39272 33137 -23596
7691 182323 211835 461 118624 82223 155143 44331 -34007 49043 -32198 166081 -83273 149344
7678 198632 -239078 291120 57524 152337 118034 257613 88877 70397 206426 62324 22062
7666 209350 127233 -15333 -2776 129979 35430 -47461 -4417 118928 250978 -44237 -26723
7655 -26723 73834 162080 -15081 154870 -147538 68737 22065 26900 84115 121823 -61057 200155
7642 79097 10456 99740 242152 25578 -95606 163054 169415 116810 228533 86072 60074
7631 60074 132788 162566 95049 91337 72424 319695 208783 248374 65615 211458 92549
7619 223526 208303 -35554 78026 214178 143443 137785 -85573 303143 36188 54809 -226966
7607 101724 200856 -58533 265108 41030 -45425 112065 164686 255875 -123185 169562 168130
7596 168130 383175 78290 143566 79829 368546 843 42845 237762 257533 8100 193613
7585 193613 166873 142862 -121297 -72789 234952 158073 256615 154139 273569 -127554 60495
7573 64007 164661 -44287 124962 -80072 7213 145861 161693 100955 -5703 61111 130411 160578
7561 160578 19295 259738 86516 205792 137833 11138 169512 90350 47131 232980 68172
7549 300724 286446 130358 -69723 46808 147962 -4665 -90498 5196 -185626 149813 170616
7538 170616 78411 70116 134634 -17611 117511 -69636 -90170 28999 170129 -112690 65884
7526 -77659 41340 227260 111908 -39650 21810 -1191 99618 9711 192176 263680 121833
7514 -152432 18720 147400 73137 55829 230034 234078 203374 213456 -20011 185331 24698
7502 194620 -72498 -8156 89536 53185 8080 -191708 -34150 -47785 272297 147088 219812
7491 219812 236333 -212672 -100115 223994 111628 187778 58586 -17781 165946 -33544 -119493
7480 -119493 290003 -92590 163861 321004 22274 70924 -44845 210413 246 234441 87073
7468 50296 174837 -104797 188116 -39498 96304 119132 64494 -68707 -160829 -52449 -193303
7457 -193303 153682 84966 214771 -224084 128 214490 13269 -188056 49806 218660 176431
7446 176431 142642 76956 45167 53769 -44285 169019 23465 -149843 90610 91840 98421 43687
7433 273050 -13196 -24796 167780 86236 69200 35416 140553 96903 6461 -220736 69597
7421 213889 194940 81427 -93542 121448 109417 80241 9317 -77063 51033 96106 86174 109625
7409 109625 10082 -58298 -165332 -89607 -12793 210325 51636 13413 40013 -153204 154243
7397 80942 89039 127387 115904 120126 -161646 -44464 53302 -35198 209031 24863 49699 243966
7385 243966 21507 -38887 -37058 9986 -35517 109715 249265 12076 -19605 158188 -48373
7373 -43977 77159 219969 -245947 -118441 139222 319423 24739 113306 2230 -126155 2305
7361 -121373 158581 198487 -45796 121423 150746 -119890 -58419 -184681 35014 268912 13236
7349 40562 32466 71478 204217 156025 -73968 142235 52925 33960 89783 -113607 90364
7337 67153 111539 -169651 113674 172974 23435 86663 41578 -144952 174009 112546 -95481
7325 -29197 -129469 -222 41355 151469 27544 221134 84426 131300 -27859 -43456 -104010 32925
7312 1804 168190 237051 251506 14308 256759 361428 15557 15552 119546 34718 181253 138317
7300 138317 5314 79969 106266 54044 -48301 71017 166539 -12075 171712 145524 -171237
7288 174004 87598 135662 144648 -25400 123720 125323 -169884 144746 5944 97912 -4068 74901
7275 -40689 3478 322430 -11164 90234 154883 32825 -186125 49951 -39486 195693 544 182588
7263 182588 155627 77695 239597 3451 279679 182897 -33864 185008 128086 115865 123511
7252 123511 -94406 192003 48977 184097 85803 -73466 360784 -52794 74386 169567 134772
7241 134772 29864 121527 98761 94409 -5561 -16155 260420 138617 134252 120970 239655 -22770
7228 102029 42938 118703 151921 120086 -199193 71228 140611 67866 -73645 -78114 80284 37797
7215 20611 21442 -111206 77762 147718 -148620 358061 171529 216969 -127692 32593 89172
7204 89172 8425 17399 15049 78579 29116 -126520 195611 -118727 -25677 266577 143183
7193 143183 77640 297532 105961 -97334 6875 171861 -10153 23569 79903 -15570 140700
7181 30713 -128824 6305 5948 93304 131153 38840 -75361 324850 78319 232515 6255 97648
7169 97648 -142587 -148025 218571 7197 -32185 221369 61825 -44998 337683 -152712 -2993
7157 -50574 212863 91704 88026 6954 221315 -32575 161916 -77429 70178 109750 58609 23860
7144 151520 -64448 175843 199738 105180 56413 338600 94360 144001 108181 82337 42843
7133 42843 -101621 153407 -17576 213200 -22051 -159028 172417 -76606 58962 -1754 62089
7121 348046 35382 193993 137828 97165 38547 78064 14502 122015 127417 -25164 93192
7109 221670 11406 158823 -63991 50061 40516 -27354 4950 2136 -144515 283672 196178 -113284
7096 45535 -42962 208763 31185 -59564 -54420 98885 161306 23026 60780 83499 130713 -108819
7083 26614 359905 232984 54544 168889 34520 68022 9818 233170 183334 24278 201440
7072 201440 81549 7973 90606 -163216 104265 82509 42759 -3645 50896 -48194 41708 106639
7060 106639 243607 160744 -10131 118898 95555 -49036 250980 48502 -11286 -95887 384704
7048 148645 333357 475543 141674 192793 -54888 73684 246426 -61313 245689 252597 158224
7037 158224 -129002 190500 -120366 151277 8182 -111815 -7012 -123637 -6931 81437 -33825
7025 -22086 -15110 -35585 311379 171327 124928 -67755 116080 -13531 80873 187423 132649
7014 132649 14638 -130460 170379 181026 123417 86668 -184792 340609 16652 346224 -8048
7002 175722 228734 -199309 104505 35589 -165595 -68484 -89873 236457 -129210 27566 -11968
6990 46938 9759 1435 84134 38689 -183028 250958 -7689 74103 -59430 -89253 97328 140933
6978 140933 -93206 169766 62678 22867 -33898 145443 132681 -38319 21365 -122511 -10707
6966 -55155 -93854 189885 -150936 -2127 11638 -138282 8566 290885 367190 162821 89990
6955 89990 19462 -39080 -55238 180454 -5876 274400 -53345 153332 -150575 179826 -64113
6943 197894 154694 192344 86851 -2583 192772 251508 -76344 49062 60652 165227 155731 -27717
6930 -72428 85754 59996 -18418 -65374 30383 -37143 -14229 130588 55842 166476 62453
6918 118881 -80621 52585 -105084 276189 90663 72475 -120741 -53099 163995 -82272 27630
6906 58889 140290 -4806 24829 98723 7720 -80980 357312 -33519 -42813 -205013 106381 241377
6894 241377 -54914 273989 86662 21220 182357 166635 -49009 227237 109435 174096 -173818
6882 -96630 -107345 95606 -1286 120338 -97204 102599 110062 -57093 32414 -34868 -10384 134984
6869 50394 -168579 221809 168323 -32268 15102 286023 5452 -83266 -19676 75377 159371
6858 159371 51078 -67863 26074 6066 -78718 91045 -46479 -156660 38972 112170 159192 219712
6846 219712 -179896 -59523 -70210 39389 -122359 177831 191795 97213 142436 -95034 313116
6834 69759 144690 117783 286186 125087 104860 -73208 -47189 106715 234393 297790 359004
6823 359004 101466 6657 -239430 102535 -7404 75957 43219 102640 94783 140074 -222558
6811 186497 151557 -134583 -36472 -122876 41692 87899 270115 -13796 140891 73931 -44194
6799 128393 281735 56715 111509 -6192 14651 122194 228346 230269 -46334 71910 -38619
6787 -8726 -8745 -84157 182339 -32781 -150722 74805 92486 106369 129327 2634 96298 -123128
6774 138946 27750 207552 55667 -199613 -29703 343708 -18107 245564 145811 -50751 221408
6762 21247 -155213 121820 208312 -179663 346634 2362 170638 325961 315863 -81238 154267
6750 -127255 -62363 82502 76640 60142 120890 48950 -92270 90401 341893 -7027 76198 259658
6738 259658 36233 -48860 -44681 -81945 117395 32931 -108153 -23736 54864 118266 -45766
6726 134171 87151 -71450 -3181 125283 226897 33981 223857 115058 18084 -138188 133497
6714 191436 153381 -61617 120747 97861 114098 45958 104075 155589 -64981 -40780 62718
6702 -122361 68204 -84886 97222 36993 -31628 265380 171559 -165102 -71795 -101778 4724
6690 211854 -95923 -20953 5952 47410 102625 -120910 -60963 188410 -7973 38798 -59613 -115528
6678 -115528 209501 223082 69311 182905 -75050 -141 -19919 62195 -236465 28513 81184
6667 81184 31204 -63950 150076 134240 92385 -102192 67787 -50530 72138 -89812 25450
6655 5663 100921 -39562 45501 121843 -52183 22468 201808 20023 58919 450462 19136 -43949
6642 -30422 86139 51828 70947 4020 15859 7942 -23808 152958 186255 -89502 109057 -56144
6629 162012 181832 -182147 -20360 11412 -139872 211286 352220 -83788 50233 223013 -120342
6617 -32873 -8849 183696 184076 -41965 147708 234624 135178 -94274 -35993 45305 -76229 152138
6604 -51695 49201 -115083 87726 -10727 -64616 6841 109250 44256 104651 264723 3665 -131604
6591 54392 -99264 -174314 8860 156379 -32997 -83435 119094 -66829 -29033 86357 137862 -71219
6578 -96459 -107462 176793 -134623 91738 109382 -100352 -10929 95405 33337 154825 -27036
6566 -3223 12372 68932 23027 69783 -130535 518 123122 -151320 -28271 -145353 184106
6554 133613 72414 133589 249380 163689 150892 190024 108774 31751 6698 132918 137897 81698
6542 81698 -75223 -73096 103671 97661 148407 49679 118624 336581 -197498 -81470 215180
6530 149005 84614 240228 293673 11434 79666 175025 65861 158136 -46695 185206 226185
6519 226185 -73535 153843 145805 -62297 7814 -90646 -238071 52882 359333 -36 40254 255334
6507 255334 20200 114891 133214 79882 84405 71506 79909 97440 188535 174084 50290 237005
6495 237005 -39460 45846 147591 308772 101961 95641 24489 196542 128828 5739 188928
6484 188928 -78207 117918 -151827 150808 202367 298282 -96011 -158847 -67066 239256 40751
6472 -240521 34819 100407 180460 240265 32116 30075 330890 -10542 220870 120217 5771
6460 229812 -107031 225390 219738 223872 -31392 8905 35480 -43428 -58322 133357 80004 -37595
6447 -38795 71873 -90894 6839 96941 79239 250166 187241 26005 64165 -14870 134416 243283
6435 243283 147434 221244 150078 142477 -2374 20601 -135866 118621 39738 -14808 216306
6423 -53642 34415 -190901 45409 18441 192844 92570 13187 213778 201038 -25978 139842
6411 56808 49391 -45779 111443 5573 128141 48705 183500 -352695 131740 80472 -130505
6399 -148243 -8842 32370 85116 -83359 26104 63296 83752 15153 -79096 23504 -45591 -64086
6387 -64086 118104 89193 24100 32812 76236 3734 78471 -156660 -22566 130357 -35534 39188
6374 39205 173566 226219 10783 -150645 197668 112937 54002 -84677 114296 63697 132759
6363 132759 66345 243000 146682 1244 219279 64472 222858 -75121 63926 -71089 -67144
6352 -67144 91754 84998 -60027 281741 1908 136190 -23798 69926 63389 190085 -61557 158744
6339 300299 169687 41094 71158 -96279 199302 -80268 274897 -124882 -246627 -126920
6329 -126920 -24375 337720 78434 -43749 267354 119646 82106 158701 156693 -46143 -179459
6318 -179459 -26673 1947 12732 173052 1174 -108284 121663 77923 -130937 -153014 57359
6306 -214385 207403 -112461 106496 140808 -227088 -59464 -50856 170874 189752 207001 42298
6294 -27354 104180 18991 -15229 -72930 -58085 33783 76481 79471 -231927 182176 205832
6283 205832 37294 134906 -26653 -10003 -17031 -101552 -155625 122090 145408 173957 78863 122563
6271 122563 -13205 93979 934 177978 210176 24393 89405 44321 -9917 310570 127595 -95049
6258 -119866 71673 163355 70486 13671 53881 118100 367787 165063 -2531 102572 160842
6247 160842 41117 173755 42432 -31696 141561 41617 2217 1882 214102 46486 87698 158371
6235 158371 66503 299638 67726 -143937 49312 80964 223752 -19667 171307 -61002 -8289
6223 54738 4049 28227 92033 -59934 -66838 42958 -132304 110516 22806 -293220 -132850
6211 134859 -261284 93182 154129 135682 56361 70920 165513 -4855 6431 147010 76574 204305
6199 204305 58160 206545 128965 53650 -25985 60506 -57687 43600 -262497 -91460 -70385
6188 -70385 149725 165766 -106823 -51676 101476 -16179 85929 415751 25474 -21534 148582
6176 228038 58831 204751 225272 110776 -143280 73787 26483 114201 98620 -76432 4193
6164 97490 7191 -10851 -710 64107 103485 -12937 110097 -159802 280761 16623 176508 101750
6152 101750 245496 166092 -119303 -4857 306044 -83471 -103515 -135013 50066 128885 -40361
6140 103495 46042 45028 82087 -22606 -75522 -111686 90137 205243 77201 -71396 163603
6128 -84289 -105744 -7626 -141508 -203871 135211 45855 111821 -193643 144077 275416 9363
6116 -29749 125826 -64822 27020 37001 32654 87486 254515 -162168 96250 -43450 184122
6104 75303 76381 97471 -237189 -138577 32741 93399 9397 566 196396 79841 -52743 113589
6091 28481 -104843 -184810 127083 43273 78704 101291 -194464 49707 79298 237367 -7567
6079 69864 34637 106349 224176 223860 -225040 70732 -30718 -50258 95341 287219 107785
$$ [...]
##END NTUPLES=NMR SPECTRUM
##END=
