##TITLE=coffee_type TORI02-ROVE100A-95-5
COFFEE_meoh_noesyp64 COFFEE_meoh {C:\Bruker\TOPSPIN} Administrator 13
##JCAMPDX= 6.0         $$ Bruker NMR JCAMP-DX V2.0
##DATA TYPE= NMR SPECTRUM
##DATA CLASS= NTUPLES
##ORIGIN= Bruker BioSpin GmbH
##OWNER= Administrator
$$ 1.72 TOPSPIN		Version 2.1
$$ 2012-05-29 13:28:51.798 -0700  Administrator@X
$$ Compression mode = diff/dup
##.OBSERVE FREQUENCY= 400.13188235
##.OBSERVE NUCLEUS= ^1H
##.ACQUISITION MODE= SIMULTANEOUS (DQD)
##.ACQUISITION SCHEME= undefined
##.AVERAGES= 64
##.DIGITISER RES= 22
##SPECTROMETER/DATA SYSTEM= spect
##.PULSE SEQUENCE= noesygpps1d.comp
##.SOLVENT NAME= COFFEE_meoh
##.SHIFT REFERENCE= INTERNAL, COFFEE_meoh, 1, 14.98061
##AUDIT TRAIL= $$ (NUMBER, WHEN, WHO, WHERE, PROCESS, VERSION, WHAT)
$$ ##TITLE= Audit trail, TOPSPIN		Version 2.1
$$ ##JCAMPDX= 5.01
$$ ##ORIGIN= Bruker BioSpin GmbH
$$ ##OWNER= Administrator
$$ $$ Z:/data/jwist/nmr/12-COFFEE-0203/152/pdata/1/auditp.txt
$$ ##AUDIT TRAIL=  $$ (NUMBER, WHEN, WHO, WHERE, PROCESS, VERSION, WHAT)
(   1,<2012-03-03 00:54:54.943 -0500>,<Administrator>,<TOPSPIN>,<go>,<TOPSPIN 2.1>,
      <created by zg
	started at 2012-03-03 00:43:24.709 -0500,
	POWCHK enabled, PULCHK disabled,
       configuration hash MD5:
       1A 1E CE 29 27 FD 77 03 67 4E F0 E3 C4 B2 CB 90
       data hash MD5: 64K
       7C 87 63 E0 15 CD C6 68 56 F8 16 60 CE 00 F9 96>)
(   2,<2012-03-03 00:54:59.803 -0500>,<Administrator>,<TOPSPIN>,<audit>,<TOPSPIN 2.1>,
      <user comment:
       ICON-NMR User ID: Administrator
       data hash MD5: 64K
       7C 87 63 E0 15 CD C6 68 56 F8 16 60 CE 00 F9 96>)
(   3,<2012-05-29 09:24:57.706 -0700>,<Administrator>,<X>,<proc1d>,<TOPSPIN 2.1>,
      <Start of raw data processing
       efp LB = 0.3 FT_mod = 6 PKNL = 1 PHC0 = 0 PHC1 = 0 SI = 128K 
       data hash MD5: 128K
       1B E0 82 A3 C0 9F 33 A2 93 4A 26 77 74 7B 96 14>)
(   4,<2012-05-29 09:24:58.269 -0700>,<Administrator>,<X>,<proc1d>,<TOPSPIN 2.1>,
      <pk PHC0 = 38.50708 PHC1 = 0 
       data hash MD5: 128K
       7B 49 58 DA AD E8 2D 87 22 CD C2 14 2E F0 8C F7>)
(   5,<2012-05-29 09:24:59.362 -0700>,<Administrator>,<X>,<proc1d>,<TOPSPIN 2.1>,
      <abs ABSG = 1 
       data hash MD5: 128K
       88 90 0B 49 22 2C EC DF 83 4D 99 9B E3 E4 BC BD>)
(   6,<2012-05-29 09:24:59.440 -0700>,<Administrator>,<X>,<proc1d>,<TOPSPIN 2.1>,
      <abs ABSG = 2 
       data hash MD5: 128K
       48 DB 1E D3 D1 B4 42 DC FF 1E FF 7F 26 F5 35 A9>)
(   7,<2012-05-29 09:24:59.534 -0700>,<Administrator>,<X>,<proc1d>,<TOPSPIN 2.1>,
      <abs ABSG = 3 
       data hash MD5: 128K
       1F D7 34 07 F7 A8 1D 10 82 F9 03 FA 7D 15 42 EC>)
(   8,<2012-05-29 09:24:59.612 -0700>,<Administrator>,<X>,<proc1d>,<TOPSPIN 2.1>,
      <abs ABSG = 4 
       data hash MD5: 128K
       5A 9D 58 72 54 C5 35 50 AE 16 5B 7C 88 92 3E F7>)
(   9,<2012-05-29 09:24:59.690 -0700>,<Administrator>,<X>,<proc1d>,<TOPSPIN 2.1>,
      <abs ABSG = 5 
       data hash MD5: 128K
$$ [...]
150 150 150 150 150 150 150 150
##$TP07= 0
##$TPNAME0= <>
##$TPNAME1= <>
##$TPNAME2= <>
##$TPNAME3= <>
##$TPNAME4= <>
##$TPNAME5= <>
##$TPNAME6= <>
##$TPNAME7= <>
##$TPOAL= (0..7)
0.5 0.5 0.5 0.5 0.5 0.5 0.5 0.5
##$TPOFFS= (0..7)
0 0 0 0 0 0 0 0
##$TUNHIN= 0
##$TUNHOUT= 0
##$TUNXOUT= 0
##$USERA1= <user>
##$USERA2= <user>
##$USERA3= <user>
##$USERA4= <user>
##$USERA5= <user>
##$V9= 5
##$VALIST= <valist>
##$VCLIST= <CCCCCCCCCCCCCCC>
##$VD= 0
##$VDLIST= <DDDDDDDDDDDDDDD>
##$VPLIST= <PPPPPPPPPPPPPPP>
##$VTLIST= <TTTTTTTTTTTTTTT>
##$WBST= 1024
##$WBSW= 4
##$XGAIN= (0..3)
0 0 0 0
##$XL= 0
##$YL= 0
##$YMAX_a= 14912275
##$YMIN_a= -7273930
##$ZGOPTNS= <>
##$ZL1= 120
##$ZL2= 120
##$ZL3= 120
##$ZL4= 120
##$ABSF1= 14.98061
##$ABSF2= -5.57192
##$ABSG= 5
##$ABSL= 3
##$ALPHA= 0
##$AQORDER= 0
##$ASSFAC= 0
##$ASSFACI= 0
##$ASSFACX= 0
##$ASSWID= 0
##$AUNMP= <proc_prof1d_extract>
##$AXLEFT= 0
##$AXNAME= <>
##$AXNUC= <1H>
##$AXRIGHT= 0
##$AXTYPE= 0
##$AXUNIT= <>
##$AZFE= 0.1
##$AZFW= 0.1
##$BCFW= 0
##$BC_mod= 0
##$BYTORDP= 0
##$COROFFS= 0
##$CY= 15
##$DATMOD= 1
##$DC= 0
##$DFILT= <>
##$DTYPP= 0
##$F1P= 0
##$F2P= 0
##$FCOR= 0.5
##$FTSIZE= 131072
##$FT_mod= 6
##$GAMMA= 0
##$GB= 0
##$INTBC= 1
##$INTSCL= 1
##$ISEN= 128
##$LB= 0.3
##$LEV0= 0
##$LPBIN= 0
##$MAXI= 10000
##$MC2= 0
##$MEAN= 0
##$ME_mod= 0
##$MI= 0
##$NCOEF= 0
##$NC_proc= -3
##$NLEV= 6
##$NOISF1= 0
##$NOISF2= 0
##$NSP= 0
##$NTH_PI= 0
##$NZP= 0
##$OFFSET= 14.98061
##$PC= 1
##$PHC0= 38.50708
##$PHC1= 0
##$PH_mod= 1
##$PKNL= yes
##$PPARMOD= 0
##$PPDIAG= 0
##$PPIPTYP= 0
##$PPMPNUM= 2147483647
##$PPRESOL= 1
##$PSCAL= 4
##$PSIGN= 0
##$PYNMP= <proc.py>
##$REVERSE= no
##$SF= 400.13
##$SI= 131072
##$SIGF1= 0
##$SIGF2= 0
##$SINO= 400
##$SIOLD= 131072
##$SPECTYP= <>
##$SREGLST= <1H.CDCl3>
##$SSB= 0
##$STSI= 131072
##$STSR= 0
##$SW_p= 8223.68421052632
##$SYMM= 0
##$S_DEV= 0
##$TDeff= 65536
##$TDoff= 0
##$TI= <>
##$TILT= no
##$TM1= 0
##$TM2= 0
##$TOPLEV= 0
##$USERP1= <user>
##$USERP2= <user>
##$USERP3= <user>
##$USERP4= <user>
##$USERP5= <user>
##$WDW= 1
##$XDIM= 131072
##$YMAX_p= 474231269
##$YMIN_p= -212177855
##$CURPLOT= <Network HP LaserJet P1505>
##$CURPRIN= <$Network HP LaserJet P1505>
##$DFORMAT= <normdp>
##$LAYOUT= <+/1D_H.xwp>
##$LFORMAT= <normlp>
##$PFORMAT= <normpl>
##$SURQMSG= 1
$$ End of Bruker specific parameters
$$ ---------------------------------
##NTUPLES= NMR SPECTRUM
##VAR_NAME=  FREQUENCY,     SPECTRUM/REAL,   SPECTRUM/IMAG
##SYMBOL=    X,             R,               I
##VAR_TYPE=  INDEPENDENT,   DEPENDENT,       DEPENDENT
##VAR_FORM=  AFFN,          ASDF,            ASDF
##VAR_DIM=   131072,        131072,          131072
##UNITS=     HZ,            ARBITRARY UNITS, ARBITRARY UNITS
##FACTOR=    0.0627417313425165, 1,          1
##FIRST=     8223.62146879498, 1262,         -101171
##LAST=      0,             4584,            -101624
##MIN=       0,             -212177855,      0
##MAX=       8223.62146879498, 474231269,    0
$$ Real data points
##PAGE= N=1
##DATA TABLE= (X++(R..R)), XYDATA
$$ [...]
62907B819453q2043q1181p9562p7955p6351p4666p2589o9520o5625o2144n9744
$$ 2819453 2737410 2656229 2576667 2498712 2422361 2347695 2275106 2205586 2139961 2077817 2018073
62896B018073n7327n3594m8962m4646m0691l6503l2700l0366k8656k5405k0730
$$ 2018073 1960746 1907152 1858190 1813544 1772853 1736350 1703650 1673284 1644628 1619223 1598493
62885A598493j7788j8777k1633k2283j9292j4847j1767j0967j1662j2675j3006
$$ 1598493 1580705 1561928 1540295 1518012 1498720 1483873 1472106 1461139 1449477 1436802 1423796
62874A423796j2130j0427r100r145j0452j1953j2673j2516j2081j1878j1833j1653
$$ 1423796 1411666 1401239 1392139 1382994 1372542 1360589 1347916 1335400 1323319 1311441 1299608 1287955
62862A287955j1382j1380j1785j2253j2279j1701j0818j0059r525q878p883p000
$$ 1287955 1276573 1265193 1253408 1241155 1228876 1217175 1206357 1196298 1186773 1177895 1170012 1163012
62850A163012p040q061r091r235q630p862o974n729m548m188m528m542l731k727
$$ 1163012 1155972 1147911 1138820 1129585 1120955 1113093 1106119 1100390 1095842 1091654 1087126 1082584 1078853 1076126
62836A076126k177j842j395j412k572m203m755l874l101l847n389n769m380k622
$$ 1076126 1073949 1072107 1070712 1069300 1066728 1062525 1057770 1053896 1050795 1046948 1041559 1035790 1031410 1028788
62822A028788j809j660j448j587k832m504m975l852k241p88J020L161M338L893
$$ 1028788 1026979 1025319 1023871 1022284 1019452 1014948 1009973 1006121 1003880 1003092 1004112 1007273 1011611 1015504
62808A015504L062L101L358K681J628J504J895J294j00l45J152K516K174J054
$$ 1015504 1018566 1021667 1025025 1027706 1029334 1030838 1032733 1034027 1033927 1033582 1034734 1037250 1039424 1040478
62794A040478R36J960K972L361L274K599J056q33j962j843r47J56J311K450L279
$$ 1040478 1041414 1043374 1046346 1049707 1052981 1055580 1056636 1055803 1053841 1051998 1051051 1051207 1052518 1054968 1058247
62779A058247L535L228K540J674Q51K03l84j244k568l985m675m223l425l673n187
$$ 1058247 1061782 1065010 1067550 1069224 1070075 1070278 1069894 1068650 1066082 1062097 1057422 1053199 1049774 1046101 1040914
62764A040914o374n742m041l411m402n125l926j811j166k587m161l921k110n91
$$ 1040914 1034540 1028798 1024757 1021346 1016944 1011819 1007893 1006082 1004916 1002329 998168 994247 992137 991546
62750I91546n78j527k090j589k82J372L123M591N244N137N282O739R512J2691
$$ 991546 990968 989441 987351 985762 985480 986852 989975 994566 999810 1004947 1010229 1016968 1026480 1039171
62736A039171J5381J7040J7376J6823J6889J9038K2988K6859K9246L0511L1843
$$ 1039171 1054552 1071592 1088968 1105791 1122680 1141718 1164706 1191565 1220811 1251322 1283165
62725A283165L3852L6538L9924M3948M8058N1611N4771N8553O3768P0077P6294
$$ 1283165 1317017 1353555 1393479 1437427 1485485 1537096 1591867 1650420 1714188 1784265 1860559
62714A860559Q1557Q5967Q9859R2898R4594R5402R6183R6182R2895Q5002P4371
$$ 1860559 1942116 2028083 2117942 2210840 2305434 2400836 2497019 2593201 2686096 2771098 2845469
62703B845469O3822N3574M1590K7055J1687k557j5451k7713l9638n1014o1352
$$ 2845469 2909291 2962865 3004455 3031510 3043197 3040640 3025189 2997476 2957838 2906824 2845472
62692B845472o9772p5725q0013q3896q7062q8052q6958q5911q5959q5419q2566
$$ 2845472 2775700 2699975 2619962 2536066 2449004 2360952 2273994 2188083 2102124 2016705 1934139
62681A934139p8370p4877p2132o8642o4128n9880n6573n3514n0036m6246m2304
$$ 1934139 1855769 1780892 1708760 1640118 1575990 1516110 1459537 1406023 1355987 1309741 1267437
62670A267437l8149l4211l1310k9467k7569k4511k0334j6133j3176j1889j1352
$$ 1267437 1229288 1195077 1163767 1134300 1106731 1082220 1061886 1045753 1032577 1020688 1009336
62659A009336j0088p733n431m141l248j503J207M019O438Q484R961J0751J1763
$$ 1009336 999248 991515 986084 981943 978695 977192 978399 982418 988856 997340 1007301 1018052 1029815
62646A029815J4430J9026K4195K8328L0936L2658L4543L7310M0957M5059M9445
$$ 1029815 1044245 1063271 1087466 1115794 1146730 1179388 1213931 1251241 1292198 1337257 1386702
62635A386702N4225N9086O3443O7345P1265P4627P6011P5590P5635P7101P7286
$$ 1386702 1440927 1500013 1563456 1630801 1702066 1776693 1852704 1928294 2003929 2081030 2158316
62624B158316P2902O4306N4434M4370L2726J9215N906n670j6313k7128l7687m7095
$$ 2158316 2231218 2295524 2349958 2394328 2427054 2446269 2452175 2446505 2430192 2403064 2365377 2318282
62612B318282n5177o1711o6068o8467p0185p1688p2176p1663p1666p2629p2501
$$ 2318282 2263105 2201394 2135326 2066859 1996674 1924986 1852810 1781147 1709481 1636852 1564351
62601A564351o9474o4710o0565n7363n3820m9749m6246m3557m0811l7803l5368
$$ 1564351 1494877 1430167 1369602 1312239 1258419 1208670 1162424 1118867 1078056 1040253 1004885
62590A004885l3735l2023k9708k7453k5984k4984k3536k1190j8379j6107j5112
$$ 1004885 971150 939127 909419 881966 855982 830998 807462 786272 767893 751786 736674
62579G36674j4995j4425j2721j0757r666r186q259o963o592p628q635p772m967
$$ 736674 721679 707254 694533 683776 674110 664924 656665 649702 643110 635482 626847 619075 614108
62566F14108k133j262k376l474k752p64L40j99o53P40L303N039N259M799M301
$$ 614108 611975 610713 608337 604863 602111 601347 601687 601488 600835 601575 604878 609917 615176 619975 624276
62551F24276L929M408O459R110J0310R772R634J1562J4549J6492J6858J6701J7013
$$ 624276 628205 632613 639072 648182 658492 668264 677898 689460 704009 720501 737359 754060 771073
62538G71073J8218K0735K4647K9011L2438L4498L5914L7447L9323M1673M4712
$$ 771073 789291 810026 834673 863684 896122 930620 966534 1003981 1043304 1084977 1129689
62527A129689M8124N0848N1874N1125M9307M6961M3847L9381L3534K7053K0594
$$ 1129689 1177813 1228661 1280535 1331660 1380967 1427928 1471775 1511156 1544690 1571743 1592337
62516A592337J3954O531j579r433j6280k2154k7247l1256l3817l5219l6210l7236
$$ 1592337 1606291 1612822 1611243 1601810 1585530 1563376 1536129 1504873 1471056 1435837 1399627 1362391
62504A362391l8171l8659l8435l7498l6233l5168l4389l3438l2015l0409k8966
$$ 1362391 1324220 1285561 1247126 1209628 1173395 1138227 1103838 1070400 1038385 1007976 979010
62493I79010k7534k5962k4680k4110k3644k2159j9611j7318j6349j6278j5984
$$ 979010 951476 925514 900834 876724 853080 830921 811310 793992 777643 761365 745381
62482G45381j5014j3657j2222j0950j0273j0259r885p789m058n73R20O63L97J316
$$ 745381 730367 716710 704488 693538 683265 673006 663121 655332 651274 650701 651621 652284 652681 653997
62468F53997L146N062O789Q513J0053J0714J0115R000Q861J0577J3581J6625J9144
$$ 653997 657143 662205 668994 677507 687560 698274 708389 717389 726250 736827 750408 767033 786177
62455G86177K1436K3689K5635K7433K9978L3623L7207L9274L9930M0521M1665
$$ 786177 807613 831302 856937 884370 914348 947971 985178 1024452 1064382 1104903 1146568
62444A146568M2658M2825M2253M0995L8585L4899L0434K5261J8717J0858L261
$$ 1146568 1189226 1232051 1274304 1315299 1353884 1388783 1419217 1444478 1463195 1474053 1477314
62433A477314k662p417j2384j7706k2391k5992k8785l0626l1076l0746l1024l2067
$$ 1477314 1474652 1467235 1454851 1437145 1414754 1388762 1359977 1329351 1298275 1267529 1236505 1204438
62421A204438l2378l0945k8654k6779k5144k2788j9761j7161j5639j4807j4136
$$ 1204438 1172060 1141115 1112461 1085682 1060538 1037750 1017989 1000828 985189 970382 956246
62410I56246j3707j3730j3792j2906j0401o763l498j859j682j656o75J347L766
$$ 956246 942539 928809 915017 902111 891710 884947 881449 879590 877908 876252 875577 876924 880690
62397H80690N739O615O482O411P445R162J0058R606R130J0013J1808J2787J1906
$$ 880690 886429 893044 899526 905937 913382 922544 932602 942208 951338 961351 973159 985946 997852
62384I97852R578O857M456K357q8l445p302j0490j2391j3573j4808j6201j7519
$$ 997852 1007430 1014287 1018743 1021100 1021012 1017567 1010265 999775 987384 973811 959003 942802 925283
62371I25283j8573j8725j7127j4228j2041j1748j2004j0949r023q052q176p769
$$ 925283 906710 887985 870858 856630 844589 832841 820837 809888 800865 792813 784637 776868
62359G76868o278m938m288l059m87K182L705M828O718Q688R161Q286P874Q995
$$ 776868 770590 765652 761364 758305 757818 760000 763705 768533 775251 783939 793100 801386 809260 818255
62345H18255J0962J2708J3825J4183J3582J2160J0432Q697P033N811N490N741
$$ 818255 829217 841925 855750 869933 883515 895675 906107 914804 921837 927648 933138 938879
62333I38879N534M240K106l38k619l962l741k688k638m130n068l018J501N315
$$ 938879 944413 948653 950759 950421 947802 943840 940099 937411 934773 930643 925575 922557 924058 929373
62319I29373O333N837O504R241J2941J6559K0132K3802K7150K9964L2855L6544
$$ 929373 935706 941543 948047 957288 970229 986788 1006920 1030722 1057872 1087836 1120691 1157235
62307A157235M0982M5633N0104N4232N8076O2221O7248P2277P4873P3464O9360
$$ 1157235 1198217 1243850 1293954 1348186 1406262 1468483 1535731 1608008 1682881 1756345 1825705
62296A825705O5197O1754N7536N1289M3378L4576K5063J5149N607l398j2460k1274
$$ 1825705 1890902 1952656 2010192 2061481 2104859 2139435 2164498 2179647 2185254 2181856 2169396 2148122
62284B148122k8189l2546l6172m1030m6304m9540n0151m9898m9999m9749m8401
$$ 2148122 2119933 2087387 2051215 2010185 1963881 1914341 1864190 1814292 1764293 1714544 1666143
62273A666143m6649m5322m3888m1476l8515l6223l4915l3919l2902l2272l2070
$$ 1666143 1619494 1574172 1530284 1488808 1450293 1414070 1379155 1345236 1312334 1280062 1247992
62262A247992l1423k9417k6035k1942j7759j4003j1194r468q200o697n286n035
$$ 1247992 1216569 1187152 1161117 1139175 1121416 1107413 1096219 1086751 1078551 1071854 1066568 1061533
62250A061533o183p577q069p853p676p453o656n672n400n639n318m542m851o700
$$ 1061533 1055350 1047773 1039704 1031851 1024175 1016722 1010066 1004394 998994 993355 988037 983495 978644 971944
62236I71944q158p233m463j874k22J349L350N146O047O107N864O132P787J0743
$$ 971944 963786 956553 952090 950216 949994 951343 954693 959839 965886 971993 977857 983989 991776 1002519
62222A002519J3465J4542J4540J5118J6568J7640J7727J7680J8228J9144K0412
$$ 1002519 1015984 1030526 1045066 1060184 1076752 1094392 1112119 1129799 1148027 1167171 1187583
62211A187583K2667K5703K7972K8709K9389L1785L5459L8639M1138M4721N0457
$$ 1187583 1210250 1235953 1263925 1292634 1322023 1353808 1389267 1427906 1469044 1513765 1564222
62200A564222N6908O1633O3866O5022O6664O8458O8322O4586N7605M9007L9768
$$ 1564222 1621130 1682763 1746629 1811651 1878315 1946773 2015095 2079681 2137286 2186293 2226061
62189B226061K9769J9078Q611r27r900j8894k7549l4966m0948m6015n0291n3172
$$ 2226061 2255830 2274908 2283519 2282592 2272692 2253798 2226249 2191283 2150335 2104320 2054029 2000857
62177B000857n4326n4379n4151n3507n1599m8299m4807m2289m0343l7557l3516
$$ 2000857 1946531 1892152 1838001 1784494 1732895 1684596 1639789 1597500 1557157 1519600 1486084
62166A486084k9317k5865k2842j9889j7636j6414j4996j2111q642o633o409o316
$$ 1486084 1456767 1430902 1408060 1388171 1370535 1354121 1339125 1327014 1318372 1311739 1305330 1299014
62154A299014n284l794k236k88J576J887N00m54R30M078P209R543J1201J2170
$$ 1299014 1293730 1289936 1287700 1287412 1288988 1290875 1291375 1290921 1291851 1295929 1303138 1312681 1323882 1336052
62140A336052J2707J3682J5378J6809J7469J8701K1955K6640L1116L4846L8014
$$ 1336052 1348759 1362441 1377819 1394628 1412097 1430798 1452753 1479393 1510509 1545355 1583369
62129A583369L9890L9585L8014L7192L7669L8242L7863L6268L3059K8132K3037
$$ 1583369 1623259 1662844 1700858 1738050 1775719 1813961 1851824 1888092 1921151 1949283 1972320
62118A972320J9955J9072J8647J7933J8146K0152K3154K6444L0452L5040L8455
$$ 1972320 1992275 2011347 2029994 2047927 2066073 2086225 2109379 2135823 2166275 2201315 2239770
62107B239770L9491L9292L9493L9672L8248L5009L1061K6858K2041J7007J2890
$$ 2239770 2279261 2318553 2358046 2397718 2435966 2470975 2502036 2528894 2550935 2567942 2580832
62096B580832R729O124J232m050q521j2315j6354k0735k4396k6205k5823k3738
$$ 2580832 2590561 2596685 2597917 2593867 2585346 2573031 2556677 2535942 2511546 2485341 2459518 2435780
62084B435780k0935j8451j6741j5479j4191j3035j2557j2762j2947j2485j1345
$$ 2435780 2414845 2396394 2379653 2364174 2349983 2336948 2324391 2311629 2298682 2286197 2274852
62073B274852r577p044l980j324L39J721L946O989R944J2526J5223J7922J9843
$$ 2274852 2265275 2258231 2254251 2252927 2253266 2254987 2258933 2265922 2275866 2288392 2303615 2321537 2341380
62060B341380K1139K3182K6520K9790L1576L2330L3433L5313L7475L9549M1150
$$ 2341380 2362519 2385701 2412221 2442011 2473587 2505917 2539350 2574663 2612138 2651687 2692837
62049B692837M1720M1758M3215M7072N1343N3332N3338N4075N6815O0277O3376
$$ 2692837 2734557 2776315 2819530 2866602 2917945 2971277 3024615 3078690 3135505 3195782 3259158
62038C259158O6696P0692P4595P7990Q1616Q5604Q8571Q9574Q9471Q9244Q8467
$$ 3259158 3325854 3396546 3471141 3549131 3630747 3716351 3804922 3894496 3983967 4073211 4161678
62027D161678Q6886Q6044Q7526R0490R2652R3202R3032R2495R0769Q7535Q3744
$$ 4161678 4248564 4334608 4422134 4512624 4605276 4698478 4791510 4884005 4974774 5062309 5146053
62016E146053Q0307P7205P4432P2874P3480P5901P8412P9213P7799P5308P3442
$$ 5146053 5226360 5303565 5377997 5450871 5524351 5600252 5678664 5757877 5835676 5910984 5984426
62005E984426P2820P2431P0784O7442O3282N9524N6724N4434N1693M8164M4770
$$ 5984426 6057246 6129677 6200461 6267903 6331185 6390709 6447433 6501867 6553560 6601724 6646494
61994F646494M2791M2179M1405L9258L6089L3010L0579K8805K7699K7015K6009
$$ 6646494 6689285 6731464 6772869 6812127 6848216 6881226 6911805 6940610 6968309 6995324 7021333
61983G021333K4332K2971K3342K5542K7972K8747K7214K4231K1315J9242J7338
$$ 7021333 7045665 7068636 7091978 7117520 7145492 7174239 7201453 7225684 7246999 7266241 7283579
61972G283579J4474J0814P826O241M883K355j039l984o228q674j1679j4527j6619
$$ 7283579 7298053 7308867 7316693 7322934 7327817 7330172 7329133 7325149 7318921 7310247 7298568 7284041 7267422
61959G267422j8125j9139j9160j7892j5979j4431j3625j3064j1881r385n396k50
$$ 7267422 7249297 7230158 7210998 7193106 7177127 7162696 7149071 7136007 7124126 7114741 7109345 7109095
61947G109095N526J1379J6638K0734K3829K6843L0244L2997L3360L0679K5991
$$ 7109095 7114621 7126000 7142638 7163372 7187201 7214044 7244288 7277285 7310645 7341324 7367315
61936G367315K0875J6136J1610O839J717l463q530j3823j9596k5070k8819l0424
$$ 7367315 7388190 7404326 7415936 7422775 7424492 7421029 7412499 7398676 7379080 7354010 7325191 7294767
61924G294767l1173l2626l5122l8126m1322m4613m7568m9837n1744n3705n5511
$$ 7294767 7263594 7230968 7195846 7157720 7116398 7071785 7024217 6974380 6922636 6868931 6813420
61913F813420n6971n8648o0804o2174o1278n8804n7102n7027n6886n5071n2285
$$ 6813420 6756449 6697801 6636997 6574823 6513545 6454741 6397639 6340612 6283726 6228655 6176370
61902F176370n0253m9290m8444m7250m6131m5122m3288l9704l4532k8940k4080
$$ 6176370 6126117 6076827 6028383 5981133 5935002 5889880 5846592 5806888 5772356 5743416 5719336
61891E719336k0140j6232j1325n388O28N945J0831J6081K1923K7623L2152L5230
$$ 5719336 5699196 5682964 5671639 5666251 5666879 5672824 5683655 5699736 5721659 5749282 5781434 5816664
61879E816664L7816M1338M6048N0356N2454N2629N3252N6141O0517O4074O5629
$$ 5816664 5854480 5895818 5941866 5992222 6044676 6097305 6150557 6206698 6267215 6331289 6396918
61868F396918O6181O7538P0482P4404P8526Q3204Q9836R9386J11351J24567J38763
$$ 6396918 6463099 6530637 6601119 6675523 6754049 6837253 6927089 7026475 7137826 7262393 7401156
61857G401156J54800J73432J94581K17960K43642K71700L02000L34794L70856
$$ 7401156 7555956 7729388 7923969 8141929 8385571 8657271 8959271 9294065 9664921
61848I664921M10498M53037M97990N46363N99866O58872P21618P84811Q43831
$$ 9664921 10075419 10528456 11026446 11572809 12172675 12831547 13553165 14337976 15181807
61839A5181807Q92114R21371R23142Q90152Q16784P00122N42438L52975J46635
$$ 15181807 16073921 16995292 17918434 18808586 19625370 20325492 20867930 21220905 21367540
61830B1367540n9947k52135m19390n56058o61153p36808p86256q13035q21552
$$ 21367540 21307593 21055458 20636068 20080010 19418857 18682049 17895793 17082758 16261206
61821A6261206q17053q04018p84769p60153p31213o99538o66281o31824n96472
$$ 16261206 15444153 14640135 13855366 13095213 12364000 11664462 10998181 10366357 9769885
61812I769885n60681n24399m87047m48635m10283l73170l37614l03768k72560
$$ 9769885 9209204 8684805 8197758 7749123 7338840 6965670 6628056 6324288 6051728
61803F051728k44878k19956j95652j70671j45994j23686j04657q7967p2168n6936
$$ 6051728 5806850 5586894 5391242 5220571 5074577 4950891 4846234 4758267 4686099 4629163
61793D629163m3162l1683k2425j4948r364o020m537m021m353o257r718j3302j5841
$$ 4629163 4586001 4554318 4531893 4516945 4507581 4501561 4497024 4493003 4488650 4482393 4472675 4459373 4443532
61780D443532j7972k0802k3520k3678k0073j4280q967n258k221J447N640Q793
$$ 4443532 4425560 4404758 4381238 4357560 4337487 4323207 4314240 4308982 4306761 4308208 4313848 4322641
61768D322641R596Q568P322O122L139k946j0477j6348j9604k2009k4915k7299
$$ 4322641 4332237 4340805 4348127 4354249 4357388 4354442 4343965 4327617 4308013 4286004 4261089 4233790
61756D233790k7521k5541k2243j7597j0944k650N781J3399K0789K9283L9629N1417
$$ 4233790 4206269 4180728 4158485 4140888 4129944 4127294 4133075 4146474 4167263 4196546 4236175 4287592
61744D287592O3391P4448Q4718R5603J08357J22688J37135J50633J63433J76613
$$ 4287592 4350983 4425431 4510149 4605752 4714109 4836797 4973932 5124565 5287998 5464611
61734E464611J91130K07289K24777K43191K62730K84154L07924L33711L61237
$$ 5464611 5655741 5863030 6087807 6330998 6593728 6877882 7185806 7519517 7880754
61725G880754L91219M24834M62493N04074N50363O03087O63014P29077Q00427
$$ 7880754 8271973 8696807 9159300 9663374 10213737 10816824 11479838 12208915 13009342
61716A3009342Q78639R66452J064356J169734J279666J392772J506638J613784
$$ 13009342 13887981 14854433 15918789 17088523 18368189 19760961 21267599 22881383
61708B2881383J701222J753559J755557J692985J554886J338400J052020P13874
$$ 22881383 24582605 26336164 28091721 29784706 31339592 32677992 33730012 34443886
61700C4443886L47132k3227l72446o79520r31588j125215j263616j353318j402846
$$ 34443886 34791018 34767791 34395345 33715825 32784237 31659022 30395406 29042088 27639242
61691B7639242j421844j418857j399493j367133j324919j276262j223754j168675
$$ 27639242 26217398 24798541 23399048 22031915 20706996 19430734 18206980 17038305
61683A7038305j111555j052521r91229r27542q62571p98258p35668o74468o14669
$$ 17038305 15926750 14874229 13883000 12955458 12092887 11294629 10558961 9884493 9269824
61674I269824n57878n05846m58433m14217l72933l35879l03683k75138k49049
$$ 9269824 8711946 8206100 7747667 7333450 6960517 6624638 6320955 6045817 5796768
61665E796768k26096k07617j93140j80490j68287j57146j48133j40930j33978
$$ 5796768 5570672 5363055 5169915 4989425 4821138 4663992 4515859 4374929 4240951
61656D240951j25984j16947j08018j00465r4466q8994q3113p7134p1950o7730
$$ 4240951 4114967 3998020 3890002 3789537 3695071 3606077 3522964 3445830 3373880 3306150
61646C306150o4139o1346n9694n8434n6274n3338n1218n0635n0336m8984m6924
$$ 3306150 3242011 3180665 3120971 3062537 3006263 2952925 2901707 2851072 2800736 2751752 2704828
61635B704828m5319m4600m4475m4406m3467m0987l7997l6595l6904l6435l3751
$$ 2704828 2659509 2614909 2570434 2526028 2482561 2441574 2403577 2366982 2330078 2293643 2259892
61624B259892l0879l0047k9822k7369k3337k1144k1524k1233j7960j3502j0608
$$ 2259892 2229013 2198966 2169144 2141775 2118438 2097294 2075770 2054537 2036577 2023075 2012467
61613B012467r057o786l262K04K571L694L358J156k612o720r859j1411j1685j1497
$$ 2012467 2003410 1996624 1993362 1993566 1996137 1999831 2003189 2004345 2001733 1995013 1985154 1973743 1962058 1950561
61599A950561j1188j0179q164o332o225p377p566n733l177j387k87M71Q4k024
$$ 1950561 1939373 1929194 1921030 1914698 1908473 1901096 1893530 1887797 1884620 1883233 1882946 1883417 1883501 1881477
61585A881477m527n449m661l737l716m044l646k154j84J111J155R83K581O509
$$ 1881477 1876950 1871501 1866840 1863103 1859387 1855343 1851697 1849543 1849359 1850470 1851625 1852608 1855189 1861698
61571A861698J0983J3967J5439J6569J7461J7038J4915J2118R910Q647P684N804
$$ 1861698 1872681 1886648 1902087 1918656 1936117 1953155 1968070 1980188 1990098 1998745 2006429 2012233
61559B012233K106k777o672p969p474p337q469j0111j1641j3410j5464j6733j6303
$$ 2012233 2014339 2011562 2004890 1996921 1989447 1982110 1973641 1963530 1951889 1938479 1923015 1906282 1889979
61546A889979j4846j3960j4377j5401j6026j6082j6083j6239j6099j5270j4081
$$ 1889979 1875133 1861173 1846796 1831395 1815369 1799287 1783204 1766965 1750866 1735596 1721515
61535A721515j3064j2088j0610q770p382o719o155n240m246l190j263J982N721
$$ 1721515 1708451 1696363 1685753 1676983 1669601 1662882 1656727 1651487 1647241 1644051 1642788 1644770 1650491
61522A650491Q926J1720J4701J7570J9548K0792K2268K4414K6981L0137L4530
$$ 1650491 1659417 1671137 1685838 1703408 1722956 1743748 1766016 1790430 1817411 1847548 1882078
61511A882078M0036M5363M9277N1742N3522N5231N6922N8176N8356N7090N4647
$$ 1882078 1922114 1967477 2016754 2068496 2122018 2177249 2234171 2292347 2350703 2407793 2462440
61500B462440N1684M8713M6008M3684M1500L8927L5992L3684L2870L2995L2674
$$ 2462440 2514124 2562837 2608845 2652529 2694029 2732956 2768948 2802632 2835502 2868497 2901171
61489B901171L1427K9857K8044K4914J9826J4004R415O457L608m83n351r580j2778
$$ 2901171 2932598 2962455 2990499 3015413 3035239 3049243 3058658 3065115 3068723 3068240 3062889 3053309 3040531
61476C040531j5775j8834k0718k0212j7967j5800j4378j2646r590n505j147L362
$$ 3040531 3024756 3005922 2985204 2964992 2947025 2931225 2916847 2904201 2894611 2889106 2887959 2891321
61464B891321Q219J3256J8237K3288K8594L4194M0521M8302N7389O6510P4870
$$ 2891321 2899540 2912796 2931033 2954321 2982915 3017109 3057630 3105932 3163321 3229831 3304701
61453C304701Q3371R3458J05358J18393J32314J47397J63635J80811J99023K18303
$$ 3304701 3388072 3481530 3586888 3705281 3837595 3984992 4148627 4329438 4528461 4746764
61443D746764K38113K58170K79196L01587L23628L42150L54859L60790L58579
$$ 4746764 4984877 5243047 5522243 5823830 6147458 6489608 6844467 7205257 7563836
61434G563836L45850L20917K84284K38212J85785J30631P6324K5079k2547o6072
$$ 7563836 7909686 8230603 8514887 8753099 8938884 9069515 9145839 9170918 9148371 9082299
61424I082299j03792j33806j55952j71900j83306j90561j93647j93435j91226
$$ 9082299 8978507 8844701 8688749 8516849 8333543 8142982 7949335 7755900 7564674
61415G564674j87022j79396j67701j53663j39677j26037j11254r4982p8864o4116
$$ 7564674 7377652 7198256 7030555 6876892 6737215 6611178 6499924 6404942 6326078 6261962
61405F261962m9910l5064j9930n448Q349K1610L3481M3220N1599N9552O6136O9665
$$ 6261962 6212052 6176988 6157058 6151610 6159959 6181569 6215050 6258270 6309869 6369421 6435557 6505222
61393F505222P0545P1237P3356P6238P8531P9826Q0546Q1308Q2561Q3963Q4369
$$ 6505222 6575767 6647004 6720360 6796598 6875129 6954955 7035501 7116809 7199370 7283333 7367702
61382G367702Q3191Q1373P9912P8133P4933P1027O8002O5460O1362N5227M8644
$$ 7367702 7450893 7532266 7612178 7690311 7765244 7836271 7904273 7969733 8031095 8086322 8134966
61371H134966M2152L4048K3438J2282K882n122j3598k2937l1851l9374m5610n0816
$$ 8134966 8177118 8211166 8234604 8246886 8249768 8244646 8231048 8208111 8176260 8136886 8091276 8040460
61359H040460n4913n7673n8593n7029n3168m8390m3925l9615l4640k8927k3078
$$ 8040460 7985547 7927874 7869281 7812252 7759084 7710694 7666769 7627154 7592514 7563587 7540509
61348G540509j7453j2223q044n807n629o566p395p571p607q553j0758j3020j3431
$$ 7540509 7523056 7510833 7502789 7496982 7491353 7484787 7477392 7469821 7462214 7453661 7442903 7429883 7416452
61335G416452j1055o296K81Q674J8926L0791M4208N9340P5990R3791J13159J35030
$$ 7416452 7405397 7399101 7399382 7408056 7426982 7457773 7501981 7561321 7637311 7731102 7844261 7979291
61323G979291J59347J84834K10705K37497K65542K93585L19611L42137L59922
$$ 7979291 8138638 8323472 8534177 8771674 9037216 9330801 9650412 9992549 10352471
61314A0352471L71181L73909L66555L48039L18063K78052K30880J78954J23477
$$ 10352471 10723652 11097561 11464116 11812155 12130218 12408270 12639150 12818104 12941581
61305A2941581O6227J0649m0269q6470j29714j70608k07969k40740k68834k92133
$$ 12941581 13007808 13018457 12978188 12891718 12762004 12591396 12383427 12142687 11873853 11581720
61295A1581720l10087l22679l30755l35097l35980l33862l29571l23351l14478
$$ 11581720 11271633 10948954 10618199 10283102 9947122 9613260 9283689 8960338 8645860
61286H645860l02415k87976k72747k57437k41248k23017k02722j81655j61120
$$ 8645860 8343445 8055469 7782722 7525285 7284037 7061020 6858298 6676643 6515523
61277F515523j41311j21767j02565q4462o7944n2708l8272k4582j1773J93J1466
$$ 6515523 6374212 6252445 6149880 6065418 5997474 5944766 5906494 5881912 5870139 5870332 5881798
61266E881798K2116L2021M0628M7079N1203N4074N6810N8908N8848N6344N2810
$$ 5881798 5903914 5935935 5976563 6023642 6074845 6128919 6185729 6244637 6303485 6359829 6412639
61255F412639M9407M5991M2481L9796L8423L7175L4531L0374K5402J9581J2450
$$ 6412639 6462046 6508037 6550518 6590314 6628737 6665912 6700443 6730817 6756219 6775800 6788250
61244F788250M436l401j0712j7924k5058l1590l7532m3797n1087n8838o5609p0382
$$ 6788250 6792686 6789285 6778573 6760649 6735591 6704001 6666469 6622672 6571585 6512747 6447138 6376756
61232F376756p3395p5568p7068p6899p4527p1371o9506o8822o6876o2005n5291
$$ 6376756 6303361 6227793 6150725 6073826 5999299 5927928 5858422 5789600 5722724 5660719 5605428
61221E605428m8751m2835l6780l0480k4747k0239j7109j5339j4588j4176j3724
$$ 5605428 5556677 5513842 5477062 5446582 5421835 5401596 5384487 5369148 5354560 5340384 5326660
61210E326660j3322j2664j0973q447o666o544o941o402n344n073n399m813k539
$$ 5326660 5313338 5300674 5289701 5281254 5274588 5268044 5261103 5254701 5249357 5244284 5238885 5234072 5231533
61197E231533J113O200J3485K3252L5018M8401O3232P8872R4403J09407J23639
$$ 5231533 5232646 5238846 5252331 5275583 5310601 5359002 5422234 5501106 5595509 5704916 5828555
61186E828555J36108J45522J51454J53950J51895J42987J25696J00587O9549L4414
$$ 5828555 5964663 6110185 6261639 6415589 6567484 6710471 6836167 6936754 7006303 7040717
61176G040717l416m2289p9606j12137j37737j56840j71400j82184j88343j89940
$$ 7040717 7037301 6995012 6915406 6803269 6665532 6508692 6337292 6155108 5966765 5776825
61166E776825j89120j87544j84359j78435j71173j64868j59235j52085j42953
$$ 5776825 5587705 5400161 5215802 5037367 4866194 4701326 4542091 4390006 4247053
61157D247053j33590j24883j15825j05967r6604q8761q1760p4513o6550n7271
$$ 4247053 4113463 3988580 3872755 3766788 3670184 3581423 3499663 3425150 3358600 3301329
61147C301329m6034l3956k3896j7407j2885p832j775M102R031J2901J5292J5792
$$ 3301329 3255295 3221339 3197443 3180036 3167151 3159319 3157544 3161646 3170677 3183578 3198870 3214662
61135C214662J5089J4469J4097J2759R549N240J469j170l657p018j0856j4207
$$ 3214662 3229751 3244220 3258317 3271076 3280625 3285865 3287334 3286164 3282507 3275489 3264633 3250426
61123C250426j7441k1877k7233l1196l2700l3903l7287m1944m5061m6133m7131
$$ 3250426 3232985 3211108 3183875 3152679 3119979 3086076 3048789 3006845 2961784 2915651 2868520
61112B868520m8843m9811m9327m8820m9336m9879m9423m8672m8567m8633m8174
$$ 2868520 2819677 2769866 2720539 2671719 2622383 2572504 2523081 2474409 2425842 2377209 2329035
61101B329035m7677m7658m7269m5428m2531l9856l7976l6727l6027l5798l5684
$$ 2329035 2281358 2233700 2186431 2141003 2098472 2058616 2020640 1983913 1947886 1912088 1876404
61090A876404l5589l5880l6580l7123l7275l7286l6765l4720l1276k7987k5603
$$ 1876404 1840815 1804935 1768355 1731232 1693957 1656671 1619906 1585186 1553910 1525923 1500320
61079A500320k3040j9540j6422j5200j5077j3897j0935p425m747l219k169l32
$$ 1500320 1477280 1457740 1441318 1426118 1411041 1397144 1386209 1378784 1374037 1370818 1368649 1368317
61067A368317L156P446J0436J1337J1767J3390J5584J6674J6365J5644J5208J5398
$$ 1368317 1371473 1378919 1389355 1400692 1412459 1425849 1441433 1458107 1474472 1490116 1505324 1520722
61055A520722J6683J8715J9766J8821J7454J7857J9592K0141J8226J4663J0428
$$ 1520722 1537405 1556120 1575886 1594707 1612161 1630018 1649610 1669751 1687977 1702640 1713068
61044A713068N932K110k6j210l343o619r048r358q569q085q041q475j0337j3861
$$ 1713068 1719000 1721110 1721084 1719874 1716531 1709912 1700864 1691506 1682937 1674852 1666811 1658336 1647999 1634138
61030A634138j7215j8376j7688j7143j7654j8353j8350j7815j7284j6961j7047
$$ 1634138 1616923 1598547 1580859 1563716 1546062 1527709 1509359 1491544 1474260 1457299 1440252
61019A440252j7852j9093j9640j8600j6430j4438j3298j2522j1511j0445r624
$$ 1440252 1422400 1403307 1383667 1365067 1348637 1334199 1320901 1308379 1296868 1286423 1276799
61008A276799q419n838k123J038K262J890J371J786L270N183O419O091M519L114
$$ 1276799 1268380 1262542 1260419 1261457 1263719 1265609 1266980 1268766 1272036 1277219 1283638 1289729 1294248 1297362
60994A297362K988M044N708P675R491J0245R642Q731Q736R574J0284J0436J0359
$$ 1297362 1300350 1304394 1310102 1317777 1327268 1337513 1347155 1355886 1364622 1374196 1384480 1394916 1405275
60981A405275J0471J1170J2933J5604J8070J9539K0715K2764K5588K8109K9980
$$ 1405275 1415746 1426916 1439849 1455453 1473523 1493062 1513777 1536541 1562129 1590238 1620218
60970A620218L1780L3800L5659L7145L8570M0262M2367M4948M7709M9957N1533
$$ 1620218 1651998 1685798 1721457 1758602 1797172 1837434 1879801 1924749 1972458 2022415 2073948
60959B073948N3270N5916N9296O3197O8104P4063P9976Q5365R1627R9739J08025
$$ 2073948 2127218 2183134 2242430 2305627 2373731 2447794 2527770 2613135 2704762 2804501 2912526
60948B912526J14586J21068J30988J44527J58010J69091J79403J91042K03243
$$ 2912526 3027112 3148180 3279168 3423695 3581705 3750796 3930199 4121241 4324484
60939D324484K14403K25451K39136K56947K78160L01180L24940L49777L77281
$$ 4324484 4538887 4764338 5003474 5260421 5538581 5839761 6164701 6514478 6891759
60930F891759M08398M41820M76148N13585N59013O15177O81852P60507Q55897
$$ 6891759 7300157 7741977 8218125 8731710 9290723 9905900 10587752 11348259 12204156
60921A2204156R71260J106350J263557J452161J682695J961727K296679K694707
$$ 12204156 13175416 14281766 15545323 16997484 18680179 20641906 22938585 25633292
60913B5633292L134744L532170L748489L663609L255882K618209J903974J262169
$$ 25633292 28768036 32300206 36048695 39712304 42968186 45586395 47490369 48752538
60905D8752538Q07453O09229O65678Q75418J055933J023266O81742N8778p27656
$$ 48752538 49559991 50169220 50834898 51710316 52766249 53789515 54471257 54530035 53802379
60896E3802379j529451k217514k710493k986691l076366l035075k914676k750629
$$ 53802379 52272928 50055414 47344921 44358230 41281864 38246789 35332113 32581484
60888C2581484k565734k376252k193053k021776j865122j724251j597854j482292
$$ 32581484 30015750 27639498 25446445 23424669 21559547 19835296 18237442 16755150
60880A6755150j373912j270408j169869j070440r71828q75923p85176p01167o24825
$$ 16755150 15381238 14110830 12940961 11870521 10898693 10022770 9237594 8536427 7911602
60871G911602n56567m95774m41199l92522l50498l15385k86328k62485k43368
$$ 7911602 7355035 6859261 6418062 6025540 5675042 5359657 5073329 4810844 4567476
60862D567476k27734k13624k00031j87205j74945j62263j49422j38402j30043
$$ 4567476 4339742 4126118 3926087 3738882 3563937 3401674 3252252 3113850 2983807
60853B983807j22436j13578j04251r6418q9942q3038p5395o8813o4651o2307o0303
$$ 2983807 2861371 2747793 2643542 2547124 2457182 2374144 2298749 2229936 2165285 2102978 2042675
60842B042675n7613n3834m9305m5211m2462m0344l7312l3172k9359k6849k4923
$$ 2042675 1985062 1931228 1881923 1836712 1794250 1753906 1716594 1683422 1654063 1627214 1602291
60831A602291k2375j9016j5496j2432j0214r049q530p618n581k962j265j616l627
$$ 1602291 1579916 1560900 1545404 1532972 1522758 1513709 1505179 1497561 1491980 1489018 1487753 1486137 1482510
60818A482510n600o077n374n151o334q171r763j1526j4048j6269j6364j4414j2676
$$ 1482510 1476910 1470833 1465459 1460308 1453974 1445803 1436040 1424514 1410466 1394197 1377833 1363419 1350743
60805A350743j2837j4154j4690j3505j1225r339r162j0595j1618j0013n939j831
$$ 1350743 1337906 1323752 1309062 1295557 1284332 1274993 1265831 1255236 1243618 1233605 1227666 1225835
60793A225835N73J949L526M980N387N330O531R630J3521J6843J9250K1101K2639
$$ 1225835 1226408 1228357 1231883 1236863 1242250 1247580 1254111 1263741 1277262 1294105 1313355 1334456 1357095
60780A357095K3726K4064K3555K2493K1165J9413J7225J5658J6004J7706J8342
$$ 1357095 1380821 1404885 1428440 1450933 1472098 1491511 1508736 1524394 1540398 1558104 1576446
60769A576446J6561J3887J2469J2107J0985Q607O147M297K679J489J700L050L519
$$ 1576446 1593007 1606894 1619363 1631470 1642455 1651062 1657209 1661506 1664185 1665674 1667374 1670424 1673943
60756A673943J844p33k308k926m089o417r066j1206j2830j4081j4858j5422j6515
$$ 1673943 1675787 1675054 1672746 1669820 1665731 1659314 1650248 1639042 1626212 1612131 1597273 1581851 1565336
60743A565336j8314j9731j9477j7752j6149j5653j5345j3705j0866q581p792p314
$$ 1565336 1547022 1527291 1507814 1490062 1473913 1458260 1442915 1429210 1418344 1409763 1401971 1394657
60731A394657n642l109j192j37J301L789O377P909Q519R112J0219J1909J4183
$$ 1394657 1389015 1385906 1384714 1384577 1385878 1389667 1396044 1403953 1412472 1421584 1431803 1443712 1457895
60718A457895J6645J8111J7409J4711J1732J0323J0865J2032J2195J1087R840
$$ 1457895 1474540 1492651 1510060 1524771 1536503 1546826 1557691 1569723 1581918 1593005 1602845
60707A602845R425R579R611R554R768R961R710R574J0452J1907J2471J1826J1305
$$ 1602845 1612270 1621849 1631460 1641014 1650782 1660743 1670453 1680027 1690479 1702386 1714857 1726683 1737988
60694A737988J1814J2529J2324J1321J0338R739R542R699R487P763M694K248J878
$$ 1737988 1749802 1762331 1774655 1785976 1796314 1806053 1815595 1825294 1834781 1842544 1847238 1849486 1851364
60681A851364K596K476J090p97k974n497p411p738p461q614j1250j3160j2963
$$ 1851364 1853960 1856436 1857526 1856729 1853755 1848258 1840847 1833109 1825648 1817034 1805784 1792624 1779661
60668A779661j1678j0687r845q679p998q951j1267j3558j4862j5011j4146j2772
$$ 1779661 1767983 1757296 1747451 1738772 1730774 1721823 1710556 1696998 1682136 1667125 1652979 1640207
60656A640207j1905j2124j2763j2836j2502j2793j4021j5276j5512j4454j2485
$$ 1640207 1628302 1616178 1603415 1590579 1578077 1565284 1551263 1535987 1520475 1506021 1493536
60645A493536j0396r226r477j0135r219n854j386K061L733M434M878M784L823
$$ 1493536 1483140 1473914 1464437 1454302 1445083 1439229 1437843 1439904 1443637 1448071 1452949 1457733 1461556
60632A461556K602J980J652K89k758o473r339j0994j2263j3735j5090j5913j6559
$$ 1461556 1464158 1466138 1467790 1468079 1465321 1458848 1449509 1438515 1426252 1412517 1397427 1381514 1364955
60619A364955j7629j8937j9497j8705j7033j5407j4120j2737j0970r170p841o995
$$ 1364955 1347326 1328389 1308892 1290187 1273154 1257747 1243627 1230890 1219920 1210750 1202909 1195914
60607A195914o321n647m826l452j275J118K766L609M553N902O520N257K890J619
$$ 1195914 1189593 1183946 1179120 1175668 1174393 1175511 1178277 1181886 1186439 1192341 1198861 1204118 1207008 1208627
60593A208627K680N046O746O934O424O480P435Q510Q861Q530Q108P641O523M795
$$ 1208627 1211307 1216353 1223099 1230033 1236457 1242937 1250372 1258882 1267743 1276273 1284381 1292022 1298545 1303340
60579A303340L811M845P364R562J0544J1079J2097J3325J3998J4265J5079J6924
$$ 1303340 1307151 1311996 1319360 1328922 1339466 1350545 1362642 1375967 1389965 1404230 1419309 1436233
60567A436233J9227K1154K2490K3507K4175K3916K2355K0100J8375J7690J7194
$$ 1436233 1455460 1476614 1499104 1522611 1546786 1570702 1593057 1613157 1631532 1649222 1666416
60556A666416J5678J3031J0237Q019O003L389R4l104n323o221o104n695n807o841
$$ 1666416 1682094 1695125 1705362 1713381 1719384 1722773 1722867 1719763 1714440 1708219 1702115 1696420 1690613 1683772
60542A683772q452r935j1070j2328j3962j5310j5616j5439j6128j7570j7592j4658
$$ 1683772 1675320 1665385 1654315 1641987 1628025 1612715 1597099 1581660 1565532 1547962 1530370 1515712
60530A515712j0265p205n875m227j352J011J458J308K400L963L751J595l37o87
$$ 1515712 1505447 1498242 1492367 1488140 1486788 1487799 1489257 1490565 1492965 1496928 1500679 1502274 1501937 1501250
60516A501250k76o5M29J823L321L592K544J381J278K379L804M305L330J539j0
$$ 1501250 1500974 1500909 1501338 1503161 1506482 1510074 1512618 1513999 1515277 1517656 1521460 1525765 1529095 1530634 1530624
60501A530624j066k056k990l475l828m983o871p887o696l865j111O18J761L348
$$ 1530624 1529558 1527502 1524512 1521037 1517209 1512226 1505355 1497468 1490772 1486907 1485796 1486414 1488175 1491523
60487A491523O095R868J3690J6669J9203K2681K7700L3291L8305M2761M7141N1148
$$ 1491523 1497618 1507486 1521176 1537845 1557048 1579729 1607429 1640720 1679025 1721786 1768927 1820075
60475A820075N3956N5105N4313N0922M4618L6341K7482J8317Q334j906j0324j5209
$$ 1820075 1874031 1929136 1983449 2034371 2078989 2115330 2142812 2161129 2169463 2167557 2157233 2142024
60463B142024j6732j6234j4624j2006q295l567K020Q104J3870J8336K1034K2389
$$ 2142024 2125292 2109058 2094434 2082428 2074133 2070566 2072586 2080690 2094560 2112896 2133930 2156319
60451B156319K3360K4680K6390K8031K9387L1071L4349M0118M7956N6315O3942
$$ 2156319 2179679 2204359 2230749 2258780 2288167 2319238 2353587 2393705 2441661 2497976 2561918
60440B561918P1176P9625R0445J03295J17138J31677J47536J65300J84916K05945
$$ 2561918 2633094 2712719 2803164 2906459 3023597 3155274 3302810 3468110 3653026 3858971
60430C858971K27901K50495K74174L00432L30829L65213M00891M33150M55942
$$ 3858971 4086872 4337367 4611541 4911973 5242802 5608015 6008906 6442056 6897998
60421F897998M62551M47228M07248L43337K58391J56883M5823o5249j66702k51525
$$ 6897998 7360549 7807777 8215025 8558362 8816753 8973636 9019459 8954210 8787508 8535983
60411H535983l15944l59006l82726l91706l90805l82967l69902l54014l38050
$$ 8535983 8220039 7861033 7478307 7086601 6695796 6312829 5942927 5588913 5250863
60402E250863l22846l07098k89851k72176k55731k40684k25832k10223j93911
$$ 5250863 4928017 4620919 4331068 4058892 3803161 3562477 3336645 3126422 2932511
60393B932511j77394j61053j45058j29554j14903j01825r0865q1662p3215o5196
$$ 2932511 2755117 2594064 2449006 2319452 2204549 2102724 2011859 1930197 1856982 1791786
60383A791786n8458n3649m9900m5663m0752l6644l4452l3337l1540k8478k5154
$$ 1791786 1733328 1679679 1629779 1584116 1543364 1506720 1472268 1438931 1407391 1378913 1353759
60372A353759k2600k0791j9259j7992j7104j6146j4547j2557j1006j0106r247
$$ 1353759 1331159 1310368 1291109 1273117 1256013 1239867 1225320 1212763 1201757 1191651 1182404
60361A182404q066o914o000m869l297j939j357r89N1J528K416K456K410K737L023
$$ 1182404 1174338 1167424 1161424 1156555 1153258 1151319 1149962 1148973 1149024 1150552 1152968 1155424 1157834 1160571 1163594
60346A163594K928K857L289L996M431M393M115M088M953O953R189J0121R271P895
$$ 1163594 1166522 1169379 1172668 1176664 1181095 1185488 1189603 1193691 1198644 1205597 1214786 1224907 1234178 1242073
60332A242073P512Q312R489J0428J0747R817P405M605K952K432J490o95k919l547
$$ 1242073 1249585 1257897 1267386 1277814 1288561 1298378 1305783 1310388 1313340 1315772 1317262 1316567 1313648 1310101
60318A310101k552j262n56k20J72M88K48p95k277l285l096k037j169q19j63J250
$$ 1310101 1307549 1306287 1305731 1305511 1305683 1306171 1306419 1305624 1303347 1300062 1296966 1294929 1293760 1292941 1292778 1294028
60302A294028K354K050J207J721L719N221M827L437K728L202M430O095P822Q948
$$ 1294028 1296382 1298432 1299639 1301360 1305079 1310300 1315127 1318564 1321292 1324494 1328924 1335019 1342841 1351789
60288A351789R338R672J0045R354P148N123N209O823P624O598M679K647M14j480
$$ 1351789 1361127 1370799 1380844 1390198 1397346 1402469 1407678 1414501 1422125 1428723 1433402 1436049 1436463 1434983
60274A434983j733l12J104J582K248M129O221P063P048P471Q151P742N980L966
$$ 1434983 1433250 1432938 1434042 1435624 1437872 1442001 1448222 1455285 1462333 1469804 1477955 1485697 1491677 1495643
60260A495643K257K34k368m564n344m803l625k306j404j769l631n830o750n952
$$ 1495643 1497900 1498134 1495766 1491202 1485858 1481055 1477430 1475124 1473720 1471951 1468320 1462490 1455740 1449788
60246A449788m399l126k199j203j87L45K77J84O55J642K679L418L657L200K249
$$ 1449788 1445389 1442263 1440064 1438861 1438674 1439019 1439296 1439480 1440135 1441777 1444456 1447874 1451531 1454731 1456980
60231A456980J732K563M534O464P568Q108Q476Q372P310N653M600N187P394J0115
$$ 1456980 1458712 1461275 1465809 1472273 1479841 1487949 1496425 1504797 1512107 1517760 1522360 1527547 1534941 1545056
60217A545056J2021J2716J3030J3825J4786J5054J4888J5586J7544J9519K0504
$$ 1545056 1557077 1569793 1582823 1596648 1611434 1626488 1641376 1656962 1674506 1694025 1714529
60206A714529K1396K3709K7317L0656L3009L5319L8525M2116M4959M7085M9875
$$ 1714529 1735925 1759634 1786951 1817607 1850616 1885935 1924460 1966576 2011535 2058620 2108495
60195B108495N4474O0439O6261P1064P5504Q0904Q7852R5839J03943J11497J18485
$$ 2108495 2162969 2223408 2289669 2360733 2436237 2517141 2604993 2700832 2804775 2916272 3034757
60184C034757J25722J34303J44205J53787J61593J68222J75316J82789J88536
$$ 3034757 3160479 3294782 3438987 3592774 3754367 3922589 4097905 4280694 4469230
60175D469230J90987J90499J87736J82216J73319J61501J47548J31695J14475
$$ 4469230 4660217 4850716 5038452 5220668 5393987 5555488 5703036 5834731 5949206
60166E949206R7402Q1490O6015M9817L3174J7270K716j0108k0083k6255k9202
$$ 5949206 6046608 6128098 6194113 6243930 6277104 6294374 6297090 6286982 6266899 6240644 6211442
60155F211442l0033k8488k3591j5821o985K073J2140K3989L7551N2723O9509Q7027
$$ 6211442 6181409 6152921 6129330 6113509 6106524 6108597 6120737 6144726 6182277 6235000 6304509 6391536
60143F391536J03816J19427J34442J48533J59863J66916J69793J69160J65048
$$ 6391536 6495352 6614779 6749221 6897754 7057617 7224533 7394326 7563486 7728534
60134G728534J57340J46426J32664J15886R6073P3954N0583K6905L937j7488l7467
$$ 7728534 7885874 8032300 8164964 8280850 8376923 8450877 8501460 8528365 8532302 8514814 8477347
60123H477347n6605p4417q8978r8664j03542j04697j02925r8373r0792p9806o5638
$$ 8477347 8420742 8346325 8257347 8158683 8055141 7950444 7847519 7749146 7658354 7578548 7512910
60112G512910m9757l3805j7695J50K0161M0362N8299P3259Q5863R6340J03980
$$ 7512910 7463153 7429348 7411653 7411803 7431964 7472326 7530625 7603884 7689747 7786087 7890067
60101G890067J07620J06221R9818R0366Q0460P0636N9158M5309L1311J9754J0605
$$ 7890067 7997687 8103908 8203726 8294092 8374552 8445188 8504346 8549655 8580966 8600720 8611325
60090H611325K569l685o038m106L90O609J5811K9069M5599O4141Q4475J06524
$$ 8611325 8613894 8610209 8604171 8600065 8600455 8607064 8622875 8651944 8697543 8761684 8846159 8952683
60078H952683J29405J52808J78487K08754K43520K80031L15750L50572L85839
$$ 8952683 9082088 9234896 9413383 9622137 9865657 10145688 10461438 10812010 11197849
60069A1197849M21857M57047M89239N17041N39792N56815N67231N70243N64992
$$ 11197849 11619706 12076753 12565992 13083033 13622825 14179640 14746871 15317114 15882106
60060A5882106N50402N25940M92691M52684M06773L53949K93388K26389J55467
$$ 15882106 16432508 16958448 17451139 17903823 18310596 18664545 18957933 19184322 19339789
60051A9339789Q2169P009o8748j42465k11373k73404l26725l69657m01492m22687
$$ 19339789 19421958 19428967 19360219 19217754 19006381 18732977 18406252 18036595 17635103 17212416
60041A7212416m33833m35184m27439m12009l89874l61143l26545k88528k49670
$$ 17212416 16778583 16343399 15915960 15503951 15114077 14752934 14426389 14137861 13888191
60032A3888191k10444j69781j27658q5902m6356r680K3425N1041P1112Q3138Q7914
$$ 13888191 13677747 13507966 13380308 13294406 13248050 13238370 13261795 13312836 13383948 13467086 13555000
60021A3555000Q6022P7534O3044M3929K1599k849k8215n3372p8037j02489j26359
$$ 13555000 13641022 13718556 13781600 13825529 13847128 13844279 13816064 13762692 13684655 13582166 13455807
60010A3455807j48656j69363j89772k10276k28789k42546k50964k55436k56715
$$ 13455807 13307151 13137788 12948016 12737740 12508951 12266405 12015441 11760005 11503290
60001A1503290k54070k47061k36707k24283k09975j93343j74281j53034j30028
$$ 11503290 11249220 11002159 10765452 10541169 10331194 10137851 9963570 9810536 9680508
59992I680508j06153q2427n8708l3587o319K1781M8694P3748R7244J18347J34742
$$ 9680508 9574355 9491928 9433220 9399633 9393314 9415095 9463789 9537537 9634781 9753128 9887870
59981I887870J44555J47808J45627J38774J27359J11449R1442O7998M1884J3916
$$ 9887870 10032425 10180233 10325860 10464634 10591993 10703442 10794884 10862882 10904766 10918682
59971A0918682j5046m4054p2197r8903j23851j46171j64055j75777j81258j82203
$$ 10918682 10903636 10859582 10787385 10688482 10564631 10418460 10254405 10078628 9897370 9715167
59961I715167j80381j76073j68276j56284j40796j23569j06142q8796p0672n0819
$$ 9715167 9534786 9358713 9190437 9034153 8893357 8769788 8663646 8574850 8504178 8453359
59951H453359k9019n595J9236M5443P2707J00345J27829J54974J81315K05521
$$ 8453359 8424340 8418745 8437981 8483424 8556131 8656476 8784305 8939279 9120594 9326115
59941I326115K25758K40614K49413K51743K47159K35627K18009J95697J69693
$$ 9326115 9551873 9792487 10041900 10293643 10540802 10776429 10994438 11190135 11359828
59932A1359828J40187J07074P0780L2616n466m1608p4941j05687j33891j57987
$$ 11359828 11500015 11607089 11677869 11710485 11705019 11663411 11588470 11482783 11348892 11190905
59922A1190905j75282j84341j86302j83315j76322j65155j50311j33156j14365
$$ 11190905 11015623 10831282 10644980 10461665 10285343 10120188 9969877 9836721 9722356
59913I722356r3413p0089m5481k0799L859K8702N2937P5360R5905J15415J33699
$$ 9722356 9628943 9558854 9513373 9492574 9496433 9525135 9578072 9653432 9749337 9864752 9998451
59902I998451J48788J58579J62793J62956J60725J56587J50066J40900J29740
$$ 9998451 10147239 10305818 10468611 10631567 10792292 10948879 11098945 11239845 11369585
59893A1369585J17694J05489R3549Q2825P4859P0601O9607P0952P4743Q2213R4540
$$ 11369585 11487279 11592768 11686317 11769142 11844001 11914602 11984209 12055161 12129904 12212117 12306657
59882A2306657J12118J34812J62265J93860K29017K67798L10762L57737M06877
$$ 12306657 12418775 12553587 12715852 12909712 13138729 13406527 13717289 14075026 14481903
59873A4481903M55230N00153N40062N73813N99440O13509O11792N90850N49235
$$ 14481903 14937133 15437286 15977348 16551161 17150601 17764110 18375902 18966752 19515987
59864A9515987M87400M07071L11145K04109R1750j9949j25733k21309l03580l71182
$$ 19515987 20003387 20410458 20721603 20925712 21017462 20997513 20871780 20650471 20346891 19975709
59854A9975709m24333m63541m88782n00446n00676m92759m79015m59838m34999
$$ 19975709 19551376 19087835 18599053 18098607 17597931 17105172 16626157 16166319 15731320
59845A5731320m04904l70305l31698k89968k46850k03575j59398j12778o4125
$$ 15731320 15326416 14956111 14624413 14334445 14087595 13884020 13724622 13611844 13547719
59836A3547719j6088K9266P2024J12298J47663J74183J89601J94137J88321J71412
$$ 13547719 13531631 13560897 13632921 13745219 13892882 14067065 14256666 14450803 14639124 14810536
59826A4810536J42519J02291N2987k675o2160j23032j82755k38678k88223l29462
$$ 14810536 14953055 15055346 15108333 15105658 15043498 14920466 14737711 14499033 14210810 13881348
59816A3881348l61746l85631m02031m11557m14550m11501m03317l91245l76349
$$ 13881348 13519602 13133971 12731940 12320383 11905833 11494332 11091015 10699770 10323421
59807A0323421l58884l38549l15813k92636k71099k51338k31720k11348j91610
$$ 10323421 9964537 9625988 9310175 9017539 8746440 8495102 8263382 8052034 7860424
59798G860424j74794j61777j51691j43290j35698j27912j18728j07822r6403q5880
$$ 7860424 7685630 7523853 7372162 7228872 7093174 6965262 6846534 6738712 6642309 6556429
59788F556429p6059o5356n3184m1277l2087k6406k3552k3406k6835l3833m2579
$$ 6556429 6480370 6415014 6361830 6320553 6288466 6262060 6238508 6215102 6188267 6154434 6111855
59777F111855n1138n8998o6270p2367p6482p8517p8455p5634p0076o3751n8690
$$ 6111855 6060717 6001719 5935449 5863082 5786600 5708083 5629628 5553994 5483918 5420167 5361477
59766E361477n4175m7489l7535k5946j4593l880N886J3682J9576K5871L4714M5345
$$ 5361477 5307302 5259813 5222278 5196332 5181739 5177859 5183745 5197427 5217003 5242874 5277588 5322933
59754E322933N5306O3799P2178Q1212Q9346R4327R5504R3734Q9594Q2752P3363
$$ 5322933 5378239 5442038 5514216 5595428 5684774 5779101 5874605 5968339 6057933 6140685 6214048
59743F214048O3141N4208M7056M0666L4771L0724K9473K9915L0643L2491L7646
$$ 6214048 6277189 6331397 6378453 6419119 6453890 6484614 6514087 6544002 6574645 6607136 6644782
59732F644782M6654N8017P0704Q5187J01823J20145J40417J64136J91968K22693
$$ 6644782 6691436 6749453 6820157 6905344 7007167 7127312 7267729 7431865 7623833 7846526
59722G846526K55274K90631L30032L72754M16590M59655M99903N32905N51230
$$ 7846526 8101800 8392431 8722463 9095217 9511807 9971462 10471365 11004270 11555500
59713A1555500N46521N12537M47661L56084K46806J30919J9271p8867j57438k15187
$$ 11555500 12102021 12614558 13062219 13418303 13665109 13796028 13815299 13736432 13578994 13363807
59703A3363807k54442k77546k85473k80470k67735k52368k35616k16027j93528
$$ 13363807 13109365 12831819 12546346 12265876 11998141 11745773 11510157 11294130 11100602
59694A1100602j70156j47128j23494r8119p1247m3429j4360J6302M8000P9995
$$ 11100602 10930446 10783318 10659824 10561705 10490458 10447029 10432669 10448971 10496971 10576966
59684A0576966J12402J45851J80356K15210K49835K84377L19403L55316L92300
$$ 10576966 10689368 10835219 11015575 11230785 11480620 11764997 12084400 12439716 12832016
59675A2832016M30860M71878N15819N62233O10654O61564P15386P70868Q25844
$$ 12832016 13262876 13734754 14250573 14812806 15423460 16085024 16800410 17571278 18397122
59666A8397122Q79639R33012R85061J031787J068612J093031J103959J100401
$$ 18397122 19276761 20209773 21194834 22226621 23295233 24388264 25492223 26592624
59658B6592624J082814J054805J021566R87025R53938R26053R07923R02208R08395
$$ 26592624 27675438 28730243 29751809 30738834 31692772 32618825 33526748 34428956 35337351
59649C5337351R24368R48111R77490J009103J037645J056438J059298J042627
$$ 35337351 36261719 37209830 38187320 39196423 40234068 41290506 42349804 43392431
59641D3392431J005391R46970Q66309P64101O44860N15748L84132K56965J40887
$$ 43392431 44397822 45344792 46211101 46975202 47620062 48135810 48519942 48776907 48917794
59632D8917794M0888m0770j03081j44653j64731j64686j46613j11289n9302O902
$$ 48917794 48958682 48917912 48814831 48670178 48505447 48340761 48194148 48082859 48023557 48030459
59622D8030459Q4440J72871K73261L84693N04109O29342P59506Q91777J019910
$$ 48030459 48114899 48287770 48561031 48945724 49449833 50079175 50838681 51730458 52750368
59613E2750368J136224J232742J299720J325663J300362J217131J072390Q66232
$$ 52750368 53886592 55119334 56419054 57744717 59045079 60262210 61334600 62200832
59605F2200832O05573L05453j4486l34857o38559r10936j140750j321554j452011
$$ 62200832 62806405 63111858 63097372 62762515 62123956 61213020 60072270 58750716 57298705
59596E7298705j535281j577658j586314j568057j531094j487111j449073j426154
$$ 57298705 55763424 54185766 52599452 51031395 49500301 48013190 46564117 45137963
59588D5137963j422149j438082j472849j520064j567619j603458j621194j619237
$$ 45137963 43715814 42277732 40804883 39284819 37717200 36113742 34492548 32873311
59580C2873311j597130j555589j498707j432815j362583j289808j215569j141726
$$ 32873311 31276181 29720592 28221885 26789070 25426487 24136679 22921110 21779384
59572B1779384j070085j001608r36663q75033q15744p57962p02131o49306n99432
$$ 21779384 20709299 19707691 18771028 17895995 17080251 16322289 15620158 14970852 14371420
59563A4371420n51212n03759m57559m13779l73400l37069l05030k76845k51686
$$ 14371420 13820208 13316449 12858890 12445111 12071711 11734642 11429612 11152767 10901081
59554A0901081k29149k09641j93882j82341j75075j71798j71747j73608j75878
$$ 10901081 10671932 10462291 10268409 10086068 9910993 9739195 9567448 9393840 9217962
59545I217962j77704j79296j81032j82177j81207j77644j72690j67499j61794
$$ 9217962 9040258 8860962 8679930 8497753 8316546 8138902 7966212 7798713 7636919
59536G636919j54986j47516j39668j30193j17959j04390r2165q1702p1077n9345
$$ 7636919 7481933 7334417 7194749 7064556 6946597 6842207 6750042 6668340 6597263 6537918
59526F537918m7564l6296k4578j2384j778N828J1831J8440K5852L2791L8515M3046
$$ 6537918 6490354 6454058 6429480 6417096 6415318 6421146 6432977 6451417 6477269 6510060 6548575 6591621
59514F591621M6474M9299N2664N7192O2446O8270P5561Q4791R5059J05574J16943
$$ 6591621 6638095 6687394 6740058 6797250 6859696 6927966 7003527 7088318 7183377 7288951 7405894
59503G405894J29842J43598J57250J71103J86143K02952K22097K44257K68826
$$ 7405894 7535736 7679334 7836584 8007687 8193830 8396782 8618879 8863136 9131962
59494I131962K93592L17141L40428L64716L89208M12159M33065M52025M68015
$$ 9131962 9425554 9742695 10083123 10447839 10837047 11249206 11682271 12134296 12602311
59485A2602311M79465M85760M86741M81850M71510M58107M43352M25476M01260
$$ 12602311 13081776 13567536 14054277 14536127 15007637 15465744 15909096 16334572 16735832
59476A6735832L70412L35882L00306K64580K29805J98095J70784J47681J28812
$$ 16735832 17106244 17442126 17742432 18007012 18236817 18434912 18605696 18753377 18882189
59467A8882189J15494J08978J09247J15546J27158J42932J60523J76194J85255
$$ 18882189 18997683 19106661 19215908 19331454 19458612 19601544 19762067 19938261 20123516
59458B0123516J83562J69644J44792J10138O4515O598o1720j35915k12270k88773
$$ 20123516 20307078 20476722 20621514 20731652 20796167 20802765 20741045 20605130 20392860 20104087
59448B0104087l62985m31258m90465n38916n75450n99422o11891o15117o10402
$$ 20104087 19741102 19309844 18819379 18280463 17705013 17105591 16493700 15878583 15268181
59439A5268181n97900n78687n55122n28609m98863m66159m32560l99796l67477
$$ 15268181 14670281 14091594 13536472 13007863 12509000 12042841 11610281 11210485 10843008
59430A0843008l34712l02071k70469k39004k05772j70626j35805j03539p3822
$$ 10843008 10508296 10206225 9935756 9696752 9490980 9320354 9184549 9081010 9007188
59421I007188m4699j4379J7122M8249P7765J06154J34856J64358J93751K22153
$$ 9007188 8962489 8948110 8965232 9013481 9091246 9197400 9332256 9496614 9690365 9912518
59411I912518K49740K76929L02962L25700L42688L52408L54625L49379L35575
$$ 9912518 10162258 10439187 10742149 11067849 11410537 11762945 12117570 12466949 12802524
59402A2802524L11049K74537K27108J71159J08693M1459k7813r5653j59300k17035
$$ 12802524 13113573 13388110 13615218 13786377 13895070 13936529 13908716 13813063 13653763 13436728
59392A3436728k67453l09652l43863l70713l89875m00745m04357m03200l98896
$$ 13436728 13169275 12859623 12515760 12145047 11755172 11354427 10950070 10546870 10147974
59383A0147974l91447l80921l68398l54607l39067l21498l02866k84191k65228
$$ 10147974 9756527 9375606 9007208 8652601 8313534 7992036 7689170 7404979 7139751
59374G139751k45430k25423k06395j88363j70106j50982j32103j15383j01533
$$ 7139751 6894321 6668898 6462503 6274140 6104034 5953052 5820949 5705566 5604033
59365E604033q9092p5782o0965m6329l3764k3089j2709j970Q476J8379K8459L8911
$$ 5604033 5514941 5439159 5378194 5331865 5298101 5275012 5262303 5260333 5268809 5287188 5315647 5354558
59353E354558M8626N6400O1845O4700O4648O2707O1667O3918O9561P7497Q7760
$$ 5354558 5403184 5459584 5521429 5586129 5650777 5713484 5775151 5839069 5908630 5986127 6073887
59342F073887J01383J18216J36106J52496J66072J76730J85045J92490K01649
$$ 6073887 6175270 6293486 6429592 6582088 6748160 6924890 7109935 7302425 7504074
59333G504074K15124K33796K56626K82399L11212L43706L79563M17905M59100
$$ 7504074 7719198 7952994 8209620 8492019 8803231 9146937 9526500 9944405 10403505
59324A0403505N04530N54069O05131O55394P05282P56224Q06908Q52666Q88293
$$ 10403505 10908035 11462104 12067235 12722629 13427911 14184135 14991043 15843709 16732002
59315A6732002R10311R17025R08221Q85348Q50964Q07631P57632P03264O46443
$$ 16732002 17642313 18559338 19467559 20352907 21203871 22011502 22769134 23472398 24118841
59306B4118841N88419N30671M75186M22366L69420L12803K51920J88429J22304
$$ 24118841 24707260 25237931 25713117 26135483 26504903 26817706 27069626 27258055 27380359
59297B7380359N1151k6020j06639j86776k63407l33765l94916m45618m87118n21017
$$ 27380359 27431510 27405490 27298851 27112075 26848668 26514903 26119987 25674369 25187251 24666234
59287B4666234n47981n69579n89308o09821o30519o49542o66683o82438o95419
$$ 24666234 24118253 23548674 22959366 22349545 21719026 21069484 20402801 19720363 19024944
59278A9024944p03013p04025o98814o87464o69890o47334o21837n94168n63829
$$ 19024944 18321931 17617906 16919092 16231628 15561738 14914404 14292567 13698399 13134570
59269A3134570n30999m96913m62501m28194l94850l63146l32146l00407k68563
$$ 13134570 12603571 12106658 11644157 11215963 10821113 10457967 10125821 9825414 9556851
59260I556851k38905k11994j85893j59495j34480j12538r2427p1717n0256k9864
$$ 9556851 9317946 9105952 8920059 8760564 8626084 8513546 8421119 8349402 8299146 8269282
59250H269282j1151P257K6273M4872O1578P6111Q8886R9902J08856J15672J20288
$$ 8269282 8258131 8265388 8291661 8336533 8398111 8474222 8563108 8663010 8771866 8887538 9007826
59239I007826J22339J21655J18588J13280J05157R3962Q0956O8223N6909M6995
$$ 9007826 9130165 9251820 9370408 9483688 9588845 9682807 9763763 9831986 9888895 9935890
59229I935890L8693L2967L0323L0120L1799L5966M3383N3436O4757P7143R1765
$$ 9935890 9974583 10007550 10037873 10067993 10099792 10135758 10179141 10232577 10297334 10374477 10466242
59218A0466242J09077J27357J43893J57181J67357J74579J77693J75012J66117
$$ 10466242 10575319 10702676 10846569 11003750 11171107 11345686 11523379 11698391 11864508
59209A1864508J51985J33099J08339P6888M0842M636k8260n6858q0908r9309j11200
$$ 11864508 12016493 12149592 12257931 12334819 12375661 12380297 12352037 12295179 12214271 12114962 12003762
59198A2003762j17181j18274j14670j06677r5910q4092p1485n8018m5146l4771
$$ 12003762 11886581 11768307 11653637 11546960 11451050 11366958 11295473 11237455 11192309 11157538
59188A1157538k6839j9916j3952j0433r572r404q237o343m454k037K064Q414J7371
$$ 11157538 11130699 11110783 11096831 11086398 11076826 11067422 11059185 11052842 11048388 11046351 11048415 11056829 11074200
59175A1074200K9791M6427O7165R1375J18712J49315J83726K22442K64786L08428
$$ 11074200 11103991 11150418 11217583 11308958 11427670 11576985 11760711 11983153 12247939 12556367
59165A2556367L51096L92384M32419M68625M95480N07964N03865M82489M43016
$$ 12556367 12907463 13299847 13732266 14200891 14696371 15204335 15708200 16190689 16633705
59156A6633705L85203L10443K21208J20640J3404r4547j98386k95491l83340m57843
$$ 16633705 17018908 17329351 17550559 17671199 17684603 17590056 17391670 17096179 16712839 16254996
59146A6254996n15572n56841n84825o01975o08691o05296n93753n76977n57193
$$ 16254996 15739424 15182583 14597758 13995783 13387092 12781796 12188043 11611066 11053873
59137A1053873n35238n11108m85057m58251m32075m06782l81420l55246l28684
$$ 11053873 10518635 10007527 9522470 9064219 8632144 8225362 7843942 7488696 7160012
59128G160012l02623k77620k54069k32315k12102j92676j73894j56452j40636
$$ 7160012 6857389 6579769 6325700 6093385 5881283 5688607 5514713 5358261 5217625
59119E217625j25699j10997r6877q3864p1956o1264n2277m4683l6885k7760j8180
$$ 5217625 5091926 4980929 4884052 4800188 4728232 4666968 4614691 4570008 4533123 4505363 4487183
59108D487183r751k614M588J2983K2483L2134M0779M7769N3635N9809O7199P5356
$$ 4487183 4477432 4474818 4479406 4492389 4514872 4547006 4587785 4635554 4689189 4748998 4816197 4891553
59096D891553Q3215R0216R6607J03335J11557J21347J30958J38529J44534J50984
$$ 4891553 4974768 5064984 5161591 5264926 5376483 5497830 5628788 5767317 5911851 6062835
59086F062835J57986J63050J64346J62783J59783J54888J46933J36029J22885
$$ 6062835 6220821 6383871 6548217 6711000 6870783 7025671 7172604 7308633 7431518
59077G431518J07603R0661P3843N8576M4444L0819J8705R352K420k623m484j663
$$ 7431518 7539121 7629782 7703625 7762201 7806645 7837464 7856169 7865521 7867941 7865318 7860834 7859171
59065G859171M694J1881J9167K8296M0830N6728P5128R4801J14226J32984J52619
$$ 7859171 7863865 7875746 7894913 7923209 7964039 8020767 8095895 8190696 8304922 8437906 8590525
59054H590525J74426J97033K18157K38114K59130K81361L02025L18717L31261
$$ 8590525 8764951 8961984 9180141 9418255 9677385 9958746 10260771 10579488 10910749
59045A0910749L39750L42879L38879L26467L04347K71608K29383J80841J29103
$$ 10910749 11250499 11593378 11932257 12258724 12563071 12834679 13064062 13244903 13374006
59036A3374006P6236K4144k5416p1979j15664j55099j88095k14943k38807k61835
$$ 13374006 13450242 13474386 13448970 13376991 13261327 13106228 12918133 12703190 12464383 12202548
59026A2202548k82959l00707l16048l30470l42849l50600l53371l53561l53196
$$ 12202548 11919589 11618882 11302834 10972364 10629515 10278915 9925544 9571983 9218787
59017I218787l51897l48037l40810l30791l19335l07783k96836k86263k75255
$$ 9218787 8866890 8518853 8178043 7847252 7527917 7220134 6923298 6637035 6361780
59008F361780k63073k49557k35250k21042k07432j94277j81502j69576j58843
$$ 6361780 6098707 5849150 5613900 5392858 5185426 4991149 4809647 4640071 4481228
58999D481228j48823j38924j29426j20874j12907j04771r6758q9915q4398p9284
$$ 4481228 4332405 4193481 4064055 3943181 3830274 3725503 3628745 3538830 3454432 3375148
58989C375148p4085o9239o5079o1439n8298n5571n2323m7570m2017l7394l3866
$$ 3375148 3301063 3231824 3166745 3105306 3047008 2991437 2939114 2891544 2849527 2812133 2778267
58978B778267k9757k4341j9148j5586j2905r651n807k163J312N092Q791J1608
$$ 2778267 2748510 2724169 2705021 2689435 2676530 2666879 2661072 2658909 2660221 2665313 2674104 2685712
58966B685712J3643J5653J7720J8947J8455J6123J2673R215O381L775Q83j660
$$ 2685712 2699355 2715008 2732728 2751675 2770130 2786253 2798926 2808141 2814522 2818297 2819180 2817520
58954B817520k715k494k316k311j038J929M829O124O421O733O549N324M273M555
$$ 2817520 2814805 2812311 2809995 2807684 2806646 2808575 2813404 2819528 2825949 2832682 2839231 2844555 2848828 2853383
58940B853383M769K731q92l208l211k869l813n146n208l727j471Q46K630L637
$$ 2853383 2858152 2860883 2859991 2856783 2853572 2850703 2846890 2841744 2836536 2832809 2831338 2832184 2834814 2838451
58926B838451M719P003R947J1623J1582J1809J3951J7188J9954K2176K4354K5871
$$ 2838451 2843170 2850173 2860120 2871743 2883325 2895134 2909085 2926273 2946227 2968403 2992757 3018628
58914C018628K6185K6652K9112L3133L6798L9833M3746M8704N2728N4652N5986
$$ 3018628 3044813 3071465 3100577 3133710 3170508 3210341 3254087 3302791 3355519 3410171 3466157
58903C466157N8740O2947O7395P1377P4586P6699P8396Q1554Q6938R2716R6906
$$ 3466157 3524897 3587844 3655239 3726616 3801202 3877901 3956297 4037851 4124789 4217505 4314411
58892D314411J00329J05296J12132J19114J25482J32193J39674J47134J54670
$$ 4314411 4414740 4520036 4632168 4751282 4876764 5008957 5148631 5295765 5450435
58883E450435J63900J75542J88166K00369K12649K25947K39862K53683K68128
$$ 5450435 5614335 5789877 5978043 6178412 6391061 6617008 6856870 7110553 7378681
58874G378681K84490L02765L21985L41878L63072L86141M11491M39752M71207
$$ 7378681 7663171 7965936 8287921 8629799 8992871 9379012 9790503 10230255 10701462
58865A0701462N05257N41308N79704O20936O64641P10472P59343Q12283Q68209
$$ 10701462 11206719 11748027 12327731 12948667 13613308 14323780 15083123 15895406 16763615
58856A6763615R24004R77040J026681J073037J114713J147612J165622J162740
$$ 16763615 17687619 18664659 19691340 20764377 21879090 23026702 24192324 25355064
58848B5355064J135206J081493J000472Q90865P53349N92318M14649K27489L7970
$$ 25355064 26490270 27571763 28572235 29463100 30216449 30808767 31223416 31450905 31488875
58839C1488875j46275l18354m73716o09599p23774q15401q86415r39997r77625
$$ 31488875 31342600 31024246 30550530 29940931 29217157 28401756 27515341 26575344 25597719
58830B5597719r99194j005916j001139r87837r67080r39548r07011q71245q32718
$$ 25597719 24598525 23592609 22591470 21603633 20636553 19697005 18789994 17918749 17086031
58821A7086031p91495p48837p06915o67194o29737n93774n58453n23217m87997
$$ 17086031 16294536 15545699 14838784 14171590 13541853 12948079 12389626 11866409 11378412
58812A1378412m53316m20107l89273l61101l35114l10676k87627k65865k44659
$$ 11378412 10925096 10504989 10115716 9754615 9419501 9108825 8821198 8555333 8310674
58803H310674k23480k03428j86316j71842j57209j40578j23395j08036r4593q1668
$$ 8310674 8087194 7883766 7697450 7525608 7368399 7227821 7104426 6996390 6901797 6820129
58793F820129o9046n7367m5866l2793j8004l277J0137K2709L5391M8645O2681
$$ 6820129 6751083 6693716 6647850 6615057 6597053 6593776 6603913 6626622 6662013 6710658 6773339
58782F773339P7264R1361J04268J17004J31246J47096J63138J78368J92892K07225
$$ 6773339 6850603 6941964 7046232 7163236 7294482 7441578 7604716 7783084 7975976 8183201
58772H183201K22319K39531K59018K79013K98514L19566L44534L72169L99397
$$ 8183201 8405520 8645051 8904069 9183082 9481596 9801162 10145696 10517865 10917262
58763A0917262M26249M55650M88582N23281N59763O01006O48327O99034P50535
$$ 10917262 11343511 11799161 12287743 12811024 13370787 13971793 14620120 15319154 16069689
58754A6069689Q03564Q59076R14745R66987J014029J054333J083888J097694J092417
$$ 16069689 16873253 17732329 18647074 19614061 20628090 21682423 22766311 23864005 24956422
58745B4956422J065185J011635R28207Q15607O77663N17989L40714J53629l2874
$$ 24956422 26021607 27033242 27961449 28777056 29454719 29972708 30313422 30467051 30434177
58736C0434177k10693l75826n25389o55569p63518q49341r14933r61931r91760
$$ 30434177 30223484 29847658 29322269 28666700 27903182 27053841 26138908 25176977 24185217
58727B4185217j006816j010461j005750r94313r76273r51307r20031q84264q45897
$$ 24185217 23178401 22167940 21162190 20167877 19191604 18240297 17320266 16436002 15590105
58718A5590105q05918p64873p23617o83113o43877o06121n70035n35526n02188
$$ 15590105 14784187 14019314 13295697 12612584 11968707 11362586 10792551 10257025 9754837
58709I754837m69950m39268m10323l82706l56375l32115l10320k89988k69809
$$ 9754837 9284887 8845619 8435296 8052590 7696215 7364100 7053780 6763792 6493983
58700F493983k49877k31597k15936k02384j89549j76406j62939j49687j36876
$$ 6493983 6244106 6012509 5796573 5594189 5404640 5228234 5065295 4915608 4778732
58691D778732j24379j12704j03128r5997q9582q1867p3116o5262n9156n4064m9649
$$ 4778732 4654353 4541649 4438521 4342524 4252942 4171075 4097959 4032697 3973541 3919477 3869828
58680C869828m6596m4927m3603m2350m2241m3862m6386m8947n1222n2279n0776
$$ 3869828 3823232 3778305 3734702 3692352 3650111 3606249 3559863 3510916 3459694 3407415 3356639
58669C356639m7280m4539m4404m6076m8187n0652n3342n4994n5116n5263n6715
$$ 3356639 3309359 3264820 3220416 3174340 3126153 3075501 3022159 2967165 2912049 2856786 2800071
58658B800071n8325n8487n7731n7399n6996n5064n1868m9098m7339m5666m3437
$$ 2800071 2741746 2683259 2625528 2568129 2511133 2456069 2404201 2355103 2307764 2262098 2218661
58647B218661m0973l8707l6908l5915l5505l4620l2845l1435l1488l1918l0827
$$ 2218661 2177688 2138981 2102073 2066158 2030653 1996033 1963188 1931753 1900265 1868347 1837520
58636A837520k8308k6302k5867k6097k5710k4370k2355j9976j7525j5154j2778
$$ 1837520 1809212 1782910 1757043 1730946 1705236 1680866 1658511 1638535 1621010 1605856 1593078
58625A593078j0461q609p525p129p312p762p442n537l212k866m928o942o785n103
$$ 1593078 1582617 1574008 1566483 1559354 1552042 1544280 1536838 1531301 1528089 1525223 1520295 1513353 1506568 1501465
58611A501465l449j795M98K774M048M746N582N858M850L959N212Q076R781Q690
$$ 1501465 1498016 1496221 1496719 1499493 1503541 1508287 1513869 1519727 1524577 1528536 1533748 1541824 1551605 1560295
58597A560295N763K927J551K336N022Q066R866J0425J1023J2620J5363J9139K3527
$$ 1560295 1566058 1568985 1570536 1572872 1577894 1585960 1595826 1606251 1617274 1629894 1645257 1664396 1687923
58584A687923K7610L0812L3561L6501L9612M2707M5864M8752N0763N2632N6453
$$ 1687923 1715533 1746345 1779906 1816407 1856019 1898726 1944590 1993342 2044105 2096737 2153190
58573B153190O2911O9962P5631Q0567Q6322R2722R9054J06456J16622J28988J41651
$$ 2153190 2216101 2286063 2361694 2442261 2528583 2621305 2720359 2826815 2943437 3072425 3214076
58562C214076J54462J68938J85394K02478K19528K37350K56424K75991K95097
$$ 3214076 3368538 3537476 3722870 3925348 4144876 4382226 4638650 4914641 5209738
58553E209738L13074L28687L39809L44037L39086L23218K96185K59162K13159
$$ 5209738 5522812 5851499 6191308 6535345 6874431 7197649 7493834 7752996 7966155
58544G966155J58729R8115L6021k3268p8159j27634j68855j99412k20702k36413
$$ 7966155 8124884 8222999 8259020 8235752 8157593 8029959 7861104 7661692 7440990 7204577
58534G204577k48298k55686k58362k57376k53412k46824k39009k31503k23866
$$ 7204577 6956279 6700593 6442231 6184855 5931443 5684619 5445610 5214107 4990241
58525D990241k14473k03065j90625j77403j63245j49293j36850j24958j11763
$$ 4990241 4775768 4572703 4382078 4204675 4041430 3892137 3755287 3630329 3518566
58516C518566r8105q7078p9822p4271o8415o2425n7029n2042m7200m2792l8795
$$ 3518566 3420461 3333383 3253561 3179290 3110875 3048450 2991421 2939379 2892179 2849387 2810592
58505B810592l4951l1973l1161l2629l5191l8035m1149m4246m6674m8193m8658
$$ 2810592 2775641 2743668 2712507 2679878 2644687 2606652 2565503 2521257 2474583 2426390 2377732
58494B377732m7535m5087m3061m2387m1308l7939l3648l1250l0673k9365k6580
$$ 2377732 2330197 2285110 2242049 2199662 2158354 2120415 2086767 2055517 2024844 1995479 1968899
58483A968899k4142k2900k1517j9306j7535j7197j7792j8986k1268k4398k7031
$$ 1968899 1944757 1921857 1900340 1881034 1863499 1846302 1828510 1809524 1788256 1763858 1736827
58472A736827k8325k8286k6598k3195j9820j8829k0226k1950k2897k3527k3782
$$ 1736827 1708502 1680216 1653618 1630423 1610603 1591774 1571548 1549598 1526701 1503174 1479392
58461A479392k2973k1686k1109k0543j8229j4780j2915j3471j4486j4562j4253
$$ 1479392 1456419 1434733 1413624 1393081 1374852 1360072 1347157 1333686 1319200 1304638 1290385
58450A290385j3653j1669q499o021m858l637j846p07m00O56K758L989L544L327
$$ 1290385 1276732 1265063 1256564 1250543 1245685 1242048 1240202 1239495 1239095 1239751 1242509 1246498 1250042 1253369
58436A253369M894P284R111J0408J1198J0709R355R202J1075J3305J4485J5205
$$ 1253369 1258263 1265547 1274658 1285066 1296264 1306973 1316328 1325530 1336605 1349910 1364395 1379600
58424A379600J5889J5366J3133J0706R244P846N725L894L097K030n81l915o650
$$ 1379600 1395489 1410855 1423988 1434694 1443938 1451784 1457509 1461403 1464500 1466530 1465949 1462034 1455384
58411A455384r057j1865j4574j6448j7934j9686k1189k1530k0491j8251j5212
$$ 1455384 1446327 1434462 1419888 1403440 1385506 1365820 1344631 1323101 1302610 1284359 1269147
58400A269147j2616j1832j2466j2655j1636j0311r068p147m756l562m212n264
$$ 1269147 1256531 1244699 1232233 1219578 1207942 1197631 1188563 1181416 1176660 1173098 1168886 1163622
58388A163622n280m183k172P03L474N037O364R495J3880J6498J6292J5675J6644
$$ 1163622 1158342 1154159 1151987 1152690 1156164 1161201 1167565 1177060 1190940 1207438 1223730 1239405 1256049
58375A256049J8215J8849J8617J7551J4507R430M528J659L75k87j39J010K547
$$ 1256049 1274264 1293113 1311730 1329281 1343788 1353218 1357746 1359405 1359780 1359493 1359354 1360364 1362911
58362A362911M269O368P777P086N511N954Q402R510P828N991O314P591P962P748
$$ 1362911 1367180 1373548 1381325 1388411 1393922 1399876 1408278 1417788 1425616 1431607 1437921 1445512 1453474 1461222
58348A461222P464O283M526M586P013Q467O083J398k384m617o406p924r024j0513
$$ 1461222 1468686 1474969 1479495 1484081 1491094 1499561 1505644 1507042 1504658 1500041 1493635 1485711 1476687 1466174
58334A466174j2606j3788j3116j1789j0938r876q066o530n792m763l135k370k825
$$ 1466174 1453568 1439780 1426664 1414875 1403937 1394061 1385995 1379465 1373673 1368910 1365775 1363405 1360580
58321A360580k625j068k76j618l203k951j453J38K353N457P894Q708R085R806
$$ 1360580 1357955 1356887 1356611 1354993 1351790 1348839 1347386 1347524 1349877 1355334 1363228 1371936 1381021 1390827
58307A390827R780Q785Q608R740J0040Q677Q101J0046J2717J4207J5345J6923
$$ 1390827 1400607 1409392 1418000 1427740 1437780 1446457 1454558 1464604 1477321 1491528 1506873 1523796
58295A523796J7551J6737J6800J8993K1022K0864J9725J8655J6005J1141P052
$$ 1523796 1541347 1558084 1574884 1593877 1614899 1635763 1655488 1674143 1690148 1701289 1708341
58284A708341N987N864M292K707L069L757K515O48O71K316M072O120Q714J0384
$$ 1708341 1714328 1720192 1724484 1727191 1730260 1734017 1736532 1737180 1737851 1740167 1744239 1750359 1759073 1769457
58270A769457J0547J1118J2969J4030J3433J3805J6706J9757K1275K3453K7544
$$ 1769457 1780004 1791122 1804091 1818121 1831554 1845359 1862065 1881822 1903097 1926550 1954094
58259A954094L0435K9896K8906L0550L2781L2645L1606L2033L2318L0127K6789
$$ 1954094 1984529 2014425 2043331 2073881 2106662 2139307 2170913 2202946 2235264 2265391 2292180
58248B292180K4009K0074J3957R198Q783J0172J0187J0660J4050J7733J8338J7907
$$ 2292180 2316189 2336263 2350220 2359418 2368201 2378373 2388560 2399220 2413270 2431003 2449341 2467248
58236B467248J9924K2888K3599K3278K4733K6852K7492K8342L1465L4700L5907
$$ 2467248 2487172 2510060 2533659 2556937 2581670 2608522 2636014 2664356 2695821 2730521 2766428
58225B766428L7754M2651M7449M9139N1148N7407O4835O8854P1837P8400Q6358
$$ 2766428 2804182 2846833 2894282 2943421 2994569 3051976 3116811 3185665 3257502 3335902 3422260
58214C422260R0322R0845R2323R4800R5207R3777R2454R0261Q6553Q4783Q6754
$$ 3422260 3512582 3603427 3695750 3790550 3885757 3979534 4071988 4162249 4248802 4333585 4420339
58203D420339Q8062Q5972Q5968R2902J01964J07014J11484J21345J33613J42392
$$ 4420339 4508401 4594373 4680341 4773243 4875207 4982221 5093705 5215050 5348663 5491055
58193E491055J50565J64323J81434J96160K10706K30047K50633K66343K80674
$$ 5491055 5641620 5805943 5987377 6183537 6394243 6624290 6874923 7141266 7421940
58184G421940L00516L22780L40246L55845L77656M04422M30065M57817M95188
$$ 7421940 7722456 8045236 8385482 8741327 9118983 9523405 9953470 10411287 10906475
58175A0906475N39140N81159O22908O71604P24231P72164Q17136Q66508R17476
$$ 10906475 11445615 12026774 12649682 13321286 14045517 14817681 15634817 16501325 17418801
58166A7418801R63106J009078J066304J131885J196385J264660J348945J446229
$$ 17418801 18381907 19390985 20457289 21589174 22785559 24050219 25399164 26845393
58158B6845393J544004J643590J754960J873640J987532K102550K236019K388900
$$ 26845393 28389397 30032987 31787947 33661587 35649119 37751669 39987688 42376588
58150D2376588K551020K728744K939075L182066L449773L755894M122739M546359
$$ 42376588 44927608 47656352 50595427 53777493 57227266 60983160 65105899 69652258
58142F9652258N012226N537459O157275O882493P720410Q723912R960961J1453788
$$ 69652258 74664484 80201943 86359218 93241711 100962121 109686033 119646994 131100782
58134A31100782J3225897J5390712J8088016K1338341K5087443K9363226L4090355
$$ 131100782 144326679 159717391 177805407 199143748 224231191 253594417 287684772
58127B87684772L8517699M0981946L9608635L3485100K3249004J0704113j992831
$$ 287684772 326202471 367184417 406793052 440278152 463527156 474231269 472238438
58120D72238438j2981987k1097649k6055166k8299148k8547281k7415413k5394553
$$ 472238438 459256451 438158802 412103636 383804488 355257207 327841794 302447241
58113C02447241k2975125k0611245j8579819j6965621j5762668j4916842j4302359
$$ 302447241 279472116 258860871 240281052 223315431 207552763 192635921 178333562
58106A78333562j3755528j3153943j2429378j1530701j0437751r200333p902290
$$ 178333562 164578034 151424091 138994713 127464012 117026261 107825928 99923638
58099I9923638o587445n264426l963214k721047j523965l48005P13298J425027
$$ 99923638 93336193 88071767 84108553 81387506 79863541 79515536 80228834 81653861
58091H1653861J560947J063466O0630j215185k500307l559447m258312m598941
$$ 81653861 83214808 84278274 84338904 83123719 80623412 77063965 72805653 68206712
58083F8206712m667817m550540m300345l961007l583875l218194k899105k644759
$$ 68206712 63538895 58988355 54688010 50727003 47143128 43924934 41025829 38381070
58075C8381070k454966k314257k203561k108346k015346j910858j788514j652992
$$ 38381070 35926104 33611847 31408286 29299940 27284594 25373736 23585222 21932230
58067B1932230j511961j370212j233738j110927j005233r13101q32050p63748
$$ 21932230 20420269 19050057 17816319 16705392 15700159 14787058 13955008 13191260
58059A3191260p06819o54678o03860n57279n16456m77967m40507m08021l82524
$$ 13191260 12484441 11829763 11225903 10668624 10152168 9674201 9233694 8825673 8443149
58050H443149l60714l40630l24800l13808l03408k91020k78889k68140k56073
$$ 8443149 8082435 7741805 7417005 7103197 6799789 6508769 6229880 5961740 5705667
58041E705667k41968k29278k19368k09064j96948j85915j77018j66938j54358
$$ 5705667 5463699 5234421 5015053 4805989 4609041 4423126 4246108 4079170 3924812
58032C924812j42911j35024j28523j22056j17982j16906j14944j09788j04373
$$ 3924812 3781901 3646877 3518354 3396298 3278316 3161410 3046466 2936678 2832305
58023B832305j01306r8564r3961q9295q6624q4403q0618p6214p2520o8493o3100
$$ 2832305 2730999 2632435 2538474 2449179 2362555 2278152 2197534 2121320 2048800 1980307 1917207
58012A917207n7594n3293m9825m7059m5760m5107m2793l8730l5493l4187l3184
$$ 1917207 1859613 1806320 1756495 1709436 1663676 1618569 1575776 1537046 1501553 1467366 1434182
58001A434182l1619l0533k9860k8073k5561k4502k4648k3177j9449j6088j4574
$$ 1434182 1402563 1372030 1342170 1314097 1288536 1264034 1239386 1216209 1196760 1180672 1166098
57990A166098j3701j2943j3250j3923j2974j1152j1198j2602j1902q850p168q077
$$ 1166098 1152397 1139454 1126204 1112281 1099307 1088155 1076957 1064355 1052453 1043603 1036435 1028358
57978A028358q270n917l559l050k512n27J164J439K003L573L984K329J068J803
$$ 1028358 1020088 1014171 1010612 1007562 1005050 1004523 1005687 1007126 1009129 1012702 1016686 1019015 1020083 1021886
57964A021886K805K804L319N093O159N668N827P623Q554O975N032M731M681L282
$$ 1021886 1024691 1027495 1030814 1035907 1042066 1047734 1053561 1061184 1069738 1076713 1081745 1086476 1091157 1094439
57950A094439J659Q04p51l730n866n543m534m575m388k821j669k465l488l069
$$ 1094439 1096098 1096902 1096151 1092421 1086555 1081012 1076478 1071903 1067515 1064694 1063025 1060560 1057072 1054003
57936A054003l077n785r645j1415j0758r838j0000j1132j2835j4104j3472j1127
$$ 1054003 1050926 1045141 1035496 1024081 1013323 1003485 993485 982353 969518 955414 941942 930815
57924I30815r137q300p130n126m126m782m739k446L39J949L613O325Q023O842
$$ 930815 921678 913378 906248 901122 896996 892214 887475 885029 885368 887317 890930 897255 905278 912120
57910I12120M456L153K174P1j665q33J418K157J041J40N37J665K889L457K158
$$ 912120 916576 919729 921903 921974 920309 919476 920894 923051 924092 924232 924769 926434 929323 932780 934938
57895I34938r09l611m651n522p608r476r255p721o504n238l163j650k130l044
$$ 934938 934029 930418 925767 920245 912637 903161 893906 886185 879681 874443 871280 869630 867500 864456
57881H64456j899Q20K557K455J551L20j332k603l001m055p307j1452j3992j4949
$$ 864456 862557 863377 865934 868389 869940 870260 868928 866325 863324 859269 851962 840510 826518 811569
57867H11569j6316j8436j9587j8883j7270j5657j4106j2743j1770j0651q755o495
$$ 811569 795253 776817 757230 738347 721077 705420 691314 678571 666801 656150 647395 640900
57855F40900m725l538k656k099j490L9K232L506L598M514P385J0292J1154J0795
$$ 640900 636175 632637 629981 627882 626392 626431 628663 632169 635767 640281 647666 657958 669112 679907
57841F79907J0893J0888R507P713P151P018N413K761Q84l81k565n221o330n789
$$ 679907 690800 701688 711195 718908 726059 733077 738490 741251 742135 741754 739189 733968 727638 721849
57827G21849n459n758n189l580l025m857p769r653r663q166o190n045n078m901
$$ 721849 716390 710632 705443 701863 698838 693981 686212 676559 666896 658730 652540 647495 642417 637516
57813F37516l293j333q92j605j440j3J084J245J768L342M830N274N341N899O636
$$ 637516 634223 632890 631998 630393 628953 628940 630024 631269 633037 636379 641209 646483 651824 657723 664359
57798F64359O918O837O606N836M087J666n31j697j743j523k093l297l890l490
$$ 664359 671277 678114 684720 690556 694643 696309 695778 694081 692338 690815 688722 685425 681535 678045
57784F78045l271l969m628m587n147p325r302q542n746m076m723n797n703n170
$$ 678045 674774 670805 666177 661590 656443 649118 639816 631274 625528 621452 616729 610932 605229 600059
57770F00059n289n758o045o682q312j0474j2106j2567j1840j0548r837j0336j1162
$$ 600059 594770 589012 582967 576285 567973 557499 545393 532826 520986 510438 500601 490265 479103
57757D79103j0907r553q377q074q088p894p697p676p480o815n759m428k927j637
$$ 479103 468196 458643 450266 442192 434104 426210 418513 410837 403357 396542 390783 386355 383428 381791
57743C81791q91m96j02L61J164L021N906Q428R438R641J0374J1442J1616J0754
$$ 381791 380900 380404 380302 380663 381827 384848 390754 399182 408620 418261 428635 440077 451693 462447
57729D62447R866R319Q523P326O279N536M762M179M451N468O348O425N267K177
$$ 462447 472313 481632 490155 497481 503760 509296 514058 518237 522688 528156 534504 540929 546196 548373
57715E48373k767p457r282q219o938p525r411j0815j0928j0015q459o432m092
$$ 548373 545606 538149 528867 520648 513710 506185 496774 485959 475031 465016 456557 450125 446033
57702D46033j707J76R01N27J31N75J400J728J788K449L635M445M702N141O084
$$ 446033 444326 444502 445403 445930 446061 446636 448036 449764 451552 454001 457636 462081 466783 471924 478008
57687D78008O950P168O785O218O075O899Q363R160Q532P377O898O942O836P007
$$ 478008 484958 492126 498911 505129 511204 518103 526466 535626 544158 551535 558433 565375 572211 579218
57673E79218Q179R573R759R012R064J0544J2387J3852J5398J7251J8739J9541
$$ 579218 587397 596970 606729 615741 624805 635349 647736 661588 676986 694237 712976 732517
57661G32517K0271K1305K2251K3039K4417K6718K9118L0720L1642L2628L4135
$$ 732517 752788 774093 796344 819383 843800 870518 899636 930356 961998 994626 1028761
57650A028761L6181L8610M1240M4046M7189N0721N4482N8451O2657O6563O9496
$$ 1028761 1064942 1103552 1144792 1188838 1236027 1286748 1341230 1399681 1462338 1528901 1598397
57639A598397P2141P6564Q3678R1772R8591J04077J10004J17862J28207J41063
$$ 1598397 1670538 1747102 1830780 1922552 2021143 2125220 2235224 2353086 2481293 2622356
57629B622356J55531J69987J84017J99195K16615K34917K52359K69070K84946
$$ 2622356 2777887 2947874 3131891 3331086 3547701 3782618 4034977 4304047 4588993
57620D588993K96679K99819K93023K77588K53738K20745J80686J38633R8638O2182
$$ 4588993 4885672 5185491 5478514 5756102 6009840 6230585 6411271 6549904 6648542 6710724
57610F710724L0792O632j1040k7479m8863p8129j14512j54595j92806k23141k42252
$$ 6710724 6741516 6748148 6737108 6709629 6660766 6582637 6468125 6313530 6120724 5897583 5655331
57599E655331k50389k49424k41561k29640k16270k02065j86697j71745j59761
$$ 5655331 5404942 5155518 4913957 4684317 4468047 4265982 4079285 3907540 3747779
57590C747779j50124j38850j23815j07528r3344q1420p0046n8661m7590l6663
$$ 3747779 3597655 3458805 3334990 3227462 3134118 3052698 2982652 2923991 2876401 2839738
57580B839738k5891j5997o786L378J5094K6675L6851M6968N8867P2323Q6251J00659
$$ 2839738 2813847 2797850 2791064 2794442 2809536 2836211 2873062 2920030 2978897 3051220 3137471 3238130
57568C238130J15598J29866J42843J56126J71248J87004K00990K12366K20905
$$ 3238130 3353728 3483594 3626437 3782563 3953811 4140815 4341805 4554171 4775076
57559D775076K24559K20536K08081J87925J59809J23109P9757L3988j1048n4476
$$ 4775076 4999635 5220171 5428252 5616177 5775986 5899095 5978852 6012840 6001792 5947316
57549E947316r5325j30976j58875j78678j92049k00975k06525k08789k07941k05324
$$ 5947316 5851991 5721015 5562140 5383462 5191413 4990438 4783913 4575124 4367183 4161859
57539D161859k02660j99914j95058j86827j76657j66935j58325j50008j41546
$$ 4161859 3959199 3759285 3564227 3377400 3200743 3033808 2875483 2725475 2583929
57530B583929j33021j24169j14805j05645r7464r0008q2824p6363p0938o5537
$$ 2583929 2450908 2326739 2211934 2106289 2008825 1918817 1835993 1759630 1688692 1623155
57520A623155n9266n3363m9840m8403m6421m1975l5637k9276k4434k1766k0757
$$ 1623155 1563889 1510526 1460686 1412283 1365862 1323887 1288250 1258974 1234540 1212774 1192017
57509A192017j9790j7473j3958j0389p541n672m908m595l026O68M873P341Q353
$$ 1192017 1172227 1154754 1140796 1130407 1122866 1117194 1112286 1107691 1104665 1105333 1110206 1117547 1125900
57496A125900J0331J4437J9196K2730K4762K6030K7122K8520L0751L3899L7444
$$ 1125900 1136231 1150668 1169864 1192594 1217356 1243386 1270508 1299028 1329779 1363678 1401122
57485A401122M0948M4360M7703N1106N5118O0275O6342P2595P8805Q5305R2388
$$ 1401122 1442070 1486430 1534133 1585239 1640357 1700632 1766974 1839569 1918374 2003679 2096067
57474B096067J00253J09276J19608J30642J41504J51798J61293J69331J75226
$$ 2096067 2196320 2305596 2425204 2555846 2697350 2849148 3010441 3179772 3354998
57465C354998J78645J78745J73563J61332J42053J16928Q6977N3341J8186j6109
$$ 3354998 3533643 3712388 3885951 4047283 4189336 4306264 4393241 4446582 4464768 4448659
57455D448659m8296p7528j01964j19837j31641j39532j44559j46219j44711j41706
$$ 4448659 4400363 4322835 4220871 4101034 3969393 3829861 3685302 3539083 3394372 3252666
57445C252666j38359j34134j28397j21779j15226j08821j02263r5563q8599q0823
$$ 3252666 3114307 2980173 2851776 2729997 2614771 2505950 2403687 2308124 2219525 2138702
57435B138702p2113o3281n5144m7699m0498l3284k5956j8675j2114o837k136L540
$$ 2138702 2066589 2003308 1948164 1900465 1859967 1826683 1800727 1782052 1769938 1763101 1760965 1764505
57423A764505J0632J7808K3733K8665L3722L9495M6154N4157O3738P3990Q3439
$$ 1764505 1775137 1792945 1816678 1845343 1879065 1918560 1964714 2018871 2082609 2156599 2240038
57412B240038R1658R9695J08907J19653J31162J42151J51496J58411J62154J61467
$$ 2240038 2331696 2431391 2540298 2659951 2791113 2933264 3084760 3243171 3405325 3566792
57402C566792J54585J40225J18685R1724O1217K8103o958m2218p4829j02484j24535
$$ 3566792 3721377 3861602 3980287 4072011 4133228 4161331 4154373 4112155 4037326 3934842 3810307
57391C810307j41261j52779j59361j62161j62620j61436j58913j55808j52583
$$ 3810307 3669046 3516267 3356906 3194745 3032125 2870689 2711776 2555968 2403385
57382B403385j48368j42124j34605j27552j21048j13733j05752r9089r4332q9421
$$ 2403385 2255017 2112893 1978288 1850736 1729688 1615955 1510203 1411114 1316782 1227361
57372A227361q2885p6006p0277o4885n8733n3058m9568m7323m4067l9692l5982
$$ 1227361 1144476 1068470 998193 933308 874575 821517 771949 724626 680559 640867 604885
57361F04885l3566l1495k9355k7552k5817k3637k1895k1868k2711k2139j9693
$$ 604885 571319 539824 510469 482917 457100 433463 411568 389700 366989 344850 325157
57350C25157j7318j6396j6155j5278j3504j1375r768r614j0753j1420j0405r064
$$ 325157 307839 291443 275288 260010 246506 235131 225363 215749 204996 193576 183171 174107
57338A74107r311j0368r900p828o252n751m790l115k552l622m259l179j857j712
$$ 174107 164796 154428 144528 136700 130448 124697 119907 116792 114240 110618 106359 103180 101323 99611
57324I9611j789q65J84p6j435k979m694o569p585p066n798m585l083j281n48j699
$$ 99611 97822 96957 97141 97065 95630 92651 87957 81388 73803 66737 60939 56354 53271 51990 51442 49743
57308D9743l404m078m108m618n307n187m478l962l318j765J77J049K61j527l322
$$ 49743 46339 42261 38153 33535 28228 23041 18563 14601 11283 9518 9695 10744 11005 9478 6156
57293F156B003a300j196O21f49F69J674J799J134L94M51Q80R50J046J745K382
$$ 6156 2003 -1300 -2496 -1875 -649 669 2343 4142 5276 5670 6121 7001 7951 8997 10742 13124
57277A3124K014J131Q90J342J827K446L668M910N012L979K996K871L377L867L739
$$ 13124 15138 16269 17159 18501 20328 22774 26442 31352 36364 40343 43339 46210 49587 53454 57193
57262E7193K737J535J446K877M763O117P174Q327R180R584J0305J1560J2303J2294
$$ 57193 59930 61465 62911 65788 70551 76668 83842 92169 101349 110933 121238 132798 145101 157395
57248A57395J3286J6444J9994K1378K0696J9925J9840J9994K0745K2747K4970
$$ 157395 170681 187125 207119 228497 249193 269118 288958 308952 329697 352444 377414
57237C77414K5735K5520K6117K7221K6693K4497K3652K6232L0620L3933L5321
$$ 377414 403149 428669 454786 482007 508700 533197 556849 583081 613701 647634 682955
57226F82955L5710L5721L5235L4162L2741L1513L1323L2443L3553L2633K9173
$$ 682955 718665 754386 789621 823783 856524 888037 919360 951803 985356 1017989 1047162
57215A047162K4473J9565J4112P782J338m349r419j4423j9238k3150k5524k6156
$$ 1047162 1071635 1091200 1105312 1113094 1114432 1110083 1100664 1086241 1067003 1043853 1018329 992173
57203I92173k5527k4769k4663k4605k3314k0671j8002j6416j5671j4844j3337
$$ 992173 966646 941877 917214 892609 869295 848624 830622 814206 798535 783691 770354
57192G70354j1054q247n484l265j641m22N07J525L298N759P782Q627R127J0294
$$ 770354 759300 751053 745569 742304 740663 740241 740748 742273 745571 751330 759112 767739 776866 787160
57178G87160J1581J1918J1740J2382J3808J4793J5111J5771J7044J8005J8211
$$ 787160 798741 810659 822399 834781 848589 863382 878493 894264 911308 929313 947524
57167I47524J8306J8706J9251K0248K2182K4189K4652K3693K3389K4854K6790
$$ 947524 965830 984536 1003787 1024035 1046217 1070406 1095058 1118751 1142140 1166994 1193784
57156A193784K7776K8409L0193L3457L7356M0936M3466M4536M4610M4755M5449
$$ 1193784 1221560 1249969 1280162 1313619 1350975 1391911 1435377 1479913 1524523 1569278 1614727
57145A614727M6278M6982M7706M8163M7681M6350M4939M3431M0916L7220L3372
$$ 1614727 1661005 1707987 1755693 1803856 1851537 1897887 1942826 1986257 2027173 2064393 2097765
57134B097765L0237K7996K7180K8584L1757L5170L8449M2789M8471N3611N6346
$$ 2097765 2128002 2155998 2183178 2211762 2243519 2278689 2317138 2359927 2408398 2462009 2518355
57123B518355N6946N6901N7205N8332O0514O3043O4373O3784O1969N9532N6288
$$ 2518355 2575301 2632202 2689407 2747739 2808253 2871296 2935669 2999453 3061422 3120954 3177242
57112C177242N2635N0005M8930M8044M6042M3408M1228L9537L7944L6731L6235
$$ 3177242 3229877 3279882 3328812 3376856 3422898 3466306 3507534 3547071 3585015 3621746 3657981
57101C657981L6043L5723L5408L4964L3622L1179K8458K5996K3349K0319J7556
$$ 3657981 3694024 3729747 3765155 3800119 3833741 3864920 3893378 3919374 3942723 3963042 3980598
57090C980598J5562J4375J4761J7943K3540K9378L3821L6433L5852K9569J7070
$$ 3980598 3996160 4010535 4025296 4043239 4066779 4096157 4129978 4166411 4202263 4231832 4248902
57079D248902J220j4639k8956m0558m7738n0523n1411n2121n1821n0326n0349
$$ 4248902 4250122 4235483 4206527 4165969 4118231 4067708 4016297 3964176 3912355 3862029 3811680
57068C811680n4365o1746p1547q5671j06347j32477j61625j93865k30538k70790
$$ 3811680 3757315 3695569 3624022 3538351 3432004 3299527 3137902 2944037 2713499 2442709
57058B442709l12645l56411m04224m57290C95885a87045o59057p44597q39971
$$ 2442709 2130064 1773653 1369429 912139 395885 -187045 -846102 -1590699 -2430670
57049b430670r48173j071985j211013j364439j534628j724798j935735k168760
$$ -2430670 -3378843 -4450828 -5661841 -7026280 -8560908 -10285706 -12221441 -14390201
57041a4390201k429446k723410l049607l401325l770578m145852m508252m839407
$$ -14390201 -16819647 -19543057 -22592664 -25993989 -29764567 -33910419 -38418671 -43258078
57033d3258078n138722n434148n777668o226225o812075p518836q286990r038038
$$ -43258078 -48396800 -53830948 -59608616 -65834841 -72646916 -80165752 -88452742 -97490780
57025i7490780r665335r984463r744013q793431p316621n882149n179720n613670
$$ -97490780 -107156115 -117140578 -126884591 -135678022 -142994643 -148876792 -154056512 -159670182
57017a59670182p058529q911125j0334822j0537777r011080n688628r65712M448501
$$ -159670182 -166728711 -175639836 -185974658 -196512435 -205523515 -211212143 -212177855 -207729354
57009b07729354R762388J4292758J7564618J9351196J9681062J8795908J7050556
$$ -207729354 -197966966 -183674208 -166109590 -146758394 -127077332 -108281424 -91230868
57002i1230868J4799302J2332582R882742P656458N836777M541131L775524L434102
$$ -91230868 -76431566 -64098984 -54216242 -46559784 -40723007 -36181876 -32406352 -28972250
56994b8972250L350670L364277L360300L279961L111664K874204K596796K304229
$$ -28972250 -25621580 -22257303 -18897003 -15617042 -12505378 -9631174 -7034378 -4730149
56986d730149K013441i79876E03853J259606J067063R07467P79252O75812N88234
$$ -4730149 -2716708 -979876 503853 1763459 2830522 3737989 4517241 5193053 5781287
56977E781287N10789M42346L83222L32960K90838K56059K26975K01843J80624
$$ 5781287 6292076 6734422 7117644 7450604 7741442 7997501 8224476 8426319 8606943
56968H606943J64304J52199J41648J30865J20478J11643J03990R6354Q8441Q0754
$$ 8606943 8771247 8923446 9065094 9195959 9316437 9428080 9532070 9628424 9716865 9797619
56958I797619P3377O5759N7527M8863L9997L0584J9915Q015l448j1978j6511j8523
$$ 9797619 9870996 9936755 9994282 10043145 10083142 10113726 10133641 10141656 10138208 10126230 10109719 10091196
56946A0091196k0317k2573k4237k4515k3766k2043j7777r189K582J2263J2805
$$ 10091196 10070879 10048306 10024069 9999554 9975788 9953745 9935968 9926779 9929361 9941624 9954429
56935I954429j028l1398p8597j40979k12127k79679l30569l59344l70538l72411
$$ 9954429 9953401 9922003 9843406 9702427 9490300 9210621 8880052 8520708 8150170 7777759
56925G777759l69715l63215l53775l44034l36231l30364l24874l17879l07779
$$ 7777759 7408044 7044829 6691054 6347020 6010789 5680425 5355551 5037672 4729893
56916D729893k94068k77975k61221k44017k25347k05342j86010j69051j54118
$$ 4729893 4435825 4157850 3896629 3652612 3427265 3221923 3035913 2866862 2712744
56907B712744j40111j27141j16112j06834r7678q7125p5075o2606n1014m1097
$$ 2712744 2572633 2445492 2329380 2222546 2124868 2037743 1962668 1900062 1849048 1807951
56897A807951l3065k6982k3331k2841k5577l0508l6170m1474m5601m7724m7543
$$ 1807951 1774886 1747904 1724573 1701732 1676155 1645647 1609477 1568003 1522402 1474678 1427135
56886A427135m5948m4389m3426m2385m0563l8206l6004l4079l1919k8989k4940
$$ 1427135 1381187 1336798 1293372 1250987 1210424 1172218 1136214 1102135 1070216 1041227 1016287
56875A016287j9439j2528n151J293O035R140J0420Q875L812l934j2414j9938k5513
$$ 1016287 996848 984320 979169 980462 986497 995637 1006057 1014932 1018744 1014810 1002396 982458 956945
56862I56945k8523k9061k8404k8102k8237k7559k5514k3169k1640k0655j9427
$$ 956945 928422 899361 870957 842855 814618 787059 761545 738376 716736 696081 676654
56851F76654j8066j6986j5627j3065r794p559p347q399r495j0193j0444r832p924
$$ 676654 658588 641602 625975 612910 603116 595557 588210 579811 570316 560123 549679 539847 531923
56838E31923n063k289n20J3j82k53L33J382K397L388M843P059R803J2556J4551
$$ 531923 526860 524571 524051 524064 523882 523629 523962 525344 527741 531129 535972 543031 552834 565390 579941
56823E79941J4801J2963J0325Q941R314R724Q416N843M082M505O655R054J0475
$$ 579941 594742 607705 618030 626971 636285 646009 654425 660268 664350 668855 675510 684564 695039
56810F95039J0641J0328J0723J2285J4501J6920J9890K3745K7989L1983L5781
$$ 695039 705680 716008 726731 739016 753517 770437 790327 814072 842061 874044 909825
56799I09825L9165M0449L7625L0593K1013J0180j265j1620j8267k0623k1196k2319
$$ 909825 948990 989439 1027064 1057657 1078670 1088850 1087585 1075965 1057698 1037075 1015879 993560
56787I93560k3130k1446j7435j3341j0009n890K99P781J5186K2192K9145L6395
$$ 993560 970430 948984 931549 918208 908199 902309 902608 910389 925575 947767 976912 1013307
56775A013307M4703N4797O5183P1475O9464N8506M1189K0618n11j8988l1669l7781
$$ 1013307 1058010 1112807 1177990 1249465 1318929 1377435 1418624 1439242 1438731 1419743 1388074 1350293
56763A350293l9455l9420l8919l8005l6557l4218l0263k4557j8130j2131o646
$$ 1350293 1310838 1271418 1232499 1194494 1157937 1123719 1093456 1068899 1050769 1038638 1031992
56752A031992j140M592J0755J8235K7568L7061M2967M2098L3950K0290L514j4005
$$ 1031992 1030852 1035444 1046199 1064434 1092002 1129063 1172030 1214128 1248078 1268368 1271882 1257877
56740A257877k9591m0391m4622m2985l8660l5287l4274l4057l2184k7958k2836
$$ 1257877 1228286 1187895 1143273 1100288 1061628 1026341 992067 958010 925826 897868 875032
56729H75032j8616j5957j4332j2493q914k840M647J1279J5601J7631J7243J3280
$$ 875032 856416 840459 826127 813634 804720 801880 806527 817806 833407 851038 868281 881561
56717H81561N367m201j1994j6680j9548k1865k3223k2950k1792k1090k0929k0184
$$ 881561 886928 882727 870733 854053 834505 812640 789417 766467 744675 723585 702656 682472
56705F82472j8269j6024j4748j4768j5074j4370j2495j0829j0826j2107j2610
$$ 682472 664203 648179 633431 618663 603589 589219 576724 565895 555069 542962 530352
56694E30352j1005q337o649o457o422n351l502j836q49n40q39j495k002k218k708
$$ 530352 519347 511010 504361 497904 491482 486131 482629 480793 479944 479404 478565 477070 475068 472850 470142
56679D70142l953n355n774m982m012l832m234m349l927l485l377l203k454j405
$$ 470142 466189 460834 455060 450078 446066 442234 438000 433651 429724 426239 422862 419659 417205 415800
56665D15800j029j945l615m793m684l659k608j896j234n45m44j378k663l030k068
$$ 415800 414771 412826 409211 404418 399734 396075 393467 391571 390337 389792 389348 387970 385307 382277 380209
56650C80209o76J34K67L00N91R74R88J85j284k265j443Q43K349J321j210k569
$$ 380209 379533 379667 379934 380234 380825 381799 382787 382972 381688 379423 377980 378823 381172 382493 381283 378714
56634C78714j667K7P61N67N15Q36P34l02j705k356j603J57J781K469K514K663
$$ 378714 377047 377074 377835 378402 378917 379753 380487 380185 378480 376124 374521 374678 376459 378928 381442 384105
56618C84105K897K541J626J188J788K503K054M37j162j670q99N36J536J206j62
$$ 384105 387002 389543 391169 392357 394145 396648 398702 399139 397977 396307 395408 395944 397480 398686 398524
56603C98524j191j052n20q62k172l423l707k744p87J200J859R40j9L51J205P46
$$ 398524 397333 396281 395761 394899 392727 389304 385597 382853 382066 383266 385125 386065 386046 386397 387602 388348
56587C88348q88j692q02M58Q96J031J485J419l2j932k580j760o01L32J443K778
$$ 388348 387460 385768 384966 385424 386320 387351 388836 390255 390223 388291 385711 383951 383350 383682 385125 387903
56571C87903L523L036J479o07k598l679l362k292j702j803j576m76N46L52p06
$$ 387903 391426 394462 395941 395334 392736 389057 385695 383403 381701 379898 378322 377846 378392 378744 378038
56556C78038j335j176j121j777k583k819k666k728k977l021l001l421m084m072
$$ 378038 376703 375527 374406 372629 370046 367227 364561 361833 358856 355835 352834 349413 345329 341257
56542C41257l002j581n31L17J346K180K123J226K42l78p04p31k97L27L69n31j717
$$ 341257 338255 336674 336143 336460 337806 339986 342109 343335 343577 343199 342495 341764 341467 341794 342163 341632 339915
56525C39915k057j037P25K128K772L357M460N238M268J934O51J845L815L977K455
$$ 339915 337858 336821 337546 339674 342446 345803 350263 355501 359769 361703 362354 364199 368014 371991 374446
56510C74446J662K573L442K677J279J381L412N874P229P136O196N248M812M708
$$ 374446 376108 378681 382123 384800 386079 387460 390872 396746 403975 411111 417307 422555 427367 432075
56496D32075M354L617L091L361M301N290N785N634N059M380L562K329R51L59Q35
$$ 432075 436429 440046 443137 446498 450799 456089 461874 467508 472567 476947 480509 482838 483789 484148 484983
56481D84983J278P68R6L36N51j112m162n834m863l041k227k042j675j906l439
$$ 484983 486261 487029 487125 487461 488012 486900 482738 476904 472041 469000 466773 464731 463056 461150 457711
56466D57711m912m713l667l735m852n184m185l183k865k292r25k1j048l716o294
$$ 457711 452799 448086 444419 440684 435832 430648 426463 423280 420415 418123 417198 417177 416129 412413 406119
56451D06119p297o528m869l383k345j268l4N25k21j531k098j632q17j50K08j41
$$ 406119 398822 392294 387425 384042 381697 380429 380395 380920 380699 379168 377070 375438 374621 374471 374679 374538
56435C74538j343k470k327j038J91P39Q99P82J91l02M21K296L692L346J796N23
$$ 374538 373195 370725 368398 367360 367551 368290 369189 369971 370162 369860 370281 372577 376269 379615 381411 381934
56419C81934L46J142K297L052L011K652K816L498L919L902M176M895M928L498
$$ 381934 382280 383422 385719 388771 391782 394434 397250 400748 404667 408569 412745 417640 422568 426066
56405D26066J757J703L749O278P537P272O406N712N124M133K535P74l76l60P98
$$ 426066 427823 429526 433275 439553 447090 454362 460768 466480 471604 475737 478272 479046 478670 478310 479108
56390D79108K550M043M477L527J569n35j984k448k140j467o07N00J570J785O91
$$ 479108 481658 485701 490178 493705 495274 494739 492755 490307 488167 486700 486093 486593 488163 489948 490639
56375D90639r12j764j725j822k624l441l426k542j090P44K314K499J001j045k454
$$ 490639 489727 487963 486238 484416 481792 478351 474925 472383 471293 472037 474351 476850 477851 476806 474352
56360D74352l241l820l970l460k890k867l088l227l831n134n855m793k896k133
$$ 474352 471111 467291 463321 459861 456971 454104 451016 447789 443958 438824 432969 428176 425280 423147
56346D23147k581k414p75J038J508O54o28j761k527k646j914l84J556L037L082
$$ 423147 420566 418152 417377 418415 419923 420577 419949 418188 415661 413015 411101 410717 412273 415310 418392
56331D18392J739L25j97l19o95o50N64K010K303J972K635M096M446L146J885J961
$$ 418392 420131 420456 420259 419940 419245 418595 419159 421169 423472 425444 428079 432175 436621 439767 441652 443613
56315D43613K792L555M494N701O312N888N308N274N254M746M360M599M593L248
$$ 443613 446405 449960 454454 460155 466467 472355 477663 482937 488191 492937 497297 501896 506489 509737
56301E09737R04j104k037k093j706j157n41L41J643K827K962K013J165J633L523
$$ 509737 510641 509537 507500 505407 503701 502544 502003 502344 503987 506814 509776 511789 512954 514587 518110
56286E18110N953P626P451N571L753L770N314O559O635O253N936N325M632N060
$$ 518110 524063 531689 539140 544711 548464 552234 557548 564107 570742 576995 582931 588256 592888 597948
56272E97948O889Q474Q181O401M873M778O090P968R185R067Q401Q621R868J0936
$$ 597948 604837 613311 621492 627893 632766 637544 643634 651602 660787 669854 678255 686876 696744 707680
56258G07680J1374J2133J3549J4305J3368J1679J0705J0476J0232J0006J0177
$$ 707680 719054 731187 744736 759041 772409 784088 794793 805269 815501 825507 835684
56247H35684J0133Q784O141L413J764J695L131N254O665O587N858N943P126Q304
$$ 835684 845817 854601 860742 864155 865919 867614 870745 875999 882664 889251 895109 901052 908178 916482
56233I16482Q477P950P980R546J2518J5925J8851K0874K1783K1641K1450K2833
$$ 916482 924959 932909 940889 950435 962953 978878 997729 1018603 1040386 1062027 1083477 1106310
56221A106310K6260L0321L3596L6464L9928M3606M6473M8878N2001N5802N9371
$$ 1106310 1132570 1162891 1196487 1232951 1272879 1316485 1362958 1411836 1463837 1519639 1579010
56210A579010O3062O8091P4221Q0041Q5619R2554J01014J09250J16690J25223
$$ 1579010 1642072 1710163 1784384 1864425 1950044 2042598 2143612 2252862 2369552 2494775
56200B494775J36287J48758J60866J72341J83524J94055K03680K12834K21289
$$ 2494775 2631062 2779820 2940686 3113027 3296551 3490606 3694286 3907120 4128409
56191D128409K27488K30098K28912K23525K12873J97002J77736J56558J33352
$$ 4128409 4355897 4585995 4814907 5038432 5251305 5448307 5626043 5782601 5915953
56182E915953J08039Q1851N5954L0427N536j7451l7734n5734p1611q4646r4926
$$ 5915953 6023992 6105843 6161797 6192224 6197760 6180309 6142575 6086841 6015230 5930584 5835658
56171E835658j03827j11924j18234j22480j26237j30685j35207j39241j43515
$$ 5835658 5731831 5619907 5501673 5379193 5252956 5122271 4987064 4847823 4704308
56162D704308j48193j51850j53694j54839j56021j56012j53827j50560j47605
$$ 4704308 4556115 4404265 4250571 4095732 3939711 3783699 3629872 3479312 3331707
56153C331707j44770j41478j37748j32822j25233j15728j07643j02562r8138r1978
$$ 3331707 3186937 3045459 2907711 2774889 2649656 2533928 2426285 2323723 2225585 2133607
56143B133607q5061p8999p2805o5340n8525n4814n3200n0771m6851m2759l8876
$$ 2133607 2048546 1969547 1896742 1831402 1772877 1718063 1664863 1614092 1567241 1524482 1485606
56132A485606l4826l1330k9131k7152k4114k0764j8175j5417j1473p952o993p721
$$ 1485606 1450780 1419450 1390319 1363167 1339053 1318289 1300114 1284697 1273224 1265272 1258279 1250558
56120A250558p515n657l144j84L297N978O724O866Q331J0673J2426J3932J6000
$$ 1250558 1243043 1237386 1234242 1234058 1237355 1243333 1250057 1256923 1265254 1275927 1288353 1302285 1318285
56107A318285J7305J6170J3801J2760J3274J3833J4164J4732J4696J3461J2790
$$ 1318285 1335590 1351760 1365561 1378321 1391595 1405428 1419592 1434324 1449020 1462481 1475271
56096A475271J4269J6143J6084J5442J6975J9855K1142K1173K2950K6816L0206
$$ 1475271 1489540 1505683 1521767 1537209 1554184 1574039 1595181 1616354 1639304 1666120 1696326
56085A696326L2559L6192M1986M8197N4012O0771O9196P8664Q9490J02840J18069
$$ 1696326 1728885 1765077 1807063 1855260 1909272 1970043 2039239 2117903 2207393 2310233 2428302
56074B428302J32913J46099J56988J63315J62713J56376J48002J39542J31006
$$ 2428302 2561215 2707314 2864302 3027617 3190330 3346706 3494708 3634250 3765256
56065C765256J23489J18452J14385J08047R8631Q7057P1982N1285K7486O806q047
$$ 3765256 3888745 4007197 4121582 4229629 4328260 4415317 4487299 4538584 4566070 4572876 4564829
56054D564829k0085l2469m5076n7488p1196q7059j03565j18773j31350j39379
$$ 4564829 4544744 4512275 4467199 4409711 4338515 4251456 4147891 4029118 3897768 3758389
56044C758389j41279j38404j33870j28657j21729j13475j05584r7842q8904q0019
$$ 3758389 3617110 3478706 3344836 3216179 3094450 2980975 2875391 2777549 2688645 2608626
56034B608626p3996p0626o7081o2680n9088n6052n1531m6097m2427m0128l5896
$$ 2608626 2534630 2464004 2396923 2334243 2275155 2219103 2167572 2121475 2079048 2038920 2003024
56023B003024k9310k3627k0133j6518j1782p969n960m079j918j013q34J273N165
$$ 2003024 1973714 1950087 1929954 1913436 1901654 1893685 1887725 1883646 1881728 1880715 1879881 1881154 1886319
56010A886319P488P236P099Q412R479R791J1177J3648J4892J4754J5503J7072
$$ 1886319 1893807 1901043 1908142 1916554 1926033 1935824 1947001 1960649 1975541 1990295 2005798 2022870
55998B022870J7143J6496J8550K2865K5059K4211K4184K6293K7185K5807K5900
$$ 2022870 2040013 2056509 2075059 2097924 2122983 2147194 2171378 2197671 2224856 2250663 2276563
55987B276563K9167L2156L2603L2979L5323L8220M1095M5662N1015N3479N3447
$$ 2276563 2305730 2337886 2370489 2403468 2438791 2477011 2518106 2563768 2614783 2668262 2721709
55976B721709N5958O2156O7095O8458P0233P4522P7252P6012P5077P8207Q2688
$$ 2721709 2777667 2839823 2906918 2975376 3045609 3120131 3197383 3273395 3348472 3426679 3509367
55965C509367Q5030Q6639Q9695R3048R6045J00858J07696J13412J17708J24314
$$ 3509367 3594397 3681036 3770731 3863779 3959824 4060682 4168378 4281790 4399498 4523812
55955D523812J33486J40496J44494J51096J63008J76205J88843K04960K25160
$$ 4523812 4657298 4797794 4942288 5093384 5256392 5432597 5621440 5826400 6051560
55946F051560K42793K54557K66149K82210K99557L15700L34842L59509L85450
$$ 6051560 6294353 6548910 6815059 7097269 7396826 7712526 8047368 8406877 8792327
55937H792327M10954M41870M81050N22234N60925O01546O47067O91835P31902
$$ 8792327 9203281 9645151 10126201 10648435 11209360 11810906 12457973 13149808 13881710
55928A3881710P72166Q15890Q58156Q97411R42030R96931J055593J114144J180777
$$ 13881710 14653876 15469766 16327922 17225333 18167363 19164294 20219887 21334031 22514808
55919B2514808J261343J348398J434881J525674J624974J726427J827643J940303
$$ 22514808 23776151 25124549 26559430 28085104 29710078 31436505 33264148 35204451
55911C5204451K073448K221313K379853K559197K767294K999664L259121L564886
$$ 35204451 37277899 39499212 41879065 44438262 47205556 50205220 53464341 57029227
55903E7029227L926497M331828M778827N293707N898776O594128P396787Q363497
$$ 57029227 60955724 65287552 70066379 75360086 81258862 87852990 95249777 103613274
55895A03613274R545131J0961207J2661724J4770297J7416679K0675848K4607657
$$ 103613274 113158405 124119612 136781336 151551633 168968312 189644160 214251817
55888B14251817K9189131L3937363L7546535L8157677L4319310K5899233J4223733
$$ 214251817 243440948 277378311 314924846 353082523 387401833 413301066 427524799
55881D27524799J480886j0079550j8790771k3967558k5945745k5689209k4213515
$$ 427524799 429005685 418926135 400135364 376167806 350222061 324532852 300319337
55874C00319337k2242216k0209892j8371890j6837974j5597067j4603858j3838876
$$ 300319337 278077121 257867229 239495339 222657365 207060298 192456440 178617564
55867A78617564j3274356j2832341j2416623j1961838j1428827j0784608j0019776
$$ 178617564 165343208 152510867 140094244 128132406 116703579 105918971 95899195
55860I5899195r167145q277651p389918o535712n750701n056384m445842l905392
$$ 95899195 86732050 78454399 71064481 64528769 58778068 53721684 49275842 45370450
55852D5370450l436774l043502k712133k425148k179484j976165j803785j648406
$$ 45370450 41933676 38890174 36178041 33752893 31573409 29597244 27793459 26145053
55844B6145053j509449j390919j286491j187295j095467j016515r46401q78752
$$ 26145053 24635604 23244685 21958194 20770899 19675432 18658917 17712516 16833764
55836A6833764q16781p65565p19904o72038o24751n85136n51581n18131m85946
$$ 16833764 16016983 15251418 14531514 13859476 13234725 12649589 12098008 11579877 11093931
55827A1093931m59458m36303m11637l87785l69654l54919l38265l21335l09160
$$ 11093931 10634473 10198170 9786533 9398748 9029094 8674175 8335910 8014575 7705415
55818G705415l00419k89961k77693k66819k56440k43608k29681k17682k06552
$$ 7705415 7404996 7115035 6837342 6570523 6314083 6070475 5840794 5623112 5416560
55809E416560j94600j84810j80017j76617j69967j62119j57332j53804j47147
$$ 5416560 5221960 5037150 4857133 4680516 4510549 4348430 4191098 4037294 3890147
55800C890147j38572j32193j27211j19886j10586j02112r3748q3768p5258p2482
$$ 3890147 3751575 3619382 3492171 3372285 3261699 3159587 3065839 2982071 2906813 2834331
55790B834331p3643p3751p2558p3175p4916p4215p1070o8297o5746o1372n6587
$$ 2834331 2760688 2686937 2614379 2541204 2466288 2392073 2321003 2252706 2186960 2125588 2069001
55779B069001n4510n3934n1044m6263m3728m4520m5725m5653m5042m3621m0384
$$ 2069001 2014491 1960557 1909513 1863250 1819522 1775002 1729277 1683624 1638582 1594961 1554577
55768A554577l6898l5828l6556l6312l4888l4238l4396l3850l2978l3132l3207
$$ 1554577 1517679 1481851 1445295 1408983 1374095 1339857 1305461 1271611 1238633 1205501 1172294
55757A172294l1244k8174k6170k4464k1015j7060j5524j5824j4610j1113p658
$$ 1172294 1141050 1112876 1086706 1062242 1041227 1024167 1008643 992819 978209 967096 959438
55746I59438n393l518k184k260k666j659k11n90k311l142l335m942p630r114r328
$$ 959438 954045 950527 948343 946083 943417 941758 941547 940957 938646 935504 932169 927227 919597 910483 901155
55731I01155j0277j1914j2045j0344q907q656q477q048q343r156q906p151m916
$$ 901155 890878 878964 866919 856575 847668 839012 830535 822487 814144 804988 796082 788931 784015
55718G84015k902j541k002m643p476q872j0390j3957j7696j8286j6241j4794j4291
$$ 784015 781113 779572 777570 772927 765451 756579 746189 732232 714536 696250 680009 665215 650924
55705F50924j2092p895m880m880o162o906p650r272j1237j2727j3505j3303j2252
$$ 650924 638832 630937 626057 621177 615015 608109 600459 591187 579950 567223 553718 540415 528163
55692E28163j1716j2595j3434j2565j1348j2371j5045j6097j4286j1498r337p673
$$ 528163 516447 503852 490418 477853 466505 454134 439089 422992 408706 397208 387871 380198
55680C80198o484o208o043m706k889k278k416j356P06J696J353J371J784P08j815
$$ 380198 373714 367506 361463 356757 353868 351590 349174 347818 348524 350220 351573 352944 354728 355436 353621
55665C53621l232k591k038l130m545m722m095l452k462j144p41j855l398m220
$$ 353621 350389 347798 345760 342630 338085 333363 329268 325816 323354 322210 321469 319614 316216 311996
55651C11996m221l415j639M24J814L043N361Q192R516Q954Q018P127N083J973
$$ 311996 307775 304360 302721 303145 304959 308002 313363 321555 331071 340025 348043 355170 360253 362226
55637C62226j68m55m03j049j267k6J834L224M134M377L127Q85j66Q50J957J101
$$ 362226 362058 361603 361200 360151 358884 358858 360692 363916 368050 372427 375554 376439 376273 377123 379080 380181
55621C80181j136k837l217k500q33J278K485J879R3j552k139j109J526M283M978
$$ 380181 379045 376208 372991 370491 369658 370936 373421 375300 375393 373841 371702 370593 372119 376402 381380
55606C81380L231J130P74K237M262N703N685L947J820J512L493N623N773M235
$$ 381380 384611 385741 386515 388752 393014 398717 404402 408349 410169 411681 415174 420797 426570 430805
55592D30805K820K421K368J506o28l326n219n715n744o312o848o328n568o567
$$ 430805 433625 436046 438414 439920 439292 435966 430747 425032 419288 412976 406128 399800 394232 387665
55578C87665r432j1868j2124j0883r672q984q668q801r301r700r825r905r757
$$ 387665 378233 366365 354241 343358 333686 324702 316034 307233 297932 288232 278407 268502 258745
55565B58745q946p846p302p175o589n738n753o458o111m075k061j780k844l875
$$ 258745 249799 241953 234651 227476 220887 215149 209396 202938 196827 192752 190691 188911 186067 182192
55551A82192m430m604m000k328l45Q45J038O96L1r69j927k166j394j45N48J49
$$ 182192 177762 173158 169158 166830 166485 167330 168368 169064 169095 168126 166199 164033 162639 162494 163042 163191
55535A63191n84l78O49P76p81k332j997n53j16p49o65N84J479J261R17J020Q01
$$ 163191 162607 162229 162878 163654 162873 160541 158544 157991 157875 157126 156461 157045 158524 159785 160702 161722 162523
55518A62523J31L41J920L243K873J666J291J839K195K062K313L633N650P277P684
$$ 162523 162654 162995 164915 168158 171031 172697 173988 175827 178022 180084 182397 186030 191680 198957 206641
55503B06641P097O505O247N422L455J400M02l52k317m814n676m598l535l651m134
$$ 206641 213738 220243 226490 231912 235367 236767 237169 236817 234500 229686 224010 219412 215877 212226 208092
55488B08092m419n246o601o955n634m018l199k323n76R81J054J75l41k70P6R73
$$ 208092 203673 198427 191826 184871 179237 175219 172020 169697 169121 170102 171156 171331 170990 170720 170796 171769
55472A71769K459L461L201K509K388K254J096m05o15O46J890K078J622J288J175
$$ 171769 174228 177689 180890 183399 185787 188041 189137 188732 188117 188763 190653 192731 194353 195641 196816
55457A96816J005P33M92J47q46k889n339o501n399l307k596l914n553n777m681
$$ 196816 197821 198554 199046 199193 198347 195458 190119 183618 178219 174912 172316 168402 162849 157072 152391
55442A52391l339k310j607j387j815k767l929n015n709n908n862n678n048m095
$$ 152391 149052 146742 145135 143748 141933 139166 135237 130222 124513 118605 112743 107065 102017 97922
55428I7922l748m229m021j883P17J135q08k785l424l538l705l095j425QK17l12
$$ 97922 94174 89945 85924 84041 84758 85893 85085 82300 78876 75338 71633 68538 67113 67121 67338 67026
55412F7026j073k285l409k926p15J159J173K99J15O38J168J664K025J484Q2o75
$$ 67026 65953 63668 60259 57333 56618 57777 58950 59249 59364 60002 61170 62834 64859 66343 66425 65750
55396F5750R8J254J444J002P93O30J54p2J75k62k130m064m227k723j003J75Q32
$$ 65750 65848 67102 68546 69548 70341 70971 71125 71053 71228 70966 68836 64772 60545 57822 56819 56994 57826
55379E7826Q00J09m57l91k52m92n29j1K85l1O8J142J927J400Q09J583K559J595
$$ 57826 58626 58735 58278 57887 57635 57143 56614 56603 56888 56857 56925 58067 59994 61394 62203 63786 66345 67940
55361F7940q29k071j075M78Q79K76l82p27q49p56l56M84J645K303J558rn59M64
$$ 67940 67111 65040 63965 64443 65322 65598 65216 64489 63640 62884 62528 63012 64657 66960 68518 68509 67950 68414
55343F8414J327O46m79n01j18p88j728r32J290K383J291j36p0Q59R11l71j959
$$ 68414 69741 70387 69908 69407 69289 68501 66773 65841 67131 69514 70805 70669 70599 71458 72369 71998 70039
55326G0039k720k265j003J80N59J31m85n74J89J260J268n82l055l955k862j426
$$ 70039 67319 65054 64051 64231 64790 64921 64436 63862 64051 65311 66579 65997 62942 58987 56125 54699
55310E4699o70J97J535K007R30j31R2K68j094k614k061j85L95o44j240n78Q0K62
$$ 54699 54029 54226 55761 57768 58698 58567 58659 58927 57833 55219 53158 52973 53368 52724 51484 50906 50986 51248
55292E1248J095K710L381K088n0j650k470k428j204L31J54k312m934n256l140
$$ 51248 52343 55053 58434 60522 60472 58822 56352 53924 52720 53051 53205 50893 45959 40703 37563
55277C7563l24J680K536K783L120L571L322K086J098J532K261J111j700l353k244
$$ 37563 37239 38919 41455 44238 47358 50929 54251 56337 57435 58967 61228 62339 60639 57286 55042
55262E5042j31N64K5K09J776L211K829P59j150j196L06J266K46j822l116l291
$$ 55042 54911 55475 55500 55709 57485 60696 63525 64284 63134 61938 62244 63510 63756 61934 58818 55527
55246E5527l127k559r23R83J323J5r01l14M42J44k09O87J860J272j100l035k736
$$ 55527 52400 49841 48918 49901 51224 51239 50338 50024 50466 50610 50401 51088 52948 54220 53120 50085 47349
55229D7349n88J590K226J104n07r42J43J392J397K60q03r43k94M48O62L08J8L15
$$ 47349 46761 48351 50577 51681 51174 50232 50375 51767 53164 53424 52621 51678 51384 51832 52494 52802 52820 53135
55211E3135O76R2j321k149j478m6R89J517J944K003J160j40p19j53P49J025M70
$$ 53135 53811 53903 52582 50433 48955 48909 49898 51415 53359 55362 56522 56382 55663 55510 56259 57284 57754
55194E7754n28j430j681r89K27J083J217J200J524J633O74q41j220J01J321M04
$$ 57754 57226 55796 54115 53126 53353 54436 55653 56853 58377 60010 60684 59843 58623 58724 60045 60449
55178F0449k164l960l745k553j511k82J628L377L743K734J216k11j105q62M06
$$ 60449 58285 54325 50580 48027 46516 46234 47862 51239 54982 57716 58932 58721 57616 56754 57160
55163E7160J435J351Q33P85Q32M08K14R03J317J46j395r75J153K328J515N96J032
$$ 57160 58595 59946 60779 61564 62396 62804 63018 63921 65238 65384 63989 63014 64167 66495 68010 68606 69638
55146F9638J803J687J327J505J176p98l256l842k089J45R37m5j727k603j874l60
$$ 69638 71441 73128 74455 75960 77136 76338 73082 69240 67151 67296 68233 68188 66461 63858 61984 61624
55130F1624J82q15j936j800r22n29l82P01K473L127J874K21p0O09M12j281k906
$$ 61624 61806 60991 59055 57255 56333 55804 55422 56123 58596 61723 63597 63818 63748 64357 64769 63488 60582
55113F0582k671o80J380K167J687O56l39r48j063r74j016q39K19J827K575J707
$$ 60582 57911 57231 58611 60778 62465 63121 62782 61834 60771 59797 58781 57942 58161 59988 62563 64270
55097F4270P7j233k167k820k513j031J91j72j157p49J049K318K183J742J843J807
$$ 64270 64347 63114 60947 58127 55614 54583 54774 54602 53445 52696 53745 56063 58246 59988 61831 63638
55081F3638R33k57j012j286j106k95O77P80K1k38Q26K307K934K591J812Q97J83
$$ 63638 64571 64314 63302 62016 60910 60615 61292 62072 62093 61855 62681 64988 67922 70513 72325 73222 73405
55064G3405K22Q57J090O21N70J815L429L806K762J478P39J46r84k591l756l456
$$ 73405 73627 74484 75574 76195 76765 78580 82009 85815 88577 90055 90794 90940 89956 87365 83609 80153
55048H0153j570P40K071K134J717J503J657K248L088L259K060M28N3Q85J039l89
$$ 80153 78583 79323 81394 83528 85245 86748 88405 90653 93741 97000 99060 99488 99541 100426 101465 101076
55032A01076j978k213j484q30j38J038J973J704Q08P47J743K590K542K111J875
$$ 101076 99098 96885 95401 94571 94433 95471 97444 99148 99956 100703 102446 105036 107578 109689 111564
55017A11564J497L74j275k424k320j341m97r3N23J528J716J52j897k284j025k80
$$ 111564 113061 113435 112160 109736 107416 106075 105578 105485 106008 107536 109252 109404 107507 105223 104198 103918
55001A03918j040j731q52Q36J872K279K863L438L268K445J594Q82K93J98N23K22
$$ 103918 102878 101147 100295 101131 103003 105282 108145 111583 114851 117296 118890 119772 120065 120263 120786 121008
54985A21008j348l153l729l025j944q08N13J582J816J530J448J548J334Q27K40
$$ 121008 119660 116507 112778 109753 107809 107001 107514 109096 110912 112442 113890 115438 116772 117599 117839
54970A17839p66k358l498k942r59R66J913K041J730J275J074J178R85K65r6O03
$$ 117839 117073 114715 111217 108275 107316 108282 110195 112236 113966 115241 116315 117493 118478 118743 118647 119250
54954A19250J511J419P23O53J033N37r48k021j890j317j104j077r47r11r35o01
$$ 119250 120761 122180 122903 123556 124589 125126 124178 122157 120267 118950 117846 116769 115822 114911 113976 113375
54938A13375p1j19q11j216q23k25Q3M60J127J455R59K65K69R52J741K512L450
$$ 113375 113304 113185 112374 111158 110335 110110 110193 110653 111780 113235 114194 114459 114728 115680 117421 119933 123383
54921A23383M216L983K354j3j725j575M09K822M064L780K880K242J925J656J427
$$ 123383 127599 131582 133936 133923 132198 130623 131032 133854 137918 141698 144578 146820 148745 150401 151828
54906A51828J358J466J730K140K576K928L288L647L764L817M754P137R848J1148
$$ 151828 153186 154652 156382 158522 161098 164026 167314 170961 174725 178542 183296 190433 200281 211429
54892B11429J0964J0934J1953J3055J3358J3670J5075J6778J6733J4052R662M912
$$ 211429 222393 233327 245280 258335 271693 285363 300438 317216 333949 348001 357663 362575
54880C62575N97k727m626n482o483q423j0780j2301j2291j1173r981r378r080
$$ 362575 363172 360445 355819 350337 343854 335431 324651 312350 300059 288886 278905 269527 260447
54867B60447q419p482p279q256r174q454o407m913m636l956j558J188J966R84
$$ 260447 252028 244546 237267 229011 219837 211383 204976 200063 195427 191471 189913 191101 193067 194051
54853A94051P88K593M670N153M795N598P811R898J0998J1792J2871J3750J3872
$$ 194051 194839 197432 202102 207255 212050 217648 225459 235357 246355 258147 271018 284768 298640
54840B98640J3337J2049R203M515o74m507o644q311j0316j1870j1817j0484r533
$$ 298640 311977 324026 333229 337744 337070 332563 325919 317608 307292 295422 283605 273121 263588
54827B63588r827j0310r557p886p001p598q448q156o734m951l174j770j569k802
$$ 263588 253761 243451 233894 226008 219007 211409 202961 194805 188071 183120 179946 178176 176607 173805
54813A73805m266m809m987n955p327p673o741n484m117j993M52J583Q06n93j393
$$ 173805 169539 164730 159743 153788 146461 138788 132047 126563 122446 120453 120905 122488 123294 122701 121308
54798A21308j672j668r93K81J227J447J533J543O63q73j313L0J337Q10q02j744
$$ 121308 119636 117968 116975 117256 118483 119930 121463 123006 123669 122796 121483 121513 122850 123660 122858 121114
54782A21114j965k523l245k920j433p7R5q46k094k517j386L75N97j309k849j326
$$ 121114 119149 116626 113381 110461 109028 108951 109046 108200 106106 103589 102203 102578 103175 101866 99017 97691
54766I7691K546N542N919M830M010L711L165J920M25k11P53K437K972K020J484
$$ 97691 100237 105779 111698 116528 120538 124249 127414 129334 129759 129548 130301 132738 135710 137730 139214
54751A39214K659M041L613K084J655K526L070L058M072O459Q432Q885Q983J0016
$$ 139214 141873 145914 149527 151611 153266 155792 158862 161920 165992 172451 180883 189768 198751 208767
54737B08767J1487J2438J3195J4593J6381J7479J7232J5792J3750J1740R814P156
$$ 208767 220254 232692 245887 260480 276861 294340 311572 327364 341114 352854 362668 369824
54725C69824L135j410m771o339o928p296p476p551p767p713o722n374n265o853
$$ 369824 372959 371549 366778 360439 353511 346215 338739 331188 323421 315708 308986 303612 298347 291494
54711B91494q618q950p733n813l942k688k252j990j099P8O25J052K977O284Q461
$$ 291494 282876 273926 266193 260380 256438 253750 251498 249508 248409 248487 249112 250164 253141 259425 267886
54696B67886P952O622P331J0186J2810J3780J4113J5383J7636J9362J8961J6113
$$ 267886 275838 282460 289791 299977 312787 326567 340680 356063 373699 393061 412022 428135
54684D28135J2032Q274N107J546k822o812r094r964j0815j2336j4043j5363j6288
$$ 428135 440167 448441 453548 455094 452272 445460 436366 426402 415587 403251 389208 373845 357557
54671C57557j6864j6719j5534j3663j2019j1266j1136j0744r631q317p538p243
$$ 357557 340693 323974 308440 294777 282758 271492 260356 249612 239981 231664 224126 216883
54659B16883o808n975m969l909k848k298k830m026m524l540j778o25p97j826k468
$$ 216883 210075 204100 199131 195222 192374 190076 187246 183220 178696 175156 173378 172753 171956 170130 167662
54644A67662j665L26J893J738M28l62l4M16P3p37j179j027o45m08l61j26P55J922
$$ 167662 165997 166323 168216 169954 170382 170020 169986 170402 170475 169738 168559 167532 166887 166479 166118 165992 166747 168669
54626A68669K098P46o64k49J610K626J776N46O28J743K610K883L124L559L878
$$ 168669 170767 171513 170849 170600 172210 174836 176612 177158 177786 179529 182139 185022 188146 191705 195583
54611A95583L986M182M656N131N034M109K929K532L135L805L904M063M815N257
$$ 195583 199569 203751 208407 213538 218572 222681 225610 228142 231277 235082 238986 243049 247864 253121
54597B53121M554L930N130P283P607N352K761J655J425J218J761L569N263N528
$$ 253121 257675 261605 266735 274018 281625 286977 289738 291393 292818 294036 295797 299366 304629 310157
54583C10157N232N954P442Q316Q452Q985J0350J1644J1814J0539Q124N178K112
$$ 310157 315389 321343 328785 337101 345553 354538 364888 376532 388346 398885 407009 412187 414299
54570D14299j255n094q497j0160j0341j0678j1650j1821j0428q954q883r431r054
$$ 414299 413044 407950 399453 389293 378952 368274 356624 344803 334375 325421 316538 307107 298053
54557B98053p912p093o509n345l875l051k835k439j752j165m66O19J305O63o56
$$ 298053 290141 283048 276539 271194 267319 264268 261433 258994 257242 256077 255611 256230 257535 258198 257542
54542B57542j021m2J054J113J59r62j269m72J65j338n007q101q308o756o204p137
$$ 257542 256521 256479 257533 258646 258805 257843 256574 256102 256267 254929 249922 241821 233513 226757 220553 213416
54526B13416p642o649n202m462m366m468m620m463l601k469j988k252k573k615
$$ 213416 205774 199125 193923 189461 185095 180627 176007 171544 167943 165474 163486 161234 158661 156046
54512A56046k430j716k95R71J098N17L07K70n52j790k077j413j240j941k212j421
$$ 156046 153616 151900 151605 152576 153674 154191 154498 154768 154216 152426 150349 148936 147696 145755 143543 142122
54496A42122o89r05j296q57J07P80R83P84N2q63j032j64R50J696K354L145L646
$$ 142122 141433 140528 139232 138375 138482 139262 140245 141029 141081 140218 139186 139022 139972 141668 144022 147167 150813
54479A50813L612L329K752J509K26M05K293M166M572M012L632L609L841M758O093
$$ 150813 154425 157754 160506 162015 162241 162646 164939 169105 173677 177689 181321 184930 188771 193529 199622
54464A99622O135L879R94j58K05j91k210m287m920m468l961l614l342l590m596
$$ 199622 205757 209636 210630 210472 210677 210486 208276 203989 199069 194601 190640 187026 183684 180094 175498
54449A75498n483n062l427j955j600j747j189P0O59m01k315l364k789j267J89
$$ 175498 170015 164953 161526 159571 157971 156224 155035 155105 155764 155363 153048 149684 146895 145628 145817
54434A45817J006Q99rq12m40R37K056K381K805L875M412L049N02r42m4K148L659
$$ 145817 146823 147722 147713 146901 146461 147398 149454 151835 154640 158515 162927 165976 166478 165536 165492 167640 171299
54417A71299L395J747J55J39J901L796L734J421j354k648k098n90J032K379L095
$$ 171299 174694 176441 176596 176735 178636 182432 186166 187587 186233 183585 181487 180897 181929 184308 187403
54402A87403K760J409k55j372j543q69M47K092L312L070J142j223k295j646n14
$$ 187403 190163 191572 191317 189945 188402 187533 187980 190072 193384 196454 197596 196373 194078 192432 191918
54387A91918k69j025j984k581k837k885k724k408k074j727j233o04j11q0n70j168
$$ 191918 191649 190624 188640 186059 183222 180337 177613 175205 173131 171404 170171 169567 169456 169376 168806 167638
54371A67638j193l94N21M73o00j476j044K58R83M62n87j119q18M7J192K212K495
$$ 167638 166445 166051 166572 167045 166445 164969 163925 164183 165166 165628 165041 163922 163104 163151 164343 166555 169050
54354A69050J878J227J595K818L647L481L146L373L435K319Q18Q95K817M383L825
$$ 169050 170928 172155 173750 176568 180215 183696 186842 190215 193650 195969 196787 197682 200499 204882 208707
54339B08707K355K599N116P769Q446P232N737N232N785O486O123M159J348r57
$$ 208707 211062 213661 218777 226546 234992 242224 247961 253193 258978 265464 271587 275746 277094 276137
54325B76137k161k617k535j679l96o4j594m105n769n805m996m434m437m576m203
$$ 276137 273976 271359 268824 267145 266749 266685 265091 260986 255217 249412 244416 239982 235545 230969 226766
54310B26766k962j379p58j899l807m514l450k228k536l942m669m030k913j998
$$ 226766 223804 222425 221667 219768 215961 211447 207997 205769 203233 199291 194622 190592 187679 185681
54296A85681q97N13J203M91m57K7J727K742K081P26rR1P15J872L339M271M221
$$ 185681 184784 185297 186500 186991 186534 186561 188288 191030 193111 193837 193828 193919 194634 196506 199845 204116 208337
54279B08337L937M368N391O161O199N459L979K207J089R56Q65Mr45r53o34j580
$$ 208337 212274 216642 222033 228194 234393 239852 243831 246038 247127 248083 248948 248952 248007 247054 246420 244840
54263B44840l889n833o187n514m898m584m373m301m390m545n031o124p012o321
$$ 244840 240951 235118 228931 223417 218519 213935 209562 205261 200871 196326 191295 185171 178159 171838
54249A71838m275l086m152n949n938l866j721r16r64r55q91j068j231j070r34
$$ 171838 167563 164477 160325 154376 148438 144572 142851 141935 140971 140016 139125 138057 136826 135756 134822
54234A34822j413k520l585l731k341M46L261M134K277r57l396m098l657k772j463
$$ 134822 133409 130889 127304 123573 121232 121678 124939 129073 131350 130393 126997 122899 119242 116470 115007
54219A15007J90J546K101K084J860J354O09K80P33J139N49n01o01L51R08K81m49
$$ 115007 115197 116743 118844 120928 122788 124142 124751 125031 125764 126903 127452 126951 126350 126701 127609 127890 127441
54202A27441L6J421K340K167J445J006J172J566J334L3j538k005j167j98J67N87
$$ 127441 127477 128898 131238 133405 134850 135856 137028 138594 139928 139961 138423 136418 135251 135053 135220 135807
54186A35807J581K268J653K74n75o56o83q99q61l67L88J285K125K402J974J368
$$ 135807 137388 139656 141309 141583 141008 140352 139669 138770 137909 137542 137930 139215 141340 143742 145716 147084
54170A47084P24o82k844m077l067j106n00j353j776r02K78J030J771K595K752
$$ 147084 147808 147126 144282 140205 137138 136032 135532 134179 132403 131501 131779 132809 134580 137175 139927
54155A39927K155J783J945J710N96n23q55p50p32o66m98n75o62J04J553K103Q74
$$ 139927 142082 143865 145810 147520 148116 147593 146738 145988 145256 144590 144092 143517 142855 142959 144512 146615 147489
54138A47489r95k042k355k712k880k125p84n4l52q79q07k43M9l87j169j532j379
$$ 147489 146494 144452 142097 139385 136505 134380 133596 133542 133190 132311 131504 131261 131310 130923 129754 128222 126843
54121A26843j429j916j779j50J890K436J339J43m04r65j652j467m14j65j642l494
$$ 126843 125414 123498 121719 121569 123459 125895 127234 127377 126973 126008 124356 122889 122475 122310 120668 117174
54105A17174m057l354k116m02J482K164R19q16j144n3J201K078K656K438R78p78
$$ 117174 113117 109763 107647 107245 108727 110891 111810 110994 109850 109797 110998 113076 115732 118170 119148 118370
54089A18370j355o01M19J042J298J032L5j222k044k406k509k008o31Q48J413J105
$$ 118370 117015 116414 116833 117875 119173 120205 120240 119018 116974 114568 112059 110051 109420 110268 111681 112786
54073A12786N96L4o77j107r62q64j308j471m66R27J243N47M9m1m94j129q23M22
$$ 112786 113382 113416 112739 111632 110670 109806 108498 107027 106561 107488 108731 109278 109327 109286 108792 107663 106840 107262
54055A07262J201Q63L42L05j1j249k551k618j491m16l98j383k493k736j782k30
$$ 107262 108463 109326 109668 109973 109962 108713 106162 103544 102053 101637 101239 99856 97363 94627 92845 92615
54039I2615J123K066K649K443R75j242k860k964j678K81K049K866K584J840J137
$$ 92615 93738 95804 98453 100896 101871 100629 97769 94805 93127 93408 95457 98323 100907 102747 103884
54024A03884K74p52j000J35J576J869J316J271J629R52q46j845q12J117K204K211
$$ 103884 104158 103406 102406 102541 104117 105986 107302 108573 110202 111154 110308 108463 107651 108768 110972 113183
54008A13183J878J541J314J612K399K537J065j279k612j908J68K143K968K604
$$ 113183 115061 116602 117916 119528 121927 124464 125529 124250 121638 119730 119898 122041 125009 127613
53994A27613J891J701J998J956J135J88J23J181K726L986M585M565M182L775L772
$$ 127613 129504 131205 133203 135159 136294 136482 136605 137786 140512 144498 149083 153648 157830 161605 165377
53979A65377M564N930O693N662L388K147L394N803O804N683M194M281O206Q760
$$ 165377 169941 175871 182564 188226 191614 193761 197155 202958 209762 215445 219639 223920 230126 238886
53965B38886J0357R982Q000O130N809O729P615Q068Q548Q921Q428O990N274L417
$$ 238886 249243 259225 267225 273355 279164 285893 293508 301576 310124 319045 327473 334463 339737 343154
53951C43154J115j064j970j652j355j500j369j018j581k969l386k255j625l040
$$ 343154 344269 343205 341235 339583 338228 336728 335359 334341 332760 329791 326405 324150 322525 319485
53937C19485m773m389k703k806n514q249q558o786m748l453k888k838l021l051
$$ 319485 314712 310323 307620 304814 299300 291051 282493 275707 270959 267506 264618 261780 258759 255708
53923B55708k949l213l964m509m204l241k297j670j231q38m19K21J149J847J534
$$ 255708 252759 249546 245582 241073 236869 233628 231331 229661 228430 227592 227173 227394 228543 230390 231924
53908B31924K20r54r29q6K77j42j05J295L092L605K646J488R31O01K12K39Q80
$$ 231924 232144 231190 230261 230175 230452 230310 230205 231500 234592 238197 240843 242331 243262 243863 244075 244314 245194
53891B45194J407J108K03o69j039l30K040N398P528O712L825J357O37Q76J026
$$ 245194 246601 247709 247912 247243 246204 245874 247914 253312 260840 267552 271377 272734 273371 274247 275273
53876B75273J465L247O204Q547Q635O640M104K000Ok120l417k751n04J722K791
$$ 275273 276738 279985 286189 294736 303371 310011 314115 316115 316121 314001 310584 307833 307329 309051 311842
53861C11842K587J352k66p91R07L791N470N177M600N274O615P292P071O487N824
$$ 311842 314429 315781 315515 314724 315631 319422 324892 330069 334669 339943 346558 353850 360921 367408 373232
53846C73232N567O556Q506R536Q504O785O259O546N946M373L265K960K242O33
$$ 373232 378799 385355 393861 403397 411901 418686 424945 431491 437437 441810 445075 448035 450277 450910
53832D50910q16j471k178l618n009n321m844m668n269o311p309p956q157q134
$$ 450910 450094 448623 446445 442827 437818 432497 427653 422985 417716 411405 404096 396140 387983 379849
53818C79849q241q545q910r333r663r160p388n434n067o347p270o438m947m662
$$ 379849 371608 363063 354153 344820 335157 325997 318609 313175 308108 301761 294491 288053 283106 278444
53804B78444n584o095n375m226l563l252k817k436k657l480m220m284l840l641
$$ 278444 272860 266765 261390 257164 253601 250349 247532 245096 242439 238959 234739 230455 226615 222974
53790B22974m119m786m776m046l581m051m609l738j275J054J441j1j513j636o79
$$ 222974 218855 214069 209293 205247 201666 197615 193006 189268 187993 189047 190488 190477 188964 187328 186649
53775A86649ml58j172j435q93j59J90K19K97N05O94Q24Q64N41l02j150j185l54
$$ 186649 186645 186287 185115 183680 182787 182628 182818 183037 183334 183839 184533 185357 186221 186762 186460 185310 184125 183771
53757A83771N44J064J666K575K896J824K93J41J728L523M237M135L874L384K647
$$ 183771 184315 185379 187045 189620 192516 194340 194633 194774 196502 200025 204262 208397 212271 215655 218302
53742B18302K445L260M254M485M395M860N447N210M725N538P547Q741Q054O784
$$ 218302 220747 224007 228261 232746 237141 242001 247448 252658 257383 262921 270468 279209 287263 294047
53728B94047O353O112M652K349J153K069M050N433N652N261M874M458L666K558
$$ 294047 300400 306512 311164 313513 314666 316735 320785 326218 331870 337131 342005 346463 350129 352687
53714C52687J666J214P47j16r97j566k442m212n788n242k522KK78j234k725l272
$$ 352687 354353 355567 356314 356198 355201 353635 351193 346981 341193 335951 333429 333431 333709 332475 329750 326478
53698C26478l106k644k233k295k845l414l881m695n693n713m210k315j205l76
$$ 326478 323372 320728 318495 316200 313355 309941 306060 301365 295672 289959 285749 283434 282229 281853
53684B81853J231L140L865L106J866O78q33k544l470l104k125j434j388k033l167
$$ 281853 283084 286224 290089 293195 295061 295739 294906 292362 288892 285788 283663 282229 280841 278808 275641
53669B75641m010l748k661j921k081k610k978l198k967j456J314L591L396P88
$$ 275641 271631 267883 265222 263301 261220 258610 255632 252434 249467 248011 249325 252916 256312 257100
53655B57100k001k744j327L40M89m57l35K007N035O193M948L232L008M188N201
$$ 257100 255099 252355 251028 251368 251857 251400 251065 253072 258107 264300 269248 272480 275488 279676 284877
53640B84877M846L441K600L802O665Q809Q291O048M946O309Q541R399Q455O816
$$ 284877 289723 293164 295764 299566 306231 315040 323331 329379 334325 340634 349175 358574 367029 373845
53626C73845N500M932N156N645N499M558L832M122M796M744L945L137K393J246
$$ 373845 379345 384277 389433 395078 400577 405135 408967 413089 417885 422629 426574 429711 432104 433350
53612D33350M6l7J247K562K571J542O76L16l63j869l300l229j508L16O73k72j007
$$ 433350 433396 433359 434606 437168 439739 441281 441957 442273 441910 440041 436741 433512 432004 432320 432993 432721 431714
53595D31714p42k78n60j110p80L49R23K85n44m13K18mj204j978j292J68J087J180
$$ 431714 430972 430694 430134 429024 428244 428593 429516 429801 429257 428844 429062 429058 427854 425876 424584 424752 425839 427019
53577D27019J069Q98M3j662l315m009l897l667l284k025K49K476L447L132K621
$$ 427019 428088 428986 429029 427367 424052 420043 416146 412479 409195 407170 407419 409895 413342 416474 419095
53562D19095K851L708M442M692M717M700M286L238K278K604M393O418P454P647
$$ 419095 421946 425654 430096 434788 439505 444205 448491 451729 454007 456611 461004 467422 474876 482523
53548D82523P981Q722R091Q521P612P517Q568R803R900Q591P134P205R146J1503
$$ 482523 490504 499226 508317 516838 524450 531967 540535 550338 560238 568829 575963 583168 592314 603817
53534F03817J2520J1944J0946J0318R518P838O060N972Q023J0248J0302Q327O896
$$ 603817 616337 628281 639227 649545 659063 666901 672961 678933 686956 697204 707506 715833 722729
53521G22729P908J0332J1633J0755Q896P647P361P434P338O995O666O661O842
$$ 722729 730637 740969 752602 763357 772253 779900 787261 794695 802033 809028 815694 822355 829197
53508H29197O564N586M802N092N657M780K518J186K313M390M858L405J963J752
$$ 829197 835761 841347 846149 851241 856898 861678 864196 865382 867695 872085 876943 880348 882311 884063
53494H84063J903J141k55p99L95K449L456K422M46n25n0N42L31O8N81J203R52
$$ 884063 885966 887107 886852 886053 886448 888897 892353 894775 895221 894696 894646 895188 895519 895587 896168 897371 898323
53477H98323L01L37R13J194J492K800M707N607N176M877N590O344O217O053P255
$$ 898323 898624 898961 899874 901068 902560 905360 910067 915674 920850 925727 931317 937661 943878 949931 957186
53462I57186R776J2392J4303J5551J6322J6677J6874J7381J8605K0683K3277K5561
$$ 957186 966962 979354 993657 1009208 1025530 1042207 1059081 1076462 1095067 1115750 1139027 1164588
53450A164588K6894K7602K8585L0148L1930L3948L6726M0069M2627M3369M2966
$$ 1164588 1191482 1219084 1247669 1277817 1309747 1343695 1380421 1420490 1463117 1506486 1549452
53439A549452M3066M4650M7439N0422N2531N3237N3023N3022N3925N5455N6986
$$ 1549452 1592518 1637168 1684607 1735029 1787560 1840797 1893820 1946842 2000767 2056222 2113208
53428B113208N8179N8915N9219N9447N9904O0227N9881N9372N9927O1579O2670
$$ 2113208 2171387 2230302 2289521 2348968 2408872 2469099 2528980 2588352 2648279 2709858 2772528
53417B772528O2084O0974O1087O2008O1399N7979N3103M9120M7007M6059M5294
$$ 2772528 2834612 2895586 2956673 3018681 3080080 3138059 3191162 3240282 3287289 3333348 3378642
53406C378642M4404M3283M1377L8048L3656K9565K6759K4925K3346K1981K0740
$$ 3378642 3423046 3466329 3507706 3545754 3579410 3608975 3635734 3660659 3684005 3705986 3726726
53395C726726J8368J3611P437K537O2j821n462j0975j6690k1235k4214k5892k7347
$$ 3726726 3745094 3758705 3766142 3768679 3768741 3766920 3761458 3750483 3733793 3712558 3688344 3662452 3635105
53382C635105l0163l4722l9338m2144m3319m4326m5610m6558m7363m9201n2250
$$ 3635105 3604942 3570220 3530882 3488738 3445419 3401093 3355483 3308925 3261562 3212361 3160111
53371C160111n4923n5698n4833n3604n2547n1112m8783m5973m3746m2685m2092
$$ 3160111 3105188 3049490 2994657 2941053 2888506 2837394 2788611 2742638 2698892 2656207 2614115
53360B614115m0604l7694l4156l0786k7275k3066j8657j5098j2402r512n733j380
$$ 2614115 2573511 2535817 2501661 2470875 2443600 2420534 2401877 2386779 2374377 2364865 2359132 2357752
53348B357752L061P444J1628J5480J9377K3821K8464L2289L5072L7719M0937M4528
$$ 2357752 2360813 2368257 2379885 2395365 2414742 2438563 2467027 2499316 2534388 2572107 2613044 2657572
53336B657572M8270N2484N7086O1062O3817O6221O9422P3229P6761Q0098Q4043
$$ 2657572 2705842 2758326 2815412 2876474 2940291 3006512 3075934 3149163 3225924 3306022 3390065
53325C390065Q8467R2406R5836R9846J04424J07591J07958J07341J09223J14677
$$ 3390065 3478532 3570938 3666774 3766620 3871044 3978635 4086593 4193934 4303157 4417834
53315D417834J21035J24918J25481J24268J22827J21520J20172J18691J16738
$$ 4417834 4538869 4663787 4789268 4913536 5036363 5157883 5278055 5396746 5513484
53306E513484J13626J09072J03653R8167R2713Q6836Q0418P4005O8089O2425N6308
$$ 5513484 5627110 5736182 5839835 5938002 6030715 6117551 6197969 6271974 6340063 6402488 6458796
53295F458796M9426M2045L4387K6238J7379Q064j322j0812k0526l0082l9150m8518
$$ 6458796 6508222 6550267 6584654 6610892 6628271 6636335 6635013 6624201 6603675 6573593 6534443 6485925
53283F485925n9511p1942q3616r2565r8947j03928j07763j10297j12510j15618
$$ 6485925 6426414 6354472 6270856 6178291 6079344 5975416 5867653 5757356 5644846 5529228
53273E529228j18751j19541j17588j15571j15969j18007j19025j17879j15663
$$ 5529228 5410477 5290936 5173348 5057777 4941808 4823801 4704776 4586897 4471234
53264D471234j13731j12317j10856j08657j05218j00720r5987r1453q6502q0520
$$ 4471234 4357503 4245186 4134330 4025673 3920455 3819735 3723748 3632295 3545793 3465273
53254C465273p4163o8756o4618o0855n6669n2074m7403m2927l8976l5756l2857
$$ 3465273 3391110 3322354 3257736 3196881 3140212 3088138 3040735 2997808 2958832 2923076 2890219
53243B890219k9572k5744k1817j8097j4458j0808p191l611k48K203L182L177L406
$$ 2890219 2860647 2834903 2813086 2794989 2780531 2769723 2762532 2758921 2758673 2760876 2764058 2767235 2770641
53230B770641M551O525R289J2966J7055K0552K3253K5996K9172L1944L3695L5378
$$ 2770641 2775192 2781717 2791006 2803972 2821027 2841579 2864832 2890828 2920000 2951944 2985639 3021017
53218C021017L8405M2593M6303M8385M9055M8968M8474M7997M8095M8569M8309
$$ 3021017 3059422 3102015 3148318 3196703 3245758 3294726 3343200 3391197 3439292 3487861 3536170
53207C536170M6716M4714M3474M2553M0429L6842L3437L1532L0221K7667K3662
$$ 3536170 3582886 3627600 3671074 3713627 3754056 3790898 3824335 3855867 3886088 3913755 3937417
53196C937417J9718J6805J4091J0303N387K65m430q888j3682j9247k5453l1440
$$ 3937417 3957135 3973940 3988031 3998334 4003721 4003986 3999556 3990668 3976986 3957739 3932286 3900846
53184C900846l6226l9729m2768m5940m9115n2272n5912o0024o3311o4485o3855
$$ 3900846 3864620 3824891 3782123 3736183 3687068 3634796 3578884 3518860 3455549 3391064 3327209
53173C327209o2788o2004o1308o0783o0914o1508o1553o0480n8750n7044n5694
$$ 3327209 3264421 3202417 3141109 3080326 3019412 2957904 2896351 2835871 2777121 2720077 2664383
53162B664383n5043n5330n5720n4588n1399m7708m5446m4847m4712m4054m2586
$$ 2664383 2609340 2554010 2498290 2443702 2392303 2344595 2299149 2254302 2209590 2165536 2122950
53151B122950m0164l6965l4071l2770l3111l4024l4912l6049l7153l6809l4263
$$ 2122950 2082786 2045821 2011750 1978980 1945869 1911845 1876933 1840884 1803731 1766922 1732659
53140A732659l1019k9467l0095l1139l0970k9920k9415l0135l1511l2462l2168
$$ 1732659 1701640 1672173 1642078 1610939 1579969 1550049 1520634 1490499 1458988 1426526 1394358
53129A394358l0567k8670k7989k9049l0612l0983k9995k9079k9381l0345l0423
$$ 1394358 1363791 1335121 1307132 1278083 1247471 1216488 1186493 1157414 1128033 1097688 1067265
53118A067265k8797k6306k4754k5241k6907k7609k6147k3505k1439k0291j9186
$$ 1067265 1038468 1012162 987408 962167 935260 907651 881504 857999 836560 816269 797083
53107G97083j7992j7695j8515j9029j8025j6303j5537j5993j6373j5702j4341
$$ 797083 779091 761396 742881 723852 705827 689524 673987 657994 641621 625919 611578
53096F11578j3151j2344j1491j0208q683p607p451p857p996p680p601q301r380
$$ 611578 598427 586083 574592 564384 555701 548094 540643 532786 524790 517110 509509 501208 491828
53083D91828j0049r885q715o488l817j983j657k108k379k607l327m107m006l109
$$ 491828 481779 471894 463179 456691 452874 450891 449234 447126 444747 442140 438813 434706 430700 427591
53069D27591k495k668l104l212k900k152j042j57j8l9Q48K398L067K209J114J243
$$ 427591 425096 422428 419324 416112 413212 411060 410018 409861 409843 409804 410652 413050 416117 418326 419440 420683
53053D20683K367L212L192K731K323K068J863J544R86L59n5m83j552l207m557
$$ 420683 423050 426262 429454 432185 434508 436576 438439 439983 440969 441328 441273 440790 439238 436031 431474
53038D31474n213n995p431q361p263m667k914l357m929n904n958n799n639n136
$$ 431474 426261 420266 412835 404474 397211 392544 389630 386273 381344 375440 369482 363683 358044 352908
53024C52908m440m223m600m901m672m248m053m130m562n608o807o851n163k994
$$ 352908 348468 344245 339645 334744 330072 325824 321771 317641 313079 307471 300664 293813 288650 285656
53010B85656j922j824j576j331k277m075m502k487J36J087N17j0k00r40k159k776
$$ 285656 283734 281910 280334 279003 276726 272651 268149 265662 265798 266885 267402 267392 267192 266252 264093 261317
52994B61317k567k457k721k574j754j036o70K83K213L660K881J29k532l427k708
$$ 261317 258750 256293 253572 250998 249244 248208 247538 247821 250034 253694 256575 256704 254172 250745 248037
52979B48037j746j625k175k349j548l70K66L95O85J144J001l1j306k181k611k530
$$ 248037 246291 244666 242491 240142 238594 238224 238490 238885 239570 240714 241715 241684 240378 238197 235586 233056
52963B33056j660k63P93J200J576K102J729l50l130m666m207k709j390o10r7L25
$$ 233056 231396 231133 231926 233126 234702 236804 238533 238183 235053 230387 226180 223471 222081 221471 221374 221699
52947B21699M54q5j322k541k671j370N54K067K837L043K715J883J054Q60J278
$$ 221699 222153 222068 220746 218205 215534 214164 214718 216785 219622 222665 225380 227263 228317 229177 230455
52932B30455J641J509J086P41M09k40j163j829j766j159n55p4O75J806K695K725
$$ 230455 232096 233605 234691 235432 235841 235601 234438 232609 230843 229684 229129 229055 229730 231536 234231 236956
52916B36956K047J183L81m1O95K913N484O879P127P573Q682R323Q551O936N546
$$ 236956 239003 240186 240567 240526 241221 244134 249618 256497 263624 271197 279879 289202 297753 304689 310235
52901C10235M745M584N243O243O229M623K728K034K057J145q36k133j633m81m97
$$ 310235 314980 319564 324807 331050 337279 341902 344630 346664 348721 349866 349030 346897 345264 344783 344286
52886C44286j738k518j683j49J89j219k954l428k792k450l011l659l601l147k912
$$ 344286 342548 340030 338347 338198 338387 337168 334214 330786 327994 325544 322533 318874 315273 312126 309214
52871C09214k702j928p20L5l08j448k374k156q38L55K28q15r72P35L015L653J984
$$ 309214 306512 304584 303864 303899 303591 302143 299769 297613 296775 297130 297358 296543 295571 296306 299321 302974 304958
52854C04958n60k252k781l005l335k988j164J308K454J584L08K64Q19L02j092
$$ 304958 304398 302146 299365 296360 293025 290037 288873 290181 292635 294219 294527 294791 295610 295912 294820
52839B94820j553o71j74j118k282k269j600j443j545q25Q31K629M034M808M471
$$ 294820 293267 292596 292422 291304 289022 286753 285153 283710 282165 281340 282171 284800 288834 293642 298113
52824B98113K768L53j786k996k693m65K789M882M536K730J031k57j276j327M6
$$ 298113 300881 301234 299448 296452 293759 293294 296083 300965 305501 308231 309262 309005 307729 306402 306448
52809C06448J648J959J202N49K08k18l38K45N11n41j670p92J805L798M173L933
$$ 306448 308096 310055 311257 311806 312014 311796 311458 311703 312214 311673 310003 309211 311016 314814 318987 322920
52793C22920L634K770J831K425M477N673M708L074K500K580K251J912K556M041
$$ 322920 326554 329324 331155 333580 338057 343730 348438 351512 354012 356592 358843 360755 363311 367352
52779C67352N544O748P500P349O507O115O476O142L915O50k106m204o132p278
$$ 367352 372896 379644 387144 394493 401000 407115 413591 419733 423648 424298 422192 417988 411856 404578
52765D04578o665m907l759l858m245m075l677l865m998o731q122q279p314o252
$$ 404578 397913 393006 389247 385389 381144 377069 373392 369527 364529 357798 349676 341397 334083 327831
52751C27831n535m522k980k005k357k975k418j093m47o42o78n03j156k787m177
$$ 327831 322296 317774 314794 312789 310432 307457 305039 303946 303499 302857 302179 301676 300520 297733 293556
52736B93556m513m270m085m045m274m895n137m025k278j924l292m015k241N26
$$ 293556 289043 284773 280688 276643 272369 267474 262337 258312 256034 254110 250818 246803 244562 245088
52722B45088J359k47k142k644k196j899j948k033k171k343k045r41M00R66L59
$$ 245088 246447 246200 244058 241414 239218 237319 235371 233338 231167 228824 226779 225838 226238 227204 227563
52707B27563j026k627m015m633l900j977m9O12p3j040j449j583k170l237m153
$$ 227563 226537 223910 219895 215262 211362 209385 209336 209948 209875 208835 207386 205803 203633 200396 196243
52692A96243m545m533m031k666p13M90j12j827k816k258j164p78q75k84J124J937
$$ 196243 191698 187165 183134 180468 179755 180245 180133 178306 175490 173232 172068 171290 170415 170131 171255 173192
52676A73192R08j449l373l692k685j405o56o66j186j617j398n81J68L35P1k62
$$ 173192 174100 172651 169278 165586 162901 161496 160840 160174 158988 157371 155973 155392 155560 155895 155966 155704
52660A55704p44j590k385k289j191j27q6p07o68P05K572L448K619O76j027j280
$$ 155704 154960 153370 150985 148696 147505 147378 147292 146585 145917 146622 149194 152642 155261 155937 154910 153630
52644A53630K34K716M786N489M863L613K548K366L410N093N885M701K344R24J635
$$ 153630 153864 156580 161366 166855 171718 175331 177879 180245 183655 188748 194633 199334 201678 202602 204237
52629B04237L572M827M226J898j098l221l347j893o60r00j943k384k093k064k606
$$ 204237 207809 212636 216862 218760 217662 214441 211094 209201 208541 207641 205698 203314 201221 199157 196551
52614A96551k868k365j875k257l212l813l723l285k828k517k632l266l763l217
$$ 196551 193683 191318 189443 187186 183974 180161 176438 173153 170325 167808 165176 161910 158147 154930
52600A54930j764q12j396k620k521o17J222J050o61j715j129q8J57m3J07K11n65
$$ 154930 153166 152354 150958 148338 145817 145200 146422 147472 146811 145096 143967 143879 144036 143993 144100 144311 143746
52583A43746j827k339j776r87o06m91m76o63q91q29n56k62M04J686K706K250N49
$$ 143746 141919 139580 137804 136817 136211 135720 135244 134581 133690 132861 132305 132043 132447 134133 136839 139089 139638
52566A39638r59j617j871j763q00L73J50j506k537j756m74J0N98K258L560K601
$$ 139638 138679 137062 135191 133428 132628 133001 133151 131645 129108 127352 126878 126888 127486 129744 133304 135905
52550A35905L30o59j5K19q04j571j013j34k3j82J37N34N48P84J787K765K651J644
$$ 135905 136235 135576 135561 135780 134976 133405 132392 132258 132235 132053 132190 132724 133272 134056 135843 138608 141259 142903
52532A42903O80K8m45l15R07K525L095K190R09N19J124J818J807J226J070K087
$$ 142903 143583 143611 143166 142851 143758 146283 149378 151568 152477 152996 154120 155938 157745 158971 160041 162128
52516A62128L672M241L078J272L31L83M56K37M73J655L168M126M374M288M082
$$ 162128 165800 170041 173119 174391 174722 175105 175561 175798 176271 177926 181094 185220 189594 193882 197964
52501A97964L753L325K763J953J133R84J763K669K620J591N44J5l57p52m62R73
$$ 197964 201717 205042 207805 209758 210891 211875 213638 216307 218927 220518 221062 221077 220720 219968 219506 220479
52485B20479K551K781J702R22J508K648K869J817L53n67n44K68J158J229L76l05
$$ 220479 223030 225811 227513 228435 229943 232591 235460 237277 237630 237063 236519 236787 237945 239174 239550 239245
52469B39245K23J532K214J684O85O6j31j40J48Q96J783K142J411m16k375k880
$$ 239245 239468 241000 243214 244898 245583 245649 245518 245378 245526 246422 248205 250347 251758 251342 248967 246087
52453B46087j336O01M88j917m250m578l604k892k306p53J294K088J275M00L74
$$ 246087 244751 245352 245840 243923 239673 235095 231491 228599 226293 225540 226834 228922 230197 230597 230971
52438B30971K52o62j210k28J243J308J18l04Q68K157K095J253R98J218N78j289
$$ 230971 231223 230561 229351 229123 230366 231674 231792 231488 232356 234513 236608 237861 238859 240077 240655 239366
52422B39366k884k432J13L031M535M274L178K114J107pp85o49P5M27J88J87R62
$$ 239366 236482 234050 234163 237194 241729 246003 249181 251295 252402 252395 251610 250961 251036 251463 251651 251838 252800
52405B52800K005K785L599M464M075J246k737m673k866J011L957M564L443J628
$$ 252800 254805 257590 261189 265653 269728 270974 268237 263564 260698 261709 265666 270230 273673 275301
52391B75301j36r42L4K356M151L842J813j04p22m76l61m11J10J366K490K693K201
$$ 275301 275165 274223 274257 276613 280764 284606 286419 286315 285593 285117 284756 284345 284455 285821 288311 291004 293205
52374B93205J673J230O33J12K36J027J765J832J204J45j055k006k433k661l322
$$ 293205 294878 296108 296741 296853 297089 298116 299881 301713 302917 303062 302007 300001 297568 294907 291585
52359B91585m358m964m654l883l248k726k136j761j863j877r19J003K787L240
$$ 291585 287227 282263 277609 273726 270478 267752 265616 263855 261992 260115 259196 260199 262986 266226
52345B66226K013k57k336l084k314j026m02n57o01Q5J053J425R72K83PJ24J21
$$ 266226 268239 267982 265646 262562 260248 259222 258820 258263 257662 257747 258800 260225 261197 261480 261487 261611 261732
52328B61732j81l55k0N26P69Q97J548K649L224K699J717J232J425K020K961M016
$$ 261732 261551 261196 261176 261702 262471 263368 264916 267565 270789 273488 275205 276437 277862 279882 282843 286859
$$ [...]
##END NTUPLES=NMR SPECTRUM
##END=
