##TITLE=Coffee green (TOSA01 0.0999g + 1.5mL buffer 50/50,  450uL extracto + 50uL (D2O+TMS))
without heating, vortex and centrifuged, temperature 0oC.
##JCAMPDX= 6.0         $$ Bruker NMR JCAMP-DX V2.0
##DATA TYPE= NMR SPECTRUM
##DATA CLASS= NTUPLES
##ORIGIN= Bruker BioSpin GmbH
##OWNER= Administrator
$$ 1.72 TOPSPIN		Version 2.1
$$ 2012-05-22 16:10:29.856 -0700  Administrator@X
$$ Compression mode = diff/dup
##.OBSERVE FREQUENCY= 400.13188205
##.OBSERVE NUCLEUS= ^1H
##.ACQUISITION MODE= SIMULTANEOUS (DQD)
##.ACQUISITION SCHEME= undefined
##.AVERAGES= 64
##.DIGITISER RES= 22
##SPECTROMETER/DATA SYSTEM= spect
##.PULSE SEQUENCE= noesygppr1d
##.SOLVENT NAME= H2O+D2O
##.SHIFT REFERENCE= INTERNAL, H2O+D2O, 1, 14.97986
##AUDIT TRAIL= $$ (NUMBER, WHEN, WHO, WHERE, PROCESS, VERSION, WHAT)
$$ ##TITLE= Audit trail, TOPSPIN		Version 2.1
$$ ##JCAMPDX= 5.01
$$ ##ORIGIN= Bruker BioSpin GmbH
$$ ##OWNER= Administrator
$$ $$ c:\Bruker\TOPSPIN/data/jwist/nmr/11-coffee-green-quantification-2/11/pdata/1/auditp.txt
$$ ##AUDIT TRAIL=  $$ (NUMBER, WHEN, WHO, WHERE, PROCESS, VERSION, WHAT)
(   1,<2011-11-17 12:57:39.263 -0500>,<Administrator>,<TOPSPIN>,<go>,<TOPSPIN 2.1>,
      <created by zg
	started at 2011-11-17 12:48:44.638 -0500,
	POWCHK enabled, PULCHK disabled,
       configuration hash MD5:
       DA 63 81 1B EF 4C B5 72 B4 DF EA D9 B4 DB 4C 08
       data hash MD5: 64K
       F0 0E 28 3F 96 F5 53 BC B2 A2 1E DB BC 96 6F A9>)
(   2,<2011-11-17 18:13:35.154 -0500>,<Administrator>,<TOPSPIN>,<proc1d>,<TOPSPIN 2.1>,
      <Start of raw data processing
       efp LB = 0 FT_mod = 6 PKNL = 1 PHC0 = 0 PHC1 = 0 SI = 32K 
       data hash MD5: 32K
       9D 35 C1 5F D2 CC 5B F8 3A 2C 38 AA C5 38 39 70>)
(   3,<2011-11-17 18:13:35.732 -0500>,<Administrator>,<TOPSPIN>,<proc1d>,<TOPSPIN 2.1>,
      <pk PHC0 = 21.01135 PHC1 = 0 
       data hash MD5: 32K
       F4 6E 8A 09 9B 5C D5 EA 77 AD 8D C8 5D 1A AB B1>)
(   4,<2011-11-22 06:58:59.036 -0800>,<Administrator>,<X>,<proc1d>,<TOPSPIN 2.1>,
      <abs ABSG = 5 
       data hash MD5: 32K
       9F DA EC 24 72 35 5F 97 DA BA 78 5D 89 C5 52 20>)
$$ ##END=
$$ 
$$ $$ hash MD5
$$ $$ 85 49 20 90 1C A3 11 0B 92 21 03 44 A5 67 1D 47
##$RELAX= 
##$RELAX= 
##$RELAX= 
##$RELAX= 
##$RELAX= 
##$RELAX= 
##$RELAX= 
##$RELAX= 
$$ Bruker specific parameters
$$ --------------------------
##$DU= <Z:>
##$EXPNO= 11
##$NAME= <11-coffee-green-quantification-2>
##$PROCNO= 1
##$TYPE= <nmr>
##$USER= <jwist>
##$ACQT0= -8.17841842394917
##$AMP= (0..31)
100 100 100 100 100 100 100 100 100 100 100 100 100 100 100 100 100 100
100 100 100 100 100 100 100 100 100 100 100 100 100 100
##$ANAVPT= -1
##$AQSEQ= 0
##$AQ_mod= 3
##$AUNM= <au_prof>
##$AUTOPOS= <>
##$BF1= 400.13
##$BF2= 400.13
##$BF3= 400.13
##$BF4= 400.13
##$BF5= 400.13
##$BF6= 400.13
##$BF7= 400.13
##$BF8= 400.13
##$BYTORDA= 0
##$CFDGTYP= 0
##$CFRGTYP= 9
##$CHEMSTR= <none>
##$CNST= (0..63)
1 1 145 1 1 1 1 1 1 1 1 1 1 1 1 1 1 1 1 1 1 1 1 1 1 1 1 1 1 1 1 1 1 1 1
$$ [...]
150 150 150 150 150 150 150 150
##$TP07= 0
##$TPNAME0= <>
##$TPNAME1= <>
##$TPNAME2= <>
##$TPNAME3= <>
##$TPNAME4= <>
##$TPNAME5= <>
##$TPNAME6= <>
##$TPNAME7= <>
##$TPOAL= (0..7)
0.5 0.5 0.5 0.5 0.5 0.5 0.5 0.5
##$TPOFFS= (0..7)
0 0 0 0 0 0 0 0
##$TUNHIN= 0
##$TUNHOUT= 0
##$TUNXOUT= 0
##$USERA1= <user>
##$USERA2= <user>
##$USERA3= <user>
##$USERA4= <user>
##$USERA5= <user>
##$V9= 5
##$VALIST= <valist>
##$VCLIST= <CCCCCCCCCCCCCCC>
##$VD= 0
##$VDLIST= <DDDDDDDDDDDDDDD>
##$VPLIST= <PPPPPPPPPPPPPPP>
##$VTLIST= <TTTTTTTTTTTTTTT>
##$WBST= 2048
##$WBSW= 25
##$XGAIN= (0..3)
0 0 0 0
##$XL= 0
##$YL= 0
##$YMAX_a= 5958944
##$YMIN_a= -2355032
##$ZGOPTNS= <>
##$ZL1= 120
##$ZL2= 120
##$ZL3= 120
##$ZL4= 120
##$ABSF1= 14.97986
##$ABSF2= -5.57267
##$ABSG= 5
##$ABSL= 3
##$ALPHA= 0
##$AQORDER= 0
##$ASSFAC= 0
##$ASSFACI= 0
##$ASSFACX= 0
##$ASSWID= 0
##$AUNMP= <proc_prof1d>
##$AXLEFT= 0
##$AXNAME= <>
##$AXNUC= <1H>
##$AXRIGHT= 0
##$AXTYPE= 0
##$AXUNIT= <>
##$AZFE= 0.1
##$AZFW= 0.1
##$BCFW= 0
##$BC_mod= 0
##$BYTORDP= 0
##$COROFFS= 0
##$CY= 15
##$DATMOD= 1
##$DC= 0
##$DFILT= <>
##$DTYPP= 0
##$F1P= 7.8871
##$F2P= 6.2181
##$FCOR= 0.5
##$FTSIZE= 32768
##$FT_mod= 6
##$GAMMA= 0
##$GB= 0
##$INTBC= 0
##$INTSCL= 1.323434e-010
##$ISEN= 128
##$LB= 0
##$LEV0= 0
##$LPBIN= 0
##$MAXI= 10000
##$MC2= 0
##$MEAN= 0
##$ME_mod= 0
##$MI= 0.1
##$NCOEF= 0
##$NC_proc= -6
##$NLEV= 6
##$NOISF1= 0
##$NOISF2= 0
##$NSP= 0
##$NTH_PI= 0
##$NZP= 0
##$OFFSET= 14.97986
##$PC= 1
##$PHC0= 21.01135
##$PHC1= 0
##$PH_mod= 1
##$PKNL= yes
##$PPARMOD= 0
##$PPDIAG= 0
##$PPIPTYP= 0
##$PPMPNUM= 2147483647
##$PPRESOL= 1
##$PSCAL= 0
##$PSIGN= 0
##$PYNMP= <proc.py>
##$REVERSE= no
##$SF= 400.13
##$SI= 32768
##$SIGF1= 0
##$SIGF2= 0
##$SINO= 400
##$SIOLD= 32768
##$SPECTYP= <>
##$SREGLST= <1H.CDCl3>
##$SSB= 0
##$STSI= 32768
##$STSR= 0
##$SW_p= 8223.68421052631
##$SYMM= 0
##$S_DEV= 0
##$TDeff= 65536
##$TDoff= 0
##$TI= <>
##$TILT= no
##$TM1= 0
##$TM2= 0
##$TOPLEV= 0
##$USERP1= <user>
##$USERP2= <user>
##$USERP3= <user>
##$USERP4= <user>
##$USERP5= <user>
##$WDW= 1
##$XDIM= 32768
##$YMAX_p= 436375573
##$YMIN_p= -919069
##$CURPLOT= <Network HP LaserJet P1505>
##$CURPRIN= <integrals_lipp.txt>
##$DFORMAT= <normdp>
##$LAYOUT= <+/1D_H.xwp>
##$LFORMAT= <normlp>
##$PFORMAT= <normpl>
##$SURQMSG= 1
$$ End of Bruker specific parameters
$$ ---------------------------------
##NTUPLES= NMR SPECTRUM
##VAR_NAME=  FREQUENCY,     SPECTRUM/REAL,   SPECTRUM/IMAG
##SYMBOL=    X,             R,               I
##VAR_TYPE=  INDEPENDENT,   DEPENDENT,       DEPENDENT
##VAR_FORM=  AFFN,          ASDF,            ASDF
##VAR_DIM=   32768,         32768,           32768
##UNITS=     HZ,            ARBITRARY UNITS, ARBITRARY UNITS
##FACTOR=    0.250966925370066, 1,           1
##FIRST=     8223.43324360094, 29430,        -217782
##LAST=      0,             228775,          -355927
##MIN=       0,             -919069,         0
##MAX=       8223.43324360094, 436375573,    0
$$ Real data points
##PAGE= N=1
##DATA TABLE= (X++(R..R)), XYDATA
$$ [...]
19664A697062n266m4781J24906j00961n1920K96866m03629J03439J3431j88398
19654A440749J49316j36365M3310l8457J3716M9374l8297J66841j24542J3656
19644A539301q9158j524J20547q9154Q5123q1348K49762j56823R8275k67866J37045
19633A544180O9170l00742Q9888p7879M29186r6787j00837M33k0253j6712k04863
19622A314784K32389p1175M9312Q8491l60030R9763q2325P1308k92427K59079
19612A309169l08575L11241K1216k10387K00805L3530j85282n5549M8882M13706
19602A578756m68925P6180J06906J11633Q7542M915l05144L5133K4088R9551m0967
19591A309668q3913j3494J74919m27570K01170J6156P5788o5422M3619j46914
$$ y = [1697062, 1691796, 1647015, 1771921, 1670960, 1619040, 1915906, 1512277, 1615716, 1629147, 1440749, 1590065, 1453700, 1497010, 1458553, 1472269, 1521643, 1483346, 1650187, 1525645, 1539301, 1450143, 1448619, 1569166, 1480012, 1565135, 1483787, 1733549, 1576726, 1675001, 1407135, 1544180, 1613350, 1312608, 1402496, 1324617, 1753803, 1657016, 1556179, 1556612, 1536359, 1519647, 1314784, 1547173, 1475998, 1525310, 1613801, 1253771, 1353534, 1271209, 1342517, 1050090, 1309169, 1000594, 1311835, 1333051, 1122664, 1323469, 1356999, 1171717, 1116168, 1165050, 1578756, 1109831, 1186011, 1292917, 1404550, 1492092, 1497007, 1191863, 1226996, 1251084, 1350635, 1309668, 1225755, 1212261, 1387180, 959610, 1160780, 1176936, 1252724, 1187302, 1230921, 1084007]
19581A084007M7295q7244j19149L78398j51282k40580J85249j00495N8743O9827
19571A124769N7972j06554p7192K27281K8142m99727L74550n8229R9280J41164
19561A311456l83028M9514L41923j01539m8686O971j23385m2110k7769K15208
19551A198555L1771k87462L73317k68536K48640m8649p3239P0443k00091R4950
19541A139699j09461J51158K1105o2672P2511k08331Q1648j7486L5911L4088K364
19530A140534k00206J80648P4527q9427q9282o0013M4012O9829J66019k56321
19520I80320p7193J93232j02543Q4891K71727k75965j31778J6585q131J2818K24347
19509A188310k69751L17628j31822J30655r5434j62815J62093q6146J13746j35782
$$ y = [1084007, 1131302, 1044058, 924909, 1303307, 1152025, 911445, 1096694, 996199, 1054942, 1124769, 1182741, 1076187, 998995, 1226276, 1254418, 754691, 1129241, 1071012, 1170292, 1311456, 928428, 977942, 1319865, 1218326, 1169640, 1176611, 1053226, 1011116, 983347, 1198555, 1230326, 942864, 1316181, 1047645, 1296285, 1247636, 1174397, 1244840, 1044749, 1139699, 1030238, 1181396, 1202501, 1139829, 1212340, 1004009, 1085657, 1068171, 1104082, 1138170, 1140534, 940328, 1120976, 1195503, 1106076, 1016794, 956781, 1000793, 1070622, 1236641, 980320, 903127, 1096359, 993816, 1078707, 1350434, 1074469, 942691, 959276, 951145, 963963, 1188310, 918559, 1236187, 1104365, 1235020, 1139586, 976771, 1138864, 1052718, 1166464, 1030682]
19499A030682j87164K62640M4729j82482J85623l80859J52035J14002j09397L6183
19489I65992j32374M00572j34427R6646q1917j33769R2572m0468P9192J94483
19479A306502n78197K81513j33212j10880P1585J28401j92144O508N468J49007
19469I34551p3529j62383J28834j67129J31964j12954J30142J2520P345j17745
19459G11616j8186j48129Q8444K43155l00567l8072J61488P5142j55553p4573
19449E44765J98792j96294J65736R5444q2409k4424r4450L15227j55386Q342L8115
19438H13458j54417K94084j76385m3711R9634o1402j30748P3491j4379j27478
19428E72147K6519K35913Q8520l04546J51644l36613P0941J76013r4306K12478
$$ y = [1030682, 843518, 1106158, 1150887, 968405, 1154028, 773169, 925204, 1039206, 929809, 965992, 833618, 1234190, 1099763, 1196409, 1114492, 980723, 1073295, 1032827, 1112019, 1306502, 728305, 1009818, 876606, 765726, 837311, 965712, 773568, 780076, 785544, 934551, 861022, 698639, 827473, 660344, 792308, 679354, 809496, 822016, 829361, 711616, 693430, 545301, 633745, 876900, 576333, 538261, 699749, 774891, 619338, 544765, 743557, 547263, 712999, 808443, 726034, 701610, 607160, 922387, 767001, 775343, 813458, 659041, 953125, 776740, 733029, 832663, 771261, 640513, 714004, 699625, 572147, 598666, 834579, 923099, 618553, 770197, 433584, 504525, 680538, 586232, 798710]
19418G98710L9671J22394k84924K3614j5512K39656j92810n9565q7365N6729K90857
19407I31455D35336K60170J52197k89935K16058j18700K45955k8085k27794k9016
19397F16186p9595M45105k42029M780R157N8997j03845j88607L40688o0799L9583
19386H39621K525p0760j16914J03647j09320Q865n2087K08508K4505j79665J07764
19375G66689L145j37367J93774j58931K41829r2572l19787K50295k10931J51463
19365F87607j43207O3962J49249k73503M19000k96694J81304L4902Q5791k30296
19355F78115Q4001Q1641l09948L22134R3422k31764M337L2779K5506N1555q113
19344H23665Q0650N2329j08453K03250j85473j11030Q8579N2815P4617J796J66026
$$ y = [798710, 838381, 960775, 675851, 699465, 683953, 923609, 730799, 671234, 583869, 640598, 931455, 435336, 695506, 847703, 557768, 773826, 655126, 901081, 872996, 645202, 616186, 536591, 981696, 739667, 744447, 753604, 812601, 708756, 520149, 860837, 800038, 839621, 842146, 771386, 654472, 758119, 648799, 657664, 605577, 814085, 838590, 658925, 766689, 769834, 632467, 826241, 667310, 909139, 816567, 496780, 747075, 536144, 687607, 544400, 608362, 757611, 484108, 903108, 606414, 787718, 822620, 908411, 678115, 762116, 843757, 533809, 855943, 949365, 717601, 721938, 754717, 780223, 831778, 823665, 904315, 956644, 848191, 1051441, 865968, 754938, 843517, 896332, 970949, 972745, 1138771]
19333A138771k11794j59237J1027K1161K68889k13870q623j6415o1069K6031N0352
19322H45223J26809J12247k92997R2002r6242j58437Q7588K05941j36820j25034
19312F60280m7061J9000J18968N7413o2754J60408j30190j61246K3155J8915j39586
19301E17302Q3880J34918r0550o2144r6519J6216K12786k89340J27656j64376
19291C89829J5415J3545N5898J43958r3793J61548k16240L84667l48769P1927
19281E77985J81684o943r1835K4855J15479C84474L35107K4477M4841C23133M70651
19270G93784n019k6601j85268J01318J59287k58510L71025k55944q7118j32435
19260D74519K50902J64333l69258K13009q9885R5821L8540k12804L57428k57620
$$ y = [1138771, 926977, 767740, 778767, 799928, 1068817, 854947, 846324, 829909, 768840, 794871, 845223, 972032, 1084279, 791282, 883284, 787042, 628605, 716193, 922134, 785314, 660280, 613219, 632219, 751187, 808600, 745846, 906254, 776064, 614818, 637973, 656888, 517302, 601182, 736100, 645550, 583406, 486887, 503103, 715889, 426549, 554205, 389829, 405244, 418789, 474687, 618645, 524852, 686400, 470160, 854827, 506058, 577985, 759669, 752726, 660891, 685746, 801225, 384474, 719581, 744058, 788899, 323133, 793784, 788765, 762164, 576896, 678214, 837501, 578991, 950016, 694072, 606954, 474519, 725421, 889754, 520496, 733505, 643620, 739441, 777981, 565177, 922605, 664985]
19250F64985m666m2726n1664J39317m1833j65969J64209J57746J14902J06758
19240A041059k3275K03688p8511J77404J56458l88359J89346j51648j70754D70724
19229G31822R792j28616K09942J39553k14901j19271J90965j14825K0439k37728
19219D87172J1664j55709K46195j26686J0574K4778N3585J41145j1279N0759j61116
19208E71082K19683n8464N3606l37131J25620J78546j97343N1468J33525k5160
19198G15432k0740p0840L6024J3561K5613R3692J8601k65235J31489J13911o4724
19187G26784K6965J39296q3191J08410J27546r7315O0096m8614k13836J22620
19177H68761L4312j06855K6625L8983R427L4283k69532J21781J46155k5114R0046
$$ y = [664985, 660319, 617593, 565929, 705246, 663413, 497444, 661653, 819399, 934301, 1041059, 1017784, 1221472, 1142961, 1320365, 1476823, 1088464, 1277810, 1126162, 955408, 470724, 731822, 741614, 612998, 822940, 962493, 747592, 628321, 819286, 704461, 724900, 487172, 498836, 343127, 589322, 462636, 473210, 497988, 551573, 692718, 681439, 732198, 571082, 790765, 732301, 785907, 448776, 574396, 752942, 555599, 607067, 740592, 715432, 694692, 623852, 659876, 673437, 699050, 792742, 811343, 546108, 677597, 791508, 726784, 753749, 893045, 809854, 918264, 1045810, 948495, 1008591, 959977, 746141, 868761, 903073, 796218, 822843, 861826, 871253, 905536, 636004, 757785, 903940, 878826, 968872]
19166I68872J63046j00275l04010K25944j42568J01597J13249j57446j29017K78289
19156A017681j87837m6528N2187j29059L457L10383j77692j05676J76515q6224
19146H27207K15021l22030K56959k5338j09655J33167j80811R7392K04760l4287
19136A062385m04670L55740k16885P1321M6682k5494N0531p0710J26107P6245
19126A071252J0205k812K2197J35765L54389k04011L4106J67008j784K32815J67334
19115A986464N15783L27043M52376L12753r0746P5331M34733n9411q6853j37073
19105C730400r8569q05238l41230l50166j02259n18148J56558k96433K50338k42302
19095A382951j28283j09625L04354j86030P1469L00622L6483K14408K02129J41935
$$ y = [968872, 1131918, 1031643, 727633, 953577, 811009, 912606, 1025855, 868409, 739392, 1017681, 829844, 783316, 835503, 706444, 709901, 1020284, 842592, 736916, 913431, 827207, 1042228, 720198, 977157, 951819, 842164, 975331, 794520, 891912, 1096672, 1062385, 657715, 1013455, 796570, 867891, 914573, 889079, 939610, 868900, 995007, 1071252, 1081457, 1078645, 1100842, 1236607, 1590996, 1386985, 1421091, 1588099, 1586315, 1819130, 1986464, 2502247, 2829290, 3281666, 3594419, 3503673, 3579004, 4013737, 3954326, 3867473, 3730400, 3631831, 2826593, 2485363, 2135197, 2032938, 1514790, 1671348, 1374915, 1625253, 1382951, 1254668, 1145043, 1449397, 1263367, 1334836, 1635458, 1671941, 1886349, 2088478, 2230413]
19085B230413K51856M67100L98950J87395J61343K41623K06962M42177r7994R7735
19075D587560m62684k72388j22632j12407R2546k74425k09783k46699m55146k34142
19065B289800j59698P1492l45357k45074j42812M2866L28485j39420k68640K06296
19055A637938K71791M2177J53134L07847M66845J29670L61112K44631J28107M35392
19045D178644l3691j02660m2732k72703k85156k53181n63490n22714k91205l2752
19035A778360k11128O7680n9239J76215Q4270o7268J80276J37756J59922j79145
19025B067699K40349M29635J29552L27965M06464K41761N00593M09391K29048
19016D982457M96170L66543K00948N6960L08643O4835L37281N14296R29561O95050
$$ y = [2230413, 2482269, 2949369, 3348319, 3535714, 3697057, 3938680, 4145642, 4587819, 4489825, 4587560, 4124876, 3852488, 3729856, 3617449, 3709995, 3435570, 3225787, 2979088, 2523942, 2289800, 2130102, 2201594, 1856237, 1611163, 1468351, 1511217, 1839702, 1700282, 1431642, 1637938, 1909729, 1951906, 2105040, 2412887, 2879732, 3009402, 3370514, 3615145, 3743252, 4178644, 4144953, 4042293, 3999561, 3726858, 3441702, 3188521, 2625031, 2102317, 1811112, 1778360, 1567232, 1634912, 1575673, 1751888, 1836158, 1768890, 1949166, 2086922, 2246844, 2067699, 2308048, 2737683, 2867235, 3195200, 3601664, 3843425, 4344018, 4753409, 4982457, 5478627, 5845170, 6046118, 6103078, 6411721, 6476556, 6813837, 7328133, 8257694, 8952744]
19006H952744J287005J247832J212841J869418J383960J499321J137623P99624
18998A9390368J76030J62549n51391j162862j852957k251929k091641k373926
18990I444241j612416j172067r49087j035456m76579m88352m04458l31847l75625
18981B598354K8511j09309j15243l13655k20509m0816j8450R6476k28396k43365
18971A433598J79021j1551Q0930r3062J7491j31694K79101J63807k27921J00072
18961A789792o4709R7131k79249M01067j52402L11083j94997L24411K00706k3179
18951B409654Q1876L26942J95534L08674N16113K62377Q29808R42156J049764
18942F922898J289194J668158J390278J879697J531631J609377P13598O90558
$$ y = [8952744, 10239749, 11487581, 12700422, 14569840, 15953800, 17453121, 18590744, 19390368, 19566398, 19728947, 19177556, 18014694, 16161737, 13909808, 11818167, 9444241, 7831825, 6659758, 5710671, 4675215, 4198636, 3710284, 3305826, 2973979, 2598354, 2626865, 2517556, 2402313, 2088658, 1868149, 1827333, 1808883, 1905359, 1676963, 1433598, 1612619, 1601068, 1681998, 1588936, 1606427, 1474733, 1753834, 1917641, 1689720, 1789792, 1725083, 1822214, 1542965, 1944032, 1791630, 2102713, 1907716, 2232127, 2432833, 2409654, 2491530, 2818472, 3014006, 3322680, 3838793, 4101170, 4930978, 5873134, 6922898, 8212092, 9880250, 11270528, 13150225, 14681856, 16291233, 17004831, 17695389]
18934A7695389L46378k99749n87543j438407j899004k208735j940376j832856
18926G835097j548138j042001r47684n58493o39020k59134j72919l74465l08085
18917A985158j74440m03034K70971O6468m33565L3557m4917k92616L36338k71302
18907A072618j50577P8550p3294P0559j57412N7887J49867j42833o1172l5216
18897H08977L7961J05814l64212Q8577l282J30607k423j68982N197R8323j09845
18886F26712n1932l6698P0007k26979K48885l0998J61955K7104j31612k22322
18876D34122J32662j4322K20410p9843P6249k25328L4865K8150k696K4744P3462
18865G02475j80053n7220M45783l23334M2305j29552J00101R8498j90106l0193
$$ y = [17695389, 18041767, 17742018, 17154475, 15716068, 13817064, 11608329, 9667953, 7835097, 6286959, 5244958, 4297274, 3738781, 3099761, 2840627, 2667708, 2293243, 1985158, 1810718, 1407684, 1678655, 1745123, 1311558, 1345115, 1300198, 1007582, 1343920, 1072618, 922041, 1000591, 927297, 997856, 840444, 898331, 1048198, 905365, 844193, 808977, 846938, 952752, 588540, 677117, 673835, 804442, 802019, 633037, 638234, 736557, 626712, 574780, 538082, 608089, 381110, 629995, 598997, 760952, 788056, 656444, 434122, 566784, 552462, 772872, 693029, 769278, 543950, 578815, 606965, 604269, 629013, 702475, 522422, 465202, 910985, 587651, 629956, 500404, 600505, 699003, 508897, 478704]
18855D78704J20761K0480K2093k7638P7131R4793k1723j01372j04610r1021L5343
18844E02941P4486J3838L9730j33889J60144j62909M8211J91567o3524j85169
18834D85426J82678j02485j35326J21103m1614J80607j04687K0383k50212J72142
18824E28015B00960K37328P4188J62638N3414o3590k48275K25796k28534L0160
18814D44085j21649J11292K23047j9586p685j598L220j27399K3467j87511J92513
18803E32196Q7779J50838p232q0136k5980l7240K32927k95411P3303m1302k7488
18792E62254J92600j09787J53287j7098L7263k19611K60153P905r0426r0090L80061
18781A066511m4444j92204O6417K41263l30723m3112j1895n7160P7356o7362j10672
$$ y = [478704, 599465, 619945, 642038, 614400, 691531, 786324, 764601, 663229, 558619, 467598, 502941, 577427, 591265, 630995, 497106, 657250, 494341, 542552, 734119, 670595, 485426, 668104, 565619, 430293, 551396, 509782, 690389, 585702, 606085, 355873, 528015, 200960, 438288, 512476, 675114, 728528, 664938, 416663, 642459, 413925, 444085, 322436, 433728, 656775, 637189, 629504, 627906, 631126, 503727, 527194, 339683, 532196, 619975, 770813, 763581, 683445, 657465, 620225, 853152, 557741, 631044, 589742, 562254, 754854, 645067, 798354, 781256, 818519, 598908, 859061, 866966, 776540, 686450, 1066511, 1022067, 829863, 896280, 1137543, 806820, 763708, 751813, 694653, 772009, 704647, 593975]
18770E93975J89288j946j17553J76631j6272L7419k11674N522R8580k58927K86079
18759G81122k6570n5215j02457m428m7490O2454M6735k6275P472j06823L27901
18748H56426k40132J5070L8589L9023j09941L7065n2047o5157P520l8358o4036
18737D24022J44692k094N8862N3572k4957n8508k20935M47364k60930J99082j69932
18726E90238l6722K17775R6422m04187K41490J4243M8129N4060j45660k35241
18716D40547J58829N4068J94772j43100J48753k28515J96551k58604j6588J81268
18706G27981j81145K90191C05593L47381J14222j92764j19784K94498j4913j1548
18696G22685L4182r2791l0433J546p6728R6596j40667J27734k35545L66399p3313
$$ y = [593975, 783263, 781317, 663764, 840395, 824123, 861542, 649868, 655390, 753970, 495043, 781122, 754552, 699337, 596880, 592452, 544962, 607416, 654151, 627876, 635348, 528525, 856426, 616294, 631364, 669953, 708976, 599035, 636100, 584053, 518896, 526416, 488058, 424022, 568714, 566620, 625482, 679054, 654097, 595589, 374654, 822018, 561088, 760170, 590238, 553516, 771291, 867713, 463526, 705016, 719259, 767388, 821448, 675788, 440547, 599376, 653444, 848216, 705116, 853869, 625354, 821905, 563301, 546713, 727981, 546836, 837027, 305593, 652974, 767196, 574432, 454648, 749146, 734233, 722685, 756867, 664076, 633643, 635189, 558461, 655057, 514390, 642124, 406579, 772978, 699665]
18685F99665k4728n1764K9782J83531l0730j0033q2514K7324l2150M7902j18130
18674F38155k0002K60359j43072j23514O8482j49527K13886j77491J13292Q2708
18664G63276N6289l69429J39051n9089P37M5262P9074r0721O3830m9696j05874
18653D72710L18031j21460k62438K13620J6405j08313k08527R1125r336Q4617
18643D86434J98820j03746O2035k6040J36813C31973j0826J34236P3341j33527
18633C95197K46025j39298k6683m5356J5003p1228Q4456M8456p294o3450k3055
18622D12773K01917r3893l154Q4152j9716R4179B18626L41732J15112l7940j10696
18611E26834K07726J30527k77801k4797J77645j58801J92349j31027K14674j58467
$$ y = [699665, 674937, 623173, 652955, 836486, 805756, 795723, 713209, 740533, 708383, 756285, 638155, 618153, 878512, 735440, 611926, 680408, 530881, 744767, 567276, 680568, 763276, 819565, 450136, 589187, 530098, 530835, 576097, 655171, 564450, 628280, 578584, 472710, 790741, 669281, 406843, 620463, 636868, 528555, 320028, 411153, 401817, 486434, 685254, 581508, 643543, 617503, 754316, 331973, 321147, 455383, 528724, 395197, 641222, 501924, 475241, 429885, 444888, 373660, 458116, 506572, 499278, 435828, 412773, 614690, 520797, 517643, 601795, 582079, 676258, 218626, 560358, 675470, 637530, 526834, 734560, 865087, 587286, 562489, 740134, 581333, 773682, 642655, 857329, 698862]
18601F98862J1427m620K25194k76638o8810J30752L2982J4623k8454q3062N1008
18590G03264J67047j09355J5296k1457j6545P9146k58996N5033k1690j5955K2945
18579E98733K3529M8863R6613N6055j68365J01895j2225J54329D43486K05744
18569F49230n6884m7368k24006J78170Q2691r6702J36577j953k444j54750m2011
18558D20550K13906j91267K13938M0962j44464q4093K23897o5109r8699k20849
18548C08772K82985p7992j18337j01254L41741l8602j80594j08903J94203K9518
18538E31537j37671J59871J85294j81487K44008l71843k1462P6787L910j2500
18528D76444p3616r4375L44161j13401r2291r2116L89341l32442l5323O6924j692
$$ y = [698862, 710289, 705669, 930863, 654225, 585415, 716167, 749149, 763772, 735318, 652256, 703264, 870311, 760956, 776252, 754795, 738250, 817396, 558400, 613433, 591743, 575788, 598733, 622262, 671125, 767738, 823793, 655428, 757323, 745098, 899427, 443486, 649230, 592346, 544978, 320972, 499142, 581833, 485131, 621708, 619755, 617311, 462561, 420550, 634456, 443189, 657127, 698089, 553625, 469532, 693429, 628320, 529621, 308772, 591757, 513765, 395428, 294174, 635915, 597313, 416719, 307816, 502019, 531537, 393866, 553737, 739031, 557544, 801552, 429709, 408247, 485034, 488944, 476444, 402828, 308453, 652614, 539213, 446922, 354806, 744147, 411705, 376382, 443306, 441614]
18517D41614J51437o7970r1961M370J16188m851j09440L6325n832k184J77804
18506F45500j98182J27031j47648K12061J8743j44947K47576k73721L5057J7643
18496E39113n8768O6753B53094L07436j50339J06926P2321j02608N5194k32534
18486C09490K37613j19909J32197N211o4895L7896J01818p7687j4567N6488j93310
18475D10345K21989j76489K59392j91833Q8473m6547K12474o1482r9021J41299
18465G58600j39049L0852m5494N2786J26936q1107J03113R1271j96096r5005M4717
18454F51524J56080j22313M9492o5936j55009J92831j55280j07895n0486N4826
18444D47834J64397k00915Q2288J87833J3491j55958K26220m4052m6851j17006
$$ y = [441614, 593051, 525081, 433120, 437490, 553678, 548827, 439387, 475712, 469880, 467696, 645500, 447318, 574349, 426701, 638762, 657505, 512558, 760134, 486413, 521470, 539113, 480345, 547098, 253094, 560530, 410191, 517117, 589438, 486830, 542024, 309490, 547103, 427194, 559391, 564602, 499707, 537603, 639421, 561734, 547167, 603655, 410345, 632334, 455845, 715237, 523404, 611877, 565330, 777804, 716322, 617301, 758600, 619551, 650403, 604909, 657695, 784631, 703524, 806637, 897908, 701812, 606807, 651524, 807604, 685291, 734783, 668847, 513838, 706669, 551389, 443494, 393008, 447834, 612231, 411316, 493604, 681437, 694928, 538970, 765190, 721138, 674287, 557281]
18434E57281J19759k7128J13214Q4221N808q4577j48455O56L5978q0383J29408
18423G05782J28975k17697J46897l22534L3087J27289j28209o2163J89963j87132
18413D14258r9251J11257Q2227P1333k44632J76768j47815L0219j20292K04996
18403D79068M3585k42014L38073j00084K5593J17486j96684J8449q8977J67035
18393E61530j30342P0277j63036J10636N3035j04321M6587q1301p1948K61908
18383E53025j33514K77603l24279K6930r3749L64640j94509l5620n9432J45235
18373E26330M7366j05075M004J15924m8969j26089Q8585J27847l5804R9731k14767
18362D79083j47444K94847J00617k56388L63594n7771k00759l5080P5139q3498
$$ y = [557281, 677040, 649912, 763126, 847347, 853155, 768578, 620123, 620779, 656757, 576374, 705782, 834757, 617060, 763957, 441423, 474510, 601799, 473590, 411427, 601390, 414258, 315007, 426264, 508491, 579824, 335192, 511960, 364145, 394364, 274072, 479068, 522653, 280639, 618712, 518628, 544221, 661707, 465023, 483472, 394495, 561530, 431188, 501465, 338429, 449065, 502100, 397779, 444366, 363065, 291117, 553025, 419511, 697114, 372835, 399765, 306016, 670656, 476147, 440527, 381095, 526330, 573696, 468621, 472625, 588549, 539580, 413491, 502076, 629923, 594119, 693850, 479083, 331639, 626486, 727103, 470715, 834309, 776538, 575779, 540699, 615838, 532340]
18352E32340J9032P2074R1509n9615j81957q8529M07707j643l07967K21161k43466
18341D60646Q6836J71774k28016R1796n9070j72240K58710J07337l05690J38189
18331E50272J16789R0668k48123K26441p8539O968m0820j1430l956k33849K38149
18320F12570l8252O0043j41021J93310j36887K02685k61718m9845J13673K5891
18310E80449r4948J39164C11539J27467K42002l33460R7990j3652m1545P9812
18300D70153j34197M4976r0220J43957J73172j11513J8606B11018L74572j74804
18290D10786j2268J93268j17533n013r892q0028J77938B29671Q6920P0591j91790
18279A95392M44381j56405j71108K2468K19440j77350k2297Q2754L0351j58924
$$ y = [532340, 551372, 623446, 714955, 655340, 473383, 384854, 792561, 790918, 482951, 704112, 460646, 547482, 719256, 491240, 583036, 523966, 351726, 610436, 717773, 412083, 550272, 667061, 757729, 509606, 736047, 657508, 664476, 623656, 612226, 608270, 374421, 612570, 574318, 634361, 493340, 686650, 549763, 752448, 490730, 440885, 554558, 580449, 485501, 624665, 311539, 439006, 681008, 347548, 445538, 431886, 390341, 470153, 335956, 380932, 290712, 434669, 607841, 496328, 514934, 211018, 585590, 410786, 398518, 591786, 474253, 469240, 459348, 379320, 557258, 229671, 316591, 387182, 195392, 639773, 483368, 312260, 334728, 554168, 376818, 354521, 437275, 467626, 308702]
18269C08702J58791J7246k12942K35814k5191p0442K99416j76920J63436j50791
18259E47119j95342K69079j33971J15908l4407p8161J07741j01403M8279j38145
18249D06697J56146N6937j93620K1749P9190J47230k65447j8100m6951J54382
18239D98213K3226Q404K3949J04624n4732r2405k00540J46271j86941J60258r6782
18228C33545J04623J0148K37077j86280Q7176j04544J0581j13562J84857q9340
18218D74281k8462R7214K43443O1897o9468n7810k96561K32993p0771j68808j51861
18207B66087M78147j34898O5810k30215j17528J65685K20423k2007m8378o4709
18197E78417J58250J28162j11384k53389N6274Q4776R6345j79605J58850p2278
$$ y = [308702, 467493, 484739, 271797, 507611, 482420, 411978, 711394, 534474, 697910, 547119, 351777, 620856, 486885, 602793, 568386, 490225, 597966, 496563, 544842, 406697, 562843, 619780, 426160, 447909, 527099, 674329, 408882, 390782, 343831, 498213, 521439, 529843, 553792, 658416, 603684, 511279, 310739, 457010, 270069, 430327, 333545, 438168, 448316, 685393, 499113, 586289, 481745, 492326, 378764, 563621, 474281, 445819, 543033, 786476, 848373, 778905, 721095, 424534, 657527, 586756, 417948, 266087, 744234, 609336, 675146, 444931, 327403, 493088, 713511, 691504, 643126, 578417, 736667, 864829, 753445, 500056, 556330, 641106, 737451, 557846, 716696, 644418]
18187F44418n7332N7144l3937P4210p1570M3742k02565J79930j06344R6481N3831
18176F78008j82281K10298m2183k8293O3542j96433k6786K26068j09727j14700
18166D77513K602L13705k59317j20520l8337J42925p2154j8645J92038k4853j04298
18155D90659L04113k28096O0530j18852J98431k30054J19954J01913j7188j85542
18145D95868K2161K74052l62571J29584n1101J16122P1053O6762k00113o809K03662
18134G58670k33054J01366j9861l1458J11863n8252j21739J94410k17925J68928
18124F52948j16230j09344L68512l94192K82663j64574L04196k15621O4865M5233
18114G18456k15702J81394r562j92424J847L9870k1542j06989R0839q4796j1242
$$ y = [644418, 587086, 644230, 610293, 684503, 612933, 656675, 454110, 634040, 527696, 624177, 678008, 495727, 706025, 663842, 635549, 699091, 502658, 475872, 701940, 592213, 477513, 480115, 793820, 534503, 413983, 375646, 518571, 446417, 427772, 619810, 594957, 490659, 794772, 566676, 627206, 508354, 706785, 476731, 596685, 698598, 681410, 495868, 518029, 792081, 429510, 559094, 507993, 624115, 695168, 761930, 561817, 555008, 758670, 525616, 626982, 607121, 575663, 687526, 629274, 507535, 701945, 484020, 652948, 536718, 427374, 795886, 401694, 684357, 519783, 823979, 608358, 673223, 718456, 502754, 684148, 674586, 482162, 484009, 523879, 502337, 395348, 486187, 401391, 390149]
18103C90149J56905R1242K4828k8718m8648n2023R5733j47124j64648M2728K51133
18092F11557k32794J24483m2115L8427L8565n2897J53366k41255o8468J44190
18082D73059K2489J29409j04271N4476P7099k04985j17099m7756L44407j8523
18072F08305k4794j38434J64907k56862q2068J86493A98118L26158m3181p618
18062D73477J82035k94990K8052J67601p3151A53897K31125J01286P4389B62512
18051D87023P5202Q6362j94949m0060K46179j13761j35045N9791j44225J82749
18041E09266j1613O8045B44952J63481J17088j90255o7326K45061B31751J97632
18031D29383L9707M448J14254k12652L16846B61150J24498j29115K11441O7846
$$ y = [390149, 547054, 638296, 663124, 634406, 585758, 533735, 629468, 482344, 317696, 360424, 611557, 378763, 503246, 461131, 499558, 538123, 485226, 638592, 397337, 328869, 473059, 495548, 624957, 520686, 575162, 652261, 447276, 330177, 282421, 626828, 608305, 583511, 445077, 609984, 353122, 271054, 457547, 198118, 524276, 481095, 473477, 655512, 360522, 388574, 556175, 483024, 153897, 385022, 486308, 560697, 262512, 487023, 562225, 648587, 453638, 413578, 659757, 545996, 410951, 470742, 326517, 509266, 497653, 565698, 244952, 408433, 525521, 335266, 267940, 513001, 231751, 429383, 469090, 473538, 587792, 375140, 691986, 261150, 385648, 256533, 467974, 535820]
18021E35820N047j24756J24266j07140r7668J62918l5336j87636P592J51273L6372
18010D70752J23319j53623J802L2042A79719M05601j35396N7849j25042J17905
18000E00636J02738B58651K31158K13956j19175o2551j69408K98423l22747L11282
17990F39589m0761j50672A99584R9832K20915j60899J61741q4560J19833K1596
17980E78042q1812M9470Q4112J0919j76212J03964B75625L57043j2065k66673
17970C53930L09040j63177P2830M1295k63947K31438K36699k90071k04700J64089
17960D87426k6861n8340K362K8804K3448M8716k8333j04344J43804M9197j73233
17949C92646J34438k17533L81514j20721r6562j03265R3858K732N2963J08875
$$ y = [535820, 540867, 416111, 540377, 433237, 335569, 498487, 463151, 275515, 283107, 434380, 470752, 594071, 440448, 442250, 474292, 179719, 585320, 449924, 507773, 382731, 500636, 603374, 258651, 489809, 703765, 584590, 522039, 352631, 651054, 328307, 639589, 598828, 448156, 199584, 299416, 520331, 359432, 521173, 436613, 556446, 578042, 496230, 545700, 629812, 640731, 464519, 568483, 275625, 632668, 620603, 353930, 662970, 499793, 572623, 613918, 349971, 581409, 818108, 528037, 323337, 487426, 460565, 402225, 404587, 433391, 456839, 505555, 477222, 372878, 516682, 565879, 392646, 527084, 309551, 691065, 570344, 473782, 370517, 464375, 467107, 520070, 628945]
17939F28945j23215k253N9448p0226J02635m232o9900k6255m4259M1526J29777
17928F21991j17227j21553J91070m7647k475M9158J03896k49143J5262J60689
17918F04021k6497j84918Q2107R5290j2352N8070o6487j46965k6858j02295M30057
17907G03173q2939j4355J56262l9899j18039q9523L8832J50691k79929L8642K254
17896D65170M38803j71841n617o0500j18967m4355p1135K46563k02214J22356
17886E98263m560k5726n8260K04225J1627k50763J38895j8646J70998k43597J08757
17875F31213k44373J39621l7660J63060j71364j76165L3976K00166P1737J47569
17865G57780l02710M9082J55232k65003J53861r7733K96448K4273k25305l967
$$ y = [628945, 505730, 503477, 562925, 492699, 595334, 591102, 521202, 494947, 450688, 492214, 621991, 504764, 383211, 574281, 526634, 524159, 573317, 677213, 428070, 443332, 604021, 577524, 392606, 474713, 570003, 557651, 615721, 549234, 402269, 375411, 273116, 703173, 620234, 605879, 762141, 722242, 604203, 514680, 553512, 704203, 424274, 462916, 465170, 903973, 732132, 726515, 666015, 547048, 502693, 431558, 678121, 475907, 598263, 593703, 567977, 509717, 713942, 725569, 474806, 613701, 595055, 766053, 522456, 631213, 386840, 526461, 488801, 651861, 480497, 304332, 338308, 538474, 610211, 757780, 455070, 504152, 659384, 394381, 548242, 450509, 746957, 771230, 545925, 541958]
17855E41958J59486k69850K43981r8619J54870j72198j69598O6513K82837k47634
17845D91746j11284J43340j27710K16881p3360R1921L320l2786p1068J23050j57164
17834D96886K2506Q3705J1475K03438k08801j45149L4700O3413q7829P2542Q1235
17823F28121N3618k33853J8168K36893P9034J69830q7723j19612N06861j75345
17813A075992p9580R2380r5669p3218J82758k82775J91056k832J7409j27010j07952
17802G90559Q2546J45391k3598l5402j01367J16133r5973J65849o1201O34K93354
17791A276925m28294k72358J34085J40736l21454J3090q7910J71750K805K6414
17781F55789O105R6704n9391K19038j78284j14028r5338K91729k25185K06888
$$ y = [541958, 701444, 431594, 675575, 576956, 731826, 559628, 390030, 456543, 739380, 491746, 380462, 523802, 396092, 612973, 539613, 631534, 634854, 602068, 531000, 654050, 496886, 519392, 603097, 614572, 818010, 609209, 464060, 498760, 562173, 474344, 546886, 628121, 681739, 447886, 466054, 702947, 781981, 951811, 864088, 744476, 1251337, 1075992, 996412, 1088792, 993123, 919905, 1102663, 819888, 1010944, 1008112, 1025521, 898511, 790559, 873105, 1018496, 994898, 959496, 858129, 974262, 878289, 1044138, 982937, 983571, 1276925, 848631, 576273, 710358, 851094, 529640, 542730, 454820, 626570, 629375, 655789, 661894, 758598, 699207, 918245, 739961, 625933, 530595, 822324, 597139, 804027]
17771H04027j89834M6597N6920j84262k0713k3429O9461R0042n3414p8742K68616
17760G85269m9244P1417o0755j31661j27239k2337J16127J5490j02819J69137
17750F63385j55463P688K29778n189j31887J44079j33161J59435j43327j26472
17740E08866O6591l8739K92154j59648J00538j32102N4854j68748j90451L81383
17730G14698L2148r4486n1290o2593J26295L9847m9967L5728o2331j57633K90858
17719G61274j25371R2016q0058J02368j30106K52839j73989j71483j04396J66792
17709E89886k62993L30279n6313R7499j60430J18880k7879K2763K46755j63587
17699G34860j62203j7806O0102P6797j2602K0410O8938j74410J80172J5862j00574
$$ y = [804027, 614193, 660790, 717710, 533448, 512735, 489306, 558767, 648809, 595395, 516653, 785269, 736025, 807442, 746687, 615026, 487787, 465450, 581577, 597067, 494248, 663385, 507922, 515610, 745388, 740199, 608312, 752391, 619230, 778665, 635338, 508866, 575457, 536718, 828872, 669224, 769762, 637660, 692514, 523766, 333315, 714698, 746846, 652360, 601070, 538477, 664772, 704619, 654652, 690380, 628049, 470416, 761274, 635903, 727919, 647861, 750229, 620123, 872962, 698973, 527490, 423094, 589886, 326893, 657172, 600859, 698358, 537928, 656808, 628929, 651692, 898447, 734860, 572657, 554851, 614953, 691750, 679148, 699558, 768496, 594086, 774258, 790120, 689546]
17688F89546L5231r4814K9039j04953N0106L38984k22907n0609J5312J07660k05040
17677E87555N3314q9096r0432L97846q0257o4303j3917k36516L22528j98686L24535
17666I12571J50441l93212L1444k4150j31894M03490l35002J2049J72036N3384
17656H51157K0141j70855m8720J6425N6297N5600M8280k95682M49553k80725J03707
17645H05178j26136L7517O2987n9515K4833q792K35285k53025l486J16035r4797
17634G36084J94411J02322m2072k18736J32717j56410p556K39252L5697k15838
17624G99871k0709J05578R4547R743J66382k4222l8454q3046J0526M0165j8031
17613A042350q1457O3451O1725J06813j67908J43735j17624J89512j06567L1989
$$ y = [689546, 724777, 629963, 659002, 554049, 604155, 943139, 720232, 669623, 684935, 792595, 587555, 640869, 551773, 461341, 859187, 778930, 714627, 700710, 464194, 786722, 588036, 912571, 1063012, 669800, 701244, 677094, 545200, 948690, 613688, 625737, 797773, 851157, 871298, 700443, 651723, 668148, 724445, 780045, 828325, 532643, 982196, 701471, 805178, 679042, 716559, 779546, 720031, 744864, 736072, 971357, 718332, 714846, 830881, 736084, 930495, 1032817, 990745, 772009, 904726, 748316, 740760, 980012, 1015709, 799871, 779162, 884740, 979287, 989030, 1155412, 1131190, 1092736, 1009690, 1020216, 1060381, 1042350, 960893, 1024344, 1086069, 1192882, 1024974, 1168709, 1051085, 1240597, 1134030, 1166019]
17603A166019j09018o4239J46555j65093O4300l0695J37269l9620J19313j84648
17593A040143J58810k8142J21449j45355J66472m9766r6940J0539o0323J63019
17583A279906o4193l49486L04408J89820j84175J66547k32967N56751l53867K5109
17573A337853k4656M0624j12852R7472j26673J12700J14437n5986r3022l6212
17563A253685k9500Q5792j16596P9594n2217K396k061j94606K51896m2926J81126
17552A416583l51318J98324p2481R7525O2432j06416J87570p2035J26250j63825
17542A322609J56844l9107k4832L6176m7339k04194Q0793J26598l8247j04332
17532A264969O8090j69065l0072K91447k00938J08115L0173m9836J94004o0673
$$ y = [1166019, 1057001, 992762, 1139317, 974224, 1038524, 1007829, 1145098, 1105478, 1224791, 1040143, 1198953, 1170811, 1292260, 1146905, 1313377, 1263611, 1166671, 1177210, 1116887, 1279906, 1215713, 866227, 1170635, 1360455, 1176280, 1342827, 1109860, 1666611, 1312744, 1337853, 1313197, 1353821, 1240969, 1338441, 1211768, 1324468, 1438905, 1382919, 1289897, 1253685, 1224185, 1309977, 1193381, 1272975, 1220758, 1223154, 1221093, 1026487, 1278383, 1235457, 1416583, 1065265, 1263589, 1191108, 1288633, 1351065, 1244649, 1432219, 1360184, 1486434, 1322609, 1479453, 1440346, 1415514, 1451690, 1404351, 1200157, 1280950, 1407548, 1369301, 1264969, 1333059, 1163994, 1133922, 1425369, 1224431, 1332546, 1362719, 1312883, 1506887, 1446214]
17522A446214k02986J20901J7837k0612K1024R2889J5719L54883j54256l1508
17512A660105M30916J66391J80505j98666K62194j65941J15063J90036J21011
17503B761614k85607J19656l2098K4900n5580L90600L37811Q3773M30153n0705
17493C724517Q67706K0326R15524N91407R45409J555051J939650L674519N945539
17484B0179648R707440J2253260J3653325J2291581R665602O869617M750086K035001
17476I1405560l07067l902408q368157j2874861j4196126j1398776n463938K435919
17468C7330146P943028J1570425J1998120J0084003O752353M395077J970419p68523
17460I1275048l607946p786642j3158279j6260400j6002645j2911937p824085
$$ y = [1446214, 1243228, 1364129, 1381966, 1361354, 1382378, 1475267, 1490986, 1845869, 1691613, 1660105, 2091021, 2257412, 2437917, 2239251, 2501445, 2335504, 2450567, 2640603, 2761614, 2476007, 2595663, 2563565, 2588465, 2532885, 2923485, 3261296, 3345069, 3775222, 3724517, 4592223, 4612549, 5528073, 6119480, 7064889, 8619940, 10559590, 14234109, 20179648, 29887088, 42140348, 55793673, 68085254, 77750856, 84620473, 89370559, 91405560, 91098493, 87196085, 78827928, 65953067, 51756941, 40358165, 34894227, 37330146, 45273174, 56843599, 68841719, 78925722, 85678075, 90073152, 92043571, 91275048, 87667102, 79880460, 66722181, 50461781, 34459136, 21547199, 13723114]
17453A3723114m178012k469633j167106n86138o97713k18771n01139j6241k79475
17444C608886Q3940q2449k61078J68078j32314o6321j55764q301L2036l25203
17434B861510L7553o988k51563K88184j63470J11850m5518N9838J01680j56095
17424B836981l873m5843M3468k37762k55859o9937j22917K19039j43336J9610
17414B239571k08220J53427K63428k98232j1633O6829J16213L2175L5384j239
17404B387703J83555o3839L7814L79672r7078J67551o2877N32225J46380J52079
17394C763185L43877K10839L13710N13313L21427L75835L19050K71812L32524
17385F765572L98925K5853J54280j45123L2466m30541j31889k69664k04927M2788
$$ y = [13723114, 9545102, 7075469, 5908363, 5322225, 4624512, 4405741, 3904602, 3888361, 3608886, 3692826, 3610377, 3349299, 3517377, 3385063, 3318742, 3162978, 3154677, 3186713, 2861510, 2899063, 2892075, 2640512, 2928696, 2765226, 2877076, 2831558, 2891396, 2993076, 2836981, 2833108, 2787265, 2830733, 2592971, 2337112, 2267175, 2144258, 2363297, 2219961, 2239571, 2031351, 2184778, 2448206, 2149974, 2138341, 2205170, 2321383, 2353558, 2388942, 2387703, 2571258, 2507419, 2545233, 2924905, 2827827, 2995378, 2932501, 3464726, 3611106, 3763185, 4107062, 4317901, 4631611, 5144924, 5466351, 5842186, 6161236, 6433048, 6765572, 7164497, 7190350, 7344630, 7199507, 7231973, 6801432, 6669543, 6399879, 6194952, 6237740]
17375F237740L7380p3289K30204J76032K83425L67438L24499J36232L75013P1727
17365H166401J86787j13757M25445k44497K49913j77064m9972K3380k2878M5531
17355H489289O7466J34374K01939O28055L74844P34185O13811L11046M40082P88752
17345A2783843L50713M32446O41464K70846k03572J30265k08423M0613m76137
17336A3762058k66792l96280j80954l96844K44114K11303m2954L12620O53123
17327A3899394L3382M06128O16402L87764J98630K46131J64257j93018M07573
17318A6166643j22939J23465l3929J91493n04685L17809K5329k16282M7510J6866
17308A6011280K44179K01081L56507q760L88400R9846l0970J86440j26098j27217
$$ y = [6237740, 6275120, 6201831, 6432035, 6608067, 6891492, 7258930, 7583429, 7719661, 8094674, 8166401, 8353188, 8239431, 8664876, 8420379, 8670292, 8493228, 8443256, 8466636, 8443758, 8489289, 8556755, 8691129, 8893068, 9521123, 9895967, 10630152, 11243963, 11555009, 11995091, 12783843, 13134556, 13567002, 14208466, 14479312, 14275740, 14406005, 14197582, 14238195, 13762058, 13495266, 13098986, 12918032, 12521188, 12765302, 12976605, 12933651, 13246271, 13899394, 13932776, 14338904, 14955306, 15343070, 15541700, 15787831, 15952088, 15759070, 16166643, 16043704, 16167169, 16133240, 16324733, 15820048, 16137857, 16163186, 15946904, 15994414, 16011280, 16255459, 16456540, 16813047, 16804287, 17192687, 17292533, 17261563, 17448003, 17321905, 17194688]
17298A7194688j58202j72828M7503n44101q9149q061l21309K47310N1400L20064
17288A6567315k37556N27405j45384K4663o3289k79845k37254p73573o22381n84668
17278A4175433q38034j108550p01907q74160o91134o83472q45151l34661n75923
17269G522441l12615j73984l59005L4662k19739o0633R707k47950J07035m9901
17259F250018k50877K19307l84069j28602k95815K91610n33704K14128l23738
17250E058258j30183l15305J21370J03656j19166k24991J42947J5871r0512l9150
17240D522795o3412n8310L143j85330j55377l5536k20456j73550J72390k62144
17230C544213J78660j41423m0896l14614Q2398k9384j0978r1380L35520j18567
$$ y = [17194688, 17036486, 16863658, 16911161, 16367060, 16277911, 16269850, 15948541, 16195851, 16247251, 16567315, 16329759, 16857164, 16711780, 16736443, 16673154, 16393309, 16156055, 15382482, 14760101, 14175433, 13337399, 12228849, 11526942, 10652782, 9961648, 9278176, 8433025, 8098364, 7522441, 7209826, 7035842, 6676837, 6711499, 6491760, 6431127, 6440834, 6192884, 6299919, 6250018, 5999141, 6218448, 5834379, 5705777, 5409962, 5701572, 5167868, 5381996, 5058258, 4928075, 4612770, 4734140, 4837796, 4718630, 4493639, 4636586, 4652457, 4561945, 4522795, 4459383, 4401073, 4404216, 4218886, 4063509, 4027973, 3807517, 3633967, 3806357, 3544213, 3722873, 3581450, 3540554, 3225940, 3308338, 3278954, 3267976, 3176596, 3512116, 3393549]
17220C393549K07438r1406K6631l7670p1795J13983o9692J1936m0058n9790k36115
17209C147011J00496j26177K25959q7771k86326K22141k91235k03809K14066P8736
17199B993091k23627j99189P8772n3434j11040j10656j93915J51642M1089j22294
17189B250439m1284J46161j4957j56079J4384L7941l59428L30415J14944j37429
17179B185107m0764J99245P2196J42536l01579L07972q957M3921p8108K13470
17169B735039j96682l7458N0698j14989K42430j37835J41611n6964P5449J0959
17159B712258J10094K33002j70166K01506J78814k73446J45758k41719K1680J09705
17149C027486O066r2923r5074J40824K9493j55305K2814J91896p1043L1255j8958
$$ y = [3393549, 3600987, 3509581, 3536212, 3498542, 3426747, 3540730, 3471038, 3482974, 3442916, 3383126, 3147011, 3247507, 3121330, 3347289, 3259518, 2973192, 3195333, 2904098, 2700289, 2914355, 2993091, 2769464, 2570275, 2649047, 2595613, 2484573, 2373917, 2180002, 2331644, 2372733, 2250439, 2209155, 2355316, 2340359, 2184280, 2198664, 2236605, 1877177, 2207592, 2322536, 2185107, 2144343, 2343588, 2415784, 2558320, 2256741, 2564713, 2555756, 2599677, 2521569, 2735039, 2538357, 2500899, 2551597, 2436608, 2679038, 2541203, 2682814, 2625850, 2701299, 2712258, 2822352, 3055354, 2885188, 3086694, 3265508, 2992062, 3137820, 2896101, 2917781, 3027486, 3033552, 2940629, 2845555, 2986379, 3015872, 2860567, 2883381, 3075277, 3004234, 3035489, 3016531]
17138C016531J40902m1223r9663n9175J47285L762k05316J16662k21595p7663
17128B720507j30457K719P5741l8838K0060j16761L15452j09080K690m6364o291
17117B689378R7075j05572M3716j33234J42404m707k33596J99545K32158P5537
17107C002704k73711L30010k0536m4065r8320l83309M2961L44673m61735Q9968
17097B528640j21487j88226j50677P1723n6224m14453j07121n6j61416J74164
17087A574867j64975p7826Q1266k49831J44982R9711j18496n4640j26097J2256
17077A121217k0279K08358j10132K5570O28J83923k19972L53127m07559K10745
17067A345626M1687j72185N7637R7193p5963l3091J50786M5818o6258K4816L12574
$$ y = [3016531, 3157433, 3116210, 3016547, 2957372, 3104657, 3108419, 2903103, 3019765, 2798170, 2720507, 2590050, 2592769, 2668510, 2629672, 2649732, 2532971, 2848423, 2739343, 2742033, 2695669, 2689378, 2786453, 2680881, 2724597, 2591363, 2733767, 2729060, 2495464, 2695009, 2927167, 3002704, 2728993, 3059003, 3038467, 2994402, 2896082, 2512773, 2555734, 2900407, 2438672, 2528640, 2407153, 2218927, 2068250, 2139973, 2083749, 1669296, 1562175, 1562119, 1400703, 1574867, 1409892, 1332066, 1413332, 1163501, 1308483, 1408194, 1289698, 1235058, 1108961, 1121217, 1100938, 1309296, 1199164, 1224734, 1225362, 1409285, 1189313, 1542440, 1134881, 1345626, 1387313, 1215128, 1272765, 1369958, 1293995, 1260904, 1411690, 1457508, 1391250, 1416066, 1728640]
17056A728640J24599K30298J56121K67789J89345L15971p0044K6176J6408k6636
17046B958667K32128o2996j04928k140J04543J61903K26370j2766k4878O038j4534
17035C467407j67506n9866k28785n9166l52256L256m58587j42896j29599Q0090
17025A952092j32553l74048K56770k1207j16782k3868k03348K24886l8865j87789
17015A335288N1434K88765n72306K50497L4801k23798J09462j04018K7719J78171
17005A376015j41044j4804L74103k05871j28125J95413k40458O6105Q778q3634
16995A206478M9692j596r3084K76426j59712R9393N3496l71347L53492M2727k09220
16984A246745l9645J98467O6958k10725m9617K62657j14902J45346O3849j55889
$$ y = [1728640, 1853239, 2083537, 2239658, 2507447, 2696792, 3012763, 2942719, 2968895, 2985303, 2958667, 3190795, 3127799, 3022871, 3020731, 3125274, 3287177, 3513547, 3500781, 3475903, 3481941, 3467407, 3299901, 3240035, 3011250, 2952084, 2599828, 2603084, 2144497, 2001601, 1872002, 1952092, 1819539, 1445491, 1702261, 1681054, 1564272, 1540404, 1337056, 1561942, 1523077, 1335288, 1386722, 1675487, 1103181, 1353678, 1388479, 1164681, 1274143, 1170125, 1197844, 1376015, 1234971, 1220167, 1594270, 1388399, 1260274, 1455687, 1215229, 1281334, 1290112, 1206478, 1256170, 1254574, 1161490, 1437916, 1278204, 1377597, 1431093, 1059746, 1413238, 1455965, 1246745, 1207100, 1405567, 1472525, 1261800, 1212183, 1474840, 1359938, 1505284, 1569133, 1413244]
16974A413244M3106K57876l03356K79762n8442m8849K21717R5887J13461n3850
16964A960556p2319L4050K99147M4383k0535J25554M899o2131K45443J61880j32422
16953B588505n5466k1354j1704j13581q9317j3447k11826J05189j36966J20095
16943B160128r4640k84555l3095j85723p2481j10896J28299k04717R5561j17150
16933A280731l4596j95286R1107J88565l7651q7756j09652j21855K33269j67426
16923A039450J51456l11164R5792L3783J87203O4181k43370m5887P3121J4341
16913A058906o492O8567l30365J76164J22828j38753J19772J08880j55439P516
16903A031584M377L3514J12508j29610k34897J22551K3413j49348J44687K2182
$$ y = [1413244, 1456350, 1714226, 1410870, 1690632, 1632190, 1583341, 1805058, 1900945, 2014406, 1960556, 1888237, 1922287, 2221434, 2265817, 2245282, 2370836, 2375735, 2313604, 2559047, 2720927, 2588505, 2533039, 2511685, 2499981, 2386400, 2297083, 2283636, 2071810, 2176999, 2040033, 2160128, 2065488, 1780933, 1747838, 1562115, 1489634, 1378738, 1507037, 1302320, 1397881, 1280731, 1246135, 1050849, 1141956, 1330521, 1292870, 1205114, 1095462, 973607, 1206876, 1039450, 1190906, 879742, 975534, 1009317, 1196520, 1260701, 1017331, 971444, 1044565, 1058906, 1052414, 1120981, 790616, 966780, 1089608, 950855, 1070627, 1179507, 1024068, 1031584, 1035961, 1069475, 1181983, 1052373, 817476, 940027, 963440, 814092, 958779, 980961]
16893I80961J63063j63766J69677l17018K45551r1799j1675l361r4031j60347
16883G17255K82363j61778L7255R575j32921M9306K41067k56344L82879j13607
16873A055050j74356j73333L31654k11280J75082K728N4502p6863j8440J17450
16863A082194k98725J79928j94532L76967J0577k5241j59841J46251l7486L9340
16853A119432j24796N8811r6890M4206J07027k5766o6305J02763k92586P2872
16843H98768N9384j74075K38315m023N4127L420m6991M6272j72773K44703N9091
16832A206218L7164j6830Q7762k63346J85928J70124r8259j56674K46232n526
16822A392793o6757K14134l18094L26196K54871M9416p2835q490P7005o0653J38685
$$ y = [980961, 1144024, 980258, 1149935, 832917, 1078468, 986669, 974994, 971633, 877602, 717255, 999618, 837840, 875095, 884670, 751749, 801055, 1042122, 785778, 1168657, 1055050, 880694, 707361, 1039015, 827735, 1002817, 1005545, 1060047, 983184, 964744, 1082194, 783469, 963397, 768865, 1145832, 1156409, 1131168, 971327, 1117578, 1080092, 1119432, 994636, 1053447, 956557, 1000763, 1107790, 1082024, 1015719, 1118482, 825896, 898768, 958152, 784077, 1022392, 1018369, 1072496, 1075916, 1028925, 1075197, 902424, 1147127, 1206218, 1243382, 1226552, 1314314, 1050968, 1236896, 1407020, 1308761, 1152087, 1398319, 1392793, 1326036, 1540170, 1222076, 1548272, 1803143, 1852559, 1779724, 1771234, 1848239, 1787586, 1926271]
16811A926271K69075k77684j01776N6960n163K60918k83143J23966k80111L6685
16801A725998j08918J8521K68891j60839K0962j47819k7950J34626j74199J07581
16791A656854j39506m97137J68806j39510L0171J19985k97711O4821j31520N9754
16781H95007k7604j14405J05559L43959m90281J58433N4053O7608j99477R2793
16771H85645m1530K42742j05808K1312j43100l3335p6522K13298k502j79037J44039
16760I25202o0441K89913j24556K3108m9297o1479n8236n2777L11829k72069L0544
16749I01741O0007K5144n0716K7053J93931k80259j2243J3538q463N2797j62630
16738G59900K19271J45972j58576O8686j33139Q5246n2678N61n8017J00247p7174
$$ y = [1926271, 2195346, 1917662, 1815886, 1872846, 1867683, 2128601, 1845458, 1969424, 1689313, 1725998, 1617080, 1635601, 1904492, 1743653, 1764615, 1616796, 1588846, 1723472, 1549273, 1656854, 1517348, 1020211, 1189017, 1049507, 1079678, 1199663, 901952, 966773, 835253, 895007, 867403, 752998, 858557, 1202516, 712235, 870668, 924721, 992329, 792852, 885645, 844115, 1086857, 981049, 1002361, 859261, 825926, 749404, 962702, 960200, 781163, 925202, 864761, 1154674, 1030118, 1053226, 1003929, 942450, 884214, 831437, 1143266, 871197, 901741, 961748, 986892, 936176, 963229, 1157160, 876901, 864658, 878196, 869733, 922530, 759900, 979171, 1125143, 966567, 1035253, 902114, 987360, 934682, 935243, 877226, 977473, 900299]
16727I00299n3070K56905k19568J07437Q065k26160J84904L97413k97693M2115
16717A100647J38987q1765J52928q5436R4477j69111n3306n6405J19187l2060
16707A128143K08766k41352N26022j44286J90027j51606J86195p9487O5763o5567
16697A622618K57441l59066K29816j53189J08006j73704K07362P27j0712J26834
16687A856133l2558P5662k26448K21973j86426k2382N6961k90071o3155j62182
16677A227507n386J173q3170K07374k5427j39329L40299n0919J98323Q5153K6734
16666A782332j12385J86814j03153J68654J19702j82775O210K24846l13749o1543
16656A714953K20045k38891K51287Q844l5693P4482j48242J5375n7550J09067
$$ y = [900299, 847229, 1104134, 884566, 992003, 1000068, 773908, 958812, 1356225, 1058532, 1100647, 1239634, 1157869, 1310797, 1225361, 1319838, 1150727, 1097421, 1041016, 1160203, 1128143, 1336909, 1095557, 1621579, 1477293, 1667320, 1515714, 1701909, 1622422, 1688185, 1622618, 1880059, 1520993, 1750809, 1597620, 1705626, 1531922, 1739284, 1740011, 1729299, 1856133, 1823575, 1899237, 1672789, 1894762, 1708336, 1685954, 1742915, 1452844, 1389689, 1227507, 1222121, 1223294, 1140124, 1347498, 1322071, 1182742, 1523041, 1472122, 1670445, 1755598, 1782332, 1669947, 1856761, 1753608, 1922262, 2041964, 1859189, 1865399, 2090245, 1776496, 1714953, 1934998, 1696107, 1947394, 1956238, 1920545, 1995027, 1846785, 1862160, 1804610, 1913677]
16646A913677l50532L5150k80173k7755J42878k76303Q2520J8393j3973m3085
16636A200797Q5538K06660l59346J6443N7420j92656J72434m3312j354q734k7397
16625A106493J24059j72435J48329P270m100J01690J73604L0829j29511M4965
16615A431193j8036K28378j89244k53127K11120m0973J39941j43855K67071j92363
16605A440105R9886j20678j1803O2593L7285q5823j79281L29106m0878r7200K8434
16594A461746p55k9066L3300j85930L09848l03277O1416l194q4198K8888L69037
16583A657815m12149L5497J21708j49106K09340j09619j77443R6029j01779N7338
16573A227631J24313l23665K1465J28223J22985J12183j12628j2583O964J68547
$$ y = [1913677, 1563145, 1598295, 1318122, 1290367, 1433245, 1156942, 1239462, 1257855, 1243882, 1200797, 1286335, 1492995, 1133649, 1150092, 1207512, 1014856, 1187290, 1143978, 1142624, 1133890, 1106493, 1230552, 1058117, 1206446, 1213716, 1209616, 1311306, 1484910, 1515739, 1386228, 1431193, 1413157, 1641535, 1452291, 1199164, 1410284, 1369311, 1509252, 1365397, 1632468, 1440105, 1539991, 1419313, 1407510, 1470103, 1507388, 1421565, 1242284, 1571390, 1530512, 1433312, 1461746, 1460991, 1431925, 1465225, 1279295, 1589143, 1285866, 1347282, 1344088, 1259890, 1288778, 1657815, 1245666, 1281163, 1402871, 1253765, 1463105, 1353486, 1176043, 1272072, 1170293, 1227631, 1351944, 1028279, 1049744, 1177967, 1300952, 1413135, 1300507, 1287924, 1294888, 1463435]
16563A463435k03494n0921J09985K2923L02475j45864j39452J16897L8126K31865
16553A745975p9532O2802l4899r0659J32268r1778l7964L13710k21001j70538
16543A528384L5699J38878J48098j93445n1439J2687K14130k31450K2229K48823
16533A872594O0179J94558o0230k40890J14786K19799j77915M8219N450j8798
16523B017752K30810p9793J5312p8841k44740J73765j62657P4073p2974Q1679
16513A954386R243P5730m0202J73232j55622L73698j2542k94196L00961J325J08511
16502B494524Q217R8122J98505L1185J42965K1231L5387j76686j44726L87915
16492C096639k42273j7572j0093K5180Q167J52094m0359K17321J86275O1361R778
$$ y = [1463435, 1259941, 1209020, 1319005, 1341928, 1644403, 1498539, 1359087, 1475984, 1514110, 1745975, 1666443, 1729245, 1694346, 1603687, 1735955, 1644177, 1606213, 1919923, 1698922, 1528384, 1564083, 1702961, 1851059, 1657614, 1606175, 1618862, 1832992, 1601542, 1623771, 1872594, 1932773, 2127331, 2067101, 1826211, 1940997, 2160796, 1982881, 2031100, 2036550, 2017752, 2248562, 2168769, 2184081, 2105240, 1860500, 2034265, 1871608, 1945681, 1872707, 1954386, 1963629, 2039359, 1999157, 2172389, 2016767, 2390465, 2377923, 2083727, 2384688, 2386013, 2494524, 2502741, 2600863, 2799368, 2830553, 2973518, 2994749, 3030136, 2853450, 2708724, 3096639, 2854366, 2836794, 2826701, 2851881, 2860048, 3012142, 2971783, 3189104, 3375379, 3436740, 3446518]
16481C446518o4501K87827o037L23540M2812L60133N2703K36471L06585j01002
16471D885049L94003J92950J01002q4435L62266L33205J92988K80303J83944K71592
16461G112867J49332M69626K6442M50591M88714N20037L57935O74029J026021
16452A1275594Q48557J222750J016338J425397J516682J744112J732957K173690
16444B2956077K282856K784845K964411L533089M031492M779904N861477O361328
16436E5555479O968890P204857O672568O206909N866677N621232N834223N735053
16428A05665888N779990N202746N516480N201137N106303N122907M753501L842169
16420A46191121K177419J130399N45572R06292L6098n46698j267188j851344k455476
$$ y = [3446518, 3382017, 3669844, 3663807, 3987347, 4030159, 4390292, 4442995, 4679466, 4986051, 4885049, 5279052, 5472002, 5573004, 5488569, 5850835, 6184040, 6377028, 6657331, 6841275, 7112867, 7262199, 7731825, 7758267, 8208858, 8697572, 9217609, 9575544, 10249573, 11275594, 12124151, 13346901, 14363239, 15788636, 17305318, 19049430, 20782387, 22956077, 25238933, 28023778, 30988189, 34521278, 38552770, 43332674, 49194151, 55555479, 62524369, 69729226, 76401794, 82608703, 88475380, 94096612, 99930835, 105665888, 111445878, 116648624, 122165104, 127366241, 132472544, 137595451, 142348952, 146191121, 148368540, 149498939, 150044511, 150950803, 150986901, 150440203, 149173015, 147321671, 144866195]
16411A44866195l337463l764505m472017n218545n650563n423359o531180o358914
16403A04109649o550856p383913p869943p755766p533547p253457o881562o573612
16395D6306993o025918n218224l929074k043953J015566N915854J0781901J3826185
16387F0629330J2169648O609952Q43205l171773n134627o922399q561153q800899
16379D7661284p988603o561695m295447l052055j537035L54387Q30879P89164
16371B6200879M16609k83672o12550j006656j072332j027613j328315j112949
16363B0173401j067625r37081q59610q51666l69897o95311r17226r13341j021359
16354A2540285j048208j174090j187892j031260j244903q56762r82465r54428
$$ y = [144866195, 141528732, 137764227, 133292210, 128073665, 122423102, 116999743, 110468563, 104109649, 97558793, 90174880, 82304937, 74549171, 67015624, 59762167, 52880605, 46306993, 40281075, 35062851, 31133777, 29089824, 30105390, 36021244, 46803145, 60629330, 72798978, 79408930, 80252135, 77080362, 71945735, 65023336, 56462183, 47661284, 39672681, 33110986, 28815539, 25763484, 24226449, 24580836, 25411715, 26200879, 26617488, 26333816, 25721266, 24714610, 23642278, 22614665, 21286350, 20173401, 19105776, 18168695, 17309085, 16457419, 16087522, 15392211, 14474985, 13561644, 12540285, 11492077, 10317987, 9130095, 8098835, 6853932, 5997170, 5014705, 4060277]
16346D060277r01217o88650n54504n64344l32081J9551m73690L32330O9263J19764
16336A086699K03896j48609L04132n37238J2432J87236j34873O9558M1275m49820
16326F34688j95862j203m6719g0168b920n64709o4089P5556j3566l49341P2116
16315h46953J08011q801L27290p7561J89694f5798j88563g8794p5972l5121H114
16303a49122e3589k38730J11514k86396J41523k07413K05783l2368n6694n3126
16293d69496p7008P5209P5823P0983p5239l2448M057l5122q6506J00392m5277
16282d94632n6396l7012q8934L28159k48649N3197l3028j13457P6619K21763j2020
16271d04390R3925m2462a3024j93072j78820a46627B14613l8083f6910A02724
$$ y = [4060277, 3159060, 2470410, 1915906, 1351562, 1019481, 1039032, 565342, 897672, 966935, 1086699, 1290595, 1141986, 1446118, 908880, 921312, 1108548, 973675, 1043233, 1084508, 634688, 438826, 437623, 390904, -70168, -2920, -567629, -631718, -556162, -569728, -919069, -846953, -738942, -747743, -420453, -498014, -308320, -65798, -254361, -78794, -154766, -189887, 8114, -149122, -53589, -292319, -180805, -467201, -325678, -533091, -327308, -359676, -416370, -469496, -546504, -471295, -395472, -324489, -399728, -432176, -428119, -463241, -549747, -449355, -494632, -551028, -588040, -676974, -348815, -597464, -544267, -577295, -690752, -614133, -392370, -404390, -310465, -352927, -13024, -206096, -384916, -146627, 214613, 176530, -66910, 102724]
16260B72059p7004J03145H0224a2763B6796r28b20669N998j13272f0927k97950
16249c58877O7414g1945j52044p9891a43356K6747b3929p2945B3422J80191O8547
16238B72160n2163Q8742J5273J08779j83484H8142J18962j0105J35434O2336E7257
16226D57250G3749K72299O9731j30049j04326p7434J75101R1707j12011L3280
16216B92047K4653P1719R4190k08338K20926O8204K3729B66629J94969m6648P2272
16205D87222K1632k0553J27573R2671C28822J18943M0257J28865j07921l7813
16195D71153J23922k44024J46831j15032o3012R5790l842Q2862B17256M43174
16185F60430j63803j3457k0651j97707J20651J37141k2688k7660n4299l9569p6274
$$ y = [272059, 195055, 298200, 80224, -12763, 26796, 25868, -220669, -214671, -327943, -60927, -358877, -291463, -71945, -223989, -303880, -143356, -116609, -23929, -96874, 23422, 203613, 272160, 219997, 308739, 324012, 432791, 249307, 88142, 207104, 196999, 332433, 394769, 57257, 457250, 73749, 346048, 415779, 285730, 181404, 103970, 279071, 370778, 258767, 292047, 316700, 388419, 482609, 274271, 495197, 563401, 587130, 266629, 461598, 414950, 487222, 508854, 488301, 615874, 708545, 328822, 447765, 488022, 616887, 508966, 471153, 595075, 351051, 497882, 382850, 319838, 415628, 411786, 494648, 217256, 660430, 496627, 483170, 462519, 264812, 385463, 522604, 499916, 472256, 417957, 378388, 302114]
16174C02114q7669J75199j6357J09859j35287o1184J05624p7398L52734j11346
16164E56289B30058K33101k1363l1748j5798j51314k001J07130J19738k05876
16154B61927n7232j5787O2823p9350M2972L170M5054l2434K36303q1591m4857
16143C40998M4898K8638p6864O9979J64363l7299r4648m7618J67913B69805P1688
16132C41493K90018k31753j04073J64316K0382R6645l4511q9064R1180k08072
16122C36561M2344p1702K92574j59364L28474j79634j66504J12763R3657j69599
16112D59570J35080o4635J05055q4153J50129q3443k7480J52989m4093k37174
16102D61845J64201l2700K692n072M21850l88852O2910k34831L87749l58263N34526
$$ y = [302114, 214445, 389644, 373287, 483146, 347859, 286675, 392299, 314901, 667635, 556289, 230058, 463159, 441796, 410048, 394250, 242936, 240935, 348065, 467803, 261927, 204695, 188908, 251731, 172381, 215353, 218523, 263577, 231143, 467446, 385855, 340998, 385896, 414534, 337670, 407649, 572012, 534713, 440065, 392447, 560360, 269805, 341493, 631511, 399758, 295685, 460001, 480383, 577028, 542517, 453453, 544633, 336561, 378905, 307203, 599777, 440413, 768887, 589253, 422749, 535512, 629169, 459570, 594650, 530015, 635070, 550917, 701046, 617603, 590123, 743112, 699019, 461845, 626046, 593346, 596038, 590966, 1012816, 623964, 686874, 452043, 839792, 481529, 1016055]
16091A016055j73556k70206J72218O3209p0915N4255j62643j01169K30584K6726
16081G84558J25680j43431l9347K56014j13566k9435j18226J96064Q8648k12127
16071G94832P0152l0459J18686K90M1984K6704k6369r6463L85706n6868j63438
16060A064757j8805l4177J44620k43089J23264J93316L6087p0961k6815J55175
16050A323372j26778J05826O8937N6053j78731J17561k5174j9650k16377K11045
16040A316084j01348M3173j16992M8367k24044L85539j94973N098L07756o8733
16030A399927j51884J3970J61274K7451m5553L9867L4479J74477J56132p7944
16020A732196j54750k5851L21429j32397j66976J28922J18284j22455m0544Q9561
$$ y = [1016055, 842499, 572293, 744511, 807720, 736805, 791060, 628417, 527248, 757832, 784558, 910238, 766807, 727460, 983474, 869908, 840473, 722247, 918311, 1006959, 794832, 864984, 834525, 953211, 953501, 995485, 1022189, 995820, 899357, 1285063, 1228195, 1064757, 1045952, 1011775, 1156395, 913306, 1036570, 1229886, 1265973, 1195012, 1168197, 1323372, 1196594, 1302420, 1371357, 1427410, 1248679, 1366240, 1341066, 1321416, 1105039, 1316084, 1214736, 1257909, 1140917, 1189284, 965240, 1350779, 1155806, 1160904, 1468660, 1399927, 1248043, 1262013, 1423287, 1450738, 1405185, 1445052, 1479531, 1654008, 1810140, 1732196, 1577446, 1551595, 1873024, 1740627, 1573651, 1702573, 1820857, 1698402, 1657858, 1747419]
16010A747419j94624J63396K07461j68655J46459j71730j808q7899M6305N2931
16000A739255o8282j43773J68701J53613m14029J72029K60713p3817j44369m4428
15990A605613Q1601P6679k77084N355J11985P5212J57879k870R029n5865J99901
15979A987435J4077M5169m07187K77138l9492L5942o793M2177J0015j7832j03042
15968A837607o1093J30177p9691Q4927O5462j39617l3810j68430R7711j37935
15958A595308K59857k07379J890j8558J98426K3313k17879k2411L28756j87155
15948A754168R2947l4720j6310K88726k64009J59490r8036Q5988L42223j40547
15938B169920k01137N37366j52464j28133K33799j52052q8346J76821l5247K50843
$$ y = [1747419, 1552795, 1716191, 1923652, 1754997, 1901456, 1729726, 1727918, 1640019, 1686324, 1739255, 1670973, 1527200, 1695901, 1849514, 1435485, 1607514, 1868227, 1794410, 1650041, 1605613, 1687214, 1763893, 1486809, 1492164, 1604149, 1679361, 1837240, 1834370, 1843399, 1787534, 1987435, 2001512, 2046681, 1639494, 1916632, 1877140, 1913082, 1906289, 1948466, 1958481, 1940649, 1837607, 1776514, 1906691, 1827000, 1911927, 1977389, 1837772, 1803962, 1635532, 1733243, 1595308, 1855165, 1647786, 1649676, 1631118, 1829544, 1852857, 1634978, 1612567, 1941323, 1754168, 1847115, 1812395, 1796085, 2084811, 1820802, 1980292, 1882256, 1968244, 2310467, 2169920, 1968783, 2506149, 2353685, 2225552, 2459351, 2307299, 2218953, 2395774, 2360527, 2611370]
15928B611370J48261K7133n726O7771L66702O5663k1537L65277j63351K16163
15918C677726P67141J55037M98661P37162J034877J013222J730783K262184L138681
15909A5015474N024351O191512P084007P567763P233589O226482M373890L065722
15901F1782790J382769p38436l598289n515766p922925q688049q280681p583207
15893B0838206n356143l858519k464002j639992j356928p35761p96981k77635
15885D352245n34308k10018m71254j32060k03816j46095l3817l25164J71304j74237
15875B292780k91937L57802k30996q5934Q2716J27043J08470j23707j06989R6548
15865B225796Q798J50544k17491j98140j11978J80012q5246Q6466J5551m71706
$$ y = [2611370, 2759631, 2786764, 2781038, 2848809, 3215511, 3281174, 3259637, 3624914, 3461563, 3677726, 4444867, 4599904, 5098565, 5835727, 6870604, 7883826, 9614609, 11876793, 15015474, 20039825, 26231337, 33315344, 40883107, 48116696, 54343178, 58717068, 61782790, 63165559, 62427123, 58828834, 53313068, 45390143, 36702094, 28421413, 20838206, 15482063, 11623544, 9159542, 7519550, 6162622, 5426861, 4629880, 4352245, 3817937, 3607919, 3136665, 3004605, 2800789, 2654694, 2620877, 2295713, 2467017, 2292780, 2000843, 2358645, 2127649, 2041715, 2124431, 2251474, 2359944, 2236237, 2129248, 2225796, 2234594, 2385138, 2167647, 1969507, 1857529, 2037541, 1952295, 2038761, 2054312, 1582606]
15855A582606K91267M4585o7769j35259J88945j56299K6441l4783L48731k24916
15845A863549j06610j30613J5245K37246j02078K4823K90144J89549k56298J10712
15835B135669j03018J30211Q9739L0438J5838J35959j43689r9319j50573q7055
15825A954200J58846k24636K10236l60012J04091J96269j95432k8191J60103J22375
15815B097849j82804K01725k58205J60733p304K09422m55560N28070k79769J66644
15805B180801k759k32664J35402J70794q6675K56062J16277j01117j06841M7572
15795B376852K26866n1863P3173L08435j61328R0488J49873k9628L96066k04623
15785C174311j55003K58108k01505M63904J14005J00481J20827P5675K81770N4608
$$ y = [1582606, 1873873, 1918458, 1850689, 1715430, 1904375, 1748076, 1774517, 1739734, 2088465, 1863549, 1756939, 1626326, 1641571, 1878817, 1776739, 1801562, 2091706, 2281255, 2024957, 2135669, 2032651, 2162862, 2252601, 2283039, 2298877, 2434836, 2291147, 2191828, 2041255, 1954200, 2113046, 1888410, 2098646, 1738634, 1842725, 2038994, 1843562, 1815371, 1975474, 2097849, 1915045, 2116770, 1858565, 2019298, 2011994, 2221416, 1765856, 2293926, 2014157, 2180801, 2178042, 1945378, 2080780, 2251574, 2164899, 2420961, 2537238, 2436121, 2329280, 2376852, 2603718, 2551855, 2625028, 2933463, 2772135, 2862623, 3012496, 2982868, 3378934, 3174311, 3019308, 3277416, 3075911, 3539815, 3653820, 3754301, 3875128, 3950803, 4232573, 4287181]
15775D287181j89741N4144J7566j21218K67009j02570j08671n9924K58055j14418
15765D187413o9955M81216k70734K06103Q3287K96434l28749J57378N1830N7551
15755D851774j20334K38274j81950n1608J6066L55981O7881L11641j84720L24262
15745E627267j15101L26791L10546J2967L68943N9176K70576K40748r3297J18306
15735G126922K87499m9301o2521n5996J05317M2263J95731j42332L96590l28732
15725G515440j20701o9063m0727l24854j12304k5247l60746k03083J11125L1321
15715F401161J87862R4927J6763j0912j50477L26720j05754R6968j46581J16963
15705F827640J23001L01397J76462J83622K58267L34780m1043M96186o8173P4946
$$ y = [4287181, 4097440, 4151584, 4169150, 4047932, 4314941, 4212371, 4103700, 4043776, 4301831, 4187413, 4117458, 4598674, 4327940, 4534043, 4617330, 4913764, 4585015, 4742393, 4794223, 4851774, 4731440, 4969714, 4787764, 4736156, 4752222, 5108203, 5176084, 5487725, 5303005, 5627267, 5512166, 5838957, 6149503, 6162470, 6531413, 6590589, 6861165, 7101913, 7008616, 7126922, 7414421, 7365120, 7302599, 7246603, 7351920, 7394183, 7589914, 7447582, 7844172, 7515440, 7394739, 7325676, 7284949, 6960095, 6847791, 6822544, 6461798, 6258715, 6369840, 6401161, 6589023, 6683950, 6700713, 6689801, 6539324, 6866044, 6760290, 6857258, 6710677, 6827640, 6950641, 7252038, 7428500, 7612122, 7870389, 8205169, 8164126, 8660312, 8592139, 8667085]
15695H667085K04923J2082J65749J06739q4159k94610K36066K4j88723l22482
15685H502694n2795j14438J06017l46113L17204m53292j25552L58125k57944P6425
15675H010331k14650l82815k5115k39090k82604P1110j16589l20266L93473J09044
15665G002829j32809K27277j27205K47258K43807J81680J6356N50428N66083M72580
15655I248284J74430N30777P11945Q4681Q00630P72181N56637O36315O43022N49293
15645A4708195M91688M60834O35524O74686O03133M89731P71929J078851R38379
15636B0852950M93266O73415M32487K24812o2476J31601K4937o51666j79210k90086
15626B1650030l07346K70551j50854J73521o1908k77791o88484m73452n91848
$$ y = [8667085, 8872008, 8884090, 9049839, 9156578, 9072419, 8777809, 9013875, 9013899, 8825176, 8502694, 8449899, 8335461, 8441478, 8095365, 8412569, 7959277, 7833725, 8191850, 7933906, 8010331, 7795681, 7412866, 7387751, 7148661, 6866057, 6937167, 6820578, 6500312, 6893785, 7002829, 6870020, 7097297, 6970092, 7217350, 7461157, 7642837, 7659193, 8209621, 8775704, 9248284, 9422714, 9953491, 10665436, 10750117, 11550747, 12322928, 12879565, 13515880, 14158902, 14708195, 15199883, 15660717, 16296241, 16970927, 17574060, 18063791, 18835720, 19914571, 20852950, 21346216, 22019631, 22452118, 22676930, 22614454, 22746055, 22770992, 22119326, 21940116, 21650030, 21342684, 21613235, 21462381, 21635902, 21573994, 21296203, 20607719, 20134267, 19542419]
15617A9542419r07606j190176r55131p70810p13779n62438l33859m84162p35662
15608A2888796O6752l57895m50870o60479o1493j77772l96146n10517j37900j44734
15598A0057742J86059M7379L22014J52808J77708P77228J509260K345638M847183
15589B0423019J0447484J5531986J5303052J1172847P446626N288243L028063
15582H8641320J710828n32692l076777r800037j9240833k1477789j4329281o624264
15574A5270475l313719j388592r66084k97965n99997k35285L85954J09650K09566
15565I174003M25551R121K69529K42404L30123Q24834M06731J000107J948442
15556A4630845L877765Q383824J5321204K0840666J8947000J3120858Q812300
$$ y = [19542419, 18634813, 17444637, 16489506, 15718696, 15004917, 14442479, 14108620, 13624458, 12888796, 12955548, 12597653, 12146783, 11486304, 11424811, 11247039, 10850893, 10340376, 10202476, 10057742, 10243801, 10291180, 10613194, 10766002, 10943710, 11720938, 13230198, 15575836, 20423019, 30870503, 46402489, 61705541, 72878388, 80325014, 85613257, 88641320, 90352148, 89819456, 86742679, 76942642, 57701809, 36224020, 21894739, 15270475, 11956756, 10568164, 9602080, 9304115, 8704118, 8468833, 8854787, 8964437, 9174003, 9599554, 9608675, 9878204, 10120608, 10450731, 11275565, 11682296, 12682403, 14630845, 18508610, 26892434, 42213638, 63054304, 82001304, 95122162, 103934462]
15549A03934462O058247L453584J119540j749140o137237j5868741k7769614k5924872
15541C7116229j6201918p149984l162779j712248j099350n91500o32474k67353
15533F298623k34248j29585P1071k30899o6536l16007j70271k54059k44548Q9350
15523D812891l31023j57480N2538n09649P023j2969n9301J25763J0629o2821J12504
15512C988105l4034M29377j69804K13652J0554J43500L0721m921J9588j49080
15502D477658r4520M8145m6808k07414k41524l2682L2200r4800L00801m20508
15492C720548M20030K41715J0543k44185K42284j72567L33901K69659P0435K46758
15482E139121J22748L76040K45777K14640r3748p7665J53979K04008K3413M3124
$$ y = [103934462, 109992709, 113446293, 114565833, 112816693, 106679456, 90810715, 63041101, 37116229, 20914311, 13764327, 10601548, 8889300, 7789950, 7198450, 6565976, 6298623, 6064375, 5934790, 6005861, 5774962, 5708426, 5392419, 5222148, 4968089, 4723541, 4812891, 4481868, 4324388, 4376926, 3867277, 3874300, 3861331, 3802030, 3927793, 3938422, 3875601, 3988105, 3954071, 4383448, 4213644, 4427296, 4437850, 4581350, 4612071, 4607150, 4626738, 4477658, 4383138, 4431283, 4384475, 4177061, 3935537, 3902855, 3935055, 3840255, 4141056, 3720548, 4140578, 4382293, 4392836, 4148651, 4390935, 4218368, 4552269, 4821928, 4892363, 5139121, 5261869, 5637909, 5883686, 6098326, 6004578, 5926913, 6080892, 6284900, 6308313, 6351437]
15472F351437j27505O32282N41578N93961P66942P01532N55064L30926L57263
15463A0703480l488r7772k07324k41449q63481K7414l15554o90N86782L70801
15453I958719O60158N26849L68430K55341m10655K02674k13929l58692j092597
15444I896298l53418n56668j41870l35334L07915J59449N9028K3576L4370r5613
15434H997733Q2714o0200m67142n52999l90030j84156k72808k25343l97458l58980
15424F171331L39245k48998k16652P7131n41478K83510l40693k74205O2430n11172
15414D800449m7142j92813Q526L88888k04595o9906j66985J25911k5241L89126
15404E006218l14023J64519K60260j08877K07791J52259o7375m0691K30262O4351
$$ y = [6351437, 6223932, 6856214, 7397792, 7991753, 8758695, 9460227, 10015291, 10346217, 10703480, 10699992, 10602220, 10394896, 10153447, 9289966, 9317380, 9001826, 9001136, 9587918, 9958719, 10618877, 11145726, 11514156, 11769497, 11358842, 11561516, 11347587, 10988895, 9896298, 9542880, 8986212, 8844342, 8509008, 8816923, 8976372, 9035400, 9058976, 9093346, 8997733, 9080447, 9020247, 8553105, 8000106, 7610076, 7425920, 7153112, 6927769, 6530311, 6171331, 6510576, 6261578, 6044926, 6122057, 5580579, 5864089, 5523396, 5249191, 5311621, 4800449, 4753307, 4560494, 4569020, 4957908, 4753313, 4683407, 4516422, 4642333, 4617092, 5006218, 4692195, 4856714, 5116974, 5008097, 5215888, 5368147, 5300772, 5260081, 5490343, 5554694]
15394E554694M1474q6057K7995J18182j81297K68406r0898K47145o3333J36093
15384E972404J93570P2652O3335L2215j21124L57007K65744l16355j13906Q6362
15374F491904j53307j12658J86328k79467J31702K62073m5369K51492k49941L89249
15364F872006r3609K89475p901K73386K00656L35116K8503J13038K32472J20901
15354H364043K86378Q7033N03068N29734L60352J138728K112013L688518O351937
15345B3421804Q714786Q398840N868093M483233L080836K219835O73851k14466
15337E6646812k280148o284645r959389j0026909o898784l480219j471426r03396
15329A5341896n50839j30087n42475j43123l17298q0079n11017J03180K54273
$$ y = [5554694, 5596168, 5510111, 5538106, 5656288, 5474991, 5743397, 5652499, 5899644, 5836311, 5972404, 6165974, 6238626, 6301961, 6334176, 6213052, 6570059, 6835803, 6519448, 6405542, 6491904, 6338597, 6225939, 6412267, 6132800, 6264502, 6526575, 6481206, 6732698, 6482757, 6872006, 6778397, 7067872, 7059971, 7333357, 7534013, 7869129, 7897632, 8010670, 8243142, 8364043, 8650421, 8737454, 9240522, 9770256, 10130608, 11269336, 13381349, 17069867, 23421804, 32136590, 40535430, 46403523, 50886756, 53967592, 56187427, 56861278, 56646812, 54366664, 48082019, 38122630, 28095721, 21196937, 17716718, 16245292, 15341896, 14791057, 14660970, 14118495, 13975372, 13658074, 13577995, 13066978, 13170158, 13424431]
15320A3424431J81679N06773N95328J023631J619535L046404N461271R353165
15312C5212217J3263283J4975916J4097350J0620619P464654M700182K479367
15305A02813588j57912l087659q942629j5532555j9014194j7364878j2479851
15298B6233910o747078l537648j380868j006355n28965l01236J72885k49108q9376
15289A2566161J34241m51552J61025P1243r8735R9113J00617K33153J039810K399000
15279A6254076M099520O935448Q160448P477346N184709L801422K209596J304703
15271E5427268J63081r39075l355408p028615j0529056r849372o162292l174602
15263A4551929j633757j391356m09150r11121o07777m02480k83650k07331J8149
$$ y = [13424431, 13606110, 14112883, 14708211, 15731842, 17351377, 20397781, 25859052, 35212217, 48475500, 63451416, 77548766, 88169385, 95634039, 100334221, 102813588, 102655676, 99568017, 90625388, 75092833, 56078639, 38713761, 26233910, 19486832, 15949184, 14568316, 13561961, 13032996, 12731760, 12904645, 12655537, 12566161, 12700402, 12248850, 12409875, 12481118, 12382383, 12481496, 12582113, 12815266, 13855076, 16254076, 20353596, 27289044, 35449492, 42926838, 48111547, 51912969, 54122565, 55427268, 55590349, 54651274, 51295866, 44267251, 33738195, 23888823, 17726531, 14551929, 12918172, 11526816, 11117666, 10206545, 9598768, 9196288, 8912638, 8705307, 8723456]
15254H723456n0984O0055L58108K52191K06633O13397n7073j85678j35928m26236
15244I357941j33458j30023l67619k19119k93215k49046m06770J44234K5677J79468
15234G908070O63798L51766M96884M34402K64764J19347K49529O3780k06777l52074
15224I993489p9067o86389m02668m41044k32327L1405j4116N69451L2825M74446
15214I246005K34401N28533K05027J74631R0041O9370n43645k86223n76384m05624
15204H736132m51783o19246l36860m85893o9938k44522k64475j80781J65131K2860
15194F270625m31290P2759R4373K8608K72926L0802L9107K25266J6344O5791P168
15183F692479J28640n320L09078l15665K41154O1898J18333K15231R8269o7307
$$ y = [8723456, 8672472, 8732527, 9090635, 9342826, 9549459, 10162856, 10105783, 9920105, 9784177, 9357941, 9224483, 9094460, 8726841, 8507722, 8214507, 7965461, 7558691, 7702925, 7728602, 7908070, 8571868, 8923634, 9420518, 9854920, 10119684, 10239031, 10488560, 10552340, 10345563, 9993489, 9914422, 9228033, 8825365, 8384321, 8151994, 8183399, 8169283, 8738734, 8771559, 9246005, 9480406, 10008939, 10213966, 10388597, 10478638, 10548008, 10004363, 9718140, 9141756, 8736132, 8284349, 7665103, 7328243, 6842350, 6772412, 6527890, 6263415, 6082634, 6247765, 6270625, 5839335, 5912094, 6006467, 6035075, 6308001, 6338803, 6377910, 6603176, 6619520, 6685311, 6692479, 6821119, 6815799, 7124877, 6809212, 7050366, 7112264, 7230597, 7445828, 7544097, 7476790]
15173G476790K28766o2589m3436m4582K12519l11865K9163j8858m2057o9002K29559
15162G584408O0277K37399q2726J24411J65619q49K44408J38920O3982n6207K18775
15151H698417j13224j76982O4232j3569m22223K66205r803q3902J1990L143n8867
15140H165417J99496l5754l10485J25722j8032N8388M9027J5135m50261K36872
15130H035525k40521M3575J3641J96399p0591J09845r9462N5431j01325J22161
15120H064678j69568L5250J15275l02693n4505j50380P1860j83212L27977J4201
15110G768883Q1223j37263r854K93398N91M00466N5080L7150K81231K97611L87647
15099I456163K4987J22304L913N87484Q4862O64913L56121R75018J097127J919371
$$ y = [7476790, 7705556, 7642967, 7599531, 7554949, 7767468, 7455603, 7484766, 7465908, 7423851, 7354849, 7584408, 7644685, 7882084, 7799358, 7923769, 8089388, 8088539, 8332947, 8471867, 8535849, 8479642, 8698417, 8585193, 8408211, 8472443, 8458874, 8036651, 8302856, 8293053, 8209151, 8221141, 8224284, 8165417, 8364913, 8329159, 8018674, 8144396, 8126364, 8184752, 8233779, 8248914, 7798653, 8035525, 7795004, 7838579, 7852220, 8048619, 7978028, 8087873, 7988411, 8043842, 7942517, 8064678, 7895110, 7930360, 8045635, 7742942, 7688437, 7538057, 7609917, 7426705, 7754682, 7768883, 7850106, 7712843, 7702989, 7996387, 7996978, 8397444, 8452524, 8489674, 8770905, 9068516, 9456163, 9481150, 9603454, 9607367, 10194851, 10279713, 10944626, 11300747, 12275765, 13372892, 15292263]
15089A5292263K917180L261693K986244K588811J553099J729789P76827M55092
15081C1560998j22845q15617k440932k597670k459318n40326J349263K774773
15073B6708326L215430K286266K097266J422889J031103Q11551k7367k37075p11204
15064C6597185n46994J240849L083417L416299K996860K765377K699197K619009
15056E4871199K698766K676178J104638k523608m770058k617152O15174K808039
15048E4863176M790974L958912K221773J160762P77725J720503K241960J934071
15040G3669856P45075j624524l210816l788923j606841l33552P12685M27447P11002
15031F5701409J358278L471294O389422O934207O002052M657535K891153J747017
$$ y = [15292263, 18209443, 21471136, 24457380, 27046191, 28599290, 30329079, 31105906, 31560998, 31438153, 30622536, 28181604, 25583934, 23124616, 22584290, 23933553, 26708326, 29923756, 32210022, 34307288, 35730177, 36761280, 37572831, 37545464, 37308389, 36597185, 36050191, 37291040, 40374457, 43790756, 46787616, 49552993, 52252190, 54871199, 57569965, 60246143, 61350781, 58827173, 54057115, 51439963, 52055137, 54863176, 59654150, 63613062, 65834835, 66995597, 67773322, 69493825, 71735785, 73669856, 74414931, 72790407, 69579591, 65790668, 64183827, 63850275, 64562960, 64990407, 65701409, 67059687, 70530981, 76920403, 83854610, 89856662, 94514197, 97405350, 99152367]
15023I9152367J98493q63953k051343m216265p325961p721266n365780k220423
15015F9585869m87125n6972K54503L44590J0962L33060L2990j012881j987672
15006F7017324l878022n023818n015307l146004j679495j035080l90553K87557
14998D7136602J346546K185159J956629J920180J734957J322267N57831l59396
14990E7800775j430045j830117j671978j029688m27474L38650L95583R3539K31654
14981E2470899P50673P05455N7404j037410l012642m344325m976664l374027k553338
14972C4686025k806684k282198j718395q05440n5719p5364R32657Q21141Q85336
14963B9581359R15745P08729R99821J641476K506736L376890M909477P194945
$$ y = [99152367, 99350860, 98486907, 96435564, 92219299, 84893338, 77172072, 71806292, 69585869, 69098744, 69041772, 69296275, 69640865, 69651827, 69984887, 70017877, 69004996, 67017324, 63139302, 58115484, 53100177, 49954173, 48274678, 47239598, 46849045, 47136602, 48483148, 50668307, 52624936, 54545116, 56280073, 57602340, 58160171, 57800775, 56370730, 54540613, 52868635, 51838947, 51411473, 51750123, 52145706, 52239245, 52470899, 53221572, 53927027, 53984431, 52947021, 49934379, 45590054, 40613390, 37239363, 34686025, 31879341, 29597143, 27878748, 27073308, 27017589, 26942225, 27874882, 28696023, 29581359, 30497104, 31205833, 32205654, 33847130, 36353866, 39730756, 44640233, 51835178]
14955E1835178J0332949J4351275J9872509K5367829K9497303L3521674L7963645
14948B22742362M0743547M0663127M0017878L9311840L1879363J8055312K962144
14941D36375573p743186j4447421k0947527k5847754k8471077l1457119l6890468
14934B70571021l7254092k8276711j7278170r619304p793199j0400380j3758294
14927A46190871j5344163j3384649j0653187p071676l846028k622232l068448
14920I0200488l525471l471498l780983l516763l493871m597636o725911j0222979
14912E0865376j1946507j0005329o597129l788854k030307j194741n21649m39288
14904A4341572L90620M67694Q18098J292177J209630J635377J649019K392029
$$ y = [51835178, 62168127, 76519402, 96391911, 121759740, 151257043, 184778717, 222742362, 263485909, 304149036, 344166914, 383478754, 415358117, 433413429, 436375573, 428632387, 414184966, 393237439, 367389685, 338918608, 307461489, 270571021, 233316929, 205040218, 187762048, 178142744, 170349545, 159949165, 146190871, 130846708, 117462059, 106808872, 99737196, 95891168, 93268936, 90200488, 86675017, 83203519, 79422536, 75905773, 72411902, 67814266, 61088355, 50865376, 38918869, 28913540, 22316411, 18527557, 16497250, 15302509, 14780860, 14341572, 14732192, 15199886, 16017984, 17310161, 18519791, 20155168, 21804187, 24196216]
14896B4196216L289715M637315O276201N610917M560221K254909J477302N55499
14888E2858295k14136j060121k523452n672653p755709p948292o075311l326940
14880A8281681j759698r00462l28638j49151J029847N92655J389197Q68813P35797
14871A9760041N67612M46786N52545J59183M17566K22946m01144o86800j20383
14862B0918352P24535J916088L902834O276239Q921219J0434891J1364365J1597065
14854G6055588J1665440R510085O695989L881441N38330l688984q442451j1380297
14846H4835141j2494202j3208719j3122925j1405130p692141m501752k527076
14839A9883196j867897r42632n63177o09627m46271J05679l24797p9789M20161
$$ y = [24196216, 27485931, 32123246, 38399447, 44010364, 48570585, 50825494, 52302796, 52858295, 52644159, 51584038, 49060586, 43387933, 35632224, 27683932, 21608621, 18281681, 16521983, 15621521, 15292883, 15143732, 16173579, 16766234, 18155431, 19024244, 19760041, 20327653, 20774439, 21326984, 21486167, 21903733, 22126679, 21725535, 21038735, 20918352, 21642887, 23558975, 27461809, 33738048, 42659267, 53094158, 64458523, 76055588, 87721028, 97231113, 103927102, 107808543, 108346873, 104657889, 96215438, 84835141, 72340939, 59132220, 46009295, 34604165, 26912024, 22410272, 19883196, 18015299, 17072667, 16509490, 15899863, 15453592, 15559271, 15234474, 15154685, 15574846]
14830A5574846J39070k09063L27453M64878R68323N04830J330534R95833J779341
14821B1876045K875367M991938P621603R472630R042874O836351N005568K842096
14813G0564472J718987P7355j945879m679385q068109j1787808j2452176r515410
14805B3912047n926286l012103j394265j115599n96115l50871n42639m18258l15090
14796A0240821j88960n46602K39771o59885n55686j77886j86554k83547O0286
14787G941758l2542l93628k751M07181M58934k87756N05142N38096Q97130Q54756
14777A0886320Q79159M27698N16113M5135p9911L45279l83986n08507q24805r82423
14767A0320072r39029q60173L7040j85641J64700K31452o7085L62097K71570J81258
$$ y = [15574846, 15713916, 15504853, 15832306, 16297184, 17265507, 17770337, 19100871, 20096704, 21876045, 24751412, 29743350, 37364953, 46837583, 55880457, 62716808, 67722376, 70564472, 72283459, 72360814, 70414935, 65735550, 57667441, 45879633, 33427457, 23912047, 17985761, 14973658, 13579393, 12463794, 11867679, 11516808, 10974169, 10555911, 10240821, 10051861, 9505259, 9745030, 9085145, 8529459, 8351573, 8165019, 7881472, 7941758, 7909216, 7515588, 7512837, 7920018, 8378952, 8091196, 8596338, 9134434, 10031564, 10886320, 11765479, 12193177, 12709290, 12754425, 12674514, 13019793, 12635807, 12127300, 11302495, 10320072, 9381043, 8520870, 8557910, 8372269, 8536969, 8768421, 8701336, 9063433, 9335003, 9516261]
14757I516261K99051N79905K86994K40544J49878J34396l81751M71328N9886J34740
14747A1491232l03780J5619N8678N04667K69420N40160L25465J060993R72742
14738A4935196J241089J823522K280403K930582M442361N770368Q914121J3320850
14730E5658492K0715318K9956932L7020161M0239229M0120243L5012576K6657219
14723B85380170J7662854Q730515o00285j2496888k7253327l9884258m6247817
14716A85290964m6568735m0815372l0321708j9286722j1619589o932197m788614
14709B4958027l309592k486524j948233j299925j284682q20001p56488j212995
14701A1839587q40770j513943m62029m78911l16804l08378k62173k71722k25045
$$ y = [9516261, 9815312, 10395217, 10682211, 10922755, 11072633, 11207029, 10825278, 11296606, 11356492, 11491232, 11187452, 11203071, 11261749, 11766416, 12035836, 12575996, 12901461, 13962454, 14935196, 16176285, 17999807, 20280210, 23210792, 27653153, 33423521, 42337642, 55658492, 76373810, 106330742, 143350903, 183590132, 223710375, 258722951, 285380170, 303043024, 311773539, 311173254, 298676366, 271423039, 231538781, 185290964, 138722229, 97906857, 67585149, 48298427, 36678838, 29746641, 24958027, 21648435, 19161911, 17213678, 15913753, 14629071, 13809070, 13052582, 11839587, 10998817, 9484874, 9022845, 8543934, 8227130, 7918752, 7656579, 7384857, 7159812]
14692G159812K3707j145J6360K63899L4085J25924n1339L10432m0811K1607l6273
14681G826258M87042l6835M7869N23726N49402O34226O68828N17430R21676q9963
14671A2049659j73190q593k26637k46776p25746r95344j054605p80140k56890
14662G581738j48277j40586j12634J99781P2319J03868j76125m92453n35365k07595
14652F144671j25614l02511L40655J2634L83547n551k3516O2371L29594K3665
14642F839945K36483q6450L20021K30931m1311K25327L1195L54946O23235J70692
14632H905014L39623j11248m4583q9245o72292p14634m03026r47477o03371l49249
14622E309512l68370k89266j82209M0224m8452J51772m08507J1426j39195j42423
$$ y = [7159812, 7183519, 7182374, 7198734, 7462633, 7496718, 7622642, 7571303, 7881735, 7840924, 7862531, 7826258, 8313300, 8276465, 8324334, 8848060, 9397462, 10031688, 10700516, 11217946, 12139622, 12049659, 11876469, 11867876, 11641239, 11394463, 10668717, 9673373, 8618768, 7838628, 7581738, 7433461, 7292875, 7180241, 7380022, 7452341, 7556209, 7380084, 6887631, 6352266, 6144671, 6019057, 5716546, 6057201, 6069835, 6453382, 6447831, 6424315, 6486686, 6816280, 6839945, 7076428, 6989978, 7309999, 7540930, 7499619, 7724946, 7756141, 8111087, 8734322, 8905014, 9244637, 9133389, 9088806, 8999561, 8327269, 7612635, 7209609, 6262132, 5658761, 5309512, 4941142, 4651876, 4469667, 4509891, 4461439, 4613211, 4204704, 4216130, 4076935, 3934512]
14612C934512r2713k10989K40528j20420r8494j36040K15629l15919J37351l20592
14602C232853J86031J17879M15492M27088O32321N69819N43677M09016J16103
14593F650279M50633J22470n00270k37953m04788n18690o03744o22998m15651
14584C919288J10759k89291P9931k4521N2132J73213k31780J50674K82388k52697
14574C970096L91697k40187N22181r2599J35017O2986O68008K94902O07068N17277
14564F836446O99315P58355J346984K156181L688281O764561R144276R157047
14556D0551446O805351M790745L629731K113111R56646N347j891800n676478j0485674
14547D0798425j0586534p278792j181200L457995P507829R549006Q104768O134288
$$ y = [3934512, 3841799, 3630810, 3871338, 3750918, 3652424, 3516384, 3732013, 3416094, 3553445, 3232853, 3418884, 3536763, 3952255, 4379343, 5011664, 5581483, 6125160, 6534176, 6650279, 7100912, 7223382, 6723112, 6485159, 6080371, 5561681, 4957937, 4334939, 3919288, 4030047, 3740756, 3820687, 3796166, 3848298, 4021511, 3789731, 3940405, 4222793, 3970096, 4361793, 4121606, 4643787, 4551188, 4686205, 4749191, 5417199, 5712101, 6319169, 6836446, 7535761, 8294116, 9641100, 11797281, 15485562, 22250123, 31394399, 40551446, 47356797, 52147542, 55777273, 57890384, 58847030, 58852377, 56960577, 51284099, 40798425, 30211891, 22933099, 21751899, 25209894, 32717723, 42266729, 50371497, 56505785]
14539E6505785L973583K749571J171084k97966j946224m852432r970555j2188775
14531C5144071j0709413o364045k878924j359221k53497k1042N0675J16321O70634
14522A4395559O15814R42348K644380M691797O465376N975962M521932L070571
14514D3323739K409013J520295M96800J5523j877433n135556p749894o956037
14506B6046450l206699M30219L980034O103434O896261M635093L248713J800286
14498D9933791J258515k28220j027770k122928m618213p377860q946944o976761
14490A9893610l906013k087446j742415j033824j091273p46639j117235j107416
14482G061349q63837j068912n25900l60490m3342r4877j05586O082J3192j75470
$$ y = [56505785, 60479368, 63228939, 64400023, 64102057, 62155833, 57303401, 47332846, 35144071, 24434658, 18070613, 15191689, 13832468, 13578971, 13557929, 13608604, 13724925, 14395559, 15011373, 15953721, 18598101, 23289898, 29755274, 35731236, 40253168, 43323739, 45732752, 47253047, 47749847, 47765370, 45887937, 40752381, 33002487, 26046450, 22839751, 23269970, 27250004, 33353438, 40249699, 44884792, 48133505, 49933791, 51192306, 50964086, 49936316, 47813388, 43195175, 35817315, 26870371, 19893610, 15987597, 13900151, 12157736, 11123912, 10032639, 9286000, 8168765, 7061349, 6197512, 5128600, 4602700, 4242210, 4198868, 4103991, 3998405, 4004487, 4017679, 3842209]
14472C842209L38711M26776M71896K70795K76049M10139l2211J28084J85378Q2941
14462F400767L2405k06828q1801q539M4498O41030o8657L66135J32102J17760
14452G368872J7337J24483l16975m85890l86816k55713o611j8905L39187O62258
14442G041227J53828M30001L29684J10340K53450j70397M97752M45992L85464
14433I477341J20403O36649Q46226J881745K662358M781890O121421O910681O713783
14424D0152497N366096M298202K974557J786138O17673j097740m101825o878754
14416D3116844q000594q005895o048410m152132k680297k235850j156305r14665
14408I922696n80030m73823l4995k35k21756Q7143K53100n9604J20431L39763
$$ y = [3842209, 4180920, 4607696, 5079592, 5350387, 5626436, 6036575, 6004364, 6132448, 6317826, 6400767, 6433172, 6226344, 6144543, 6136004, 6180502, 6821532, 6752875, 7119010, 7251112, 7368872, 7386209, 7510692, 7193717, 6707827, 6321011, 6065298, 6058687, 6039782, 6378969, 7041227, 7195055, 7625056, 7954740, 8065080, 8318530, 8148133, 8645885, 9091877, 9477341, 9597744, 10234393, 11080619, 12962364, 15624722, 20406612, 26528033, 33438714, 40152497, 45518593, 49816795, 52791352, 54577490, 55195163, 54097423, 49995598, 43116844, 35116250, 27110355, 21061945, 16909813, 14229516, 11993666, 10837361, 9922696, 9342666, 8868843, 8833848, 8833613, 8611857, 8699000, 8952100, 8892496, 9012927, 9352690]
14398I352690N42678L14873R97999J585200K329289M162082O164244R214785J1176348
14389D5840188J1752429J1191646Q618685O721216M362541J894452j027828m272684
14381H5080645q765188j2166431j3989146j2846490r827575o780718m330400k666161
14373A3708536j903528r48719p30778k70232o31257J50098r3500k64896m6149
14364H969575l64N3572K70576M52112L96113O01716J509507J655162K609254L486774
14354B0003997M537043N712382O060517O156646N668970N302353M879458N047601
14346F3368967N418945N254557M443535L546311Q76693K15410n7099p1766l85753
14337H2609800j302697l026770n830730q950546j0188975r184249p153388n204115
$$ y = [9352690, 9895368, 10210241, 11208240, 12793440, 15122729, 19284811, 25449055, 34663840, 45840188, 57592617, 68784263, 77402948, 84124164, 88486705, 90381157, 89353329, 85080645, 76315457, 64149026, 50159880, 37313390, 27485815, 20705097, 16374697, 13708536, 11805008, 10856289, 10125511, 9855279, 9224022, 9374120, 9280620, 9015724, 8969575, 8969211, 9022783, 9293359, 9745471, 10141584, 10743300, 12252807, 13907969, 16517223, 20003997, 24541040, 30253422, 36313939, 42470585, 48139555, 53441908, 58321366, 63368967, 68787912, 74042469, 78486004, 82032315, 82909008, 83124418, 83067319, 82995553, 82609800, 81307103, 78280333, 72449603, 63499057, 53310082, 44125833, 36972445, 31768330]
14329C1768330l956439l071649k710752l759809m212142l375314k141069q74694
14321G666462q77916o11482n50834n05339m91400r8665n48309k3428l71960N248
14311C592377k46374j44977o0599k34447P9351p0408P3291M4150m47298J18159
14301B703225J07069m0807j90099o5107M6419R110j04940J47798k43953J24838
14291B493553q8402J27988k56830o3811K83675L5659l36285J61560K0033j36982
14281B240158Q7358J35661p8352J57892o8996J3333k37902K51879n4721j37468
14271B308842M83631k34993R408j81879J77271j8655j24017M9536j33186m389
14261B331569M6879R231k53394J52052r6839J22974l08072K66141k7610l59574
$$ y = [31768330, 27811891, 24740242, 22029490, 18269681, 14057539, 10682225, 8541156, 7666462, 6788546, 6177064, 5626230, 5120891, 4629491, 4530826, 3982517, 3959089, 3587129, 3592377, 3346003, 3201026, 3140427, 2905980, 2985331, 2914923, 2988214, 3032364, 2585066, 2703225, 2810294, 2769487, 2579388, 2514281, 2560700, 2569810, 2464870, 2612668, 2368715, 2493553, 2405151, 2533139, 2276309, 2212498, 2496173, 2531832, 2195547, 2357107, 2377140, 2240158, 2327516, 2463177, 2384825, 2542717, 2473721, 2487054, 2249152, 2501031, 2446310, 2308842, 2792473, 2557480, 2566888, 2385009, 2562280, 2543625, 2419608, 2469144, 2335958, 2331569, 2378448, 2387679, 2134285, 2286337, 2189498, 2312472, 2004400, 2270541, 2242931, 1883357]
14251A883357J99265l4852j55428j73720L06617j11499n0430j01486J29164o5901
14241A825087j64372J05595k21286J86091J21246J44371N3041m1032N8286q7803
14231A979224r8216K12042l61201J97593p2118L5848J13286n38445O9154j3079
14221A524088J79403M4328K7361L4589J56047K02569m8784M10239j13569j25370
14211B290901j6843J47461J23039M00541P11293K58545L14527j93410J81187J50511
14201D367752k80151L57061k55133m10399j025610p14115k46682j34360j07600
14192A550763M19948o0907K68499j53802k09424K22741J01265j49476K44161n16567
14182A717201O1812l0560J53041J36901n0463M27458J32750j27271L56850m9120
$$ y = [1883357, 2082622, 2047770, 1892342, 1718622, 2025239, 1913740, 1863310, 1761824, 1890988, 1825087, 1660715, 1766310, 1545024, 1731115, 1852361, 1996732, 2049773, 2008741, 2067027, 1979224, 1881008, 2093050, 1731849, 1929442, 1857324, 1893172, 2006458, 1468013, 1537167, 1524088, 1703491, 1747819, 1775180, 1809769, 1965816, 2168385, 2119601, 2529840, 2416271, 2290901, 2274058, 2421519, 2544558, 2945099, 3656392, 3914937, 4229464, 4036054, 4217241, 4367752, 4087601, 4444662, 4189529, 3779130, 2753520, 2039405, 1792723, 1658363, 1550763, 1970711, 1909804, 2178303, 2024501, 1815077, 2037818, 2139083, 1989607, 2233768, 1717201, 1779013, 1748453, 1901494, 2038395, 1987932, 2415390, 2548140, 2420869, 2777719, 2728599]
14172B728599N9062N2126j11534l91612J0811j73287j49811l36394R6115J52297
14162A936372j45712q8069J9595K03221j53032J67228J02577R0932Q402l2562
14152B108952P2219m2690M4905K61478j69559L7261j08161k0316J47053L67671
14142B698813O4780L44040Q11006P19600J105710P38193O08089M54309K08193
14133G752733L73188k00473j50375n30424j005371q33677j123280n23450m63994
14124C294877l52515j43522j89616L96323k3261K74844j34519L06616K03821K2699
14114C655747o5649o1420l8196k59467n9196n50962k73493M949j78438J05026
14104B278901p6810L76497O3233j26873L13108k0716O25017J53211O65722J73598
$$ y = [2728599, 2787661, 2839787, 2728253, 2336641, 2347452, 2174165, 2024354, 1687960, 1784075, 1936372, 1790660, 1702591, 1722186, 1925407, 1772375, 1939603, 2042180, 2133112, 2141514, 2108952, 2181171, 2138481, 2183386, 2444864, 2275305, 2312566, 2204405, 2184089, 2331142, 2698813, 2763593, 3107633, 3918639, 4638239, 5743949, 6482142, 7090231, 7544540, 7752733, 8125921, 7925448, 7775073, 7244649, 6239278, 5405601, 4282321, 3758871, 3294877, 2942362, 2798840, 2609224, 3005547, 2982286, 3257130, 3122611, 3429227, 3633048, 3655747, 3590098, 3528678, 3490482, 3231015, 3171819, 2620857, 2347364, 2352313, 2173875, 2278901, 2202091, 2578588, 2641821, 2514948, 2828056, 2807340, 3432357, 3585568, 4251290, 4424888]
14094D424888L06453k69987O63454l1372K56967Q732l33452l64270K07022j34050
14084D734385N37529M27673P53274P94995M36560L85904O23533J056054R01755
14075A0651662O84421J099332J704915K209733K921007M493677N967143Q064536
14067C7796426Q598349Q907427P736319O321989M684570L106997J494100m09946
14059G8236231l673656p064511j0215518j1405439j0228504q177437n779061l887010
14051A7805095k913606k624638j736072j419610r33317o35952k79368l77075l32702
14042F552755j87381m6353k43252m15615L7862m23988m43622n08291n88186j35276
14032C598653l64160m21992P60j54146J4532j14467k5053J29783m26467J47462
$$ y = [4424888, 4731341, 4461354, 5124808, 5093436, 5350403, 5359135, 5025683, 4661413, 4868435, 4734385, 5271914, 5699587, 6452861, 7247856, 7684416, 8070320, 8693853, 9749907, 10651662, 11336083, 12435415, 14140330, 16350063, 19271070, 23764747, 29731890, 37796426, 46394775, 55302202, 63038521, 69360510, 74045080, 77152077, 78646177, 78236231, 74562575, 67498064, 57282546, 45877107, 35648603, 27471166, 21692105, 17805095, 14891489, 12266851, 10530779, 9111169, 8177852, 7541900, 7262532, 6885457, 6552755, 6365374, 6319021, 6075769, 5660154, 5698016, 5274028, 4830406, 4322115, 3733929, 3598653, 3234493, 2812501, 2813261, 2659115, 2673647, 2559180, 2534127, 2663910, 2237443, 2384905]
14022B384905l4142q8760k32463N7819J33044m28303M03070j1068j60185J56352
14012B180269k37156K01432n1226l0607L8255M1731n4469K09815k57403O1456
14002B102097k78643J05594m0545j44110K07001L8684L8407Q0956M2713j50962
13992B001192n0498N06344L52297Q0728K84838O40847Q63993J320517R92576J559288
13982H552122P43028R51823P11744R3128Q9106l55937n67021j608385j080207
13973G529401j369396j273426m53303m72881l36880j77506j88539P3708J02634
13964C433812k37723j06291j99199j9049n05468k20981K88410k31285j69017j2671
13954B020538k35557J03490P2831j64025L10716J28556k09145N18219j22746O6177
$$ y = [2384905, 2350763, 2262003, 2029540, 2087359, 2220403, 1792100, 2195170, 2184102, 2023917, 2180269, 1943113, 2144545, 2093319, 2062712, 2100967, 2142698, 2088229, 2298044, 2040641, 2102097, 1823454, 1929048, 1888503, 1744393, 1951394, 1990078, 2028485, 2109441, 2152154, 2001192, 1950694, 2457038, 2809335, 2890063, 3174901, 3815748, 4679741, 6000258, 6992834, 8552122, 9295150, 10246973, 10958717, 11051845, 11140951, 10785014, 10217993, 8609608, 7529401, 6160005, 4886579, 4433276, 3960395, 3623515, 3446009, 3257470, 3331178, 3433812, 3196089, 3089798, 2890599, 2871550, 2366082, 2145101, 2433511, 2202226, 2033209, 2020538, 1784981, 1888471, 1961302, 1797277, 2107993, 2236549, 2027404, 2545623, 2422877, 2489054]
13944B489054L41566M6119M84788R71958J004971J414682K306069J590588J923209
13935A2573004J589841J127000Q67075L29920o36082p83489j778465k571832k180395
13926H536577j832707k097867j057002q22231m49783k04311l1599j82835k9300
13917A828942l56161K65536j60877j487L9327k49791K70596j41431p6005M5495
13907A464144K9203r2386M911p5915j3683R5084k16448N2398N3493M9117j88488
13896A161430J5517j53079J34119r1195L39215j78361J58206o2226r6656J07892
13886A334862q3648R1442J81566m11943L20267j00128O0204J47334j12583r3513
13876A333860m80565N30859j52621j74400L66171k44086J56034J2222J29973l8890
$$ y = [2489054, 2830620, 2876739, 3361527, 4333485, 5338456, 6753138, 9059207, 10649795, 12573004, 14162845, 15289845, 16156920, 16486840, 15850758, 15067269, 13288804, 10716972, 8536577, 6703870, 4606003, 3549001, 2726770, 2276987, 2072676, 2041077, 1858242, 1828942, 1472781, 1738317, 1577440, 1575953, 1615280, 1365489, 1636085, 1494654, 1418649, 1464144, 1493347, 1400961, 1405872, 1329957, 1316274, 1411358, 1194910, 1247308, 1300801, 1349918, 1161430, 1176947, 1023868, 1157987, 1066792, 1406007, 1227646, 1385852, 1323626, 1226970, 1334862, 1251214, 1342656, 1524222, 1112279, 1432546, 1332418, 1392622, 1539956, 1427373, 1333860, 853295, 1384154, 1231533, 1057133, 1423304, 1179218, 1335252, 1347474, 1477447, 1438557]
13866A438557Q3850R380j94442J00963j66693K54296j4721P1285P5297j80355
13856A477417q7363N0464j37013J7080J1142M2328K3416l9395j94171K73994j83459
13845A254440L44648l33894L47311l83148J95209Q8549k97174K0756J75318j20915
13835A291100n9164J5099j04936j15929L17006j21370N4809Q6481j86280J09219
13825A286035m0937J6560j51531O5676k9866Q2001J03837N3304l91122K57734
13815A251691K1986j10956k1049j21567j36053K74664l8241J5432j0260J55291
13805A280938k08879q7040K26230J82283p5796J26539k39119q2459J60678L65843
13795A649218m51930P4542l8071j37852J06943J1417K3352j72892J03383J01232
$$ y = [1438557, 1522407, 1531787, 1337345, 1438308, 1271615, 1525911, 1511190, 1582475, 1657772, 1477417, 1390054, 1440518, 1303505, 1320585, 1331727, 1374055, 1397471, 1358076, 1163905, 1437899, 1254440, 1599088, 1265194, 1612505, 1229357, 1424566, 1513115, 1215941, 1236697, 1412015, 1291100, 1231936, 1247035, 1142099, 1026170, 1343176, 1221806, 1276615, 1363096, 1176816, 1286035, 1245098, 1261658, 1110127, 1175803, 1145937, 1227938, 1331775, 1385079, 993957, 1251691, 1273677, 1162721, 1141672, 1020105, 884052, 1158716, 1120475, 1135907, 1125647, 1280938, 1072059, 985019, 1211249, 1393532, 1317736, 1444275, 1205156, 1122697, 1283375, 1649218, 1197288, 1271830, 1233759, 1095907, 1202850, 1214267, 1237619, 1064727, 1168110, 1269342]
13785A269342j48000J13899j41274K53152l12116L62427j38674o8165K22803J6957
13775A430351M8824J46185J99501l64068K26531l08761j6766j50763J60254j53615
13765A217673l2303J21706q1882j30662K00319k45349m724K98463j92253m2992
13755A107996R9289L512J70796j37678j41639K75990r2278J18706L0772N6955
13745A492421O8849m3508j66523K53000j06073l0950J51231r5984K00790j45957
13735A577296N3081k62216J99220J41307q9206N0010M8149k5785J00587K6515
13725A818958j34143K08765J0741l06205M39861j60411L30227j76709R2418r1817
13715B031685J30610n8904N3261j1459R5484K15497k54515l684q7908N9740O0560
$$ y = [1269342, 1121342, 1235241, 1093967, 1347119, 1035003, 1397430, 1258756, 1190591, 1413394, 1430351, 1479175, 1625360, 1824861, 1460793, 1687324, 1378563, 1361797, 1211034, 1371288, 1217673, 1185370, 1307076, 1225194, 1094532, 1294851, 1049502, 1044778, 1343241, 1150988, 1107996, 1207285, 1210797, 1381593, 1243915, 1102276, 1378266, 1285988, 1404694, 1435466, 1492421, 1561270, 1517762, 1351239, 1604239, 1498166, 1467216, 1618447, 1522463, 1723253, 1577296, 1630377, 1368161, 1567381, 1708688, 1619482, 1669492, 1717641, 1691856, 1792443, 1818958, 1684815, 1893580, 1904321, 1598116, 2037977, 1877566, 2207793, 2031084, 2123502, 2031685, 2162295, 2103391, 2156652, 2145193, 2240677, 2456174, 2201659, 2197975, 2110067, 2169807, 2230367]
13704B230367p366j47470M9730j12297q0781O6409j05206K42583k57645K61694
13694B140018n8547K96608J15275j73541Q6371o1268k5430K03074k48935j4511
13684B259114j60126j15518J28382k87862k2333Q0034k89042K62103j04161k10027
13674A540564J22664M7343j262K18716j5124k77722N224K18308J31284J75620
13664B165615o7523L97193k12178J70808N5836P4647j93454N9624q629m2504j81070
13653B218365l06140J01273k05010Q5619j49110O8499J28888k24836o1713M0415
13643A696250P431L52J12351l0936K44770k30948j49458K42163K85300j30956
13633B046319K14633K24780M2241j05221k6998r7346L47355k30098k36560j84539
$$ y = [2230367, 2223001, 2075531, 2125261, 2012964, 1932183, 1998592, 1893386, 2135969, 1878324, 2140018, 2081471, 2378079, 2493354, 2319813, 2406184, 2344916, 2319486, 2522560, 2273625, 2259114, 2098988, 1983470, 2111852, 1823990, 1801657, 1881691, 1592649, 1854752, 1750591, 1540564, 1663228, 1710571, 1709309, 1928025, 1912901, 1635179, 1640403, 1858711, 1989995, 2165615, 2098092, 2495285, 2283107, 2453915, 2509751, 2584398, 2390944, 2450568, 2441939, 2399435, 2218365, 1912225, 2013498, 1808488, 1894107, 1744997, 1813496, 1942384, 1717548, 1655835, 1696250, 1703681, 1704033, 1816384, 1785448, 2030218, 1799270, 1649812, 1891975, 2177275, 2046319, 2260952, 2485732, 2527973, 2422752, 2395754, 2298408, 2645763, 2415665, 2179105, 1994566]
13623A994566r5466k34474J24967K4162k12678j00048P3037P8246J2123K31510
13613A895945m80151K34402J47608j5221J8292M2360N9075J26459J3784J14581
13603B157134n5592p2198O8297k56682j24670J83590k53648J78989q5774j08470
13593A630976K11437J0692o8763J42654o3847N1094n6055j16570J88458m4589
13583A885487k64636l8219J28370m5538o7208J9366k28779L70829k06777j75737
13573A377158K65163j28236k2566j4860J1192j17953O3760P9138n3282J13206
13563A572720j21989j3553O3822J92346N4604l70713j19820j0553L77040j10751
13553A513153j56734M4833L31812l91748J83700m9257k72216J12344K45716r0679
$$ y = [1994566, 1899100, 1664626, 1789593, 1813755, 1601077, 1501029, 1574066, 1652312, 1664435, 1895945, 1415794, 1650196, 1797804, 1782583, 1800875, 1843235, 1902310, 2028769, 2042553, 2157134, 2101542, 2029344, 2097641, 1840959, 1716289, 1899879, 1646231, 1825220, 1739446, 1630976, 1842413, 1853105, 1784342, 1926996, 1863149, 1914243, 1858188, 1741618, 1930076, 1885487, 1620851, 1582632, 1711002, 1665464, 1598256, 1617622, 1388843, 1759672, 1552895, 1377158, 1642321, 1514085, 1491519, 1476659, 1487851, 1369898, 1433658, 1512796, 1459514, 1572720, 1450731, 1437178, 1501000, 1693346, 1747950, 1377237, 1257417, 1246864, 1623904, 1513153, 1356419, 1401252, 1733064, 1341316, 1525016, 1475759, 1203543, 1315887, 1561603, 1470924]
13543A470924M27054p4709L31881q3757J41370Q3512N3267k6710m0640k49038
13533B033154k70888j23982k9906k25574J45559n2779L00906l2198M36953k69755
13523A911490J1391L79850J64140k49656K91766l65698j09875j92409j46520l31828
13513A362651q7897J01499o2861O554j36355K5892J43493j5888j16355r9801J50249
13502A271181o9850K3626k7543j14030L92537j00751j72035J76697k20057L4053
13492A193828N5290M4241j93118q9354K75845j42200m1289J60471k02855J60464
13482A221323k26856J82235K879j10176N3872J38035R5527j59073J9508j24854
13472A092420L512K03301k72099J17430M3637j32462K74208j81886J95660k17423
$$ y = [1470924, 1897978, 1823269, 2155150, 2071393, 2212763, 2296275, 2349542, 2322832, 2282192, 2033154, 1762266, 1638284, 1608378, 1382804, 1528363, 1475584, 1776490, 1744292, 2181245, 1911490, 1922881, 2302731, 2466871, 2217215, 2508981, 2143283, 2033408, 1840999, 1694479, 1362651, 1274754, 1376253, 1313392, 1319946, 1183591, 1209483, 1352976, 1337088, 1220733, 1120932, 1271181, 1201331, 1224957, 1197414, 1083384, 1475921, 1375170, 1203135, 1379832, 1159775, 1193828, 1249118, 1293359, 1100241, 1010887, 1286732, 1144532, 1103243, 1263714, 1060859, 1221323, 994467, 1176702, 1179581, 1069405, 1123277, 1261312, 1356839, 1197766, 1217274, 1092420, 1095932, 1299233, 1027134, 1144564, 1188201, 1055739, 1329947, 1148061, 1343721, 1126298]
13462A126298K14892r1504j49080K42428j14721K80898k70025K68228p0348J83737
13452A620803K37704L41942j64073K34606L1307M3190l13688J9679J44031n2460
13442B143041j12286k50172m07596J39373k36267k1702J50557N4729n7494j50577
13432A251606q1923J22971p8839K88059k11111J65086L788r9268J95001O3585
13422A618955J68275J65576R5378J21987K16126N1302p2909j02522Q8354j4711
13412B335811m57401K20751j33563k35246M6489k08891j01037k1785j25526K17740
13402A537342J6818k0803j57213O8081L5238Q1730k23039L40417N3745O3408k97318
13391A498406J42425L10484q8226J7596J10610Q6662L20796r0369j20801K53863
$$ y = [1126298, 1341190, 1249686, 1100606, 1343034, 1228313, 1509211, 1239186, 1507414, 1437066, 1620803, 1858507, 2200449, 2036376, 2270982, 2302289, 2345479, 2031791, 2051470, 2195501, 2143041, 2030755, 1780583, 1372987, 1512360, 1276093, 1254391, 1404948, 1459677, 1402183, 1251606, 1169683, 1292654, 1213815, 1501874, 1290763, 1455849, 1459637, 1360369, 1555370, 1618955, 1787230, 1952806, 2048184, 2170171, 2386297, 2437599, 2364690, 2262168, 2350522, 2335811, 1878410, 2099161, 1965598, 1730352, 1776841, 1567950, 1466913, 1445128, 1319602, 1537342, 1554160, 1533357, 1376144, 1444225, 1479463, 1561193, 1338154, 1678571, 1732316, 1795724, 1498406, 1640831, 1951315, 1863089, 1880685, 1991295, 2077957, 2398753, 2308384, 2187583, 2441446]
13381B441446P9350k86155o7993K13160o6762p5733N5067k0811m46012O4303q4851
13370A805009K65373k66561J30263O9549n8734J4951J60823m5472j94868J88088
13360B068421J466k9021J14970K0933j15720O285k00386L91609J24323j27967
13350B254913J16921j11613J59274j3573j89632L7009R3274o3232l83720K09095
13340B108716n1350J7227k05754J31565J73419r2695K8659M5413J60973j69083
13330B147090j44971J96175j83131K67968r4148J03530j49148J29082j0988J10995
13320B372454j31131N3819P4933j82639J52784K55968L5011Q7322k15725M14798
13310B917594R6065J05318l19670L12072n9016j29171o0297o5202J20108j53516
$$ y = [2441446, 2520796, 2234641, 2166648, 2379808, 2313046, 2237313, 2292380, 2271569, 1825557, 1889860, 1805009, 2070382, 1803821, 1934084, 2003633, 1944899, 1959850, 2120673, 2075201, 1880333, 2068421, 2069887, 2040866, 2155836, 2176769, 2061049, 2067334, 1866948, 2258557, 2382880, 2254913, 2371834, 2260221, 2419495, 2405922, 2216290, 2253299, 2346573, 2283341, 1899621, 2108716, 2057366, 2074593, 1868839, 2000404, 2173823, 2081128, 2109787, 2155200, 2316173, 2147090, 2002119, 2198294, 2015163, 2283131, 2188983, 2292513, 2143365, 2272447, 2261459, 2372454, 2241323, 2295142, 2370075, 2187436, 2340220, 2596188, 2631199, 2718521, 2502796, 2917594, 3013659, 3118977, 2799307, 3111379, 3052363, 2923192, 2862895, 2797693, 2917801, 2764285]
13300B764285J21462J45054M29906j79221j24100P4351N2086J81311K3157J47550
13290C635841p5761m538k60710R1442M3799j0590k70095K60353L8481J87596j27212
13279C508606n2585N6378J18187j21235J88255l8273o781k9299L69358n1138N0338
13268C991811Q1236K07240J2442P626P5236p0379k9319M84911k97008L38464R4698
13257D896958K07103J85547J1806K9878N94770j06799K58894J64365K89790K09648
13247F741960J55927L82771k360N402K99552R4954M30437L4597J58047k08553
13237H092734K82633K03851j59878J80011j23062K95532p8256K27916L38905K05170
13227I465556n8063N41647L93691J12650L99037M28303J72695K88363J75193L32404
$$ y = [2764285, 2885747, 3030801, 3460707, 3281486, 3157386, 3231737, 3283823, 3465134, 3488291, 3635841, 3560080, 3555542, 3294832, 3386274, 3430073, 3419483, 3149388, 3409741, 3448222, 3635818, 3508606, 3456021, 3512399, 3630586, 3509351, 3697606, 3659333, 3652552, 3623253, 3992611, 3941473, 3991811, 4073047, 4280287, 4292729, 4300355, 4375591, 4305212, 4275893, 4760804, 4463796, 4802260, 4896958, 5104061, 5289608, 5301414, 5331292, 5926062, 5819263, 6078157, 6242522, 6532312, 6741960, 6897887, 7280658, 7278298, 7283700, 7583252, 7678206, 8108643, 8143240, 8301287, 8092734, 8375367, 8579218, 8419340, 8599351, 8476289, 8771821, 8693565, 8921481, 9260386, 9465556, 9407493, 9949140, 10342831, 10455481, 10854518, 11282821, 11455516, 11743879, 11919072, 12251476]
13217A2251476L7009M3539j42487j81382R1617k57903K51023o24861j80681q7652
13207A1199698o34155j2696k78792j38238L4873j87993l69218K04256M3398j49704
13197I711429j36336P7084j31174k83828J99036l93829k62402J95469l49385j92355
13187H433709j69064l88632j85798l55758k69892j68716p4787m26048j8515k35245
13177F141254j78787k26741j53680j51345j62450K7050n1011k63435J57459l04286
13167D834028L01696Q1417k54709J29414J72213j7550L54702L78467j2069N89100
13157F556709L54051J02165L93807k34337L05556K19442m48893l4666j68635J67952
13147G213151m40164K53968k65516J42511j23230j37580j25585j90759k28035
$$ y = [12251476, 12288485, 12332024, 12189537, 12008155, 12099772, 11841869, 12092892, 11468031, 11287350, 11199698, 10565543, 10552847, 10274055, 10135817, 10170690, 9982697, 9613479, 9817735, 9861133, 9711429, 9575093, 9652177, 9521003, 9237175, 9436211, 9042382, 8779980, 8975449, 8626064, 8433709, 8264645, 7876013, 7690215, 7334457, 7064565, 6895849, 6821062, 6395014, 6376499, 6141254, 5962467, 5735726, 5582046, 5430701, 5268251, 5295301, 5244290, 4980855, 5138314, 4834028, 5135724, 5217141, 4962432, 5091846, 5264059, 5246509, 5601211, 5979678, 5967609, 6556709, 6910760, 7012925, 7406732, 7172395, 7477951, 7697393, 7248500, 7213834, 7045199, 7213151, 6772987, 7026955, 6761439, 6903950, 6780720, 6643140, 6517555, 6326796, 6098761]
13138F098761j26246j32246m48149n18549k5723p17856K44689m07257q7901j37955
13128C741568J53165m585l11081K68016n8270k04475J98300j32672l18518L49910
13118C681358j32488l76387J61084P62l08916K41823p3469J63771j53363J39430
13108C343605k1361k02367J34378L23457P8821k5005J1360J02189K65261N35024
13098D545362L16869O9170K03770O97495M31889K84926M33718L3800K49354K71606
13088G537959j14179Q5324l46227J13128p4962p0233O7182k00456k92020r397
13078F696119k25744k44525m59173m84182k39422m90127l52414k07763m05234
13069C587535N2064J085k15145J3728n10504L30449j5807j98353J14345N194l2049
$$ y = [6098761, 5972515, 5840269, 5392120, 4873571, 4847848, 4129992, 4374681, 3967424, 3879523, 3741568, 3894733, 3890148, 3579067, 3847083, 3788813, 3584338, 3782638, 3649966, 3331448, 3681358, 3548870, 3172483, 3333567, 3334329, 3025413, 3267236, 3193767, 3357538, 3204175, 3343605, 3322244, 3119877, 3254255, 3577712, 3656533, 3631528, 3642888, 3745077, 4010338, 4545362, 4862231, 4931401, 5135171, 5832666, 6264555, 6549481, 6983199, 7016999, 7266353, 7537959, 7423780, 7509104, 7162877, 7276005, 7201043, 7130810, 7197992, 6997536, 6705516, 6696119, 6470375, 6225850, 5766677, 5282495, 5043073, 4552946, 4200532, 3992769, 3587535, 3639599, 3640684, 3425539, 3439267, 2928763, 3259212, 3243405, 3045052, 3159397, 3164591, 3132542]
13058C132542O1941J28035j459j53001J48682O7267K9504Q736o1510K0425k17023
13047C164139l7678J98810O1799l6007l2615k14464K48482R6331p3632o5053J41582
13036C451694j40990j3929L98098k11401J77003K55846l08798J63919N5126K24789
13026D051357m6620j10029J71618Q5168J8820Q6176m8409J23813J3627o5233J01133
13015D381421J34193Q60p6644K902L57431k18197N3011J56747K21J51915l6116
13004D907744r944j03898J29161J52242q228K7291k430K58584k3118J79320k92682
12993E214042K26294k3942l5946K00215k26868O1709J70802J6573M9048k47433
12983E404494j76163J53856K15557k81398j88352K94848q2599J2333J89436j32626
$$ y = [3132542, 3194483, 3322518, 3321059, 3168058, 3316740, 3384007, 3413511, 3422247, 3360737, 3381162, 3164139, 3126461, 3325271, 3387070, 3351063, 3318448, 3103984, 3352466, 3448797, 3375165, 3310112, 3451694, 3310704, 3296775, 3694873, 3483472, 3660475, 3916321, 3607523, 3771442, 3826568, 4051357, 4004737, 3894708, 4066326, 4151494, 4170314, 4256490, 4208081, 4331894, 4345521, 4280288, 4381421, 4515614, 4516474, 4439830, 4442732, 4800163, 4581966, 4634977, 4791724, 4791945, 4943860, 4907744, 4897800, 4793902, 4923063, 5075305, 5067077, 5094368, 5091938, 5350522, 5327404, 5506724, 5214042, 5440336, 5416394, 5380448, 5580663, 5353795, 5415504, 5586306, 5602879, 5651927, 5404494, 5228331, 5382187, 5597744, 5316346, 5127994, 5422842, 5340243, 5352576, 5542012, 5409386]
12973E409386r4794n1384n1158r197j03341Q6862k47399J6480K2781R0448J41534
12962E210218l00139k7686P2320R0855o9523j20093j13204K91661k19284J09929
12952D925054j1106p3041L07319j05587j00537J28398j61154K34396k32002J41543
12942E053283n0104r6685n0236K03195m8173o2343J48057j89044o2390M96422
12932E341982k82056J15723J28716j04024r038j63411J7253k50257j11657K8821
12922D712052J13447l21253m391L69125j01365j82383K08167k06353j95254m1240
12912D350552k04924j54439k11468J42764q6052L0407M4660j94685o873k60895
12902C449047J52779q32Q1259j50629j95914q5028J00953j05544K14084j77102
$$ y = [5409386, 5314592, 5263208, 5212050, 5202853, 5099512, 5186374, 4938975, 4955455, 4978236, 5068684, 5210218, 4910079, 4882393, 4954713, 5045568, 4976045, 4855952, 4742748, 5034409, 4815125, 4925054, 4913948, 4840907, 5148226, 5042639, 4942102, 5070500, 4909346, 5143742, 4911740, 5053283, 5003179, 4906494, 4856258, 5059453, 5011280, 4948937, 5096994, 4907950, 4845560, 5341982, 5059926, 5175649, 5304365, 5200341, 5191303, 5027892, 5045145, 4794888, 4683231, 4712052, 4825499, 4504246, 4499855, 4868980, 4767615, 4585232, 4793399, 4587046, 4391792, 4350552, 4145628, 3991189, 3779721, 3922485, 3836433, 3866840, 3911500, 3716815, 3709942, 3449047, 3601826, 3600994, 3682253, 3531624, 3335710, 3250682, 3351635, 3246091, 3460175, 3283073]
12892C283073J26835m46215Q9068O7276K20148j77475J51043k48885J50481R388
12882C224737m0100l4652L7553r9472Q8222j37478N5710j06097j36809J2317J24316
12871B988247j49473L1099M2318j90039J07490l90592K32290Q7386o0122l3591
12861B665013p1055O8015J89854j96867N8644k86872K30992p8327P7840q2466
12851B574771n1837j02828L30593k839o4613k40213J75585j4125l9913o2969K23253
12840B724865j25662k06626N8018k0304J8552R5071j8089R006J56656l8122r4551
12829B558814o189r5792L1814K91200j29505J5656k01300J53068j84074J80300
12819B613992n2813M5077j15948o4657O9841o9195N8932Q2164L5374n8660N8745
$$ y = [3283073, 3409908, 2963693, 3052761, 3120037, 3340185, 3162710, 3313753, 3064868, 3215349, 3224737, 3184637, 3149985, 3187538, 3088066, 3176288, 3038810, 3094520, 2988423, 2851614, 2863931, 2988247, 2838774, 2869873, 2912191, 2722152, 2829642, 2439050, 2671340, 2758726, 2698604, 2665013, 2593958, 2661973, 2851827, 2654960, 2713604, 2426732, 2657724, 2579397, 2657237, 2574771, 2522934, 2420106, 2750699, 2747860, 2683247, 2443034, 2618619, 2604494, 2564581, 2501612, 2724865, 2599203, 2392577, 2450595, 2430291, 2448843, 2543914, 2525825, 2534831, 2691487, 2653365, 2558814, 2552625, 2456833, 2488647, 2779847, 2650342, 2665998, 2464698, 2617766, 2433692, 2613992, 2561179, 2606256, 2490308, 2425651, 2495492, 2426297, 2485229, 2567393, 2602767, 2544107, 2602852]
12808B602852n8263r8199N0037k6485J72758n656j16799R0125j42610J12644K29050
12797B809454k34438J80302j49395N9028j2843J34951K11375k81151o5434q7683
12787B564166J14013K9074J32122q1224K2094J54134k11570l06407K46982J48978
12777B812362k16867K7749k00432L17670j42596p0281J03214N9842N5948Q2891
12767B829500l9391j79836J72867Q6558j2781p9979P7308p3201k05866Q4455L59830
12756C019464m1882n4033j69960P9752L9508j09376R7625j68736l503N97o2460
12745B626996J77515J5082O9260q2172L655K55195m11880K58064M5920j59910
12735B797725n4426J43695J50929q4734m5336K34462l04076J60435m6167k015
$$ y = [2602852, 2544589, 2446390, 2496427, 2469942, 2642700, 2637044, 2520245, 2610370, 2467760, 2580404, 2809454, 2575016, 2755318, 2605923, 2664951, 2652108, 2787059, 2998434, 2717283, 2651849, 2564166, 2678179, 2707253, 2839375, 2758151, 2780245, 2934379, 2722809, 2416402, 2663384, 2812362, 2595495, 2623244, 2422812, 2740482, 2597886, 2527605, 2630819, 2690661, 2746609, 2829500, 2790109, 2610273, 2783140, 2869698, 2856917, 2776938, 2854246, 2781045, 2575179, 2659634, 3019464, 2977582, 2923549, 2753589, 2833341, 2872849, 2763473, 2861098, 2692362, 2688859, 2689456, 2626996, 2804511, 2819593, 2888853, 2806681, 2810336, 3065531, 2653651, 2911715, 2957635, 2797725, 2743299, 2886994, 3037923, 2953189, 2907853, 3142315, 2838239, 2998674, 2952507, 2950492]
12725B950492l7085k8076k77361J81006L18486k54694J83139Q47N5011j1446o6908
12714C013411j31545J86797J69586J3475N8175j49893K66130J04562j33837J79385
12704C576246k2382K77408p3265N1341p3561J81371k481r8673N71547L17135k06875
12693D497811M18609K34743N15044J67151O01085L39447M31967R0067K56008l94023
12683G157909q737j48188m66056k34718l18554m54959n94688k88404j61042k3845
12673D458718k81897K03586p1116j05028P158J35049K58587k66060L83613M3145
12663D765755o6353l4625R816J50669K29974J61163k16536P5416p946K52862L38391
12652E658586K97325O8257L11040Q6984L68898J9448q4700q9382L2785O597j64672
$$ y = [2950492, 2913407, 2885331, 2607970, 2788976, 3107462, 2852768, 3035907, 3036754, 3091765, 3080319, 3013411, 2881866, 3068663, 3238249, 3251724, 3309899, 3160006, 3426136, 3530698, 3396861, 3576246, 3553864, 3831272, 3758007, 3809348, 3735787, 3917158, 3914677, 3816004, 4387551, 4704686, 4497811, 4916420, 5151163, 5666207, 5833358, 6434443, 6773890, 7205857, 7295924, 7551932, 7157909, 7149172, 7000984, 6534928, 6300210, 5981656, 5526697, 4932009, 4643605, 4482563, 4458718, 4176821, 4380407, 4309291, 4204263, 4211421, 4346470, 4605057, 4338997, 4722610, 4765755, 4699402, 4664777, 4674593, 4825262, 5055236, 5216399, 4999863, 5075279, 5067333, 5320195, 5658586, 5955911, 6024168, 6335208, 6422192, 6791090, 6810538, 6725838, 6636456, 6669241, 6675838, 6511166]
12641F511166m7002n3922P926P212N5507Q5099L63274L0154K72786k90377k690
12630F939133J28577K9515J64319n4230J62535m4694k10289l10025k16289m41407
12620F147145k59603J1858m06360M392o22937K32121k22132L16761j16442M62096
12610E546899M21925L72812L36375O80179N59637M23963K95571J20663R2394m07046
12600H443372m18706k69843l28037m74892m99159k33226m45856k18135O8150N1363
12590E675031P863J63064J02463L27649J83481j60661j78554j8977J86603j97427
12580F090535M8378p0745L21409K70471K80702J14764N0472J53319k70175J3901
12570G003031m70737p753n52545m77455l64682n13133q9145M4584q4492M1139
$$ y = [6511166, 6464164, 6410242, 6418168, 6425380, 6480887, 6565986, 6929260, 6959414, 7232200, 6941823, 6939133, 7067710, 7097225, 7261544, 7207314, 7369849, 7325155, 7114866, 6804841, 6588552, 6147145, 5887542, 5899400, 5493040, 5497432, 4874495, 5106616, 4884484, 5201245, 5084803, 5546899, 5968824, 6341636, 6678011, 7358190, 7917827, 8341790, 8637361, 8758024, 8850418, 8443372, 8024666, 7754823, 7426786, 6951894, 6452735, 6219509, 5773653, 5555518, 5623668, 5675031, 5682894, 5845958, 5948421, 6276070, 6459551, 6298890, 6120336, 6101359, 6287962, 6090535, 6138913, 6068168, 6389577, 6660048, 6940750, 7055514, 7105986, 7259305, 6989130, 7003031, 6532294, 6524541, 5971996, 5494541, 5129859, 4616726, 4527581, 4572165, 4487673, 4528812]
12560D528812J39316M0416J76737j64614r5334N8503L8711J63992k33803K91335
12550D944071j41644j89383P2500l4376J80596M4489J27463p2666J5580J45899
12540E092529J33246O3705L2851r5035J22824j18637K97202k13147l06962Q2531
12530E091107k58322r2931j20465L58114k89919j08320L92587N80m9286J96082
12520E119227K07643j58715L0539N1091r4957K64758M7609K015J15305O85427
12510F269942j88015O26510j21102p7548j58J4024J44746k65507r5747j64354
12500F142791n91743o4969K21654m22260J24198J03120j47393P0446L02402l11217
12490E427029J19361K0592J13963J14567p7587j18159K04378J47175J85342r4482
$$ y = [4528812, 4668128, 4708544, 4885281, 4720667, 4625333, 4683836, 4722547, 4886539, 4652736, 4944071, 4802427, 4613044, 4685544, 4651168, 4831764, 4876253, 5003716, 4931050, 4946630, 5092529, 5225775, 5289480, 5322331, 5227296, 5350120, 5231483, 5528685, 5315538, 5008576, 5091107, 4832785, 4739854, 4619389, 4977503, 4687584, 4579264, 4971851, 4972431, 4923145, 5119227, 5326870, 5168155, 5198694, 5249785, 5154828, 5419586, 5467195, 5469210, 5584515, 6269942, 6081927, 6708437, 6587335, 6509787, 6509629, 6523653, 6668399, 6402892, 6307145, 6142791, 5551048, 5486079, 5707733, 5285473, 5409671, 5512791, 5365398, 5435844, 5738246, 5427029, 5546390, 5566982, 5680945, 5795512, 5717925, 5599766, 5804144, 5951319, 6136661, 6042179]
12480F042179L25592P610N7321k3128m7393J6842J24624j79720l1154m47622J09419
12469E954570J16247l52703N2082J59920K76468k4684L24381l37930J44914L05521
12459F618786n4219O9220J85315J9434J60727j3500K64329J24530L05275r25L27006
12448H005978K49496K33030L75589M06532K74652K49897M03347M95123J51206
12439A0844850K82012L36426K99868J31109J36877K5623Q9161j60313L6000K57251
12429A2278864l52741L03867j98016K64693L8762R0128P7042L37571K74048L97907
12419A3512125K12057J25971N34742N50892P54036L14171P18240N35970O09459
12410A7867663O22390K63161M77305P312k364m1297m04584j06131m27764l83707
$$ y = [6042179, 6367771, 6375381, 6432702, 6409574, 6362181, 6379023, 6503647, 6323927, 6292773, 5845151, 5954570, 6070817, 5718114, 5770196, 5930116, 6206584, 6181900, 6506281, 6168351, 6313265, 6618786, 6564567, 6633787, 6819102, 6838536, 6999263, 6985763, 7250092, 7374622, 7679897, 7678972, 8005978, 8255474, 8488504, 8864093, 9270625, 9545277, 9795174, 10198521, 10693644, 10844850, 11126862, 11463288, 11763156, 11894265, 12031142, 12056765, 12145926, 11985613, 12021613, 12278864, 11926123, 12229990, 12031974, 12296667, 12335429, 12425557, 12502599, 12840170, 13114218, 13512125, 13724182, 13850153, 14384895, 14935787, 15689823, 16003994, 16722234, 17258204, 17867663, 18490053, 18753214, 19230519, 19237831, 19235467, 19194170, 18789586, 18683455, 18255691, 17871984]
12400A7871984n27528l31733k75192k92469l80628l76078j51715J00j69583j51162
12390A5215996L99385j27400K99572M08134J32624P33239K73048L95701K15356
12381A7945655N26648L26573J05815K61455Q135J11471q7909k61074k19686k01089
12371A8515994q8060k07147j78231m25868k10470j41621l63090k53370o3082n2479
12361A6532576k87631m74573L93k85255q4269k67369j38776m18802K43997j04476
12351A4715815l23816k12343l23500j21764l341m67861j8069k28323J53523j80693
12341A2989628J20734J15230l07445M57934K42464K32892L50048M26400K85496
12332A4913381K04018K61416M46749K03673K74700K84709M56558K07367K53447
$$ y = [17871984, 17344456, 17012723, 16737531, 16445062, 16064434, 15688356, 15536641, 15536741, 15367158, 15215996, 15615381, 15487981, 15787553, 16195687, 16328311, 17061550, 17334598, 17730299, 17945655, 18472303, 18798876, 18904691, 19166146, 19174281, 19285752, 19197843, 18936769, 18717083, 18515994, 18427934, 18220787, 18042556, 17616688, 17406218, 17264597, 16901507, 16648137, 16585055, 16532576, 16244945, 15770372, 15770765, 15485510, 15401241, 15133872, 14995096, 14576294, 14820291, 14715815, 14391999, 14179656, 13856156, 13734392, 13731051, 13263190, 13245121, 13016798, 13170321, 12989628, 13110362, 13225592, 12918147, 13376081, 13618545, 13851437, 14201485, 14627885, 14913381, 15117399, 15378815, 15825564, 16029237, 16303937, 16588646, 17045204, 17252571, 17506018]
12323A7506018j39544J86147K03313J86767r7127J03861L66625k05551J08373
12314A8218882j48200k15823k5462K66637K38700r6644J45682L75513L48691M68014
12304A9575990M7800O39262j84097L86879K31927k15675n2116l13116m04428k51285
12294A9461141m06078n38381n91678j29214k68068k46579k11922l00466l2587
12285A6736168n28428k84369m79040n57751k97126o11972l87900l28684m85716
12276A2775182m74967q0677k64684j30225j79018M2842m18726K65918r1831k32997
12266A1210817J26173m2878j02165p3509j72736K37794k02303K49594q1577Q953
12256A1158163J20580J42383L81508J85149j35447R57090L05017M50412R40587
$$ y = [17506018, 17366474, 17552621, 17755934, 17942701, 17845574, 17949435, 18316060, 18110509, 18218882, 18070682, 17854859, 17829397, 18096034, 18334734, 18238090, 18383772, 18759285, 19107976, 19575990, 19623790, 20263052, 20078955, 20465834, 20697761, 20482086, 20429970, 20116854, 19712426, 19461141, 19055063, 18516682, 17925004, 17795790, 17527722, 17281143, 17069221, 16768755, 16736168, 16207740, 15923371, 15444331, 14886580, 14589454, 13977482, 13589582, 13260898, 12775182, 12300215, 12219538, 11954854, 11824629, 11645611, 11688453, 11269727, 11535645, 11443814, 11210817, 11336990, 11294112, 11191947, 11118438, 10945702, 11183496, 10981193, 11230787, 11149210, 11158163, 11278743, 11421126, 11802634, 11987783, 11852336, 12809426, 13114443, 13564855, 14505442]
12247A4505442O72982R22475J027485R76996P46616P77444Q72813O71675N48009
12238B1721937K75041L05590M7826k25646R233j88478k95206j17178j58332l89798
12228B0984989P1894l29129m84166j089018l77522r75256r10990q63312r90696
12219A5036794j075439m42133r34444m85344j01273n70547m63519R1189l38799
12210A0716485k27150j21575k60889q2006j04312l72968k12231j70659J46115
12201I310810j36304j78176L80598j53010k18211M70152l12886K03695k18612
12192I148056J22101j1435K32257Q2462L43482J42612J15505L89555K08084J75764
12182A0948443r9545M25164j25885N3035K50409j01727P5811O8332j11791j13892
$$ y = [14505442, 15178424, 16100899, 17128384, 18105380, 18851996, 19629440, 20502253, 21173928, 21721937, 21996978, 22302568, 22350394, 22124748, 22133981, 21945503, 21650297, 21533119, 21374787, 20984989, 21056883, 20727754, 20243588, 19154570, 18777048, 17801792, 16890802, 16027490, 15036794, 13961355, 13519222, 12584778, 12099434, 11998161, 11427614, 10964095, 11055284, 10716485, 10489335, 10367760, 10106871, 10024865, 9920553, 9547585, 9335354, 9164695, 9310810, 9174506, 8996330, 9376928, 9223918, 9005707, 9475859, 9162973, 9366668, 9148056, 9270157, 9258722, 9490979, 9573441, 9916923, 10059535, 10175040, 10564595, 10772679, 10948443, 10848898, 11274062, 11148177, 11201212, 11451621, 11349894, 11425705, 11494037, 11382246, 11268354]
12172A1268354N4552j24979J41870j47325K18721l3137M89557K32289J37696J75083
12162A2412681N14958M87436M42344O02325K67696K07240K99319J44846J05077
12153A5483922k74479J53823j57419m14986J345p3882J16468M26628O08090L87088
12143A6256598M06887K68501J01567Q15222J28359L39890M61378O59257N41138
12134A9978797Q18263J120432J195561J157996J620006J669586K052008J733595
12126C1346244J819169J687909J762364J114456J293038P52650N94164L46401
12118D0716395Q5432Q9730m85468k82662k83428m16092l73978m25564l76643n83759
12108C7663963j86727k72518m37070N541K49327K27479O07418M35985L55841M06469
$$ y = [11268354, 11322906, 11197927, 11339797, 11192472, 11411193, 11378056, 11867613, 12099902, 12237598, 12412681, 12927639, 13415075, 13857419, 14459744, 14727440, 14934680, 15233999, 15378845, 15483922, 15209443, 15363266, 15205847, 14790861, 14792206, 14718324, 14834792, 15261420, 15869510, 16256598, 16663485, 16931986, 17033553, 17848775, 17977134, 18317024, 18778402, 19437659, 19978797, 20797060, 21917492, 23113053, 24271049, 25891055, 27560641, 29612649, 31346244, 33165413, 34853322, 36615686, 37730142, 39023180, 39775830, 40369994, 40716395, 40801827, 40891557, 40406089, 40123427, 39839999, 39423907, 39049929, 38624365, 38247722, 37663963, 37477236, 37204718, 36767648, 36773189, 37022516, 37249995, 37857413, 38293398, 38649239, 39055708]
12098C9055708K83627l04450m23134p3019k61637q61234n19318j418657m84750
12089C4993136l03256l51564K80290M57587K47485O68091M84381Q45445M47947
12080C7769542M16244K35291L9673k72220K37470k88391K66494J34558K25209
12071C8763870k89938j85292m24229q83921m83962r18332p06610j488630q32342
12062C2550614j188228j024270j001936p77969o31760j097017q9642m73426k48712
12053B6017654n04099n11091k26022m36698o32195l64263l76929k71577k66246
12044B2428534n37517l56284m84108n07572j39410n64886k83691o87852m32823
12035A8434391l16654r2131m35399j47209k4051j93139M16769J12705J77761M58326
$$ y = [39055708, 39339335, 39034885, 38611751, 38538732, 38277095, 37415861, 36896543, 35477886, 34993136, 34689880, 34338316, 34618606, 35076193, 35323678, 35991769, 36476150, 37321595, 37769542, 38185786, 38421077, 38460750, 38188530, 38426000, 38137609, 38404103, 38538661, 38763870, 38473932, 38288640, 37864411, 36980490, 36496528, 35578196, 34871586, 33382956, 32550614, 31362386, 30338116, 29336180, 28558211, 27926451, 26829434, 26739792, 26266366, 26017654, 25513555, 25002464, 24776442, 24339744, 23707549, 23343286, 22966357, 22694780, 22428534, 21891017, 21534733, 21050625, 20543053, 20403643, 19838757, 19555066, 18867214, 18434391, 18117737, 18025606, 17590207, 17442998, 17418947, 17225808, 17642577, 17755282, 17933043, 18391369]
12025A8391369L9683L84336k01958n20925n9087m14979m91863p19738n39399m38985
12015A5428454n77391j94144l45094j22302o91354J0686l34623j35125p28092
12006A2311015L2416l99211j15164J04837o770K79520M84965j93389K19860j69436
11996A2548643k89038m32374l76392o5559m06967m56789j59164o0517l34029n0386
11986I917428j39858J1734j52769j98001J07960l84641o00195l24535j25179k96852
11976G815092k63118m8531k83522J19867k83333N083k0770l11036j61036k50736
11966F317960J27290m50565o7334j74661j39100J22236J11742j35913j7207N03087
11956F197535J0544N6112J53157J14468p0132K27758j62297J0734j09263n7546
$$ y = [18391369, 18431052, 18815388, 18613430, 18092505, 18033418, 17618439, 17126576, 16406838, 15867439, 15428454, 14851063, 14656919, 14311825, 14189523, 13498169, 13508855, 13174232, 13039107, 12311015, 12343431, 11944220, 11829056, 11933893, 11927123, 12206643, 12691608, 12498219, 12718079, 12548643, 12259605, 11827231, 11450839, 11385280, 10978313, 10521524, 10362360, 10301843, 9967814, 9917428, 9777570, 9789304, 9636535, 9438534, 9546494, 9161853, 8561658, 8237123, 8111944, 7815092, 7551974, 7503443, 7219921, 7339788, 7056455, 7061538, 7040768, 6729732, 6568696, 6317960, 6445250, 5994685, 5927351, 5752690, 5613590, 5735826, 5847568, 5711655, 5694448, 6197535, 6208079, 6264191, 6417348, 6531816, 6461684, 6689442, 6527145, 6537879, 6428616, 6371070]
11946F371070J40859P2563j44690K98150M5627N55568j34762J49419K24261o5394
11936G512671j59595p2738L69355j22067P6725J15678N4864j00301K0522p2019
11926G623095J47252m78740L3644N9901j50538n12238k09856k32842j65093k3669
11916F090916N7799R867J00017j84898l024j33629L21877N60351J193113J177091
11906I189480O95573L71781J89010L02855n8757j20997q4238n41372j651814j733834
11896F557687j127300j34640r0719j77700J40568k37581L08528l6410N29887L93173
11886F125493L87742O28093O15937O13498N94989M95526R8987L40959J1390l54966
11876I557648m57534o01868k50448o75696p27341l02424j90480n36560m84145
$$ y = [6371070, 6511929, 6584492, 6439802, 6737952, 6783579, 7339147, 7204385, 7353804, 7578065, 7512671, 7353076, 7280338, 7649693, 7527626, 7604351, 7720029, 7774893, 7674592, 7695114, 7623095, 7770347, 7291607, 7325251, 7385152, 7234614, 6722376, 6512520, 6279678, 6114585, 6090916, 6148715, 6158582, 6258599, 6073701, 6070677, 5937048, 6258925, 6819276, 8012389, 9189480, 9885053, 10256834, 10445844, 10748699, 10689942, 10568945, 10484707, 9943335, 8291521, 6557687, 5430387, 5295747, 5205028, 5027328, 5167896, 4930315, 5238843, 5202433, 5732320, 6125493, 6513235, 7141328, 7757265, 8370763, 8965752, 9461278, 9560265, 9901224, 9912614, 9557648, 9100114, 8498246, 8247798, 7572102, 6844761, 6542337, 6351857, 5815297, 5331152]
11867E331152J26551m52022K0862j28803o6727j34787j6687K0617j77812k8015
11857D494329J33995J3109N5278l06461K52505m6166J08430J61066j8302K4516
11847D872299M44377q4953J81777P91171K83424O09009N82787M57680J48615L65550
11837H651736L3672q9039Q6257j48957m39638n8457l18051j79211r5632j43372
11827G299308K34364k25753l159m52329k13611n16267o14559k83451n74843j80699
11817D469001l05675J52067m23907J60348J01729o8062j73715r832P9625j50356
11807C831223r8240j52748K09597R2337l29511O4181J20350K1313K5955q5424
11797C699033J71729O0111m90749Q14993k20081K0681K48511M81624M30496Q5919
$$ y = [5331152, 5457703, 5005681, 5026543, 4897740, 4831013, 4696226, 4679539, 4700156, 4522344, 4494329, 4628324, 4641433, 4696711, 4390250, 4642755, 4596589, 4705019, 4866085, 4847783, 4872299, 5316676, 5231723, 5413500, 6204671, 6488095, 7097104, 7679891, 8137571, 8286186, 8651736, 8685408, 8596369, 8682626, 8533669, 8094031, 8035574, 7717523, 7538312, 7442680, 7299308, 7533672, 7307919, 7304760, 6852431, 6638820, 6122553, 5507994, 5224543, 4649700, 4469001, 4163326, 4315393, 3891486, 4051834, 4153563, 4085501, 3911786, 3901954, 3981579, 3831223, 3732983, 3580235, 3789832, 3882169, 3552658, 3616839, 3737189, 3758502, 3784457, 3699033, 3870762, 3930873, 3440124, 4255117, 4035036, 4055717, 4304228, 4785852, 5216348, 5302267]
11787E302267P28226J31308j21098N41380q2667J92792l21477m47524k40024p51003
11777D932180n76778j49941m46397o8255k46673O6003k4201J10528k18401j27191
11767C250874j04359j02J72548j76687J44366j98145j89227K76553n9990j91163
11757B924668O6362Q05p1548r901J258N0860J33282j30452n598L17194q6277r0948
11745C099705J75498l06114O23L5030q5926q2286J48186k92076K68915q9269K4917
11734B897203k11124N2552o0771J23396j07376O0709k46329N0889M06082l82611
11724B582620r9781L48817j98356j05573N1367Q8967l5566J1694N5235J5914j5674
11713B699664K1030J75775l9903k21873M7873J0502J99498o796l09751J45211
$$ y = [5302267, 6030493, 6161801, 6040703, 6582083, 6499416, 6692208, 6370731, 5923207, 5683183, 4932180, 4355402, 4205461, 3759064, 3690809, 3444136, 3510139, 3485938, 3596466, 3378065, 3250874, 3146515, 3146413, 3318961, 3142274, 3286640, 3088495, 2899268, 3175821, 3115831, 2924668, 2991030, 2991835, 2920287, 2910386, 2911644, 2962504, 3095786, 2965334, 2959736, 3276930, 3190653, 3099705, 3275203, 2969089, 2969712, 3004742, 2918816, 2836530, 2984716, 2692640, 2961555, 2872286, 2897203, 2686079, 2738631, 2677860, 2801256, 2693880, 2754589, 2508260, 2559149, 2965231, 2582620, 2482839, 2831656, 2633300, 2527727, 2579094, 2668061, 2632495, 2644189, 2699424, 2715338, 2699664, 2720694, 2896469, 2856566, 2634693, 2682566, 2693068, 2892566, 2885770, 2576019, 2721230]
11703B721230J53794j81786L18011j57067k1572J17788J75966j88968J49353j88946
11693B897803N8471J31543J84414M5733j52557O6291J18166j57044J11866J82490
11683C487176L7117p6115J78529j16882K03350k45139K44584j38302J02209O7282
11673C743809k8337j47957j733J75036j80808K59162J6311j02910r4638L6341
11663C674276O8258n8612j67968L11023l79226K29813n5730J58954p4030m1202
11653C665556j1364K08062l40933j17896K61698j51179n6431P6874j62426J85241
11643C557202m1234M5538k37068K983L47389j54918j34368k02253K20111j78994
11633C224388J57095L7411j68110K07145k55178Q2861P4478m25830K51141l0898
$$ y = [2721230, 2875024, 2693238, 3011249, 2854182, 2832610, 2950398, 3126364, 2937396, 3086749, 2897803, 2956274, 3087817, 3272231, 3317964, 3165407, 3231698, 3349864, 3192820, 3304686, 3487176, 3524293, 3448178, 3626707, 3509825, 3713175, 3468036, 3712620, 3574318, 3676527, 3743809, 3715472, 3567515, 3565782, 3740818, 3560010, 3819172, 3835483, 3732573, 3637935, 3674276, 3742534, 3683922, 3515954, 3826977, 3447751, 3677564, 3621834, 3780788, 3706758, 3665556, 3654192, 3862254, 3521321, 3403425, 3665123, 3513944, 3457513, 3534387, 3371961, 3557202, 3515968, 3561506, 3324438, 3327421, 3674810, 3519892, 3385524, 3183271, 3403382, 3224388, 3381483, 3418894, 3250784, 3457929, 3202751, 3285612, 3360090, 2934260, 3185401, 3154503]
11623C154503o560K22434k32352J01495j640m9427p2325K32510l3279K9154Q5100
11612C429613j78471L44277k38323l03473J90390J68444J31087j82389J56567
11603C517722l5631j91320J9980o3563J78335K5188P0850q2538O5060j99419k3065
11592C281599K69954K97942m80298J91763K8967r4041j59916K02521k7357Q815
11582C519949r4395k1230L34240J69766j94232O8130M1758O8018q8082J01967
11572C905889q1375n7597j72471K78842r6732p0046J56866k59519K78933k40253
11562C642537j06299J97636o058R1160K4314K10906j94978J19254r4870N7266
11552C940868j47938J49396q481J3495q5713R7955k16003N9770J64337j52357
$$ y = [3154503, 3147943, 3370377, 3138025, 3239520, 3237880, 3188453, 3116128, 3348638, 3315359, 3344513, 3429613, 3251142, 3595419, 3357096, 3053623, 3244013, 3412457, 3543544, 3361155, 3517722, 3482091, 3290771, 3310751, 3247188, 3425523, 3450711, 3521561, 3439023, 3504083, 3304664, 3281599, 3551553, 3849495, 3369197, 3560960, 3589927, 3495886, 3335970, 3538491, 3511134, 3519949, 3425554, 3404324, 3738564, 3908330, 3714098, 3782228, 3823986, 3892004, 3803922, 3905889, 3824514, 3766917, 3594446, 3873288, 3776556, 3706510, 3863376, 3603857, 3882790, 3642537, 3536238, 3733874, 3727816, 3818976, 3843290, 4054196, 3859218, 3978472, 3883602, 3940868, 3792930, 3942326, 3933845, 3947340, 3861627, 3959582, 3743579, 3803349, 3967686, 3815329]
11542C815329j54506l9966m1681J39982l6743K6016q7695j72509L43284k03660
11532C587851J11576j60315L61873j03149k27244J04592P0639j35039N4543k90721
11522C374606K56763J29861j40830J94605j40983p2768J80336J9162L13529j36977
11512C977304j40472L4440P1959J98494k18509K77124P3226j49235k12319L01661
11502D213673j50662n5479q119K20955R167j52812J8132k7482q2469L7585J87375
11491D209864l0704J06246r9937j09367J0234J96207j8620J93723l42863L05625
11481D420408m5462m5670K02823m0052K72431k27405J88125r3383j55181K46554
11471D723188k43614K34798m7118j9427l87512L14771k63809J06526J9088K1757
$$ y = [3815329, 3660823, 3620857, 3579176, 3719158, 3682415, 3708431, 3620736, 3448227, 3791511, 3587851, 3699427, 3539112, 3900985, 3797836, 3570592, 3675184, 3745823, 3610784, 3665327, 3374606, 3631369, 3761230, 3620400, 3815005, 3674022, 3601254, 3781590, 3800752, 4114281, 3977304, 3836832, 3871272, 3943231, 4141725, 3923216, 4200340, 4273566, 4124331, 3912012, 4213673, 4063011, 4007532, 3999413, 4220368, 4229535, 4076723, 4094855, 4067373, 3984904, 4022489, 4209864, 4179160, 4285406, 4185469, 4076102, 4086336, 4282543, 4263923, 4457646, 4114783, 4420408, 4374946, 4329276, 4532099, 4492047, 4764478, 4537073, 4725198, 4631815, 4476634, 4723188, 4479574, 4714372, 4667254, 4647827, 4260315, 4575086, 4311277, 4417803, 4436891, 4458648]
11461D458648q454J2100j8615J32817j11272l78868K35801K02516q391J3647O9131
11450D599060k17404J58810Q1390J44431k0770j18409J49544N5986j45635J06867
11440D793870M89579k15436J03677k74120M00121k93082K90540Q6148J30358O305
11430E517960K47419j21286L0694P2825K4356M1098K18007j02446j57983N8386
11420E829030K61748k988j72056K47596n8971J78036J8475n4852N37501k60140
11410F523379R8753J08986J26970J41304P7059J76367K31942j56327K54078J52589
11400G735100J66906N3164l3770M97173k21772K24558m4180M54892L9923J44266
11390I016260K81520p3679R5662J17641M66956n0157L37222O8954J88590K09213
$$ y = [4458648, 4450194, 4462294, 4443679, 4576496, 4465224, 4086356, 4322157, 4524673, 4516282, 4529929, 4599060, 4381656, 4540466, 4621856, 4766287, 4745517, 4627108, 4776652, 4832638, 4687003, 4793870, 5283449, 5068013, 5171690, 4897570, 5297691, 5004609, 5295149, 5381297, 5511655, 5517960, 5765379, 5644093, 5674787, 5747612, 5771968, 5813066, 6031073, 5928627, 5770644, 5829030, 6090778, 6087790, 5915734, 6163330, 6104359, 6282395, 6300870, 6246018, 6783519, 6523379, 6622132, 6731118, 6858088, 6999392, 7076451, 7252818, 7484760, 7328433, 7582511, 7735100, 7902006, 7955170, 7921400, 8418573, 8196801, 8421359, 8377179, 8832071, 8871994, 9016260, 9297780, 9224101, 9319763, 9437404, 9904360, 9854203, 10191425, 10260379, 10448969, 10658182]
11380A0658182M5171K5293J0882J32059l8167M51939j68746K10733K61870k05497
11370A1383719M32538j49708L34447j2302q677Q6699J73747r5813J58836L01025
11360A2604511k26796n4877K7469L26669m6506k7745J92750p3685k38970J32491
11350A2615311K45422k42001M986n8335J12194J01823K1775j22956j28310J7954
11340A2567863O4238P5837n62448K59677j24693l49004K93319k7663m58673p0378
11330A1668075j98148J2245m5779q9978l98632k57064J32453q6576j98232k64844
11320A0273520k29676L6116j39350j33648n4406k01197q7911m17488j82746j4315
11310H848899k59390J50148m71875j63081k33883j28927l08232j17738R243k31743
$$ y = [10658182, 10703353, 10728646, 10739528, 10871587, 10833420, 11285359, 11116613, 11327346, 11589216, 11383719, 11816257, 11666549, 12000996, 11988694, 11980017, 12066716, 12240463, 12144650, 12303486, 12604511, 12377715, 12322838, 12350307, 12676976, 12630470, 12602725, 12795475, 12721790, 12482820, 12615311, 12860733, 12618732, 12623718, 12565383, 12677577, 12779400, 12801175, 12678219, 12549909, 12567863, 12632101, 12707938, 12145490, 12405167, 12280474, 11931470, 12224789, 12197126, 11738453, 11668075, 11469927, 11482172, 11436393, 11346415, 10947783, 10690719, 10823172, 10736596, 10538364, 10273520, 10043844, 10079960, 9940610, 9806962, 9752556, 9551359, 9463448, 9045960, 8863214, 8848899, 8589509, 8739657, 8267782, 8104701, 7870818, 7741891, 7433659, 7315921, 7325164, 7093421]
11300G093421j46355q4279j8556m03511m1206k08531k29861l2794p5463k93155
11290E559710j36145M508k3279k15275k2391j22475j37868K6050j27340q9580
11280D715915Q0450k95320j22607J1339j3232k1771j95333N6988K5579l3622k82474
11269C925912j13539O2527j13331J2674Q6890k92704Q5431N8649J01055j42137
11259C671427j22872o5348M8275p0387o6961K76403m16713K95209q5940j31904
11249C331189j10102K07055R0133j84920j0962o9142J03518J6794N4517j40943
11239C287137O2369p4690K83355j43696l2554O8973j51571M8927j15991K628J96193
11228C431080p154J28245o2617J94587L72123O32686O35816M51905o090O08120
$$ y = [7093421, 6947066, 6862787, 6844231, 6440720, 6399514, 6190983, 5961122, 5928328, 5852865, 5559710, 5423565, 5428073, 5404794, 5189519, 5167128, 5044653, 4906785, 4932835, 4805495, 4715915, 4796365, 4501045, 4378438, 4389777, 4376545, 4354774, 4159441, 4216429, 4242008, 4208386, 3925912, 3812373, 3874900, 3761569, 3774243, 3861133, 3568429, 3653860, 3712509, 3813564, 3671427, 3548555, 3483207, 3531482, 3461095, 3394134, 3670537, 3253824, 3549033, 3463093, 3331189, 3221087, 3428142, 3518275, 3333355, 3322393, 3253251, 3356769, 3373563, 3428080, 3287137, 3349506, 3274816, 3558171, 3414475, 3381921, 3450894, 3299323, 3348250, 3232259, 3234887, 3431080, 3423926, 3552171, 3489554, 3684141, 4056264, 4688950, 5324766, 5776671, 5770581, 6378701]
11218F378701J09414M00462q7430n68839j64242o24436p79269n14544m44562j86733
11208C518522M4902l50558P3250o9127p2382K11052k26889K74019R67n4491J96124
11197C545389P2745j2258M03462O61621P06409L95198M90081J26859L62075p1162
11187F680419j4328k674l50839o45048j066164m22667m56520P8055k03812J70950
11177C767372p7054K3546o6228J18527m20508K34589m4658J61553J16938j05821
11167C708256j30036J76682l7808K31149j74239N7287K9680N5667K4207r5080
11157C845765P4880J6494l99175J39247L31968j79993j41631K02850J5345p5388
11147C830362l2479J29640j18132J30656j4948N7858L2524k70845L30547J74896
$$ y = [6378701, 6488115, 6888577, 6801147, 6232308, 6068066, 5443630, 4664361, 4149817, 3705255, 3518522, 3563424, 3212866, 3286116, 3216989, 3144607, 3355659, 3128770, 3402789, 3403756, 3349265, 3545389, 3618134, 3605876, 4009338, 4670959, 5377368, 5772566, 6262647, 6389506, 6751581, 6680419, 6666091, 6663417, 6312578, 5667530, 4601366, 4178699, 3722179, 3800234, 3596422, 3767372, 3690318, 3713864, 3647636, 3766163, 3345655, 3580244, 3535586, 3697139, 3814077, 3708256, 3578220, 3754902, 3717094, 3948243, 3774004, 3831291, 3860971, 3916638, 3940845, 3845765, 3920645, 3937139, 3537964, 3677211, 4009179, 3829186, 3687555, 3890405, 3905750, 3830362, 3797883, 3927523, 3809391, 3940047, 3925099, 3982957, 4015481, 3744636, 4075183, 4250079]
11137D250079l91713J99628J14633m229P5932J28914q1344l3915L59826m53100
11127D164711L83632n2797j20188L65904j36013j3875L8533k3127K1078j88323
11117D439535J35044Q728L97432k63043K13273m9726J30637k65703O1484q5799
11107D721862j5460K12897j18169o9315l5997k35733N42929j51480m31214J65779
11097D586099K1769K03040j9906l36786k07761n133J59917K13961k59496J15445
11087D471149J80843j16079N9332j9049k27989K39188j97920p1232J43408K7896
11077D489547K833K14270n091l5306j14332J83175p9881J64702j9121J20324R8429
11066E019549r7621M512J26857K03613J63791j44635K98743j43988m238L36387
$$ y = [4250079, 3858366, 4057994, 4172627, 4168398, 4244330, 4373244, 4291900, 4257985, 4617811, 4164711, 4548343, 4495546, 4375358, 4741262, 4605249, 4591374, 4629907, 4606780, 4627858, 4439535, 4574579, 4583307, 4980739, 4717696, 4930969, 4881243, 5011880, 4746177, 4807661, 4721862, 4706402, 4919299, 4801130, 4731815, 4695818, 4460085, 5003014, 4851534, 4420320, 4586099, 4607868, 4810908, 4791002, 4454216, 4246455, 4241322, 4401239, 4615200, 4355704, 4471149, 4651992, 4535913, 4595245, 4576196, 4348207, 4587395, 4389475, 4318243, 4461651, 4489547, 4492380, 4706650, 4701559, 4666253, 4551921, 4735096, 4655215, 4819917, 4800796, 4921120, 5019549, 4921928, 4926440, 5053297, 5256910, 5420701, 5276066, 5574809, 5430821, 5426583, 5762970]
11056E762970J98952l07935K34384n2290K24122j95000J28235J76979k32765K21511
11046F159163J47819Q2295j35954J27761o4242J18234K43547J30484Q3417O6924
11036F959448J68892L0815J13290K28077K30756J56490Q4828K09407J31305J43903
11026H457211M86659L23547o543M79799J88165K90881M08891n6810Q6378N71507
11016A1229685O88j99930L06067L68043J08117j71936L00163J27097L18448q500
11006A2377942L12927o4434M86783K57411J11171L16365M32870K05860N84602
10997A5021497R9885L32789K26422P22737J87288K14275J40300L29504J57738
10988A7432435Q7905L78732L0047J64347L33142K10819M23354K77653L40468K23145
$$ y = [5762970, 5961922, 5653987, 5888371, 5836081, 6060203, 5865203, 5993438, 6170417, 5937652, 6159163, 6306982, 6389277, 6253323, 6381084, 6316842, 6435076, 6678623, 6809107, 6892524, 6959448, 7128340, 7159155, 7272445, 7500522, 7731278, 7887768, 7972596, 8182003, 8313308, 8457211, 8943870, 9267417, 9260874, 9740673, 9928838, 10219719, 10628610, 10571800, 10658178, 11229685, 11230373, 11030443, 11336510, 11704553, 11812670, 11640734, 11940897, 12067994, 12386442, 12377942, 12690869, 12626435, 13113218, 13370629, 13481800, 13798165, 14231035, 14436895, 15021497, 15121382, 15454171, 15680593, 16403330, 16590618, 16804893, 16945193, 17274697, 17432435, 17520340, 17899072, 17929119, 18093466, 18426608, 18637427, 19060781, 19338434, 19678902, 19902047]
10978A9902047K20982N70107J01782M40294K62417J78837K80152M08497O5399
10969B2430514K76133N10261M12045L85956M68635M70255L59377M07035L89662
10960B6109873M88983N13619J69680M09220P95276L00688O78820M92650N38438
10951C0497247M49918R48668N03062P06645N80109P40961O00605N87162N57990
10942C6172367O04753Q83181N24147P07331Q18373O65685Q55007O10147J269942
10933D3110933K72159R55296R73892O91370J200158J131409P18103Q75221J307253
10924E1235794J021794J303058J078231J141943J066447O14951J071053P02623
10916E9235894P84337M61466L78474K10659K08527M09348L5491K96762p8460L8782
$$ y = [19902047, 20123029, 20693136, 20794918, 21235212, 21497629, 21676466, 21956618, 22365115, 22430514, 22706647, 23216908, 23628953, 24014909, 24483544, 24953799, 25313176, 25720211, 26109873, 26598856, 27112475, 27282155, 27691375, 28486651, 28787339, 29466159, 29958809, 30497247, 30947165, 31895833, 32398895, 33105540, 33685649, 34426610, 35027215, 35614377, 36172367, 36777120, 37660301, 38184448, 38891779, 39710152, 40375837, 41230844, 41840991, 43110933, 43383092, 44338388, 45312280, 46003650, 47203808, 48335217, 49053320, 49928541, 51235794, 52257588, 53560646, 54638877, 55780820, 56847267, 57462218, 58533271, 59235894, 60020231, 60481697, 60860171, 61070830, 61279357, 61688705, 61724196, 62020958, 61942498, 61981280]
10906F1981280k3262J92341J11309j37320o187K21586R1792J68374K94956L64597
10896F3259466K53865K06336L26649M75919M30574P59480N72045J052761Q29960
10887F8167055J090660J207320J440534J525058K017201J699544K548991K499530
10879H2195893K927454L305546L376793M162356M651837M705196M981737N198081
10871A15504893N510593N045122M826395M064040L594747L030355J715141Q11633
10863A44102919m32587j226785k131391l056725m221649m084326m997156n258831
10855A18693469n613466n480752n253069n721194n344762n187257n001181m977517
10847G6114271m497250m296713m072494m118151l216610l519508l419397k860364
$$ y = [61981280, 61958018, 62150359, 62261668, 62124348, 62118161, 62339747, 62431539, 62599913, 62894869, 63259466, 63513331, 63719667, 64046316, 64522235, 64952809, 65712289, 66284334, 67337095, 68167055, 69257715, 70465035, 71905569, 73430627, 75447828, 77147372, 79696363, 82195893, 85123347, 88428893, 91805686, 95968042, 100619879, 105325075, 110306812, 115504893, 121015486, 126060608, 130887003, 134951043, 138545790, 141576145, 143291286, 144102919, 143670332, 142443547, 140312156, 137255431, 133033782, 128949456, 123952300, 118693469, 113080003, 107599251, 102346182, 96624988, 91280226, 86092969, 81091788, 76114271, 71617021, 67320308, 63247814, 59129663, 55913053, 52393545, 48974148, 46113784]
10839D6113784k699346k823289j976319k502628j877554j806292j657115j516418
10831B9254823j574100j418712j414304j127179r53022j129799r70978j072325
10823A9594404r10951o89365o64596o52630n47542n15964m82980l46824m99696
10814A4283856k57984l71280j92521k67516m07446n60072j99132l68886k06276
10805A1452743n24357m29268m45281n26492j41800k43943m60464j37598l55769
10796H187771k0185k42553j79514k24035r7181k77245j94229L7622k71038p6359
10786F643054K3999N6218m00699p2824m7275k26502K935l25966O0501j3607j42952
10775E556882k37901J8193n5361j35103m8339m19997J75922J04163l38546j4987
$$ y = [46113784, 43414438, 40591149, 38614830, 36112202, 34234648, 32428356, 30771241, 29254823, 27680723, 26262011, 24847707, 23720528, 22767506, 21637707, 20666729, 19594404, 18683453, 17994088, 17329492, 16676862, 16129320, 15613356, 15130376, 14783552, 14283856, 14025872, 13654592, 13462071, 13194555, 12787109, 12227037, 12027905, 11659019, 11452743, 10928386, 10499118, 10053837, 9527345, 9385545, 9141602, 8681138, 8543540, 8187771, 8167586, 7925033, 7745519, 7521484, 7424303, 7147058, 6952829, 6990451, 6719413, 6643054, 6667053, 6723271, 6322572, 6249748, 6202473, 5975971, 5978906, 5652940, 5713441, 5699834, 5556882, 5318981, 5337174, 5281813, 5146710, 5098371, 4678374, 4854296, 4958459, 4619913, 4604926]
10765D604926j9199l23623L51531k17091p6284j6257K44828j03529k99848J05033
10755D250487J3038k8312k3782P5660j3862n1336j69294K88359l88865J83262
10745D135355j04929j9494j10711k83199L11599j82239r8975l18872J68711O8867
10735C566113j37657p5051K13299Q8880p2575K12073m01793J59662P6563k0791
10725C608723K56161j78084J03718p2177l09314L62778k98405j60505R9643J35730
10715C548268m7419K5638P3986k54431J60859k76711M22724j48465N4365j1337
10705C547477M1824j85592J44926j08245k17840K10403L1547j91258k2345k3922
10695C226975L3638j338k24412K44150j03661j68781R8750P7765j2041r4294J17513
$$ y = [4604926, 4585727, 4262104, 4613635, 4396544, 4320260, 4304003, 4548831, 4445302, 4145454, 4250487, 4263525, 4235213, 4211431, 4287091, 4273229, 4221893, 4052599, 4340958, 3952093, 4135355, 4030426, 4010932, 3900221, 3617022, 3928621, 3746382, 3647407, 3328535, 3497246, 3566113, 3428456, 3353405, 3566704, 3655584, 3583009, 3795082, 3393289, 3552951, 3629514, 3608723, 3864884, 3686800, 3790518, 3718341, 3409027, 3771805, 3473400, 3312895, 3412538, 3548268, 3500849, 3526487, 3600473, 3346042, 3506901, 3230190, 3652914, 3504449, 3558814, 3547477, 3589301, 3403709, 3548635, 3440390, 3222550, 3432953, 3464500, 3273242, 3250897, 3226975, 3260613, 3259275, 3034863, 3279013, 3175352, 3006571, 3105321, 3183086, 3171045, 3076751, 3194264]
10684C194264R7249k480m37291J48547M0375L02698o14779K22354M7979R569j07539
10673B900946m1421O9594j40675J81587k99781J54744r5460P2251j57964k28644
10663B415177K53022N408j51551k4338J08625r9243j07196j5969O9269j64010
10653B289194J78623j89294K49874q8697J98315k45081K57036j05390j84626L86
10643B360340J70532j45917J46923k49553J41222j12267k2921n9675Q7251q5713
10633B230222M6809M4561k87256p4474L56209o2375L756k59153O5882j45450L24251
10622B242982l0302R3267Q3662j25961j93471o5854j5887P2853M7442N5515J96692
10611B360938j11701K9893m7862j421r791l4242k85850J97906Q8891k62790J30023
$$ y = [3194264, 3291513, 3289033, 2851742, 3000289, 3040664, 3343362, 2728583, 2950937, 2998916, 3008485, 2900946, 2859525, 2929119, 2788444, 2970031, 2670250, 2824994, 2729534, 2801785, 2643821, 2415177, 2668199, 2673607, 2522056, 2497718, 2606343, 2507100, 2399904, 2383935, 2453204, 2289194, 2467817, 2278523, 2528397, 2439700, 2638015, 2392934, 2649970, 2544580, 2359954, 2360340, 2530872, 2384955, 2531878, 2282325, 2423547, 2311280, 2288359, 2228684, 2315935, 2230222, 2277031, 2321592, 2034336, 1959862, 2316071, 2253696, 2257452, 1998299, 2064181, 1918731, 2242982, 2212680, 2305947, 2389609, 2263648, 2070177, 2004323, 1988436, 2061289, 2108731, 2164246, 2360938, 2249237, 2279130, 2231268, 2229847, 2220056, 2185814, 1899964, 2097870, 2186761, 1923971, 2053994]
10600B053994K0868J33690j36396K7796j27518K34684j83832p5612J30646M1716
10590B120036j67962N9707J36773J73173l43052L914K07961k06270P2484R5138
10580B151902l31019L57100j15652j41550L01909m75969K34097J07309j60053
10571A928074N3030J28537k08458j95671j44653J10528j7115k6074K23460j03494
10561A748164N2617m7926o9377j77698J14940O0680j31492N7308j1427K6908Q3215
10550A705912k60706j4712R2027j88448J37362R4860L9618j81104J87001m6115
10540A565695n6263L8987l9659O9649l41954M64951j84635M7865K73762k02272
10530A636126J24407k17092J32641J73679l89422P2170J46149N3360K99977l82685
$$ y = [2053994, 2074862, 2208552, 2072156, 2099952, 1972434, 2207118, 2023286, 1947674, 2078320, 2120036, 1952074, 2011781, 2148554, 2321727, 1978675, 1982589, 2190550, 1984280, 2056764, 2151902, 1820883, 2177983, 2062331, 1920781, 2222690, 1746721, 1980818, 2088127, 1928074, 1981104, 2109641, 1901183, 1705512, 1560859, 1671387, 1654272, 1628198, 1851658, 1748164, 1800781, 1752855, 1683478, 1505780, 1620720, 1681400, 1549908, 1607216, 1595789, 1622697, 1705912, 1445206, 1430494, 1522521, 1334073, 1471435, 1566295, 1605913, 1424809, 1611810, 1565695, 1509432, 1548419, 1508760, 1578409, 1236455, 1701406, 1516771, 1564636, 1838398, 1636126, 1760533, 1543441, 1676082, 1849761, 1460339, 1532509, 1678658, 1732018, 2031995, 1649310]
10520A649310J45224L86510m2114l9264J04806J79678P8761r0983o0354O184J58649
10509B476407k7728n97736K8157q7177j8281J25060j95220K13373j05097R0026
10499A901784r4459N6225L01262o786P8235m12768L46588k51435M15530O269L46184
10488B686629k94552o9857M21792l17488J24250j18256n1185K15914m42729M4075
10478B198593j9582R264j77108K95453k92058R5830J9754q2671K79296l3775k55572
10467B037424K02245J04870N9184R2406R6989K06425k42128J32532N6659m3451
10457B703155R1268M6109J5034J04774q3000J48273j52555R8121l1873M7994j59295
10446B828005k00764l148o5559N1204k16038J32284j58480K17018L27710J57020
$$ y = [1649310, 1794534, 2181044, 2138930, 2099666, 2204472, 2384150, 2462911, 2371928, 2311574, 2317758, 2476407, 2448679, 1850943, 1879100, 1791923, 1773642, 1898702, 1703482, 1916855, 1811758, 1901784, 1807325, 1863550, 2164812, 2158026, 2236261, 1823493, 2170081, 1918646, 2334176, 2340445, 2686629, 2392077, 2322220, 2744012, 2426524, 2550774, 2432518, 2381333, 2597247, 2154518, 2198593, 2179011, 2188275, 2011167, 2306620, 2014562, 2110392, 2130146, 2047475, 2326771, 2292996, 2037424, 2239669, 2344539, 2403723, 2496129, 2593118, 2799543, 2557415, 2689947, 2746606, 2703155, 2794423, 2840532, 2855566, 2960340, 2877340, 3025613, 2873058, 2971179, 2939306, 2987300, 2828005, 2627241, 2624093, 2558534, 2609738, 2393700, 2525984, 2367504, 2584522, 2912232, 3069252]
10436C069252J83238l04874K90161K40102k47162j01025o2364j96721k601l21401
10426B546605k76990k7734K38934k59260j88941J31137j6474n495J81749J3297
10416B336828m4532L19254j21207Q308L22873J60448l3235J60697L48755O88990
10406D147179j39004K91127J92981K78083J87820J58084j60713p9111K65777J95876
10396E338099L0924M77513M4115K99491M31155M13691J72322J85222N9040K28492
10386G680064j23620j56853k08000j23635l83337J23297K876j37192J09919k84141
10376F499378K11165o3664J75184j40151K56757J45834n361j96165K46959K10178
10366G340114j38657O3872K12769K02973l17719j44526K502k33566k20838k72078
$$ y = [3069252, 3252490, 2947616, 3237777, 3477879, 3230717, 3129692, 3067328, 2870607, 2868006, 2546605, 2269615, 2241881, 2480815, 2221555, 2032614, 2163751, 2147277, 2141782, 2323531, 2336828, 2292296, 2611550, 2490343, 2498651, 2821524, 2981972, 2948737, 3109434, 3458189, 4147179, 4008175, 4299302, 4492283, 4770366, 4958186, 5116270, 4955557, 4876446, 5142223, 5338099, 5369023, 5846536, 5890651, 6190142, 6621297, 7034988, 7207310, 7392532, 7451572, 7680064, 7556444, 7399591, 7191591, 7067956, 6684619, 6807916, 6810792, 6673600, 6783519, 6499378, 6710543, 6646879, 6822063, 6681912, 6938669, 7084503, 7079142, 6882977, 7129936, 7340114, 7201457, 7265329, 7478098, 7681071, 7363352, 7218826, 7221328, 6987762, 6766924, 6494846]
10356F494846M722j86863l4328o1539k74514l64656J89577l64822j94982k46208
10346D961233J72747l53694n2262k16031K8740j74920p393Q9260K58384P6791
10336D782855j07471O1995j76663J14600q60O659j20523J62642R4252l32251n847
10325D479388J64169J4014m6708J83193j24066j312K1198j25980J04086K79833
10315D947815k80751l7342K28978j63733k60238M95117j71433N32103R4025l34315
10305E050226M11775J2039r0523L60649k51161M2811j65512R3549J1302J8157
$$ y = [6494846, 6499568, 6312705, 6278377, 6216838, 5942324, 5577668, 5767245, 5402423, 5207441, 4961233, 5133980, 4780286, 4728024, 4511993, 4540733, 4365813, 4358420, 4447680, 4706064, 4782855, 4675384, 4737379, 4560716, 4675316, 4674456, 4681115, 4560592, 4723234, 4817486, 4485235, 4479388, 4643557, 4657571, 4610863, 4794056, 4669990, 4668678, 4689876, 4563896, 4667982, 4947815, 4667064, 4629722, 4858700, 4694967, 4434729, 4929846, 4758413, 5290516, 5384541, 5050226, 5462001, 5474040, 5383517, 5744166, 5493005, 5535816, 5370304, 5463853, 5475155, 5493312]
$$ [...]
##END NTUPLES=NMR SPECTRUM
##END=
